
##TITLE=AC1295_UGARS11106_6534052_0wtJG578sq
##JCAMPDX= 6.0         $$ Bruker NMR JCAMP-DX V2.0
##DATA TYPE= NMR SPECTRUM
##DATA CLASS= NTUPLES
##ORIGIN= BRUKER
##OWNER= Administrator
$$ 1.72 TOPSPIN		Version 2.1
$$ 2012-07-17 04:53:59.250 -0500  Administrator@TOPSPIN
$$ Compression mode = diff/dup
##.OBSERVE FREQUENCY= 400.02188249412
##.OBSERVE NUCLEUS= ^1H
##.ACQUISITION MODE= SIMULTANEOUS (DQD)
##.ACQUISITION SCHEME= undefined
##.AVERAGES= 64
##.DIGITISER RES= 22
##SPECTROMETER/DATA SYSTEM= spect
##.PULSE SEQUENCE= noesygpps1d.comp
##.SOLVENT NAME= COFFEE_meoh
##.SHIFT REFERENCE= INTERNAL, COFFEE_meoh, 1, 14.96083
##AUDIT TRAIL= $$ (NUMBER, WHEN, WHO, WHERE, PROCESS, VERSION, WHAT)
$$ ##TITLE= Audit trail, TOPSPIN		Version 2.1
$$ ##JCAMPDX= 5.01
$$ ##ORIGIN= Bruker BioSpin GmbH
$$ ##OWNER= Administrator
$$ $$ C:\Bruker\TOPSPIN/data/COFFEE/nmr/AC1295_UGARS11106_6534052_0wtJG578sq/22/pdata/1/auditp.txt
$$ ##AUDIT TRAIL=  $$ (NUMBER, WHEN, WHO, WHERE, PROCESS, VERSION, WHAT)
(   1,<2012-07-17 04:53:54.484 -0500>,<Administrator>,<TOPSPIN>,<go>,<TOPSPIN 2.1>,
      <created by zg
	started at 2012-07-17 04:42:24.296 -0500,
	POWCHK enabled, PULCHK disabled,
       configuration hash MD5:
       6B 1B 68 BB D9 2E 58 E2 7F 35 AD 54 07 DF 0E 41
       data hash MD5: 64K
       A9 68 CA CD A9 E9 54 10 05 A5 8F 7C 13 C6 50 E6>)
(   2,<2012-07-17 04:53:57.312 -0500>,<Administrator>,<TOPSPIN>,<proc1d>,<TOPSPIN 2.1>,
      <Start of raw data processing
       efp LB = 0.3 FT_mod = 6 PKNL = 1 PHC0 = 0 PHC1 = 0 SI = 128K 
       data hash MD5: 128K
       80 86 97 76 1D 4D 20 63 13 31 D9 5C 3A BE 78 B0>)
(   3,<2012-07-17 04:53:58.484 -0500>,<Administrator>,<TOPSPIN>,<proc1d>,<TOPSPIN 2.1>,
      <pk PHC0 = 4.619751 PHC1 = 0 
       data hash MD5: 128K
       09 F7 52 A0 C0 4D B2 4A 94 ED 1B 49 62 AE 8F 6B>)
(   4,<2012-07-17 04:53:58.718 -0500>,<Administrator>,<TOPSPIN>,<proc1d>,<TOPSPIN 2.1>,
      <abs ABSG = 1 
       data hash MD5: 128K
       59 E1 A0 6C BB 36 B6 3D 91 2D B0 3E C7 A1 58 52>)
(   5,<2012-07-17 04:53:58.796 -0500>,<Administrator>,<TOPSPIN>,<proc1d>,<TOPSPIN 2.1>,
      <abs ABSG = 2 
       data hash MD5: 128K
       32 5A 53 67 4B F0 83 EF CD 4C 21 FE 1D D9 3B 8B>)
(   6,<2012-07-17 04:53:58.906 -0500>,<Administrator>,<TOPSPIN>,<proc1d>,<TOPSPIN 2.1>,
      <abs ABSG = 3 
       data hash MD5: 128K
       F6 DB 1E BD 8D E6 ED F9 E1 2D E4 AA F5 CC AF 12>)
(   7,<2012-07-17 04:53:59.109 -0500>,<Administrator>,<TOPSPIN>,<proc1d>,<TOPSPIN 2.1>,
      <abs ABSG = 4 
       data hash MD5: 128K
       E7 49 A8 8C 57 E0 E5 3C 34 DA 31 27 8C 6D 17 B6>)
(   8,<2012-07-17 04:53:59.156 -0500>,<Administrator>,<TOPSPIN>,<proc1d>,<TOPSPIN 2.1>,
      <abs ABSG = 5 
       data hash MD5: 128K
       70 AA 3C A0 4C E9 63 AF 69 F5 BF 1A 0B 75 12 39>)
$$ ##END=
$$ 
$$ $$ hash MD5
$$ $$ 33 33 BC A1 E8 0F 6A 82 21 9E D0 48 DC E4 09 5B
##$RELAX= 
##$RELAX= 
##$RELAX= 
##$RELAX= 
##$RELAX= 
##$RELAX= 
##$RELAX= 
##$RELAX= 
$$ Bruker specific parameters
$$ [...]
##$TP07= 0
##$TPNAME0= <>
##$TPNAME1= <>
##$TPNAME2= <>
##$TPNAME3= <>
##$TPNAME4= <>
##$TPNAME5= <>
##$TPNAME6= <>
##$TPNAME7= <>
##$TPOAL= (0..7)
0.5 0.5 0.5 0.5 0.5 0.5 0.5 0.5
##$TPOFFS= (0..7)
0 0 0 0 0 0 0 0
##$TUNHIN= 0
##$TUNHOUT= 0
##$TUNXOUT= 0
##$USERA1= <user>
##$USERA2= <user>
##$USERA3= <user>
##$USERA4= <user>
##$USERA5= <user>
##$V9= 5
##$VALIST= <valist>
##$VCLIST= <CCCCCCCCCCCCCCC>
##$VD= 0
##$VDLIST= <DDDDDDDDDDDDDDD>
##$VPLIST= <PPPPPPPPPPPPPPP>
##$VTLIST= <TTTTTTTTTTTTTTT>
##$WBST= 2048
##$WBSW= 25
##$XGAIN= (0..3)
0 0 0 0
##$XL= 0
##$YL= 0
##$YMAX_a= 11073450
##$YMIN_a= -7384094
##$ZGOPTNS= <>
##$ZL1= 120
##$ZL2= 120
##$ZL3= 120
##$ZL4= 120
##$ABSF1= 14.96083
##$ABSF2= -5.597352
##$ABSG= 5
##$ABSL= 3
##$ALPHA= 0
##$AQORDER= 0
##$ASSFAC= 0
##$ASSFACI= 0
##$ASSFACX= 0
##$ASSWID= 0
##$AUNMP= <proc_prof1d_extract.lims>
##$AXLEFT= 0
##$AXNAME= <>
##$AXNUC= <1H>
##$AXRIGHT= 0
##$AXTYPE= 0
##$AXUNIT= <>
##$AZFE= 0.1
##$AZFW= 0.1
##$BCFW= 0
##$BC_mod= 0
##$BYTORDP= 0
##$COROFFS= 0
##$CY= 15
##$DATMOD= 1
##$DC= 0
##$DFILT= <>
##$DTYPP= 0
##$F1P= 0
##$F2P= 0
##$FCOR= 0.5
##$FTSIZE= 131072
##$FT_mod= 6
##$GAMMA= 0
##$GB= 0
##$INTBC= 1
##$INTSCL= 1
##$ISEN= 128
##$LB= 0.3
##$LEV0= 0
##$LPBIN= 0
##$MAXI= 10000
##$MC2= 0
##$MEAN= 0
##$ME_mod= 0
##$MI= 0
##$NCOEF= 0
##$NC_proc= -2
##$NLEV= 6
##$NOISF1= 0
##$NOISF2= 0
##$NSP= 0
##$NTH_PI= 0
##$NZP= 0
##$OFFSET= 14.96083
##$PC= 1
##$PHC0= 4.619751
##$PHC1= 0
##$PH_mod= 1
##$PKNL= yes
##$PPARMOD= 0
##$PPDIAG= 0
##$PPIPTYP= 0
##$PPMPNUM= 2147483647
##$PPRESOL= 1
##$PSCAL= 4
##$PSIGN= 0
##$PYNMP= <proc.py>
##$REVERSE= no
##$SF= 400.020009703887
##$SI= 131072
##$SIGF1= 0
##$SIGF2= 0
##$SINO= 400
##$SIOLD= 131072
##$SPECTYP= <>
##$SREGLST= <1H.CDCl3>
##$SSB= 0
##$STSI= 131072
##$STSR= 0
##$SW_p= 8223.68421052631
##$SYMM= 0
##$S_DEV= 0
##$TDeff= 65536
##$TDoff= 0
##$TI= <>
##$TILT= no
##$TM1= 0
##$TM2= 0
##$TOPLEV= 0
##$USERP1= <user>
##$USERP2= <user>
##$USERP3= <user>
##$USERP4= <user>
##$USERP5= <user>
##$WDW= 1
##$XDIM= 131072
##$YMAX_p= 412969451
##$YMIN_p= -12799
##$CURPLOT= <Network HP LaserJet P1505>
##$CURPRIN= <$Network HP LaserJet P1505>
##$DFORMAT= <normdp>
##$LAYOUT= <+/1D_H.xwp>
##$LFORMAT= <normlp>
##$PFORMAT= <normpl>
##$SURQMSG= 1
$$ End of Bruker specific parameters
$$ ---------------------------------
##NTUPLES= NMR SPECTRUM
##VAR_NAME=  FREQUENCY,     SPECTRUM/REAL,   SPECTRUM/IMAG
##SYMBOL=    X,             R,               I
##VAR_TYPE=  INDEPENDENT,   DEPENDENT,       DEPENDENT
##VAR_FORM=  AFFN,          ASDF,            ASDF
##VAR_DIM=   131072,        131072,          131072
##UNITS=     HZ,            ARBITRARY UNITS, ARBITRARY UNITS
##FACTOR=    0.0627417313425164, 1,          1
##FIRST=     8223.62146879497, 1864,         -45179
##LAST=      0,             2732,            -45745
##MIN=       0,             -12799,          0
##MAX=       8223.62146879497, 412969451,    0
$$ Real data points
##PAGE= N=1
##DATA TABLE= (X++(R..R)), XYDATA
$$ [...]
63895A270623j02654q9238p7047o7002n8978n2091m5810m0299l5768l2031k8788
$$ 1270623 1167969 1078731 1001684 934682 875704 823613 777803 737504 701736 669705 640917
63884F40917k5909k3371k1180j9349j7749j6113j4423j3119j2428j1746j0356
$$ 640917 615008 591637 570457 551108 533359 517246 502823 489704 477276 465530 455174
63873D55174q645p746p808p521n868l529j803q15K84J706K781L288L977N438P293
$$ 455174 446529 438783 430975 423454 417586 414057 412254 411439 411723 413429 416210 419498 423475 428913 436206
63858D36206Q942J0441J2159J4096J6067J8123K0335K2393K3998K5358K6896K8635
$$ 436206 445148 455589 467748 481844 497911 516034 536369 558762 582760 608118 635014 663649
63846F63649L0311L1845L3215L4039L3924L3132L2274L1341K9653K6943K3790
$$ 663649 693960 725805 759020 793059 826983 860115 892389 923730 953383 980326 1004116
63835A004116K0681J7247J2898P851K912j586o039j0846j5786k0242k3751k6301
$$ 1004116 1024797 1042044 1054942 1062793 1065705 1064119 1058080 1047234 1031448 1011206 987455 961154
63823I61154k8330l0407l2719l4841l6167l6480l5971l4830l3193l1386k9759
$$ 961154 932824 902417 869698 834857 798690 762210 726239 691409 658216 626830 597071
63812E97071k8232k6340k3931k1409j9150j7056j4969j3151j1931j1086j0101
$$ 597071 568839 542499 518568 497159 478009 460953 445984 432833 420902 409816 399715
63801C99715q966q265q386q999r420r261q622p873p344p106o976o799o641o526
$$ 399715 390749 382484 374098 365099 355679 346418 337796 329923 322579 315473 308497 301698 295057 288531
63787B88531o199n493m781m577m725m502l651k750k333k208k005j829j856j755
$$ 288531 282332 276839 272058 267481 262756 258254 254603 251853 249520 247312 245307 243478 241622 239867
63773B39867j201n84n37r13j036q41j001j771k478k445j808j149q14r41j591k436
$$ 239867 238666 238082 237545 236632 235596 234755 233754 231983 229505 227060 225252 224103 223289 222348 220757 218321
63757B18321k707j936n60O02J203J370J173N90j11m74l96k59m47r44j369j226
$$ 218321 215614 213678 213118 213720 214923 216293 217466 218056 217945 217471 217075 216816 216369 215425 214056 212830
63741B12830k54J218K336K393J541O07K97O71J344J923K240K330K293K157J971
$$ 212830 212576 213794 216130 218523 220064 220671 220968 221639 222983 224906 227146 229476 231769 233926 235897
63726B35897K002K584L681M795N512N907O222O462O567O729P100P367P075O256
$$ 235897 237899 240483 244164 248959 254471 260378 266600 273062 279629 286358 293458 300825 307900 314156
63712C14156N267M103K463N19j014j800k312l049l766l965l705l416l151k625
$$ 314156 319423 323526 325989 326508 325494 323694 321382 318333 314567 310602 306897 303481 300330 297705
63698B97705j936j636j937k354k404k193j948j355oJ664K613K549K390K937L693
$$ 297705 295769 294133 292196 289842 287438 285245 283297 281942 281936 283600 286213 288762 291152 294089 297782
63683B97782L640K789K042J694J093j4q23p32l91o39j035m59J150K685L468L940
$$ 297782 301422 304211 306253 307947 309040 309026 308203 307471 307080 306441 305406 304947 306097 308782 312250 316190
63667C16190M538M881M587M101M075M344M163L264K107J159L79n45j744l084m306
$$ 316190 320728 325609 330196 334297 338372 342716 346879 350143 352250 353409 353788 353243 351499 348415 344109
63652C44109n207n711n899n910n854n707n300m520l583k899k521k062j356q42
$$ 344109 338902 333191 327292 321382 315528 309821 304521 300001 296418 293519 290998 288936 287580 286738
63638B86738p95n75N76K202L011K671K235K551L236L680M118M860N287M683L570
$$ 286738 285943 285368 285944 288146 291157 293828 296063 298614 301850 305530 309648 314508 319795 324478 328048
63623C28048L078L327L536L672M705O967R359J0779J1455J2295J3516J4695J5736
$$ 328048 331126 334453 337989 341661 346366 353333 362692 373471 384926 397221 410737 425432 441168
63610D41168J6989J8574K0260K2048K4309K7200L0319L3173L5620L7654L8888
$$ 441168 458157 476731 496991 519039 543348 570548 600867 634040 669660 707314 746202
63599G46202L8659L6638L3149K8619K2951J5779P486l97o188r358j0678j1233
$$ 746202 784861 821499 854648 883267 906218 921997 929483 929086 922898 913540 902862 891629
63587H91629j1695j2419j3661j5449j7520j9641k1822k4040k5939k7021k6994
$$ 891629 879934 867515 853854 838405 820885 801244 779422 755382 729443 702422 675428
63576F75428k5869k3863k1380j8897j6645j4516j2351j0151p907n529l102j059
$$ 675428 649559 625696 604316 585419 568774 554258 541907 531756 523849 518320 515218 514159
63564E14159K79J155K106L278M308M807M765M488M370M772N788P071Q078Q597
$$ 514159 514438 515593 517699 520977 525285 530092 534857 539345 543715 548487 554275 561346 569424 578021
63550E78021Q996R932J1841J4719J8175K1769K5450K9610L4547L9998M5400N0406
$$ 578021 587017 596949 608790 623509 641684 663453 688903 718513 753060 793058 838458 888864
63538H88864N4470N5885N2056M1667K6570J0967j514r791j4705j7245j7887j7126
$$ 888864 943334 999219 1051275 1092942 1119512 1130479 1128965 1119174 1104469 1087224 1069337 1052211
63526A052211j5916j5238j5562j6868j9021k1934k5465k9301l2941l5736l7089
$$ 1052211 1036295 1021057 1005495 988627 969606 947672 922207 892906 859965 824229 787140
63515G87140l6834l5449l3706l2003l0162k7871k5189k2472j9942j7561j5334
$$ 787140 750306 714857 681151 649148 618986 591115 565926 543454 523512 505951 490617
63504D90617j3469j2100j1010r881q725p913p676p675p229o032m536l550l409
$$ 490617 477148 465048 454038 444157 435432 427519 419843 412168 404939 398907 394371 390821 387412
63491C87412l650l565k954k145j441q02j83K31L18L48P01J426K293L120L742L883
$$ 387412 383762 380197 377243 375098 373657 372855 372672 372903 373221 373569 374270 375696 377989 381109 384851 388734
63475C88734L557L428M158N323N669M733L544L167L143K117k33k727m188m639
$$ 388734 392291 395719 399877 405200 410869 415602 419146 422313 425456 427573 427340 424613 420425 415786
63461D15786m833n194n635n965o074n840n207m257l135j974r91m28k79k57j28
$$ 415786 410953 405759 400124 394159 388085 382245 377038 372781 369646 367672 366681 366253 365974 365717 365589
63446C65589J77P61J728K876L735M198M740N773P021P849Q008P833P939R011J1542
$$ 365589 365766 366527 368255 371131 374866 379064 383804 389577 396598 404447 412455 420288 428227 437238 448780
63431D48780J5408J9896K4543K9632L5322M0449M2817M0859L4761K6115J6995
$$ 448780 464188 484084 508627 538259 573581 614030 656847 697706 732467 758582 775577
63420G75577R305M272K092K236M193P783J2773J8643K4815L0779L5937L9686M1707
$$ 775577 784882 789154 791246 793482 797675 805458 818231 836874 861689 892468 928405 968091 1009798
63407A009798M1776L9304L3649K5170J5496O419j166p122j1504j4559j6796j8578
$$ 1009798 1051574 1090878 1124527 1149697 1165193 1171612 1170446 1163324 1151820 1137261 1120465 1101887
63395A101887j9899k0993k2688k5592k9179l2368l4719l6487l7638l7669l6392
$$ 1101887 1081988 1060995 1038307 1012715 983536 951168 916449 879962 842324 804655 768263
63384G68263l4270l1752k8916k5947k3360k1406j9656j7564j5130j2711j0426
$$ 768263 733993 702241 673325 647378 624018 602612 582956 565392 550262 537551 527125
63373E27125q081n533k912n70J163K335L546N384P624R360J0166J0681J1786J3641
$$ 527125 519044 513511 510599 510029 511192 513527 517073 522457 530081 539441 549607 560288 572074 585715
63359E85715J5931J8627K1866K5280K8229L0714L3384L6447L9195M0947M1944
$$ 585715 601646 620273 642139 667419 695648 726362 759746 796193 835388 876335 918279
63348I18279M2745M3055M1736L7962L1873K4089J5191N961k347q616j2685j5246
$$ 918279 961024 1004079 1045815 1083777 1115650 1139739 1154930 1160891 1158544 1149928 1137243 1121997
63336A121997j6985j8225j9340k0860k2936k5110k7024k8959l1223l3315l4441
$$ 1121997 1105012 1086787 1067447 1046587 1023651 998541 971517 942558 911335 878020 843579
63325H43579l4658l4732l4756l3759l1110k7589k4316k1133j6948j1535n999j297
$$ 843579 808921 774189 739433 705674 674564 646975 622659 601526 584578 573043 567044 565747
63313E65747K728O078P131L703m157j3251j9707k2121k1907k1002j9993j8466
$$ 565747 568475 574553 581684 585387 581230 567979 548272 526151 504244 483242 463249 444783
63301D44783j6260j3776j1507r766q682q013p176n971n106n328o190o423n592
$$ 444783 428523 414747 403240 393474 384792 376779 369603 363632 358526 353198 347008 340585 334993
63288C34993m580m199m094l575k816k520k775k950k571j810j177j102j622k115
$$ 334993 330413 326214 322120 318545 315729 313209 310434 307484 304913 303103 301926 300824 299202 297087
63274B97087j725m09P48Q24J81k53l58n94q51o26k67p78k176l114k631j257j2
$$ 297087 295362 294953 295701 296525 296706 296453 296095 295501 294650 294024 293757 292979 290803 287689 285058 283801 283789
63257B83789Q46J378J237K99o06n09M18J120R66J82o56r84l89Q72J737J429M97
$$ 283789 284635 286013 287250 287549 286943 286434 286852 287972 288938 289120 288464 287480 287091 287963 289700 291129 291626
63240B91626R5M44P96P32O01O63O99O70R17J396J477Q87K35J74N95J055J479J906
$$ 291626 291721 292165 292961 293693 294294 294957 295656 296326 297243 298639 300116 301003 301238 301412 302007 303062 304541 306447
63222C06447K033J629J058Q48R56J021J133J669K493K895K567K013J856K098K347
$$ 306447 308480 310109 311167 312015 312971 313992 315125 316794 319287 322182 324749 326762 328618 330716 333063
63207C33063K439K540K773L044L245L424L751M357N215O009O209N441L959K612
$$ 333063 335502 338042 340815 343859 347104 350528 354279 358636 363851 369860 376069 381510 385469 388081
63193C88081K179K646L329L729M039M660N537O400P467R270J1637J3501J4157
$$ 388081 390260 392906 396235 399964 404003 408663 414200 420600 428067 437337 448974 462475 476632
63180D76632J4269J5063J6738J8230J8506J7530J5990J4584J3789J3715J3844
$$ 476632 490901 505964 522702 540932 559438 576968 592958 607542 621331 635046 648890
63169F48890J3274J1610R444P673O587N905N373M780L632J418j731n138q354j1398
$$ 648890 662164 673774 683218 690891 697478 703383 708756 713536 717168 718586 716855 711717 703363 691965
63155F91965j4155j6160j7336j8303j9531k0519k0482j9477j8278j7195j5808
$$ 691965 677810 661650 644314 626011 606480 585961 565479 546002 527724 510529 494721
63144D94721j3932j2133j0975j0207r181p748o342n324m633m036l459k960k529
$$ 494721 480789 468656 457681 447474 438293 430545 424203 418879 414246 410210 406751 403791 401262
63131D01262j988j177j91O58J268J947K946L955M452M476M565M917N148N113N335
$$ 401262 399274 398097 397906 398564 399832 401779 404725 408680 413132 417608 422173 427090 432238 437351 442686
63116D42686O233P344P808P371O502N714N194M896M692M528M687N519O730P347
$$ 442686 448919 456263 464071 471442 477944 483658 488852 493748 498440 502968 507655 513174 519904 527251
63102E27251O859N922N403N174M599L837L647M069M406M558N305O871Q262Q612
$$ 527251 534110 540032 545435 550609 555208 559045 562692 566761 571167 575725 581030 587901 596163 604775
63088F04775Q442Q718R309R216Q079O575N307M032K249M7j965l417m559n797o979
$$ 604775 613217 621935 631244 640460 648539 655114 660421 664453 666702 666749 664784 661367 656808 651011 644032
63073F44032p491p199o971p769r318j0285r894q789q055p899p815p531p234o997
$$ 644032 636541 629342 622371 614602 605284 594999 585105 576316 568261 560362 552547 545016 537782 530785
63059E30785o613n949n031l809k187l91J085K012K723L735N129O430P109P128
$$ 530785 524172 518223 513192 509383 507196 506805 507890 509902 512625 516360 521489 527919 535028 542156
63045E42156O942O914O969O962P146P901R050R934J0161R894R357Q595P862P611
$$ 542156 549098 556012 562981 569943 577089 584990 594040 603974 614135 624029 633386 641981 649843 657454
63031F57454P802P745O988N919N021M066K622J025R2J3J47j67j012k073k968l462
$$ 657454 665256 673001 679989 685908 690929 694995 697617 698642 698734 698747 698894 698727 697715 695642 692674 689212
63015F89212l644l793l854l319k020o58Q5O11J901M055O225P957R845J2512J5686
$$ 689212 685568 681775 677921 674602 672582 671924 672009 672620 674521 678576 684801 692758 702603 715115 730801
63000G30801J8652K1134K3233K4872K5738K5729K5172K4605K4333K4119K3378
$$ 730801 749453 770587 793820 818692 844430 870159 895331 919936 944269 968388 991766
62989I91766K1892K0222J9082J8486J7921J7181J6427J5464J3745J1219Q424N456
$$ 991766 1013658 1033880 1052962 1071448 1089369 1106550 1122977 1138441 1152186 1163405 1171829 1177285
62977A177285J624l366q545j2751j6091j9575k3606k7600l1011l3772l5663l6045
$$ 1177285 1178909 1175543 1166998 1154247 1138156 1118581 1094975 1067375 1036364 1002592 966929 930884
62965I30884l4758l2686l0873k9351k7423k4936k2592k0862j9304j7370j5450
$$ 930884 896126 863440 832567 803216 775793 750857 728265 707403 688099 670729 655279
62954F55279j4365j4008j3296j1780j0482j0580j1796j2842j3156j3239j3335
$$ 655279 640914 626906 613610 601830 591348 580768 568972 556130 542974 529735 516400
62943E16400j2843j1444r983r515r972j0401j0242r710r003p903o310m740l908
$$ 516400 503557 492113 482130 472615 462643 452242 442000 432290 423287 415384 409074 404334 400426
62930D00426l991m422m456l876l199l084l553l924l610k807k127j781j462r88
$$ 400426 396435 392013 387557 383681 380482 377398 373845 369921 366311 363504 361377 359596 358134 357146
62916C57146o16n92p35p46p04q46j006o85J79R30R90O76P95J489K021J807J198
$$ 357146 356530 355938 355203 354457 353753 352907 351901 351216 351395 352325 353315 353991 354786 356275 358296 360103 361301
62899C61301R23J188J678K150K619L067L509M213N410O802P749Q003P779P152
$$ 361301 362224 363412 365090 367240 369859 372926 376435 380648 386058 392860 400609 408612 416391 423543
62885D23543N984M650M112M837N960O109M855K963J277j01j508k996m249n036
$$ 423543 429527 434177 438289 443126 449086 455195 460050 463013 464290 464189 462681 459685 455436 450400
62871D50400n484n842o152o331o466o765p140p211o833o366o135n931n414m725
$$ 450400 444916 439074 432922 426591 420125 413360 406220 399009 392176 385810 379675 373744 368330 363605
62857C63605m186l583k431r06J54L14jl08o17r66j001n55j24k80q81j307j197
$$ 363605 359419 355836 353405 352499 352653 352967 352966 352658 352041 351075 350074 349519 349395 349115 348234 346927 345730
62840C45730n90K70Q99P26j72q61n89J56K81m15j034q55j83K49K20J07K80O58
$$ 345730 345140 345410 346309 347035 346863 346002 345413 345569 345850 345435 344401 343546 343363 343612 343832 343939 344219 344877
62822C44877P84L53l17n16M9Q52J197R69M91l7m98o39l88k28o16j176j159o14
$$ 344877 345661 346014 345697 345181 345230 346082 347279 348248 348739 348702 348204 347565 347177 346949 346333 345157 343998 343384
62804C43384l73p53j110j003r64j558k229j879m05J055J462R36L57K47L49J45
$$ 343384 343011 342258 341148 340145 339181 337623 335394 333515 333110 334165 335627 336563 336920 337167 337516 337661
62788C37661m22q43o45L0N83O41L67J00LK32J110K707M408N268N020M440M482
$$ 337661 337239 336396 335751 335781 336364 337005 337372 337472 337475 337707 338817 341524 345932 351200 356220 360660 365142
62771C65142N287O166O454O031N073L737K333J454J432J766J567O65j80l87l96
$$ 365142 370429 376595 383049 389080 394153 397890 400223 401677 403109 404875 406442 407107 406927 406540 406144
62756D06144j051k417l706m260m195l990l910l952m134m486m846m855m268l303
$$ 406144 405093 402676 398970 394710 390515 386525 382615 378663 374529 370043 365197 360342 356074 352771
62742C52771k612k744l578m376m478l845k957k315k128k242k229j765r91l52q
$$ 352771 350159 347415 343837 339461 334983 331138 328181 325866 323738 321496 319267 317502 316511 316159 316151
62727C16151K95O86R27R21R98J345J580J376J148J535K429L201L672M220M928
$$ 316151 316446 317132 318059 318980 319978 321323 322903 324279 325427 326962 329391 332592 336264 340484 345412
62712C45412N389N450N543O020O678P243P867Q900J0447J2295J4123J5709J7202
$$ 345412 350801 356251 361794 367814 374492 381735 389602 398502 408949 421244 435367 451076 468278
62699D68278J9169K1942K5018K7505K9250L0889L2822L4725L6324L7980M0071
$$ 468278 487447 509389 534407 561912 591162 622051 654873 689598 725922 763902 803973
62688H03973M2386M4465M6052M6773M5815M2559L7257L0669K3300J5347P100j189
$$ 803973 846359 890824 936876 983649 1029464 1072023 1109280 1139949 1163249 1178596 1185696 1184507
62676A184507r564j7950k5641l1751l6161l9474m2066m3674m4079m3683m3057
$$ 1184507 1174943 1156993 1131352 1099601 1063440 1023966 981900 938226 894147 850464 807407
62665H07407m2153m0316l7169l3328l0055k8102k7009k5695k3630k1151j8717
$$ 807407 765254 724938 687769 654441 624386 596284 569275 543580 519950 498799 480082
62654D80082j6441j4420j2970j2083j1163r729q149p135o784o602o296n976n626
$$ 480082 463641 449221 436251 424168 413005 403276 395127 387992 381208 374606 368310 362334 356708
62641C56708m972l970l021k534k497k593k498k057j418r36p40n44j40J39j27o91
$$ 356708 351736 347766 344745 342211 339714 337121 334623 332566 331148 330212 329472 328928 328788 328927 328800 328109
62625C28109q96p36r45j863k774k798k063j456j423j512j155n16k36n41r11p76
$$ 328109 327213 326477 325532 323669 320895 318097 316034 314578 313155 311643 310488 309972 309736 309195 308284 307508
62609C07508l63m17j129j727j425m51K79L32J11J52N36J063J530J698J362O66
$$ 307508 307145 306728 305599 303872 302447 301996 302275 302607 302718 302870 303406 304469 305999 307697 309059 309725
62593C09725Q5k6L25R82J696J977J434M71J55J048K464L284L158K541J865J233
$$ 309725 309810 309784 310109 311091 312787 314764 316198 316669 316824 317872 320336 323620 326778 329319 331184 332417
62577C32417P26M65K80j49p97j298j521j756k174k501k448k196k136k286k280
$$ 332417 333143 333608 333888 333739 332942 331644 330123 328367 326193 323692 321244 319048 316912 314626 312346
62562C12346j868j199o59n76j018j644j791j031K10R10O03M5L29J401J940R86
$$ 312346 310478 309279 308620 308044 307026 305382 303591 302560 302770 303680 304283 304328 304657 306058 307998 308984
62546C08984p97j871j646r61p99j086j004j59J024J870K098J969J966K376K922
$$ 308984 308187 306316 304670 303709 302910 301824 300820 300661 301685 303555 305653 307622 309588 311964 314886
62531C14886K957K157J012L95O92J500K165K383K328K448L137M377N654O475P015
$$ 314886 317843 320000 321012 321407 322099 323599 325764 328147 330475 332923 336060 340437 346091 352566 359581
62516C59581P926R472J1193J2634J4006J5772J7878J9866K1614K3406K5347K7151
$$ 359581 367507 376979 388172 400806 414812 430584 448462 468328 489942 513348 538695 565846
62504E65846K8561K9485K9669K8760K6875K4649K2347J9438J5420J0702O160K140
$$ 565846 594407 623892 653561 682321 709196 733845 756192 775630 791050 801752 807912 810052
62492H10052j484m512o451p341p781p932p087m665j197K161M901P570J0928J5028
$$ 810052 808568 804056 797605 790264 782483 774551 767464 762799 761602 763763 768664 776234 787162 802190
62478H02190J9128K2455K4925K7010K8789K9374K7671K3637J8369J2965P697K342
$$ 802190 821318 843773 868698 895708 924497 953871 981542 1005179 1023548 1036513 1044210 1046552
62466A046552l328r534j6420k3513k9719l4235l7226l9324m0796m1565m1613m0932
$$ 1046552 1043224 1033690 1017270 993757 964038 929803 892577 853253 812457 770892 729279 688347
62454F88347l9334l6792l3685l0369k6888k3431k0602j8608j6666j3904j0612
$$ 688347 649013 612221 578536 548167 521279 497848 477246 458638 441972 428068 417456
62443D17456p852o061m850l918l315k857k195j534j408j674j573r65o28j002j504
$$ 417456 409604 403543 398693 394775 391460 388603 386408 384874 383466 381792 380219 379254 378626 377624 376120
62428C76120j442r38n51o65j483k896m034l863k625j812k197k842k673j990j561
$$ 376120 374678 373740 373189 372524 371041 368145 364111 360248 357623 355811 353614 350772 348099 346109 344548
62413C44548j249o74m08j084j934j707o71j34k47Q0R74J133L8r71p05J68M55L29
$$ 344548 343299 342625 342217 341133 339199 337492 336821 336687 336440 336520 337494 338627 338665 337694 336989 337157 337612 337941
62395C37941O82J412J655J365J353J972K777L441M069M578M620M284M111M244
$$ 337941 338623 340035 341690 343055 344408 346380 349157 352598 356667 361245 365865 370149 374260 378504
62381C78504M270M083M171M801N550O050O599P496Q371Q762R036R923J1310J2234
$$ 378504 382774 386857 391028 395829 401379 407429 414028 421524 429895 438657 447693 457616 468926 481160
62367D81160J2202J1800J1774J2165J2747J3831J5904J8757K1603K4131K6871
$$ 481160 493362 505162 516936 529101 541848 555679 571583 590340 611943 636074 662945
62356F62945L0427L4899M0189M6309N2921N8995O3385O5622O5811O4016O0149
$$ 662945 693372 728271 768460 814769 867690 926685 990070 1055692 1121503 1185519 1245668
62345A245668N4264M6543L7099K6331J5265N035m012j2163j9419k5433l0489l5630
$$ 1245668 1299932 1346475 1383574 1409905 1425170 1430205 1426193 1414030 1394611 1369178 1338689 1303059
62333A303059m1210m5956m8221m7895m6338m4557m2217l8698l4479l0868k8603
$$ 1303059 1261849 1215893 1167672 1119777 1073439 1028882 986665 947967 913488 882620 854017
62322H54017k7150k5502k3375k1434k0413k0283k0352k0064j9453j8871j8492
$$ 854017 826867 801365 777990 756556 736143 715860 695508 675444 655991 637120 618628
62311F18628j8158j7647j6878j5954j4965j3837j2421j0809r356q279p369o337
$$ 618628 600470 582823 565945 549991 535026 521189 508768 497959 488603 480324 472955 466618
62299D66618n216m235l346k349j371q56r11j087q81j81Q20J837K521K708K717
$$ 466618 461402 457167 453821 451472 450101 449245 448334 447247 446366 446185 447005 448842 451363 454071 456788
62284D56788L031L551L668L212K795K895L171L076K692K439K393K429K698L298
$$ 456788 459819 463370 467038 470250 473045 475940 479111 482187 484879 487318 489711 492140 494838 498136
62270D98136L740L538L166L677N277P015Q039Q612R589J1422J4021J7203K0911
$$ 498136 501876 505414 508580 512257 517534 524549 532588 541200 550789 562211 576232 593435 614346
62257F14346K5108K9778L4947M0545M6347N2150N7845O3204O7567O9906O9336
$$ 614346 639454 669232 704179 744724 791071 843221 901066 964270 1031837 1101743 1171079
62246A171079O5702N9614N1711M2025L0509J8201P042k031j0212j9311k9380l8634
$$ 1171079 1236781 1296395 1348106 1390131 1420640 1438841 1445883 1443852 1433640 1414329 1384949 1346315
62234A346315m5592n0370n3832n6321n7674n7785n6641n4187n0568m6291m1897
$$ 1346315 1300723 1250353 1196521 1140200 1082526 1024741 968100 913913 863345 817054 775157
62223G75157l7624l3545k9686k5982k2356j9049j6487j4763j3531j2483j1520
$$ 775157 737533 703988 674302 648320 625964 606915 590428 575665 562134 549651 538131
62212E38131j0532r400q281p340o289m777l292k746l075l177k629k342k836k952
$$ 538131 527599 518199 509918 502578 496289 491512 488220 485474 482399 479222 476593 474251 471415 468463
62198D68463j414J101K784L150L356M153M915M950M676M934N954P486R301J1023
$$ 468463 467049 468150 470934 474084 477440 481593 486508 491458 496134 501068 507022 514508 523809 534832
62184E34832J2022J2066J1756J1813J2173J2286J2051J1921J2030J1706J0173
$$ 534832 546854 558920 570676 582489 594662 606948 618999 630920 642950 654656 664829
62173F64829P608N187M010M066M509M839N557P540J1142J6069K1792K7757L3444
$$ 664829 672437 677624 681634 685700 690209 695048 700605 708145 719287 735356 757148 784905 818349
62160H18349L8615M3349M7423M9927M9927M7305M2441L5425K6366J6376P243j61
$$ 818349 856964 900313 947736 997663 1047590 1094895 1137336 1172761 1199127 1215503 1222746 1222585
62148A222585o499j2672j8636k3913k8573l3042l7243m0592m2643m3269m2411
$$ 1222585 1216086 1203414 1184778 1160865 1132292 1099250 1062007 1021415 978772 935503 893092
62137H93092m0179l7082l3735l0368k6949k3641k0715j8095j5479j2945j0936
$$ 893092 852913 815831 782096 751728 724779 701138 680423 662328 646849 633904 622968
62126F22968r540q275o761n255m184l491k853k332k231k315j712O2K360M129N217
$$ 622968 613428 605153 598392 593137 588953 585462 582609 580277 578046 575731 574019 574081 576441 580570 585787
62111E85787O485Q683J1662J4816J7796K0552K3055K5336K7346K8367K7023K2639
$$ 585787 592272 600955 612617 627433 645229 665781 688836 714172 741518 769885 796908 819547
62099H19547J6512J1122P979O876P152Q701J1148J2891J1984P936J967m352j0052
$$ 819547 836059 847181 855160 862036 869188 877889 889037 901928 913912 921848 923815 919463 909411
62086I09411j4334j6208j5251j2417r391p050m933k313P58L801O827J0203J3731
$$ 909411 895077 878869 863618 851201 841810 834760 829827 827514 828272 832073 838900 849103 862834
62073H62834J6647J8755K0815K3310K5448K6154K5628K5097K5152K5337K5445
$$ 862834 879481 898236 919051 942361 967809 993963 1019591 1044688 1069840 1095177 1120622
62062A120622K6194K8247L1176L3944L5846L6598L6037L4215L1344K7206K1145
$$ 1120622 1146816 1175063 1206239 1240183 1276029 1312627 1348664 1382879 1414223 1441429 1462574
62051A462574J3255N091j550o450j0874j5861k1291k6559l1406l5818l9656m2679
$$ 1462574 1475829 1480920 1479370 1472920 1462046 1446185 1424894 1398335 1366929 1331111 1291455 1248776
62039A248776m4687m5569m5436m4681m3576m1858l9125l5635l2223k9322k6568
$$ 1248776 1204089 1158520 1113084 1068403 1024827 982969 943844 908209 875986 846664 820096
62028H20096k3554k0501j7916j5885j4108j2352j0615q991p673o952o973p499
$$ 820096 796542 776041 758125 742240 728132 715780 705165 696174 688501 681549 674576 667077
62016F67077q028q141p656o708n796n481n812o116n719m696l662k931k274j515
$$ 667077 659049 650908 643252 636544 630748 625267 619455 613339 607620 602924 599262 596331 594057 592542
62002E92542q81m89J60J696L966O011P036P113O785O332N731N033M407L827L143
$$ 592542 591661 591172 591332 593028 596994 603005 610041 617154 623939 630271 636002 641035 645442 649269 652412
61987F52412K411J778R82n91l095n848q010r393j0262j0716j0736j0615j0766
$$ 652412 654823 656601 657583 656992 653897 648049 640039 630646 620384 609668 598932 588317 577551
61974E77551j0997j0537r025p126n890n697o080o335o058n195l984k901k398k468
$$ 577551 566554 556017 546992 539866 533976 528279 522199 515864 509806 504611 500627 497726 495328 492860
61960D92860k615k404j963j738j806j748j330r06q36q06k60O34J107J027J279
$$ 492860 490245 487841 485878 484140 482334 480586 479256 478350 477514 476708 476448 477082 478189 479216 480495
61945D80495K517M168N302O045P291R195J0880J1806J2641J4349J6930J9481K1199
$$ 480495 483012 487180 492482 498527 505818 515013 525893 537699 550340 564689 581619 601100 622299
61932F22299K1869K1709K1107K0449J9811J8904J7500J5831J4340J3133J1881
$$ 622299 644168 665877 686984 707433 727244 746148 763648 779479 793819 806952 818833
61921H18833J0138P601M153N0m013p274r388j0417j0468r668q327o786m956k476
$$ 818833 828971 836572 840725 840775 836762 829488 820100 809683 799215 789547 781220 774434 769478 767002
61907G67002O08L745O679R851J3494J6786J8512J8555J7912J7098J5274J1479
$$ 767002 767610 771355 778034 787885 801379 818165 836677 855232 873144 890242 905516 916995
61895I16995O191R54l344p198j1357j5610j8915k0497k0480j9597j8514j7401
$$ 916995 923186 924140 920796 913598 902241 886631 867716 847219 826739 807142 788628 771227
61883G71227j6107j4691j3596j3191j3260j3254j2965j2726j2925j3621j4521
$$ 771227 755120 740429 726833 713642 700382 687128 674163 661437 648512 634891 620370
61872F20370j5122j4940j3938j2695j1764j0972r832q472p414o492m839k285J71
$$ 620370 605248 590308 576370 563675 551911 540939 531107 522635 515221 508729 503890 501605 501776
61859E01776J776L052M731O469P601Q602J0641J3831J7043J9514K1611K3904K6382
$$ 501776 503552 506604 511335 517804 525405 534007 544648 558479 575522 595036 616647 640551 666933
61846F66933K8916L1639L4474L6821L8067L7962L6423L3509K9785K5913K1655
$$ 666933 695849 727488 761962 798783 836850 874812 911235 944744 974529 1000442 1022097
61835A022097J5970Q616R67n257r601j2621j4617j5319j4543j2394q927m239J169
$$ 1022097 1038067 1046683 1047650 1042393 1032792 1020171 1005554 990235 975692 963298 954371 950132 951301
61822I51301O573J1514J5738J8840K0425K0491J9147J6163J1268M911j943q713
$$ 951301 957874 969388 985126 1003966 1024391 1044882 1064029 1080192 1091460 1096371 1094428 1085715
61810A085715j5446k2055k7926l2495l5719l7716l8362l7625l5959l3982l1879
$$ 1085715 1070269 1048214 1020288 987793 952074 914358 875996 838371 802412 768430 736551
61799G36551k9474k6712k3780k0829j7949j5418j3590j2400j1337j0072q850p927
$$ 736551 707077 680365 656585 635756 617807 602389 588799 576399 565062 554990 546140 538213
61787E38213o895n159l113k100k793m061m152k779j302q56j123j201r39p85q37
$$ 538213 531318 526159 523046 520946 518153 514092 509940 507161 505859 505003 503880 502679 501740 500955 500118
61772E00118p56m39j55p2j46m02q45j086o75J36M71p9q39q60K5J209K113K619
$$ 500118 499362 498923 498768 498696 498550 498148 497303 496217 495542 495678 496149 496070 495231 494371 494396 495605 497718 500337
61754E00337K851K938L008L197L521L799L762L233K250J036j83j263k075k445
$$ 500337 503188 506126 509134 512331 515852 519651 523413 526646 528896 529932 529749 528486 526411 523966
61740E23966k388k291k532k915k747j715m05K36j20r30j394j115k73O52J215J272
$$ 523966 521578 519287 516755 513840 511093 509378 508973 509209 509089 508159 506765 505650 505377 506029 507244 508516
61724E08516R98P45Q58J484K393L047L093K817K850L312L564L073K188J730J964
$$ 508516 509514 510259 511117 512601 514994 518041 521134 523951 526801 530113 533677 536750 538938 540668 542632
61709E42632K331K210J460L06r98k172k966l326l346l023k304j440r11q50q93
$$ 542632 544963 547173 548633 548939 547941 545769 542803 539477 536131 533108 530804 529364 528453 527603 526710
61694E26710q18q53j057q34L39J968K959K927K431K029J696J368J297J530J565
$$ 526710 525892 525039 523982 523148 523487 525455 528414 531341 533772 535801 537497 538865 540162 541692 543257
61679E43257J066M48K98N22N90L90K42K11J8l61n82n63p45j471k447l136l374
$$ 543257 544323 544771 545069 545591 546181 546571 546813 547024 547042 546681 546099 545536 544791 543320 540873 537737 534363
61662E34363l363l195k770k128j579j383j366j020j21Q45J046K79o80q57k8J284
$$ 534363 531000 527805 525035 522907 521328 519945 518579 517559 517438 518283 519329 519608 518928 518071 518043 519327
61646E19327K504L237L102K053R04P97J874L017L256K902K795K982K844K199J476
$$ 519327 521831 525068 528170 530223 531127 531924 533798 536815 540071 542973 545768 548750 551594 553793 555269
61631E55269Q13k01j700l088l751l778l633l493l325l288l574l937l905l429k968
$$ 555269 556082 555881 554181 551093 547342 543564 539931 536438 533113 529825 526251 522314 518409 514980 512012
61616E12012k768k443j538k70O00O02n4r25j893l062m308n257n751o027o256o163
$$ 512012 509244 506801 505263 504993 505593 506195 506141 505216 503323 500261 495953 490696 484945 478918 472662 466499
61600D66499n402m266l591l824m456m623m078l297k740k389k074j888k013k324
$$ 466499 461097 456831 453240 449416 444960 440337 436259 432962 430222 427833 425759 423871 421858 419534
61586D19534k454k238j910j837k176k725l055k848k178j383p00j66R6r6n13n36
$$ 419534 417080 414842 412932 411095 408919 406194 403139 400291 398113 396730 396030 395864 395960 395864 395351 394815
61570C94815k3K18m98j566j764j020n47j016j659j582j127j152j624j772j217
$$ 394815 394792 395010 394512 392946 391182 390162 389615 388599 386940 385358 384231 383079 381455 379683 378466
61555C78466k42P94J472J146l14j844k152j331n67l83k31Q2j29j038j606j087
$$ 378466 378224 379018 380490 381636 381322 379478 377326 375995 375428 375045 374814 374896 374767 373729 372123 371036
61539C71036k76k43n35N2J329J715M84j129j553p91l8K6j66n4J79j1o51j139j038
$$ 371036 370760 370517 369982 370034 371363 373078 373562 372433 370880 370089 370051 370077 369911 369857 370036 370025 369374 368235 367197
61520C67197o64o90j312k080k541k749l035l460l704l403k500j343m84k44m05
$$ 367197 366533 365843 364531 362451 359910 357161 354126 350666 346962 343559 341059 339716 339232 338988 338583
61505C38583n08l96l28n04p74q80p17k81L18P33N95O7j82K53J019J490J461J062
$$ 338583 338075 337679 337351 336847 336073 335193 334476 334195 334513 335246 335841 335908 335726 335979 336998 338488 339949 341011
61487C41011L68m89j109j158q02m34j58J31L50L52L42N80P92M43m14j037r37l59
$$ 341011 341379 340890 339781 338623 337821 337387 337229 337360 337710 338062 338404 338984 339776 340219 339805 338768 337831 337472
61469C37472L06J068J946K484K163J107k5p44j007q86m40J04M38N27O27P34M52
$$ 337472 337778 338846 340792 343276 345439 346546 346521 345777 344770 343884 343444 343548 343986 344513 345140 345874 346326
61452C46326l76j159j167n47j86m91p60j05J376K733L250K947K177J263N78N04
$$ 346326 345950 344791 343624 343077 342891 342400 341640 341535 342911 345644 348894 351841 354018 355281 355859 356363
61436C56363J008J596J874J951K112K338K395K243K103K131K181J938J259M20
$$ 356363 357371 358967 360841 362792 364904 367242 369637 371880 373983 376114 378295 380233 381492 381912
61422C81912n8J8K22R7r4L84J704L084L686L468K919K257J414N84K85P18J352
$$ 381912 381854 381872 382094 382191 382097 382481 384185 387269 390955 394423 397342 399599 401013 401597 401882 402600 403952
61405D03952J335K76j374k753l389l533l650l783l650l279l069l215l381l177
$$ 403952 405287 405563 404189 401436 398047 394514 390864 387081 383431 380152 377083 373868 370487 367310
61391C67310k598j866j098l53K60O86R73J099R37N05J2l83n89l49N83J881K727
$$ 367310 364712 362846 361748 361395 361655 362341 363314 364413 365350 365855 365867 365484 364895 364546 365129 367010 369737
61374C69737K673K065J412Q21L20K61Q76J765K240K036J370N45j32l21R0Q01J440
$$ 369737 372410 374475 375887 376708 377028 377289 378165 379930 382170 384206 385576 386121 385989 385668 385758 386559 387999
61357C87999J893K128J993J511J072J072J564K406L381M067M114L974M704O614
$$ 387999 389892 392020 394013 395524 396596 397668 399232 401638 405019 409086 413200 417174 421878 428492
61343D28492Q722J0034J0715J1455J2274J2705J2631J2082J0736Q536O404N273
$$ 428492 437214 447248 457963 469418 481692 494397 507028 519110 529846 538382 544786 550059
61331E50059M693L461J403n46j945l241m581n450n755o056o362n870m498l495
$$ 550059 554752 558213 559616 559070 557125 553884 549303 543853 538098 532042 525680 519810 515312 511817
61317E11817l728m276l663j833M4J171J627J622J250Q53Q43J091J189J229J711
$$ 511817 508089 503813 500150 498317 498361 499532 501159 502781 504031 504884 505727 506818 508007 509236 510947
61302E10947K688L606M156M702N670O949Q153R112R815J0120R818Q848P204M728
$$ 510947 513635 517241 521397 526099 531769 538718 546871 555983 565798 575918 585736 594584 601788 606516
61288F06516J351k464n795p924q848r067q997q705q116p251o297n521n077m801
$$ 606516 607867 605403 599608 591684 582836 573769 564772 556067 547951 540700 534403 528882 523805 519004
61274E19004m251l158j718k87J050K373L557M496N478O787P979Q262P779P692
$$ 519004 514753 511595 509877 509590 510640 513013 516570 521066 526544 533331 541310 549572 557351 565043
61260E65043Q620R680R693Q759P947P852Q232Q886J0040J1829J3906J5680J6655
$$ 565043 573663 583343 593036 601795 609742 617594 625826 634712 644752 656581 670487 686167 702822
61247G02822J6556J5448J3615J1119P733L531q10m627p773j0174j1509j1795j1751
$$ 702822 719378 734826 748441 759560 767293 770824 770014 765387 757614 747440 735931 724136 712385
61234G12385j1831j1430r913p911o546n764m555k689j033q9N46J073J031M22K51
$$ 712385 700554 689124 679211 671300 664754 658990 654435 651746 650713 650624 651170 652243 653274 653696 653947
61219F53947J296L041M450N228N704O003N927N414M630L672K517J166k33j309
$$ 653947 655243 658284 662734 667962 673666 679669 685596 691010 695640 699312 701829 702995 702762 701453
61205G01453j581r69r9K81Q5l04p95j539k249k321j758j195q36n8J653L973O264
$$ 701453 699872 698903 698804 699085 699170 698866 698071 696532 694283 691962 690204 689009 688173 688115 689768 693741 700005
61188G00005Q356J0441J2638J4943J7269J9317K0654K1022K0366J8589J5745J2414
$$ 700005 708361 718802 731440 746383 763652 782969 803623 824645 845011 863600 879345 891759
61176H91759R475P411O179N607N454N240M567L596K647J496l11k569m637o406
$$ 891759 901234 908645 914824 920431 925885 931125 935692 939288 941935 943431 943120 940551 935914 929508
61162I29508q239j0048j1304j2016j2750j3587j3988j3897j3970j4460j4745j4344
$$ 929508 921269 911221 899917 887901 875151 861564 847576 833679 819709 805249 790504 776160
61150G76160j3584j2797j1759j0266q557o729m496k004o1J049K204M300O941Q887
$$ 776160 762576 749779 738020 727754 719197 712468 707972 705968 705907 706956 709160 713460 720401 729288
61136G29288R360Q315N925K455j459m983p596r316j0405j0856j0132p730m238
$$ 729288 738648 746963 752888 755343 753884 748901 741305 731989 721584 710728 700596 692866 688628
61123F88628j338q4M22J861M486P058Q742R981J1461J3296J5317J7276J8605J8996
$$ 688628 687290 687206 687628 689489 693975 701033 709775 719756 731217 744513 759830 777106 795711 814707
61109H14707J9228K0429K2395K3720K3713K3057K2462K1806K0907K0043J9312
$$ 814707 833935 854364 876759 900479 924192 947249 969711 991517 1012424 1032467 1051779
61098A051779J8453J7525J6733J5575J3326J0425Q042O165L556j50l940p349j1239
$$ 1051779 1070232 1087757 1104490 1120065 1133391 1143816 1151858 1158023 1161579 1161429 1157489 1150140 1138901
61085A138901j5996k0499k3642k5453k6106k5335k3567k2137k1532k0780j9330
$$ 1138901 1122905 1102406 1078764 1053311 1027205 1001870 978303 956166 934634 913854 894524
61074H94524j7992j7221j6066j3882j1620j0319r657r040q751q952q821p787o355
$$ 894524 876532 859311 843245 829363 817743 807424 797767 788727 779976 771024 762203 754416 748061
61061G48061m861k743l1J975K553K663L237L869M228N093O766Q134Q572R159J0698
$$ 748061 743200 740457 740426 742401 744954 747617 750854 754723 758951 764044 770810 778944 787516 796675 807373
61046H07373J2266J3034J3870J5599J7458J8658J9830K1356K2189K1946K2221
$$ 807373 819639 832673 846543 862142 879600 898258 918088 939444 961633 983579 1005800
61035A005800K4076K6140K6988K7476K8769L0117L0596L1042L2152L2809L2446
$$ 1005800 1029876 1056016 1083004 1110480 1139249 1169366 1199962 1231004 1263156 1295965 1328411
61024A328411L2850L5281L8161M0061M2454M6700N1006N3637N6409O1381O6584
$$ 1328411 1361261 1396542 1434703 1474764 1517218 1563918 1614924 1668561 1724970 1786351 1852935
61013A852935O8966O9288P0080P1195P1800P4441Q2261R4137J07276J22245J40273
$$ 1852935 1921901 1991189 2061269 2132464 2204264 2278705 2360966 2455103 2562379 2684624 2824897
61002B824897J58169J72061J84274K00334K21608K47961K84917L39654M12033
$$ 2824897 2983066 3155127 3339401 3539735 3761343 4009304 4294221 4633875 5045908
60993E045908M99530O09418P55042R42118J173751J469174J857467K344071K897446
$$ 5045908 5545438 6154856 6909898 7852016 9025767 10494941 12352408 14696479 17593925
60984A7593925L467531L978377M276109M131462L388792K162022Q48505j10346
$$ 17593925 21061456 25039833 29315942 33447404 36836196 38998218 39846723 39736377
60976C9736377n04989m07635m794N39812J045946J242026Q61982j28779j439726
$$ 39736377 39231388 38823753 38818959 39358771 40404717 41646743 42508725 42379946 40940220
60967D0940220k634471l414859l741643l734975l524168l194802k811470k428168
$$ 40940220 38305749 34890890 31149247 27414272 23890104 20695302 17883832 15455664
60959A5455664k073513j752405j467313j225194j025695q58571p16483o00309
$$ 15455664 13382151 11629746 10162433 8937239 7911544 7052973 6336490 5736181
60951E736181n09870m38679l80595l34096k97479k66353k38320k14562j94732
$$ 5736181 5226311 4787632 4407037 4072941 3775462 3509109 3270789 3056227 2861495
60942B861495j75317j54859j35962j20435j06957r5202q7679q5427q5764q6091
$$ 2861495 2686178 2531319 2395357 2274922 2167965 2072763 1985084 1899657 1813893 1727802
60932A727802q6311q6031q3253p7708p2007o7641o2995n6916n0954m6331m1874
$$ 1727802 1641491 1555460 1472207 1394499 1322492 1254851 1191856 1134940 1083986 1037655 995781
60921I95781l6867l3016l1495l0656k8613k5788k3163k0355j7206j5068j4635
$$ 995781 958914 925898 894403 863747 835134 809346 786183 765828 748622 733554 718919
60910G18919j4477j3273j1673j0587r526q035o826o163m986k988j642j842k355
$$ 718919 704442 691169 679496 668909 659383 651348 644522 638359 633373 630385 628743 626901 624546
60897F24546j957j264j151j184r07r63j642k053j937k406l711m215l055j868k262
$$ 624546 622589 621325 620174 618990 618083 617120 615478 613425 611488 609082 605371 601156 598101 596233 593971
60882E93971l316l317k412j838j960k642m166o220p302o693n799o056o864p058
$$ 593971 590655 587338 584926 583088 581128 578486 574320 568100 560798 554105 548306 542250 535386 528328
60868E28328o988p473p903p243n961n256n079m532l551k812k559k652l119l626
$$ 528328 521340 513867 505964 498721 492760 487504 482425 477893 474342 471530 468971 466319 463200 459574
60854D59574l259j902q54j038j561j149O0J266K427L673M349M035L654M227N327
$$ 459574 456315 454413 453559 452521 450960 449811 449871 451137 453564 457237 461586 465621 469275 473502 478829
60839D78829N965O134O182N618L936J922P33L00j33n43m70k06l47o71n61j06J97
$$ 478829 484794 490928 497110 502728 506664 508586 509319 509619 509486 508943 508473 508267 507920 507249 506688 506582 506779
60822E06779L50N61O38M84N14Q28Q39L74J60L93O0j357k773l288l739n099o610
$$ 506779 507129 507690 508328 508812 509326 510154 510993 511367 511527 511920 511980 510623 507850 504562 500823 495724 489114
60805D89114p116p091p562q052p506o446o186o473n924m502l617l875m431m559
$$ 489114 481998 474907 467345 459293 451787 445341 439155 432682 426758 422256 418639 414764 410333 405774
60791D05774m318l736k725j782j507j523j086m71m58q12p28m47q74j766j884r89
$$ 405774 401456 397720 394995 393213 391706 390183 389097 388626 388168 387356 386628 386181 385307 383541 381657 380668
60775C80668j80j17k66l6O11J739L375M762M939M166L669L933M412M885N785P004
$$ 380668 380488 380371 380105 380069 380680 382419 385794 390556 395495 399661 403330 407263 411675 416560 422345 429349
60759D29349P724P671P472P503P497P396P484P441O507M812L485L061K847K219
$$ 429349 437073 444744 452216 459719 467216 474612 482096 489537 496044 500856 504341 507402 510249 512468
60745E12468J489J156J232J650K373K795J941j97k442l873m743n553o149o230
$$ 512468 513957 515113 516345 517995 520368 523163 525104 524907 522465 518592 513849 508296 502147 495917
60731D95917o065o077o228o313o445o852p409p722p441o539n400m599m282m011
$$ 495917 489852 483775 477547 471234 464789 457937 450528 442806 435365 428826 423426 418827 414545 410534
60717D10534l564l407l837m146l466k126j184r06o54j18L90Q23J448K028K013
$$ 410534 406970 403563 399726 395580 392114 389988 388804 387898 387244 387126 387516 388339 389787 391815 393828
60702C93828J715K122L373M437M734M982N978P360Q175Q041P271O311N477M855
$$ 393828 395543 397665 401038 405475 410209 415191 421169 428529 436704 444745 452016 458327 463804 468659
60688D68659M252L439K474J409K9j561k488k202j651k210l602m170l274k011j262
$$ 468659 472911 476350 478824 480233 480262 478701 476213 474011 472360 470150 466548 462378 459104 457093 455831
60673D55831m75R22K241K591K288K210K505K846L423M695O470P938Q486P977O595
$$ 455831 455356 456278 458519 461110 463398 465608 468113 470959 474382 479077 485547 493485 501971 509948 516543
60658E16543M915L830L877M798O044P444R054J0759J2357J3787J4994J5913J6851
$$ 516543 521458 525288 529165 533963 540007 547451 556505 567264 579621 593408 608402 624315 641166
60645F41166J8429K0722K2783K3514K2829K1618K0615J9650J7996J5351J2352
$$ 641166 659595 680317 703100 726614 749443 771061 791676 811326 829322 844673 857025
60634H57025J0017Q545O972M288O12l107o259q848j0863j2176j2999j3698j4101
$$ 857025 867042 875587 882559 886847 887459 884352 878093 869245 858382 846206 833207 819509 805408
60621H05408j3752j2906j2411j2494j2411j1631j0546r729r179q743q580q739
$$ 805408 791656 778750 766339 753845 741434 729803 719257 709528 700349 691606 683026 674287
60609F74287q803q474q064q032q357q727q919q757q121p233o504n916n112m296
$$ 674287 665484 657010 648946 640914 632557 623830 614911 606154 598033 590800 584296 578380 573268 568972
60595E68972m329n523o985p726p786p737p576o876n713m640l864l046j991j022
$$ 568972 564643 559120 552135 544409 536623 528886 521310 514434 508721 504081 500217 497171 495180 494158
60581D94158n37m52k65M25J442K097J901J227J022J785L100M233M981N743O992
$$ 494158 493621 493169 492904 493329 494771 496868 498769 499996 501018 502803 505903 510136 515117 520860 527852
60566E27852Q827J0978J3156J5460J8226K1454K4639K7400K9771L1416L1035K7482
$$ 527852 536679 547657 560813 576273 594499 615953 640592 667992 697763 729179 760214 787696
60554G87696K1260J4088P012j04p177j3087j6739j8132j7852j6158j3157r339
$$ 787696 808956 823044 830056 829952 822775 809688 792949 774817 756965 740807 727650 718311
60542G18311n289j115L454Q508J3874J9424K5213L1386L7863M3962M8395M9986
$$ 718311 713022 711907 715361 723869 737743 757167 782380 813766 851629 895591 943986 993972
60530I93972M8364M3686L6011K5569J3454J353r391j7845k2982k4168k2269j9278
$$ 993972 1042336 1086022 1122033 1147602 1161056 1162409 1153018 1135173 1112191 1088023 1065754 1046476
60518A046476j6522j4055j1791j0185r383q844q283q102q340q130o836m892k924
$$ 1046476 1029954 1015899 1004108 993923 984540 975696 967413 959311 950971 942841 936005 931113 928189
60505I28189q82J323L217M673O583R763J3833J8120K3038K9535L7741M7194N7981
$$ 928189 927307 928630 931847 936520 943103 952866 966699 984819 1007857 1037392 1075133 1122327 1180308
60492A180308P0405Q3660R6037J06515J15192J21963J25682J25004J19543J09910
$$ 1180308 1250713 1334373 1430410 1536925 1652117 1774080 1899762 2024766 2144309 2254219
60482B254219R6979Q1273O2734M1044J6385j0130l6914o2603q5990j05682j20315
$$ 2254219 2351198 2432471 2495205 2536249 2552634 2542504 2505590 2442987 2356997 2251315 2131000
60471B131000j29136j32091j29621j22836j13538j03485r3492q3635p4067o5227
$$ 2131000 2001864 1869773 1740152 1617316 1503778 1400293 1306801 1223166 1149099 1083872
60461A083872n7299n0070m3425l7659l3159k9971k7680k5675k3552k1470j9857
$$ 1083872 1026573 976503 933078 895419 862260 832289 804609 778934 755382 733912 714055
60450G14055j8680j7310j5341j3253j1875j1367j1088j0359r073p544o072m707
$$ 714055 695375 678065 662724 649471 637596 626229 615141 604782 595709 588165 582093 577386
60438E77386l362k096j123m57K36J177K074K573K898L403L700K964J142r40k779
$$ 577386 574024 571928 570805 570348 570584 571761 573835 576408 579306 582709 586409 589373 590515 589575 586796
60423E86796m623o522p822p990p226n891m096k227j015n84k68K03K24m23q53m56
$$ 586796 582173 575651 567829 559839 552613 546722 542626 540399 539384 538800 538532 538735 538959 538536 537683 537227
60407E37227L2k12p03o17l33o00q64L0J745K629K048J163J140J726K082K056K142
$$ 537227 537259 537047 536344 535727 535394 534794 533930 533960 535705 538334 540382 541545 542685 544411 546493 548549 550691
60390E50691K753L820M715M521K946R70JL75J229J783K002K060J960J822J921
$$ 550691 553444 557264 561979 566500 569446 570416 570417 570792 572021 573804 575806 577866 579826 581648 583569
60375E83569K160K090J614J222J368J984K721L303L623L846M353N294O307O992
$$ 583569 585729 587819 589433 590655 592023 594007 596728 600031 603654 607500 611853 617147 623454 630446
60361F30446P386P676P782P737P962Q632R132Q861Q143P553O812N430L961L435
$$ 630446 637832 645508 653290 661027 668989 677621 686753 695614 703757 711310 718122 723552 727513 730948
60347G30948L708L738L524M408P170J1070J5261J9887K5174L0480L5042L8701
$$ 730948 734656 738394 741918 746326 753496 764566 779827 799714 824888 855368 890410 929111
60335I29111M1088M0875L6945K9876K1357J2309K356q766j9940k9007l4251l5636
$$ 929111 970199 1011074 1048019 1077895 1099252 1111561 1113917 1105151 1085211 1056204 1021953 986317
60323I86317l4675l3025l1188k8741k5496k1916j8433j5096j2041r674q064o665
$$ 986317 951642 918617 887429 858688 833192 811276 792843 777747 765706 756032 747968 741303
60311G41303m890k634l6K764N389P287Q404R420J1102J3746J7457K2477K8954
$$ 741303 736413 733779 733743 736507 741896 749183 757587 767007 778109 791855 809312 831789 860743
60298H60743L6446M3642M8316M8110M2273L2623K1723J0046l799j9651l4041m2960
$$ 860743 897189 940831 989147 1037257 1079530 1112153 1133876 1143922 1140123 1120472 1086431 1043471
60286A043471m5415m3266l8369l1364k2727j3421m205M615J2397J8059K1000K1400
$$ 1043471 998056 954790 916421 885057 862330 848909 844704 849319 861716 879775 900775 922175
60274I22175J9373J4621P308j406j0221j8565k6038l1542l3876l3149l0886k8433
$$ 922175 941548 956169 963477 962071 951850 933285 907247 875705 841829 808680 777794 749361
60262G49361k5841k2612j9058j6187j4402j3029j1391r689q408p367o043m631
$$ 749361 723520 700908 681850 665663 651261 638232 626841 617152 608744 601377 595334 590703
60250E90703l927m121m407m037l231k651k459k291j872j287p72n25n74o60m11
$$ 590703 586776 582655 578248 574211 570980 568329 565870 563579 561707 560420 559648 559123 558549 557889 557478
60235E57478J52N16K63m03r02q50j66J044K485L740M661N509O491P274P351O764
$$ 557478 557630 558146 558409 558006 557104 556254 556088 557132 559617 563357 568018 573527 580018 587292 594643 601407
60219F01407O134N921N894N441M254K640J210L41q1l98p82j104j103o09L31J381
$$ 601407 607541 613462 619356 624797 629051 631691 632901 633242 633161 632763 631981 630877 629774 629165 629496 630877
60203F30877K121K424K520K526K189J392O46N90J134J565J451R77L89k44p08o83
$$ 630877 632998 635422 637942 640468 642657 644049 644695 645285 646419 647984 649435 650412 650801 650557 649849 649166
60187F49166k84J2J42N66J338J747J320O05M25P98J142J191J053O46k55j448k328
$$ 649166 648882 648894 649036 649602 650940 652687 654007 654612 655037 655835 656977 658168 659221 659867 659612 658164 655836
60170F55836k468j889q15M65J578K321K901L643M595N710P175R102J0976J1926
$$ 655836 653368 651479 650664 651129 652707 655028 657929 661572 666167 671877 679052 688154 699130 711056
60156G11056J1581J0282Q433O040L031l17l488o137q211r730j0528j0304r059
$$ 711056 722637 732919 741352 747392 750423 750106 746618 740481 732270 722540 712012 701708 692649
60143F92649p443o259n417l890j143J728L120K987L019M530P005R003R824R651
$$ 692649 685206 678947 673530 669640 668497 670225 673345 676332 679351 683881 690886 699889 709713 719364
60129G19364Q677O930M736K555K75k603n939q717j0084j0125r342p938o060m248
$$ 719364 728041 734971 739707 742262 742537 739934 733995 725278 715194 705069 695727 687789 681729 677481
60115F77481k958j908n29J084K305K992L608M318M736M815N181O195P328P942
$$ 677481 674523 672615 672086 673170 675475 678467 682075 686393 691129 695944 701125 707320 714648 722590
60101G22590Q188Q501Q803Q814Q720Q764Q530P464N833M317K883R68j222k668
$$ 722590 730778 739279 748082 756896 765616 774380 782910 790374 796207 800524 803407 804375 803153 800485
60087H00485k965k926l432m390n222n665n622m909l717k807k679k906k849k705
$$ 800485 797520 794594 791162 786772 781550 775885 770263 765354 761637 758830 756151 753245 750396 747691
60073G47691l194m355n324n397m905m831n684p000p892q087q097q325q288p164
$$ 747691 744497 740142 734818 729421 724516 719685 714001 707001 699109 691022 682925 674600 666312 659148
60059F59148m918k448p21k32j095k937m690n314n020n061o031p094p246o563n695
$$ 659148 654230 651782 651061 650829 649734 646797 642107 636793 631773 626712 620681 613587 606341 599778 594083
60044E94083m802l775k944k751k925k733j884o78N57J632K313K562K788L341L918
$$ 594083 589281 585506 582562 579811 576886 574153 572269 571591 572148 573780 576093 578655 581443 584784 588702
60029E88702M027L858M014M407M159K797R45l87q46p96p04p56r96j471k138k715
$$ 588702 592729 596587 600601 605008 609167 611964 612909 612522 611676 610880 610176 609420 608424 606953 604815 602100
60013F02100k833k466k094k185k586k784k733k842l084k795j719o02j60j9O41
$$ 602100 599267 596801 594707 592522 589936 587152 584419 581577 578493 575698 573979 573377 573217 573198 573839
59998E73839J764K581K949L647N227P228Q737R277Q960Q137P079N751L901J511
$$ 573839 575603 578184 581133 584780 590007 597235 605972 615249 624209 632346 639425 645176 649077 650588
59984F50588q52k470l155l268l165k916k509k014j600j580k196l139l632l404
$$ 650588 649736 647266 644111 640843 637678 634762 632253 630239 628639 627059 624863 621724 618092 614688
59970F14688l142l458l812l349k404k162k775l016k111q93n55j085j596j589j123
$$ 614688 611546 608088 604276 600927 598523 596361 593586 590570 588459 587566 587011 585926 584330 582741 581618
59955E81618k46Q74J538J108k4p88p99o71q97j127q92l45J81Q70K004L123L355
$$ 581618 581372 582246 583784 584892 584868 584080 583281 582610 581713 580586 579694 579349 579530 580400 582404 585527 588882
59938E88882K620J816J612J614J094Q6p94j219j372j502j768k384l263l675k928
$$ 588882 591502 593318 594930 596544 597638 597724 596930 595711 594339 592837 591069 588685 585422 581747 578819
59923E78819j399j68M32J073K046K595K151J404J340J845K110J971J908J907J393
$$ 578819 577420 577252 577684 578757 580803 583398 585549 586953 588293 590138 592248 594219 596127 598034 599427
59908E99427K93o52q65o40o72j312k394l360l543k799j879j721k291k670k267
$$ 599427 599720 599068 598203 597563 596891 595579 593185 589825 586282 583483 581604 579883 577592 574922 572655
59893E72655j418o49M7Q98J827K604L181L616L890M115M668N821P307Q471Q827
$$ 572655 571237 570588 570635 571533 573360 575964 579145 582761 586651 590766 595434 601255 608562 617033 625860
59878F25860Q456P886P603P537P101N913M336L116K523K161J530M22j130k976
$$ 625860 634316 642202 649805 657342 664443 670356 674692 677808 680331 682492 684022 684444 683314 680338
59864F80338m793o220p090p406p190o573n865n286m752m254m122m464m670m089
$$ 680338 675545 669325 662235 654829 647639 641066 635201 629915 625163 620909 616787 612323 607653 603564
59850F03564l084k649l032l407l055k169j280n78QN70J398K864M903P119R559
$$ 603564 600480 597831 594799 591392 588337 586168 584888 584310 584318 584888 586286 589150 594053 601172 610731
59835F10731J2762J6672K0014K1173J9356J4904R110M008J432J613L149M758O397
$$ 610731 623493 640165 660179 681352 700708 715612 724722 728730 730162 731775 734924 739682 746079
59822G46079Q023Q259N465j40o526j1950j6044j8955k0560k0898k0473j9603j8036
$$ 746079 754102 762361 767826 767686 761160 749210 733166 714211 693651 672753 652280 632677 614641
59809F14641j5657j3033j0750q711o665n058m638n283n872n546m587l837l574
$$ 614641 598984 585951 575201 566490 559825 554767 550129 544846 538974 533428 528841 525004 521430
59796E21430l362k848k243j982k172k558k839k845k547k089j700j433j143p96
$$ 521430 518068 515220 512977 510995 508823 506265 503426 500581 498034 495945 494245 492812 491669 490873
59782D90873o17o89o85l68j21m35j015j056n00k41p66j270p85L12O65l20j847
$$ 490873 490256 489567 488882 488514 488393 487958 486943 485887 485387 485146 484380 483110 482325 482637 483302 482982 481135
59765D81135k772k729j993q98K58J049J163Q30O79J096J835K340K374K206K196
$$ 481135 478363 475634 473641 472743 473001 474050 475213 476043 476722 477818 479653 481993 484367 486573 488769
59750D88769K368K588K911L536M326M756M469L695K908K304J804J446J416J720
$$ 488769 491137 493725 496636 500172 504498 509254 513723 517418 520326 522630 524434 525880 527296 529016
59736E29016K014J848J039j88j292j749j443p61j80J72M43O39M99j10q80j330
$$ 529016 531030 532878 533917 533729 532437 530688 529245 528484 528304 528476 528919 529558 530057 529947 529067 527737
59720E27737j348j305j568k017k210j921j340p26r8M96P48L93k53m68J10J111
$$ 527737 526389 525084 523516 521499 519289 517368 516028 515302 515204 515700 516448 516841 516588 516120 516230 517341
59704E17341J900K253K459K936L836M909N716O023O000O001O210O693P585Q901
$$ 517341 519241 521494 523953 526889 530725 535634 541350 547373 553373 559374 565584 572277 579862 588763
59690E88763J0150J0525R624P731N410L061R94m98j313j612j637j580j716k252
$$ 588763 598913 609438 619062 626793 632203 635264 636258 635760 634447 632835 631198 629618 627902 625650
59676F25650k895k995k373j686j639k078k273j911j389j178j330j684k194k819
$$ 625650 622755 619760 617387 615701 614062 611984 609711 607800 606411 605233 603903 602219 600025 597206
59662E97206l291l266k747k164j911j832j371l20P73J214J048J048J805L141M432
$$ 597206 593915 590649 587902 585738 583827 581995 580624 580304 581077 582291 583339 584387 586192 589333 593765
59647E93765N214N289M674L522J956o8k478m629n698n666n474n831o292n962m756
$$ 593765 598979 604268 608942 612464 614420 614352 611874 607245 601547 595881 590407 584576 578284 572322 567566
59632E67566l458k713k488k447k353k062j554j033p05m43Q1Q78J546J768J659
$$ 567566 564108 561395 558907 556460 554107 552045 550491 549458 548753 548310 548391 549269 550815 552583 554242
59617E54242J566J652J747J467M65j232l138m672n596o028o087n699m784l445
$$ 554242 555808 557460 559207 560674 561139 559907 556769 552097 546501 540473 534386 528687 523903 520458
59603E20458j988q33k58j53l6M71J253J840J894J404N93j72m95k62J47J88k08
$$ 520458 518470 517637 517379 517226 517190 517661 518914 520754 522648 524052 524645 524473 523978 523716 523863 524051 523843
59586E23843n21k19O09J278J138J91r52j753k340l173m213m771m435l711l381
$$ 523843 523322 523103 523712 524990 526128 526319 525367 523614 521274 518101 513888 509117 504682 500971 497590
59571D97590l483l418k954k524k440k368j934j425j391j681j472l36J083J773
$$ 497590 494107 490689 487735 485211 482771 480403 478469 477044 475653 473972 472500 472164 473247 475020
59557D75020J447O62Jm23o48n60j31L59P35J240K104K932L050K424J836J990K835
$$ 475020 476467 477129 477130 476707 476059 475499 475368 475727 476462 477702 479806 482738 485788 488212 490048 492038 494873
59540D94873L814M528N116O163Q215J1181J4402J7568K0967K4081K4424J9370
$$ 494873 498687 503215 508331 514494 522709 533890 548292 565860 586827 610908 635332 654702
59528F54702R551p55p415r823r950r227p630n140k403J27K523M580N651N591N036
$$ 654702 664253 663498 656083 646260 636310 627083 619453 614313 611910 612037 614560 619140 624791 630382 635418
59513F35418M455L608K260Q15k33r68j787k864m250o007p865r044q967q002p093
$$ 635418 639873 643481 645741 646556 646323 645355 643568 640704 636454 630447 622582 613538 604571 596569 589476
59498E89476o702o499o001n196m376l635k705j404n4O61L69n86j484j833j527
$$ 589476 582774 576275 570274 565078 560702 557067 554362 552958 552904 553565 553934 553348 551864 550031 548504
59483E48504n52J033K849M257M925N201N849P381R644J2025J4006J5512J6639
$$ 548504 547952 548985 551834 556091 561016 566217 572066 579447 589091 601116 615122 630634 647273
59470F47273J7094J6221J3643R658M925J11m027o715p781p862p537o563m503j720
$$ 647273 664367 680588 694231 703889 708814 708925 704898 698183 690402 682540 675003 668440 663937 662217
59456F62217R68L381N927Q519J0474J1707J3157J5604J8774K2040K5390K8954
$$ 662217 663185 666566 672493 681012 691486 703193 716350 731954 750728 772768 798158 827112
59444H27112L2030L3304L1955K7965K1473J2543J810r082j8071k3743k5899k5383
$$ 827112 859142 892446 924401 952366 973839 986382 988192 979110 961039 937296 911397 886014
59432H86014k3533k1643k0596k0694k1632k2623k2756k1565j9381j7000j4821
$$ 886014 862481 840838 820242 799548 777916 755293 732537 710972 691591 674591 659770
59421F59770j2370q974m834j022J857M466P715J1402J4724J7794K1545K6145L0773
$$ 659770 647400 638426 633592 632570 634427 638893 646608 658010 672734 690528 712073 738218 768991
59408G68991L5142L9395M1552L7126K3630M756j2061k2138k5946k5717k2417j6535
$$ 768991 804133 843528 885080 922206 945836 950592 938531 916393 890447 864730 842313 825778
59396H25778r150q93P993J4970J4782M493j1956k6559l4405l6258l4892l1717
$$ 825778 816628 815735 823728 838698 853480 857973 846017 819458 785053 748795 713903 682186
59384F82186k7517k3686k0998j8523j5260j1923r813q732p395n524m086l533l084
$$ 682186 654669 630983 609985 591462 576202 564279 554466 545734 538339 532815 528729 525196 522112
59371E22112k018p37J1J97L02N20P67J144J742K220K129J652J455J699J801J396
$$ 522112 520094 519357 519368 519565 519867 520387 521154 522298 524040 526260 528389 530041 531496 533195 534996 536392
59355E36392R83J155J726K190K704L806N335O533P361Q756J1193J3790J5445J6262
$$ 536392 537375 538530 540256 542446 545150 548956 554291 560824 568185 576941 588134 601924 617369 633631
59341F33631J7092J8172J8984J9301J9487J9739J9701J9021J7732J5912J3400
$$ 633631 650723 668895 687879 707180 726667 746406 766107 785128 802860 818772 832172
59330H32172J0139O472K937p3k367l970n219o594q289j0048j1435j2112j1880
$$ 832172 842311 848783 851720 851647 849280 845310 840091 833497 825208 815160 803725 791613 779733
59317G79733j0794r347q322q145q390q111o775m893l536l186l154k493j335p32
$$ 779733 768939 759592 751270 743125 734735 726624 719849 714956 711420 708234 705080 702587 701252 700520
59303G00520j136j708j507p33r5N24J810L651M985N179M763M632N177O345P923
$$ 700520 699384 697676 696169 695436 695341 695865 697675 701326 706311 711490 716253 720885 726062 732407 740330
59288G40330R448J0557J1673J3826J7422K1854K6413L0596L2867L0270K0870O589
$$ 740330 749778 760335 772008 785834 803256 825110 851523 882119 914986 945256 966126 972715
59276I72715p551j7279k1698k2327k0739j7605j3271q272l227J391N299Q359J0428
$$ 972715 965164 947885 926187 903860 883121 865516 852245 843973 840746 842137 847436 855795 866223
59263H66223J1356J1241J0524R589Q302O333L867J492o71l135o120r011j1117
$$ 866223 877579 888820 899344 908933 917235 923568 927435 928927 928256 925121 919001 909990 898873
59250H98873j2518j3617j4289j4122j3323j2596j2110j1286r865q500p812p411
$$ 898873 886355 872738 858449 844327 831004 818408 806298 795012 785147 776647 768835 761424
59238G61424o493n128m224m201m343l777k554j416p38k05N40J345J735J454O34
$$ 761424 754931 749803 745579 741378 737035 733258 730704 729288 728550 728345 728885 730230 731965 733419 734053
59223G34053m34j651l212n283p484q927r092q570q509r202r715r211q132p600
$$ 734053 733619 731968 728756 723473 715989 707062 697970 689400 680891 671689 661974 652763 644631 637031
59209F37031p891q155p595o290m813l620k996l042l388l364k801k279k211k138
$$ 637031 629140 620985 613390 607100 602287 598667 595671 592629 589241 585877 583076 580797 578586 576448
59195E76448j469m78Q1J27L53J223K413L317L586L248K768K896L867M872M965
$$ 576448 574979 574501 574582 574709 575062 576285 578698 582015 585601 588849 591617 594513 598380 603252 608217
59180F08217M410M295M837N119M709M421M883N462N401N156N587O445O803O556
$$ 608217 612627 616922 621759 626878 631587 636008 640891 646353 651754 656910 662497 668942 675745 682301
59166F82301O415O637O864P056P599Q470R206R731J0337J0837J0729J0107R516
$$ 682301 688716 695353 702217 709273 716872 725342 734548 744279 754616 765453 776182 786289 795805
59153G95805Q844P432N400L657K325M71k085m004m359m145m812o172p034p173
$$ 795805 804649 812081 817481 821138 823463 823934 821849 817845 813486 809341 804529 798357 791323 784150
59139G84150p341p717p718p248o890o796o448n667m864m122l013j621p86q57r27
$$ 784150 776809 769092 761374 754126 747236 740440 733992 728325 723461 719339 716326 714705 713919 713062 712135
59124G12135P9K060M029N362O228P079Q194R675J1469J3376J5124J6438J7037
$$ 712135 712214 714274 718303 723665 729893 736972 745166 754841 766310 779686 794810 811248 828285
59111H28285J6873J6355J6002J5754J5010J3493J1715J0262R057P805O753O390
$$ 828285 845158 861513 877515 893269 908279 921772 933487 943749 952806 960611 967364 973754
59099I73754O420N802M046J921M61l77j463l093m499m897m456l880l516l407l829
$$ 973754 980174 985976 990022 991943 992404 992027 990564 987471 982972 978075 973619 969739 966223 962816 958987
59084I58987n060o674p824q427r362j1197j3264j4511j4809j4915j5378j6000
$$ 958987 953927 947253 939429 931002 921640 910443 897179 882668 867859 852944 837566 821566
59072H21566j6273j5899j4996j4000j3284j2678j1629j0121q929q578q522p942
$$ 821566 805293 789394 774398 760398 747114 734436 722807 712686 703757 695179 686657 678715
59060F78715o944o207n727m914l815l259l517l776l357k658k369k404k281k041
$$ 678715 671771 665564 659837 654923 651108 647849 644332 640556 637199 634541 632172 629768 627487 625446
59046F25446k077k250j987j215n88o07r79j053n92J36Q46J461J941K178K243K473
$$ 625446 623369 621119 619132 617917 617329 616722 615743 614690 614098 614234 615080 616541 618482 620660 622903 625376
59030F25376L084L816M279M607N302O421P340P643P726Q182Q954R623J0154J0805
$$ 625376 628460 632276 636555 641162 646464 652885 660225 667868 675594 683776 692730 702353 712507 723312
59016G23312J1431J1561J1022R956Q327O092L730J928O45p25k221l120l053k535
$$ 723312 734743 746304 757326 767282 775609 781701 785431 787359 788004 787279 785058 781938 778885 776350
59002G76350k012j175K85J966L315M418N564O535O945O936O839O476N431L849
$$ 776350 774338 773163 773448 775414 778729 783147 788711 795246 802191 809127 815966 822442 827873 831722
58988H31722K218N67j474l752n476o214o525p309q887j0789j2193j2414j1322
$$ 831722 833940 834507 833033 829281 823805 817591 811066 803757 794870 784081 771888 759474 748152
58975G48152r447p543n999m723l521k224n14J951M968P710R539J0697J1888J3295
$$ 748152 738705 731162 725163 720440 716919 714695 714181 716132 721100 728810 738349 749046 760934 774229
58961G74229J4329J4372J3364J1533R006O002L197J263N7j248l066m991o658q434
$$ 774229 788558 802930 816294 827827 836833 842835 846032 847295 847352 846104 843038 838047 831389 822955
58947H22955j0684j2819j3831j3643j3095j2647j1840j0328q658p555o901n997
$$ 822955 812271 799452 785621 771978 758883 746236 734396 724068 715410 707855 700954 694957
58935F94957m649l521l361m173n111n243m410l359k888l062l431l758m101m351
$$ 694957 690308 686787 683426 679253 674142 668899 664489 661130 658242 655180 651749 647991 643890 639539
58921F39539m266l969l757l484k689j479n77l31l27j55J52O57J686L071L988M121
$$ 639539 635273 631304 627547 624063 621374 619895 619318 618987 618660 618505 618657 619314 621000 624071 628059 632180
58905F32180M286N242O594P584Q414R895J2135J4436J6264J7538J8118J7728J6443
$$ 632180 636466 641708 648302 655886 664300 674195 686330 700766 717030 734568 752686 770414 786857
58892G86857J4684J2773J0909R502R020R565J0975J3092J5649J8091J9960K1215
$$ 786857 801541 814314 825223 834725 843745 853310 864285 877377 893026 911117 931077 952292
58880I52292K1763K1108J8905J5585J1839P819L479o72l915o246q319j0500j2572
$$ 952292 974055 995163 1014068 1029653 1041492 1049311 1052790 1052118 1048203 1041957 1033638 1023138 1010566
58867A010566j4245j5371j5835j5665j5135j4321j2986j1352j0476j1007j2118
$$ 1010566 996321 980950 965115 949450 934315 919994 907008 895656 885180 874173 862055
58856H62055j2568j2459j2899j4170j5390j5911j5902j5555j4820j4106j4035
$$ 862055 849487 837028 824129 809959 794569 778658 762756 747201 732381 718275 704240
58845G04240j4271j3634j1769r708q461p953p736p731p776p309o180n032m392
$$ 704240 689969 676335 664566 654858 646397 638444 630708 622977 615201 607892 601712 596680 592288
58832E92288m001l508l072k851k630k431k744l555l928l235k107j503j377j038
$$ 592288 588287 584779 581707 578856 576226 573795 571051 567496 563568 560333 558226 556723 555346 554308
58818E54308l17L94R09J284J498J627K078K978L748L816L430L157K993K596K088
$$ 554308 553991 554385 555294 556578 558076 559703 561781 564759 568507 572323 575753 578910 581903 584499 586587
58803E86587J861J845J683J503J824K705L558L790L213J895J24j509k479k852
$$ 586587 588448 590293 591976 593479 595303 598008 601566 605356 608569 610464 610588 609079 606600 603748
58789F03748l066l251l059k182p37Q06J909K349K599L561N662Q267J0328J1403
$$ 603748 600682 597431 594372 592190 591453 592259 594168 596517 599116 602677 608339 616606 626934 638337
58775F38337J1757J1646J0900R264O815L938R44k165n421q305r873r812r114r009
$$ 638337 650094 661740 672640 681904 688719 692657 693601 691436 686015 677710 667837 658025 648911 639902
58761F39902r390r090p698o090m999m050k767j539r25p12m53k38k15P5J026K123
$$ 639902 630512 621422 613724 607634 602635 598585 595818 594279 593354 592642 592189 591951 591736 591811 592837 594960
58745E94960K635K779L377M628N979O972P548P814Q125Q979J0242J0903J0401
$$ 594960 597595 600374 603751 608379 614358 621330 628878 636692 644817 653796 664038 674941 685342
58732F85342R592R540R879R542Q628Q237Q548Q456P313N813M784M211L867L940
$$ 685342 694934 704474 714353 723895 732523 740760 749308 757764 765077 770890 775674 779885 783752 787692
58718G87692M507N106N414N803O774Q195R485J0181J0158R601Q890Q082O613M007
$$ 787692 792199 797305 802719 808522 815296 823491 832976 843157 853315 862916 871806 879888 886501 890508
58704H90508P96j970m178o724j0026j3327j5846j7778j9606k1113k1795k1725
$$ 890508 891304 889334 885156 878432 868406 855079 839233 821455 801849 780736 758941 737216
58692G37216k1338k0667j9454j7826j6233j4803j3240j1417r677q486p982p891
$$ 737216 715878 695211 675757 657931 641698 626895 613655 602238 592561 584075 576093 568202
58680E68202p716o994n643m151l314l579m512n022m277k441l75J314K671L920
$$ 568202 560486 553492 547849 543698 540384 536805 532293 527271 522994 520553 520178 521492 524163 528083
58666E28083N115O363P946R837J1529J2645J3302J3491J2558R887N791J250k897
$$ 528083 533198 539561 547507 557344 568873 581518 594820 608311 620869 630756 636547 637797 634900
58653F34900o013p517p406o642o223o075n584m830m424m327l895l085k611k803
$$ 634900 628887 621370 613964 607322 601099 595024 589440 584610 580186 575859 571964 568879 566268 563465
58639E63465l208l485l825m228m173l366k116q03M47J407J806J896K167K398J831
$$ 563465 560257 556772 552947 548719 544546 541180 539064 538261 538708 540115 541921 543817 545984 548382 550213
58624E50213O26J36J169K831L731L677L416L314L142K883K986L735M862N874O475
$$ 550213 550839 550975 552144 554975 558706 562383 565799 569113 572255 575138 578124 581859 586721 592595 599070
58609E99070O752O994P287P244O368M698K766R97m81j442j557j008n58p50j330
$$ 599070 605822 612816 620103 627347 633715 638413 641179 642176 641695 640253 638696 637688 637130 636380 635050
58594F35050j732j805j836k090k456k424j484K89K141L483M610O193Q253J0119
$$ 635050 633318 631513 629677 627587 625131 622707 621223 621512 623653 627136 631746 637939 646192 656311
58580F56311J1257J1555J1062J0092R326R102Q749P471N734M769M748M611L904
$$ 656311 667568 679123 690185 700277 709603 718705 727454 734925 740659 745428 750176 754787 758691
58567G58691L643M875P340J0129J2818J5369J7582J9253K0467K1261K1447K1028
$$ 758691 762334 767209 774549 784678 797496 812865 830447 849700 870167 891428 912875 933903
58555I33903K0293J9219J7321J4373J0720O679K274k214o044q724j0402j1370
$$ 933903 954196 973415 990736 1005109 1015829 1022508 1024782 1022568 1016524 1007800 997398 986028
58543I86028j1702j1580j1371j1218j1099j1289j2085j3137j3879j4578j5896
$$ 986028 974326 962746 951375 940157 929058 917769 905684 892547 878668 864090 848194
58532H48194j7440j7914j6961j5614j4624j3604j2258j1067j0079q407n783l471
$$ 848194 830754 812840 795879 780265 765641 752037 739779 728712 718633 710226 704443 700972
58520G00972k529k255j440k43L04Om80q00j086j293j302j254j108l32J237K729
$$ 700972 698443 696188 694748 694505 694809 694815 694335 693535 692449 691156 689854 688600 687492 687160 688397 691126
58504F91126L254L092L092L432L694L726L612L164K249J272O72J76p27j854k470
$$ 691126 694380 697472 700564 703996 707690 711416 715028 718192 720441 721713 722385 722561 721834 719980 717510
58489G17510k150j078K14J125J363J330J676K338K707K847L618N225O762P680
$$ 717510 715360 714282 714496 715621 716984 718314 719990 722328 725035 727882 731500 736725 743487 751167
58475G51167Q655J0248J1744J2181J1671J0778R391P196M538J923o90l292n212
$$ 751167 759822 770070 781814 793995 805666 816444 825835 833031 837569 839492 838802 835510 830298
58462H30298n985o189o560o862o439n328l978k493q65O05J822L214M961O524P467
$$ 830298 824313 818124 811564 804702 798263 792935 788957 786464 785599 786204 788026 791240 796201 802725 810192
58447H10192P902P684O218L678J261m42k119m041n101m657l868l921m147l358
$$ 810192 818094 825778 831996 835674 836935 836493 834374 830333 825232 820575 816707 812786 808639 805281
58433H05281j826n17O31K078L304L627L548L770L873L450L566N304P685Q950R177
$$ 805281 803455 802938 803569 805647 808951 812578 816126 819896 823769 827219 830785 836089 843774 852724 861901
58418H61901R743J0764J1002J0025Q654P463O458O031O686P868Q359P622N625
$$ 861901 871644 882408 893410 903435 912089 919552 926010 932041 938727 946595 954954 962576 968201
58405I68201K059k934p768j0717j1665j1415j0043p511m988l734l223k202r26
$$ 968201 970260 967326 959558 948841 937176 925761 915718 908207 903219 899485 896262 894060 893134
58392H93134m94n23L31J905K622J996J140Q37P89P64Q50O76j20q95q41l52q6N65
$$ 893134 892640 892117 892448 894353 896975 898971 900111 900948 901737 902501 903351 904027 903907 903012 902171 901819 901733 902298
58374I02298K357M296M901M740N550P284Q279Q079P797P894P845P951R225J1311
$$ 902298 904655 908951 913852 918592 924142 931426 939705 947784 955581 963475 971320 979271 988496 999807
58360I99807J2649J2808J2801J3044J2980J2714J2970J3382J2766J1149R706Q693
$$ 999807 1012456 1025264 1038065 1051109 1064089 1076803 1089773 1103155 1115921 1127070 1136776 1145469
58348A145469P355N795M930M691M211L773M570O587Q596J0107J1481J2399J2301
$$ 1145469 1152824 1158619 1163549 1168240 1172451 1176224 1180794 1187381 1195977 1206084 1217565 1229964 1242265
58335A242265J1962J2605J3812J4380J4677J5781J6958J6619J5294J4905J5482
$$ 1242265 1254227 1266832 1280644 1295024 1309701 1325482 1342440 1359059 1374353 1389258 1404740
58324A404740J5426J4685J4610J4932J4057J2291J1592J1980J1480R873R214J0158
$$ 1404740 1420166 1434851 1449461 1464393 1478450 1490741 1502333 1514313 1525793 1535666 1544880 1555038
58312A555038J0971J0789J0785J1449J1759J1678J2554J4368J5458J5549J6260
$$ 1555038 1566009 1576798 1587583 1599032 1610791 1622469 1635023 1649391 1664849 1680398 1696658
58301A696658J8007J9369J9904K0710K1714K1554K0582K0775K2167K2622K1783
$$ 1696658 1714665 1734034 1753938 1774648 1796362 1817916 1838498 1859273 1881440 1904062 1925845
58290A925845K1773K3317K4575K4744K5361K7041K8312K8733K9975L2596L4877
$$ 1925845 1947618 1970935 1995510 2020254 2045615 2072656 2100968 2129701 2159676 2192272 2227149
58279B227149L5947L7126L9171M1158M2785M4928M7295M8527M9014N0531N2918
$$ 2227149 2263096 2300222 2339393 2380551 2423336 2468264 2515559 2564086 2613100 2663631 2716549
58268B716549N4419N5373N7820O1414O3673O4488O6285O9493P2039P3605P6023
$$ 2716549 2770968 2826341 2884161 2945575 3009248 3073736 3140021 3209514 3281553 3355158 3431181
58257C431181P9201Q1138Q2237Q4946Q8931R1408R2420R4739R8396J00727J02059
$$ 3431181 3510382 3591520 3673757 3758703 3847634 3939042 4031462 4126201 4224597 4325324 4427383
58246D427383J05733J12067J18049J23301J30450J39314J46941J53650J62692
$$ 4427383 4533116 4645183 4763232 4886533 5016983 5156297 5303238 5456888 5619580
58237E619580J73644J82973J91217K02504K16803K30191K42934K59237K78864
$$ 5619580 5793224 5976197 6167414 6369918 6586721 6816912 7059846 7319083 7597947
58228G597947K97491L15615L38108L64714L90457M15841M46525M82558N18557
$$ 7597947 7895438 8211053 8549161 8913875 9304332 9720173 10166698 10649256 11167813
58219A1167813N55096N98642O49616P02509P58440Q25209R04257R90695J086640
$$ 11167813 11722909 12321551 12971167 13673676 14432116 15257325 16161582 17152277 18238917
58210A8238917J200577J333630J481578J650047J851436K088355K358662K675504
$$ 18238917 19439494 20773124 22254702 23904749 25756185 27844540 30203202 32878706
58202C2878706L062537L532696M095572M783202N644217O720243Q060727R753875
$$ 32878706 35941243 39473939 43569511 48352713 53996930 60717173 68777900 78531775
58194G8531775J1905216J4593731J7886700K1859654K6495935L1519812L6336610
$$ 78531775 90436991 105030722 122917422 144777076 171273011 202792823 239129433
58187B39129433M0049007M1398551L8836932L1185328J8722038L648162j0841010
$$ 239129433 279178440 320576991 359413923 390599251 409321289 412969451 402128441
58180D02128441k2214020k9538945l3157344l3879694l2549440k9956369k6734995
$$ 402128441 379914421 350375476 317218132 283338438 250788998 220832629 194097634
58173A94097634k3271091j9788925j6470401j3405408j0530511p760751n135326
$$ 194097634 170826543 151037618 134567217 121161809 110631298 102870547 97735221
58166I7735221k745810o51361R42790J522713N98965j678736m411484o585388
$$ 97735221 94989411 94338050 95280840 96803553 97402518 95723782 91312298 84726910
58158H4726910p749038q050480p811718p246454o492967n685707m916526m209419
$$ 84726910 76977872 68927392 61115674 53869220 47376253 41690546 36774020 32564601
58150C2564601l573691l033870k595024k229309j914656j652399j438995j254622
$$ 32564601 28990910 25957040 23362016 21132707 19218051 17565652 16126657 14872035
58142A4872035j089229r51851q46075p59637o84013o23194n78124n40659n06461
$$ 14872035 13782806 12830955 11984880 11225243 10541230 9918036 9339912 8799253 8292792
58133H292792m77708m51109m18531l80800l46517l16891k85393k52076k24285
$$ 8292792 7815084 7363975 6945444 6564644 6218127 5901236 5615843 5363767 5139482
58124E139482k03184j83144j64858j55947j57398j61064j61710j60919j58652
$$ 5139482 4936298 4753154 4588296 4432349 4274951 4113887 3952177 3791258 3632606
58115C632606j51564j40710j31356j24281j15777j06157r9655r6038r0775q3446
$$ 3632606 3481042 3340332 3208976 3084695 2968918 2862761 2763106 2667068 2576293 2492847
58105B492847p7907p4433o9696o4125o1376o0843n8334n3924n1614n1451m9487
$$ 2492847 2414940 2340507 2270811 2206686 2145310 2084467 2026133 1972209 1920595 1869144 1819657
58094A819657m5441m3028m2611m0612l6531l3756l3060l1688k9266k8383k8972
$$ 1819657 1774216 1731188 1688577 1647965 1611434 1577678 1544618 1512930 1483664 1455281 1426309
58083A426309k8082k5562k4302k4591k3838k1971k1692k3151k3717k3163k3784
$$ 1426309 1398227 1372665 1348363 1323772 1299934 1277963 1256271 1233120 1209403 1186240 1162456
58072A162456k5354k5151k3179k2205k2481k1428j8777j7061j6736j5612j3425
$$ 1162456 1137102 1111951 1088772 1066567 1044086 1022658 1003881 986820 970084 954472 941047
58061I41047j2334j2605j2303j1425j1847j3145j2972j1677j1887j3378j3136
$$ 941047 928713 916108 903805 892380 880533 867388 854416 842739 830852 817474 804338
58050H04338j0804r346r761r790q683q562r995j0497q809o840o077n609m847m917
$$ 804338 793534 784188 774427 764637 755954 747392 737397 726900 718091 711251 705174 699565 694718 689801
58036F89801o174p300p747q336q994q728q219r342j1789j3135j2610j1825j1511
$$ 689801 683627 676327 668580 660244 651250 642522 634303 624961 613172 600037 587427 575602 564091
58023E64091j0629r068q146q036p531o652o601o987o098m155l308m068m688m330
$$ 564091 553462 544394 536248 528212 520681 514029 507428 500441 494343 490188 486880 482812 478124 473794
58009D73794l909l609k515j039p17j305j000K44N90j91j52J350K679K958L222
$$ 473794 469885 466276 463761 462722 462005 460700 459700 459944 460534 460343 460191 461541 464220 467178 470400
57994D70400L910M015L411L311L756L239J507K62M59J152J522J739J529K32j450
$$ 470400 474310 478325 481736 485047 488803 492042 493549 493811 494270 495422 496944 498683 500212 500444 498994
57979D98994k033j678j739k021j215R0j71j992l234l355m015n572o227n439m959
$$ 498994 496961 495283 493544 491523 490308 490398 490227 488235 485001 481646 477631 472059 465832 460393 455434
57964D55434n497n476m261l625m548n359m598l356l155l688m089m464m808m267
$$ 455434 449937 444461 440200 436575 432027 426668 422070 418714 415559 411871 407782 403318 398510 394243
57950C94243k837k039k654l357k807j529o85l13J56Q58J699K653L315L302L151
$$ 394243 391406 389367 386713 383356 380549 379020 378335 378022 378178 379036 380735 383388 386703 390005 393156
57935C93156L704M664N190N531O364O954O095M514M018M430L899K286J511K270
$$ 393156 396860 401524 406714 412245 418609 425563 431658 436172 440190 444620 448519 450805 452316 454586
57921D54586L114L206L365L768L288J811P02K81p45k606l811m001m795o821q466
$$ 454586 457700 460906 464271 468039 471327 473138 473840 474121 473376 470770 466959 462958 458163 451342 442876
57906D42876q705q752r575j0197r796r345r756j0356j0491j0678j1021j0416q573
$$ 442876 434171 425419 415844 405647 395851 386506 376750 366394 355903 345225 334204 323788 315215
57893C15215o926o414o151n339m506l891k658q44P9k70k56R25J776J339J198K827
$$ 315215 308289 301875 295724 290385 285879 281988 279330 278486 278565 278295 278039 278964 280740 282079 283277 286104
57877B86104N017N807N303M722M228L570L373M051M637M281L655L430K818J145
$$ 286104 291121 296928 302231 306953 311181 314751 318124 322175 326812 331093 334748 338178 340996 342141
57863C42141m76p52k74m06j192j835k201k411j983p81J85J53j70Q4N68P53J060
$$ 342141 341665 340913 340639 340233 339041 337206 335005 332594 330611 329830 330015 330168 329998 330082 330650 331403 332463
57846C32463J788K247K208K838M715O364O289N352N293O016O110N229M194L288
$$ 332463 334251 336498 338706 341544 346259 352623 358912 364264 369557 375573 381683 386912 391106 394394
57832C94394K144Q61j12r69k264l950n565o836p472p089o125n779o175n733l445
$$ 394394 396538 397399 397287 396318 394054 390104 384539 377703 370231 363142 357017 351238 345063 339330 335885
57817C35885o83N20J20l13J55J197K282L114L471L460L520L580K943J604O69P17
$$ 335885 335202 335722 335842 335529 335684 336881 339163 342277 345748 349208 352728 356308 359251 360855 361524 362241
57801C62241P54l10k162l996n835p897r531j0038r758r406r008q347p646o998
$$ 362241 362995 362685 360523 356527 350692 342795 333264 323226 313468 304062 295054 286707 279061 272063
57787B72063n999m754m274m997n899n952n401m752l708k145r72q42r89m92L34
$$ 272063 266064 261310 257036 252039 246140 240188 234787 230035 226327 224182 223210 222368 221379 220887 221221
57772B21221Q85J456K298K699K275K141L269M726N103M755M977N655N550M495
$$ 221221 222106 223562 225860 228559 230834 232975 236244 240970 246073 250828 255805 261460 267010 271505
57758B71505L539L058K271P49q52j774j975j869j850k108k493k734k988l574m098
$$ 271505 275044 278102 280373 281122 280270 278496 276521 274652 272802 270694 268201 265467 262479 258905 254807
57743B54807l698k566k020k564l012k312j075m65n48q04j122j403j123k80K13
$$ 254807 251109 248543 246523 243959 240947 238635 237560 237095 236547 235743 234621 233218 232095 231815 232028
57728B32028M3K74J582K881K975K497K798L774M300M090L783L648L408K943K201
$$ 232028 232071 232345 233927 236808 239783 242280 245078 248852 253152 257242 261025 264673 268081 271024 273225
57713B73225R55n73j511j509j283j281r48j06K31m94j110m60P89J350J276J324
$$ 273225 274180 273607 272096 270587 269304 268023 267075 266969 267200 266706 265596 265136 265925 267275 268551 269875
57697B69875J487J641K549M624O667P335P030O704N867L550M19j935l239m328
$$ 269875 271362 273003 275552 280176 286843 294178 301208 307912 313779 317329 317748 315813 312574 308246
57683C08246n271n466n104m820m224k432K88K938N501Q791J2954J7630K3254L0731
$$ 308246 302975 297509 292405 287585 283361 280929 281217 284155 289656 298447 311401 329031 352285 383016
57669C83016M0150N1093O3767P8253R2779J03617J06239R6100P0444L1978j0046
$$ 383016 423166 474259 538026 616279 709058 812675 918914 1015014 1085458 1117436 1107390
57658A107390m5066o8065q0236q4285q1718p4300o4995n6153m8263m1055l4566
$$ 1107390 1062324 994259 914023 829738 748020 673720 608725 552572 504309 463254 428688
57647D28688k8830k3842j9962j7316j4920j1776q487o378n334m160k833k454k961
$$ 428688 399858 376016 356054 338738 323818 312042 303555 297177 291843 287683 284850 282396 279435
57634B79435k852j549k26J46M6J65M21O10Q39Q73K52o53r23o00p14j638k626l145
$$ 279435 276583 275034 274808 274954 275000 275165 275586 276196 277035 277908 278160 277507 276584 275984 275270 273632 271006 267861
57616B67861l362l150k054n29J80k18o45l77Q3J85J94L66L77O4k24l96p91j313
$$ 267861 264499 261349 259295 258766 258946 258728 258083 257706 257789 257974 258168 258534 258911 258975 258751 258355 257564 256251
57598B56251j291n85P9J28l27j112k240l351l783l489l077k865k658k435k410
$$ 256251 254960 254375 254454 254582 254255 253143 250903 247552 243769 240280 237203 234338 231680 229245 226835
57583B26835k418k121j815k126k936l464l322k719j867j065r78j765k355j803
$$ 226835 224417 222296 220481 218355 215419 211955 208633 205914 204047 202982 202004 200239 197884 196081
57569A96081q88j010j927k178j523j187j719k325k476k577k765k577k040j668
$$ 196081 195193 194183 192256 190078 188555 187368 185649 183324 180848 178271 175506 172929 170889 169221
57555A69221j238j01J180J260K73p0Q71J818J856J761K246K597K113J396J201
$$ 169221 167983 167882 169062 170322 170595 170525 171396 173214 175070 176831 179077 181674 183787 185183 186384
57540A86384J261J211J447K143K528K106J550J449J283N46j43j13J31k53j044
$$ 186384 187645 188856 190303 192446 194974 197080 198630 200079 201362 201908 201765 201652 201783 201530 200486
57525B00486j422j193p48l64k63p17j471j696j107m29k21RQ41J933K635K916K953
$$ 200486 199064 197871 197123 196759 196496 195779 194308 192612 191505 191076 190855 190864 191705 193638 196273 199189 202142
57508B02142K535J665J112J529K435K836K398J535O91J87K70P78J075P72K13p1
$$ 202142 204677 206342 207454 208983 211418 214254 216652 218187 218878 219065 219335 220113 221188 221960 222173 222102
57492B22102K2L00N94N94M1o62o96NM59o7j047j493j181o13k12k4J06M30R89J290
$$ 222102 222124 222424 223018 223612 223653 222991 222295 222300 222759 222692 221645 220152 218971 218358 218146 218122 218228 218658 219647 220937
57472B20937P18n42j534j681j345j064q27m07J17N52Q62J066J173J381J891K498
$$ 220937 221655 221113 219579 217898 216553 215489 214662 214255 214372 214924 215786 216852 218025 219406 221297 223795
57456B23795K825K912L047L139K879K443K324K461K327J937J898K387K829K757
$$ 223795 226620 229532 232579 235718 238597 241040 243364 245825 248152 250089 251987 254374 257203 259960
57442B59960K364K007J781J664J534J154O46O93J580K425K266J522J302J644J772
$$ 259960 262324 264331 266112 267776 269310 270464 271110 271803 273383 275808 278074 279596 280898 282542 284314
57427B84314J773K428L474L664K818K216K524K818K285J484J215J416J811K562
$$ 284314 286087 288515 291989 295653 298471 300687 303211 306029 308314 309798 311013 312429 314240 316802
57413C16802L431L426K125M90k98j37M49J208J973K394K452K618L025L144K663
$$ 316802 320233 323659 325784 326274 325976 325839 326288 327496 329469 331863 334315 336933 339958 343102 345765
57398C45765K026J762J915K411L254M057M219L753L276L080L019L293M232N315
$$ 345765 347791 349553 351468 353879 357133 361190 365409 369162 372438 375518 378537 381830 386062 391377
57384C91377N585N121M878N001M681L839L460L838M046L579L157L305L529L501
$$ 391377 396962 402083 406961 411962 416643 420482 423942 427780 431826 435405 438562 441867 445396 448897
57370D48897L627L853L390K287J761K234K569K105J799K357K881K601K441L368
$$ 448897 452524 456377 459767 462054 463815 466049 468618 470723 472522 474879 477760 480361 482802 486170
57356D86170M532M617L937L738M226M789N331N999O297N849N379N666O217O164
$$ 486170 490702 495319 499256 502994 507220 512009 517340 523339 529636 535485 540864 546530 552747 558911
57342E58911N854O100O518O083N014M636N470O632P184P096O786O512O289N985
$$ 558911 564765 570865 577383 583466 588480 593116 598586 605218 612402 619498 626284 632796 639085 645070
57328F45070N543N360N932O917P238O585N965O210O777O744O216N906O061O574
$$ 645070 650613 655973 661905 668822 676060 682645 688610 694820 701597 708341 714557 720463 726524 733098
57314G33098P495Q619R181Q770Q042P789P943Q072Q186Q391Q471Q445Q809R565
$$ 733098 740593 749212 758393 767163 775205 782994 790937 799009 807195 815586 824057 832502 841311 850876
57300H50876R846R177Q305Q040Q179Q276Q539R118R458R252R104R369R348Q676
$$ 850876 860722 869899 878204 886244 894423 902699 911238 920356 929814 939066 948170 957539 966887 975563
57286I75563Q423R563J1240J1860J1201J0242R631R548J0334J1982J3482J3990
$$ 975563 983986 993549 1004789 1016649 1027850 1038092 1047723 1057271 1067605 1079587 1093069 1107059
57274A107059J4126J4923J6036J6305J5639J4988J4752J4523J4254J4415J5024
$$ 1107059 1121185 1136108 1152144 1168449 1184088 1199076 1213828 1228351 1242605 1257020 1272044
57263A272044J5509J5586J5474J5294J4917J4345J3756J3369J3518J4371J5230
$$ 1272044 1287553 1303139 1318613 1333907 1348824 1363169 1376925 1390294 1403812 1418183 1433413
57252A433413J4906J3304J1813J1579J2239J2967J3694J4482J4760J4267J3784
$$ 1433413 1448319 1461623 1473436 1485015 1497254 1510221 1523915 1538397 1553157 1567424 1581208
57241A581208J3931J4038J3381J2616J2793J3729J4538J5062J5571J5786J5439
$$ 1581208 1595139 1609177 1622558 1635174 1647967 1661696 1676234 1691296 1706867 1722653 1738092
57230A738092J5114J5387J5765J5615J5365J5646J6003J5758J5390J5677J6170
$$ 1738092 1753206 1768593 1784358 1799973 1815338 1830984 1846987 1862745 1878135 1893812 1909982
57219A909982J5922J5142J4725J4692J4487J4286J4607J5087J5004J4612J4692
$$ 1909982 1925904 1941046 1955771 1970463 1984950 1999236 2013843 2028930 2043934 2058546 2073238
57208B073238J5193J5498J5530J5415J4692J3166J1906J2032J3068J3766J3867
$$ 2073238 2088431 2103929 2119459 2134874 2149566 2162732 2174638 2186670 2199738 2213504 2227371
57197B227371J3735J3059J1514R957R322R001P991O900O949P690P670O976O941
$$ 2227371 2241106 2254165 2265679 2275636 2284958 2293959 2301950 2308850 2315799 2323489 2331159 2338135 2345076
57184B345076P620P746P045O611O810O852O587O862P796Q450Q456Q332Q034O916
$$ 2345076 2352696 2360442 2367487 2374098 2380908 2387760 2394347 2401209 2409005 2417455 2425911 2434243 2442277 2449193
57170B449193N340M628N079N602N649N823O277O190N415N066N716O410O203N534
$$ 2449193 2454533 2459161 2464240 2469842 2475491 2481314 2487591 2493781 2499196 2504262 2509978 2516388 2522591 2528125
57156B528125N409O092P190Q224Q788Q839R019R914J1135J1905J2285J2825J3312
$$ 2528125 2533534 2539626 2546816 2555040 2563828 2572667 2581686 2591600 2602735 2614640 2626925 2639750 2653062
57143B653062J3148J2614J2434J2261J1157R382Q173P729O981N414L581J764k80
$$ 2653062 2666210 2678824 2691258 2703519 2714676 2724058 2732231 2739960 2746941 2752355 2755936 2757700 2757420
57130B757420k156l063l372m289n622n633l556o55J801M160P282J1150J5196J8987
$$ 2757420 2755264 2752201 2748829 2744540 2738918 2733285 2729729 2729074 2730875 2735035 2742317 2753467 2768663 2787650
57116B787650K2069K4196K6073K8895L2920L7553M2897M9914N8988O9612Q1757
$$ 2787650 2809719 2833915 2859988 2888883 2921803 2959356 3002253 3052167 3111155 3180767 3262524
57105C262524R6210J13412J33357J56896J85811K21310K63882L14782L76293M50254
$$ 3262524 3358734 3472146 3605503 3762399 3948210 4169520 4433402 4748184 5124477 5574731
57095E574731N37676O39832P57910Q91070J036006J188440J343317J493471J630030
$$ 5574731 6112407 6752239 7510149 8401219 9437225 10625665 11968982 13462453 15092483
57086A5092483J744735J830747J881869J893517J863585J787348J649169J424258
$$ 15092483 16837218 18667965 20549834 22443351 24306936 26094284 27743453 29167711
57078B9167711J096119O76000K05181k62589o83325j034096j310224j515620j655230
$$ 29167711 30263830 30939830 31145011 30882422 30199097 29165001 27854777 26339157 24683927
57069B4683927j733594j756991j734313j675392j589508j485456j371588j254815
$$ 24683927 22950333 21193342 19459029 17783637 16194129 14708673 13337085 12082270
57061A2082270j139951j030124r27099q31374p43087o63076n92200n29879m74484
$$ 12082270 10942319 9912195 8985096 8153722 7410635 6747559 6155359 5625480 5150996
57052E150996m25089l81597l43379l09290k78977k52663k29658k08733j89912
$$ 5150996 4725907 4344310 4000931 3691641 3412664 3160001 2930343 2721610 2531698
57043B531698j74062j60722j48205j35965j24940j15360j06275r7535r0012q3520
$$ 2531698 2357636 2196914 2048709 1912744 1787804 1672444 1566169 1468634 1378622 1295102
57033A295102p6717o9505o3227n7981n2264m5933m0918l8003l5386l1498k6814
$$ 1295102 1218385 1148880 1085653 1027672 975408 929475 888557 850554 815168 783670 756856
57022G56856k1889j6212j0163n243r56N761J6587L0204M6005O6010R1344J20576
$$ 756856 734967 718755 708592 703349 702393 708154 724741 754945 800950 866960 958304 1078880
57010A078880J53065J87880K14788K12345J64528P9715j2855q6356j32325j55657
$$ 1078880 1231945 1419825 1634613 1846958 2011486 2091201 2078346 1991990 1859665 1704008
57000A704008j62553j57072j43757j27473j10987r5224q0991o8858n8466m9448
$$ 1704008 1541455 1384383 1240626 1113153 1002166 906942 825951 757093 698627 649179
56990F49179m2120l6328l0775k4520j8152j2660q195m814l345m486p704j1754
$$ 649179 607059 570731 539956 515436 497284 484624 476429 471615 468270 463784 456080 444326
56978D44326j5684j8814k0541k0771k0024j8727j6996j5228j4008j3090j1349
$$ 444326 428642 409828 389287 368516 348492 329765 312769 297541 283533 270443 259094
56967B59094q333n077k864j704n75J338M093P243J0246J2771J4798J6115J5778
$$ 259094 250761 245684 242820 241116 240541 241879 245972 253215 263461 276232 291030 307145 322923
56954C22923J2710P029L54n484r668j2302j3620j3759j3004j1810j0485q974p074
$$ 322923 335633 342662 343016 337532 327864 315562 301942 288183 275179 263369 252884 243910 236836
56941B36836m835k666r07O18K410M809P939J1895J6503K0900K3962K5067K3933
$$ 236836 232001 229335 228428 229046 231456 236265 244204 256099 272602 293502 317464 342531 366464
56928C66464J9967J2774L505n395j2140j6666j9542k0889k0773j9760j8381j6750
$$ 366464 386431 399205 402710 397315 385175 368509 348967 328078 307305 287545 269164 252414
56916B52414j5040j3601j2224j0310q187p116p400p634o655n120m195l734k926
$$ 252414 237374 223773 211549 201239 193052 185936 178536 170902 164247 159127 154932 151198 148272
56903A48272j815r87l37O11J687K391K807L236L456L313L488M742O753Q676J0404
$$ 148272 146457 145470 145133 145744 147431 149822 152629 155865 159321 162634 166122 170864 177617 186293 196697
56888A96697J2377J4523J6205J6935J6378J4210J0576O283J939k495o741r729
$$ 196697 209074 223597 239802 256737 273115 287325 297901 304184 306123 303628 296887 287158
56876B87158j0816j0618r836q211n566k836q36J080L886P298J0597J4223J9025
$$ 287158 276342 265724 255888 247677 242111 239275 238439 239519 243405 250703 261300 275523 294548
56863B94548K4554K9681L4362L9138M3090M3760L9232K9436J5843J126j1442j9751
$$ 294548 319102 348783 383145 422283 465373 509133 548365 577801 593644 594770 583328 563577
56851E63577k4161k6205k6503k4995k2395j9675j6435j1460m927J522P016J2398
$$ 563577 539416 513211 486708 461713 439318 419643 403208 391748 386821 388343 395359 407757
56839D07757J8771K6381L5143M4994N5266O4481P0811P2116O5923N0966K9052
$$ 407757 426528 452909 488052 533046 588312 652793 723604 795720 861643 912609 941661
56828I41661M574j8166l6587m9395n6118n7450n5092n0627m4917l8467l1669k4707
$$ 941661 946235 928069 891482 842087 785969 728519 673427 622800 577883 539416 507747 483040
56816D83040j7823j1506n792K93P758J6413K5300L3935M2048M8349N0624M7132
$$ 483040 465217 453711 447919 448212 455970 472383 497683 531618 573666 622015 672639 719771
56804G19771L7400K2161L563j4936l0084m0555m6629m8772m7430m3696l8868l3451
$$ 719771 757171 779332 782895 767959 737875 697320 650691 601919 554489 510793 471925 438474
56792D38474k7509k1736j7037j3235r350n021o61L642Q290J3318J8188K2275K4676
$$ 438474 410965 389229 372192 358957 349607 344586 343925 347567 355857 369175 387363 409638 434314
56779D34314K3983J9369J1677K501p345j7297k5673l0504l1625l0620k8751k6271
$$ 434314 458297 477666 489343 491844 484499 467202 441529 411025 379400 348780 320029 293758
56767B93758k3572k1329j9363j6817j3740j1191r594q269o910o119o094n990n226
$$ 293758 270186 248857 229494 212677 198937 187746 178152 169883 162973 156854 150760 144770 139544
56754A39544m358m098m258m211l740k981k095j328r42r11j007j155j315j231q79
$$ 139544 135186 131088 126830 122619 118879 115898 113803 112475 111533 110622 109615 108460 107145 105914 105035
56739A05035p57j176j586j376q44n82m13R3N85M88J18O0l0p41j439j021J75P15
$$ 105035 104278 103102 101516 100140 99296 98714 98301 98394 98979 99467 99585 99645 99615 98874 97435 96414 96589 97304
56721I7304K77k7L55O15O5q35j279r97o1J218K142K204J824J680J562Q61m9j79
$$ 97304 97581 97554 97909 98524 98589 97754 96475 95478 95417 96635 98777 100981 102805 104485 106047 106908 106859 106680
56703A06680N30J184J356J296R90K58l48o4O98P73Mo40o46l57K2N69Q82N41J97
$$ 106680 107210 108394 109750 111046 112036 112294 111946 111882 112580 113353 113357 112717 112071 111714 111736 112305 113187 113728 113925
56684A13925P99J895K138J390P60O47L89j30j81L27O12M40L53L83R7p6P51K114
$$ 113925 114724 116619 118757 120147 120907 121554 121943 121813 121632 121959 122571 123011 123364 123747 123844 123768 124519 126633
56666A26633K526J807J365J918K664L018L351L618L096J940J293J336J030K28
$$ 126633 129159 130966 132331 134249 136913 139931 143282 146900 149996 151936 153229 154565 155595 155823
56652A55823J62J128J639P63m96j043j236j618j764j469j571k532l479l631l393
$$ 155823 155985 157113 158752 159515 159019 157976 156740 155122 153358 151889 150318 147786 144307 140676 137283
56637A37283l193k618j603j079j467j810j388q47q02o78L1O90Q50J291K563L685
$$ 137283 134090 131472 129869 128790 127323 125513 124125 123278 122476 121798 121829 122519 123369 124660 127223 130908
56621A30908L575K758K359K404K280K023J898J566P92K37M27O45L7q85r74k01
$$ 130908 134483 137241 139600 142004 144284 146307 148205 149771 150563 150800 151227 151872 151909 151024 150050 149849
56605A49849M13K56l36p54o36K0P93J135R82O14n4j276k527k801k103j461j238
$$ 149849 150262 150518 150182 149428 148792 148812 149605 150740 151722 152336 152282 151006 148479 145678 143575 142114 140876
56588A40876o55M87J069L28q28j126n30J89O42Q79R51J057J452J890J890J689
$$ 140876 140221 140708 141777 142105 141277 140151 139621 139810 140452 141331 142282 143339 144791 146681 148571 150260
56572A50260J962K526K564K188K378L103L162K292J805K498L577M357N370O953
$$ 150260 152222 154748 157312 159500 161878 164981 168143 170435 172240 174738 178315 182672 188042 194995
56558A94995Q384R293J0378J1618J1468R060N818L583K431J616J298J868K591
$$ 194995 203379 212672 223050 234668 246136 255196 261014 264597 267028 268644 269942 271810 274401
56545B74401K442J569P69K78oL3J68l37j472k119j803j653k646m092m889n158
$$ 274401 276843 278412 279181 279459 279453 279486 279654 279317 277845 275726 273923 272270 269624 265532 260643 255485
56529B55485n523n828n680n298m916m256l461l391m103m333l436k534k692l352
$$ 255485 249962 244134 238454 233156 228240 223984 220523 217132 213029 208696 205260 202726 200034 196682
56515A96682l600l628l686l154j919j260j853k338j472l16m76j464j761j431j549
$$ 196682 193082 189454 185768 182614 180695 179435 177582 175244 173772 173456 172980 171516 169755 168324 166775
56500A66775j914j384j11N95L95K00M76P71Q24Q64Q98O95L46O6k30m72k48L60
$$ 166775 164861 163477 163366 163961 164356 164556 165032 165803 166627 167491 168389 169084 169430 169496 169266 168794 168546 168906
56482A68906N47J70K27J188J952J577Q04O80Q22M12j94k52o2k33m45k03Q3N8M01
$$ 168906 169453 169623 169850 171038 172990 174567 175371 176051 176873 177285 177091 176839 176777 176544 176099 175896 175979 176037 176438
56463A76438J540K506K475K244K739L283K986K622L251M140M007L327L311L522
$$ 176438 177978 180484 182959 185203 187942 191225 194211 196833 200084 204224 208231 211558 214869 218391
56449B18391K701J209N20P11O81L44N45J018O27n06j075q13p58j234j372q51m85
$$ 218391 221092 222301 222821 223532 224213 224557 225102 226120 226747 226241 225166 224353 223595 222361 220989 220138 219653
56432B19653p79j235j357j255j116j008j102j296j040l63l57j600k926l014k339
$$ 219653 218874 217639 216282 215027 213911 212903 211801 210505 209465 209102 208745 207145 204219 201205 198866
56417A98866k092k036j219n7J91k93j41Q54J420R08J27n7L78J099J752J870J406
$$ 198866 196774 194738 193519 193462 193653 193360 193219 194073 195493 196401 196528 196471 196849 197948 199700 201570 202976
56400B02976J111J447J706J225O53P87J077O94K83R17K006K085J186O45Q83J141
$$ 202976 204087 205534 207240 208465 209118 209905 210982 211676 211959 212876 214882 216967 218153 218798 219681 220822
56384B20822J185J515K067K249K163K429K947L176L259L570L690L120K476K483
$$ 220822 222007 223522 225589 227838 230001 232430 235377 238553 241812 245382 249072 252192 254668 257151
56370B57151K473J462R2k44L51O58M46L49J30r64k400k835k214j690j555j051
$$ 257151 259624 261086 261178 260934 261285 261943 262389 262738 262868 261904 259504 256669 254455 252765 251210 250159
56354B50159j20M24L13k7n65j419j869j239l23k99p44m50K87K12m28j17J371K620
$$ 250159 250039 250463 250776 250749 250184 248765 246896 245657 245334 245035 244291 243841 244128 244340 243912 243795 245166 247786
56336B47786K831K545K130J386O99Q62J592J814J452J433K007K563K964L481L674
$$ 247786 250617 253162 255292 256678 257377 258239 259831 261645 263097 264530 266537 269100 272064 275545 279219
56321B79219K904J774J473J923K115J952K146K639K751K511K282J606J06j076
$$ 279219 282123 283897 285370 287293 289408 291360 293506 296145 298896 301407 303689 305295 305401 304325
56307C04325o97M34O21j2o5O02J058J488K711M042M080L371L702M933N078L559
$$ 304325 303628 304062 304683 304671 304606 305208 306266 307754 310465 314507 318587 321958 325660 330593 335671 339230
56291C39230J881R12n1j257j852j649j468j416p13N82J539J987K408K442J524
$$ 339230 341111 342023 341972 340715 338863 337214 335746 334330 333617 334199 335738 337725 340133 342575 344099
56276C44099O33J228K741L383L036L066L660L896M041N007N917N071L180K655
$$ 344099 344732 345960 348701 352084 355120 358186 361846 365742 369783 374790 380707 385778 388958 391613
56262C91613L818M833N297O599Q545R141Q225Q013R323J0524J1026J2402J5043
$$ 391613 395431 400264 405561 412160 420705 429846 438071 446084 455407 465931 476957 489359 504402
56249E04402J6952J7298J8141K1052K4768K7687L0199L3053L5718L7876M0310
$$ 504402 521354 538652 556793 577845 602613 630300 660499 693552 729270 767146 807456
56238H07456M3041M4663M4694M4492M4701M3899M0921L6389L0957K4214J6416
$$ 807456 850497 895160 939854 984346 1029047 1072946 1113867 1150256 1181213 1205427 1221843
56227A221843R143L089k874r385j5414k0199k4310k7862k9879l0414l1144l2832
$$ 1221843 1230986 1234075 1231201 1221816 1206402 1186203 1161893 1134031 1104152 1073738 1042594 1009762
56215A009762l4174l4090l3091l1614k9139k5901k3343k1965k0735j9339j8775
$$ 1009762 975588 941498 908407 876793 847654 821753 798410 776445 755710 736371 717596
56204G17596j8965j8216j5983j3892j2968j2153j0517q790p634o539n371m925
$$ 717596 698631 680415 664432 650540 637572 625419 614902 606112 598478 591939 586568 581643
56192E81643n127m718l414k307j675o89L48P0j105j039N90J635J104N29R01J147
$$ 581643 576516 571798 568384 566077 564402 563713 564061 564131 563026 561987 562577 564212 565316 565845 566746 567893
56176E67893O86N79J048P22n98j180m42N2l21j18J124J751J075O22J145J375J001
$$ 567893 568579 569158 570206 570928 570330 569150 568708 568760 568439 568321 569445 571196 572271 572893 574038 575413 576414
56159E76414J706L912N572N585N415N992O104N319N328O915Q564R445J0712J2595
$$ 576414 578120 582032 587604 593189 598604 604596 610700 616019 621347 628262 636826 646271 656983 669578
56145F69578J3485J3225J3807J5544J6143J4975J4466J5664J6516J6336J7866
$$ 669578 683063 696288 710095 725639 741782 756757 771223 786887 803403 819739 837605
56134H37605K2632K8349L3364L9777M9548O1302P3646Q7870J04381J19947J31342
$$ 837605 860237 888586 921950 961727 1011275 1072577 1146223 1234093 1338474 1458421 1589763
56123A589763J38363J40681J35558J22069J04357Q7604P3580O2671N6381N4414
$$ 1589763 1728126 1868807 2004365 2126434 2230791 2318395 2391975 2454646 2511027 2565441
56113B565441N2442M6308L6063K3556R510m230j3438j6234j6322j8588k4455l4127
$$ 2565441 2617883 2664191 2700254 2723810 2733320 2729090 2715652 2699418 2683096 2664508 2640053 2605926
56101B605926m9265o9617r0313j06297j16848j22766j22697j15875j05310r4395
$$ 2605926 2556661 2487044 2396731 2290434 2173586 2050820 1928123 1812248 1706938 1612543
56091A612543q3085p0633n8926m9612m1117l1982k4116j9225j5355j0459o102
$$ 1612543 1529458 1458825 1399899 1350287 1309170 1277188 1253072 1233847 1218492 1208033 1201931
56080A201931m036k451N54L230L727M035O345Q834R054Q376R065J0147J0033J0067
$$ 1201931 1197895 1195444 1195998 1199228 1202955 1206990 1213335 1222169 1231223 1239599 1248664 1258811 1268844 1278911
56066A278911J1534J2482J1396J0669J2533J5021J5799J6375J8552K0590K0871
$$ 1278911 1290445 1302927 1314323 1324992 1337525 1352546 1368345 1384720 1403272 1423862 1444733
56055A444733K1433K3663K4768K2821K1018K2215K3680K2175J9794J9694K0447
$$ 1444733 1466166 1489829 1514597 1537418 1558436 1580651 1604331 1626506 1646300 1665994 1686441
56044A686441J9835J9836K2386K4648K3987K3273K5710K8989L0171L1482L5306
$$ 1686441 1706276 1726112 1748498 1773146 1797133 1820406 1846116 1875105 1905276 1936758 1972064
56033A972064L8530L8211L7825M1213M5347M6066M5878M8723N2088N2029N1193
$$ 1972064 2010594 2048805 2086630 2127843 2173190 2219256 2265134 2313857 2365945 2417974 2469167
56022B469167N3837N7547N8001N7379N9884O3542O4734O6203P1927P8688Q1555
$$ 2469167 2523004 2580551 2638552 2695931 2755815 2819357 2884091 2950294 3022221 3100909 3182464
56011C182464Q3010Q7765R3360R5281R6489J02191J09876J14399J18028J25366
$$ 3182464 3265474 3353239 3446599 3541880 3638369 3740560 3850436 3964835 4082863 4208229
56001D208229J33478J37580J41414J50869J62498J69733J75362J86052J99665
$$ 4208229 4341707 4479287 4620701 4771570 4934068 5103801 5279163 5465215 5664880
55992E664880K10278K20533K36395K54836K69763K84735L06440L31222L52002
$$ 5664880 5875158 6095691 6332086 6586922 6856685 7141420 7447860 7779082 8131084
55983H131084L72688M01133M34152M64661M97092N39563N87834O34052O84038
$$ 8131084 8503772 8904905 9339057 9803718 10300810 10840373 11428207 12062259 12746297
55974A2746297P47907Q21502Q96508R80441J085702J208017J338514J487532J671790
$$ 12746297 13494204 14315706 15212214 16192655 17278357 18486374 19824888 21312420 22984210
55965B2984210J888381K129256K411086K761333L186768L689946M305473N084241
$$ 22984210 24872591 27001847 29412933 32174266 35361034 39050980 43356453 48440694
55957D8440694O057462P260781Q779465J0719793J3151281J6130438J9743156
$$ 48440694 54498156 61758937 70538402 81258195 94409476 110539914 130283070
55950A30283070K4010543K8715076L3345387L7123104L8921104L7255872L0850583
$$ 130283070 154293613 183008689 216354076 253477180 292398284 329654156 360504739
55943C60504739J9699661N653551q305158j9608529k7135038l1071238l2175087
$$ 360504739 380204400 385857951 377552793 357944264 330809226 299737988 267562901
55936B67562901l1265650k9089579k6270566k3238749k0247740j7461772j4985732
$$ 267562901 236297251 207207672 180937106 157698357 137450617 119988845 105003113
55929A05003113j2842784j0999299r425849q105585p001170o060633n254541m574696
$$ 105003113 92160329 81161030 71735181 63629596 56628426 50567793 45313252 40738556
55921D0738556m001916l506412l075099k709484k399844k126811j884562j678529
$$ 40738556 36736640 33230228 30155129 27445645 25045801 22918990 21034428 19355899
55913A9355899j503358j344976j201073j078833r75388q79771p91336p17725o57075
$$ 19355899 17852541 16507565 15306492 14227659 13252271 12372500 11581164 10863439 10206364
55904A0206364n99695n45054n00473m64910m29941l95067l66947l44876l21410
$$ 10206364 9606669 9061615 8561142 8096232 7666291 7271224 6904277 6559401 6237991
55895F237991k96202k75563k59340k41177k20884k04215j91161j76267j59684
$$ 6237991 5941789 5666226 5406886 5165709 4944825 4740610 4549449 4373182 4213498
55886D213498j46607j36582j24208j09567r7386q6701p1759n2505l4234j7535
$$ 4213498 4066891 3930309 3806101 3696534 3599148 3512447 3440688 3388183 3353949 3336414
55876C336414J729K2723L9287M8796N2692M9047L3775R082j7612m2935o8141r1801
$$ 3336414 3338143 3360866 3400153 3448949 3501641 3550688 3584463 3593545 3575933 3532998 3464857 3373056
55864C373056j10358j25013j39535j51724j55358j50253j42292j33787j22136
$$ 3373056 3262698 3137685 2998150 2846426 2691068 2540815 2398523 2264736 2142600
55855B142600j07903r5924q7577p9499p0728o4005n9488n4166m8116m4664m3739
$$ 2142600 2034697 1938773 1851196 1771697 1700969 1636964 1577476 1523310 1475194 1430530 1386791
55844A386791m1624l7808l5607l5452l3957l0346k7591k6465k4469k1418k0194
$$ 1386791 1345167 1307359 1271752 1236300 1202343 1171997 1144406 1117941 1093472 1072054 1051860
55833A051860k1143k1305j9929j9257j9317j7493j3977j2170j2885j3341j2585
$$ 1051860 1030717 1009412 989483 970226 950909 933416 919439 907269 894384 881043 868458
55822H68458j2784j4447j5440j5444j6373j7807j7034j4281j2875j3495j3207
$$ 868458 855674 841227 825787 810343 793970 776163 759129 744848 731973 718478 705271
55811G05271j1017r342r088q148n914m523m451l404p61J183J580K364M164M937
$$ 705271 694254 684912 675824 667676 661762 657239 652788 649384 648623 649806 651386 653750 657914 662851
55797F62851L893K829K620K146J438K002L323K989J020KK72p38l544n345m942
$$ 662851 666744 669573 672193 674339 675777 677779 681102 684091 685111 685113 685385 684647 681103 675758 670816
55782F70816m630n815o696o081n822p667j0850j4145j7313j9385j8635j5399j2019
$$ 670816 666186 660371 653675 647594 641772 634105 623255 609110 591797 572412 553777 538378 526359
55769E26359r216n508p30L248N818Q081R293O838Q53m726p228p957q704r058q641
$$ 526359 517143 511635 510905 514153 519971 528052 537345 544183 545036 540310 533082 525125 516421 507363 498722
55754D98722q685r648j0147r705r757j0733j1024j0078r577j0262j0509r379q209
$$ 498722 490037 480389 470242 460537 450780 440047 429023 418945 409368 399106 388597 379218 371009
55741C71009p842p124n532m466m513m128k443q38l56j26L16k23k153l833m179
$$ 371009 363167 356043 350511 346045 341532 337404 334961 334123 333767 333641 333957 333734 331581 327748 323569
55726C23569m277n097n913o113o339o722o309n146m584m684l935k302j709k516
$$ 323569 319292 314195 308282 302169 295830 289108 282799 277653 273069 268385 264450 262148 260439 257923
55712B57923k530p82Q81J402K580N597Q452Q976P898O716M914J571k283n173p277
$$ 257923 255393 254611 255492 256894 259474 265071 273523 282499 290397 297113 302027 303598 301315 296142 288865
55697B88865r113r899r121q006p638p180n755m385m247m499l739k322j502j365
$$ 288865 279752 269853 260732 252726 245088 237908 232153 227768 223521 219022 215283 212961 211459 210094
55683B10094j206r12o22l3Q04J098O59M37Q65R84R8j191k336l660m977n168m125
$$ 210094 208888 207976 207354 207321 208125 209223 209882 210319 211184 212168 212266 211075 208739 205079 200102 194934 190809
55666A90809l335l519l514k549j710j845j927r42L14P79R72J713K550K855L186
$$ 190809 187474 183955 180441 177892 176182 174337 172410 171468 171782 172561 173533 175246 177796 180651 183837
55651A83837M058M666M200L299K953L097L319L749M238L956K807J906J705J161
$$ 183837 187895 192561 196761 200060 203013 206110 209429 213178 217416 221372 224179 226085 227790 228951
55637B28951l28j743k305k882m257n617o003n866n818n374m233l376l519l796
$$ 228951 228623 226880 224575 221693 217436 211819 205816 199950 194132 188758 184525 181149 177630 173834
55623A73834l279k502k149j721p96k40o75j103n35K47K6r12j660k292l127l509
$$ 173834 170555 168053 165904 164183 163387 163147 162472 161369 160834 161081 161107 160195 158535 156243 153116 149607
55607A49607k864k005j870j895j115k8J55n38r73n92J77O85M78m68j375j288n12
$$ 149607 146743 144738 142868 140973 139858 139830 139985 139447 138474 137882 138059 138744 139222 138754 137379 136091 135579
55590A35579l33r91j275o72k27n65p85l09k9m57n35L90J109O27L4P47K256L365
$$ 135579 135246 134255 132980 132308 132081 131516 130731 130422 130393 129936 129401 129791 130900 131527 131561 132308 134564 137929
55572A37929M263N680P202Q168R128J0689J2046J2233J1850J1751J1114Q652M930
$$ 137929 142192 147872 155074 163242 172370 183059 195105 207338 219188 230939 242053 250705 255635
55559B55635J659o82k879n278p510r468j1186j2304j2630j2559j2048j0310p570
$$ 255635 257294 256612 253733 248455 240945 231477 220291 207987 195357 182798 170750 160440 152870
55546A52870n698n681n926m692k891k506l450m025l666l130k690k085j736k147
$$ 152870 147172 141491 135565 130873 127982 125476 122026 118001 114335 111205 108515 106430 104694 102547
55532A02547k586k055j077q70j301j407j290j716k345k234j745k091l248l967
$$ 102547 99961 97906 96829 95959 94658 93251 91961 90245 87900 85666 83921 81830 78582 74615
55518G4615l763l227k613j687q13n93o06J09J416K324K623K891L121K751J903
$$ 74615 70852 67625 65012 63325 62512 61919 61313 61422 62838 65162 67785 70676 73797 76548 78451
55503G8451J253Q54L43rK89Q10Q30O66J091J788J807J183P25N03po00o37l83n74
$$ 78451 79704 80558 80901 80892 81181 81991 82821 83487 84578 86366 88173 89356 90081 90584 90577 89977 89340 88957 88383
55484H8383r34n78L19P94P42Q31J014O57k0j12M16Q03Q96J042Q96j07j242j172
$$ 88383 87449 86871 87190 87984 88726 89557 90571 91228 91208 91096 91512 92315 93211 94253 95149 95042 93800 92628
55466I2628q6N08O9n02o78q35r31l85M41L81n60j011l96L05L85M18Q24R44L07
$$ 92628 92542 93050 93119 92617 91939 91104 90173 89788 90229 90610 90050 89039 88643 88948 89333 89751 90575 91519 91826
55447I1826m21n46l58l47m16m14o01j027j228r74o07l43K5N27R03J173J554J722
$$ 91826 91405 90859 90501 90154 89738 89324 88723 87696 86468 85494 84887 84544 84569 85096 85999 87172 88726 90448
55429I0448J171K65o1K86M95K87K76P19J124J278J540J804J343J36p55n30M77
$$ 90448 91619 91884 91823 92109 92604 92891 93167 93886 95010 96288 97828 99632 100975 101111 100356 99826 100303
55412A00303J662K809L601L467K426J291N66r6j030j997k747l355l690l421k701
$$ 100303 101965 104774 108375 111842 114268 115559 116125 116029 114999 113002 110255 106900 103210 99789 97088
55397I7088k097j643r16j45j41q64j233p39j15N8K43P49Q18j46j259j220j27O95
$$ 97088 94991 93348 92432 92287 92146 91282 90049 89310 89195 89253 89496 90245 91063 90917 89658 88438 88311 89006
55379H9006M79k20m83j04M06N37L06N4j12l87p39p24k13K44K62K74O86J011O80
$$ 89006 89485 89265 88782 88678 89084 89621 89927 89981 89869 89482 88743 88019 87806 88050 88312 88586 89272 90283 90963
55360I0963K11L93Q19M61n37j013o49k84l47l79k00k31l82o1N00K84o96j089k76
$$ 90963 91174 91567 92386 92847 92310 91297 90648 90364 90017 89638 89438 89207 88825 88764 89264 89548 88852 87763 87487
55341H7487O36O07J37N3P4l95j001j041o67m62m60m09m89q84j057l78Q61J651
$$ 87487 88123 88730 88867 88920 88994 88599 87598 86557 85890 85428 84968 84559 84070 83186 82129 81751 82612 84263
55323H4263J339J40j171j737j234l23n5n57q90l98M33R00J043J210J235P63qm76
$$ 84263 85602 85742 84571 82834 81600 81277 81222 80665 79775 79377 79810 80710 81753 82963 84198 84961 84953 84477
55305H4477l09L64J102J340Q07p8o11o99q26j114j077m91J98N63O31M86J70P4
$$ 84477 84168 84532 85634 86974 87781 87703 87092 86393 85567 84453 83376 82885 83083 83646 84277 84763 84933 85007
55287H5007O37J451J561Q72L34L77K99l71r41p48l20n33j276j776j705j265o46
$$ 85007 85644 87095 88656 89528 89862 90239 90538 90167 89226 88478 88158 87625 86349 84573 82868 81603 80957
55270H0957n0K35K53M17P80Q90P00Q07J316J450Q73M53Q34J217O45k54j58Q81
$$ 80957 80907 81142 81395 81812 82592 83482 84182 84989 86305 87755 88628 89081 89915 91132 91777 91523 91365 92246
55252I2246J516J068K43j10M8L63N51L72j99o56m19L30P95N50o3n46p16n64j69
$$ 92246 93762 94830 95073 94963 95011 95374 95925 96297 96098 95442 95023 95353 96148 96698 96635 96089 95373 94809 94640
55233I4640J41l5o93j301j323p45j19o5o22j114q49pN91N46K64K10L33M83P44
$$ 94640 94781 94746 94053 92752 91429 90684 90565 90500 89878 88764 87915 87908 88499 89045 89309 89519 89852 90335 91079
55214I1079J011P94n8q77r56m04J83N83R33J242J357J255R01J73p23j068m29O17
$$ 91079 92090 92884 92826 91949 90993 90589 90772 91355 92288 93530 94887 96142 97043 97216 96493 95425 94996 95613
55196I5613J109Q51M95N72R25J059P23Q9m57o89p70r90j291j337j027n41J01R73
$$ 95613 96722 97573 98068 98640 99565 100624 101347 101436 100979 100290 99520 98530 97239 95902 94875 94334 94435 95408
55178I5408J698J595O49l18p32r16j236j329p23K40Q32Q90Q18R23J203J515J507
$$ 95408 97106 98701 99350 99032 98300 97384 96148 94819 94096 94336 95168 96058 96876 97799 99002 100517 102024
55161A02024P56n16j290r14n9J39m29q79o93k22P5J74J53r0m97o46k20N24R57
$$ 102024 102780 102264 100974 100060 100001 100140 99711 98832 98139 97917 97992 98166 98319 98229 97732 97086 96866 97390 98347
55142I8347P69L07J20J87j13j093k088k195j474p51l44K35J115J536Q63m70j572
$$ 98347 99116 99423 99543 99730 99617 98524 96436 94241 92767 92016 91672 91907 93022 94558 95421 94951 93379
55125I3379k010j722p01O58J398R73j3n84n77m74m81m38l49l37k38J86P18R22
$$ 93379 91369 89647 88946 89604 91002 91975 91962 91378 90801 90327 89846 89408 89059 88722 88484 88670 89388 90310
55107I0310P49N40N39P47J062J231R64M09K13P18J501K011K271K472K438J995
$$ 90310 91059 91599 92138 92885 93947 95178 96142 96551 96764 97482 98983 100994 103265 105737 108175 110170
55091A10170J482J213Q66N7p75q55k57J74j6m39n99m73l41m38p77j077r88o65
$$ 110170 111652 112865 113731 113788 113013 112158 111901 112075 112059 111620 111021 110548 110207 109769 108992 107915 106927 106262
55073A06262p25j323j711j217k67K47K18J69J62k75j112j568j066Q4J150J628
$$ 106262 105537 104214 102503 101286 101019 101266 101484 101653 101815 101540 100428 98860 97794 97878 99028 100656
55057A00656J392N94l84j120j306p22N79J829J890O11o58o47J27J23j016k043
$$ 100656 102048 102642 102258 101138 99832 99110 99689 101518 103408 104019 103361 102714 102841 102964 101948 99905
55041I9905j895q77J63R43J533J756J388O57K8l27n25n97l96J77R51J514J485
$$ 99905 98010 97133 97296 98239 99772 101528 102916 103573 103601 103274 102749 102152 101756 101933 102884 104398 105883
55024A05883Q13j83j120j770j986j660r39k04K99O36Q66Q52N11m7p03j243j098
$$ 105883 106696 106513 105393 103623 101637 99977 99038 98834 99133 99769 100635 101487 101998 101951 101248 100005 98907
55007I8907J57J785K253J118k57m61K04N38K79Q2J73J83J02L10P48J001J124J472
$$ 98907 99064 100849 103102 104220 103963 103502 103706 104244 104523 104605 104778 104961 105063 105373 106121 107122 108246 109718
54989A09718J833J657J095Q17P92L20o25j139p51r8J47R5M6j11m14m48J2M99M97
$$ 109718 111551 113208 114303 115120 115912 116232 115607 114468 113717 113619 113766 113861 113907 113796 113382 112934 112946 113445 113942
54970A13942P5m04p41p52k08P14J382J423J054N13k59j093j376q56j28J90K72
$$ 113942 114017 113613 112872 112120 111912 112626 114008 115431 116485 116998 116739 115646 114270 113414 113286 113476 113748
54953A13748N55Q33N50k10p05m97J10N74O78M66J6n40q79o50J25R13J121P33L52
$$ 113748 114303 115136 115686 115476 114771 114274 114384 114958 115636 116102 116118 115578 114699 114049 114174 115087 116208 116941 117293
54934A17293M59Q54J025Q49O21N36N54O42P91Q59P27O21Q88J522K265L070M067
$$ 117293 117752 118606 119631 120480 121101 121637 122191 122833 123624 124483 125210 125831 126719 128241 130506 133576 137643
54917A37643N167O091O813P541Q338R088R743J0206R999Q566N893K534r16m016
$$ 137643 142810 148901 155714 163255 171593 180681 190424 200630 210629 219195 225088 227622 226706 222690
54903B22690o357p817q779r585r890r181p728o351n349m353l226k321j785j416
$$ 222690 216333 208516 199737 190152 180262 171081 163353 157002 151653 147300 144074 141753 139968 138552
54889A38552j252j548j990j789q09J36L74J76J28L96Q76J441J840J954K359L799
$$ 138552 137300 135752 133762 131973 131164 131300 131674 131850 131978 132374 133250 134691 136531 138485 140844 144643
54873A44643N907P374P763Q116R187J0026R301P251N262L883K378J13k547m881
$$ 144643 150550 157924 165687 173803 182990 193016 202317 209568 214830 218713 221091 221204 218657 213776
54859B13776o592p751q343q207p313o029n018m677m717m556m162l993m161m194
$$ 213776 207184 199433 191090 182883 175570 169541 164523 159846 155129 150573 146411 142418 138257 134063
54845A34063l784l127k360j402o00p66j962k990k745j542m96q7m9j66l80m23j69
$$ 134063 130279 127152 124792 123390 122790 122024 120062 117072 114327 112785 112289 112202 112153 111987 111607 111184 111015
54828A11015p7n99j298j321o01R5L02L51O49J067J244J103Q80Q46R84R57M99o3
$$ 111015 110938 110339 109041 107720 107119 107214 107516 107867 108516 109583 110827 111930 112810 113656 114640 115597 116096 116033
54810A16033j18L00M69J23MO78J488J475Q29N17P39P79K49m38q53r82p74j04O87
$$ 116033 115915 116215 116684 116807 116811 117489 118977 120452 121281 121798 122537 123316 123565 123127 122274 121292 120518 120414 121101
54791A21101R59P06O26R85J165N97m55j333j742j649j000M6J008J557J814J917
$$ 121101 122060 122766 123392 124377 125542 126139 125684 124351 122609 120960 119960 120006 121014 122571 124385 126302
54775A26302J668R89L32K09O01J198J960K906L680L874L829M490O222Q173R127
$$ 126302 127970 128959 129291 129500 130101 131299 133259 136165 139845 143719 147548 152038 158260 166433 175560
54760A75560Q889Q508R107J0634J1902J1741R968P205L993L77l572p177r463j0123
$$ 175560 184449 192957 202064 212698 224600 236341 246309 253514 257507 257884 254312 247135 237672 227549
54746B27549r911r800r880r434q054o259m790l802l136k929l253l485k865j662
$$ 227549 217638 207838 197958 188524 180470 174211 169421 165619 162483 159554 156301 152816 149951 148289
54732A48289q60o19o5J058J702J176M76Q42J776J837J016P89J827L082L614M012
$$ 148289 147429 146810 146745 147803 149505 150681 151157 151999 153775 155612 156628 157417 159244 162326 165940 169952
54716A69952N208O855P814P743P234O607N446L411Q61j509l360m841o213p478
$$ 169952 175160 182015 189829 197572 204806 211413 216859 220270 221131 219622 216262 211421 205208 197730
54702A97730q282q229p335o143n208m605m022l353k905k933l146k940k163j370
$$ 197730 189448 181219 173884 167741 162533 157928 153906 150553 147648 144715 141569 138629 136466 135096
54688A35096j159j373j403j109r05q87n09M74J303J081M5p53p99m98k42O1M15
$$ 135096 133937 132564 131161 130052 129147 128260 127751 128225 129528 130609 130654 129901 129102 128604 128362 128423 128838
54671A28838L56l52j197j456j010l18J85L63K78Q5j11l88q27j207j136o41k36
$$ 128838 129194 128842 127645 126189 125179 124861 125046 125409 125687 125772 125661 125273 124446 123239 122103 121462 121226
54654A21226k37l82l52k36j92L1O83J428J678J389J066R37O34j17r40j226q62
$$ 121226 120989 120607 120255 120019 119827 119858 120541 121969 123647 125036 126102 127039 127673 127556 126616 125390 124528
54637A24528l06m9k13n96q39n97J59R93J330J085P04N18L38Kn5O33J550J525K72
$$ 124528 124222 124173 123960 123364 122525 121928 122087 123080 124410 125495 126199 126717 127055 127057 127002 127635 129185 130710 130982
54618A30982j043j223m73J67K83K35J34l43j152j669j575j217r41o40k81k00m73
$$ 130982 129939 128716 128243 128410 128693 128928 129062 128719 127567 125898 124323 123106 122165 121525 121244 121044 120571
54601A20571n32P5R64J446J444J358J237P20k74j275j726j471p87j89m3k00j13
$$ 120571 120039 120114 121078 122524 123968 125326 126563 127283 127009 125734 124008 122537 121750 121561 121518 121318 121205
54584A21205M31R05P00l4o58q95r34p57r9P99J063K07j088j656j129j37N82Q90
$$ 121205 121636 122541 123241 123207 122549 121654 120720 119963 119864 120663 121726 121933 120845 119189 118060 117923 118505 119395
54566A19395J034J123J029O76K11j45k88k68j51O1L54O05O62N50M86O18P46N26
$$ 119395 120429 121552 122581 123257 123468 123323 123035 122767 122616 122677 123031 123636 124298 124848 125334 125952 126698 127224
54548A27224J0k37J84P99O55m59j568j617p03K16O31Q56J188J387J247J070J131
$$ 127224 127234 126997 127181 127980 128635 128176 126608 124991 124288 124504 125135 125991 127179 128566 129813 130883 132014
54531A32014J151Q17M81P66J605K231K111J417O29Q8rL27O80N55K6k69oL62K78
$$ 132014 133165 133982 134463 135229 136834 139065 141176 142593 143222 143310 143301 143628 144308 144863 144889 144620 144614 144976 145254
54512A45254j08k39l4k8o22j515k108k149j895j650j412j010m68o3K2k3J46N67
$$ 145254 145146 144907 144873 144845 144223 142708 140600 138451 136556 134906 133494 132484 132016 131953 131975 131952 132098 132665
54494A32665Q58O17j62j040j427r81J22J218J643J290O39K31J81K57K59J99J61
$$ 132665 133523 134140 133978 132938 131511 130530 130652 131870 133513 134803 135442 135673 135854 136111 136370 136569 136730
54477A36730J79K44L86O34R16J001O70ro34p57l05L71P75O21L7m92m88Q4P77J157
$$ 136730 136909 137153 137539 138173 139089 140090 140760 140751 140117 139360 139055 139426 140201 140822 140859 140367 139879 139963 140740 141897
54457A41897J191J033O30p0o88o85j12L29K14q8m7J92Q3m77r69q82k17N88R84
$$ 141897 143088 144121 144751 144681 143993 143308 143196 143525 143739 143651 143604 143796 143879 143402 142433 141551 141334 141922 142906
54438A42906O45j80p26m23M23R55P61K18j69l82o67j030j265j278j150q94m35
$$ 142906 143551 143371 142645 142222 142645 143600 144361 144579 144410 144028 143361 142331 141066 139788 138638 137744 137309
54421A37309J74O83Q72P88O90P28P75O46M56N68J072J525J410P82J74q3j13o7
$$ 137309 137483 138166 139038 139826 140516 141244 142019 142665 143121 143689 144761 146286 147696 148478 148652 148569 148456 148389
54403A48389J84P32J277J349Q48J47k96l32j05J78M39P03R44J092J164J252J308
$$ 148389 148573 149305 150582 151931 152779 152926 152630 152298 152193 152371 152810 153513 154457 155549 156713 157965 159273
54386A59273J120O51K50K24M24N23N25O19N99M4r19j628j786j799j941j825j128
$$ 159273 160393 161044 161294 161518 161942 162465 162990 163609 164208 164252 163333 161705 159919 158120 156179 154354 153226
54369A53226k98nk30m84o07p49p98n03r5j29o65j164j185p71q7P74J518J682J180
$$ 153226 152928 152923 152693 152209 151602 150853 150055 149552 149457 149328 148663 147499 146314 145543 145456 146230 147748 149430 150610
54350A50610L99k66o78p20l17K16L50L4k45k83m80j111j729j749j252p66n72o24
$$ 150610 151009 150743 150065 149345 149028 149244 149594 149628 149383 149100 148620 147509 145780 144031 142779 142013 141441 140817
54332A40817q59j191j316r80l41K36O04P94P54M62J75J80L74M60M23M58M37m7
$$ 140817 139958 138767 137451 136471 136130 136366 136970 137764 138518 138980 139155 139335 139709 140169 140592 141050 141487 141440
54314A41440r91j719j567o66J22J14m72p99m31Q6o8q36j317j025n19m21m45K0
$$ 141440 140449 138730 137163 136497 136619 136733 136261 135462 135031 135117 135049 134213 132896 131871 131352 130931 130486 130506
54296A30506P91J180J170J438K140K565K307J965K234K810K844K081J024J88k59
$$ 130506 131297 132477 133647 135085 137225 139790 142097 144062 146296 149106 151950 154031 155055 155243 154984
54281A54984k76P9M20K38n23j375j813j741j320p11j04K41K31J06J89M60N56K82
$$ 154984 154708 154787 155207 155445 154922 153547 151734 149993 148673 147962 147858 148099 148330 148436 148625 149085 149641 149923
54263A49923p4p4K27K51l36j057j158n73mO7n5J69P13J170J392J491J358P52j20
$$ 149923 149849 149775 150002 150253 149917 148860 147702 147129 147125 147192 147137 147306 148019 149189 150581 152072 153430 154182 154062
54244A54062o25n30l60o32j096j142p77o51j155j872k071j533p12k26l82j041
$$ 154062 153437 152907 152547 151915 150819 149677 148900 148249 147094 145222 143151 141618 140906 140680 140298 139257
54228A39257j723j887j293k28O85J022Q59N91M27K58j0j64M1M44N85L17k7k21
$$ 139257 137534 135647 134354 134126 134811 135833 136692 137283 137710 137968 137958 137794 137835 138279 138864 139181 139154 138933
54210A38933n24j124j537j110o1O05L65j73k22O6k3n59p63l1J207J916J525M85
$$ 138933 138409 137285 135748 134638 134577 135182 135547 135374 135152 135218 135195 134636 133873 133842 135049 136965 138490 138975
54192A38975k20m6N39N96j71j033j160n85jK26L12M48M19K3n68j026j195j014
$$ 138975 138755 138709 139248 139844 139673 138640 137480 136895 136894 137120 137432 137880 138299 138322 137754 136728 135533 134519
54174A34519m18M62J168J240O55j84q51j178j218j040o22N5P50R92N46k53p90
$$ 134519 134101 134563 135731 136971 137626 137442 136591 135413 134195 133155 132533 132588 133338 134330 134876 134623 133833
54157A33833p83l72K54R54J433J353P88K10n3j16j09R3N76J008R67M03k82o28
$$ 133833 133050 132678 132932 133886 135319 136672 137460 137670 137617 137501 137392 137485 138061 139069 140036 140439 140157 139529
54139A39529m39Q1M19J68n23j016p81J77J414K346K596K330K147K256J983O49
$$ 139529 139090 139171 139590 139758 139235 138219 137438 137615 139029 141375 143971 146301 148448 150704 152687 153336
54123A53336j199k220j998j452j277j016k31M20K04k91Q2J224J918J636J146J171
$$ 153336 152137 149917 147919 146467 145190 144174 143943 144363 144567 144276 144358 145582 147500 149136 150282 151453
54107A51453J429J327Q92M86J43l77j127j792j932j292r9R91J426J226P32R8o28
$$ 151453 152882 154209 155101 155587 155730 155353 154226 152434 150502 149210 149111 150102 151528 152754 153486 153584 152956
54090A52956j188j294j049p45m11j0J88M0P4Q37J814J903J014K98N09J097J274
$$ 152956 151768 150474 149425 148680 148269 148259 148447 148487 148561 149398 151212 153115 154129 154427 154936 156033 157307
54073A57307J181J299J419R87P7o75r18p59k87M85J205J256M57n87j001m81L96
$$ 157307 158488 159787 161206 162193 162270 161595 160677 159918 159631 160116 161321 162577 163034 162447 161446 160965 161361
54056A61361P55L69j13l0M39P07P89J214J912K025J185K33K10J076J998K406K299
$$ 161361 162116 162485 162372 162342 162781 163488 164277 165491 167403 169428 170613 170846 171056 172132 174130 176536 178835
54039A78835J856J387J345J892K560K824K834L123L822M584N175N686O227O797
$$ 178835 180691 182078 183423 185315 187875 190699 193533 196656 200478 205062 210237 215923 222150 228947
54025B28947P348P672P432O596N680N204N089M917M492L826K873J780J057R80
$$ 228947 236295 243967 251399 257995 263675 268879 273968 278885 283377 287203 290076 291856 292913 293893
54011B93893J057O81j1m80p23j168j850k511l264m337n214n081m229l908m511
$$ 293893 294950 295631 295620 295140 294417 293249 291399 288888 285624 281287 276073 270992 266763 262855 258344
53996B58344m936m302l293l041l371l211k232j227r11j207j660j969k059k036
$$ 258344 253408 249106 245813 242772 239401 236190 233958 232731 231820 230613 228953 226984 224925 222889
53982B22889k120k301k178j500p26n82j149j874k299k344j932j048k41l95j563
$$ 222889 220769 218468 216290 214790 214064 213482 212333 210459 208160 205816 203884 202836 202595 202200 200637
53967B00637k564k222p46N99J013Q69R02J192J275R44N48M79O75Q52R97J348J956
$$ 200637 198073 195851 195105 195704 196717 197586 198488 199680 200955 201899 202447 202926 203601 204453 205450 206798 208754
53950B08754K539K857K926K793K414J985J984K511K855K292J296J276K962N469
$$ 208754 211293 214150 217076 219869 222283 224268 226252 228763 231618 233910 235206 236482 239444 244913
53936B44913P277P787P601P578Q032Q695R109R065Q867R040R697J0379J0813J1391
$$ 244913 252190 259977 267578 275156 283188 291883 300992 310057 318924 327964 337661 348040 358853 370244
53922C70244J2445J3183J2088Q486L312j774n571p542p643o413m856l588k336
$$ 370244 382689 395872 407960 416446 419758 417984 412413 404871 397228 390815 385959 382371 380035
53909C80035o19J290K725L671M717N932O537O001M839L882L158K095N60q59j655
$$ 380035 379416 380706 383431 387102 391819 397751 404288 410289 415128 419010 422168 424263 424823 423964 422309
53894D22309k005k347k716k757k319j800j798k495l490m275m795n366o140o874
$$ 422309 420304 417957 415241 412484 410165 408365 406567 404072 400582 396307 391512 386146 380006 373132
53880C73132p293p416p326o900o042n088m643m926n537n927n873n441m787m170
$$ 373132 365839 358423 351097 344197 338155 333067 328424 323498 317961 312034 306161 300720 295933 291763
53866B91763l854l800l568k929k376k593l419l887l483k847k810l179l100k404
$$ 291763 287909 284109 280541 277612 275236 272643 269224 265337 261854 259007 256197 253018 249918 247514
53852B47514j835j889k115j929j435j087r42q07p24p86q13p20r79j959l017l021
$$ 247514 245679 243790 241675 239746 238311 237224 236282 235475 234751 233965 233152 232432 231453 229494 226477 223456
53836B23456j840n75j44l11l81k42k23m45p76j139j457j551j399j302j439j576
$$ 223456 221616 221041 220897 220586 220205 219963 219740 219295 218519 217380 215923 214372 212973 211671 210232 208656
53820B08656j447j132p65k55L04L70l34j167j189l77M33O58M70K05m4j15L68J440
$$ 208656 207209 206077 205312 205057 205361 205731 205397 204230 203041 202664 203097 203755 204225 204430 204386 204271 204639 206079
53802B06079K519L000K968L017L499M142M409M171L969M482N665O661O761O225
$$ 206079 208598 211598 214566 217583 221082 225224 229633 233804 237773 242255 247920 254581 261342 267567
53788B67567N745N372M519L068J775J421J914K571K855K670K159J573J127P65
$$ 267567 273312 278684 283203 286271 288046 289467 291381 293952 296807 299477 301636 303209 304336 305101
53774C05101K19o22j512k190k671l115l571m008m358m425l985l183k555k487k802
$$ 305101 305320 304698 303186 300996 298325 295210 291639 287631 283273 278848 274863 271680 269125 266638 263836
53759B63836l102l256l316l226k897k429j984j506q80k53R2K44O97J863L650N579
$$ 263836 260734 257478 254162 250936 248039 245610 243626 242120 241240 240987 241079 241323 242020 243883 247533 253112
53743B53112P296Q892J0732J2759J4023J3157R612M234j416o174r584j1593j2407
$$ 253112 260408 269300 280032 292791 306814 319971 329583 333817 332401 326227 316643 305050 292643
53730B92643j2432j1906j0673q667o531n167m658m182l097j720p82o14j111k025
$$ 292643 280211 268305 257632 248965 242434 237267 232609 228427 225330 223610 222828 222214 221103 219078
53716B19078k862k887j833m48J62k32q41r03m71l2K12M16P13J050J278J291J127
$$ 219078 216216 213329 211496 211048 211210 210978 210137 209234 208763 208731 208943 209359 210072 211122 212400 213691 214818
53699B14818J010J174J621K112K476K680K634K201J545J139J174J229Q62L27K51
$$ 214818 215828 217002 218623 220735 223211 225891 228525 230726 232271 233410 234584 235813 236675 237002 237253
53684B37253O81R43N32k70q49r63q18o09l76j75j51l50o04o60n10n24j099k030
$$ 237253 237934 238877 239409 239139 238290 237327 236509 235900 235524 235349 235198 234848 234244 233584 233074 232550 231451 229421
53666B29421k439j676k11Q01Q29M38L09M00L22O6j82m80q90j073p29k58l11p68
$$ 229421 226982 225306 225095 225896 226725 227163 227472 227872 228194 228260 228078 227598 226708 225635 224906 224648 224337 223569
53648B23569q83m68j59l11l19M62J672K371K220J754J602J906K390K727K724K370
$$ 223569 222686 222218 222059 221748 221429 221891 223563 225934 228154 229908 231510 233416 235806 238533 241257 243627
53632B43627J765J077N79N42P94N68o23k032k316j282j99L3P0Q18J794J939J455
$$ 243627 245392 246469 247048 247590 248384 248952 248329 246297 243981 242699 242500 242533 242603 243421 245215 247154 248609
53615B48609J481K138K408K025K042K919L496K743J467J101J639J975J768J644
$$ 248609 250090 252228 254636 256661 258703 261622 265118 267861 269328 270429 272068 274043 275811 277455
53601B77455J786J644J113P88P81M21m93j146r83o27p96j083o94P4J38p77j710
$$ 277455 279241 280885 281998 282786 283567 283988 283495 282349 281366 280739 279943 278860 278166 278240 278378 277601 275891
53584B75891j771j133n92n99j031j497j659j406r38n55l97m68q01j373j910k046
$$ 275891 274120 272987 272395 271796 270765 269268 267609 266203 265265 264710 264313 263845 263044 261671 259761 257715
53568B57715j608o54O36J836K314J775P10j07m88p79j038q75j79N65R30J026J116
$$ 257715 256107 255453 256089 257925 260239 262014 262724 262617 262129 261350 260312 259437 259258 259823 260753 261779 262895
53551B62895J204J271J513J939K151J938J738K045K610K798K590K587L059L550
$$ 262895 264099 265370 266883 268822 270973 272911 274649 276694 279304 282102 284692 287279 290338 293888
53537B93888L584L352L400L967M875N857O764P510Q066Q531Q992R342R355R120
$$ 293888 297472 300824 304224 308191 313066 318923 325687 333197 341263 349794 358786 368128 377483 386603
53523C86603R228J0207J1723J2722J2618J2059J2092J2813J3461J3763J4387J5811
$$ 386603 395831 406038 417761 430483 443101 455160 467252 480065 493526 507289 521676 537487
53511E37487J7476J8590J9222J9968K0885K1412K1229K0583J9826J9121J8594
$$ 537487 554963 573553 592775 612743 633628 655040 676269 696852 716678 735799 754393
53500G54393J8326J8179J8010J7965J8213J8500J8457J8171J7996J7891J7548
$$ 754393 772719 790898 808908 826873 845086 863586 882043 900214 918210 936101 953649
53489I53649J7101J7041J7355J7447J7117J6947J7354J7849J7590J6327J4445
$$ 953649 970750 987791 1005146 1022593 1039710 1056657 1074011 1091860 1109450 1125777 1140222
53478A140222J2485J0867R679Q409O373L606R43j099k889m777o330p169p929r437
$$ 1140222 1152707 1163574 1173253 1181662 1188035 1191641 1192584 1191485 1188596 1183819 1177489 1170320 1162391 1152954
53464A152954j1376j2725j3432j4440j5983j7021j6838j6283j6650j7959j9158
$$ 1152954 1141578 1128853 1115421 1100981 1084998 1067977 1051139 1034856 1018206 1000247 981089
53453I81089j9691j9984k0406k0594k0026j8829j7630j6843j6368j5866j5087
$$ 981089 961398 941414 921008 900414 880388 861559 843929 827086 810718 794852 779765
53442G79765j4013j2871j2006j1628j1507j1013r583p211m504k184n57N59J479
$$ 779765 765752 752881 740875 729247 717740 706727 697144 689933 685429 683245 682688 683247 684726
53429F84726K252K767L128L802N190P074Q752R850J0827J2382J4460J6225J7103
$$ 684726 686978 689745 692873 696675 701865 708939 717691 727541 738368 750750 765210 781435 798538
53416G98538J7524J8314J9656K1053K2194K3338K4770K6280K7553K8798L0590
$$ 798538 816062 834376 854032 875085 897279 920617 945387 971667 999220 1028018 1058608
53405A058608L3055L5562L7435L8697L9921M1430M2968M4214M5285M6507M7820
$$ 1058608 1091663 1127225 1164660 1203357 1243278 1284708 1327676 1371890 1417175 1463682 1511502
53394A511502M8737M8903M8486M7986M7790M7972M8322M8383M7596M5657M2799
$$ 1511502 1560239 1609142 1657628 1705614 1753404 1801376 1849698 1898081 1945677 1991334 2034133
53383B034133L9715L7017L4715L2244K9078K5364K1734J8498J5237J1446P300
$$ 2034133 2073848 2110865 2145580 2177824 2206902 2232266 2254000 2272498 2287735 2299181 2306481
53372B306481L372k85m244q815j3588j8082k2474k7310l2721l8252m3274m7274
$$ 2306481 2309853 2309568 2305324 2296509 2282921 2264839 2242365 2215055 2182334 2144082 2100808 2053534
53360B053534m9914n1226n1683n1857n1977n1985n1825n1413n0500m8945m7097
$$ 2053534 2003620 1952394 1900711 1848854 1796877 1744892 1693067 1641654 1591154 1542209 1495112
53349A495112m5567m4612m4015m3508m2931m2022m0511l8628l7087l6269l5650
$$ 1495112 1449545 1404933 1360918 1317410 1274479 1232457 1191946 1153318 1116231 1079962 1044312
53338A044312l4363l2226k9942k8267k7219k6165k4523k2304j9956j7859j6035
$$ 1044312 1009949 977723 947781 919514 892295 866130 841607 819303 799347 781488 765453
53327G65453j4334j2715j1244r927q695p516o353n090l632k055n26Q50J939K521
$$ 765453 751119 738404 727160 717233 708538 701022 694669 689579 685947 683892 683366 684216 686155 688676
53313F88676K565K597L371N096P216R048J0441J1700J3083J4561J5907J6886J7510
$$ 688676 691241 693838 697209 702305 709521 718569 729010 740710 753793 768354 784261 801147 818657
53300H18657J8132J9131K0450K1695K2740K3881K5202K6190K6355K5996K5896
$$ 818657 836789 855920 876370 898065 920805 944686 969888 996078 1022433 1048429 1074325
53289A074325K6305K6667K6313K5114K3344K1242J8920J6481J3999J1465Q866
$$ 1074325 1100630 1127297 1153610 1178724 1202068 1223310 1242230 1258711 1272710 1284175 1293041
53278A293041O369M232K522Q07j574m749p862r860j0810j1928j4021j6390j7870
$$ 1293041 1299410 1303642 1306164 1306971 1305397 1300648 1292786 1282926 1272116 1260188 1246167 1229777 1211907
53265A211907j8519j9427k0996k2413k3039k3396k4285k5601k6698k7414k8064
$$ 1211907 1193388 1173961 1152965 1130552 1107513 1084117 1059832 1034231 1007533 980119 952055
53254I52055k8740k9265k9599k9658k9014k7410k5407k3833k2688k1387j9992
$$ 952055 923315 894050 864451 834793 805779 778369 752962 729129 706441 685054 665062
53243F65062j9363j9851k0688k1024k0814k0336j9533j8425j7465j6872j6074
$$ 665062 645699 625848 605160 584136 563322 542986 523453 505028 487563 470691 454617
53232D54617j4551j2785j1561j0678r326p581o538o718p309p289o662o104n920
$$ 454617 440066 427281 415720 405042 395716 388135 381597 374879 367570 360281 353619 347515 341595
53219C41595n923o004o287o800p328p535p098n904m342l181k928l422m144m703
$$ 341595 335672 329668 323381 316581 309253 301718 294620 288716 284374 281193 278265 274843 270699 265996
53205B65996m860m416l428k382j772j601j503j279r80o66l97m34r82j713j957
$$ 265996 261136 256720 253292 250910 249138 247537 246034 244755 243775 243109 242712 242278 241296 239583 237626
53190B37626j528j035j133j687k017j795j341j020p58l36P1N9l92p93p36l62k
$$ 237626 236098 235063 233930 232243 230226 228431 227090 226070 225312 224976 225047 225106 224714 223921 223185 222823 222821
53173B22821L73R45J490J452P07j16l55r5L1k97p39p95m14MJ15k3j08j42n20j415
$$ 222821 223194 224139 225629 227081 227788 227672 227317 227222 227253 226956 226217 225422 225008 225012 225127 225104 224996 224854 224334 222919
53153B22919k239k103r64J79M47N0k52k83m36p28o47q0L70L05K19O89J336J262
$$ 222919 220680 218577 217613 217792 218239 218289 218037 217754 217318 216590 215943 215863 216233 216538 216757 217446 218782 220044
53135B20044M01l66m97m90r37j505j441p54k27l44p67j014j053j037q85n83m57
$$ 220044 220445 220079 219582 219092 218155 216650 215209 214455 214228 213884 213117 212103 211050 210013 209128 208545 208088
53118B08088p26r74n95L36J090J230J027Q36N35j01q34j170r90o40m78n94r24
$$ 208088 207362 206388 205793 206129 207219 208449 209476 210312 210847 210746 209912 208742 207752 207112 206634 206040 205116
53101B05116j341j607j490j079p99r69j413j653j448j019p43p67r93j234j266
$$ 205116 203775 202168 200678 199599 198800 197831 196418 194765 193317 192298 191555 190788 189795 188561 187295
53086A87295q51j8P11P62K32j14J78O86P36K87k47p57j387j903j752r16o8L27
$$ 187295 186444 186426 187137 187899 188131 188017 188195 188881 189617 189904 189657 188900 187513 185610 183858 182942 182874 183201
53068A83201M85O45N38p8p76r52o89n88q81j220j277j066o81j69K81L91K14J19
$$ 183201 183686 184331 184869 184791 184015 183063 182374 181786 180905 179685 178408 177342 176661 176492 176773 177164 177378 177497
53050A77497K97M60L18N6J21O17J096J017L31m34o29n0R03J583J597J096O90R37
$$ 177497 177794 178254 178572 178628 178749 179366 180462 181479 181810 181376 180747 180697 181600 183183 184780 185876 186566 187503
53032A87503J688K013J123n62j731j696j167j228j921k392k156j580j200j138
$$ 187503 189191 191204 192327 191765 190034 188338 187171 185943 184022 181630 179474 177894 176694 175556
53018A75556j286j499j400n26R27J909J552K73o55n77p1L7k22j78L88Q84P54K31
$$ 175556 174270 172771 171371 170845 171772 173681 175233 175506 174851 174274 174203 174240 174018 173840 174228 175112 175866 176097
53000A76097n0O2J16k32p52r98q67o63p35j131j502j407q56m11m88o95l64L94
$$ 176097 176047 176109 176225 175993 175241 174243 173376 172713 171978 170847 169345 167938 167082 166671 166183 165488 165124 165518
52982A65518P65N06L36P13J016N72j04k2P22J048N03j97l20j9K24K81K26R5J17
$$ 165518 166283 166789 167125 167838 168854 169426 169322 169300 170022 171070 171573 171376 171056 171037 171261 171542 171768 171863 171980
52963A71980O79J648K267K075J494J087P50J92k87k36Nl73j372k011j627p15j35
$$ 171980 172659 174307 176574 178649 180143 181230 181980 182172 181885 181649 181654 181281 179909 177898 176271 175556 175421
52946A75421n0j23l14q27j434j527r24k33o2l32n75o26o12n33l12k01n40j087
$$ 175421 175371 175248 174934 174107 172673 171146 170222 169989 169927 169595 169020 168394 167782 167249 166937 166736 166196 165109
52928A65109j134n31Lr2l26J4O40N93k29p94l63M67O47N7n59p15o23n59m27j26
$$ 165109 163975 163444 163447 163355 163029 163043 163683 164276 164047 163253 162890 163357 164004 164061 163502 162787 162164 161605 161178 161052
52908A61052Q0p3l65l35L9K61L7k69j20M11P41N85K84K40L56L51K82M12O10L82
$$ 161052 161132 161059 160694 160359 160398 160659 160696 160427 160307 160718 161459 162044 162328 162568 162924 163275 163557 163969 164579 164961
52888A64961m14j169j084q3J041J436J021L96Rl03p55j058q44m70o54j304j464
$$ 164961 164547 163378 162294 162211 163252 164688 165709 166105 166114 165811 165056 163998 163154 162684 162030 160726 159262
52871A59262o75L24P73R94J622K275K008Q58p3r6L23M85M24O33J353K359L070
$$ 159262 158587 158911 159684 160678 162300 164575 166583 167441 167368 167272 167595 168080 168504 169137 170490 172849 175919
52854A75919K880J804P63O65J246J456R98O24P39O97k7q72j068q64j058j758k356
$$ 175919 178799 180603 181366 182031 183277 184733 185731 186355 187094 187791 187764 186892 185824 184960 183902 182144 179788
52837A79788k473k200j629q77m46p77j428j403m78M35N00jj77K38P02P64O85R73
$$ 179788 177315 175115 173486 172609 172163 171386 169958 168555 168077 168512 169012 169011 168834 169072 169774 170538 171223 172196
52819A72196J567J764J061k30j337j849j958k033k180k224j906j117j31N18P07
$$ 172196 173763 175527 176588 176358 175021 173172 171214 169181 167001 164777 162871 161754 161623 162141 162848
52804A62848J018J981L192L815L785L720L603K554L57j750k502k171j961k315
$$ 162848 163866 165847 169039 172854 176639 180359 183962 186516 186873 185123 182621 180450 178489 176174
52790A76174k663k520k017j467j072r74j097j085q74r79j663k167j587k91M52
$$ 176174 173511 170991 168974 167507 166435 165461 164364 163279 162405 161426 159763 157596 156009 155718 156170
52775A56170J97k59k37RJ08L46J082J974K348J998J262O06L33L95L08l09j032
$$ 156170 156367 156108 155871 155880 155988 156334 157416 159390 161738 163736 164998 165604 165937 166332 166640 166331 165299
52758A65299r96j29N66L17l53m16K81R95J153Q64M97K53J57J32M9j09k06j65p0
$$ 165299 164303 164174 164740 165057 164704 164288 164569 165564 166717 167581 168078 168331 168488 168620 168669 168560 168354 168189 168119
52739A68119J15N37J031J036L22n20p24k20M75J000J330J448J373J333J476J479
$$ 168119 168234 168771 169802 170838 171160 170640 169916 169696 170171 171171 172501 173949 175322 176655 178131 179610
52723A79610J030N28O58J333J697J329P61N18K62o07j954k969l094k446j529q71
$$ 179610 180640 181168 181826 183159 184856 186185 186946 187464 187726 187119 185165 182196 179102 176656 175127 174256
52707A74256q29j390k130k543k412j778p84K74R60J057Q07N85M69K82q6o05j183
$$ 174256 173427 172037 169907 167364 164952 163174 162390 162664 163624 164681 165488 166073 166542 166824 166738 166133 164950
52690A64950j583j463p56R9O55R88J409J793J719J181O41L40K8m34p04m04L76
$$ 164950 163367 161904 161148 161247 161902 162890 164299 166092 167811 168992 169633 169973 170001 169567 168863 168459 168835
52673A68835J194J622J376M63o00j095q77n15m88n89m21k6L18N92R06J080Q71
$$ 168835 170029 171651 173027 173490 172890 171795 170918 170403 169915 169326 168905 168879 169197 169789 170695 171775 172646
52656A72646M78L07L92L97K73M37J233K436L378L475K724J788J415J651J860J619
$$ 172646 173124 173431 173823 174220 174493 174930 176163 178599 181977 185452 188176 189964 191379 193030 194890 196509
52640A96509J126N13o19k367l804l923l025k291k101j735q13QR2k30l08r7N5J23
$$ 196509 197635 198148 197529 195162 191358 187435 184410 182119 180018 178283 177470 177478 177570 177340 177032 176935 176990 177113
52622A77113L76R21J592K018J698M75r31j461j063q13j331j849j430m61l6l04
$$ 177113 177489 178410 180002 182020 183718 184193 183262 181801 180738 179925 178594 176745 175315 174854 174818 174514
52606A74514l72K53R67R74K43o04r07m29M49R79P76K37J5K06M81P02R14R47O22
$$ 174514 174142 174395 175362 176336 176579 175975 175068 174639 175088 176067 176843 177080 177095 177301 177782 178484 179398 180345 180967
52587A80967L20O45J469J943J611R18L94L8k23o5O66J387J387Q01L68L90M69K41
$$ 180967 181287 181932 183401 185344 186955 187873 188267 188305 188082 188017 188683 190070 191457 192258 192626 193016 193485 193726
52569A93726r7k03k8K95O19O68J30p67j109k57J175J875J375M75k1l57j102j971
$$ 193726 193629 193426 193398 193693 194312 194980 195110 194343 193234 192977 194152 196027 197402 197877 197856 197499 196397 194426
52551A94426k128j501r90j212j718j724j140m18J58N95Q18O35J18l20l23j2J36
$$ 194426 192298 190797 189807 188595 186877 185153 184013 183595 183753 184348 185166 185801 185919 185599 185276 185264 185400
52534A85400j32m31j18P58J285Q31M5O5Q90J380R53L36K20J41o17j624j877j300
$$ 185400 185268 184837 184719 185477 186762 187593 187638 187703 188593 189973 190926 191262 191482 191623 191006 189382 187505 186205
52516A86205p44n39l9J172K482L043K899K763K942K995K533J890J674J818J547
$$ 186205 185461 184922 184883 186055 188537 191580 194479 197242 200184 203179 205712 207602 209276 211094 212641
52501B12641N39m05l72K39J49r83k053k139j718j633j646r79J71P20K06o35r42
$$ 212641 213180 212775 212403 212642 212791 211808 209755 207616 205898 204265 202619 201640 201811 202531 202737 202102 201160
52484B01160o94l76k64k97l80m91n94n29mJ056K147K533K129J661J668J817J593
$$ 201160 200466 200090 199826 199529 199149 198658 198064 197535 197531 198587 200734 203267 205396 207057 208725 210542 212135
52467B12135J200J124J261J117O44J88j33l34r5Q60K020K464K008J270O57j7q81
$$ 212135 213335 214459 215720 216837 217481 217669 217536 217202 217107 217967 219987 222451 224459 225729 226386 226369 225488
52450B25488j683k207k426k224j590j057j237j843j893j093l17m24j182j744j684
$$ 225488 223805 221598 219172 216948 215358 214301 213064 211221 209328 208235 207918 207494 206312 204568 202884
52435B02884j257r53j002j124p51K39J143J254P94M81L62r8q89j305j047o13l85
$$ 202884 201627 200674 199672 198548 197797 198036 199179 200433 201227 201708 202070 201972 201083 199778 198731 198118 197733
52418A97733j95qj75o52p48r3P97J375J750K124K228J855J403J343J658K193L072
$$ 197733 197538 197530 197355 196703 195955 195862 196659 198034 199784 201908 204136 205991 207394 208737 210395 212588 215660
52401B15660M249N242N775O211O854P299O916N559L399O03k324m492n445n637
$$ 215660 219909 225151 230926 237137 243991 251290 258206 263765 267164 267767 265443 260951 255506 249869
52387B49869n552m987l803k696k375k448k040j172n92m51j53M95R11P17L23K76
$$ 249869 244317 239330 235527 232831 230456 228008 225968 224796 224204 223753 223600 224095 225006 225723 226046 226322
52371B26322N95J084J771K678L463L684L348K906K735K666K146Q67q42k347l301
$$ 226322 226917 228001 229772 232450 235913 239597 242945 245851 248586 251252 253398 254265 253423 251076 247775
52356B47775l674l372k325r97j98j02O9R43K036K345J567K59r35j710j895j405
$$ 247775 244101 240729 238404 237407 237209 237107 237176 238119 240155 242500 244067 244326 243391 241681 239786 238381
52340B38381m94K64M62J93q4N0O12J281J864K564L553M403M476L834L230L220
$$ 238381 237887 238151 238613 238806 238722 238772 239384 240665 242529 245093 248646 253049 257525 261359 264589 267809
52324B67809L739M616N760O797P159O874O556O391N897M946M172L863L399K376
$$ 267809 271548 276164 281924 288721 295880 302754 309310 315701 321598 326544 330716 334579 337978 340354
52310C40354J543J764K719L475L813M084M261M064L702L607L688L570L360L456
$$ 340354 341897 343661 346380 349855 353668 357752 362013 366077 369779 373386 377074 380644 384004 387460
52296C87460L840M179M289L935K668P18n87l00O47N60o91j651j463p95m95n24
$$ 387460 391300 395479 399768 403703 406371 407089 406502 406202 406849 407409 406718 405067 403604 402809 402314 401790
52280D01790n29m61k04N45J638K388K407J992J500J075J084K022L574M578M375
$$ 401790 401261 400800 400596 401141 402779 405167 407574 409566 411066 412141 413225 415247 418821 423399 427774
52265D27774L625L354L711M106M166M053M037M129M146L936L603L400L369L303
$$ 427774 431399 434753 438464 442570 446736 450789 454826 458955 463101 467037 470640 474040 477409 480712
52251D80712L211L437M014M383M223M036M266M341L578K488K161K502K446J815
$$ 480712 483923 487360 491374 495757 499980 504016 508282 512623 516201 518689 520850 523352 525798 527613
52237E27613J615K224K639K075J177R35J350J935K706L858M984N467N308N008
$$ 527613 529228 531452 534091 536166 537343 538278 539628 541563 544269 548127 553111 558578 563886 568894
52223E68894M880M955N188N424N381N071M874N033N378N703N923N755M899L750
$$ 568894 573774 578729 583917 589341 594722 599793 604667 609700 615078 620781 626704 632459 637358 641108
52209F41108L253L717M399M612M556M641M711M545M522N077N952O498O418N761
$$ 641108 644361 648078 652477 657089 661645 666286 670997 675542 680064 685141 691093 697591 704009 709770
52195G09770M649L506L013L353L827L752L324L137L282L518L881M439M773M360
$$ 709770 714419 717925 720938 724291 728118 731870 735194 738331 741613 745131 749012 753451 758224 762584
52181G62584L329K253J376N14m05j222j917k651l503m350m957n109m895m808n177
$$ 762584 765913 768166 769542 770056 769651 768429 766512 763861 760358 756008 751051 745942 741047 736239 731062
52166G31062n462m826l443k395k019j375R7J530K020K060K467K770K066Q46M47
$$ 731062 725600 720774 717331 714936 712917 711542 711639 713169 715189 717249 719716 722486 724552 725398 725845
52151G25845Q97R18Q4n41k53K09J7l86j28P26J454J752J827J758J383O34l99j608
$$ 725845 726742 727660 727744 727203 726950 727159 727176 726790 726662 727388 728842 730594 732421 734179 735562 736196 735797 734189
52133G34189k722l310l252k986l004l196l001k067n04J352L238N013O589P875
$$ 734189 731467 728157 724905 721919 718915 715719 712718 710651 710147 711499 714737 719750 726339 734214
52119G34214Q832R530J0043J0327J0350J0395J0868J1573J1516R874O930L700
$$ 734214 743046 752576 762619 772946 783296 793691 804559 816132 827648 837522 844452 848152
52107H48152Q50j528l398m666n517o172o296n307l364j420j06Q32J730K369K618
$$ 848152 849002 847474 844076 839410 833893 827721 821425 816118 812754 811334 811228 812060 813790 816159 818777
52092H18777L082M399O115P003O481N215M172L465K407M73k043m358n896o557
$$ 818777 821859 826258 832373 839376 845857 851072 855244 858709 861116 861589 859546 855188 849292 842735
52078H42735o432n576m212k790j645p30P8N60M37n8k51K87J377K517L246L299
$$ 842735 836303 830727 826515 823725 822080 821350 821428 821988 822425 822367 822116 822403 823780 826297 829543 832842
52062H32842K765K114J745J561J283J092J367J787J317n11k766m024l797k839
$$ 832842 835607 837721 839466 841027 842310 843402 844769 846556 847873 847362 844596 840572 836775 833936
52048H33936k123j952j973j806j598j927l056m379n030n004n208o103o902o621
$$ 833936 831813 829861 827888 826082 824484 822557 819501 815122 810092 805088 799880 793777 786875 780254
52034G80254n499m618m306l738k307o13M04P46J188K025K749K982L114L716M711
$$ 780254 774755 770137 765831 762093 759786 759173 759577 760323 761511 763536 766285 769267 772381 776097 780808
52019G80808N564O037O260O180N470M193L110K956L668M544N077N331N478N361
$$ 780808 786372 792409 798669 804849 810319 814512 817622 820578 824246 828790 833867 839198 844676 850037
$$ [...]
##END NTUPLES=NMR SPECTRUM
##END=
