
##TITLE=AC1295_UGARS11106_6534052_0wtJG578sq
##JCAMPDX= 6.0         $$ Bruker NMR JCAMP-DX V2.0
##DATA TYPE= NMR SPECTRUM
##DATA CLASS= NTUPLES
##ORIGIN= BRUKER
##OWNER= Administrator
$$ 1.72 TOPSPIN		Version 2.1
$$ 2012-12-04 21:00:06.766 -0500  Administrator@X
$$ Compression mode = diff/dup
##.OBSERVE FREQUENCY= 400.02188249412
##.OBSERVE NUCLEUS= ^1H
##.ACQUISITION MODE= SIMULTANEOUS (DQD)
##.ACQUISITION SCHEME= undefined
##.AVERAGES= 8
##.DIGITISER RES= 22
##SPECTROMETER/DATA SYSTEM= spect
##.PULSE SEQUENCE= zg30
##.SOLVENT NAME= COFFEE_meoh
##.SHIFT REFERENCE= INTERNAL, COFFEE_meoh, 1, 14.98509
##AUDIT TRAIL= $$ (NUMBER, WHEN, WHO, WHERE, PROCESS, VERSION, WHAT)
$$ ##TITLE= Audit trail, TOPSPIN		Version 2.1
$$ ##JCAMPDX= 5.01
$$ ##ORIGIN= Bruker BioSpin GmbH
$$ ##OWNER= Administrator
$$ $$ E:\/data/COFFEE/nmr/AC1295_UGARS11106_6534052_0wtJG578sq/30/pdata/1/auditp.txt
$$ ##AUDIT TRAIL=  $$ (NUMBER, WHEN, WHO, WHERE, PROCESS, VERSION, WHAT)
(   1,<2012-12-04 20:59:58.750 -0500>,<Administrator>,<X>,<go>,<TOPSPIN 2.1>,
      <created by zg
	started at 2012-12-04 20:58:52.781 -0500,
	POWCHK enabled, PULCHK disabled,
       configuration hash MD5:
       86 BA 57 50 F2 9D 5C 9B 26 00 A9 28 5F 66 2E 89
       data hash MD5: 64K
       F1 AC 50 72 28 26 98 AE 3F 67 A7 33 52 18 D0 29>)
(   2,<2012-12-04 21:00:01.922 -0500>,<Administrator>,<X>,<proc1d>,<TOPSPIN 2.1>,
      <Start of raw data processing
       efp LB = 0 FT_mod = 6 PKNL = 1 PHC0 = 0 PHC1 = 0 SI = 32K 
       data hash MD5: 32K
       1C F1 36 81 80 18 F0 24 B7 C5 59 DC A4 39 17 37>)
(   3,<2012-12-04 21:00:02.359 -0500>,<Administrator>,<X>,<proc1d>,<TOPSPIN 2.1>,
      <pk PHC0 = 102.0081 PHC1 = 0 
       data hash MD5: 32K
       C1 9C 8C 77 52 BB E8 08 AA D1 F3 DA 88 18 9D EF>)
(   4,<2012-12-04 21:00:02.578 -0500>,<Administrator>,<X>,<proc1d>,<TOPSPIN 2.1>,
      <abs ABSG = 1 
       data hash MD5: 32K
       8A 0C 93 7B 0B 73 53 DE 37 8E 90 6A E3 47 08 81>)
(   5,<2012-12-04 21:00:02.734 -0500>,<Administrator>,<X>,<proc1d>,<TOPSPIN 2.1>,
      <abs ABSG = 2 
       data hash MD5: 32K
       0E 61 66 8C 4D 2A 08 46 01 50 81 94 9A B2 FA 42>)
(   6,<2012-12-04 21:00:02.875 -0500>,<Administrator>,<X>,<proc1d>,<TOPSPIN 2.1>,
      <abs ABSG = 3 
       data hash MD5: 32K
       BC 62 DE 1D 47 D0 C8 06 F5 6E 52 2D 4F 3A 13 5D>)
(   7,<2012-12-04 21:00:03.031 -0500>,<Administrator>,<X>,<proc1d>,<TOPSPIN 2.1>,
      <abs ABSG = 4 
       data hash MD5: 32K
       EA 6A 3F 09 15 6F 34 41 BA D1 28 3F 5B D2 79 2A>)
(   8,<2012-12-04 21:00:03.187 -0500>,<Administrator>,<X>,<proc1d>,<TOPSPIN 2.1>,
      <abs ABSG = 5 
       data hash MD5: 32K
       26 B1 9F 4F 31 9B 55 AB 98 41 BB CB D6 02 66 C9>)
$$ ##END=
$$ 
$$ $$ hash MD5
$$ $$ DD D1 68 EC 40 B7 58 D1 A7 17 A7 66 92 CF AA 78
##$RELAX= 
##$RELAX= 
##$RELAX= 
##$RELAX= 
##$RELAX= 
##$RELAX= 
##$RELAX= 
$$ Bruker specific parameters
$$ --------------------------
##$DU= <E:\>
##$EXPNO= 30
##$NAME= <AC1295_UGARS11106_6534052_0wtJG578sq>
$$ [...]
150 150 150 150 150 150 150 150
##$TP07= 0
##$TPNAME0= <>
##$TPNAME1= <>
##$TPNAME2= <>
##$TPNAME3= <>
##$TPNAME4= <>
##$TPNAME5= <>
##$TPNAME6= <>
##$TPNAME7= <>
##$TPOAL= (0..7)
0.5 0.5 0.5 0.5 0.5 0.5 0.5 0.5
##$TPOFFS= (0..7)
0 0 0 0 0 0 0 0
##$TUNHIN= 0
##$TUNHOUT= 0
##$TUNXOUT= 0
##$USERA1= <user>
##$USERA2= <user>
##$USERA3= <user>
##$USERA4= <user>
##$USERA5= <user>
##$V9= 5
##$VALIST= <valist>
##$VCLIST= <CCCCCCCCCCCCCCC>
##$VD= 0
##$VDLIST= <DDDDDDDDDDDDDDD>
##$VPLIST= <PPPPPPPPPPPPPPP>
##$VTLIST= <TTTTTTTTTTTTTTT>
##$WBST= 2048
##$WBSW= 25
##$XGAIN= (0..3)
0 0 0 0
##$XL= 0
##$YL= 0
##$YMAX_a= 682306
##$YMIN_a= -584198
##$ZGOPTNS= <>
##$ZL1= 120
##$ZL2= 120
##$ZL3= 120
##$ZL4= 120
##$ABSF1= 14.98509
##$ABSF2= -5.573092
##$ABSG= 5
##$ABSL= 3
##$ALPHA= 0
##$AQORDER= 0
##$ASSFAC= 0
##$ASSFACI= 0
##$ASSFACX= 0
##$ASSWID= 0
##$AUNMP= <proc_prof1d_extract_pilot.lims>
##$AXLEFT= 0
##$AXNAME= <>
##$AXNUC= <1H>
##$AXRIGHT= 0
##$AXTYPE= 0
##$AXUNIT= <>
##$AZFE= 0.1
##$AZFW= 0.1
##$BCFW= 0
##$BC_mod= 0
##$BYTORDP= 0
##$COROFFS= 0
##$CY= 15
##$DATMOD= 1
##$DC= 0
##$DFILT= <>
##$DTYPP= 0
##$F1P= 0
##$F2P= 0
##$FCOR= 0.5
##$FTSIZE= 32768
##$FT_mod= 6
##$GAMMA= 0
##$GB= 0
##$INTBC= 1
##$INTSCL= 1
##$ISEN= 128
##$LB= 0
##$LEV0= 0
##$LPBIN= 0
##$MAXI= 10000
##$MC2= 0
##$MEAN= 0
##$ME_mod= 0
##$MI= 0
##$NCOEF= 0
##$NC_proc= -8
##$NLEV= 6
##$NOISF1= 0
##$NOISF2= 0
##$NSP= 0
##$NTH_PI= 0
##$NZP= 0
##$OFFSET= 14.98509
##$PC= 1
##$PHC0= 102.0081
##$PHC1= 0
##$PH_mod= 1
##$PKNL= yes
##$PPARMOD= 0
##$PPDIAG= 0
##$PPIPTYP= 0
##$PPMPNUM= 2147483647
##$PPRESOL= 1
##$PSCAL= 4
##$PSIGN= 0
##$PYNMP= <proc.py>
##$REVERSE= no
##$SF= 400.02
##$SI= 32768
##$SIGF1= 0
##$SIGF2= 0
##$SINO= 400
##$SIOLD= 32768
##$SPECTYP= <>
##$SREGLST= <1H.CDCl3>
##$SSB= 0
##$STSI= 32768
##$STSR= 0
##$SW_p= 8223.68421052631
##$SYMM= 0
##$S_DEV= 0
##$TDeff= 65536
##$TDoff= 0
##$TI= <>
##$TILT= no
##$TM1= 0
##$TM2= 0
##$TOPLEV= 0
##$USERP1= <user>
##$USERP2= <user>
##$USERP3= <user>
##$USERP4= <user>
##$USERP5= <user>
##$WDW= 1
##$XDIM= 32768
##$YMAX_p= 472333975
##$YMIN_p= -718796
##$CURPLOT= <Network HP LaserJet P1505>
##$CURPRIN= <$Network HP LaserJet P1505>
##$DFORMAT= <normdp>
##$LAYOUT= <+/1D_H.xwp>
##$LFORMAT= <normlp>
##$PFORMAT= <normpl>
##$SURQMSG= 1
$$ End of Bruker specific parameters
$$ ---------------------------------
##NTUPLES= NMR SPECTRUM
##VAR_NAME=  FREQUENCY,     SPECTRUM/REAL,   SPECTRUM/IMAG
##SYMBOL=    X,             R,               I
##VAR_TYPE=  INDEPENDENT,   DEPENDENT,       DEPENDENT
##VAR_FORM=  AFFN,          ASDF,            ASDF
##VAR_DIM=   32768,         32768,           32768
##UNITS=     HZ,            ARBITRARY UNITS, ARBITRARY UNITS
##FACTOR=    0.250966925370066, 1,           1
##FIRST=     8223.43324360094, -45053,       -201381
##LAST=      0,             4993,            -77094
##MIN=       0,             -718796,         0
##MAX=       8223.43324360094, 472333975,    0
$$ Real data points
##PAGE= N=1
##DATA TABLE= (X++(R..R)), XYDATA
$$ [...]
$$ plain form
19545 292722 -36805 5403 -164911 9615 102594 -233999 -257881 76950 -14731 -318206 255969
19533 167626 50794 -182396 -548507 -210651 179859 -55099 -286515 -171728 -15006 275826
19522 88779 -357187 -96247 -258469 32612 -8507 -201481 -9602 74602 -961 29176 40053 -247989
19509 64581 -305247 317692 -183110 -91237 -72842 -212291 5640 43178 -310772 565728 -206679
19497 52667 -196740 -189694 -71253 81766 172399 13820 -25774 233079 -120316 -176493 -342639
19486 -342639 115334 -431810 -101492 217833 24920 -278570 -41055 -438990 -212471 8875
19475 -172221 388793 -157580 283413 90698 342415 -195609 -173191 -63564 124404 -100383
19464 92079 -215116 -249282 -187565 -190324 79668 20235 210259 88974 -99823 24472 123281
$$ packed form
19545B92722c6805E403a64911I615R2979b33999k3882G6950a4731l03475B55969
19533A67626E0794a82396l66111b10651A79859e5099k31416J14787a5006B75826
19522H8779c57187i6247j62222C2612h507j92974i602G4602i61B9176J0877b47989
19509F4581c05247C17692a83110i1237J8395j39449E640L7538c10772E65728b06679
19497E2667a96740P046g1253H1766R0633A3820b5774B33079a20316n6177j66146
19486c42639A15334d31810a01492B17833B4920b78570d1055l97935b12471H875
19475a72221C88793a57580B83413I0698K51717a95609K2418f3564A24404a00383
19464I2079b15116l4166O1717k759G9668B0235J90024H8974i9823B4472R8809
$$ plain form
19453 123281 -3631 -177628 24302 23781 -266658 -76090 -11289 39364 8128 87107 81152 -298725
19440 -219590 187942 -217292 40974 -446740 -60509 -49499 92077 -92227 -150679 -131282 97427
19428 246481 141054 -69734 -272772 -153810 -113655 -66553 324452 -28662 -66673 57039 -133796
19416 145456 -47930 16693 -287394 -103876 -19887 -231233 -59793 109692 151119 -21512 180465
19404 -74744 -256356 -14975 -135771 3505 -198791 -159843 -95642 5756 -170780 -225235 244767
19392 25890 72602 -382692 -67669 14988 -209544 133014 18712 -267790 47554 -247835 68111
19380 86855 137269 192761 -149421 -282446 4022 204397 166090 276427 -320430 108286 39082
19368 -113557 -52688 -154673 102657 -224441 -172770 51133 2824 -10042 68942 -160887 27224
$$ packed form
19453A23281c631j73997B4302n21b66658g6090a1289C9364H128P8979n955b98725
19440b19590A87942b17292D0974d46740f0509J1010I2077i2227n8452J9397I7427
19428B46481j05427f9734k03038J18962M0155M7102C24452b8662l8011E7039a33796
19416A45456d7930A6693b87394a03876a9887k11346e9793A09692M1427b1512A80465
19404g4744j81612a4975j20796C505a98791L8948O4201E756a70780n4455B44767
19392B5890M6712c82692f7669A4988b09544A33014A8712b67790D7554b47835F8111
19380H6855N0414N5492a49421j33025D022K00375l8307J10337c20430A08286C9082
19368a13557e2688j01985A02657b24441N1671E1133B824a0042F8942a60887B7224
$$ plain form
19356 173125 -43777 -312445 8140 79234 -89458 -86099 85620 -229714 8432 -96581 47979 -154031
19343 212159 5880 -142526 -594 -314278 -206159 158613 131339 -63562 -51995 4933 -17440
19331 -67745 66279 96294 603745 32582 -32358 -178989 -305579 -74709 -438346 -438283 178795
19319 -57621 -92494 351226 -15158 104253 -118473 9621 -184082 57526 -127046 -34772 -219184
19308 -219184 -58562 119108 -3752 -29095 136050 138939 -103508 -345346 -273686 -253557 120770
19296 -194888 -211508 -52862 237950 -223427 -213935 -220242 25428 37952 60218 -191420 -235174
19285 -235174 -73123 -67670 261272 49953 98935 -322342 93977 -258270 -230218 -14118 -14024 151274
19272 -85212 -94146 -218692 -23913 361763 -192488 149351 411615 -450252 -214891 -192369
$$ packed form
19356A73125d3777k68668H140P1094h9458L359H5620b29714H432i6581D7979a54031
19343B12159E880a42526e94l13684J08119A58613k7274f3562J1567D933a7440
19331f7745F6279L0015N07451C2582c2358j46631j26590g4709l63637O3A78795
19319e7621l4873C51226a5158A04253a18473I621a84082E7526a27046c4772j84412
19308b19184e8562A19108c752k5343A36050K889a03508k41838P1660K0129A20770
19296a94888j6620e2862B37950b23427R492o307B5428J2524K2266a91420m3754
19285b35174g3123N453B61272D9953M8982c22342I3977b58270K8052a4118R4A51274
19272h5212q934j24546b3913C61763a92488A49351K62264d50252b14891K2522
$$ plain form
19262 -192369 119519 -441496 -222187 -60420 -222623 19908 -52033 -368287 -9601 -95342 -106361
19251 -106361 -29691 127484 -202294 -110996 -113385 40321 -316412 96507 11304 -341353 -77683
19239 -46904 -57092 -117420 339057 -77654 -91640 -144744 -40584 -293221 -119275 -185914 -37136
19227 -47030 -268154 72201 222537 -111175 161443 28241 -68091 -29081 -123479 199961 -116360
19215 -78402 215750 -263771 -130341 -193920 -76449 -185727 -236269 -303760 -166612 70416 220830
19204 220830 -53976 184131 -134599 -106827 19755 -153280 -100602 11249 46168 239896 -264051
19192 -100040 -117865 -42096 -91022 -89065 150078 -28105 54525 -26274 178568 -148299 -237440
19181 -237440 18171 -248869 -219824 7912 -186339 240943 -49570 223414 -148060 119054
$$ packed form
19262a92369A19519d41496K19309f0420j62203A9908e2033l16254i601q5741j1019
19251a06361b9691A27484b02294R1298k389D0321c16412I6507A1304c41353g7683
19239d6904j0188o0328C39057g7654j3986n3104d0584k52637a19275o6639c7136
19227d7030k21124G2201J50336a11175A61443B8241f8091b9081r4398A99961a16360
19215g8402B15750b63771a30341o3579g6449j09278n0542o7491J37148G0416J50414
19204B20830e3976A84131a34599K7772A9755a53280N2678A1249L4919J93728b64051
19192a00040j7825d2096m8926J957A50078b8105E4525b6274A78568a48299q9141
19181b37440A8171b48869K9045G912a86339B40943d9570B23414a48060A19054
$$ plain form
19170 85239 343793 67786 -114901 -396744 -322014 49033 -31188 -228601 -320493 -61746 -24722
19158 -34474 -407119 -88989 -24695 -106567 40939 -91354 -50787 -311812 -143353 -147835 50875
19146 -189410 22397 23436 -191999 -85055 59228 85516 168778 217589 -183635 238440 -28900
19134 -117055 -66386 -306477 -515569 -17816 -168355 -78363 -37466 -435660 382476 105228
19123 -354162 -142469 243732 109868 -52442 94440 -50685 -84165 -271802 -130478 -14418
19112 95467 45484 56238 154321 -204034 30226 -148908 149048 -102576 175411 -19509 -13253
19101 -13253 184172 -156956 -95133 2107 57400 -431029 288670 -27747 -385049 -199030 132147
19089 122286 3503 -38759 -140440 -218463 -209478 -4695 -45051 38603 211344 252685 49315 92536
$$ packed form
19170H5239K58554F7786a14901k81843P4730D9033c1188j97413r1892f1746b4722
19158c4474l72645h8989b4695q1872D0939i1354M0567k61025a43353m482E0875
19146a89410B2397J039a91999h5055E9228K6288Q3262M8811a83635B38440b8900
19134a17055N0669k40091k09092a7816j50539g8363c7466l98194C82476A05228
19123c54162a42469B43732A09868e2442I4440e0685l3480j87637a30478a4418
19112I5467D5484J0754R8083b04034C0226a48908A49048a02576A75411a9509O256
19101a3253A84172a56956O1823B107N5293d31029B88670b7747l57302J86019A32147
19089A22286C503c8759j01681p8023Q985d695m0356C8603J72741M1341D9315M3221
$$ plain form
19077 92536 130081 -37677 97369 -243570 -34175 -328939 160022 180744 -6456 79454 -133172
19065 -73311 245292 -70525 30019 -114420 -87881 102630 -121970 -400425 102382 -202269
19054 153351 -419480 -89472 581 -132901 -252957 -13923 -421918 45484 -144624 176580 -114316
19042 -115023 -105687 -195773 108382 20552 339747 349296 97611 26144 -12509 -80577 -153888
19031 -153888 -104417 11020 128786 -83280 -11238 -128087 -35211 141707 -210799 -256896 -13484
19019 -255310 -181681 -11702 162459 48091 262788 -156850 58891 -183596 -175437 -115395 -156802
19008 -156802 -232893 82002 -277992 135873 203888 -39816 88353 224702 -239867 7813 149145
18997 149145 -21129 49271 83199 -70878 -32101 -55254 189864 115507 -99456 -23914 191313
$$ packed form
19077I2536L7545c7677I7369b43570c4175k94764A60022K0722f456G9454a33172
19065g3311B45292g0525C0019a14420K6539A02630a21970k78455A02382b02269
19054A53351d19480h9472E81a32901j20056a3923m07995D5484a44624A76580a14316
19042a15023R336r0086A08382B0552L19195R549I7611B6144a2509o8068p3311
19031a53888M9471A1020J17766h3280a1238j16849c5211A41707b10799m6097a3484
19019b55310P3629a1702A62459D8091K14697a56850E8891a83596Q159O0042m1407
19008a56802p6091H2002b77992A35873O8015c9816H8353J36349b39867G813J41332
18997A49145b1129D9271L3928g0878c2101k3153A89864p4357i9456b3914A91313
$$ plain form
18985 -115058 139719 -142200 -352490 -185144 253069 -167627 86609 178977 398588 -79270
18974 126672 294555 15229 -259279 -155803 -231654 -165780 49864 -45671 93697 -156846 31883
18962 104053 -322882 -113420 108781 357042 132758 -129458 245142 68880 132012 174311
18952 174311 99589 -18746 232423 16839 312094 -135013 175157 39600 103819 182161 -1170
18940 -59837 186384 -47284 -368018 -49959 -65636 88868 -86350 180102 -207624 -114137 -16597
18928 39814 -43500 -140499 -185658 -76768 -262544 52532 -30457 14413 29579 98536 41242
18916 117500 -199594 -78637 -370055 -220079 97692 -143879 -105112 -125667 -210682 -246709 -30446
18904 258019 29241 68381 -25041 -172302 -53802 -39703 -93987 154208 -117983 113341 -284346
$$ packed form
18985a15058A39719a42200k10290J67346B53069a67627H6609R2368K19611g9270
18974A26672J67883A5229b59279J03476p5851O5874D9864d5671I3697a56846C1883
18962A04053c22882a13420A08781K48261A32758a29458B45142F8880O3132M2299
18952A74311p4722a8746B32423A6839K95255a35013A75157C9600O4219P8342a170
18940e9837A86384d7284l20734d9959j5677H8868h6350A80102b07624R3487a6597
18928C9814d3500r6999m5159g6768j85776E2532c0457A4413J5166O8957D1242
18916A17500a99594g8637k91418J49976I7692a43879L8767k0555q5015l6027c0446
18904B58019B9241L9140b5041j47261e3802J4099n4284A54208a17983A13341b84346
$$ plain form
18892 -12684 6756 -270242 -113432 137778 -101230 -294997 -53609 172787 -174705 -182260 131094
18880 144328 -516670 -258977 -382288 79002 -53111 66728 -17352 -8919 -105915 6869 46864
18869 46864 -242866 -90927 -268428 -200374 86388 37665 100657 145601 -144655 131645 -13134
18857 51425 -96472 103299 31306 -320805 -193960 -88342 77280 -55207 -316205 -47443 -87529
18846 -87529 -305548 198576 46451 -298988 -328015 29119 316563 136831 -66148 22614 189104
18835 189104 -172921 -195631 -268212 -240300 321255 -200306 314380 54944 -21332 -75557 349696
18823 -22069 -250881 79324 -147046 171377 45466 89909 81565 170517 -2992 100427 -167545
18811 -193101 119161 15910 81168 160916 19537 133928 13135 62743 158092 60405 -410705
$$ packed form
18892a2684F756b70242a13432A37778a01230j93767e3609A72787a74705p555A31094
18880A44328e16670K57693j23311G9002e3111F6728a7352Q433r6996F869L9995
18869D6864b42866i0927j77501O8054H6388C7665O2992M4944a44655A31645a3134
18857E1425i6472A03299C1306c20805J26845h8342G7280e5207k60998d7443m0086
18846h7529k18019A98576D6451b98988k9027B9119K87444A36831f6148B2614J66490
18835A89104a72921k2710p2581K7912C21255b00306C14380E4944b1332n4225C49696
18823b2069k28812G9324a47046A71377D5466M4443q344Q8952b992A00427a67545
18811a93101A19161A5910O5258P9748A9537J14391A3135M9608R5349F0405d10705
$$ plain form
18799 168442 -93216 -38483 -23602 -132058 -39463 26280 -91253 -107395 393326 200504 -127430
18787 142760 36043 -253910 93127 -181702 -140644 -81072 -332928 86526 -50219 -207122 -261860
18776 -261860 25215 -101518 -209423 -122115 -249979 94167 -93840 -115949 -91269 -188692 -283570
18765 -283570 163931 206532 25314 133075 -186693 -317820 59668 -201118 -326955 76825
18754 18939 -203133 -38750 -52848 164479 -176609 -243767 -315895 297885 -261038 -131622
18744 -131622 -1008 19311 104853 -103316 -25462 -227143 -215871 -35628 -308705 -46053 -80809
18733 -80809 -55876 -72866 -31564 -104818 -197395 -372604 -94375 -170676 88192 -111773 -12782
18721 -183986 -284547 14193 203346 -77980 -14581 24572 268472 173914 -161496 -193177 309095
$$ packed form
18799A68442i3216c8483J4881j08456c9463B6280i1253j6142C93326j92822a27430
18787A42760C6043b53910I3127a81702M1058N9572k51856H6526e0219j56903n4738
18776b61860B5215a01518j07905Q7308j27864I4167i3840k2109K4680r7423r4878
18765b83570A63931M2601B5314J07761a86693j31127E9668b01118j25837G6825
18754A8939b03133c8750j4098A64479a76609o7158p2128B97885b61038J29416
18744a31622a008A9311Q5542a03316b5462k01681J1272c5628k73077d6053l4756
18733h0809K4933j6990c1564p3254r2577j75209i4375p6301H8192a11773a2782
18721a83986j00561A4193J89153g7980a4581B4572K43900r4558a61496l1681C09095
$$ plain form
18709 -80464 8564 83274 20433 -275204 -43391 47201 -195692 -193155 -327405 24948 310490
18698 310490 32326 -5754 335460 -197602 -199549 26735 264274 -126836 -120197 76916 100737
18687 100737 -150948 -347636 -88060 87623 -119651 248579 -27478 -245802 18453 -228882
18676 -374421 51679 68203 -173847 334474 -183263 -83292 -212416 -254303 -48585 -117654 -441576
18665 -441576 -425148 102710 36454 6494 26596 -122549 -160771 -90710 81272 -212608 13931
18653 -191975 126141 -103689 29328 -129188 -134553 -231112 -11929 -227294 -109034 -341536
18643 -341536 -3090 301636 -21229 -49547 -206776 -65388 -157689 1744 -77793 -314429 -176435
18632 -176435 18130 -268684 -196756 -143851 254278 -64998 -197415 -139340 151871 -273931
$$ packed form
18709h0464H564P4710B0433b75204d3391D7201a95692K537j34250B4948K85542
18698C10490C2326e754C35460a97602j947B6735K37539a26836O639G6916K3821
18687A00737a50948j96688h8060H7623a19651B48579b7478k18324A8453b28882
18676c74421E1679J6524a73847C34474a83263h3292j29124m1887d8585o9069l23922
18665d41576J6428A02710C6454F494K0102a22549l8222P0061H1272b12608A3931
18653a91975A26141a03689B9328a29188n365r6559a1929k15365a09034k32502
18643c41536c090C01636b1229k8318j57229f5388r2301A744g7793k36636J37994
18632a76435A8130b68684P1928N2905B54278f4998j32417N8075A51871b73931
$$ plain form
18621 -242005 -102436 -82098 176035 -216799 -247957 -26867 -108753 101684 344171 -193001
18610 -31370 -302593 -33451 -78243 -212918 -247385 265649 245654 -48029 -82859 -169313 12957
18598 225122 -166283 215779 -205416 -169577 -37589 135300 17401 413559 150765 -326678
18587 160546 253936 -115354 49104 -30198 200378 -209921 18280 18117 -99695 54734 120892
18576 120892 -104757 -297680 -110699 280299 186576 51113 183061 -120395 -117919 -156644
18566 -156644 125805 174174 -59601 54727 -24793 150557 -31122 -44284 -321007 -320152 327541
18554 -8588 -76274 -90096 -69768 150901 192072 -61359 236391 -118586 59879 -88842 124492
18542 290908 146315 -1697 -300654 388210 -64936 33913 178751 -378037 130568 105769
$$ packed form
18621b42005a02436K0338A76035b16799l1158b6867q1886A01684K42487a93001
18610c1370k71223c3451m4792j34675l4467B65649j9995d8029l4830q6454A2957
18598B25122a66283B15779b05416L5839c7589A35300A7401L96158A50765c26678
18587A60546R3390a15354D9104c0198B00378b09921A8280j63i9695E4734O6158
18576A20892a04757j92923a10699B80299r3723E1113J31948a20395K476l8725
18566a56644A25805M8369e9601E4727b4793A50557c1122j3162k76723Q55C27541
18554h588o7686j3822K0328A50901M1171f1359B36391a18586E9879h8842A24492
18542B90908j44593a697k98957C88210f4936C3913J44838c78037A30568k4799
$$ plain form
18532 105769 240660 -391013 132883 -119898 101940 34171 -252117 59863 166829 -65909
18521 40207 -148992 -350605 44954 -54380 101614 -17052 -285082 183439 18822 -161136
18510 12316 -26097 -192124 220537 -135213 -319762 -61979 -278604 175219 -140187 -147548
18500 -147548 25307 13836 250784 -271175 -24212 118629 -74190 253596 -171706 185894
18489 89331 -72962 -29544 -95876 -62504 -107118 -70074 30614 -396437 -131421 -291727 -86119
18477 -180024 -54832 281794 -355080 -287214 -170748 110262 30719 -84070 107261 -85345
18466 -172651 -247681 -73469 204400 -476392 -361017 -65029 -497 -3118 -323371 95678 -74137
18454 -117114 -329408 8585 28163 30840 -1061 -41908 -150747 158249 145443 -192841 -240233
$$ packed form
18532A05769J34891c91013A32883a19898A01940C4171b52117E9863J06966f5909
18521D0207a48992k01613D4954e4380A01614a7052k68030A83439A8822a61136
18510A2316b6097j66027B20537a35213j84549f1979k16625A75219a40187p361
18500a47548B5307j1471K36948b71175b4212A18629g4190B53596a71706A85894
18489H9331g2962b9544o6332L3372m4614L7044C0614c96437a31421j60306h6119
18477a80024e4832B81794c55080O7866J16466A10262C0719h4070A07261h5345
18466a72651p5030g3469B04400d76392J15375f5029d97k621l20253I5678g4137
18454a17114k12294H585J9578K677a061m0847j08839A58249j2806a92841m7392
$$ plain form
18443 -240233 -62722 125384 -252529 193435 354122 -397784 115913 -210364 -410454 -58778
18432 152396 -80404 41018 -175833 244811 -174845 -128352 -50783 -399237 -99199 -7896 -16743
18421 -16743 -248384 52834 -522750 -77285 69979 -139977 -228978 -285917 -324907 111480 -282070
18409 -112887 320201 98463 99729 150468 -67819 36516 -169987 -110421 -38201 -63303 -41443
18398 -41443 -322655 80476 221090 -34841 -26386 -261527 65139 -108802 197121 -220849 -37661
18386 -98349 54516 24528 324196 -275714 205905 -116109 -143556 59175 -56780 -235483 -183504
18375 -183504 -290327 13675 87375 98037 -13610 -266052 8071 -210950 -239107 236790 -94838
18363 -307256 -165558 -109743 61951 53326 -68351 -20997 39046 -251918 -24876 -213812 -208729
$$ packed form
18443b40233f2722A25384b52529A93435J60687c97784A15913b10364k00090e8778
18432A52396h0404D1018a75833B44811a74845M6493e0783l48454i9199g896q847
18421a6743k31641E2834e22750g7285F9979a39977q9001n6939l8990A11480b82070
18409a12887C20201I8463J266N0739f7819C6516a69987N9566c8201k5102K1860
18398d1443k81212H0476J40614c4841Q455k35141F5139a08802A97121b20849c7661
18386i8349E4516B4528K99668b75714B05905a16109k7447E9175e6780j78703N1979
18375a83504j06823A3675P3700J0662a3610k52442H071b10950k8157B36790i4838
18363c07256J41698N5815F1951q625f8351b0997C9046b51918b4876j88936N083
$$ plain form
18352 -208729 -13728 -62121 -1630 -106072 -140911 206694 329768 115358 -84 85656 116595
18341 116595 -28957 283617 -30153 -97377 170034 -141090 361830 -196516 -32126 -126479
18331 -126479 -257089 218267 -299049 -13474 -1129 97127 198888 -30853 33611 81625 113767
18320 113767 -6982 39678 -234442 -83552 -167775 -118383 -252749 -94559 131386 -109865 86812
18308 -349456 -61441 82996 -118024 -44122 -112569 15291 261062 -62137 -41152 330722 -251380
18296 109769 200474 -79061 -38617 -5034 127685 -92540 29075 -310145 -150335 -161434 -53810
18284 18088 -293157 114475 84226 -31405 128106 4101 -236170 -188724 278544 -238983 -150081
18273 -150081 -319145 -190419 -34965 -11960 27963 -221351 -404980 -82540 -178623 -338049
$$ packed form
18352b08729a3728m8393a630j04442l4839B06694J23074A15358h4H5656L0939
18341A16595b8957B83617c0153o7224A70034a41090C61830a96516c2126r4353
18331a26479j30610B18267b99049a3474a129I7127J01761c0853C3611M8014L2142
18320A13767f982C9678b34442h3552q4223M9392j34366i4559A31386a09865H6812
18308c49456f1441H2996a18024d4122o8447A5291K45771f2137K0985C30722b51380
18296A09769R0705g9061c8617e034A27685i2540B9075c10145a50335j1099e3810
18284A8088b93157A14475l0249c1405A28106D101b36170M7446B78544b38983Q8902
18273a50081j69064J28726c4965a1960B7963b21351j83629h2540r6083j59426
$$ plain form
18263 -338049 114953 -439269 -193869 85709 -165961 36875 -120130 -550759 -104352 7471
18252 -28974 234606 63209 -150222 -144610 -48686 -165293 -94622 176586 161845 -406410 -230340
18241 -230340 152957 -125390 337239 -76531 110128 -252483 -264176 -1099 101725 -119530
18230 -167618 3873 -61966 -128377 365293 14916 -107733 -140264 184004 38332 -324033 342810
18218 -32928 -161026 144636 -88242 38135 -101748 -63404 -238108 72170 -14294 55783 -104657
18206 -184106 129399 -40556 -48197 18737 337091 -159493 90816 5526 -295270 -178384 106522
18194 48823 -308254 -40756 -226638 -6836 11765 -84307 -176267 51686 -182154 -421015 -285531
18183 -285531 64698 -140527 89434 -64068 -25404 -10728 -312209 80621 -157337 -59027 -194478
$$ packed form
18263c38049A14953d39269a93869H5709a65961C6875a20130m30629a04352G471
18252b8974B34606F3209a50222N612d8686j16607P0671A76586j4741d06410J76070
18241b30340A52957a25390C37239g6531A10128b52483j1693a099A01725a19530
18230a67618C873f1966o6411C65293A4916a07733l2531A84004C8332c24033C42810
18218c2928j28098A44636h8242C8135a01748L8344j74704G2170a4294E5783a04657
18206a84106A29399d0556p641A8737L18354a59493I0816E526b95270J16886A06522
18194D8823c08254d0756j85882f836A1765h4307r1960E1686a82154k38861J35484
18183b85531F4698a40527H9434f4068b5404a0728l01481H0621a57337e9027j35451
$$ plain form
18172 -194478 -87424 -6181 117386 -179084 -15602 -12511 22833 -325071 -11571 -172499 -29878
18160 143592 -379644 197612 -8882 -80740 -211169 -286746 -597293 69927 136691 161582 318042
18149 318042 157299 -243364 173811 -43082 126411 23046 309445 -56845 -15618 128470
18138 87915 110290 196159 -188618 -295650 -152872 -189542 99031 -52435 -92946 -23092 71219
18126 422508 250431 -385218 -85730 213558 -201626 -93198 -234490 -92460 106106 348798
18116 348798 -65957 -98423 -65778 -45034 -49237 170805 -69114 -333569 -200425 -78296 -10179
18104 -195419 -177096 69152 276278 -334228 -136994 -166345 -5943 323697 221702 139971 8699
18092 31850 -309344 107113 40566 -77697 -142116 15401 -289932 202243 -752 21357 256423
$$ packed form
18172a94478h7424f181A17386a79084a5602L091B2833c25071a1571j60928b9878
18160A43592c79644A97612h882p1858j30429p5577l10547F9927O6764K4891J56460
18149C18042A57299b43364A73811d3082A26411B3046K86399e6845a5618A28470
18138H7915K2375Q5869a88618j07032J42778l6670I9031e2435m0511b3092G1219
18126D22508j72077c85218h5730B13558b01626i3198j41292i2460A06106K42692
18116C48798f5957l2466L2645K0744m203A70805f9114k64455J33144g8296a0179
18104a95419J8323F9152K07126c34228a36994k9351e943C23697j01995q1731H699
18092C1850c09344A07113D0566g7697o4419A5401b89932B02243g52B1357K35066
$$ plain form
18081 256423 87881 225379 -18728 -233221 42530 -90367 154218 -288249 82983 -35255 97613
18069 -62564 83499 30822 -302263 -50049 75967 -162828 -38891 -152246 -315319 34724 -175805
18057 44295 145335 4179 124495 -28700 -264316 -142641 -48637 -26343 -32236 -248889 -27115
18045 194548 146308 28192 104547 -475893 -235863 -138576 -239522 77370 -154601 286417
18034 152717 -357602 36851 -17647 110061 -193952 203590 259585 1942 85634 305162 47937
18022 -51065 -46427 138584 9753 194547 -102649 -139698 -103953 178251 -189506 117463 -93524
18010 218065 -230409 -71537 29535 -171710 2919 -257603 103945 171784 -326626 167465
17999 174560 -177097 122731 154779 -6767 76093 456822 -230278 -56006 -305556 -69908 47419
$$ packed form
18081B56423H7881J37498a8728k14493D2530i0367A54218b88249H2983c5255I7613
18069f2564H3499C0822c02263e0049G5967a62828c8891j13355j63073C4724a75805
18057D4295J01040D179J20316b8700k35616J21675d8637K2294n893k16653b7115
18045A94548m8240B8192P6355d75893b35863R7287j00946G7370a54601B86417
18034A52717c57602C6851a7647A10061a93952B03590N5995A942Q3692K19528D7937
18022e1065M638A38584I753J84794a02649l7049L5745A78251a89506A17463i3524
18010B18065b30409g1537B9535a71710B919b57603A03945O7839c26626A67465
17999A74560a77097A22731L2048f767G6093L80729b30278e6006k49550f9908D7419
$$ plain form
17987 -69992 -95204 -101221 -189798 -103475 148562 68952 -198022 -119300 -33118 217834 -43212
17975 -121795 99961 99961 -260319 105680 71865 233396 -61999 42683 -198375 23670 202817
17964 202817 -54966 55929 -223297 151450 208931 -137276 311760 -141418 153248 87458
17954 87458 -139078 -27019 79250 261680 -332924 28922 419852 201928 212578 139715 230634
17943 230634 82565 -137775 -250724 -58270 155505 99692 -201110 66077 -130998 -127242 220731
17931 -175404 36555 -87549 66550 -196142 -111930 9292 47605 122741 -200455 265654 -47970
17919 -394131 119917 9813 371954 -72442 49134 -385281 -154882 20556 -165790 -34933 -174236
17908 -174236 -41691 -178976 -161127 -48779 -19653 44118 272365 -26357 -61123 -16316 171045
$$ packed form
17987f9992k5212o017q8577Q6323A48562F8952a98022P8722c3118B17834d3212
17975a21795I9961%b60319A05680l3815J61531f1999D2683a98375B3670J79147
17964B02817e4966E5929b23297A51450N7481a37276C11760a41418A53248o5790
17954H7458a39078b7019G9250J82430c32924B8922L90930B01928J0650p2863R0919
17943B30634H2565a37775j12949e8270A55505n5813b01110F6077a30998L756B20731
17931a75404C6555h7549F6550a96142Q4212I292L8313P5136b00455B65654d7970
17919c94131A19917I813L62141g2442D9134c85281a54882B0556a65790c4933j39303
17908a74236d1691j37285J7849d8779a9653D4118K28247b6357l4766a6316A71045
$$ plain form
17896 124584 -127350 -32933 -20501 -59837 -117499 -97064 70827 196813 221022 -259177 70088
17884 200205 -228671 114714 60950 -257018 -14092 -88818 -336497 -3866 16431 122369 -195798
17872 -82219 -14307 172227 5747 -92348 309695 35697 -290204 -18880 -117486 13502 -145161
17860 -148790 -72421 273080 122792 20117 -38851 33223 -136648 -33391 -200004 30731 -175357
17848 83171 -48219 218447 30741 2527 199211 -104551 -11671 117523 140553 43322 106525
17837 106525 194209 -11694 12516 -56935 -148242 -72444 -526349 -75928 -19242 691 -72275 -17091
17824 -106063 8494 -58717 116468 -166525 -69508 -185775 -54874 -197725 254095 -127961
17813 13685 -45782 246111 38594 87349 -127758 150562 62507 -175477 122395 -34981 -28961
$$ packed form
17896A24584a27350c2933J2432l9336n7662K0435G0827J25986K4209b59177G0088
17884B00205b28671A14714n3764b57018a4092p4726k47679c866A6431J05938a95798
17872h2219a4307A72227E747i2348C09695C5697b90204a8880r8606A3502a45161
17860a48790g2421B73080A22792B0117c8851C3223a36648c3391j66613C0731a75357
17848H3171d8219B18447C0741B527J96684a04551a1671A17523K3030D3322O3203
17837A06525Q7684a1694A2516e6935r1307g2444m53905g5928a9242F91g2275a7091
17824a06063H494e8717A16468a66525f9508j16267e4874j42851B54095a27961
17813A3685d5782B46111C8594M8755a27758A50562F2507a75477A22395c4981O020
$$ plain form
17802 -28961 118082 -140422 20538 -244112 104886 237608 -46457 46837 121064 296056
17792 296056 146622 26783 127110 230522 -352091 -24465 91468 320652 38787 -23282
17781 254560 19581 -492426 127239 9874 509822 -98297 -248926 223368 324315 25864
17770 -201803 -185580 247436 176886 -39861 206570 -154873 -203004 241751 122897 185821
17760 185821 174615 123032 -120505 108604 153023 76996 -20814 -162256 -90924 -86984 193843
17748 44247 17134 57236 -87016 -203268 37915 374056 -142796 -351397 -52707 125117 96274
17737 96274 -98595 -206558 272698 11071 -73715 87056 -38729 167458 102573 157103 11019
17725 -29187 -170833 -105086 303697 -44299 -234131 68848 -33295 7702 222231 -290369 473475
$$ packed form
17802b8961A18082a40422B0538b44112A04886J32722d6457D6837P4227J74992
17792B96056A46622B6783J00327J03412c52091b4465I1468K29184C8787b3282
17781B54560A9581d92426A27239I874M99948i8297j50629B23368J00947B5864
17770b01803J6223B47436p0550c9861B06570a54873m8131B41751j18854O2924
17760A85821j1206n1583a20505A08604M4419p6027b0814j41442P1332L940A93843
17748D4247A7134M0102h7016j16252C7915L36141a42796k08601e2707A25117k8843
17737I6274i8595j07963B72698A1071g3715H7056c8729A67458o4885N4530A1019
17725b9187j41646O5747C03697d4299j89832F8848c3295G702K14529b90369D73475
$$ plain form
17713 3583 2437 81158 -201873 -202690 67211 -71943 252146 217407 56224 -43329 289786 90049
17700 214236 -247099 68780 150593 244570 69749 -259938 198184 21121 68762 -108048 -359179
17689 -359179 -111497 -48038 -79523 186096 -63362 -189384 68921 -153346 -45854 -198651
17679 -198651 -224347 333905 80267 179055 -139525 90755 46429 130819 80270 328980 -129803
17667 92585 23647 -95623 120660 -27799 245605 311796 -377053 -225307 46 -102223 -37426
17655 172012 -153817 115363 -137145 -290186 -451 239306 -166666 -212884 67809 -50856 276623
17643 -5222 474254 -74267 -18959 -43844 238885 -191792 -216625 -422493 90899 -159381 -279210
17632 -279210 -106036 115301 -98837 -213550 131247 -74047 -211751 -98704 200386 209212
$$ packed form
17713C583j146P8721b01873q17F7211g1943B52146l4739E6224d3329B89786I0049
17700B14236b47099F8780Q1813R3977F9749b59938A98184B1121M7641a08048k51131
17689c59179a11497d8038l1485A86096f3362j26022F8921a53346d5854j52797
17679a98651k5696C33905H0267R8788a39525I0755m4326Q4390n0549K48710a29803
17667I2585B3647i5623A20660b7799B45605O6191c77053J51746D6a02223c7426
17655A72012a53817A15363a37145j53041d51B39306a66666m6218F7809e0856B76623
17643e222D74254g4267a8959k4885B38885a91792k4833k05868I0899a59381j19829
17632b79210a06036A15301i8837j14713A31247g4047j37704i8704B00386Q826
$$ plain form
17622 209212 13511 -220127 -114134 -139581 6321 10979 -101148 -324706 1556 -52058 99965
17610 22507 182971 20939 -11744 21769 -192981 410269 20160 -31490 55699 33345 -340223
17598 220545 71812 52363 72401 -90202 -275845 303786 16832 277071 346 137204 -18046
17586 459197 -45419 -245535 -47680 410330 -129155 405380 140463 259086 -8697 31811
17575 -82756 242168 209912 100718 -22830 39283 -224432 115852 -119648 202567 -156335
17564 151715 373588 80597 -21825 257934 -25299 210677 -13832 138178 155505 38871 54228
17553 54228 344524 203200 138368 -228640 244827 -51283 224724 -83429 175573 209647
17543 209647 86429 97007 -14452 -295328 -167814 -174757 -100925 -5585 242881 279686 98224
$$ packed form
17622B09212A3511b20127J05993k5447F321M658a01148k23558A556e2058I9965
17610B2507J60464B0939a1744B1769a92981D10269B0160c1490E5699k2354c40223
17598B20545G1812j9449K0038i0202j85643C03786A6832K60239C46J36858a8046
17586D59197d5419k00116d7680D10330a29155D05380A40463J18623h697C1811
17575h2756B42168l2256A00718b2830C9283b24432A15852a19648B02567a56335
17564A51715K21873H0597b1825B57934b5299B10677a3832A38178J7327C8871J5357
17553E4228K90296j41324o4832b28640B44827e1283B24724h3429A75573L4074
17543B09647H6429J0578a4452k80876J27514o943P3832e585B42881L6805I8224
$$ plain form
17531 -11952 83743 41391 124951 204466 39735 -66044 89171 -216667 112382 -1520 73081
17519 72275 196220 17478 250214 -292606 84301 -22369 -31920 -105613 166387 -44939 -169660
17508 -169660 75751 455928 192111 -64221 48298 140288 35081 -309894 252498 -58212 -76270
17497 -76270 323426 -239042 -268286 220324 176361 61188 -143806 330369 433470 133413
17486 288600 172367 262769 175254 311928 -221335 218787 199676 -1767 125095 -80418 219466
17474 120563 -174638 -154769 218591 9902 -10490 140216 60534 152558 256000 -60715 -72277
17463 -72277 -182453 30827 31089 294958 86347 51202 385135 360209 222309 23058 112439
17452 112439 210250 315996 76320 -73062 406875 318968 146340 -37061 333079 276793 -11501
$$ packed form
17531a1952H3743D1391Q3560P9515C9735f6044H9171b16667A12382a520G3081
17519G2275J23945A7478K32736b92606H4301b2369r551p3693A66387d4939j24721
17508a69660G5751L80177A92111f4221D8298R1990C5081c09894B52498e8212j8058
17497g6270C23426b39042k9244B20324m3963F1188a43806C30369J03101A33413
17486B88600j16233R0402q7515J36674b21335B18787j9111a767A25095h0418B19466
17474A20563a74638J9869B18591I902a0490A40216F0534R2024J03442f0715j1562
17463g2277j10176C0827K62K63869H6347l5145L33933k4926j37900B3058Q9381
17452A12439R7811J05746G6320g3062D06875q7907A46340c7061C33079n6286a1501
$$ plain form
17440 541769 13483 326424 -66119 11536 437777 -26038 462645 274211 433960 230306
17430 230306 94445 275918 -15973 -79651 199742 206374 236718 1365 403297 347422 143184
17418 -167418 223701 280090 344560 537211 19747 306808 149677 222355 108651 100869 375215
17407 375215 -58190 -149648 242813 -52828 -162819 -57001 287764 414960 28476 149750
17397 149750 -198684 200350 198495 246796 139349 -158215 -48993 86098 366542 -63555 -56222
17386 -56222 2805 141687 -71267 356307 61815 284756 415436 96884 -226189 -94680 -37342
17374 345827 288767 168726 126396 377700 58656 382490 248500 -131564 -84556 279518
17363 178220 28258 355732 351476 -14988 69821 -151237 168033 328949 130579 356833
$$ packed form
17440E41769A3483L12941f6119A1536M26241b6038D62645j88434J59749k03654
17430B30306I4445J81473a5973o3678A99742O632L0344A365M01932n5875A43184
17418a67418B23701N6389O4470J92651A9747K87061A49677P2678A08651p782K74346
17407C75215e8190r1458B42813e2828j09991e7001B87764J27196B8476J21274
17397A49750a98684B00350j855M8301j07447a58215d8993H6098K80444f3555P333
17386e6222B805J38882g1267C56307F1815K22941J30680I6884b26189i4680c7342
17374C45827n7060j20041m2330K51304E8656L23834j33990a31564M7008B79518
17363A78220B8258L27474m256a4988F9821a51237A68033J60916A30579K26254
$$ plain form
17353 356833 -21108 68764 45752 211018 169600 223264 112156 525940 105444 -120251
17342 -163227 54236 406302 -172788 346999 351006 14819 195964 140307 356049 345073 -136338
17330 282251 414579 219749 318122 262497 154938 353167 99441 282839 10952 55865
17320 55865 -24527 -59535 43286 262163 -58529 116497 -15050 293609 218146 292734 21851
17308 150849 47879 198773 107242 337773 135258 -249333 112417 -31187 309659 90329
17297 24261 -80565 604327 154168 326718 17095 303952 -78628 191068 190733 16635 40105
17286 40105 -98599 334284 81698 328799 -64713 101262 52572 142537 17904 28729 244472
17275 244472 275153 396521 460821 280327 59847 241855 157513 176042 8158 159838 -75382
$$ packed form
17353C56833b1108F8764k3012J65266m1418N3664j11108M13784A05444a20251
17342a63227E4236L52066a72788C46999M007A4819J81145n5657K15742j0976a36338
17330B82251J32328j94830R8373n5625j07559J98229I9441J83398A0952M4913
17320E5865b4527l5008D3286K18877e8529A16497a5050B93609p5463P4588B1851
17308A50849D7879J50894r1531K30531A35258b49333A12417c1187C09659I0329
17297B4261h0565F04327A54168J72550A7095K86857g8628A91068l35A6635K3470
17286D0105i8599C34284H1698K47101f4713A01262m8690Q9965A7904J0825K15743
17275B44472L0681J21368O4300j80494E9847J82008q4342J8529H158J51680g5382
$$ plain form
17263 98149 332594 24346 314967 153896 222036 162554 193106 236362 354304 33968 250964
17252 250964 106021 -37179 20836 208056 314341 186624 253262 438198 378009 295675
17242 295675 -90569 155851 46354 78958 160699 -233307 4408 99915 60281 178016 171887
17231 171887 227507 52056 246173 274694 225136 155354 337596 735858 225119 78040 59615
17220 59615 156434 214895 15204 93524 136899 329420 1843 127826 90770 490259 377670
17209 377670 292892 262789 421968 200811 453584 379224 230166 407721 161027 292173
17199 292173 173549 241501 195565 115531 189714 167130 358106 41733 168352 312322 424552
17188 424552 508922 237421 -12770 146583 511709 184854 203778 150862 131672 769233
$$ packed form
17263I8149K34445B4346K90621A53896O8140n9482L0552M3256J17942C3968K16996
17252B50964A06021c7179B0836J87220J06285j27717O6638J84936o0189q2334
17242B95675i0569A55851D6354L2604Q1741b33307D408R5507l9634J17735o129
17231A71887N5620E2056J94117K8521m9558o9782J82242L98262B25119G8040j8425
17220E9615R6819N8461A5204P8320M3375J92521A843J25983l7056L99489j12589
17209C77670q4778l0103J59179B00811K52773p4360j49058J77555A61027J31146
17199B92173j18624O7952m5936q0034P4183k2584J90976D1733J26619J43970J12230
17188D24552Q4370B37421a2770A46583L65126A84854J8924n2916j9190O37561
$$ plain form
17178 769233 240378 34678 -48272 -86475 193122 387834 357656 154745 283052 -72333
17167 131551 400210 51485 301731 195535 378296 -264501 387744 368240 188252 34066
17156 163513 314995 360209 498881 558850 574398 116674 90746 453914 200758 406495
17146 406495 67816 20880 166211 268032 11037 258376 264647 265418 298358 253640 197467
17135 197467 330498 -60619 506021 219328 251978 427978 433621 429371 295309 -76766 159931
17123 -169643 332488 517143 64277 549538 414682 320708 440900 370833 751422 763258
17113 763258 214875 501299 516344 370683 334688 107388 327783 249783 540193 128612
17102 93736 390851 533461 73873 189240 208335 170969 381981 537970 311148 238218
$$ packed form
17178G69233B40378C4678d8272l8203A93122J94712l0178A54745J28307g2333
17167A31551K68659E1485K50246j06196J82761b64501C87744j9504j79988C4066
17156A63513J51482M5214J38672N9969J5548A16674k5928L63168B00758K05737
17146D06495F7816B0880J45331J01821A1037K47339O271P71L2940m4718n6173
17135A97467J33031f0619E06021B19328L2650J76000N643m250j34062g6766A59931
17123a69643C32488J84655F4277M85261j34856r3974J20192p0067L80589J1836
17113G63258B14875K86424J5045j45661l5995A07388K20395p8000K90410A28612
17102I3736K97115J42610G3873J15367J9095l7366K11012J55989k26822p2930
$$ plain form
17092 238218 319116 239210 283002 178030 84083 587060 399493 398445 353518 528421 -48432
17080 371159 503186 203595 314897 371332 171161 506881 605097 428355 543660 340124
17070 340124 451103 463904 384687 270770 584610 435691 534789 92367 730714 333241
17059 429149 481264 633763 446972 115030 599334 494811 626564 650686 502640 278342
17049 278342 546187 549123 575021 785359 419467 275594 480137 502262 227250 573374
17039 573374 463839 866688 284488 276353 339258 475633 653982 627495 288554 585057
17029 585057 532734 528052 657644 491798 582930 252713 1063766 421732 624521 777003
17019 777003 369534 387839 242521 302821 921839 432977 621714 522503 370294 382669
$$ packed form
17092B38218Q0898p9906M3792j04972H4083N02977j87567j048m4927J74903d8432
17080C71159J32027B03595J11302N6435A71161L35720R8216j76742J15305k03536
17070C40124J10979J2801p9217j13917L13840j48919R9098I2367O38347C33241
17059D29149N2115J52499j86791A15030M84304j04523J31753K4122j48046k24298
17049B78342K67845K936K5898K10338l65892j43873K04543K2125B27250L46124
17039E73374j09535M02849B84488q135O2905J36375J78349k6487B88554K96503
17029E85057n2323m682J29592j65846R1132B52713Q11053D21732K02789J52482
17019G77003C69534J8305j45318O0300O19018D32977J88737r9211j52209J2375
$$ plain form
17009 382669 807259 333572 740850 698550 948716 478817 732550 804195 525186 684532
16999 684532 553532 747189 709214 420082 617751 630434 567469 667474 902534 772464
16989 772464 728749 797360 870639 882786 583283 587371 942823 789324 541450 417984 715174
16978 715174 861321 622391 869552 811686 672306 591810 680048 670367 1035300 560910
16968 560910 822790 664053 784259 1104953 798442 590611 958364 937023 644191 891741
16958 891741 899573 755312 873398 949158 877297 1034129 958081 1015923 842755 964671 840484
16947 840484 885224 729436 904466 1089161 787681 1012535 1243310 845950 854268 1032049
16937 1032049 1077302 1012303 896338 1111228 1163649 1100776 989549 909013 1218277 1136782
$$ packed form
17009C82669M24590C33572M07278m2300K50166m69899K53733P1645k79009J59346
16999F84532j31000J93657l7975k89132J97669J2683o2965J00005K35060j30070
16989G72464m3715O8611P3279J2147k99503M088L55452j53499k47874j23466K97190
16978G15174J46147k38930K47161n7866j39380q0496Q8238r681L64933m74390
16968E60910K61880j58737J20206L20694l06511k07831L67753k1341k92832K47550
16958H91741P832j44261J18086P5760p1861J56832p6048N7842j73168J21916j24187
16947H40484M4740j55788J75030J84695l01480K24854K30775l97360Q318J77781
16937A032049M5253o4999j15965K14890N2421o2873j11227q0536L09264q1495
$$ plain form
16927 1136782 1051739 1314188 1013940 1094975 1267857 1334760 1447001 1256430 1727315 1465678
16917 1465678 1227086 1522224 1301460 1270509 1037433 1583270 1329561 1445600 1266166 1395708
16907 1395708 1374731 1607499 1346851 1765711 1837179 1494480 1545264 1706971 1744226 1273888
16897 1273888 1689924 1358187 1648194 1749962 1828501 1698611 2028237 1756763 1845703 1765520
16887 1765520 1933512 1712040 2119858 1938653 1593529 1887109 1943398 2107774 1800420 1900092
16877 1900092 2053024 2511611 1884086 2262244 2089498 2558927 2297493 2209919 2216523 2267901
16867 2267901 2387858 2426312 2559196 2494064 2675774 2349148 2680978 2574985 2642930 2426618
16857 2426618 2941682 2827800 2581151 2796579 3017255 3218068 2874734 2915059 3019506 2929509
$$ packed form
16927A136782q5043K62449l00248Q1035J72882O6903J12241j90571M70885k61637
16917A465678k38592K95138k20764l0951k33076N45837k53709J16039j79434J29542
16907A395708k0977K32768k60648M18860P1468l42699N0784J61707L7255m70338
16897A273888M16036l31737K90007J01768P8539j29890L29626k71474Q8940q0183
16887A765520J67992k21472M07818j81205l45124K93580N6289J64376l07354R9672
16877A900092J52932M58587o27525L78158j72746M69429k61434q7574O604N1378
16867B267901J19957L8454J32884o5132J81710l26626L31830j05993O7945k16312
16857B426618N15064j13882k46649K15428K20676K00813l43334M0325J04447q9997
$$ plain form
16847 2929509 3182750 3267190 3459251 3344178 3130185 3182686 3297496 3300184 3574541 3492079
16837 3492079 3303857 3592041 3672672 3858735 3821837 3968788 3959635 4150192 4015740 4094474
16827 4094474 4441810 4388000 4212956 4540446 4821394 4703193 4708013 4999122 4980098 4919767
16817 4919767 5196762 5213290 5329451 5583185 5587346 5742719 5967018 5899242 6017403 6250697
16807 6250697 6088818 6594496 6466286 6198229 6996977 6941761 7220269 7281757 7714354 7587900
16797 7587900 7939710 7983435 8478137 8300452 8335248 9071544 9426241 9409569 9921195 9754936
16787 9754936 10015116 10230866 10764381 11132076 11343482 11809156 11936411 12428566 12790341
16778 12790341 13119722 13494719 14185276 14559132 15038904 15500516 15899705 16623978 17448261
$$ packed form
16847B929509K53241Q4440J92061j15073k13993N2501J14810K688K74357q2462
16837C492079j88222K88184Q0631J86063l6898J46951r153J90557j34452P8734
16827D094474L47336n3810j75044L27490K80948j18201M820K91109j9024o0331
16817D919767K76995J6528J16161K53734M161J55373K24299o7776J18161K33294
16807F250697j61879N05678j28210k68057P98748n5216K78508O1488M32597j26454
16797G587900L51810M3725M94702j77685L4796P36296L54697j6672N11626j66259
16787I754936K60180K15750N33515L67695K11406M65674J27255M92155L61775
16778A2790341L29381L74997O90557L73856M79772M61612L99189P24273Q24283
$$ plain form
16769 17448261 17708387 18193278 18818377 19803978 20198672 21098977 21961295 23190268 23788076
16760 23788076 24878391 25834401 26852658 27997450 29196335 30422323 32054040 33318177
16752 33318177 35153490 36722046 38492275 40296179 41958089 44547187 46966307 49351966
16744 49351966 52058768 55041707 58414074 61347918 64853968 68895457 72652360 77371278
16736 77371278 82211572 87474664 92916601 98830276 105428792 112206440 119797573 127319095
16728 127319095 135394635 143846727 152477302 161062831 169796377 178398895 186649276 194437246
16720 194437246 201110736 206936914 211217421 214255048 215481545 215302821 213428371 210189905
16712 210189905 205154642 199218352 192442986 184460582 175802220 167366410 158384597 149702023
$$ packed form
16769A7448261K60126M84891O25099R85601L94694R00305Q62318J228973N97808
16760B3788076J090315R56010J018257J144792J198885J225988J631717J264137
16752C3318177J835313J568556J770229J803904J661910K589098K419120K385659
16744D9351966K706802K982939L372367K933844L506050M041489L756903M718918
16736G7371278M840294N263092N441937N913675O598516O777648P591133P521522
16728A27319095Q075540Q452092Q630575Q585529Q733546Q602518Q250381P787970
16720A94437246O673490N826178M280507L037627J226497j78724j874450l238466
16712B10189905n035263n936290o775366p982404q658362q435810q981813q682574
$$ plain form
16704 149702023 140603950 132331143 124111133 116231015 109214494 102093920 96059535 89723810
16696 89723810 84215419 79146214 74145175 69990435 66102298 61740865 58031653 55195794
16688 55195794 51833562 48935037 46790377 44194687 41831255 39564209 37890013 36059899
16680 36059899 34095986 32779641 31028585 29451560 28692750 26941612 25893134 24622608
16672 24622608 23915783 22942692 22061946 21290782 20533287 19323448 18794033 18277444 17244341
16663 17244341 16872752 15875211 15547749 15278822 14674638 14254427 13733965 13236279 12969364
16654 12969364 12483528 12194824 11373542 11270942 11099079 10617052 10264645 10058406 9852490
16645 9852490 9367822 9409469 9106306 8576218 8545721 8257832 8163097 8113890 7747191 7483147
$$ packed form
16704A49702023r098073q272807q220010p880118p016521p120574o034385o335725
16696H9723810n508391n069205n001039m154740l888137m361433l709212k835859
16688E5195794l362232k898525k144660k595690k363432k267046j674196j830114
16680C6059899j963913j316345j751056j577025p58810j751138j048478j270526
16672B4622608p06825r73091q80746p71164p57495j209839n29415n16589j033103
16663A7244341l71589r97541l27462k68927o04184m20211n20462m97686k66915
16654A2969364m85836k88704q21282j02600j71863m82027l52407k06239k05916
16645I852490m84668M1647l03163n30088l0497k87889r4735m9207l66699k64044
$$ plain form
16635 7483147 7363209 7289967 6938026 6912620 6858046 6358034 6380293 6199137 6175837 5949677
16625 5949677 5481820 5657361 5497839 5486924 5159547 5012595 4829422 4978292 4574707 4707267
16615 4707267 4677651 4903301 4265555 4638809 4422133 4096517 4146154 4197496 3611991 3626230
16605 3626230 4070393 3684129 3767699 3542957 3692973 3458626 3426429 3296833 3344693 3375039
16595 3375039 3156513 3093784 3071133 3050015 3047179 2513922 2541091 2716844 2500598 2590440 2796185
16584 2796185 2605498 2575272 2584918 2414364 2541247 2385899 2745806 2373615 2307332 2362288
16574 2362288 2041031 2140762 2130329 2457463 2229004 2161825 2253183 1505154 2187527 1759214
16564 1759214 2129134 1897421 2031038 1547822 1956553 1892981 1956059 1663173 1732655 1681668
$$ packed form
16635G483147j19938p3242l51941k5406n4574n00012K2259j81156k3300k26160
16625E949677m67857J75541j59522j0915l27377j46952j83173J48870m03585J32560
16615D707267k9616K25650o37746L73254k16676l25616M9637N1342n85505J4239
16605C626230M44163l86264Q3570k24742J50016k34347l2197j29596M7860L0346
16595C375039k18526o2729k2651k1118k836n33257K7169J75753k16246Q9842K05745
16584B796185j90687l0226R646j70554J26883j55348L59907l72191o6283N4956
16574B362288l21257R9731j0433L27134k28459o7179R1358p48029O82373m28313
16564A759214L69920k31713J33617m83216M08731o3572O3078k92886O9482n0987
$$ plain form
16554 1681668 1754305 1850602 1556911 1913511 1431343 1685146 1540160 1482603 1419523 1413253
16544 1413253 1846576 1201533 1498693 1479146 980521 1685374 1286553 1445275 1284996 1489249
16534 1489249 1186493 1319656 1304623 979279 1534877 1416699 1499144 1200896 1305764 1235243
16524 1235243 1184580 1194816 1033027 1428002 1282814 1269232 1191534 947090 979773 1317500
16514 1317500 1022273 1124987 1250602 1131629 1029966 1186504 1040553 1081613 866124 902172
16504 902172 738688 1105712 1088807 1135462 1061735 1030491 1015640 1187735 886811 763760
16494 763760 799083 785105 741558 673164 746027 833539 1082061 638474 802468 972882 825760
16483 825760 743402 927966 618302 1078108 514044 738153 514897 497925 976511 789824
$$ packed form
16554A681668P2637R6297k93691L56600m82168K53803j44986n7557o3080o270
16544A413253M33323o45043K97160j9547m98625P04853l98821J58722j60279K04253
16534A489249l02756J33163j5033l25344N55598j18178Q2445k98248J04868p0521
16524A235243n0663J0236j61789L94975j45188j3582p7698k44444L2683L37727
16514A317500k95227J02714J25615j18973j01663J56538j45951M1060k15489L6048
16504I02172j63484L67024j6905M6655p3727l1244j4851J72095l00924j23051
16494G63760L5323j3978m3547o8394P2863Q7512K48522m43587J63994J70414j47122
16483H25760q2358J84564l09664M59806E14044K24109k23256j6972M78586j86687
$$ plain form
16473 789824 590748 739340 978308 567837 706163 697602 1093547 592724 574724 607743
16463 607743 499431 590678 824179 632064 834469 432749 1083829 474481 711379 707917
16453 707917 615973 269638 382791 561152 853562 867924 609394 776142 425368 379277
16443 379277 399252 456465 545136 156990 330914 416779 543210 724265 445731 638098
16433 638098 700977 141426 503139 351507 96537 315278 444064 247159 396544 362854
16423 362854 416049 565681 449342 350417 477829 252746 401130 615276 210256 485294
16413 485294 353999 891837 314856 533331 644293 406834 693325 195708 349758 491898
16403 491898 443225 225155 392713 265080 242710 680333 408570 579040 171165 532683
$$ packed form
16473G89824j99076J48592K38968m10471J38326q561L95945n00823j8000L3019
16463F07743j08312R1247K33501j92115K02405m01720O51080D74481K36898l462
16453G07917r1944B69638J13153J78361K92410J4362k58530J66748l50774m6091
16443C79277J9975N7213Q8671A56990J73924Q5865J26431J81055k78534J92367
16433F38098O2879A41426L61713j51632I6537K18741J28786j96905J49385l3690
16423C62854N3195J49632j16339r8925J27412k25083J48384K14146B10256K75038
16413D85294j31295N37838C14856K18475J10962k37459K86491A95708J54050J42140
16403D91898m8673k18070J67558j27633k2370M37623k71763J70470A71165L61518
$$ plain form
16393 532683 -82264 180534 275408 590851 744705 210559 86356 789743 266162 601199
16383 601199 303987 382995 412005 554461 13225 445600 607127 -122476 456690 503317
16373 503317 490186 689627 586051 428909 327612 516330 302386 58460 204014 323172
16363 323172 192745 394570 297700 106935 428264 531427 408542 298013 596198 233486
16352 123478 693545 299326 286891 130796 286851 773133 210796 208619 -45978 -79702
16342 -79702 -123458 341411 613123 677751 321634 322384 339959 161298 146007 273281 340759
16331 340759 100125 65386 257891 289996 432404 439930 456268 362005 136908 321427 344813
16320 344813 164594 370538 462194 223404 545029 294647 387637 -21333 330313 223977
$$ packed form
16393E32683h2264A80534R4874L15443J53854B10559H6356P03387B66162L35037
16383F01199k97212P9008K9010J42456A3225M32375J61527a22476D56690M6627
16373E03317j3131J99441j03576j57142j01297J88718k13944E8460J45554J19158
16363C23172j30427K01825r6870A06935L21329J03163j22885j10529K98185B33486
16352A23478N70067B99326j2435A30796J56055M86282B10796k177d5978l3724
16342g9702m3756C41411K71712O4628C21634P50J7575A61298j5291J27274O7478
16331C40759A00125l4739J92505L2105J42408P526J6338r4263A36908J84519K3386
16320C44813A64594K05944R1656B23404L21625k50382R2990b1333C30313j06336
$$ plain form
16310 223977 816315 353118 102953 -15450 483529 317703 375147 127232 81251 236355
16300 236355 261371 393197 795676 453273 155498 55220 26251 475348 516106 381191
16290 381191 364870 -72971 58973 129643 126423 -122937 177805 439783 471089 143412 240115
16279 240115 402683 217907 157953 91880 251413 301728 111242 16307 429321 315943
16269 315943 322109 157894 57905 162022 -14561 166277 -808 -141631 159481 191181 141430
16258 141430 64103 321316 341195 -101257 347121 210205 240379 38618 -37995 28097 -45686
16246 -215449 294490 109936 74652 413339 277879 398808 444865 311108 291769 -14192
16235 177722 159949 -50429 24906 -16816 116860 120148 53005 -295283 189729 -2027 336849
$$ packed form
16310B23977N92338C53118A02953a5450D83529j65826N7444A27232m5981J55104
16300B36355K5016J31826M02479l42403A55498E5220B6251M49097M0758j34915
16290C81191j6321g2971E8973P0670l220a22937A77805K61978L1306A43412R6703
16279B40115J62568j84776n9954o6073J59533N0315A11242A6307M13014j13378
16269C15943O166A57894E7905J04117a4561A66277h08j40823A59481L1700m9751
16258A41430F4103K57213J9879a01257C47121j36916L0174C8618c7995B8097d5686
16246b15449B94490A09936l5284L38687j35460J20929M6057j33757j9339a4192
16235A77722j7773e0429B4906a6816A16860L288E3005b95283A89729b027C36849
$$ plain form
16223 -27049 354253 456239 -119425 -70702 -88552 102662 174785 81104 276658 -670 132914
16211 259111 314865 192449 113877 152406 -41450 363445 -116889 -3370 352353 275448 140952
16200 140952 -8428 181624 334913 364311 277291 221051 238386 -170006 12674 -70168 -141480
16189 -141480 229731 -10584 -690 -224368 -26162 -115989 282265 254207 139995 371260 29456
16177 214414 147319 -29308 -114353 -176847 26030 78218 -4939 -86157 -341220 202395 -313306
16165 222751 -33512 183253 -141151 166024 134872 366735 -244325 61977 243868 20230
16154 252006 -9334 266542 -109122 -34550 63841 292798 187158 -29767 56528 -65039 380720
16142 -294915 -130859 19617 301459 207024 218053 319420 -42747 214626 110083 238142
$$ packed form
16223b7049C54253J01986a19425M8723j7850A02662P2123H1104J95554f70A32914
16211B59111N5754j22416p8572L8529d1450C63445a16889c370C52353p6905j34496
16200A40952h428A81624J53289K9398q7020n6240J7335a70006A2674g0168p1312
16189a41480B29731a0584f90k23678b6162q9827B82265k8058j14212K31265B9456
16177B14414o7095b9308q5045o2494B6030N2188d939q1218k55063B02395c13306
16165B22751c3512A83253a41151A66024l1152K31863b44325F1977J81891B0230
16154B52006i334B66542a09122c4550F3841K28957j05640b9767E6528f5039C80720
16142b94915a30859A9617K81842r4435J1029J01367d2747B14626j04543J28059
$$ plain form
16132 238142 166271 150890 -193342 -73028 -65288 -186796 260659 -140461 133781 -57840 -27459
16120 -287111 291843 -78415 -30417 -152915 -45017 -92473 -233009 -61950 -258839 22090 197477
16109 197477 -37027 44062 213572 308123 69364 -38995 -98487 250614 87640 86825 -119527
16097 98807 24612 -107353 -518831 173681 -329071 -3818 44133 -108866 42139 188726 -64925
16085 139216 202071 13273 241312 45163 -163041 -134571 221899 -508905 74917 -12174 45294
16073 -421211 313805 -167544 127454 -361841 -170706 39002 -244690 -372599 -175000 64301
16062 348879 -120262 -58046 -114174 -333530 -99266 20618 -47026 -11419 -147857 -7926 142746
16050 134302 -121352 -143837 40267 46401 -176796 -53894 -51197 28130 197490 105844 -105154
$$ packed form
16132B38142p1871j5381a93342g3028P740j21508B60659a40461A33781e7840b7459
16120b87111B91843g8415c0417j22498d5017m7456j40536f1950j96889B2090J75387
16109A97477c7027D4062J69510R4551F9364c8995n9492B50614H7640q15a19527
16097I8807B4612a07353m11478A73681c29071c818D4133a08866D2139J46587f4925
16085A39216O2855A3273K28039D5163a63041K8470B21899e08905G4917a2174D5294
16073d21211C13805a67544A27454c61841a70706C9002b44690j27909a75000F4301
16062C48879a20262e8046n6128k19356i9266B0618d7026a1419j36438g926A42746
16050A34302a21352k2485D0267O134a76796e3894K697B8130J69360r1646a05154
$$ plain form
16038 170990 -94192 21940 -269542 -125887 -49470 -25312 -363370 -367785 13873 157187 -153374
16026 73700 315152 -170864 181095 -16465 -232270 -38562 -195695 100269 -211032 119569
16015 -44828 -304559 43715 101196 -176884 -76408 -394783 -47273 393090 46711 102897 289175
16004 289175 62735 115013 175122 -32903 247725 -90977 -234606 -134877 188800 2597 171495
15993 171495 -202613 -25787 361450 357063 547482 103543 220204 11167 -64068 166319
15982 245199 -68369 54106 515104 338856 445156 -69168 -1487 278641 -106790 -224207
15972 -224207 131117 -148201 -219211 -242849 -406796 62537 -42127 62042 -164752 -214388 -84334
15960 -286776 390410 -160812 72822 149005 -70480 -55258 -136089 116356 -227870 229463
$$ packed form
16038A70990i4192B1940b69542a25887d9470K4158l38058m415A3873J43314a53374
16026G3700K41452a70864A81095a6465k15805c8562j57133A00269b11032A19569
16015d4828k59731D3715N7481a76884g6408l18375d7273C93090D6711N6186J86278
16004B89175F2735N2278O0109c2903B47725i0977j43629R9729A88800B597J68898
15993A71495b02613b5787C61450m387J90419A03543J16661A1167f4068A66319
15982B45199f8369E4106M60998j76248J06300f9168a487B78641a06790j17417
15972b24207A31117a48201p1010k3638j63947F2537d2127F2042a64752m9636h4334
15960b86776C90410a60812G2822P6183g0480J5222q0831A16356b27870B29463
$$ plain form
15949 -149599 -213 -84331 207148 310101 -82048 -230577 6926 -340807 -325459 110450 249425
15938 249425 -242337 -572739 38859 84448 -13466 75692 195409 305175 -4931 -239910 -103676
15926 56096 -132927 -106294 188611 31673 -219101 -123753 -193889 -43642 -235186 208384 -154487
15914 -113956 -273569 151941 -81629 -263958 178564 116063 -232965 -194436 211418 72927
15903 39576 -172906 -120166 -29280 151896 22437 -29933 39686 -236853 -172051 321288 186861
15892 186861 -46724 -208485 51024 -281713 -466354 302235 311082 -125475 63554 83004 202108
15881 202108 -212338 -104292 113721 111930 -28207 92364 -202184 -73990 -281137 -266377 -246769
15870 -246769 2939 144111 -143506 -78901 47793 -250835 154663 -95468 111388 -215595
$$ packed form
15949a49599b13q4118B07148J02953h2048j48529F926c40807J5348A10450J38975
15938B49425b42337l30402C8859M5589a3466G5692J19717J09766d931k34979a03676
15926E6096a32927K6633A88611C1673b19101R5348p0136d3642j91544B08384a54487
15914a13956j59613A51941h1629j82329A78564o2501b32965L8529B11418G2927
15903C9576a72906N2740b9280A51896B2437b9933C9686b36853O4802C21288j34427
15892A86861d6724j61761E1024b81713j84641C02235Q847a25475F3554J9450J19104
15881B02108b12338a04292A13721j791b8207I2364b02184g3990k07147J4760J9608
15870b46769B939J41172a43506O4605D7793b50835A54663i5468A11388b15595
$$ plain form
15859 96564 -91311 -276386 56923 68494 -186306 152286 -517779 -287179 230845 60379
15848 116276 144746 323785 -1054 31438 -385490 -341051 56145 90502 -132621 -342610 -352611
15837 -352611 -125952 142804 44961 8197 226580 28978 -67371 -2558 -4251 -84890 -195206
15826 -195206 62435 122075 -86354 -109089 -165448 -141801 275129 -223877 -192195 -65978 43900
15814 375922 -224103 -149327 -14064 98662 77987 -340828 -304829 -181776 350761 -210436
15803 -165096 -198144 -378172 -356672 51033 -109561 302472 -53954 48239 -381450 106292
15792 -308435 237449 29295 38938 -234602 -78689 129290 -107986 135072 -22330 -75526 28918
15780 -146123 294655 117755 109418 -329697 -181391 -53803 -249400 -145419 266050 -355587
$$ packed form
15859I6564i1311j85075E6923J1571a86306A52286e17779K30600B30845F0379
15848A16276K8470J79039a054C1438c85490M4439E6145L4357a32621k09989j0001
15837c52611a25952A42804D4961H197K18383B8978f7371b558j693q0639j10316
15826a95206F2435N9640h6354k2735n6359K3647B75129b23877L1682f5978D3900
15814C75922b24103P4776a4064I8662k0675c40828L5999J23053C50761b10436
15803a65096l3048j80028K1500E1033a09561C02472e3954D8239c81450A06292
15792c08435B37449B9295R643b34602g8689A29290a07986A35072b2330n3196B8918
15780a46123B94655A17755q337c29697J48306e3803j95597J03981B66050c55587
$$ plain form
15769 -4468 147280 110043 28484 -116887 -69232 -50963 21279 -120617 -132582 -26676 168102
15757 35140 23928 35400 1704 -131313 -111308 98593 -139588 74610 -35734 138409 -37141
15745 118309 -17442 -264084 212173 40488 139162 -80818 -155786 269328 -395588 256141
15734 -253804 -254994 3234 252240 -49576 -230547 183107 83630 -76902 -238398 236704 -201237
15722 5278 -46848 30103 123746 -205234 -49222 61289 -4126 -297915 32569 -109158 12791
15710 -151853 -177071 -1607 -231523 -75862 -137862 32734 -14750 -242172 112214 388430 50068
15698 47891 102093 173895 101789 -381843 -200657 -278883 48310 -131802 -122372 -15034 -116640
15687 -116640 -283037 24716 -32085 -119514 104023 70081 -213306 -92408 132507 32947 354124
$$ packed form
15769d468A47280l7237B8484a16887M7655J8269B1279a20617j1965b6676A68102
15757C5140j1212J1472A704a31313K0005I8593a39588G4610c5734A38409c7141
15745A18309a7442k46642B12173D0488R8674h0818p4968B69328c95588B56141
15734b53804j190C234K49006d9576j80971A83107H3630g6902j61496B36704b01237
15722E278d6848C0103R3643b05234d9222F1289d126k93789C2569a09158A2791
15710a51853k5218a607k29916g5862o2000C2734a4750k27422A12214K76216E0068
15698D7891N4202P1802p2106c81843J81186p8226D8310a31802R430a5034j01606
15687a16640j66397B4716c2085q7429A04023l3942b13306i2408A32507C2947L21177
$$ plain form
15676 354124 267098 -71589 128697 -433115 188161 194789 88876 54544 60809 23707 1473
15664 -2860 72752 -80268 87062 69613 -164862 -234757 -232839 25898 56038 234414 -26898 14699
15651 -156905 -274713 25386 -94504 45608 -64731 22240 -308481 232895 142271 -5975 -95223
15640 -95223 190433 113567 -175854 -120182 202686 -14384 -132558 132329 -19742 140070
15629 101240 -146132 -222236 -43875 -45792 152093 101881 288880 -452414 -219856 -148499 -183563
15618 -183563 -87203 129702 -132065 -146855 96679 -207753 -89186 69914 232211 -139004
15607 -127172 -145666 111003 -53097 561 -34064 -15355 -142626 100280 -173241 -61465 13428
15595 -69405 40847 -5017 11463 66555 -83460 67504 -218157 -36643 -47506 -81618 110832
$$ packed form
15676C54124q7026g1589A28697d33115A88161O628H8876l4332O265B3707A473
15664b860G2752h0268H7062j7449a64862o9895J918B5898L0140J78376b6898A4699
15651a56905j17808B5386i4504D5608f4731B2240c08481B32895r0624e975q9248
15640i5223A90433p6866a75854N5672B02686a4384j18174A32329a9742A40070
15629A01240a46132p6104d3875j917A52093n0212J86999d52414b19856P1357l5064
15618a83563h7203A29702a32065j4790I6679b07753h9186F9914J62297a39004
15607a27172j8494A11003e3097E61c4064a5355j27271A00280a73241f1465A3428
15595f9405D0847e017A1463N5092h3460F7504b18157c6643j0863l4112A10832
$$ plain form
15583 -35471 228909 17733 155169 -156005 165214 359076 -517894 377231 68466 77327
15573 77327 151767 -69819 2089 205103 -341203 -141410 -435485 -7357 118371 -20036 248287
15561 -42725 -126628 71701 17300 -172630 183061 -63568 217144 -346670 -196020 13374 -189746
15549 -464422 -199556 -125899 -242981 -174904 -89893 161234 127667 -252058 -36686 -5387 -276
15537 158325 34601 -4068 261934 264522 25467 -255025 -35361 -202076 31165 133574 -32730
15525 51256 -48374 228751 -116573 103086 -187676 -158148 -138571 -305083 -296712 -453442 128608
15513 271732 391807 443204 46587 68905 15656 -84415 -39542 -51453 341318 -205868 16555
15501 -98808 54967 178351 66687 -110653 -185967 -47407 62973 -10939 -24591 -322503 29314
$$ packed form
15583c5471B28909A7733J37436a56005A65214J93862e17894C77231F8466Q861
15573G7327P4440f9819B089K03014c41203a41410k94075g357A18371b0036B48287
15561d2725q3903G1701A7300a72630A83061f3568B17144c46670J50650A3374a89746
15549d64422a99556P3657j17082O8077Q5011A61234l3567b52058c6686e387b76
15537A58325C4601d068B61934K588B5467b55025c5361j66715C1165J02409c2730
15525E1256d8374B28751a16573A03086a87676K9528J9577j66512Q371j56730A28608
15513B71732J20075N1397D6587K2318A5656h4415c9542j1911C41318b05868A6555
15501i8808E4967J23384F6687a10653p5314d7407F2973a0939j3652k97912B9314
$$ plain form
15489 -95953 -307132 -137847 -53540 -48306 183787 -22697 -37636 -13668 -103976 -147619 37681
15477 162554 -263205 97650 8793 107890 31693 170563 25663 88508 -52115 3211 -192000
15465 102097 37449 41591 189677 369764 -36022 -137092 206204 57532 -117488 -43765 -191942
15454 -191942 379318 -203095 318901 -203857 129911 201259 169592 171893 -188565 -35988
15443 101480 -141635 124663 -108567 -306579 -297002 21306 -105786 -130129 -196238 120393
15432 109505 12399 -77800 285780 163515 69378 200033 -254882 4682 63221 107944 74216
15421 74216 86023 183924 -237974 57312 88541 -181278 58270 -216093 155638 268530 166243
15410 166243 -171693 89162 287197 -2620 -113801 -64618 65746 -526 -12148 51298 66172
$$ packed form
15489i5953k11179a37847e3540N234A83787b2697j4939a3668r0308m3643C7681
15477A62554b63205I7650H793R9097C1693J38870B5663O2845e2115C211a92000
15465A02097C7449M142J48086J80087c6022j01070B06204E7532a17488d3765j48177
15454a91942C79318b03095C18901b03857A29911P1348l1667K301a88565c5988
15443A01480a41635A24663a08567j98012R577B1306a05786k4343o6109A20393
15432A09505A2399g7800B85780j22265F9378J30655b54882D682N8539M4723l3728
15421G4216J1807R7901b37974E7312L1229a81278E8270b16093A55638J12892j02287
15410A66243a71693H9162J98035b620j11181M9183F5746e26j1622E1298J4874
$$ plain form
15399 66172 242372 -177580 66710 36194 161644 -43741 448925 243821 -157441 342681
15388 -49480 -3691 127764 -108928 39366 -133894 -342019 -251578 132298 -200078 139107
15377 -175548 27277 -384716 -287837 -3684 -122854 -97421 -287375 265624 60962 -114718 -47336
15365 -121074 196023 -100592 16287 118808 210496 -102200 106708 -45457 -74854 -22806
15354 -243207 -221828 -155251 171182 76918 -117396 108016 -100361 139101 64111 335019
15344 335019 -156311 68212 115758 -162300 -79555 52023 -150702 13569 -21531 72786 -38962
15332 -119251 -393194 -50971 -107115 310693 30795 175971 -74894 11975 -53557 226371 -85128
15320 80335 83405 -39748 103239 -147852 -105931 -125164 122758 -46261 -75112 161395 216612
$$ packed form
15399F6172J76200a77580F6710l0516J25450d3741D48925k05104a57441C42681
15388d9480c691A27764a08928C9366a33894k08125R0441A32298b00078A39107
15377a75548B7277c84716R6879c684j19170K5433j89954B65624F0962a14718d7336
15365a21074A96023a00592A6287J02521R1688a02200A06708d5457k9397b2806
15354b43207K1379O6577A71182G6918a17396A08016a00361A39101F4111K70908
15344C35019a56311F8212M7546a62300g9555E2023a50702A3569b1531G2786c8962
15332a19251k73943e0971n6144C10693C0795J45176g4894A1975e3557B26371h5128
15320H0335L070c9748A03239a47852M1921j9233A22758d6261k8851A61395N5217
$$ plain form
15309 216612 -128120 215 219099 164492 42982 -136540 17016 -241753 -99157 231816 106379
15297 82328 -37760 222915 195896 -56029 -13382 -36076 -157384 18095 136345 281718 -13384
15285 138492 235748 59083 -98020 317565 76635 84257 225753 -109791 -13075 27602 376947
15274 376947 -191692 111310 104341 138411 274048 92495 159472 43885 360701 45133 -54798
15262 273107 -168616 77062 7982 -16065 -203809 -53598 -64409 -84628 487663 -117848 -16877
15250 20910 295376 242423 177246 901697 1647714 2744177 2040290 2323692 2397842 717408
15239 223719 387156 108692 10735 121994 136448 173847 24705 497387 131372 104114
15229 104114 66213 204805 30345 -65383 71653 229214 -172551 191060 65819 64290 -263921
$$ packed form
15309B16612a28120B15K18884n4607D2982a36540A7016b41753i9157B31816A06379
15297H2328c7760B22915k7019e6029a3382k2694j21308A8095J18250J45373a3384
15285A38492R7256E9083i8020C17565G6635P622J41496a09791a3075B7602L49345
15274C76947a91692A11310o969L4070J35637I2495O6977D3885L16816D5133e4798
15262B73107a68616G7062G982a6065j87744e3598j0811k0219D87663a17848a6877
15250B0910K74466n2953o5177P24451P46017J096463p03887K83402P4150G17408
15239B23719J63437A08692A0735J11259J4454L7399B4705M72682A31372k7258
15229A04114l7901J38592C0345f5383G1653J57561a72551A91060F5819j529b63921
$$ plain form
15217 -29941 282803 287433 106933 -180224 113316 -127897 40065 -218626 17531 307272
15207 307272 -101740 51614 -94298 18397 309699 195786 -241742 -78524 158249 217716
15197 217716 8417 93127 413966 404406 219051 107419 5790 512954 101506 192486 71710
15185 118173 454913 -24182 245114 79653 216498 152117 -67675 -43731 98589 79341 -97
15173 -18011 45769 220521 -112501 278931 -46826 370709 -111931 50831 -292136 44518
15162 -101605 -97250 428627 745416 -9430 98561 237719 -202764 123748 27474 -257763 99254
15150 333876 310167 197957 53730 156690 268706 -204158 133886 107242 -88018 187676
15139 -19141 69860 183829 267750 81701 397286 84243 -136473 162087 -312683 -1213 28166
$$ packed form
15217b9941B82803M630A06933a80224A13316a27897D0065b18626A7531K89741
15207C07272a01740E1614i4298A8397K91302j13913b41742g8524A58249N9467
15197B17716H417Q4710L20839r560j85355A07419E790N07164A01506R0980G1710
15185A18173L36740b4182B45114G9653J36845o4381f7675K3944I8589j9248i7
15173a8011D5769J74752a12501B78931d6826C70709a11931E0831b92136D4518
15162a01605M355D28627L16789i430I8561J39158b02764A23748B7474b57763I9254
15150C33876k3709j12210E3730J02960J12016b04158A33886k6644h8018A87676
15139a9141F9860J13969Q3921H1701L15585H4243a36473A62087c12683a213B8166
$$ plain form
15127 109872 -107755 127143 75596 -56075 67958 253728 75672 -79694 2507 99592 362700
15116 362700 243351 4609 182550 532919 -31757 63720 -113428 148330 112163 14672 99433
15105 99433 394969 6709 270769 -210523 255356 -61297 -21172 367068 89982 -5662 -153674
15094 -153674 200821 30742 383034 -48095 -202091 -92124 179969 304463 83333 -76468
15083 -51507 400365 225652 322572 186331 528529 365282 -7951 277383 92950 49240 -98057
15071 363709 367448 347892 56903 48003 -213843 76586 247743 228410 421095 81035 388093
15060 388093 315815 84476 91301 405449 204299 117006 325183 602409 247243 51068 258208
15049 258208 154636 72559 -60692 362132 116428 -30160 -192278 -133361 351293 -250400
$$ packed form
15127A09872a07755A27143n1547e6075F7958J85770G5672g9694B507R7085K63108
15116C62700j19349D609J77941L50369c1757F3720a13428A48330l6167A4672Q4761
15105I9433K95536F709K64060b10523B55356f1297b1172C67068H9982e662j48012
15094a53674B00821C0742L52292d8095j53996i2124A79969J24494H3333g6468
15083e1507D00365j74713R6920j36241L42198j63247g951B77383I2950m3710i8057
15071C63709L739j9556E6903q900b13843G6586J71157j9333J92685H1035L07058
15060C88093p2278H4476O825L14148k01150q7293K08177K77226B47243E1068K07140
15049B58208j03572G2559f0692C62132A16428c0160j62118N8917C51293b50400
$$ plain form
15038 276774 29373 340190 153171 160871 60401 282840 114413 220048 347809 85057
15027 220830 298474 145033 183474 80055 83902 14037 289682 261312 385014 313758 475941
15016 475941 295752 69084 208486 336777 214443 127116 385561 504006 47896 -101090
15005 25359 505428 -81620 135769 42349 171632 251255 292104 243499 187817 -81273 345327
14993 441839 450618 62018 -9277 131048 490998 237915 257260 522379 104339 289000 101621
14981 187692 338534 568721 272817 253612 321879 -183124 -39223 515975 166064 28041
14970 216007 352676 296099 58662 11373 458646 469479 141561 412708 346476 228047
14960 228047 257848 280680 388848 291798 443058 78106 353550 441209 304544 371671 461333
$$ packed form
15038B76774B9373L10817A53171P700F0401K22439A14413J05635J27761H5057
15027B20830P7644A45033L8441H0055L847A4037K75645k8370J23702p1256J62183
15016D75941j80189F9084J39402J28291j22334q7327K58445J18445D7896a01090
15005B5359M80069h1620A35769D2349J29283P9623M0849m8605n5682h1273C45327
14993D41839Q779F2018i277A31048L59950B37915J9345K65119A04339J84661A01621
14981A87692J50842K30187B72817j9205O8267a83124c9223E15975A66064B8041
14970B16007J36669n6577E8662A1373M47273J0833A41561K71147o6232j18429
14960B28047K9801K2832J08168r7050J51260G8106K75444Q7659j36665O7127Q9662
$$ plain form
14949 461333 5659 147457 286212 533608 227234 6485 202832 307590 204549 296264
14939 296264 503616 59412 266740 193918 253699 242970 185783 -59587 356050 158862 388182
14928 388182 121558 329342 116462 336311 272469 347468 482871 453668 337844 -90012
14917 345085 174341 188614 189218 92530 469749 -56469 212735 107547 416065 272752 -3526
14905 4877 394115 677520 153739 223170 210262 266350 507916 150005 510577 450306 319948
14894 319948 261197 85409 420138 450309 359034 347906 70825 278092 306983 436730 349340
14883 349340 455288 145351 270965 270836 529491 493488 309713 106601 415337 -73433
14872 413583 254161 284512 582386 242148 631809 439650 286013 427262 357037 268834
$$ packed form
14949D61333E659J41798J38755K47396B27234F485J96347J04758j03041R1715
14939B96264K07352E9412K07328p2822N9781j0729n7187e9587C56050A58862K29320
14928C88182A21558K07784A16462K19849o3842P4999J35403k9203j15824i0012
14917C45085j70744J4273O04I2530L77219e6469B12735j05188L08518j43313c526
14905D877L89238K83405A53739O9431j2908N6088K41566A50005L60572o0271j30358
14894C19948n8751H5409L34729L0171r1275j1128G0825K07267K8891J29747q7390
14883C49340J05948A45351J25614j29K58655l6003j83775A06601L08736g3433
14872D13583j59422L0351K97874B42148L89661j92159j53637J41249p0225q8203
$$ plain form
14862 268834 207692 827994 424636 572925 476893 507983 718877 214547 692930 232393
14851 590371 704149 464295 540720 546781 579880 250517 543816 468150 160817 381991
14841 381991 446074 370435 301116 266226 437494 404590 470181 618176 232289 585383 481135
14830 481135 327973 318174 517779 163011 281943 352950 518006 576918 576925 500073 339988
14819 339988 388773 504431 467448 668896 276777 346197 598076 275044 217200 875813
14809 875813 456408 505043 582847 476950 588834 394187 560185 569721 629745 376636
14799 376636 252218 891450 517050 427136 275042 447852 492619 689745 850121 646025
14789 646025 570385 454954 964463 495255 552772 603927 496613 300930 635497 645971
$$ packed form
14862B68834o1142O20302m03358J48289r6032L1090K10894B14547M78383B32393
14851E90371J13778k39854P6425O061L3099B50517K93299p5666A60817K21174
14841C81991O4083p5639o9319l4890J71268l2904O5591J47995B32289L53094j04248
14830D81135j53162r799J99605A63011J18932P1007J65056N8912Pp6852j60085
14819C39988M8785J15658l6983K01448B76777O9420K51879B75044n7844O58613
14809H75813m19405M8635P7804j05897J11884j94647J65998R536O0024k53109
14799C76636j24418O39232l74400q9914j52094J72810M4767J97126J60376k04096
14789F46025p5640j15431N09509m69208N7517N1155j07314j95683L34567J0474
$$ plain form
14779 645971 739355 630615 500697 463985 352149 527959 580480 488960 821435 884431
14769 884431 486199 759017 604521 547908 697858 930951 856068 706185 441743 399388
14759 399388 630397 503437 561073 757531 517863 1003952 699905 596631 372558 915246
14749 915246 754096 806195 763806 589014 617731 971494 839139 834887 908316 825363 857076
14738 857076 1060492 643522 917445 735183 485769 845367 536318 747706 627587 525455
14728 525455 728108 732385 812446 860009 681778 650537 971122 924444 802184 746443 849771
14717 849771 684695 787393 643314 1245422 764872 877177 772298 597925 920971 1110755
14707 1110755 888854 762556 768224 820243 1054934 738531 816788 949264 984747 1012298
$$ packed form
14779F45971R3384j08740j29918l6712j11836J75810N2521r1520L32475O2996
14769H84431l98232K72818j54496n6613J49950K33093p4883j49883k64442m2355
14759C99388K31009j26960N7636J96458k39668M86089l04047j03274k24073N42688
14749I15246j61150N2099m2389j74792K8717L53763j32355m252P3429q2953L1713
14738H57076K03416m16970K73923j82262k49414L59598l09049K11388j20119j02132
14728E25455K02653M277Q0061M7563j78231l1241L20585m6678j22260n5741J03328
14717H49771j65076J02698j44079O02108m80550J12305j04879j74373L23046J89784
14707A110755k21901j26298N668N2019K34691l16403P8257J32476L5483K7551
$$ plain form
14697 1012298 928141 984231 1006885 894340 962453 938865 748998 1009872 981722 1160407
14687 1160407 701601 865921 853889 1234381 722765 782065 1243665 950264 773318 633114
14677 633114 856776 996065 1207930 1077189 1082588 814405 1183940 1003327 1085773 1001975
14667 1001975 1238619 1021636 1020831 846708 926169 1014814 1374260 1629162 1031942 1123163
14657 1123163 1074330 1188395 1398551 1324485 1236982 1166345 1138655 1332308 1374122 730485
14647 730485 1028988 1660685 1061344 1331658 1298617 1576324 1568130 1461612 1297022 1441776
14637 1441776 1280704 1528049 1487978 1230444 1450497 1379978 1198427 1361980 1285846 1116071
14627 1116071 1588147 1349666 1282654 1106040 1454960 1106012 1498242 1406505 1223571 1707435
$$ packed form
14697A012298q4157N6090K2654j12545O8113k3588j89867K60874k8150J78685
14687A160407m58806J64320j2032L80492n11616N9300M61600k93401j76946j40204
14677F33114K23662J39289K11865j30741N399k68183L69535j80613Q2446q3798
14667A001975K36644k16983q05j74123P9461Q8645L59446K54902n97220R1221
14657A123163m8833J14065K10156p4066q7503p0637k7690J93653M1814o43637
14647G30485K98503O31697n99341K70314l3041K77707q194j06518j64590J44754
14637A441776j61072K47345m0071k57534K20053p0519j81551J63553p6134j69775
14627A116071M72076k38481o7012j76614L48920l48948L92230r1737j82934M83864
$$ plain form
14617 1707435 1261290 1485492 1485458 1892779 1744250 1804279 1591581 1410843 1569119 1535604
14607 1535604 1623252 1722240 1997821 1560535 1462972 1739685 1752403 1677703 1781162 1670271
14597 1670271 1551153 1678966 1807213 2112372 1841663 1986275 2044541 1994559 1742690 2121292
14587 2121292 2123342 1922671 2011900 1911435 1861238 2260582 1690772 2241003 1883360 1924716
14577 1924716 2234285 2304173 2258579 2314980 2372555 2407906 2113798 2385999 2337552 2312602 2297811
14566 2297811 2261344 2466675 2361745 2652006 2583192 2755002 2973852 2940206 2523950 3222688
14556 3222688 3500709 3224094 3607433 3962268 4153969 4747863 5614786 7413946 11160843
14547 11160843 18921233 31669266 41981511 28253230 13730667 8424910 7820207 7377664
$$ packed form
14617A707435m46145K24202l4M07321j48529O0029k12698j80738J58276l3515
14607A535604Q7648R8988K75581m37286r7563K76713J2718p4700J03459j10891
14597A670271j19118J27813J28247L05159k70709J44612N8266m9982k51869L78602
14587B121292K050k00671Q9229j00465n0197L99344n69810N50231l57643M1356
14577A924716L09569O9888m5594N6401N7575L5351k94108K72201m8447k4950j4791
14566B297811l6467K05331j04930K90261o8814J71810K18850l3646m16256O98738
14556C222688K78021k76615L83339L54835J91701N93894Q66923J799160L746897
14547A1160843P760390J2748033J0312245j3728281A3730667n305757o04703m42543
$$ plain form
14539 7377664 4177866 2710290 2567197 2142126 2068753 2052806 2392069 2177168 2078839 2047918
14529 2047918 2165178 2320752 2441342 2495804 2521167 2596531 2738586 2483041 2555192 2466277
14519 2466277 2725057 2250896 3090989 2535741 2813932 2984486 2698627 2738737 2733994 2847594
14509 2847594 2723359 2807630 2802029 2850588 3146526 3285980 3182137 2950290 3271539 3325514
14499 3325514 3178851 3517227 3256070 3251742 3340327 3280931 3470011 3327030 3419215 3744722
14489 3744722 3760567 3345194 3642357 3516185 3860606 3591691 3427275 3898501 4031689 3927303
14479 3927303 4042669 4058245 4327019 4204100 3981521 4136064 4101701 4616024 4617742 4433758
14469 4433758 4474972 4522577 4730149 4992148 4492571 4741061 4250355 4871802 4916034 4890240
$$ packed form
14539G377664l199798j467576j43093m25071p3373j5947L39263k14901r8329l0921
14529B047918J17260J55574J20590N4462K5363P5364J42055k55545P2151q8915
14519B466277K58780m74161Q40093n55248K78191J70554k85859M0110m743J13600
14509B847594j24235Q4271n601M8559K95938J39454j03843k31847L21249N3975
14499C325514j46663L38376k61157m328Q8585n9396J89080j42981R2185L25507
14489C744722J5845m15373K97163j26172L44421k68915j64416M71226J33188j04386
14479C927303J15366J5576K68774j22919k22579J54543l4363N14323J718j83984
14469D433758M1214M7605K07572K61999m99577K48490m90706O21447M4232k5794
$$ plain form
14459 4890240 5535542 5069482 5556353 5009178 5600285 5537627 5294369 5657053 5656364 5658375
14449 5658375 5799720 5817424 5838587 5982189 5663441 6154767 6286332 6069082 6125414 6531319
14439 6531319 6501363 6456032 6740910 6845354 6822344 7171196 6824025 6993415 7052154 7233813
14429 7233813 7358986 7533930 7543737 7313730 7605951 7904867 7974664 7937428 8278489 8597489
14419 8597489 7940312 8687992 8829938 8698197 8951474 8686363 9525455 9409060 8918713
14410 8918713 9443438 9416160 9434205 10015246 9925008 10285084 10153630 10635097 10731919 11150149
14400 11150149 11013516 10948042 11551509 11530899 11958635 11837524 12104528 12448207 12688638 13188796
14390 13188796 12734500 13161687 13488043 13580172 13915980 14112945 14426273 14423198 15022633 15117441
$$ packed form
14459D890240O45302m66060M86871n47175N91107o2658k43258L62684o89K011
14449E658375J41345J7704K1163J43602l18748M91326J31565k17250N6332M05905
14439F531319k9956m5331K84878J04444k3010L48852l47171J69390N8739J81659
14429G233813J25173J74944R807k30007K92221K98916O9797l7236L41061L19000
14419H597489o57177P47680J41946j31741K53277k65111Q39092j16395m90347
14410H918713N24725k7278J8045N81041r0238L60076j31454M81467R6822M18230
14400A1150149j36633o5474O03467k0610M27736j21111K67004L43679K40431N00158
14390A3188796m54296M27187L26356R2129L35808J96965L13328l075N99435R4808
$$ plain form
14380 15117441 15468695 15668902 16008738 16447482 16740247 16809865 17410447 17546215 17750042
14371 17750042 18100941 18482687 19193904 19015475 19819437 20256415 20488715 20589069 21263555
14362 21263555 21917871 22381571 23023773 23295428 23861968 24698852 24670385 25471783 26107544
14353 26107544 26657507 27416168 27818195 28653630 29415247 29942022 30557800 31700482 32217823
14344 32217823 33085001 34244680 35238693 35681617 36688991 38080467 39490366 39888105 41191448
14335 41191448 42497539 43604631 44692516 46672969 47705311 49195169 50578038 52357240
14327 52357240 54007790 55984834 57421087 59313495 61403741 63543024 66131296 68144621
14319 68144621 70709900 73167171 75544993 78144566 81148596 84431303 87419834 90896048
$$ packed form
14380A5117441L51254K00207L39836M38744K92765O9618O00582J35768K03827
14371A7750042L50899L81746P11217j78429Q03962M36978K32300J00354O74486
14362B1263555O54316M63700O42202K71655N66540Q36884k8467Q01398O35761
14353B6107544N49963P58661M02027Q35435P61617N26775O15778J142682N17341
14344C2217823Q67178J159679R94013M42924J007374J391476J409899L97739J303343
14335D1191448J306091J107092J087885J980453J032342J489858J382869J779202
14327E2357240J650550J977044J436253J892408K090246K139283K588272K013325
14319F8144621K565279K457271K377822K599573L004030L282707K988531L476214
$$ plain form
14311 90896048 94724526 98606964 102582630 106882820 111156113 115973135 121079105 126048864
14303 126048864 131870725 137745585 144167972 150685755 157804400 165377420 173310776 181653041
14295 181653041 190260044 199969853 209607731 219572447 230909898 242057407 254236819
14288 254236819 266801939 280294507 294089636 307797990 322449467 337423830 352412636
14281 352412636 367816259 382879903 398004016 412455807 426075451 438725775 450360340
14274 450360340 460234346 467942784 472180842 472295547 470988238 472333975 471554664 468439280
14266 468439280 463874462 457692748 448972114 438213589 426553120 413215045 399505507
14259 399505507 384394025 369232275 353410590 337985667 322237833 307158418 292407953
$$ packed form
14311I0896048L828478L882438L975666M300190M273293M817022N105970M969759
14303A26048864N821861N874860O422387O517783P118645P573020P933356Q342265
14295A81653041Q607003R709809R637878R964716J1337451J1147509J2179412
14288B54236819J2565120J3492568J3795129J3708354J4651477J4974363J4988806
14281C52412636J5403623J5063644J5124113J4451791J3619644J2650324J1634565
14274D50360340R874006P708438M238058J14705j307309J345737p79311l115384
14266D68439280m564818o181714q720634j0758525j1660469j3338075j3709538
14259C99505507j5111482j5161750j5821685j5424923j5747834j5079415j4750465
$$ plain form
14252 292407953 278503971 266566463 253744824 241471583 229515135 218257902 207554077
14245 207554077 197505314 188374932 180147695 171227773 163428218 155805481 148843369 142447388
14237 142447388 136053136 130139804 124787325 119199165 114106072 109912694 105391245 101528877
14229 101528877 97216582 93593055 89738545 86351063 83285875 80118593 77206767 74205702
14221 74205702 71953594 69198303 67186117 64436831 62708383 60764539 58875143 57120051
14213 57120051 55593861 53807651 51984317 50377390 48697379 47681386 46544977 45329781
14205 45329781 44020830 42671941 41291165 40197744 39406096 38643263 37570225 36689358
14197 36689358 35454548 34405523 33633688 32791578 32413863 31402093 30558508 29795158 29159377
$$ packed form
14252B92407953j3903982j1937508j2821639j2273241j1956448j1257233j0703825
14245B07554077j0048763r130382q227237q919922p799555p622737o962112o395981
14237A42447388o394252n913332n352479n588160n093093m193378m521449l862368
14229A01528877m312295l623527l854510l387482l065188l167282k911826l001065
14221G4205702k252108k755291k012186k749286j728448j943844j889396j755092
14213E7120051j526190j786210j823334j606927j680011j015993j136409j215196
14205D5329781j308951j348889j380776j093421p91648p62833j073038q80867
14197C6689358j234810j049025p71835q42110l77715j011770q43585p63350o35781
$$ plain form
14188 29159377 28889304 27754152 27239195 26173227 25870170 25615628 24799161 24395270 23331289
14179 23331289 22974081 22739721 21745810 22040201 21145299 21019937 20375562 19856614 19615117
14170 19615117 18971552 18905797 18734725 18384261 18164248 17533445 17182111 16814289 16467682
14161 16467682 16417573 16036249 15655190 15333904 14641121 15025681 15158474 14351455 14026024
14152 14026024 14097578 13678594 13474187 13146701 13059266 12858299 12409482 12376690 12374900 11696873
14142 11696873 12058284 11868427 11522893 11195596 11188785 10979089 10772158 10846586 10921038 10455428
14132 10455428 10278940 10366992 10275540 9840148 9680772 9651624 9463427 9556495 9104426 9271464
14122 9271464 8740508 8724270 8666506 7993943 8340207 8301690 8176618 8180945 7826950 7934629
$$ packed form
14188B9159377k70073j135152n14957j065968l03057k54542q16467m03891j063981
14179B3331289l57208k34360r93911K94391q94902j25362o44375n18948k41497
14170A9615117o43565o5755j71072l50464k20013o30803l51334l67822l46607
14161A6467682n0109l81324l81059l21286o92783L84560J32793q07019l25431
14152A4026024P1554m18984k04407l27486q7435k00967m48817l2792j790o78027
14142A1696873L61411j89857l45534l27297o811k09696k06931P4428P4452m65610
14132A0455428j76488Q8052r1452m35392j59376k9148j88197R3068m52069J67038
14122I271464n30956j6238n7764o72563L46264l8517j25072M327l53995J07679
$$ plain form
14112 7934629 7606624 7788692 7735966 7658566 7649645 7715111 7548264 7351152 6896931 6974216
14102 6974216 6999022 6939608 6793087 6804022 6691048 6351560 6245576 6557348 6383667 5944414
14092 5944414 6334143 6359924 6402777 6342794 5996236 5739783 5713155 6006309 5675480 5620848
14082 5620848 5279831 5181930 5594397 5327346 5363121 5559595 5138830 5057669 5001780 4719126
14072 4719126 4828691 4807281 4929731 4794124 5031720 4627306 4420151 4453268 4628661 4911564
14062 4911564 4656473 4755782 4546345 4251824 4064353 4717872 4437808 4410346 4030613 4135195
14052 4135195 4125264 4213335 4028927 3968640 3817604 3695087 3883341 3813900 3658047 3801223
14042 3801223 3747113 3604642 3438733 3747228 3739540 3334800 3106460 3322420 3416493 3566096
$$ packed form
14112G934629l28005J82068n2726p7400q921O5466j66847j97112m54221P7285
14102F974216K4806n9414j46521J0935j12974l39488j05984L11772j73681m39253
14092E944414L89729K5781M2853n9983l46558k56453k6628K93154l30829n4632
14082E620848l41017r7901M12467k67051L5775J96474m20765q1161n5889k82654
14072D719126J09565k1410J22450j35607K37596m04414k07155L3117J75393K82903
14062D911564k55091R9309k09437k94521j87471O53519k80064k7462l79733J04582
14052D135195r931Q8071j84408o0287j51036j22517J88254o9441j55853J43176
14042C801223n4110j42471j65909L08495p688m04740k28340K15960R4073J49603
$$ plain form
14032 3566096 3628466 3467631 3414177 3542214 3616381 3398615 3601130 3351393 3419999 3348464
14022 3348464 3386408 3218643 3023450 2891999 2964333 2572865 2466968 2905447 2669191 2847017
14012 2847017 2588296 2735631 2634764 2375194 2490527 2738465 2286938 2320278 2814836 2668086
14002 2668086 2321512 2587707 2304724 2821680 2588789 2433964 2481237 2112369 2389121 2606283
13992 2606283 2603459 2695748 3429136 4312662 6452329 13135566 26099617 41044739 33032437
13983 33032437 18781380 11556994 8035012 6228296 5041268 4521997 4368772 3714504
13975 3714504 3632775 3127930 3048335 3268103 3043043 2848335 2595453 2618305 2738265 2533639
13965 2533639 2743710 2424917 2596337 2458867 2425673 2559776 2410132 2306586 2473301 2411778
$$ packed form
14032C566096O2370j60835n3454J28037P4167k17766K02515k49737O8606p1535
14022C348464L7944j67765j95193j31451P2334l91468j05897M38479k36256J77826
14012B847017k58721J47335j00867k59570J15333K47938m51527L3340M94558j46750
14002B668086l46574K66195k82983N16956k32891j54825M7273l68868K76752K17162
13992B606283k824R2289P33388Q83526K139667O683237J2964051J4945122q012302
13983C3032437j4251057p224386l521982j806716j187028n19271j53225o54268
13975C714504q1729n04845p9595K19768k25060j94708k52882K2852J19960k04626
13965B533639K10071l18793J71420j37470l3194J34103j49644j03546J66715o1523
$$ plain form
13955 2411778 2031161 2286268 2060665 2129384 2226924 2328976 2217688 2197140 2197946 2346322
13945 2346322 2122609 2036202 1899165 1870471 1742930 2162045 2026432 1697349 1704724 1849731
13935 1849731 2101851 2118307 1746306 1655575 1956466 2057154 1531716 1859076 1661184 1771745
13925 1771745 1720319 1795089 1614974 1602517 1876482 1622206 1366665 1818400 1642743 1586619
13915 1586619 1625296 1857451 1444046 1207459 1801240 1447458 1398848 1601472 1599481 1413679
13905 1413679 1727642 1659444 1441597 1288436 1547473 1465371 1706546 1679458 1559695 1597813
13895 1597813 1166963 1401630 1472444 1514133 1322565 1149521 1579812 1217361 1295251 1196406
13885 1196406 1413979 1601168 1429767 1367422 1432822 1516930 1363051 1324344 1444561 1396803
$$ packed form
13955B411778l80617K55107k25603O8719R7540J02052j11288k0548Q06J48376
13945B346322k23713q6407j37037k8694j27541M19115j35613l29083P375J45007
13935A849731K52120J6456l72001r0731L00891J00688n25438L27360j97892J10561
13925A771745n1426P4770j80115j2457K73965k54276k55541M51735j75657n6124
13915A586619L8677K32155m13405k36587N93781l53782m8610K02624j991j85802
13905A413679L13963o8198k17847j53161K59037q2102K41175k7088j19763L8118
13895A597813m30850K34667P0814M1689j91568j73044M30291l62451P7890r8845
13885A196406K17573J87189j71401o2345O5400Q4108j53879l8707J20217m7758
$$ plain form
13875 1396803 1376180 1474714 1079247 1242137 1100674 1179749 1538442 1455518 1236349 1310566
13865 1310566 935721 1391479 1140405 1304451 974826 1089307 1739103 1315182 1287188 1147127
13855 1147127 1135067 1225831 1272507 1325283 1233735 1205179 1403659 1125622 1197891 1052092 967170
13844 967170 928481 1232055 1168515 973081 1383595 994675 723298 1196084 1342720 963904
13834 963904 1193975 1037869 1062294 1001369 1257826 874697 1229263 1130986 819167 904847
13824 904847 1179347 849045 1410686 861134 1181275 823754 1065369 1362992 995003 836311
13814 836311 954361 933584 1042791 1030548 1080823 953509 477404 891520 947595 1092667
13804 1092667 654214 952481 1103273 1077683 907238 682531 827978 913999 676401 790023
$$ packed form
13875A396803k0623R8534l95467J62890j41463P9075L58693q2924k19169P4217
13865A310566l74845M55758k51074J64046l29625J14481O49796m23921k7994j40061
13855A147127j2060R0764M6676N2776r1548k8556J98480k78037P2269j45799q4922
13844I67170l8689L03574o3540j95434M10514l88920k71377M72786J46636l78816
13834I63904K30071j56106K4425o0925K56457l83129L54566r8277l11819Q5680
13824I04847K74500l30302N61641n49552L20141l57521K41615K97623l67989j58692
13814H36311J18050k0777J09207j2243N0275j27314m76105M14116N6075J45072
13804A092667m38453K98267J50792k5590j70445k24707J45447Q6021k37598J13622
$$ plain form
13794 790023 1163422 1057770 1013826 736395 1010444 867296 1249901 853657 711222 989663
13784 989663 642617 662388 933984 695534 1028367 661375 757865 798587 653159 1047785
13774 1047785 841204 789907 937582 895219 670402 631161 598590 941710 780807 1302062
13764 1302062 1005888 1086759 700761 859469 906647 1043562 736336 798480 634079 533100
13754 533100 557901 884527 634100 779928 546125 620537 691618 664388 473588 310911
13744 310911 1162705 831261 512834 558252 671932 838949 574265 609098 453828 401263
13734 401263 777985 632485 624816 986769 555466 702604 327337 585488 415845 511437
13724 511437 580763 610544 217055 800362 686857 604320 724529 535413 392720 1093302
$$ packed form
13794G90023L73399j05652m3944k77431K74049j43148L82605l96244j42435K78441
13784I89663l47046J9771K71596k38450L32833l66992R6490M0722j45428L94626
13774A047785k06581n1297J47675m2363k24817l9241l2571L43120j60903N21255
13764A302062k96174Q0871l85998J58708M7178J36915l07226O2144j64401j00979
13754E33100K4801L26626k50427J45828k33803P4412P1081k7230j90800j62677
13744C10911Q51794l31444l18427M5418J13680J67017k64684L4833j55270n2565
13734D01263L76722j45500p669L61953m31303J47138C27337K58151j69643R5592
13724E11437O9326K9781B17055N83307j13505q2537J20209j89116j42693P00582
$$ plain form
13714 1093302 787892 497661 778747 739155 656998 380775 470610 791435 516665 616461
13704 616461 375370 806404 695729 559610 502098 347855 699283 960805 407862 749461
13694 749461 632373 396368 549575 530578 576249 331634 389613 633803 507527 587109
13684 587109 766713 527902 156198 512879 609722 541635 812919 365358 773981 536254
13674 536254 536653 796825 668525 310244 802390 691436 472906 513883 704989 718349
13664 718349 472002 537698 639323 443893 408181 315390 404660 150632 331035 341634
13654 341634 216433 569399 556736 612974 711734 377073 549371 459074 780200 381742
13643 528680 720713 534170 501791 231883 532502 470882 307752 443602 384184 320709
$$ packed form
13714A093302l05410k90231K81086l9592q2157k76223Q9835L20825k74770R9796
13704F16461k41091M31034j10675j36119n7512j54243L51428K61522D07862L41599
13694G49461j17088k36005J53207j8997M5671k44615N7979K44190j26276P9582
13684E87109J79604k38811A56198L56681R6843o8087K71284C65358M08623k37727
13674E36254L99K60172j28300C10244M92146j10954k18530M0977J91106J3360
13664G18349k46347O5696J01625j95430l5712r2791Q9270A50632J80403J0599
13654C41634j25201L52966j2663N6238R8760l34661J72298r0297L21126C81742
13643E28680J92033j86543l2379B31883L00619o1620j63130J35850n9418o3475
$$ plain form
13633 320709 365531 123383 506067 459407 443817 257195 629293 498971 468367 317601
13623 317601 618815 535660 302232 548183 391078 481674 263331 746346 374217 818213
13613 818213 761155 636562 251242 338597 517752 615450 528947 444985 650388 364575
13603 364575 165502 324976 80330 536179 702051 438351 689846 629340 721980 378078
13593 378078 452440 689331 185836 377598 98365 142158 464626 97891 535238 77778
13582 431064 497474 530040 600115 297330 274431 458198 669007 253747 419411 304810
13572 304810 187466 892168 374558 421835 635103 270191 390304 352843 154427 59768
13561 310503 367960 263795 177960 167404 230140 662416 36021 63579 574554 308437 519877
$$ packed form
13633C20709M4822A23383L82684m6660j5590j86622L72098j30322l0604j50766
13623C17601L01214q3155k33428K45951j57105R0596k18343M83015l72129M43996
13613H18213n7058j24593B51242Q7355J79155R7698q6503q3962K05403k85813
13603C64575A65502J59474H0330M55849J65872k63700K51495o0506R2640l43902
13593C78078P4362K36891A85836J91762I8365M3793L22468I7891M37347G7778
13582D31064O6410L2566P0075B97330k2899J83767K10809B53747J65664j14601
13572C04810j17344P04702C74558M7277K13268B70191J20113l7461A54427E9768
13561C10503N7457j04165q5835j0556O2736M32276C6021K7558N10975k66117K11440
$$ plain form
13550 519877 370992 262553 395425 146220 576413 519006 204065 436514 415301 501646
13540 501646 278827 530420 80268 187739 613797 512101 -250779 392079 -103866 218153
13529 166713 119900 171535 136577 231013 735329 364912 414836 756181 486755 318939
13519 318939 145525 266633 645067 458729 590760 417790 -49815 102748 325034 517508
13509 517508 541921 341599 540091 240512 542193 39609 274321 186510 154513 433043
13499 433043 79038 389875 334048 102092 278078 17680 156197 228065 312563 147417
13488 543010 518839 136880 226043 15747 53161 473969 434555 1157 404597 415501 557106
13477 557106 422736 422839 522866 272279 156334 142832 338773 220248 123199 50430 485862
$$ packed form
13550E19877j48885j08439J32872A46220M30193n7407B04065K32449k1213Q6345
13540E01646k22819K51593H0268J07471M26058j01696b50779C92079a03866B18153
13529A66713m6813N1635l4958R4436N04316C64912M9924L41345k69426j67816
13519C18939A45525J21108L78434j86338J32031j72970d9815A02748K22286J92474
13509E17508K4413k00322J98492B40512L01681C9609K34712q7811l1997K78530
13499D33043G9038L10837n5827A02092J75986A7680J38517P1868Q4498A47417
13488E43010k4171A36880Q9163A5747L7414M20808l9414A157M03440J0904J41605
13477E57106j34370J03J00027k50587j15945j3502J95941j18525r7049E0430M35432
$$ plain form
13466 485862 245359 122335 610438 516533 52180 -31818 251996 1048 149538 353607
13456 353607 627164 269567 456295 270207 176508 130996 245579 319402 125302 382805
13446 382805 267162 649906 471368 66757 290563 217931 243148 283467 235723 153882 273337
13435 273337 325187 172899 471503 314904 262282 164858 334506 429306 552501 289133
13425 289133 -115049 -95470 504452 308783 182165 279776 302159 116987 411185 581196
13415 581196 124522 184239 269248 -130294 27410 215529 212422 33285 210089 474001 54838
13403 519746 107141 183815 301133 246717 702899 111390 330235 173446 185995 424334
13393 424334 231247 108538 463109 194752 484726 441639 188813 153158 233651 421172
$$ packed form
13466D85862k40503A22335M88103r3905E2180c1818B51996A048J48490K04069
13456C53607K73557B69567J86728j86088r3699m5512J14583P3823A25302K57503
13446C82805j15643L82744j78538F6757K23806p2632K5217M0319m7744q1841J19455
13435B73337N1850j52288K98604j56599n2622r7424J69648R4800J23195k63368
13425B89133a15049J9579E04452j95669j26618R7611K2383A16987K94198J70011
13415E81196A24522N9717Q5009a30294B7410J88119l107C3285J76804K63912E4838
13403E19746A07141P6674J17318n4416M56182A11390K18845j56789J2549K38339
13393D24334j93087A08538L54571A94752K89974m3087A88813l5655Q0493J87521
$$ plain form
13383 421172 219021 -3394 502356 531945 -142993 223999 268413 -34767 490646 235033
13372 212341 126574 364287 379760 328552 243158 344264 167413 338958 144720 60356
13361 189828 297638 -85418 234171 373287 331401 -18718 241441 328463 225843 449341
13351 449341 300587 707627 194763 279888 395354 298793 91803 254869 531488 420963
13341 420963 242242 342220 114051 94530 -12283 390829 265528 214079 7542 437656 22196
13329 174139 235370 395825 311587 -69463 474898 -112067 500621 48971 300025 -69727
13318 445720 166969 138623 230538 644862 -227963 82472 385723 92059 140578 43875 195161
13307 195161 184079 72641 446932 303653 71439 471140 26564 129387 241502 114252
$$ packed form
13383D21172k02151c394E02356K9589a42993B23999M4414c4767D90646B35033
13372B12341q5767K37713J5473n1208q5394J01106A67413J71545A44720F0356
13361A89828J07810h5418B34171J39116m1886a8718B41441Q7022j02620K23498
13351D49341j48754M07040A94763Q5125J15466r6561I1803J63066K76619j10525
13341D20963j78721R9978A14051j9521a2283C90829j25301n1449G542M30114B2196
13329A74139O1231J60455q4238f9463D74898a12067E00621D8971K51054f9727
13318D45720A66969k8346R1915M14324b27963H2472L03251I2059M8519D3875J51286
13307A95161j1082G2641L74291j43279G1439L99701B6564J02823J12115A14252
$$ plain form
13296 258002 27134 302221 72063 181236 91018 260049 217995 22665 193325 -103651
13285 178178 193715 -109020 142477 247483 283229 228718 219118 339495 -117799 61799 25958
13273 183407 231531 -102059 283542 -129429 62777 -83507 432905 -43807 55582 277931
13263 277931 138045 -195710 302309 377281 13637 -70909 130233 140831 210789 298760 -4196
13251 386539 297434 94886 138288 -83502 -41799 168911 84972 -46004 -68230 72099 -308867
13239 266642 371220 88880 52163 427107 -144951 207816 315014 120863 -32630 68536
13228 -6956 -44237 6506 164091 46280 163742 218973 197740 156860 217319 -14583 -35578 42557
13215 413356 -209885 171748 139517 81701 103130 62603 -187402 132216 278204 417428
$$ packed form
13296B58002B7134K75087G2063J09173r0218J69031m2054B2665J70660a03651
13285A78178J5537a09020A42477J05006L5746n4511r600J20377a17799F1799B5958
13273A83407M8124a02059B83542a29429F2777h3507D32905d3807E5582K22349
13263B77931A38045a95710C02309P4972A3637g0909A30233J0598O9958Q7971d196
13251C86539q9105I4886M3402h3502M1703A68911q3939d6004k2226G2099c08867
13239B66642J04578H8880l6717L74944a44951B07816J07198A20863c2630F8536
13228f956l7281F506J57585D6280J17462N5231k1233m0880O0459a4583k0995D2557
13215D13356b09885A71748l2231n7816K1429m0527a87402A32216J45988J39224
$$ plain form
13205 417428 212729 301452 311406 383803 439673 11042 526492 -109353 19839 293880 202603
13194 202603 -239125 146175 -3284 -57370 547378 -184006 273496 467803 -92659 -64390
13184 -64390 152317 85957 105286 97929 158607 31807 -336512 -235821 89752 215017 45018
13172 269814 5144 384988 -26412 151550 262387 208981 -488296 321708 469197 -116615
13161 -78328 96307 313287 4814 321849 -141619 266897 131443 38156 -18479 121753 15409
13149 271794 -159214 284857 202724 -69480 56453 -2907 266998 19022 41618 -7922 -219499
13138 -219499 357096 -297914 -188552 -173720 149251 74372 355884 64332 -81692 178089
13127 241999 41132 171697 268442 303635 21548 304344 202079 269143 -354564 275567
$$ packed form
13205D17428k04699Q8723R954P2397N5870A1042N15450a09353A9839K74041r1277
13194B02603b39125A46175c284n4086E47378a84006B73496J94307i2659K8269
13184f4390A52317o6360J9329p357O0678C1807c36512J00691H9752J25265D5018
13172B69814E144L79844b6412A51550J10837n3406d88296C21708J47489a16615
13161g8328I6307K16980D814L17035a41619B66897A31443C8156a8479A21753A5409
13149B71794a59214B84857q2133f9480E6453b907B66998A9022K2596g922k11577
13138b19499C57096b97914J09362J4832A49251G4372K81512F4332h1692A78089
13127B41999D1132J30565R6745L5193B1548K82796j02265O7064c54564B75567
$$ plain form
13116 -41206 -117156 220688 186615 108279 110219 -5141 415363 -51199 34942 -26015 -3203 -129093
13104 -129093 -11453 -21743 371601 191596 221580 125198 385695 -58248 666329 274988
13093 230985 -6856 46315 249530 -486505 154810 49120 -381896 98006 -60955 89208 11096
13081 102057 224539 123752 -114903 50280 200973 82043 26630 -3302 -5366 165784 -20419
13069 -37640 -53610 -132849 309651 -147374 106163 -133470 207175 328194 138137 -23826
13058 121351 -226168 -234637 461694 304095 197650 -30928 -72255 -50225 22930 373264 -57810
13046 211479 260798 248616 143078 262946 -35707 153338 253356 184520 -98529 122028
13035 119017 206572 -98314 67023 28947 194390 164042 87544 218926 285080 13042 177172
$$ packed form
13116d1206p5950B20688l4073p8336J940e141D15363e1199C4942b6015c203j25890
13104a29093a1453j0290C71601j80005K9984r6382K60497e8248F66329B74988
13093B30985f856D6315K03215d86505A54810D9120c81896I8006f0955H9208A1096
13081A02057J22482j00787a14903E0280J50693H2043B6630c302k064A65784b0419
13069c7640j5970p9239C09651a47374A06163a33470B07175J21019A38137b3826
13058A21351b26168q469D61694j57599j06445c0928m1327K2030B2930L50334e7810
13046B11479M9319j2182j05538J19868c5707A53338J00018o8836i8529A22028
13035A19017Q7555i8314F7023B8947J65443l0348p6498J31382O6154A3042J64130
$$ plain form
13024 177172 -21662 -217568 -321550 272399 62912 -87100 57148 -129311 284440 147270
13014 147270 301557 -307081 29055 -217927 -149848 313397 73012 -58853 360045 265318
13004 265318 198365 -10071 98283 272140 125315 -195049 55882 310511 224582 83069 114490
12993 114490 55439 -101339 254811 222664 191512 -42643 221820 335745 -93144 -29073 -154236
12982 -154236 279084 48494 -248463 146029 -28059 -240013 201235 94777 512940 225610
12971 159542 158586 -15236 45673 -87604 173638 56583 30973 307906 -214742 -118369 -119671
12960 -119671 113922 395548 37128 298652 216495 -24585 72392 -9012 245353 263544 264974
12949 264974 34076 7509 80065 209178 387948 164959 -15934 45865 -130628 -15081 116947
$$ packed form
13024A77172b1662j95906j03982B72399F2912h7100E7148a29311B84440j37170
13014A47270J54287c07081B9055b17927O8079C13397G3012e8853C60045r4727
13004B65318o6953a0071I8283J73857A25315a95049E5882K54629q5929H3069L1421
12993A14490E5439a01339B54811l2147l1152d2643B21820J13925i3144b9073j25163
12982a54236B79084D8494b48463A46029b8059k11954B01235I4777M18163B25610
12971A59542r56a5236D5673h7604A73638E6583k5610K76933b14742R6373j302
12960a19671A13922K81626C7128K61524q2157b4585G2392i012B45353J8191J430
12949B64974C4076G509P2556J29113J78770A64959a5934D5865a30628a5081A16947
$$ plain form
12937 371881 67601 299861 -33470 44266 17399 88010 168171 104812 -268920 -111625 187442
12925 51776 -88256 -399001 -64261 436186 207856 -273831 544803 256290 -50836 -139720
12915 -139720 166793 155696 44593 113305 143138 -38332 -241673 163179 222231 -105158 -40138
12903 -43269 64298 -118259 182385 -276537 -255467 1708 268132 166856 -6745 -2806 -49360
12892 -49360 -208007 -45938 8480 -73880 196251 143725 40232 136407 10550 186722 27264
12880 425192 152508 192309 -430032 35766 69580 185404 358723 168177 258922 16673
12869 38458 -13741 51875 -103780 185602 433616 20121 232248 -33304 154012 -342 -193384
12858 -193384 -99589 155616 -245815 -44615 -11691 -31352 81055 -45393 -135533 217000 -164944
$$ packed form
12937C71881F7601K32260c3470D4266A7399P0611Q0161o3359b68920a11625A87442
12925E1776h8256l10745f4261D36186B07856b73831E44803B56290e0836q8884
12915a39720A66793j1097D4593O8712K9833c8332k03341A63179N9052a05158d0138
12903d3269F4298a18259A82385b76537K1070A708K66424j01276f745b806m6554
12892d9360j58647d5938H480g3880A96251n2526D0232R6175A0550J76172B7264
12880D25192A52508L9801d30032C5766L3814J15824J73319A68177R0745A6673
12869C8458a3741E1875a03780A85602K48014B0121K12127c3304A54012c42j93042
12858a93384R3795A55616b45815d4615a1691j9661H1055d5393r0140B17000a64944
$$ plain form
12846 219064 316030 -12749 220045 332286 -168288 90793 -258136 223285 -415220 -11159
12835 -148059 -128413 -244561 185852 -29902 -43068 58132 12418 259600 146366 -416817
12824 162320 -353799 -241329 -47928 186828 118132 -26499 -248317 234396 -55463 -314141
12814 -314141 88222 -196917 494042 99689 163750 306613 -154383 38733 41158 -38686 126267
12802 -34003 135484 273053 -81384 167488 37608 -398 237523 13219 378669 246299 -47208
12790 -18259 240123 -25503 269448 -140434 -93389 90750 166793 50112 134542 -66613 -431150
12779 -431150 -36481 134124 162563 -274214 -346663 -86293 -436486 257464 112909 -160165
12768 -18504 113647 -149768 -24822 296234 12796 29416 56197 166831 -363844 -562370
$$ packed form
12846B19064R6966a2749B20045J12241a68288I0793b58136B23285d15220a1159
12835a48059J9646j16148A85852b9902j3166E8132A2418K47182j13234d16817
12824A62320c53799J12470d7928A86828o8696b6499k21818B34396e5463k58678
12814c14141H8222a96917D94042I9689O4061J42863a54383C8733K425c8686A26267
12802c4003A35484J37569h1384A67488C7608c98B37523A3219L65450j32370d7208
12790a8259B40123b5503B69448a40434M7045I0750P6043E0112Q4430f6613l64537
12779d31150c6481A34124K8439b74214p2449h6293l50193B57464A12909a60165
12768a8504A13647a49768b4822B96234A2796J6620K6781J10634c63844j98526
$$ plain form
12758 -562370 298538 38889 130604 -202745 -208199 126795 46197 72106 -152240 22749 -16247
12746 193096 126526 221233 -75449 74633 89998 -198546 294224 72187 -233339 510701 147848
12734 11409 -58577 -130550 121143 83589 -315690 -135413 -148764 37170 14664 263610 236949
12723 236949 41028 114984 -12328 -10791 311065 -163224 -51586 -200769 -17320 133876 -36232
12711 87281 -41350 47172 -205050 219136 760 394523 146234 301051 315651 65883 -64329
12699 81637 72439 93972 -12234 115954 -236505 33194 219317 193241 47689 308438 -347793
12687 155292 98509 168763 -61309 1394 217065 323174 29774 -37644 -202254 22158 -147638
12675 -400190 232643 90582 -195210 251805 218287 -166865 -53969 288462 -121190 212852
$$ packed form
12758e62370B98538C8889R1715b02745n454A26795D6197K5909a52240B2749a6247
12746A93096o6570R4707g5449G4633J5365a98546B94224G2187b33339E10701A47848
12734A1409e8577p1973A21143l7554c15690a35413j3351C7170A4664K48946k6661
12723B36949D1028P3956a2328J537C11065a63224e1586j49183a7320A33876c6232
12711H7281d1350D7172b05050B19136G60L93763A46234J54817J4600F5883f4329
12699H1637r198K1533a2234A15954b36505C3194J86123k6076D7689K60749c47793
12687A55292n6783P0254f1309A394K15671J06109B9774c7644j64610B2158a47638
12675d00190B32643I0582a95210B51805l3518a66865e3969B88462a21190B12852
$$ plain form
12664 137185 -17834 20450 128512 368316 27923 178070 305011 230997 180841 -63176 139555
12652 86972 193878 223427 116940 208497 24276 127200 276483 -108475 96990 107685 17134
12640 -56870 -49913 -105692 94579 6306 178900 212698 70123 -27079 174616 297965 265695
12629 265695 286712 359678 180450 106685 180941 56384 -79493 454813 214228 -273334 178783
12617 317633 189861 235690 -122754 -130357 37800 -21620 91972 -125353 69525 -66003 6494
12605 -122093 -98575 22593 28535 -123541 26258 -149922 -99156 105566 58529 14306 99927
12594 99927 -189072 191733 216955 139953 135142 115482 -265416 190078 -79228 22446 112769
12583 112769 -41043 -118232 -16402 -37939 142002 201906 -144416 -66360 -176456 103129 92798
$$ packed form
12664A37185a7834B0450J08062K39804B7923J50147J26941p4014n0156f3176A39555
12652H6972J06906K9549j06487R1557B4276J02924J49283a08475I6990J0695A7134
12640e6870O957n5779I4579F306J72594L3798G0123b7079A74616J23349l2270
12629B65695K1017P2966j79228p3765P4256E6384g9493D54813B14228b73334A78783
12617C17633j27772M5829a22754p603C7800b1620I1972a25353F9525f6003F494
12605a22093K3518B2593N942a23541B6258a49922N0766A05566m7037A4306Q5621
12594I9927a89072A91733K5222p7002m811j9660b65416A90078g9228B2446R0323
12583A12769d1043p7189a6402k1537A42002N9904a44416f6360j10096A03129j0331
$$ plain form
12572 92798 128387 269918 165107 -85691 150946 -11214 -67184 225844 56361 -169162 -24074
12560 -34762 309930 346087 493637 -56336 101517 130150 77199 26028 -78171 9740 -251857
12548 190185 -299379 10194 329536 30756 99701 -101797 86553 -349492 164 22089 -69042
12536 -35505 160198 451224 -63211 397647 40509 -229895 -109501 165313 -14871 -198771
12526 -198771 -132103 279740 36061 96987 -169574 107363 124092 657392 272504 136230
12515 224086 406084 184047 273204 -14275 126295 175923 73386 19939 -142887 45906 -144245
12503 200374 -192950 275478 90138 -139994 180929 93788 252966 44510 -41055 -324929
12493 -324929 194088 -84013 -402209 9145 32953 194763 25683 -88125 22138 43529 -64400
$$ packed form
12572I2798L5589J41531j04811h5691A50946a1214n5970B25844E6361a69162b4074
12560c4762C09930L6157J47550e6336A01517K8633n2951B6028g8171I740b51857
12548A90185b99379A0194L19342C0756O8945a01797H6553c49492A64K1925f9042
12536c5505A60198K91026f3211C97647D0509b29895a09501A65313a4871j83900
12526a98771O6668B79740C6061O0926a69574A07363J6729N33300B72504A36230
12515B24086J81998A84047Q9157a4275A26295M9628G3386A9939a42887D5906a44245
12503B00374a92950B75478I0138a39994A80929q7141J59178D4510d1055k83874
12493c24929A94088h4013l18196I145K3808J61810B5683h8125B2138K1391f4400
$$ plain form
12481 -113203 -214606 -30095 131381 -1645 425502 94545 -145133 9064 212418 172548 -68639
12469 -135210 67386 106350 6661 -160268 68002 113139 14681 314541 357697 -102226 498755
12457 390529 -6951 -314124 -240270 79985 -102986 141147 -120717 -53882 -108705 -301035 47780
12445 -121656 325393 71593 -50117 418426 36693 23709 7421 -25975 -8982 -21925 35059
12433 276356 288801 -14109 236523 -93840 37941 143569 -390199 251500 -321656 -398993
12423 -398993 94185 63062 -98681 -25046 62456 41757 54925 115886 28240 265593 56366
12411 -189892 177845 -267258 -2215 -248090 -7392 151560 -193539 475519 220251 -121355
12400 -121053 151115 -77352 175563 -120878 -85442 226905 -318161 -328373 197424 -179463
$$ packed form
12481a13203j01403c0095A31381a645D25502I4545a45133I064K03354l9870f8639
12469a35210F7386L8964F661a60268F8002M5137A4681K99860M3156a02226D98755
12457C90529f951l07173P3854G9985a02986A41147a20717e3882n4823j92330D7780
12445a21656C25393G1593e0117D18426C6693j2984G421b5975h982j2943C5059
12433B76356J2445a4109B36523i3840C7941J05628c90199B51500c21656p7337
12423c98993I4185l1123i8681b5046F2456k0699J3168O0961B8240K37353E6366
12411a89892A77845b67258b215k45875g392A51560a93539D75519B20251a21355
12400a21053A51115g7352A75563a20878L5436B26905c18161j0212A97424a79463
$$ plain form
12389 408470 65585 -65948 -150679 282242 141719 -27109 -201796 -43973 -141616 27344 -152902
12377 -10131 102407 -65019 -247952 99547 -198204 339292 -39925 235614 199878 -286680
12366 131769 -43516 36549 130285 43177 164800 335220 -312380 107131 157298 285958
12356 285958 -215994 275710 -54116 97882 160696 3377 -17399 26665 345130 37918 123916
12345 123916 -297877 82772 2263 93905 80232 87175 -279033 41015 18211 -138534 -64431
12333 -112880 -196887 -2248 11747 149558 9078 130437 -107500 357978 -146633 218489 -141373
12321 31240 177978 199144 213521 -15016 -491837 -194696 41994 -73789 -252871 -19430 70525
12309 -81039 221632 98347 159786 -25392 -364203 -193021 53054 -69303 -81929 223470 83503
$$ packed form
12389D08470F5585f5948q4731B82242j40523b7109j74687d3973r7643B7344a52902
12377a0131A02407f5019j82933I9547a98204C39292c9925B35614l5736b86680
12366A31769d3516C6549R3736D3177J21623J70420c12380A07131N0167J28660
12356B85958b15994B75710e4116I7882O2814C377a7399B6665L18465C7918Q5998
12345A23916b97877H2772B263R1642j3673O943b79033D1015A8211a38534f4431
12333a12880q4007b248A1747J37811I078J21359a07500C57978a46633B18489a41373
12321C1240J46738K1166J4377a5016m76821a94696D1994g3789j79082a9430G0525
12309h1039B21632I8347O1439b5392l38811J71182E3054f9303j2626B23470H3503
$$ plain form
12297 329392 376139 -136044 224375 245895 143726 -81655 235285 79198 -41823 -44075 52350
12285 83151 137163 -41895 325072 509329 73854 42262 77573 -111134 -1538 -467877 43919
12273 117891 423141 458858 73995 -223863 417198 148305 93505 -232401 -63217 132194
12262 -41995 -45252 -4099 229388 -154159 130905 190468 132439 -22315 114356 50552 151839
12251 151839 -22875 263603 -49329 -26153 418314 124225 76789 18645 221418 72634 286974
12240 286974 244019 54408 -46785 140158 -33725 140899 -58897 -9513 27390 23424 256416
12229 256416 65438 -121794 -118195 -106243 48491 160598 315966 391089 453943 272112 515000
12218 515000 31806 137603 -17244 1217 238375 -135262 -146066 -73170 36481 207798 164356
$$ packed form
12297C29392M6747a36044B24375K1520j02169h1655B35285G9198d1823k252E2350
12285H3151N4012d1895C25072J84257G3854l1592L5311a11134a538m66339D3919
12273A17891L05250L5717G3995b23863D17198A48305n4800b32401f3217A32194
12262d1995l257d099B29388a54159A30905N9563n8029b2315A14356E0552J01287
12251A51839b2875B63603d9329K3176D18314A24225m7436A8645K02773G2634K14340
12240B86974m2955E4408d6785A40158c3725A40899e8897i513B7390l966K32992
12229B56416F5438a21794L599J1952D8491J12107J55368P5123O2854j81831K42888
12218E15000C1806J05797a7244A217K37158a35262j0804P2896C6481J71317m3442
$$ plain form
12207 164356 104568 -485224 -25472 247708 314765 -85185 82930 352674 27473 362691 36070
12195 -144430 -14994 -185028 216527 253286 113921 157674 170490 196728 82936 144087 298283
12184 298283 -117303 190357 -29081 -235124 354543 156865 -215619 -87672 89907 134507
12174 134507 -190673 -61616 -114117 383596 -16758 41740 303708 -210607 150493 213286
12164 213286 195478 -71764 79448 -71653 149035 427893 2415 25559 250685 -129876 33702
12152 130183 19539 262585 -41507 -18062 -571 215620 25371 -32122 312051 265343 -277613
12140 253189 203673 69215 175242 -97273 81565 -93644 195430 163425 -150236 -255651 -226635
12129 -226635 -150779 -31641 -99168 -220760 286156 -114109 214134 381197 -7010 295421
$$ packed form
12207A64356n9788d85224b5472B47708O7057h5185H2930K69744B7473L35218C6070
12195a44430a4994j70034B16527L6759A13921M3753J2816K6238H2936O1151J54196
12184B98283a17303A90357b9081k06043C54543A56865b15619h7672H9907M4600
12174A34507a90673f1616n2501C83596a6758D1740K61968b10607A50493O2793
12164B13286j7808g1764G9448g1653A49035K78858B415K3144K25126a29876C3702
12152A30183A9539K43046d1507a8062e71B15620B5371c2122C12051m6708b77613
12140B53189m9516F9215J06027i7273H1565i3644A95430l2005a50236j05415K9016
12129b26635P5856c1641o7527j21592B86156a14109B14134J67063g010B95421
$$ plain form
12118 192004 -39056 58689 80616 9700 -127401 215338 67698 282659 153209 -44415 -37461
12107 -37461 2183 267926 45905 261702 -140328 36480 460907 -200143 40143 82697 -156194
12095 -7177 -129264 -79860 15724 65359 -61293 -33952 -159721 77998 202550 259282 74274
12083 64310 -33107 9360 10475 54910 85165 30910 104342 -187102 73664 -327122 -152069
12071 2903 -19636 -15707 -2857 -15467 -271799 -30582 -132553 135068 -288204 47475 -68001
12059 -28564 69386 84554 74727 225874 264868 169664 520288 1161442 889724 331273 313707
12048 313707 58559 -22066 77010 -84456 226610 -290885 -31751 60243 9893 -121012 -96 -210435
12036 -210435 -48152 -52205 293898 -23294 -281639 42208 -125140 27730 -125371 63434 -1542
$$ packed form
12118A92004c9056E8689K1927I700a27401B15338F7698K14961j29450d4415O954
12107c7461B183K65743D5905K15797a40328C6480M24427b00143D0143M2554a56194
12095g177j22087M9404A5724M9635f1293K7341j25769G7998J24552N6732G4274
12083F4310c3107I360J115M4435L0255C0910P3432a87102G3664c27122a52069
12071B903a9636L929b857j2610k56332c0582j01971A35068b88204D7475f8001
12059b8564F9386J5168r827J51147L8994r5204L50624O41154k71718C31273j7566
12048C13707E8559b2066G7010h4456B26610b90885c1751F0243I893a21012i6k10339
12036b10435d8152m053B93898b3294k58345D2208a25140B7730a25371F3434a542
$$ plain form
12024 -2251 107915 3052 16080 -62492 -325380 -314108 157532 199974 69662 -313798 74535
12012 -45317 108567 157346 -233703 -313021 35024 -150917 381665 269700 -224552 -6818 -25651
12001 -25651 -15494 314457 -240847 -110746 97217 48317 -3767 -165003 -137560 -522657 -89646
11989 -165081 -101943 -137025 -198645 72727 170794 315017 -129708 -173690 80476 -421427 261922
11977 -96946 14676 12945 8793 -48343 -247767 -115906 -5188 4224 -168722 309159 92524 -188721
11964 123896 -85231 191517 -67095 -283916 88690 -148979 367244 220918 221528 67114 -613306
11952 228683 -106935 68587 -61880 73148 -22835 45688 -178900 -105520 -69159 -68731 435001
11940 64861 -265221 165685 434127 123292 175300 137919 100451 -262359 -348341 -252847 -151409
$$ packed form
12024b251A07915C052J3028f2492k62888J1272A57532M2442F9662c13798G4535
12012d5317A08567M8779b33703p9318C5024a50917C81665j11965b24552f818j8833
12001b5651J0157C14457b40847a10746I7217D8317c767j61236K7443l85097h9646
11989a65081O3138l5082o1620G2727R8067J44223a29708m3982H0476d21427B61922
11977i6946A4676j731m152d8343j99424a15906e188D224a68722C09159I2524a88721
11964A23896h5231A91517f7095k16821H8690a48979C67244j46326O10F7114f13306
11952B28683a06935F8587f1880G3148b2835D5688a78900P3380L6361M28D35001
11940F4861b65221A65685K68442A23292N2008l7381l7468b62359q5982R5494J01438
$$ plain form
11929 -151409 -330000 6709 17386 -306998 -216052 -208013 174457 -96639 -355279 97276 26956
11917 -62393 126223 -15584 24498 4072 -32343 -257065 -1935 -156902 134702 -78886 454228
11905 -296065 -390161 -37359 -68818 -224301 114906 61769 -26789 -121318 19037 -397577 -222537
11894 -222537 180093 -38621 -63109 -301848 260083 62107 446866 86928 -62550 -106573 -21831
11882 -52626 -125390 215998 -168211 -12479 459494 -129803 -84203 120033 137811 273440
11872 273440 211568 -311643 -182146 -220449 -136527 -88444 131136 -272690 37258 -319083
11861 -165152 12268 -140300 5686 -159009 89901 -129885 -133345 -144478 -44732 32974 -185551
11849 67487 -199827 86498 -152977 -317872 392030 -37723 -29064 -83229 216164 -92516 -64430
$$ packed form
11929a51409j78591F709J0677c06998R0946Q039A74457i6639k58640I7276B6956
11917f2393A26223a5584B4498D072c2343k24722a935j54967A34702g8886D54228
11905b96065r4096c7359l1459j55483A14906n3137b6789r4529A9037c97577J75040
11894b22537A80093c8621k4488k38739B60083F2107L84759H6928f2550m4023b1831
11882e2626p2764B15998a68211a2479D59494a29803M5600A20033J7778J35629
11872B73440o1872c11643J29497l8303Q3922M8083A31136b72690C7258c19083
11861a65152A2268a40300E686a59009H9901a29885l460j1133d4732C2974a85551
11849F7487a99827H6498a52977j64895C92030c7723Q659n4165B16164i2516K8086
$$ plain form
11838 -64430 224371 -163187 32219 135149 -44017 -254306 49277 98808 -226148 -19670 12105
11826 -28780 -104902 -358139 -142318 173178 144187 -233326 -290278 -283076 325985 -30721 -269606
11815 -269606 83608 56446 297275 -41166 165222 -52420 127806 224996 -52876 85692 -127481
11803 -168592 54538 -183690 -53502 -58489 -251385 -9193 124517 87202 -160615 -319313 -28622
11791 -132470 170739 180517 -253283 -259602 -194035 165750 -8834 160130 -235374 53525 -160658
11779 109278 -47865 79286 -222454 228908 -27426 -151030 -318744 180910 73969 -205920
11768 -163683 101078 -82005 167341 8328 -193701 94221 76303 178186 -158443 -402312
11758 -402312 123615 29287 -245238 -19491 -72798 18403 -42502 -307283 -72857 -9115 94543
$$ packed form
11838f4430B24371a63187C2219J02930d4017k10289D9277M9531b26148a9670A2105
11826b8780p6122k53237a42318A73178k8991b33326n6952P202C25985c0721k38885
11815b69606H3608k7162K40829d1166A65222e2420A27806R7190e2876H5692a27481
11803a68592E4538a83690e3502m987j92896i193A24517l7315a60615j58698b8622
11791a32470A70739R778b53283o319O5567A65750h834A60130b35374E3525a60658
11779A09278d7865G9286b22454B28908b7426j23604j67714A80910G3969b05920
11768a63683A01078h2005A67341H328a93701I4221j7918J01883a58443k43869
11758d02312A23615B9287b45238a9491n3307A8403d2502k64781g2857i115I4543
$$ plain form
11746 -69823 270334 41532 36566 3874 9451 -173763 -265660 -80089 -440087 -177122 -204546
11735 -204546 110629 -264476 -10071 -64724 -60429 135868 -140053 156330 -243044 107711
11724 -43779 98134 139766 -285771 140333 -95242 -880 329662 -79913 -3511 -180135 -74653
11712 2766 -205149 251446 -78495 389639 -44049 -189541 177790 77561 -94945 265963 -53193
11700 174674 141263 -250270 -100487 99346 -28275 -188854 -113486 266356 -140483 122791
11689 -62466 -42644 -65617 -30707 -179323 -101102 -169461 -88463 29854 162639 -47933 -85415
11678 -85415 69747 -15299 506561 -263957 -228357 319929 99728 -60618 -138506 57393 -139103
11666 -16864 -57345 234541 -135111 -134336 185277 -220867 355042 -108347 -361842 104973
$$ packed form
11746f9823B70334D1532m966C874N577a73763r1897h0089l59998a77122k7424
11735b04546A10629b64476a0071n4653M295A35868a40053A56330b43044A07711
11724d3779I8134M1632b85771A40333i5242h80C29662g9913c511j76624g4653
11712B766b05149B51446g8495C89639d4049j45492A77790G7561i4945B65963e3193
11700A74674l3411b50270a00487I9346b8275j60579P5368B66356a40483A22791
11689f2466J9822k2973c0707j48616P8221o8359Q0998B9854J32785d7933l7482
11678h5415F9747a5299E06561b63957L5600C19929I9728f0618p7888E7393a39103
11666a6864m0481B34541a35111P75A85277b20867C55042a08347k53495A04973
$$ plain form
11655 -167562 95181 -70681 -195305 30063 -270041 -69277 -99588 -105110 -113419 -241798 214794
11643 -116948 -347289 -39908 53996 86042 -22639 28359 -20838 79739 -262582 116857 37268
11631 -100215 -149697 -68817 81346 -69384 -254401 -231524 -321745 188509 51704 -242930 250533
11619 -183690 82665 18689 -311170 -3420 -9530 -240364 -10684 140502 17056 123870 -79849
11607 184590 -202788 -3949 -138636 -134543 -119088 344346 -159025 200007 60454 50138 -59576
11595 -228260 -118412 -12451 32115 93033 -207790 -78183 4115 -97538 29396 199671 -165341
11583 399026 -18813 398679 70595 122362 -418921 86367 25462 274408 -211974 333825
11572 36847 -9073 -82961 -106140 95046 -89109 -145439 -19046 -2972 431060 112164 -93028 72399
$$ packed form
11655a67562I5181g0681j24624C0063b70041f9277l0311n522q309j28379B14794
11643a16948k30341c9908E3996L2046b2639B8359b0838G9739b62582A16857C7268
11631a00215m9482f8817H1346f9384j85017K2877r0221A88509E1704b42930B50533
11619a83690H2665A8689c11170c420o110k30834a0684A40502A7056J06814g9849
11607A84590b02788c949j34687M093J5455C44346a59025B00007F0454j0316e9576
11595b28260J09848a2451C2115O0918b07790g8183D115i7538B9396J70275a65341
11583C99026a8813C98679G0595N1767d18921H6367B5462K48946b11974C33825
11572C6847i073p3888k3179I5046h9109n6330a9046b972D31060A12164i3028G2399
$$ plain form
11559 223706 60492 134742 -81760 -44218 52836 103837 -28339 -65304 -67530 18649 -10232 278938
11546 260206 -44462 -96940 -37055 -334038 60865 189354 -100590 146696 -136958 -51474
11535 149421 -155067 263176 2351 242930 159146 425044 -25986 158424 -90502 77101 17506
11523 -108299 45339 14110 -457047 145777 185359 214360 162235 -163220 24304 319087 68338
11511 250450 -263663 29057 14070 -100419 138285 -215548 31365 -154291 -126367 -186939
11501 -186939 141585 90532 -65351 35716 236147 85796 85019 304703 -208338 135865 80099
11490 80099 -52914 205691 120865 92954 67613 -99237 182710 136664 70529 266273 158441
11479 158441 261591 164510 210035 53997 -99278 -80712 27267 34054 154579 99173 -58039
$$ packed form
11559B23706F0492P4250h1760L7542E2836N1001b8339l6965k226A8649a0232B78938
11546B60206d4462n2478c7055k96983F0865J28489a00590A46696a36958e1474
11535A49421a55067B63176B351K40579q3784K65898b5986A58424i0502G7101A7506
11523a08299D5339A4110d57047A45777L9582K9001n2125a63220B4304K94783F8338
11511B50450b63663B9057A4070a00419A38285b15548C1365a54291K7924o0572
11501a86939A41585n1053f5351C5716K00431H5796p77K19684b08338A35865n5766
11490H0099e2914B05691q4826k7911k5341i9237A82710m6046o6135J95744j07832
11479A58441J03150r7081M5525E3997i9278J8566B7267O787J20525n5406e8039
$$ plain form
11467 -292702 8417 198176 -204234 -9924 100491 9566 154227 234534 417186 182031 90651
11455 426456 121222 66911 264596 184446 -125174 130040 -41693 -160388 -105185 -97630 86671
11443 -331786 -4179 -10260 -54042 2093 220669 -45575 248295 124523 521841 -132360 87615
11431 -149191 98681 111639 78751 -168108 -47180 401531 -111379 92798 249639 368201
11421 368201 -171512 -64185 82231 2897 202996 -182371 -131498 94158 29967 75583 15127
11409 101295 16185 -102597 8396 -250664 40506 337594 -2555 -5731 -25421 116991 -119377
11397 49765 151794 -24931 328252 137488 258586 -150179 110782 -2420 -190911 -44206
11386 164082 -39519 99989 -77262 69746 12614 -23214 72585 -129307 170054 80972 290600
$$ packed form
11467b92702H417J89759b04234i924A00491I566J44661Q0307J82652A82031I0651
11455D26456A21222n4311J97685q0150a25174A30040d1693j18695N5203P555H6671
11443c31786d179o081m3782B093K18576d5575B48295j23772L97318a32360H7615
11431a49191I8681J2958l2888a68108d7180D01531a11379I2798J56841J18562
11421C68201a71512f4185H2231B897K00099a82371N0873I4158B9967M5616A5127
11409A01295A6185a02597H396b50664D0506K97088b555l176j9690A16991a19377
11397D9765J02029b4931C28252A37488J21098a50179A10782b420j88491d4206
11386A64082c9519I9989g7262F9746A2614b3214G2585a29307A70054H0972K09628
$$ plain form
11375 290600 -244375 -119384 228265 224458 -8558 -71756 -49247 156151 -196396 -95016 -95659
11364 -95659 -159353 -315625 -5061 241691 -71259 -319799 -54441 -2185 47202 210379 -10621
11352 -16041 -250114 -103086 -121064 76095 88166 225824 233159 100211 206796 -62049 -32169
11341 -32169 -192087 65595 224636 -191396 26132 69342 2653 163692 -304556 82774 101165
11330 101165 -3736 -220484 -57283 87901 -173744 182871 62036 4211 -222564 -72055 323962
11318 -32399 -65149 33717 84880 230189 -128272 147242 63570 -272222 145113 -521487
11307 -109631 1496 376030 -21590 102998 72000 85080 107876 -266662 275997 -109336 -125492
11296 -125492 -145408 -260410 52460 28605 -97311 -125393 41641 33944 46019 281696 -697273
$$ packed form
11375B90600b44375a19384B28265l807h558o3198K2509A56151a96396i5016o43
11364i5659o3694j56272e061B41691g1259k48540e4441b185D7202J63177a0621
11352a6041k34073a03086j7978G6095J2071J37658P335A00211J06585f2049K9880
11341c2169j59918F5595J59041a91396B6132M3210B653J61039c04556H2774J8391
11330A01165c736k16748e7283H7901a73744A82871F2036D211b22564g2055C23962
11318c2399l2750C3717N1163J45309a28272A47242F3570b72222A45113e21487
11307a09631A496L74534b1590A02998l0998J3080K2796b66662B75997a09336j6156
11296a25492j9916j15002E2460k3855i7311k8082D1641p697J2075K35677f97273
$$ plain form
11284 -6621 244402 354962 -97246 -61936 102378 -221698 -48618 -84268 -87472 -199812 -154072
11273 -154072 -21544 115235 -291808 239976 263643 188451 42176 -11929 29642 46201 -21006
11261 120014 -200236 -52098 -108270 -318354 41228 56046 97773 118319 173648 124344 -55471
11249 -17601 -238879 48519 -196040 -127735 197673 -113916 137497 93049 180297 -348076
11238 -90066 -17906 -29478 -46262 63264 -64750 -105601 224667 146395 380989 -137334 -203123
11227 -203123 -274579 -30152 4178 -19708 -198596 109814 -181597 151203 9750 -157702 -210774
11216 -210774 -68970 -370202 -316887 -54821 90330 68543 -54468 27660 63623 -50607 -70998
11205 -70998 -109142 -428523 -20184 -67595 -58646 -58411 72513 -694613 -112522 -12480 97903 -57875
$$ packed form
11284f621B44402J10560i7246L5310A02378b21698d8618l5650l204j12340M5740
11273a54072b1544A15235b91808B39976K3667p5192D2176a1929B9642J6559b1006
11261A20014b00236e2098n6172k10084D1228J4818M1727K0546N5329m9304e5471
11249a7601k21278D8519a96040O8305A97673a13916A37497m4448Q7248c48076
11238i0066a7906j1572j6784F3264f4750m0851B24667p8272K34594a37334o5789
11227b03123p1456c0152D178a9708j78888A09814a81597A51203I750a57702n3072
11216b10774f8970l01232N3315e4821I0330k1787e4468B7660L5963e0607k0391
11205g0998l8144l19381b0184m7411Q949K35G2513f94613a12522a2480I7903e7875
$$ plain form
11192 -192587 -40798 -150592 226533 -39304 -149050 38330 12845 -226473 7641 -42598 -66213
11181 -66213 -123043 -127944 289994 -60663 -149733 -28360 49363 255013 -186217 -13994 -112657
11170 -112657 -237110 -111105 104897 121625 147487 -261384 130972 -280188 107549 68474
11160 68474 -368824 -18661 -45188 91645 169389 155337 37791 -153988 69234 86104 -3827
11148 -150875 -24717 -322960 -10377 36786 71325 3971 -176762 -164033 -20960 300748 -4521
11136 116222 182109 -204450 -157098 74613 236159 257839 131098 -30381 67739 239345 -73328
11124 6770 -225378 -21768 13079 28508 -224693 -4889 273864 178182 112663 172365 119988
11113 119988 111042 -61415 218841 222786 54639 193598 -93119 -44207 194099 76389 460210
$$ packed form
11192a92587d0798j09794B26533c9304j09746C8330A2845b26473G641d2598k3615
11181f6213n6830m901B89994f0663q9070b8360D9363K05650a86217a3994r8663
11170a12657j24453a11105A04897J6728K5862b61384A30972b80188A07549l9075
11160F8474c68824a8661k6527I1645P7744j4052C7791a53988F9234J6870c827
11148a50875b4717k98243a0377C6786L4539C971a76762J2729b0960C00748d521
11136A16222O5887b04450M7352G4613J61546K1680j26741c0381F7739J71606g3328
11124F770b25378b1768A3079J5429b24693d889B73864r5682o5519N9702n2377
11113A19988q946f1415B18841L945E4639J38959i3119d4207A94099G6389L83821
$$ plain form
11102 460210 3975 214361 109900 156903 54019 -110311 141531 121299 36068 205527 -250351
11090 194073 7642 167720 299004 58715 66685 6780 434435 -337304 190156 132512 -285445
11078 57881 284471 104766 196699 235643 447486 223748 383876 17292 142426 204197
11068 204197 284529 408227 250100 -148405 357337 520833 443207 199343 531399 237822
11057 404632 514300 590014 638844 357596 538664 818615 492186 654555 541366 490311
11047 490311 526747 968589 581759 627594 643660 678993 489630 461995 590520 754505
11037 754505 865625 770255 649441 727923 495138 522155 117375 520895 643263 643836 317850
11025 689488 451647 474162 182734 646056 392738 462085 688781 438292 533990 469184
$$ packed form
11102D60210C975K10386j04461M7003E4019a10311A41531k0232C6068J69459b50351
11090A94073G642J60078J31284E8715P970F780M27655c37304A90156n7644b85445
11078E7881K26590A04766R1933L8944K11843k23738J60128A7292J25134O1771
11068B04197Q0332J23698j58127a48405C57337J63496p7626A99343L32056B37822
11057D04632J09668P5714M8830k81248J81068K79951l26429J62369j13189n1055
11047D90311L6436M41842l86830M5835J6066L5333j89363k7635J28525J63985
11037G54505J11120r5370j20814P8482k32785K7017A17375M03520J22368N73C17850
11025F89488k37841K2515A82734M63322k53318O9347K26696k50489R5698o4806
$$ plain form
11015 469184 388341 445677 174248 92852 860112 537503 407810 463284 460091 479374 659590
11004 659590 645551 287479 338913 185841 239291 553778 563671 472598 764290 588278 326867
10993 326867 602040 406409 361744 448327 379731 872356 529633 621498 824229 730103
10983 730103 743553 1134750 919349 1082930 1444900 1184620 1629100 1567103 1540022 2039848
10973 2039848 2317761 2151660 2045973 2416556 1649334 2097534 1707523 1296962 1414458
10964 1414458 904956 1514768 1067862 976731 1045441 785045 1004806 830819 1120718 774322
10954 774322 969597 690151 407199 446501 110350 447637 412028 359763 83403 148817
10944 148817 167997 464144 819418 -97785 225975 216166 45582 225046 -11299 -275278 -91554
$$ packed form
11015D69184q0843N7336A74248q1396P67260l22609j29693N5474l193J9283J80216
11004F59590j4039B87479N1434j53072N3450L14487R893r1073K91692j76012k61411
10993C26867K75173j95631m4665Q6583o8596M92625l42723R1865K02731r4126
10983G30103J3450L91197k15401J63581L61970k60280M44480o1997k7081M99826
10973B039848K77913j66101j05687L70583p67222M48200l90011m10561J17496
10964A414458n09502O09812m46906r1131O8710k60396K19761j73987K89899l46396
10954G74322J95275k79446k82952L9302A10350L37287l5609n2265H3403O5414
10944A48817J9180K96147L55274i7785B25975r809D5582J79464a1299k63979i1554
$$ plain form
10932 -266594 24949 -87339 -83455 -270514 431 104071 168407 -43442 40881 18833 58264 -162939
10919 47462 12985 74184 -29486 -38020 -237305 115328 -91085 -107763 -81916 -93 28568 234149
10907 234149 -31074 -33698 258481 -282620 271943 -261787 -218906 -162524 -136796 -250277 -115747
10895 183752 -66996 164432 -98423 80709 -193964 -178414 134184 -4288 77735 31722 162447
10884 162447 -91939 -303295 24494 -312919 60472 127496 287904 207659 30699 -149390 149348
10872 11580 49811 111911 -350029 281356 21589 29540 63556 100323 -142213 -150939 -31824
10860 82499 36689 -106316 190399 -150265 -25744 78373 85266 -44603 -301888 -442677 202927
10848 128994 -169609 -21153 154464 277417 -452637 -163595 179625 10144 149917 114870
$$ packed form
10932b66594B4949h7339L884j87059D31J03640O4336d3442D0881A8833L9431a62939
10919D7462A2985O1199b9486q534j99285A15328i1085j6678K5847i3B8568K05581
10907B34149c1074k624B58481b82620B71943b61787M2881N6382K5728j13481a15747
10895A83752f6996A64432i8423H0709a93964J5550A34184d288G7735C1722J30725
10884A62447i1939k11356B4494c12919F0472O7024J60408q0245C0699a49390A49348
10872A1580L8231O2100c50029B81356B1589P951L4016L6767a42213q726c1824
10860H2499C6689a06316A90399a50265b5744G8373O893d4603k57285j40789B02927
10848A28994a69609b1153A54464J22953d52637a63595A79625A0144J39773l5047
$$ plain form
10838 114870 -114419 -9929 -159163 -66915 330549 284013 95823 -42195 67595 -96655 127272
10826 45131 26907 -213944 92898 -342542 141534 -232789 -389551 -126306 -27642 -415586
10816 -415586 -145576 -300350 -204283 84982 -363719 -272576 -35471 -157238 -234691 38887 216130
10805 216130 -174491 -102456 -63220 -33203 137269 121156 58808 -70791 -144155 -127196 267713
10793 -123600 372032 -167967 20788 74857 -119060 -143316 107969 113232 55808 85605 95387
10782 95387 261152 219321 12312 -26853 -157116 218578 -79977 40889 150763 340735 -50496
10770 151381 291494 -9493 74294 -195527 104574 147458 -228601 215743 112171 -125164
10759 -145002 118728 114374 154387 -230148 -109752 11868 -200913 -96574 -10148 -100271 -229821
$$ packed form
10838A14870a14419i929j49234f6915C30549m6536I5823d2195F7595i6655A27272
10826D5131j8224b13944I2898c42542A41534b32789j56762a26306b7642l87944
10816d15586a45576j54774R6067H4982c63719R1143c5471j21767p7453C8887J77243
10805B16130a74491P2035L9236L0017A37269j6113E8808g0791p3364J6959B67713
10793a23600C72032a67967B0788N4069a19060k4256A07969N263E5808K9797R782
10782I5387J65765m1831A2312b6853j30263B18578g9977D0889J09874J89972e0496
10770A51381J40113i493G4294a95527A04574M2884b28601B15743j03572a25164
10759a45002A18728m354M0013b30148a09752A1868b00913i6574a0148r0123j29550
$$ plain form
10748 -229821 -187221 -120161 106180 -237157 -533613 -263751 -294621 180325 -83412 41375
10737 -199649 -226564 -271846 169594 -263704 177047 -48746 124075 136242 -143293 -467531
10727 -467531 -177036 -22619 13178 -160307 -87784 121873 -131269 120039 -143323 -51190
10716 -361259 96147 80271 -408619 -337169 -96272 161649 160078 -190279 -52846 -160871 -86565
10705 -86565 -206494 -262736 -173613 -39790 -106054 -174193 -40711 92693 -400379 -100751 77347
10693 233713 33789 -303961 -116828 34828 -170599 84624 112038 124816 -82230 346409 -54027
10681 50144 -25229 -299608 -121254 9967 -8736 -333373 -101068 -245835 200978 -55523 -250567
10670 -250567 -148148 -73885 -83907 -391422 170139 337787 68329 59144 87365 -17910 50571
$$ packed form
10748b29821M2600O7060A06180b37157k96456b63751l0870A80325h3412D1375
10737a99649k6915m5282A69594b63704A77047d8746A24075J2167a43293l24238
10727d67531a77036b2619A3178a60307P2523A21873a31269A20039a43323e1190
10716c61259I6147j5876d08619P1450i6272A61649j571a90279e2846j08025P4306
10705h6565j19929n6242Q9123c9790o6264o8139d0711I2693d00379a00751G7347
10693B33713C3789c03961a16828C4828a70599H4624K7414J2778h2230C46409e4027
10681E0144b5229k74379a21254I967h736l24637a01068j44767B00978e5523j95044
10670b50567J02419g3885j0022l07515A70139J67648F8329r185K8221a7910E0571
$$ plain form
10658 249010 -65091 16272 22556 9654 131418 22961 9006 31962 79089 -27319 75244 140461
10646 140461 44309 -25348 142516 99526 -18351 85775 -227674 159877 -340389 227075
10635 -93930 -324133 -376032 280550 -218727 -115611 -392969 -136376 129060 -121293 115162
10624 30979 -29009 -18599 91553 -124110 20723 -40120 -111784 100695 -60928 -262638 150933
10612 -115158 -159659 -158386 140050 -79779 183342 83397 -55610 82896 61624 -18955 97701
10600 -172415 198066 -23191 -65296 -141876 57917 -424095 -253640 92743 -250394 159264
10589 207227 139589 84206 -301068 -85381 -196760 -288237 -92722 -106050 179273 -425575 259166
10577 109592 115626 63951 -153405 401620 -261097 283390 9696 -64491 -64225 -116568 -55650
$$ packed form
10658B49010f5091A6272O284I654J21764B2961I006K2956M7127b7319G5244O5217
10646A40461D4309b5348A42516m2990a8351H5775b27674A59877c40389B27075
10635i3930k30203n1899B80550b18727J03116k77358a36376A29060a21293A15162
10624C0979b9009J0410I1553a24110B0723d0120p1664A00695f0928k01710A50933
10612a15158m4501J273A40050g9779A83342H3397e5610H2896k1272a8955I7701
10600a72415A98066b3191m2105p6580E7917d24095J70455I2743b50394A59264
10589B07227o7638n5383c01068h5381j11379r1477i2722j3328A79273d25575B59166
10577A09592O034n1675a53405D01620b61097B83390I696f4491K66n2343e5650
$$ plain form
10565 -207155 -126027 308384 34400 -392518 -6431 -17268 214740 -26963 295274 167709 -132260
10553 -73414 160616 -7812 -77869 50504 44242 18806 -83596 258727 180154 -80601 153569
10541 -74437 -271838 112132 -171876 -171505 -38082 -41922 20624 55992 -109078 -47678 116659
10529 -156470 -342989 -6357 182604 -157545 -176651 -144969 -124957 2021 117043 -244973 116916
10517 72483 86483 -70 -175125 -31756 -244771 -251501 -145510 -160558 121555 -165431 65975
10505 -80926 88608 -86143 375867 -136335 -248562 137584 -71422 -66807 103216 -46066 64126
10493 -88713 -119149 -302504 -223930 -237150 -173878 76432 -98876 -31401 105549 -264284 -394537
10482 -394537 -116086 320857 72409 -240779 -39991 -6093 -116022 -360588 181679 -193789
$$ packed form
10565b07155Q1128C08384C4400c92518f431j0837B14740b6963B95274j27565a32260
10553g3414A60616g812p0057E0504o262A8806h3596B58727p8573h0601A53569
10541g4437j97401A12132a71876L71c8082l840B0624L5368a09078d7678A16659
10529a56470j86519f357A82604a57545j9106L1682K0012B021J15022b44973A16916
10517G2483J4000g0j75055c1756k13015o730J05991j5048A21555a65431F5975
10505h0926H8608h6143C75867a36335j12227A37584g1422M615A03216d6066F4126
10493h8713l0436j83355P8574j3220O3272G6432i8876c1401A05549b64284j30253
10482c94537a16086C20857G2409b40779c9991f093j09929k44566A81679a93789
$$ plain form
10471 406157 -214615 221675 194174 -130768 176198 -37749 -124609 -23805 157666 -323207
10460 -54507 35928 -109197 -422380 -84333 -208294 -93251 -139472 193695 -205422 -101174
10449 -109030 -389080 15991 349984 -140382 52239 -164292 -249133 44884 -81026 64499 -21824
10437 279841 278724 106178 46984 -32982 -277693 255661 166754 6288 286379 106468 41095
10425 -57407 -231562 -72977 -149044 -103257 -295054 -78666 97186 -54699 110638 45194 -60876
10413 -160915 36073 158145 -154808 -162515 131255 -236748 115648 -261706 -139310 -151552
10403 -151552 149969 -230969 42367 377504 -175556 40839 97195 -134041 -173551 113325
10392 159114 -174546 95426 435787 -70264 -78982 10880 -115347 230574 309485 130717 -247486
$$ packed form
10471D06157b14615B21675k7501a30768A76198c7749q6860b3805A57666c23207
10460e4507C5928a09197l13183h4333j23961i3251m6221A93695b05422a01174
10449a09030k80050A5991L33993a40382E2239a64292q4841D4884h1026F4499b1824
10437B79841j117A06178D6984c2982k44711B55661q8907F288K80091A06468D1095
10425e7407j74155g2977p6067M5787j91797g8666I7186e4699A10638D5194f0876
10413a60915C6073J22072a54808p707A31255b36748A15648b61706J22396j2242
10403a51552A49969b30969D2367L35137a75556D0839N6356a34041l9510A13325
10392A59114a74546I5426L40361g0264q718A0880a15347B30574P8911A30717b47486
$$ plain form
10380 40364 72335 -33474 330184 15943 280882 -9365 -224096 255155 156144 -208179 288461
10368 445722 412632 441369 661430 139394 288510 7967 334862 -63010 209073 -42855 132405
10356 -180457 474295 -18716 581927 324151 57149 371725 627198 434066 175847 138304
10346 138304 152240 -196864 500386 367579 237688 323141 12440 -65639 279059 364438
10336 364438 374540 67581 285522 90413 -151721 -49265 -292089 193556 169671 158931 -133066
10324 214635 107675 -117159 -70207 715825 421297 -161953 -8989 153174 134187 319432
10314 319432 148463 -167034 180187 -269047 -369101 -71116 134030 -232056 -94521 50227
10303 89698 99239 -6208 213630 -288578 -2472 34712 211652 18553 33655 8688 -13578 -32692
$$ packed form
10380D0364L1971c3474C30184A5943K64939i365k14731B55155r9011b08179B88461
10368D45722l3090K8737K20061A39394J49116G967L26895f3010B09073d2855A32405
10356a80457D74295a8716E81927k57776E7149L14576K55473j93132A75847l7543
10346A38304J3936a96864E00386j32807j29891Q5453A2440f5639B79059Q5379
10336C64438J0102F7581K17941I0413a51721d9265k42824A93556k3885j0740a33066
10324B14635j06960a17159M6952G15825k94528a61953h989A53174j8987J85245
10314C19432A48463a67034A80187b69047j00054g1116A34030b32056i4521E0227
10303H9698R541f208B13630b88578b472C4712J76940A8553J5102H688a3578j9114
$$ plain form
10291 -32692 45411 -49721 -103823 75261 153550 -92946 -57959 -13334 227622 11310 172076
10280 172076 165037 -150 -111274 146837 -28658 -136188 107828 283491 26479 -419590 53112
10268 -47644 -141200 -359489 -131602 -177024 121032 22468 56006 -204309 78032 154610 76778
10256 130152 112591 39958 399324 13230 -54076 -37027 57980 307138 -177357 -88193 -32912
10244 39990 -40570 71283 8363 393776 91334 120894 256287 224765 203464 106858 -184354
10232 -37069 84044 2737 305832 -140008 -315573 -105785 -28821 90947 -429156 85551 -124779
10220 -210958 -131225 30246 -207587 168122 135528 -280607 231399 64684 197406 -79468
10209 -134318 -243823 294675 -22751 -255599 -228844 97608 -242724 178991 277558 141397
$$ packed form
10291c2692D5411d9721n4102G5261P8289i2946L4987a3334B27622A1310J60766
10280A72076p039a50j11124A46837b8658j07530A07828J75663B6479d19590E3112
10268d7644r3556k18289a31602m5422A21032B2468L3538b04309G8032P6578G6778
10256A30152j7561C9958L59366A3230e4076J7049E7980K49158a77357h8193c2912
10244C9990d0570G1283H363L85413I1334K9560J35393l1522k1301r6606a84354
10232c7069H4044B737L03095a40008j75565a05785b8821I0947d29156H5551a24779
10220b10958P9733C0246b07587A68122l2594b80607B31399F4684J32722g9468
10209a34318j09505B94675b2751k32848K6755I7608b42724A78991R8567j36161
$$ plain form
10199 141397 -65641 50791 37763 -91521 4563 58249 -206401 7541 -152348 157186 -147313
10187 -214345 1246 61944 -33006 -48985 -35456 -85272 -112839 -254418 139036 99352 -170620
10175 -36486 -328981 -239379 -136352 -154357 -110828 -124227 -123884 -63947 98070 -183374 -118321
10164 -118321 1128 -18390 -210004 -271826 -272119 -191418 261284 52881 123571 110491 3913 39587
10152 39587 -7190 39490 -356727 -388154 182707 -201906 195520 -10390 28725 254067 68331
10140 -25731 -98881 190190 144047 -384815 -286794 927 -133432 -138127 -228112 -57427 -93252 -351371
10128 -351371 5875 -447752 -202110 126485 -248590 -173274 -167180 185675 -337734 -96219 -86744
10117 -86744 128139 -51670 -433562 -85553 44108 -64220 -108129 188587 -104919 -57124 -168176
$$ packed form
10199A41397f5641E0791j3028i1521D563N3686b06401G541a52348A57186a47313
10187b14345A246O0698c3006j5979J3529m9816k7567j41579A39036l9684a70620
10175c6486k92495Q9602J03027j8005M3529j3399L43N9937I8070a83374O5053
10164a18321A128a8390j91614o1822k93Q0701B61284E2881P0690j3080C913L5674
10152C9587g190C9490c56727l1427A82707b01906A95520a0390B8725K25342F8331
10140b5731p3150A90190m6143c84815R8021I27a33432m695q9985e7427l5825k58119
10128c51371E875d47752b02110A26485b48590P5316O094A85675c37734i6219R475
10117h6744A28139e1670l81892h5553D4108f4220m3909A88587a04919M7795j11052
$$ plain form
10106 -168176 -25282 -29621 -374242 150873 -14128 -85052 222512 251034 -221792 -190319 30324
10094 299540 369897 105827 25385 -219126 -22761 83239 134445 280960 -83950 -384980 -65771
10082 -23105 -74752 -191042 167179 110319 -172350 -154710 -40236 -237934 -116739 -125521 -199881
10071 -199881 5157 -190976 -76856 105737 -111294 -16181 -127483 -187661 -302347 -72612 -59213
10060 -59213 265187 -370466 -46546 -126836 -121246 -320300 -350211 -268169 -92359 -41464 194132
10048 -282705 25972 -168798 -30820 51216 2878 -81092 -58300 -327673 -54663 -194064 -65533
10036 52139 -68840 105257 -47572 -79841 85453 -250500 382782 -324523 -13352 126400 -118875
10024 -43055 -138750 135656 -52703 -306985 5495 119463 -111012 205372 -491557 -50014 -134250
$$ packed form
10106a68176b5282m339l44621A50873a4128p0924B22512K8522b21792L1473C0324
10094B99540P0357A05827B5385b19126b2761H3239N1206J46515h3950l01030f5771
10082b3105n1647j16290A67179n6860a72350J7640d0236j97698a16739q782p4360
10071a99881E157a90976g6856A05737a11294a6181j11302o0178j14686g2612J3399
10060e9213B65187c70466d6546q0290N590j99054k9911Q2042i2359d1464A94132
10048b82705B5972a68798c0820E1216B878h1092K2792k69373e4663j39401f5533
10036E2139f8840A05257d7572l2269H5453b50500C82782c24523a3352A26400a18875
10024d3055r5695A35656e2703k54282E495J13968a11012B05372d91557e0014q4236
$$ plain form
10013 -134250 -228529 -201918 156282 78553 -317106 -25416 -3140 -56337 -44641 68605 191349
10002 191349 -78787 -42622 88552 -212749 -166898 -273902 189661 14989 -80454 -257086 63704
9990 10284 -548284 -8177 125020 226069 -393955 166390 -107898 -362795 138613 98370
9980 98370 -23123 -207939 -155861 -63799 -68850 180191 -205239 39965 181425 -94583 -51348
9969 -51348 -30884 -271883 -46137 90330 -515872 -265827 -115552 -245744 59521 234792 -165834
9957 -328182 -126341 -226402 -17864 17115 81399 -214912 -271823 -447326 -162634 -229115 -137360
9946 -137360 -14584 -7331 199732 -399973 -371197 294307 -261348 -180973 -311917 127261 72579
9935 72579 9705 -123197 19418 -154406 250990 36345 -82916 -237790 -180255 55240 -68577
$$ packed form
10013a34250r4279K6611A56282p7729c17106b5416c140n3197J1696F8605J22744
10002A91349g8787L6165H8552b12749M5851j07004A89661A4989h0454j76632F3704
9990A0284e48284h177A25020J01049c93955A66390a07898k54897A38613m0243
9980I8370b3123j84816N2078f3799n051A80191b05239C9965J41460i4583M3235
9969e1348K0464k40999d6137I0330e15872K50045a15552j30192E9521J75271a65834
9957c28182a26341j00061a7864A7115O4284b14912n6911j75503a62634o6481R1755
9946a37360a4584P253A99732c99973K8776B94307b61348Q0375j30944A27261n4682
9935G2579I705a23197A9418a54406B50990C6345h2916j54874N7535E5240f8577
$$ plain form
9923 -182770 -433 184256 -181691 -183974 62239 -379339 -26348 145668 -24619 -69343 -151260
9912 -151260 -371271 -120860 -177007 -61763 -90038 -155150 -172730 -81219 -161677 7468 -342307
9900 -270666 -189757 11523 -92339 -17564 -275137 -245957 -197434 -293908 80345 122372 -221721
9888 15465 -139424 91933 -323794 -98183 395323 -235282 -157112 -140277 60108 -173545 -13583
9876 27160 -143552 -340769 -58446 -120955 -11527 -122810 -384981 185316 390519 -91696 -127632
9865 -127632 -107688 -186227 -47272 -159408 55598 14160 4930 -122689 -221140 27286 155685
9854 155685 -183415 -142953 118726 -26185 345873 -412146 77344 -78694 -303563 52817 15727
9842 23792 16017 -48508 141161 -302160 65373 94086 -196239 -16178 164419 -271922 -188575
$$ packed form
9923a82770d33A84256a81691k283F2239c79339b6348A45668b4619m4724q1917
9912a51260k20011a20860n6147f1763k8275o5112j7580h1219q0458G468c42307
9900b70666Q0909A1523i2339a7564k57573K9180M8523r6474H0345M2027b21721
9888A5465a39424I1933c23794i8183C95323b35282P8170J6835F0108a73545a3583
9876B7160a43552j97217e8446o2509a1527j11283k62171A85316K05203i1696l5936
9865a27632J9944p8539d7272j12136E5598A4160D930a22689r8451B7286J28399
9854A55685a83415M0462A18726b6185C45873d12146G7344g8694k24869E2817A5727
9842B3792p775d8508A41161c02160F5373K8713a96239a6178A64419b71922Q3347
$$ plain form
9831 -188575 -90245 69648 -240491 55703 -343462 28924 -81655 108221 81173 -90186 200537
9819 82343 -28280 -288643 -165471 246457 -308163 -417211 -49548 -211310 -180753 -4495 -212916
9808 -212916 282547 119542 5274 75030 -252238 13480 8356 204123 -31730 -115899 125193
9796 -85214 -264251 494 191917 -6613 3415 -298601 -207448 -8176 -51535 -84568 -73898 -1406
9783 -84955 -214298 -246962 -31526 50548 -192272 -98379 -79388 -105371 -13188 -426265 -72928
9771 311399 -35013 -120922 -138049 232320 -124344 -131829 -43511 -481358 72373 -134545 -197678
9760 -197678 -146505 255051 -13306 -134356 -188576 -147169 239816 18941 90807 -223507 -169703
9749 -169703 27309 21063 177566 -141873 -3220 -158438 -196363 -158101 32401 -238159 124772
$$ packed form
9831a88575i0245F9648b40491E5703c43462B8924h1655A08221k7048i0186B00537
9819H2343b8280k60363J23172B46457c08163j09048d9548j61762L0557d495k08421
9808b12916B82547A19542E274O9756b52238A3480n124J95767c1730q4169A25193
9796h5214j79037D94J91423f613C415b98601R1153h176m3359l3033J0670a406
9783h4955j29343l2664c1526E0548a92272R3893J8991k5983a3188m13077g2928
9771C11399c5013q5909j7127B32320a24344p485d3511m37847G2373a34545o3133
9760a97678N1173B55051a3306j21050n4220M1407B39816A8941P1866b23507N3804
9749a69703B7309o246J56503a41873c220j55218l7925L8262C2401b38159A24772
$$ plain form
9737 180354 159351 91112 60343 -140050 4442 -169015 4110 109541 96346 -22507 89589
9725 52307 62178 68829 -170889 -76149 -327266 -45820 -17622 52911 204502 44190 -64157 -266868
9713 -266868 -282254 -170046 -100595 177409 210497 -166832 -289814 154703 -382126 -92200
9702 169548 21718 7831 114860 -152733 -60571 152393 181310 -604138 97750 12148 -22866
9690 2267 56878 -106694 -162771 -28644 -203319 -493004 -209298 62167 -241368 -157387 154552
9678 65601 18329 40961 -194198 -82234 134057 -386094 -82641 -257040 -209870 76105 -111343
9666 -253359 -133422 -106272 194376 83776 -186685 -178024 117978 112148 -48027 -169597 325439
9654 259749 145462 336555 40512 -152052 -128005 -96051 148483 295652 189270 -80736
$$ packed form
9737A80354k1003o8239l0769a40050D442a69015D110J05431j3195b2507H9589
9725E2307R871O651a70889g6149k51117d5820a7622E2911J51591D4190f4157k02711
9713b66868j5386J12208O9451A77409L3088a66832j22982A54703c82126i2200
9702A69548B1718G831J07029a52733f0571A52393K8917f04138I7750A2148b2866
9690B267N4611a06694n6077b8644j74675k89685b09298F2167b41368Q3981A54552
9678F5601A8329K2632a94198h2234A34057c86094h2641j74399M7170G6105a11343
9666b53359J19937K7150A94376H3776a86685Q661A17978n830d8027j21570C25439
9654B59749j14287J91093D0512a52052K4047L1954A48483J47169j06382h0736
$$ plain form
9643 -437932 39993 -49976 29456 31652 -21928 -48650 -258634 -216793 -112668 -83554 148927
9631 -227684 69456 -22530 -101685 -47443 -205962 149237 252524 73264 -54151 -64448 -24146
9619 -18158 217316 39490 -113257 -128228 -75445 -209140 316488 -74437 -54163 -138147 -34458
9607 153344 42902 26385 51251 -121153 -49970 101886 -154458 12577 147909 -204217 154800
9595 -65804 -743 -142844 -120073 -13020 167056 19960 26494 136917 29473 149618 -184 -168139
9583 -168139 89433 7777 -247184 -131745 -14480 -599997 -180787 -191602 -143761 373261 327031
9572 327031 -8894 -360441 -347588 -364259 -56595 10869 -112592 -45576 -32834 381075 -427567
9560 -250690 69619 -447173 -39238 -129148 -143038 337021 -77484 129763 -49973 253515 -151878
$$ packed form
9643d37932C9993d9976B9456K196b1928k6722k09984M1841J04125K9114A48927
9631b27684F9456b2530p9155d7443j58519A49237J03287G3264e4151j0297b4146
9619a8158B17316C9490a13257j4971N2783j33695C16488g4437K0274q3984c4458
9607A53344D2902j6517K4866a21153d9970A01886a54458A2577J35332b04217A54800
9595f5804g43j42101K2771a3020A67056A9960O534J10423B9473J20145a84j67955
9583a68139H9433G777b47184J15439a4480n85517a80787j0815M7841C73261m6230
9572C27031h894l51547J2853j6671e6595A0869a12592d5576J2742C81075d27567
9560b50690F9619d47173c9238q9910j3890C37021g7484A29763d9973B53515a51878
$$ plain form
9548 88107 153711 -501012 82555 174647 295281 -278523 -74861 71027 -84015 -306592 99809
9536 133912 -70176 76878 236352 -210342 59938 -49731 -198145 -158928 -124127 -23856 -282518
9525 -282518 35081 253492 -278500 -13591 -347621 263773 98288 -170272 -347465 -366403
9515 -366403 -146804 189764 64634 -12654 -349759 -88391 27625 -106333 129952 252105
9505 252105 -375195 -184839 -73648 183013 -131970 -237872 -25474 -179710 177836 221901
9495 221901 135995 -56367 338143 -203645 -349329 -124332 -183309 -349519 -173714 -39590
9484 165177 431471 -19124 203573 -211099 -222477 -157938 23185 69572 -41015 -92403 -183379
9473 -183379 -24179 -39600 -313081 -319053 -221039 -15144 -384873 -17191 -183155 -209592 -68948
$$ packed form
9548H8107O5604e01012H2555R2092J20634b78523g4861G1027h4015k22577I9809
9536A33912g0176G6878J59474b10342E9938d9731j48414L9217L4801b3856k58662
9525b82518C5081K18411b78500a3591l34030B63773I8288a70272j77193j8938
9515c66403a46804A89764F4634a2654l37105h8391B7625a06333A29952J22153
9505B52105c75195a84839g3648A83013a31970j05902b5474j54236A77836M4065
9495B21901q5906e6367C38143b03645j45684a24332n8977j66210a73714c9590
9484A65177K66294a9124B03573b11099j1378O4539B3185M6387d1015n1388r0976
9473a83379b4179j5421k73481n972R8014a5144l69729a7191j65964k6437f8948
$$ plain form
9461 -90720 -58516 -98249 147552 162496 -302741 -246653 -88608 -195027 98332 205591 287996
9450 287996 -122173 -128103 -21394 -117580 -233304 83286 -168704 -317347 18860 -164884 -83989
9439 -83989 27705 148398 -229986 -164550 -125567 -77636 -130852 -343901 -96746 -3114 -232018
9428 -232018 -170950 -7140 103948 44821 100411 254167 158692 191991 -201440 -270449 -368378
9417 -368378 165042 -4407 48612 37968 -160073 43491 212328 -88659 -89173 171480 -103520
9405 92024 -164675 -23589 -267298 -44276 -137322 -30368 -205992 -155289 58828 -42596 -106375
9394 -106375 -113545 -42791 166397 -86593 68559 -108221 -156619 -14909 212701 -129570 -141940
9383 -141940 -66300 70533 63939 121722 106897 87614 -221646 -62381 -328674 -279303 119303
$$ packed form
9461i0720L2204l9733A47552J4944c02741N6088h8608j06419I8332J07259Q2405
9450B87996a22173n930b1394r6186j15724H3286a68704j48643A8860a64884Q0895
9439h3989B7705J20693b29986O5436L8983M7931n3216k13049i6746c114k28904
9428b32018O1068g140A03948D4821N5590J53756r5475L3299b01440o9009r7929
9417c68378A65042d407D8612j0644a60073D3491J68837h8659n14A71480a03520
9405I2024a64675b3589k43709d4276r3046c0368j75624N0703E8828d2596o3779
9394a06375p170d2791A66397h6593F8559a08221m8398a4909B12701a29570j2370
9383a41940f6300G0533o594N7783j4825j9283b21646f2381k66293M9371A19303
$$ plain form
9371 -75041 182220 110041 170707 -285590 -339971 -141970 137448 198950 -209048 -304793 -212869
9360 -212869 41021 151422 -212753 -5295 -178138 -18169 -102238 106380 -471409 -192637 288562
9348 -9038 34024 45374 -35047 -110589 239087 -19398 -466824 -167486 -384534 2738 86726
9337 86726 68482 162704 -74261 120648 -444999 -130414 -34895 -133984 57380 -403067 -42684
9325 -371807 40000 -81660 -2685 77363 -301922 -16017 -193095 79002 -371263 -153947 134733
9313 5174 -267234 -276831 -122073 108040 218326 253245 -217239 238435 -134082 -17376 238201
9301 110885 -27803 40110 -316438 47380 -235328 99597 -166276 -167165 173533 -263791 -71439
9289 -230709 155622 219678 11425 -343234 232478 -55920 -125575 -82102 -213522 -175807 -138475
$$ packed form
9371g5041A82220p2179O0666b85590n4381a41970A37448O1502b09048r5745R1924
9360b12869D1021J10401b12753e295j72843a8169q4069A06380d71409a92637B88562
9348i038C4024J1350c5047p5542B39087a9398m47426a67486k17048B738Q3988
9337H6726j8244R4222g4261A20648d44999a30414c4895r9089E7380d03067d2684
9325c71807D0000h1660b685G7363c01922a6017j77078G9002c71263a53947A34733
9313E174b67234r597a22073A08040J10286L4919b17239B38435a34082a7376B38201
9301A10885b7803D0110c16438D7380b35328I9597a66276q89A73533b63791g1439
9289b30709A55622O4056A1425c43234B32478e5920o9655M3473j31420L7715L7332
$$ plain form
9278 -138475 -122419 -311314 110863 22315 -167025 129546 -40642 -69409 18409 176931 -170169
9266 -241879 -238843 24743 -302045 -483299 -162039 -40687 -302867 -132495 -254100 -416477
9256 -416477 130027 104499 217238 -61080 -78136 249476 -220453 -3349 271903 -4960 175196
9244 -53168 161996 340494 -218264 28720 -64668 -107407 -87750 228191 -41477 103328 304321
9233 304321 -157390 -111811 -291712 179296 -204005 -239890 148123 121912 -133426 -54350
9222 -107305 255711 38730 -111596 -146914 -228349 -129504 26731 350002 48149 76112 85421
9211 85421 -318255 -229121 218052 -171726 116169 -328207 -36642 -123332 -92366 -495936 155884
9199 -423438 63473 27454 -164735 -110941 -171293 241803 -132142 109055 -7414 -118743 57369
$$ packed form
9278a38475J6056j88895A10863B2315a67025A29546d0642k8767A8409J58522a70169
9266b41879L036B4743c02045j81254a62039d0687k62180a32495j21605j62377
9256d16477A30027k5528J12739f1080j7056B49476b20453c349B71903d960A75196
9244e3168A61996J78498b18264B8720f4668m2739J9657B28191d1477A03328K00993
9233C04321a57390M5579j79901A79296b04005l5885A48123k6211a33426e4350
9222a07305B55711C8730a11596l5318q1435R8845B6731L23271D8149K7963R309
9211H5421c18255Q9134B18052a71726A16169c28207c6642q6690L0966m03570A55884
9199d23438F3473B7454a64735N3794o0352B41803a32142A09055g414j11329E7369
$$ plain form
9187 218256 -155442 -34898 225647 167326 63922 -196842 35369 124260 -300867 -40721 -115561
9176 -115561 -390431 19792 -192545 -10654 -74973 -238212 -76181 184824 -92717 -71216 55480
9164 -277649 -258045 131212 -220124 -147605 -314428 -282659 -211503 -7987 -80181 471913 -352083
9152 156649 287685 192513 58063 167525 -87961 -300568 11302 124517 -118024 -133926 -266425
9141 -266425 -170433 127501 -202734 101169 -74687 -73600 164278 84147 -117998 -185911 163807
9129 -21836 151715 -48186 66010 176536 -55665 -4595 -120460 104987 94129 59465 -127456
9117 225455 -285100 -108521 -250979 -154350 -253734 182400 -79468 109276 -12990 -173410
9107 -173410 -234771 112498 -265717 232500 17106 -214845 -71959 -282440 308598 43870
$$ packed form
9187B18256a55442c4898B25647n8321F3922a96842C5369Q8891c00867d0721p4840
9176a15561k74870A9792a92545a0654o4319j63239g6181A84824i2717K1501E5480
9164b77649J9604A31212b20124P2519j66823L1769P1156g987p2194D71913c52083
9152A56649J31036r5172E8063J09462h7961k12607A1302J13215a18024j5902j32499
9141b66425R5992A27501b02734A01169g4687J087A64278q0131a17998o7913A63807
9129b1836A51715d8186F6010J10526e5665d595j15865A04987j0858l4664a27456
9117B25455b85100a08521j42458R6629r9384A82400g9468A09276a2990j60420
9107a73410o1361A12498b65717B32500A7106b14845g1959k10481C08598D3870
$$ plain form
9096 61719 71478 -108127 -132947 -13551 27284 -182504 -21789 -115308 125461 23643 -288682
9084 -123355 -143036 -26454 102950 31281 -180406 41344 56241 135109 67468 195886 -134159
9072 54073 16331 -100424 -38713 50500 141572 362612 -60214 -231016 68303 -193545 -276241
9061 -276241 298854 -21292 81431 23639 306153 57228 -22149 -190702 -359178 -24856 -132996
9050 -132996 55447 -118122 -222571 53214 -114791 -357186 123026 -42533 -170331 132603
9039 -303263 98995 128398 151000 410801 -84284 110036 45990 129535 -64374 -187570 56286
9027 -46483 24575 -211160 191119 96264 -193642 -375152 7548 -65509 -34835 -238651 -222397
9016 -222397 -277307 -36996 -24658 -321453 -147073 108576 -139209 -79260 26067 -83109 -134619
$$ packed form
9096F1719R759a08127k4820a3551B7284a82504b1789r3519A25461B3643b88682
9084a23355j9681b6454A02950C1281a80406D1344J4897P8868F7468J28418a34159
9072E4073A6331a00424c8713E0500R1072K21040f0214j70802F8303a93545q2696
9061b76241B98854b1292H1431B3639K82514E7228b2149j68553j68476b4856j08140
9050a32996E5447a18122j04449E3214a14791k42395A23026d2533j27798A32603
9039c03263I8995K9403K2602K59801h4284A10036D5990Q3545f4374j23196E6286
9027d6483B4575b11160A91119r4855a93642j81510G548f5509L0674k03816J6254
9016b22397n4910c6996J2338k96795a47073A08576a39209N9949B6067h3109n1510
$$ plain form
9005 -134619 -144049 30971 256847 121056 29343 -105194 -197533 -7687 25496 11401 -164169
8993 17325 -386058 46079 -94251 -9182 -122787 -80799 107055 125073 8326 -216617 -63795
8981 326939 -344828 83743 96289 -279780 -215529 108558 -281765 -53850 -224661 -98383 -162325
8970 -162325 -93980 -140906 -13928 -374589 -62614 108950 34734 -272951 -195323 295757 -136496
8958 -166897 -113720 3257 -322061 30498 211671 184056 10765 -167178 59703 117382 -40639
8946 -91843 -345877 -101007 -34979 -277561 -278948 9037 -259819 222184 -179075 223714 -278721
8934 48181 273611 -266812 118816 -173311 -260759 112733 -39202 262732 -54827 263809
8923 763035 2678606 6403146 11025417 3688618 1405241 367481 394593 334763 269530
$$ packed form
9005a34619r430C0971K25876A21056B9343a05194r2339g687B5496A1401a64169
8993A7325c86058D6079i4251i182j13605M1988A07055J8018H326b16617f3795
8981C26939c44828H3743J2546b79780O4251A08558b81765e3850j70811i8383o3942
8970a62325O8345m6926a3928l60661f2614A08950C4734b72951P7628B95757a36496
8958a66897N3177C257c22061C0498J81173k7615A0765a67178E9703N7679d0639
8946i1843k54034a01007c4979k42582j387I037b59819B22184a79075B23714b78721
8934D8181K25430b66812A18816a73311q7448A12733c9202B62732e4827B63809
8923G63035J915571L724540M622271C688618A405241C67481K7112n9830o5233
$$ plain form
8914 269530 -44257 13699 -116675 185641 -41762 -185547 334618 160784 -7026 333273 -65716
8902 -270075 -99171 -192442 -291587 -21033 -88040 -45285 -94499 -69470 305574 -181709 140629
8890 -66381 -170238 -143271 13486 35387 -12338 12037 154545 -171011 -187624 91200 -50631
8878 49439 33962 -217126 -240705 -60448 -40458 289819 141536 75860 -162596 -293485 -76978
8866 -232244 -237217 -163207 507059 76607 57187 -220979 189378 -120144 -34845 129407 83363
8855 83363 -83258 139575 -55447 -152223 26375 147792 -87516 -194779 -151004 128799 16566
$$ packed form
8914B69530d4257A3699a16675A85641d1762j43785C34618A60784g026C33273f5716
8902b70075i9171r3271r9145b1033o7007M2755m9214K5029C05574a81709A40629
8890f6381j03857K6967A3486K1901a2338A2037J42508a71011j6613I1200e0631
8878D9439j5477b17126k3579f0448J9990B89819A41536o5676a62596j30889g6978
8866b32244m973P4010E07059G6607j9420b20979A89378a20144c4845A29407m6044
8855H3363h3258A39575e5447r6776B6375J21417h7516j07263M3775A28799A6566
$$ [...]
##END NTUPLES=NMR SPECTRUM
##END=
