
##TITLE=AC1295_UGARS11106_6534052_0wtJG578sq
##JCAMPDX= 6.0         $$ Bruker NMR JCAMP-DX V2.0
##DATA TYPE= NMR SPECTRUM
##DATA CLASS= NTUPLES
##ORIGIN= BRUKER
##OWNER= Administrator
$$ 1.72 TOPSPIN		Version 2.1
$$ 2012-12-04 21:13:08.516 -0500  Administrator@X
$$ Compression mode = diff/dup
##.OBSERVE FREQUENCY= 400.02188249412
##.OBSERVE NUCLEUS= ^1H
##.ACQUISITION MODE= SIMULTANEOUS (DQD)
##.ACQUISITION SCHEME= undefined
##.AVERAGES= 64
##.DIGITISER RES= 22
##SPECTROMETER/DATA SYSTEM= spect
##.PULSE SEQUENCE= noesygpps1d.comp
##.SOLVENT NAME= COFFEE_meoh
##.SHIFT REFERENCE= INTERNAL, COFFEE_meoh, 1, 14.96108
##AUDIT TRAIL= $$ (NUMBER, WHEN, WHO, WHERE, PROCESS, VERSION, WHAT)
$$ ##TITLE= Audit trail, TOPSPIN		Version 2.1
$$ ##JCAMPDX= 5.01
$$ ##ORIGIN= Bruker BioSpin GmbH
$$ ##OWNER= Administrator
$$ $$ E:\/data/COFFEE/nmr/AC1295_UGARS11106_6534052_0wtJG578sq/32/pdata/1/auditp.txt
$$ ##AUDIT TRAIL=  $$ (NUMBER, WHEN, WHO, WHERE, PROCESS, VERSION, WHAT)
(   1,<2012-12-04 21:13:02.766 -0500>,<Administrator>,<X>,<go>,<TOPSPIN 2.1>,
      <created by zg
	started at 2012-12-04 21:01:32.922 -0500,
	POWCHK enabled, PULCHK disabled,
       configuration hash MD5:
       86 BA 57 50 F2 9D 5C 9B 26 00 A9 28 5F 66 2E 89
       data hash MD5: 64K
       E1 97 EE AA 0A CC 02 42 43 BF 4E 7B B0 86 87 4F>)
(   2,<2012-12-04 21:13:05.797 -0500>,<Administrator>,<X>,<proc1d>,<TOPSPIN 2.1>,
      <Start of raw data processing
       efp LB = 0.3 FT_mod = 6 PKNL = 1 PHC0 = 0 PHC1 = 0 SI = 128K 
       data hash MD5: 128K
       F1 04 C5 F5 C4 44 49 0A E2 82 6E 2B 08 3C 92 48>)
(   3,<2012-12-04 21:13:06.812 -0500>,<Administrator>,<X>,<proc1d>,<TOPSPIN 2.1>,
      <pk PHC0 = -75.95398 PHC1 = 0 
       data hash MD5: 128K
       82 9A E6 D3 98 9F EB 66 8D 26 06 A0 4C B5 B6 6D>)
(   4,<2012-12-04 21:13:07.516 -0500>,<Administrator>,<X>,<proc1d>,<TOPSPIN 2.1>,
      <abs ABSG = 1 
       data hash MD5: 128K
       47 9D A2 35 72 49 36 64 22 EE 7E C9 35 3B 6F FD>)
(   5,<2012-12-04 21:13:07.672 -0500>,<Administrator>,<X>,<proc1d>,<TOPSPIN 2.1>,
      <abs ABSG = 2 
       data hash MD5: 128K
       52 D8 5A AE A3 9E B9 A6 48 6D CA FD FD 2F B5 6C>)
(   6,<2012-12-04 21:13:07.844 -0500>,<Administrator>,<X>,<proc1d>,<TOPSPIN 2.1>,
      <abs ABSG = 3 
       data hash MD5: 128K
       6C E3 D3 DC 48 75 80 FE 97 0E 25 39 9F 14 4E 0D>)
(   7,<2012-12-04 21:13:08.016 -0500>,<Administrator>,<X>,<proc1d>,<TOPSPIN 2.1>,
      <abs ABSG = 4 
       data hash MD5: 128K
       E0 C8 EA 9C 90 C1 0E 36 FC FC A2 56 DD A8 6F 8C>)
(   8,<2012-12-04 21:13:08.187 -0500>,<Administrator>,<X>,<proc1d>,<TOPSPIN 2.1>,
      <abs ABSG = 5 
       data hash MD5: 128K
       83 C5 8E 4D 43 AB AD AA 06 75 C4 DC F9 6F 32 47>)
$$ ##END=
$$ 
$$ $$ hash MD5
$$ $$ E1 0A DA 75 86 6E B1 6C CF 41 E8 22 8B D7 C2 9A
##$RELAX= 
##$RELAX= 
##$RELAX= 
##$RELAX= 
##$RELAX= 
##$RELAX= 
##$RELAX= 
##$RELAX= 
$$ Bruker specific parameters
$$ --------------------------
##$DU= <E:\>
##$EXPNO= 32
$$ [...]
##$TP07= 0
##$TPNAME0= <>
##$TPNAME1= <>
##$TPNAME2= <>
##$TPNAME3= <>
##$TPNAME4= <>
##$TPNAME5= <>
##$TPNAME6= <>
##$TPNAME7= <>
##$TPOAL= (0..7)
0.5 0.5 0.5 0.5 0.5 0.5 0.5 0.5
##$TPOFFS= (0..7)
0 0 0 0 0 0 0 0
##$TUNHIN= 0
##$TUNHOUT= 0
##$TUNXOUT= 0
##$USERA1= <user>
##$USERA2= <user>
##$USERA3= <user>
##$USERA4= <user>
##$USERA5= <user>
##$V9= 5
##$VALIST= <valist>
##$VCLIST= <CCCCCCCCCCCCCCC>
##$VD= 0
##$VDLIST= <DDDDDDDDDDDDDDD>
##$VPLIST= <PPPPPPPPPPPPPPP>
##$VTLIST= <TTTTTTTTTTTTTTT>
##$WBST= 2048
##$WBSW= 25
##$XGAIN= (0..3)
0 0 0 0
##$XL= 0
##$YL= 0
##$YMAX_a= 5927894
##$YMIN_a= -11516776
##$ZGOPTNS= <>
##$ZL1= 120
##$ZL2= 120
##$ZL3= 120
##$ZL4= 120
##$ABSF1= 14.96108
##$ABSF2= -5.597102
##$ABSG= 5
##$ABSL= 3
##$ALPHA= 0
##$AQORDER= 0
##$ASSFAC= 0
##$ASSFACI= 0
##$ASSFACX= 0
##$ASSWID= 0
##$AUNMP= <proc_prof1d_extract.lims>
##$AXLEFT= 0
##$AXNAME= <>
##$AXNUC= <1H>
##$AXRIGHT= 0
##$AXTYPE= 0
##$AXUNIT= <>
##$AZFE= 0.1
##$AZFW= 0.1
##$BCFW= 0
##$BC_mod= 0
##$BYTORDP= 0
##$COROFFS= 0
##$CY= 15
##$DATMOD= 1
##$DC= 0
##$DFILT= <>
##$DTYPP= 0
##$F1P= 0
##$F2P= 0
##$FCOR= 0.5
##$FTSIZE= 131072
##$FT_mod= 6
##$GAMMA= 0
##$GB= 0
##$INTBC= 1
##$INTSCL= 1
##$ISEN= 128
##$LB= 0.3
##$LEV0= 0
##$LPBIN= 0
##$MAXI= 10000
##$MC2= 0
##$MEAN= 0
##$ME_mod= 0
##$MI= 0
##$NCOEF= 0
##$NC_proc= -2
##$NLEV= 6
##$NOISF1= 0
##$NOISF2= 0
##$NSP= 0
##$NTH_PI= 0
##$NZP= 0
##$OFFSET= 14.96108
##$PC= 1
##$PHC0= -75.95398
##$PHC1= 0
##$PH_mod= 1
##$PKNL= yes
##$PPARMOD= 0
##$PPDIAG= 0
##$PPIPTYP= 0
##$PPMPNUM= 2147483647
##$PPRESOL= 1
##$PSCAL= 4
##$PSIGN= 0
##$PYNMP= <proc.py>
##$REVERSE= no
##$SF= 400.020009605363
##$SI= 131072
##$SIGF1= 0
##$SIGF2= 0
##$SINO= 400
##$SIOLD= 131072
##$SPECTYP= <>
##$SREGLST= <1H.CDCl3>
##$SSB= 0
##$STSI= 131072
##$STSR= 0
##$SW_p= 8223.68421052631
##$SYMM= 0
##$S_DEV= 0
##$TDeff= 65536
##$TDoff= 0
##$TI= <>
##$TILT= no
##$TM1= 0
##$TM2= 0
##$TOPLEV= 0
##$USERP1= <user>
##$USERP2= <user>
##$USERP3= <user>
##$USERP4= <user>
##$USERP5= <user>
##$WDW= 1
##$XDIM= 131072
##$YMAX_p= 395953209
##$YMIN_p= -12185
##$CURPLOT= <Network HP LaserJet P1505>
##$CURPRIN= <$Network HP LaserJet P1505>
##$DFORMAT= <normdp>
##$LAYOUT= <+/1D_H.xwp>
##$LFORMAT= <normlp>
##$PFORMAT= <normpl>
##$SURQMSG= 1
$$ End of Bruker specific parameters
$$ ---------------------------------
##NTUPLES= NMR SPECTRUM
##VAR_NAME=  FREQUENCY,     SPECTRUM/REAL,   SPECTRUM/IMAG
##SYMBOL=    X,             R,               I
##VAR_TYPE=  INDEPENDENT,   DEPENDENT,       DEPENDENT
##VAR_FORM=  AFFN,          ASDF,            ASDF
##VAR_DIM=   131072,        131072,          131072
##UNITS=     HZ,            ARBITRARY UNITS, ARBITRARY UNITS
##FACTOR=    0.0627417313425164, 1,          1
##FIRST=     8223.62146879497, 1579,         -44698
##LAST=      0,             2566,            -45044
##MIN=       0,             -12185,          0
##MAX=       8223.62146879497, 395953209,    0
$$ Real data points
##PAGE= N=1
##DATA TABLE= (X++(R..R)), XYDATA
$$ [...]
$$ plain form
63924 3255782 3452811 3636225 3800890 3942488 4057520 4143334 4198364 4222083 4214480 4175629
63914 4175629 4105914 4006578 3879931 3729165 3558138 3371279 3173352 2969092 2762927 2558799
63904 2558799 2359979 2168931 1987451 1816894 1658275 1512342 1379769 1261168 1156585
63895 1156585 1065028 984866 914795 854122 801962 756625 716217 679674 646848 617719 591971
63884 591971 569273 549386 531737 515303 499313 483928 469916 457746 447294 438293 430623 424092
63872 424092 418310 413057 408600 405343 403344 402440 402783 404911 409183 415383 422967 431470 440574 450130 460458
63857 460458 472453 486992 504222 523742 545432 569651 596477 625191 654879 685250 716474
63846 716474 748396 780440 812248 843855 874979 904495 930981 953609 972336 987417 999022
$$ packed form
63924C255782J97029J83414J64665J41598J15032Q5814N5030K3719p603l8851
63914D175629o9715r9336j26647j50766j71027j86859j97927k04260k06165k04128
63904B558799j98820j91048j81480j70557j58619j45933j32573j18601j04583
63895A156585r1557q0162p0071o0673n2160m5337m0408l6543l2826k9129k5748
63884E91971k2698j9887j7649j6434j5990j5385j4012j2170j0452r001p670o531
63872D24092n782n253m457l257j999r04L43K128M272O200P584Q503R104R556J0328
63857D60458J1995J4539J7230J9520K1690K4219K6826K8714K9688L0371L1224
63846G16474L1922L2044L1808L1607L1124K9516K6486K2628J8727J5081J1605
$$ plain form
63835 999022 1007162 1011572 1011681 1006996 997617 984150 967057 946369 922190 895158 866145 835654 803801
63822 803801 770836 737365 704046 671326 639559 609096 580084 552339 525665 500272 476829
63811 476829 456128 438640 424165 411815 400523 389777 379691 370303 361110 351597 341988 333021
63799 333021 325096 318099 311914 306500 301308 295302 287988 280137 273085 267527 263203 259414 255497 251097
63785 251097 246381 241884 237832 233843 229645 225717 222658 220160 217313 213895 210687 208420 207098 206479
63771 206479 206470 206665 206186 204610 202645 201316 200810 200608 200429 200367 200296 199943 199597 200000 201282 202560 202930 202463
63753 202463 201857 201478 201191 200913 200802 200909 201026 200937 200544 199699 198235 196363 194773 194127 194590 196009 198304
63736 198304 201318 204425 206824 208371 209792 211860 214658 217809 221046 224152 226698 228455 230053 232641
$$ packed form
63835I99022Q140M410J09m685r379j3467j7093k0688k4179k7032k9013l0491l1853
63822H03801l2965l3471l3319l2720l1767l0463k9012k7745k6674k5393k3443
63811D76829k0701j7488j4475j2350j1292j0746j0086r388r193r513r609q967
63799C33021p925o997o185n414n192o006p314p851p052n558m324l789l917m400
63785B51097m716m497m052l989m198l928l059k498k847l418l208k267j322o19
63771B06479rJ95m79j576j965j329n06k02j79o2p1l53l46M03J282J278L70m67
63753B02463o06l79k87k78j11J07J17q9l93q45j464j872j590o46M63J419K295
63736A98304L014L107K399J547J421K068K798L151L237L106K546J757J598K588
$$ plain form
63722 232641 236737 241787 247013 252272 257905 264112 270715 277265 283158 287975 291929 295611 298966 300922
63708 300922 300561 298393 295888 293775 291416 287954 283532 279075 275235 271876 268466 264731 260990 257989
63694 257989 256360 256090 256517 256918 257166 257824 259613 262684 266363 269698 272320 274666 277243 279916 282142
63679 282142 283734 285012 286238 287298 288071 288827 290023 291858 294200 296817 299495 302003 304126 305887 307680
63664 307680 310079 313330 317102 320836 324278 327372 329698 330548 329836 328461 327279 326041 323844 320390 316117
63649 316117 311241 305522 299081 292705 287024 282001 277538 273943 271353 269240 267144 265492 265079 265981 267563
63634 267563 269390 271534 274065 276818 279708 282772 285889 288906 292058 295748 299876 303909 307858 312636
63620 312636 319078 326926 335205 343373 351745 360977 371540 383656 397362 412515 429067 447451 468404
$$ packed form
63722B32641M096N050N226N259N633O207O603O550N893M817L954L682L355J956
63708C00922l61k168k505k113k359l462m422m457l840l359l410l735l741l001
63694B57989j629k70M27M01K48O58J789L071L679L335K622K346K577K673K226
63679B82142J592J278J226J060P73P56J196J835K342K617K678K508K123J761J793
63664C07680K399L251L772L734L442L094K326Q50p12j375j182j238k197l454m273
63649C16117m876n719o441o376n681n023m463l595k590k113k096j652m13R02J582
63634B67563J827K144K531K753K890L064L117L017L152L690M128M033L949M778
63620C12636O442P848Q279Q168Q372R232J0563J2116J3706J5153J6552J8384K0953
$$ plain form
63607 468404 492181 518110 545274 573622 604032 637095 672113 707548 742178 775368 806296
63596 806296 833603 856046 873033 884192 888918 887040 879803 869518 858050 845904 832742 818281
63584 818281 802516 785417 766744 746042 722876 697363 670585 644150 619223 596196 575264
63573 575264 556746 540580 526091 512785 501104 491916 485478 481396 479358 479245 480598 482758 485710
63560 485710 490126 496201 502959 509318 515486 522746 531887 542307 552710 562346 571568 581530 593504
63547 593504 608276 626012 646766 671003 699383 732115 768848 809251 853191 899976 947478
63536 947478 992221 1030254 1058057 1073354 1075976 1068180 1053708 1036064 1017441 998892 980915 963645
63524 963645 946792 929778 911945 892568 870863 846213 818479 788035 755614 722160 688663
$$ packed form
63607D68404K3777K5929K7164K8348L0410L3063L5018L5435L4630L3190L0928
63596H06296K7307K2443J6987J1159M726j878p237j0285j1468j2146j3162j4461
63584H18281j5765j7099j8673k0702k3166k5513k6778k6435k4927k3027k0932
63573E75264j8518j6166j4489j3306j1681r188o438m082k038j13J353K160K952
63560D85710M416O075O758O359O168P260R141J0420J0403R636R222R962J1974
63547E93504J4772J7736K0754K4237K8380L2732L6733M0403M3940M6785M7502
63536I47478M4743L8033K7803J5297K622p796j4472j7644j8623j8549j7977j7270
63524I63645j6853j7014j7833j9377k1705k4650k7734l0444l2421l3454l3497
$$ plain form
63513 688663 655938 624541 594958 567724 543211 521323 501614 483746 467730 453702 441563
63502 441563 430891 421118 411769 402642 393922 386113 379713 374787 370829 367127 363357 359794 356925 354905
63488 354905 353385 351780 349637 346906 344027 341667 340219 339596 339652 340603 342750 345952 349742 353922 358579
63473 358579 363461 367941 371858 375845 380331 384589 387380 388354 388243 387726 386650 384427 380686 375411 368945
63458 368945 362140 356162 351773 348865 346805 345066 343397 341680 339969 338589 337947 338179 339116 340614 342757
63443 342757 345699 349346 353373 357611 362370 368178 375245 383466 393050 404809 419414 436570 455411
63430 455411 475811 498920 526228 558228 593884 630955 666655 698381 724290 743497 756110
63419 756110 763457 768100 772922 779767 789197 801654 818304 840336 867796 899650 934774 972218
$$ packed form
63513F88663l2725l1397k9583k7234k4513k1888j9709j7868j6016j4028j2139
63502D41563j0672r773r349r127q720p809o400m926l958l702l770l563k869k020
63488C54905j520j605k143k731k879k360j448o23N6R51K147L202L790M180M657
63473C58579M882M480L917L987M486M258K791R74j11n17j076k223l741n275o466
63458C68945o805n978m389k908k060j739j669j717j711j380o42K32R37J498K143
63443C42757K942L647M027M238M759N808P067Q221R584J1759J4605J7156J8841
63430D55411K0400K3109K7308L2000L5656L7071L5700L1726K5909J9207J2613
63419G56110P347M643M822O845R430J2457J6650K2032K7460L1854L5124L7444
$$ plain form
63407 972218 1010471 1047111 1079538 1105956 1125471 1137529 1141659 1137869 1127178 1111503 1092827 1072355
63395 1072355 1050456 1027206 1002688 976738 948846 918660 886454 852880 818400 783240 747826
63384 747826 712997 679797 649239 622140 598855 579059 561976 546899 533505 521836 512141 504641
63372 504641 499192 495228 492283 490537 490637 493029 497696 504477 513312 524128 536811 551378 567932
63359 567932 586375 606477 628322 652349 678721 707011 736842 768658 803390 841293 881354
63348 881354 921887 961436 999012 1033649 1063993 1088429 1105665 1115266 1117730 1114008 1104984 1091365
63336 1091365 1073966 1053902 1032348 1010096 987324 963699 938597 911345 881499 849131 814887
63325 814887 779731 744658 710668 678797 649933 624510 602544 583988 568907 557295 548965 543747
$$ packed form
63407I72218L8253L6640L2427K6418J9515J2058M130l790j0691j5675j8676k0472
63395A072355k1899k3250k4518k5950k7892l0186l2206l3574l4480l5160l5414
63384G47826l4829l3200l0558k7099k3285j9796j7083j5077j3394j1669r695p500
63372E04641n449l964k945j746J00K392M667O781Q835J0816J2683J4567J6554
63359E67932J8443K0102K1845K4027K6372K8290K9831L1816L4732L7903M0061
63348H81354M0533L9549L7576L4637L0344K4436J7236R601K464l722r024j3619
63336A091365j7399k0064k1554k2252k2772k3625k5102k7252k9846l2368l4244
63325H14887l5156l5073l3990l1871k8864k5423k1966j8556j5081j1612q330n218
$$ plain form
63313 543747 541566 542032 543895 544995 542819 535294 521566 502524 480604 458680 438713 421152 405428
63300 405428 390939 377660 365929 355780 346697 338284 331010 325784 322644 320353 317658 314519 311595
63287 311595 308900 305752 301925 298043 294608 291321 287751 284155 281131 278830 276957 275382 274253 273586
63273 273586 273134 272681 272191 271680 271213 270996 271206 271604 271641 271109 270474 270344 270685 270834 270286 269277 268454 268211 268466
63254 268466 268929 269291 269277 268909 268758 269517 271149 272803 273774 274219 274709 275488 276520 277813 279194 280108 280264
63237 280264 280199 280536 280966 280780 280259 280497 281734 282918 283261 283291 283797 284622 285220 285747 286731 288121 289472 290733
63219 290733 292135 293575 294872 296413 298750 301658 304350 306587 308880 311593 314574 317742 321328 325290
63205 325290 329079 332272 334988 337505 339871 342172 344785 348131 352309 357082 361974 366479 370536 374831
$$ packed form
63313E43747k181M66J863J100k176p525j3728j9042k1920k1924j9967j7561j5724
63300D05428j4489j3279j1731j0149r083q413p274n226l140k291k695l139k924
63287C11595k695l148l827l882l435l287l570l596l024k301j873j575j129o67
63273B73586m52m53m90n11m67k17K10L98L7n32o35j30L41J49n48j009q23k43K55
63254B68466M63L62j4l68j51P59J632J654R71M45M90P79J032J293J381R14J56
63237B80264o5L37M30j86n21K38J237J184L43L0N06Q25N98N27R84J390J351J261
63219B90733J402J440J297J541K337K908K692K237K293K713K981L168L586L962
63205C25290L789L193K716K517K366K301K613L346M178M773M892M505M057M295
$$ plain form
63191 374831 380176 386542 393151 399573 406276 413958 422866 432956 444190 456351 468971 481857 495422
63178 495422 510161 525981 542237 558252 573646 588436 602997 617619 631949 645118 656634
63167 656634 666866 676483 685734 694417 702148 708364 712392 713942 713268 710523 705105 696028 682923 666508
63153 666508 648171 629185 610091 590664 570679 550734 531987 514974 499174 483966 469546
63142 469546 456474 444819 434282 424835 416610 409423 403009 397661 393965 391887 390667 389686 388924 388488
63128 388488 388246 388207 388820 390524 393166 396139 399013 401924 405403 409925 415507 421652 427724 433445 439020
63113 439020 444794 450792 456572 461637 466163 471147 477471 484779 491755 497689 503234 509281 515630 521397
63099 521397 526419 531526 537418 543849 550040 555515 560493 565759 572113 579588 587282 594219 600263 605867
$$ packed form
63191C74831N345O366O609O422O703P682Q908J0090J1234J2161J2620J2886J3565
63178D95422J4739J5820J6256J6015J5394J4790J4561J4622J4330J3169J1516
63167F56634J0232R617R251Q683P731O216M028J550o74k745n418r077j3105j6415
63153F66508j8337j8986j9094j9427j9985j9945j8747j7013j5800j5208j4420
63142D69546j3072j1655j0537r447q225p187o414n348l696k078j220r81p62m36
63128C88488k42l9O13J704K642K973K874K911L479M522N582O145O072N721N575
63113D39020N774N998N780N065M526M984O324P308O976N934N545O047O349N767
63099E21397N022N107N892O431O191N475M978N266O354P475P694O937O044N604
$$ plain form
63085 605867 611240 616254 620913 625213 628661 630645 631274 631109 630036 627206 622274 615915 608838 601103 592728
63070 592728 584096 575172 565222 554155 543495 535014 528683 522984 517081 511686 507647 504662 501797 498672
63056 498672 495671 493408 492350 492660 493964 495428 496429 497175 498507 501107 505086 510253 516523 523899 532213
63041 532213 541107 550342 559935 569822 579531 588416 596273 603510 610717 618257 626263 634671 643101 650955
63027 650955 657882 664031 669640 674531 678160 680136 680534 679832 678645 677352 675870 673857 671196 668123 664867
63012 664867 661491 658226 655668 654397 654626 656414 659989 665634 673485 683714 696555 711794 728542
62999 728542 746024 764506 784943 807783 832567 858617 885469 912435 938307 961996 983382
62988 983382 1003274 1022598 1041688 1060228 1077694 1093793 1108460 1121524 1132564 1141165 1147040 1149700
$$ packed form
63085F05867N373N014M659M300L448J984O29j65j073k830m932o359p077p735q375
63070E92728q632q924r950j1067j0660q481o331n699n903n395m039k985k865l125
63056D98672l001k263j058L10J304J464J001P46J332K600L979N167O270P376Q314
63041E32213Q894R235R593R887R709Q885P857P237P207P540Q006Q408Q430P854
63027F50955O927O149N609M891L629J976L98p02j187j293j482k013k661l073l256
63012F64867l376l265k558j271K29J788L575N645P851J0229J2841J5239J6748
62999G28542J7482J8482K0437K2840K4784K6050K6852K6966K5872K3689K1386
62988I83382J9892J9324J9090J8540J7466J6099J4667J3064J1040Q601N875K660
$$ plain form
62976 1149700 1148314 1142285 1131820 1117526 1099583 1077818 1052557 1024788 995312 964236 931589 898069
62964 898069 864811 832685 802093 773221 746133 720781 697250 675914 657129 640787 626339
62953 626339 613147 600657 588419 576239 564294 552810 541612 530253 518620 507153 496252
62942 496252 485666 474750 463332 452040 441635 432207 423280 414626 406599 399577 393420 387728 382401
62929 382401 377612 373339 369317 365430 361824 358633 355864 353595 351915 350605 349189 347532 346082 345331
62915 345331 345243 345383 345367 344966 344044 342723 341481 340762 340538 340480 340488 340772 341453 342384 343409 344531 345764 347068
62897 347068 348559 350570 353305 356578 360071 363795 368065 373031 378470 384138 390120 396659 403724 410993
62883 410993 418181 425065 431106 435454 437696 438382 438444 438139 436972 434619 431428 427795 423510 418115 411721
$$ packed form
62976A149700j386o029j0465j4294j7943k1765k5261k7769k9476l1076l2647l3520
62964H98069l3258l2126l0592k8872k7088k5352k3531k1336j8785j6342j4448
62953F26339j3192j2490j2238j2180j1945j1484j1198j1359j1633j1467j0901
62942D96252j0586j0916j1418j1292j0405r428q927q654q027p022o157n692n327
62929C82401m789m273m022l887l606l191k769k269j680j310j416j657j450p51
62915C45331q8J40j6m01r22j321j242p19k24n8QK84O81R31J025J122J233J304
62897C47068J491K011K735L273L493L724M270M966N439N668N982O539P065P269
62883D10993P188O884O041M348K242O86O2l05j167k353l191l633m285n395o394
$$ plain form
62868 411721 405029 398574 392276 385785 379048 372428 366407 361212 356632 352193 347632 343239 339637 337177
62854 337177 335631 334528 333643 333038 332615 331854 330216 327824 325577 324437 324623 325549 326437 326891 326978 326997 327144
62837 327144 327226 326723 325366 323630 322374 321916 321749 321304 320637 320129 319851 319682 319856 320818 322422 323727 323885
62820 323885 323037 322057 321585 321530 321447 321079 320501 319971 319772 319991 320296 320082 319102 317829 316929 316380 315530 314096 312673
62801 312673 311880 311420 310579 309474 309152 310320 312524 314871 317015 319044 320787 321842 322189 322315 322599 322883
62785 322883 322773 322183 321531 321424 322115 323267 324370 325479 327291 330284 334006 337532 340530 343547 347261
62770 347261 351827 357004 362620 368674 375092 381463 387042 391104 393478 394642 395100 394790 393445 391447 389814
62755 389814 389101 388721 387648 385547 382835 379850 376406 372227 367463 362616 358090 353887 349641 344966 339930
$$ packed form
62868D11721o692o455o298o491o737o620o021n195m580m439m561m393l602k460
62854C37177j546j103q85o05m23p61j638k392k247j140J86R26Q88M54Q7J9J47
62837C27144Q2n03j357j736j256m58j67m45o67n08k78j69J74R62J604J305J58
62820C23885q48r80m72n5q3l68n78n30j99K19L05k14r80j273r00n49q50j434j423
62801C12673p93m60q41j105l22J168K204K347K144K029J743J055L47J26K84K84
62785C22883j10n90o52j07O91J152J103J109J812K993L722L526K998L017L714
62770C47261M566N177N616O054O418O371N579M062K374J164M58l10j345j998j633
62755C89814p13l80j073k101k712k985l444m179m764m847m526m203m246m675n036
$$ plain form
62740 339930 335174 331350 328398 325578 322269 318561 314960 311848 309449 307985 307434 307265 306906 306551 306983
62725 306983 308427 309999 310629 310232 309668 309837 311185 313764 317216 320745 323695 326242 329230 333328 338703
62710 338703 345320 352928 360749 367982 374961 383194 393781 406277 419652 433920 450150 469137 490737
62697 490737 514446 539994 567313 596460 627792 661874 699029 739135 781777 826265 871525
62686 871525 916399 960163 1002504 1042869 1080090 1112743 1139626 1159814 1172497 1177027 1173146 1161179
62674 1161179 1142003 1116615 1085617 1049356 1008714 965414 921130 876625 832289 789190 748748
62663 748748 711358 676175 642508 610724 581514 554961 530796 508936 489206 470973 453746
62652 453746 437809 423674 411173 399752 389508 381184 375014 370090 365053 359078 352220 345227 339119
$$ packed form
62740C39930m756l824k952k820l309l708l601l112k399j464n51j69l59l55M32
62725C06983J444J572O30l97n64J69J348K579L452L529K950K547K988M098N375
62710C38703O617P608P821P233O979Q233J0587J2496J3375J4268J6230J8987K1600
62697D90737K3709K5548K7319K9147L1332L4082L7155M0106M2642M4488M5260
62686H71525M4874M3764M2341M0365L7221L2653K6883K0188J2683M530l881j1967
62674A161179j9176k5388l0998l6261m0642m3300m4284m4505m4336m3099m0442
62663G48748l7390l5183l3667l1784k9210k6553k4165k1860j9730j8233j7227
62652D53746j5937j4135j2501j1421j0244q324o170m924n037n975o858o993o108
$$ plain form
62639 339119 334518 331103 327933 324423 320854 317935 316139 315533 315919 316940 318201 319422 320383 320739 320112
62624 320112 318485 316267 313862 311360 308756 306266 304175 302482 300879 299053 296939 294776 293029 292234
62610 292234 292675 294072 295550 296070 295141 293281 291696 291265 291785 292293 292109 291369 290579 289968 289483 289186 289344
62593 289344 290091 291217 292367 293361 294294 295424 297002 299120 301609 304077 306192 308004 309920 312241 314701
62578 314701 316632 317593 317748 317490 316909 315798 314114 312168 310296 308500 306501 304069 301272 298475 296148
62563 296148 294568 293682 293233 292938 292493 291602 290202 288626 287323 286499 286215 286670 287933 289403 290109 289772 289093
62546 289093 288706 288318 287463 286674 287115 289006 291108 292025 291585 290703 290314 290734 291744 292947 294167 295694 298025
62529 298025 301157 304302 306511 307488 307759 308314 310216 314119 319760 326120 332498 339243 347066 355842 364752
$$ packed form
62639C39119m601l415l170l510l569k919j796o06L86J021J261J221R61L56o27
62624C20112j627k218k405k502k604k490k091j693j603j826k114k163j747p95
62610B92234M41J397J478N20r29j860j585m31N20N08j84p40p90o11m85k97J58
62593B89344P47J126J150R94R33J130J578K118K489K468K115J812J916K321K460
62578C14701J931R61J55k58n81j111j684j946j872j796j999k432k797k797k327
62563B96148j580q86m49k95m45q91j400j576j303q24k84M55J263J470P06l37o79
62546B89093l87l88q55p89M41J891K102R17m40q82l89M20J010J203J220J527K331
62529B98025L132L145K209R77K71N55J902L903N641O360O378O745P823Q776Q910
$$ plain form
62514 364752 373635 383557 395782 410622 427623 446502 467412 490441 515285 541445 568511 596184
62502 596184 624119 651785 678489 703571 726567 747034 764243 777265 785504 789068 788589 784880
62490 784880 778701 770633 761068 750582 740331 731657 725155 720573 717915 718148 722333 730404 741413 754799
62476 754799 770794 789554 810478 832576 855026 877156 898116 916755 931688 941571 945745 944651
62464 944651 939245 929785 915481 895524 870178 840694 808385 774006 737945 700793 663658 627841
62452 627841 594145 562691 533582 507429 484751 465062 447275 431102 417409 406889 399014 392620
62440 392620 386995 381944 377316 373104 369688 367348 365669 363959 362109 360512 359295 358205 357233 356693 356548
62425 356548 356135 354844 352782 350619 348966 347925 346990 345385 342802 339803 337208 335137 333055 330740 328675
$$ packed form
62514C64752Q883R922J2225J4840J7001J8879K0910K3029K4844K6160K7066K7673
62502E96184K7935K7666K6704K5082K2996K0467J7209J3022Q239L564m79l709
62490G84880o179q068r565j0486j0251q674o502m582k658K33M185Q071J1009J3386
62476G54799J5995J8760K0924K2098K2450K2130K0960J8639J4933R883M174j094
62464I44651n406r460j4304j9957k5346k9484l2309l4379l6061l7152l7135l5817
62452F27841l3696l1454k9109k6153k2678j9689j7787j6173j3693j0520p875o394
62440C92620n625n051m628m212l416k340j679j710j850j597j217j090r72n40j45
62425C56548m13j291k062k163j653j041r35j605k583k999k595k071k082k315k065
$$ plain form
62410 328675 327281 326315 325362 324511 324116 324081 323845 323045 321868 320748 319948 319470 319210 319103 319192 319606 320502 322047
62392 322047 324355 327287 330323 332901 334973 337066 339702 342879 346196 349309 352149 354936 358103 362055
62378 362055 366766 371788 376869 382438 389230 397431 406420 415402 424170 433210 443108 453905 465126 476590
62364 476590 489034 503592 520542 539014 558261 578865 602209 628977 658849 691681 728332
62353 728332 769967 816986 868958 925181 984738 1046147 1107439 1166618 1221757 1270800 1311737
62342 1311737 1343249 1364976 1377168 1380325 1375155 1362425 1342561 1315641 1282030 1242862 1199705 1153999
62330 1153999 1107070 1060416 1015516 973319 934186 898220 865296 834904 806553 780380 756857
62319 756857 735700 715623 695571 675782 657150 639832 623026 605994 588790 572016 556343
$$ packed form
62410C28675j394r66r53q51l95l5k36q00j177j120q00m78k60j07Q9M14Q96J545
62392C22047K308K932L036K578K072K093K636L177L317L113K840K787L167L952
62378C62055M711N022N081N569O792Q201Q989Q982Q768R040R898J0797J1221J1464
62364D76590J2444J4558J6950J8472J9247K0604K3344K6768K9872L2832L6651
62353G28332M1635M7019N1972N6223N9557O1409O1292N9179N5139M9043M0937
62342A311737L1512K1727J2192L157n170j2730j9864k6920l3611l9168m3157m5706
62330A153999m6929m6654m4900m2197l9133l5966l2924l0392k8351k6173k3523
62319G56857k1157k0077k0052j9789j8632j7318j6806j7032j7204j6774j5673
$$ plain form
62308 556343 542263 529753 518017 506062 493790 482136 471937 463078 455079 448094 442688 438781
62296 438781 435491 432169 429153 427207 426503 426462 426448 426382 426663 427695 429494 431629 433572 435221 437040 439513
62280 439513 442537 445608 448665 452340 457047 462082 466197 469056 471588 474729 478321 481690 484881 488691
62266 488691 493692 499874 507304 516461 527624 540500 554907 571536 591594 615838 644300 676791
62254 676791 713327 754178 799862 850983 907576 968513 1031843 1095735 1158683 1218771 1273303
62243 1273303 1319621 1356095 1382084 1397280 1401654 1395943 1381564 1359703 1330678 1294424 1251424 1202970
62231 1202970 1150603 1095584 1039043 982446 927648 876300 829195 786331 747560 712936 682308
62220 682308 654903 629751 606538 585638 567251 550932 536220 523287 512506 503566 495566 487961
$$ packed form
62308E56343j4080j2510j1736j1955j2272j1654j0199q859p999o985n406l907
62296D38781l290l322l016j946p04m1j4o6K81J032J799K135J943J649J819K473
62280D39513L024L071L057L675M707N035M115K859K532L141L592L369L191L810
62266D88691N001O182P430R157J1163J2876J4407J6629K0058K4244K8462L2491
62254F76791L6536M0851M5684N1121N6593O0937O3330O3892O2948O0088N4532
62243A273303M6318L6474K5989J5196M374n711j4379k1861k9025l6254m3000m8454
62231A202970n2367n5019n6541n6597n4798n1348m7105m2864l8771l4624l0628
62220F82308k7405k5152k3213k0900j8387j6319j4712j2933j0781q940q000p605
$$ plain form
62208 487961 480958 474817 469221 463595 457827 452453 448234 445674 444740 444903 445563 446519 447878 449541 451186
62193 451186 452902 455396 459217 464114 469619 475958 483820 493301 503715 514482 525586 536931 547847
62180 547847 557768 567100 576921 587874 599655 611502 622783 633090 642132 649826 656479 662754 669457
62167 669457 677292 686758 698286 712546 730633 753727 782426 816348 854431 895604 939060 983822
62155 983822 1028173 1069722 1106135 1135754 1157580 1171044 1176128 1173627 1164914 1151232 1133199 1110853
62143 1110853 1083947 1052233 1015879 975937 934325 893094 853594 816322 781442 749278 720313
62132 720313 694896 673003 654241 637998 623678 610952 599888 590771 583689 578292 574043 570597
62120 570597 567796 565334 562861 560572 559368 560120 562942 567530 574049 583232 595554 610741 628214 647690
$$ packed form
62208D87961p003o141n596n626n768n374m219k560r34J63O60R56J359J663J645
62193D51186J716K494L821M897N505O339P862R481J0414J0767J1104J1345J0916
62180E47847R921R332R821J0953J1781J1847J1281J0307R042P694O653O275O703
62167F69457P835R466J1528J4260J8087K3094K8699L3922L8083M1173M3456M4762
62155I83822M4351M1549L6413K9619K1826J3464N084k501q713j3682j8033k2346
62143A110853k6906l1714l6354l9942m1612m1231l9500l7272l4880l2164k8965
62132G20313k5417k1893j8762j6243j4320j2726j1064r117p082n397m249l446
62120E70597k801k462k473k289j204P52K822M588O519R183J2322J5187J7473J9476
$$ plain form
62106 647690 669170 692618 717789 744034 769918 793249 812037 825692 835209 842178 847735 852501
62094 852501 857127 862242 867452 870690 869290 862122 850489 836765 822503 808264 794795 783470 775308
62081 775308 770129 767049 765577 766086 769510 776791 788267 803313 820714 839572 859776 881579 905021
62068 905021 929860 955672 981849 1007843 1033702 1060112 1087655 1116293 1145846 1176631 1209154
62057 1209154 1243231 1277693 1310897 1341313 1367858 1389938 1407117 1418598 1423329 1420851 1411780 1397133
62045 1397133 1377493 1353236 1325121 1293948 1259729 1221974 1180970 1138226 1095462 1053628 1013069
62034 1013069 974136 937211 902431 869771 839346 811449 786438 764667 746284 730870 717452
62023 717452 705162 693850 683945 675747 668989 663020 657231 651281 645035 638420 631401 624049 616507 608921
$$ packed form
62106F47690K1480K3448K5171K6245K5884K3331J8788J3655R517O969N557M766
62094H52501M626N115N210L238j400p168j1633j3724j4262j4239j3469j1325q162
62081G75308n179l080j472N09L424P281J1476J5046J7401J8858K0204K1803K3442
62068I05021K4839K5812K6177K5994K5859K6410K7543K8638K9553L0785L2523
62057A209154L4077L4462L3204L0416K6545K2080J7179J1481M731k478r071j4647
62045A397133j9640k4257k8115l1173l4219l7755m1004m2744m2764m1834m0559
62034A013069l8933l6925l4780l2660l0425k7897k5011k1771j8383j5414j3418
62023G17452j2290j1312r905q198o758n969n789n950o246o615p019p352p542p586
$$ plain form
62009 608921 601537 594846 589382 585263 582177 579949 578821 578976 580138 581949 584411 587554 590980 594381
61995 594381 598251 603343 609402 615169 619787 623499 626747 629334 630938 631813 632321 632074 630151 625998 619669
61980 619669 611399 601495 590580 579530 569067 559608 551298 543864 536626 529116 521631 514829 508855
61967 508855 503320 498119 493727 490506 488111 485857 483398 480882 478583 476616 474866 473042 470910 468590
61953 468590 466580 465429 465466 466752 469052 471801 474407 476797 479512 483101 487611 492875 499091 506776 516263
61938 516263 527592 540911 556521 574311 593498 613299 633724 655339 678255 701675 724500
61927 724500 746093 766348 785311 803026 819557 834853 848550 860073 868878 874497 876512 874801
61915 874801 869757 862014 851981 839998 827001 814653 804515 797334 793304 792782 796363 804260 815984
$$ packed form
62009F08921p384o691n464m119l086k228j128J55J162J811K462L143L426L401
61995E94381L870N092O059N767M618L712L248K587J604Q75N08k47j923m153o329
61980F19669q270r904j0915j1050j0463r459q310p434p238p510p485o802n974
61967E08855n535n201m392l221k395k254k459k516k299j967j750j824k132k320
61953D68590k010j151L7J286K300K749K606K390K715L589M510N264O216P685R487
61938E16263J1329J3319J5610J7790J9187J9801K0425K1615K2916K3420K2825
61927G24500K1593K0255J8963J7715J6531J5296J3697J1523Q805N619K015j711
61915H74801n044p743j0033j1983j2997j2348j0138p181m030n22L581P897J1724
$$ plain form
61902 815984 830704 847682 866199 885198 903245 918959 931451 940354 945483 946576 943326 935502
61890 935502 923032 906208 886010 863954 841293 818389 795220 772384 751120 732207 715281
61879 715281 699473 684337 669809 655628 641334 626747 612069 597548 583354 569754 557046
61868 557046 545336 534647 525207 517332 511031 506016 502112 499320 497528 496629 497062 499789 505405 513555
61854 513555 523510 535079 548638 564467 582538 603014 626614 654227 686119 721502 758901 797053
61842 797053 835504 874244 912817 950062 984756 1016018 1042804 1063560 1077138 1083960 1085616 1083185
61830 1083185 1076634 1066102 1053070 1039698 1027374 1016548 1007750 1002050 1000471 1003489 1011232 1023587
61818 1023587 1039814 1058329 1077215 1094835 1109825 1120799 1126361 1125363 1117056 1101146 1077923 1048224
$$ packed form
61902H15984J4720J6978J8517J8999J8047J5714J2492Q903N129J093l250p824
61890I35502j2470j6824k0198k2056k2661k2904k3169k2836k1264j8913j6926
61879G15281j5808j5136j4528j4181j4294j4587j4678j4521j4194j3600j2708
61868E57046j1710j0689r440p875o301n015l904k792j792q99M33K727N616Q150
61854E13555R955J1569J3559J5829J8071K0476K3600K7613L1892L5383L7399L8152
61842G97053L8451L8740L8573L7245L4694L1262K6786K0756J3578O822J656k431
61830A083185o551j0532j3032j3372j2324j0826q798n700j579L018P743J2355
61818A023587J6227J8515J8886J7620J4990J0974N562r98q307j5910k3223k9699
$$ plain form
61806 1048224 1013192 974155 932746 890755 849568 809880 772112 736900 704861 676087 650233
61795 650233 627077 606679 589031 573898 561013 550166 541054 533252 526367 520064 514013 508114 502725
61782 502725 498365 495110 492535 490237 488135 486227 484403 482583 480759 478810 476607 474410 472818 472123
61768 472123 471947 471640 470813 469351 467341 465211 463603 462812 462572 462608 463075 464149 465594 467159 469118 471895
61752 471895 475297 478672 481726 484598 487117 488622 488836 488477 488602 489492 490441 490603 489835 488646 487396 485720
61736 485720 482978 479308 475887 473826 473021 472505 471801 471394 471849 473049 474516 476008 477471 478770 479939
61721 479939 481447 483764 486728 489743 492575 495534 498760 501779 504088 505931 508119 511048 514292 517200
61707 517200 519569 521417 522418 522091 520588 518748 517131 515409 513133 510762 509310 509012 508934 508119 506728
$$ packed form
61806A048224l5032l9037m1409m1991m1187l9688l7768l5212l2039k8774k5854
61795F50233k3156k0398j7648j5133j2885j0847r112p802o885o303o051n899n389
61782E02725m360l255k575k298k102j908j824j820j824j949k203k197j592o95
61768D72123j76l07q27j462k010k130j608p91k40L6M67J074J445J565J959K777
61752D71895L402L375L054K872K519J505K14l59J25Q90R49J62p68j189j250j676
61736D85720k742l670l421k061q05n16p04m07M55J200J467J492J463J299J169
61721D79939J508K317K964L015K832K959L226L019K309J843K188K929L244K908
61707E17200K369J848J001l27j503j840j617j722k276k371j452k98p8q15j391
$$ plain form
61692 506728 505791 506077 507458 509227 510827 512288 514012 516119 518112 519408 520057 520569 521063 521126 520700 520476
61676 520476 520998 521819 522101 521658 520755 519163 516363 512765 509771 508162 507070 505160 502370 499828 498324
61661 498324 497579 496924 496030 494853 493462 492178 491402 490977 490132 488404 486353 484987 484709 485132 485699 486091 486259
61644 486259 486568 487870 490840 495213 500058 504855 509782 514818 519235 522397 524617 526713 528956 530924
61630 530924 532166 532463 531568 529270 525836 521951 518018 513868 509351 504895 501174 498368 496032 493708 491458
61615 491458 489713 488653 487884 486822 485342 483845 482635 481439 479704 477218 474102 470319 465523 459525
61601 459525 452668 445627 438974 433030 427993 424021 421097 418835 416560 413780 410652 407784 405481 403386
61587 403386 401068 398699 396853 395749 395022 394164 392905 391194 389154 387102 385349 383988 383023 382551 382501 382356
$$ packed form
61692E06728r37K86J381J769J600J461J724K107J993J296O49N12M94O3m26k24
61676E20476N22Q21K82m43r03j592k800l598k994j609j092j910k790k542j504
61661D98324p45o55q94j177j391j284p76m25q45j728k051j366k78M23N67L92J68
61644D86259L09J302K970M373M845M797M927N036M417L162K220K096K243J968
61630E30924J242K97q95k298l434l885l933m150m517m456l721k806k336k324k250
61615D91458j745j060p69j062j480j497j210j196j735k486l116l783m796n998
61601D59525o857p041o653n944n037l972k924k262k275k780l128k868k303k095
61587D03386k318k369j846j104p27q58j259j711k040k052j753j361r65m72n0j45
$$ plain form
61571 382356 381626 380514 379591 378784 377312 374811 371983 369847 368774 368503 368623 368595 367768 365887 363473 361326
61555 361326 359825 358926 358527 358413 358142 357454 356656 356215 356153 356225 356472 357062 357748 358028 357840 357560 357287 356633 355341
61536 355341 353609 351699 349674 347726 346294 345611 345480 345757 346635 348155 349780 350887 351446 351802 351977 351672
61520 351672 350872 349920 348858 347164 344457 341198 338346 336418 335097 333734 331944 329750 327449 325495 324332
61505 324332 324037 324173 324135 323660 322931 322283 321929 321857 321778 321261 320162 318938 318269 318293 318508 318460 318223 318053 317907 317547
61485 317547 316904 316128 315416 314966 314834 314703 314179 313546 313826 315622 318271 320606 322270 323656 324840 325376 325159
61468 325159 324710 324399 324028 323447 323001 323035 323396 323710 323725 323165 321741 319735 318103 317584 318005 318789 319690 320565
61450 320565 320941 320565 320140 320707 322316 324001 325161 326260 327920 329906 331485 332455 333364 334785 336703 338645
$$ packed form
61571C82356p30j112r23q07j472k501k828k136j073k71J20k8q27j881k414k147
61555C61326j501q99l99j14k71o88p98m41o2P2K47N90O86K80j88k80k73o54j292
61536C55341j732j910k025j948j432o83j31K77Q78J520J625J107N59L56J75l05
61520C51672q00r52j062j694k707l259k852j928j321j363j790k194k301j954j163
61505C24332k95J36l8m75p29o48l54p2p9n17j099j224o69K4K15m8k37j70j46l60
61485C17547o43p76p12m50j32j31n24o33K80J796K649K335J664J386J184N36k17
61468C25159m49l11l71n81m46L4L61L14J5n60j424k006j632n19M21P84R01Q75
61450C20565L76l76m25N67J609J685J160J099J660J986J579R70R09J421J918J942
$$ plain form
61434 338645 340234 341521 342778 344096 345389 346871 349233 352988 357740 362390 366074 368617 370169 370784
61420 370784 370520 369645 368606 367923 368126 369535 372009 375059 378193 380987 383015 384155 384927 385951 386896 386507
61404 386507 384023 380163 376360 373398 371123 369097 366972 364473 361647 359060 357253 356005 354603 352809
61390 352809 351049 349591 348153 346554 345267 344878 345316 345990 346511 346896 347165 347148 346794 346470 346762 347995 349974
61373 349974 352159 354150 355962 357785 359527 360780 361347 361622 362273 363552 365091 366377 367386 368639 370581
61358 370581 372963 375028 376388 377488 378967 380753 382184 382979 383654 384904 387024 390124 394465 400179 406994
61343 406994 414597 423065 432549 442742 453135 463667 474588 485687 496172 505464 513661 520997 527257
61330 527257 532015 535216 537147 537973 537581 535904 533201 529915 526263 521990 516669 510427 504269 499372 496004
$$ packed form
61434C38645J589J287J257J318J293J482K362L755M752M650L684K543J552O15
61420C70784k64q75j039o83K03J409K474L050L134K794K028J140P72J024R45l89
61404C86507k484l860l803k962k275k026k125k499k826k587j807j248j402j794
61390C52809j760j458j438j599j287l89M38O74N21L85K69j7l54l24K92J233J979
61373C49974K185J991J812J823J742J253N67K75O51J279J539J286J009J253J942
61358C70581K382K065J360J100J479J786J431P95O75J250K120L100M341N714O815
61343D06994P603Q468R484J0193J0393J0532J0921J1099J0485R292Q197P336O260
61330E27257M758L201J931Q26l92j677k703l286l652m273n321o242o158m897l368
$$ plain form
61315 496004 493445 491052 489020 487832 487371 487037 486593 486401 486771 487509 488343 489492 491470 494384 497690 500818
61299 500818 504007 508363 514929 523622 533209 542416 550953 559297 567506 574535 578859 579673 577366 572866
61285 572866 566720 558941 549703 539924 530892 523327 516997 511406 506599 503011 500585 498487 495969 493367
61271 493367 491919 492567 495112 498629 502463 506616 511348 516749 522832 529700 537358 545495 553726 562019
61257 562019 570635 579603 588522 597023 605305 614085 624128 635870 649327 664110 679525 694794 709245
61244 709245 722243 732956 740364 743673 742807 738467 731663 723219 713766 703988 694520 685507 676570 667460
61230 667460 658620 650876 644787 640437 637658 636102 635232 634676 634501 634874 635672 636901 639211 643219 648305
61215 648305 652962 656558 659930 663844 667698 670426 671932 672746 672782 671538 669320 667281 666120 665552 665182
$$ packed form
61315D96004k559k393k032j188m61l34m44j92L70P38Q34J149J978K914L306L128
61299E00818L189M356O566Q693R587R207Q537Q344Q209P029M324Q14k307m500
61285E72866o146p779r238r779r032p565o330n591m807l588k426k098k518k602
61271D93367j448O48K545L517L834M153M732N401O083O868P658Q137Q231Q293
61257E62019Q616Q968Q919Q501Q282Q780J0043J1742J3457J4783J5415J5269J4451
61244G09245J2998J0713P408L309q66m340o804q444r453r778r468r013q937r110
61230F67460q840p744o089m350k779j556q70n56j75L73P98J229K310M008N086
61215F48305M657L596L372L914L854K728J506Q14L6j244k218k039j161n68l70
$$ plain form
61200 665182 665111 665452 665882 665994 665618 664607 662897 661063 660283 661429 664556 669544 676715 686402 698324 711842
61184 711842 726601 742524 759385 776725 794021 810699 826164 840092 852459 863085 871496 877597
61172 877597 882192 886395 890694 894873 898587 901454 902788 901867 898584 893475 887035 879360 870484 860705
61158 860705 850480 840187 829968 819528 808156 795390 781718 768230 755520 743405 731808
61147 731808 721401 712942 706389 701185 697240 695096 695089 696788 699499 702985 707391 712507 717337 720554 721335
61132 721335 719676 715896 709980 701643 691066 679414 668429 659475 653003 648774 646425 645749 646661 649149
61118 649149 653327 659413 667546 677647 689524 703044 718087 734374 751555 769551 788639 809069
61106 809069 830697 853099 875840 898407 920055 940190 959030 977477 996043 1014141 1030785
$$ packed form
61200F65182p1L41M30J12l76j011j710j834p80J146L127M988P171R687J1922J3518
61184G11842J4759J5923J6861J7340J7296J6678J5465J3928J2367J0626Q411O101
61172H77597M595M203M299M179L714K867J334r21l283n109o440p675q876r779
61158H60705j0225j0293j0219j0440j1372j2766j3672j3488j2710j2115j1597
61147G31808j0407q459o553n204l945k144pJ699K711L486M406N116M830L217P81
61132G21335j659l780n916q337j0577j1652j0985q954o472m229k349o76R12K488
61118F49149M178O086Q133J0101J1877J3520J5043J6287J7181J7996J9088K0430
61106H09069K1628K2402K2741K2567K1648K0135J8840J8447J8566J8098J6644
$$ plain form
61095 1030785 1045833 1060043 1073779 1086094 1095431 1100976 1102922 1101510 1096348 1086914 1073387 1056643
61083 1056643 1037635 1017129 995923 974848 954397 934665 915756 897933 881183 864975 848851
61072 848851 833079 818310 804635 791405 778082 764963 752869 742443 733904 727258 722388 718958
61060 718958 716520 714827 713972 714180 715476 717555 719988 722700 726312 731833 739769 749567 760107 770745
61046 770745 781717 793591 806632 820749 835715 851201 866845 882621 899087 917041 936960
61035 936960 958906 982821 1008537 1035562 1063249 1091318 1120025 1149880 1181522 1215782 1253262
61024 1253262 1293556 1335415 1378131 1422485 1469914 1521046 1575550 1633232 1694598 1760190 1829715
61013 1829715 1901985 1975598 2049930 2125932 2206002 2292896 2388942 2496548 2618884 2759076 2918788
$$ packed form
61095A030785J5048J4210J3736J2315R337N545J946j412n162r434j3527j6744
61083A056643j9008k0506k1206k1075k0451j9732j8909j7823j6750j6208j6124
61072H48851j5772j4769j3675j3230j3323j3119j2094j0426q539o646m870l430
61060G18958k438j693q55K08J296K079K433K712L612N521P936R798J0540J0638
61046G70745J0972J1874J3041J4117J4966J5486J5644J5776J6466J7954J9919
61035I36960K1946K3915K5716K7025K7687K8069K8707K9855L1642L4260L7480
61024A253262M0294M1859M2716M4354M7429N1132N4504N7682O1366O5592O9525
61013A829715P2270P3613P4332P6002Q0070Q6894R6046J07606J22336J40192J59712
$$ plain form
61002 2918788 3098411 3298904 3523102 3775938 4065383 4404347 4811235 5308485 5921831
60993 5921831 6681747 7623897 8785675 10201191 11899302 13905410 16244410 18941154
60985 18941154 22009979 25420478 29041620 32602553 35727226 38059744 39418267 39876060
60977 39876060 39718660 39318686 39010380 39005585 39339518 39839370 40150764 39855857 38647723
60968 38647723 36461155 33480482 30035581 26468124 23042516 19919732 17170880 14804313
60960 14804313 12793008 11096095 9671114 8478367 7482048 6650885 5957818 5378712 4891789
60951 4891789 4478354 4123388 3815011 3543795 3302762 3087322 2894304 2720829 2564306
60942 2564306 2423255 2297346 2186090 2087485 1998193 1914873 1835083 1757105 1679744 1602787 1527213
$$ packed form
61002B918788J79623K00493K24198K52836K89445L38964M06888M97250O13346
60993E921831P59916R42150J161778J415516J698111K006108K339000K696744
60985A8941154L068825L410499L621142L560933L124673K332518J358523M57793
60977C9876060j57400l99974l08306m795L33933M99852L11394k94907j208134
60968C8647723k186568k980673l444901l567457l425608l122784k748852k366567
60960A4804313k011305j696913j424981j192747r96319q31163o93067n79106m86923
60951D891789m13435l54966l08377k71216k41033k15440j93018j73475j56523
60942B564306j41051j25909j11256r8605q9292q3320p9790p7978p7361p6957p5574
$$ plain form
60931 1527213 1454258 1384337 1317314 1253603 1194220 1139649 1089387 1042930 1000570 962715 928889
60920 928889 897992 869319 842824 818501 796029 774998 755136 736246 718246 701305 685702
60909 685702 671550 658822 647657 638380 631121 625511 620775 616129 611186 606122 601458 597658 594901
60896 594901 593078 591770 590301 588195 585700 583550 582019 580583 578684 576516 574698 573457 572443 571159
60882 571159 569279 566710 563669 560489 557129 553165 548607 544338 541156 538613 535404 530838 525304 519375
60868 519375 513204 506950 501064 495684 490216 484002 477197 470638 464976 460248 456189 452642 449607 447061
60854 447061 444848 442854 441272 440543 440833 441676 442372 442718 443118 444127 446176 449650 454667 460654 466588 471906
60838 471906 476887 481951 486883 491039 493977 495574 495772 494681 492889 491304 490534 490535 490887 491263 491596 491863
$$ packed form
60931A527213p2955o9921o7023o3711n9383n4571n0262m6457m2360l7855l3826
60920I28889l0897k8673k6495k4323k2472k1031j9862j8890j8000j6941j5603
60909F85702j4152j2728j1165r277p259n610m736m646m943n064m664l800k757
60896E94901j823j308j469k106k495k150j531j436j899k168j818j241j014j284
60882E71159j880k569l041l180l360l964m558m269l182k543l209m566n534n929
60868E19375o171o254n886n380n468o214o805o559n662m728m059l547l035k546
60854D47061k213j994j582p29K90Q43O96L46M00J009K049L474N017N987N934N318
60838D71906M981N064M932M156K938J597J98j091j792j585p70JL52L76L33K67
$$ plain form
60822 491863 491832 491168 489895 488679 488381 489229 490550 491336 490992 489589 487624 485611 483743 481826 479536 476642
60806 476642 472895 467949 461736 454788 447799 440899 433840 426910 421016 416617 413118 409708 406397 403683
60792 403683 401471 398876 395115 390326 385471 381580 379008 377239 375481 373473 371526 369889 368499 367476
60778 367476 367266 367927 368791 369291 369710 370520 371401 371694 371632 372296 374238 376862 379408 381975 385265 389747 395331
60761 395331 401577 407965 414204 420448 427019 433857 440516 446813 453112 459763 466568 473004 478737 483703
60747 483703 487865 491153 493579 495256 496444 497643 499393 501773 504227 506060 507014 507156 506289 503743 498954
60732 498954 492198 484679 477662 471466 465397 458698 451312 443542 435372 426661 417913 410195 404133 399419
60718 399419 395504 392287 389794 387590 385056 382124 379382 377455 376481 376104 375756 375049 374175 373863 374801 377077
$$ packed form
60822D91863l1o64j273j216k98Q48J321P86l44j403j965k013j868j917k290k894
60806D76642l747m946o213o948o989o900p059o930n894m399l499l410l311k714
60792D03683k212k595l761m789m855l891k572j769j758k008j947j637j390j023
60778C67476k10O61Q64N00M19Q10Q81K93o2O64J942K624K546K567L290M482N584
60761C95331O246O388O239O244O571O838O659O297O299O651O805O436N733M966
60747D83703M162L288K426J677J188J199J750K380K454J833R54J42q67k546m789
60732D98954o756p519p017o196o069o699p386p770q170q711q748p718o062m714
60718C99419l915l217k493k204k534k932k742j927r74l77l48p07q74l12R38K276
$$ plain form
60702 377077 380285 384003 387995 392172 396648 401784 407829 414433 420799 426432 431605 436951 442645 448109
60688 448109 452598 456008 458960 461937 464470 465474 464494 462409 460702 460113 460149 459824 458717 457324 456550 456950
60672 456950 458407 460445 462735 465277 468268 471919 476263 480970 485563 490164 495863 503771 513595 523671
60658 523671 532628 540631 548755 557632 567232 577658 589527 603488 619737 637997 657673 678039
60646 678039 698556 719103 739731 760210 779909 798042 813903 826990 837051 843869 846888 845369
60634 845369 839205 829387 817344 803978 789641 774707 759566 744178 728278 712194 696945 683326
60622 683326 671277 660317 650207 640924 632383 624584 617853 612627 608997 606571 604672 602547 599607
60609 599607 595762 591475 587301 583349 579304 574896 570202 565467 560791 556060 551107 545849 540246 534238
$$ packed form
60702C77077L208L718L992M177M476N136O045O604O366N633N173N346N694N464
60688D48109M489L410K952K977K533J004r80k085j707n89L6l25j107j393p74M00
60672D56950J457K038K290K542K991L651M344M707M593M601N699P908R824J0076
60658E23671Q957Q003Q124Q877R600J0426J1869J3961J6249J8260J9676K0366
60646F78039K0517K0547K0628K0479J9699J8133J5861J3087J0061O818L019j519
60634H45369o164r818j2043j3366j4337j4934j5141j5388j5900j6084j5249j3619
60622F83326j2049j0960j0110r283q541p799o731n226l630k426j899k125k940
60609E99607l845m287m174l952m045m408m694m735m676m731m953n258n603o008
$$ plain form
60595 534238 527793 520966 513804 506271 498518 491172 485042 480355 476587 473214 470386 468586 467935 468140 468871
60580 468871 469804 470543 470970 471568 472957 475224 478118 481720 486354 491954 498209 505295 513747 523483 533805
60565 533805 544709 557471 573403 592529 614006 637314 662384 688853 715846 742326 767090
60554 767090 788490 804662 814147 816203 810898 799381 783799 766404 748706 731786 717056 706029
60542 706029 699461 697442 700406 709314 724612 745642 771534 802210 837989 878450 922105 966949
60530 966949 1010756 1050811 1083982 1107609 1120444 1122765 1115737 1100908 1080294 1056556 1032591 1010630
60518 1010630 991717 976038 963520 953911 946451 939903 933153 925800 918211 911128 905201 900710 897676
60505 897676 896280 897163 901142 908561 919108 932413 948770 969253 995252 1028098 1069040 1119256
$$ packed form
60595E34238o445o827p162p533p753p346o130m687l768l373k828j800o51K05P31
60580D68871R33P39M27N98J389K267K894L602M634N600O255P086Q452R736J0322
60565E33805J0904J2762J5932J9126K1477K3308K5070K6469K6993K6480K4764
60554G67090K1400J6172R485K056n305j1517j5582j7395j7698j6920j4730j1027
60542G06029o568k019K964Q908J5298K1030K5892L0676L5779M0461M3655M4844
60530I66949M3807M0055L3171K3627J2835K321p028j4829k0614k3738k3965k1961
60518A010630j8913j5679j2518r609p460o548o750p353p589p083n927m491l034
60505H97676j396Q83L979P419J0547J3305J6357K0483K5999L2846M0942N0216
$$ plain form
60493 1119256 1179622 1250513 1331949 1423801 1525564 1635843 1752211 1871615 1990643 2105358
60483 2105358 2211384 2304644 2381961 2440597 2477531 2489931 2476461 2437707 2375301 2291276 2188612
60472 2188612 2071837 1946415 1817679 1690426 1568928 1456383 1354175 1262091 1179458 1105959
60462 1105959 1041464 985457 936836 894243 856595 823371 794286 768755 745878 724939 705536
60451 705536 687186 669302 651889 635788 621808 609912 599621 590772 583336 576814 570517 564303
60439 564303 558511 553401 549254 546757 546421 547684 549437 551507 554748 559450 564493 568445 570753 571403 570135
60424 570135 566691 561446 555152 548378 541615 535545 530576 526340 522204 518168 514801 512417 510784 509572
60410 509572 508653 507968 507524 507513 508077 508920 509458 509407 508999 508627 508528 508770 509247 509671 509928 510545 512432 515862 519860
$$ packed form
60493A119256O0366P0891Q1436R1852J01763J10279J16368J19404J19028J14715
60483B105358J06026R3260P7317N8636L6934J2400j3470l8754o2406q4025j02664
60472B188612j16775j25422j28736j27253j21498j12545j02208r2084q2633p3499
60462A105959o4495n6007m8621m2593l7648l3224k9085k5531k2877k0939j9403
60451G05536j8350j7884j7413j6101j3980j1896j0291q849p436o522o297o214
60439E64303n792n110m147k497l36J263J753K070L241M702N043L952K308O50j268
60424E70135l444n245o294o774o763o070m969m236m136m036l367k384j633j212
60410E09572r19o85m44j1N64Q43N38n1m08l72r9K42M77M24K57O17J887L430L998
$$ plain form
60391 519860 522933 524436 525124 526309 528636 531745 534948 537899 540552 542826 544640 546154 547620 549072
60377 549072 550470 552019 553906 555742 556854 557300 557991 559476 561141 562130 562652 563765 566165 569819 574652
60362 574652 580783 587915 595102 601490 607033 612313 617967 624391 631563 638893 645541 651206 656449 662077
60348 662077 668371 675190 682601 691068 701097 713017 727133 743818 763425 786327 813051 843914
60336 843914 878205 913833 948015 978288 1002798 1019995 1028587 1027827 1017557 998084 970511 937253
60324 937253 901517 865792 831177 798446 769151 744878 725767 710637 698486 689121 682298 677324
60312 677324 673961 672936 674911 679445 685544 692824 701563 711979 724160 738490 755440 774917 796447
60299 796447 820154 847064 878126 912940 949332 983882 1012999 1033977 1045434 1046842 1037935 1018923
$$ packed form
60391E19860L073J503O88J185K327L109L203K951K653K274J814J514J466J452
60377E49072J398J549J887J836J112M46O91J485J665R89N22J113K400L654M833
60362E74652O131P132P187O388N543N280N654O424P172P330O648N665N243N628
60348F62077O294O819P411Q467J0029J1920J4116J6685J9607K2902K6724L0863
60336H43914L4291L5628L4182L0273K4510J7197Q592p60j0270j9473k7573l3258
60324I37253l5736l5725l4615l2731k9295k4273j9111j5130j2151r365o823m974
60312F77324l363j025J975M534O099P280Q739J0416J2181J4330J6950J9477K1530
60299G96447K3707K6910L1062L4814L6392L4550K9117K0978J1457J408q907j9012
$$ plain form
60287 1018923 991292 958119 923439 891168 864263 844407 832239 827842 830859 840138 853645 869012
60275 869012 884084 896771 904783 906046 899444 884994 863532 836547 806054 774101 742276 711832
60263 711832 683902 659157 637488 618570 602580 589753 579380 570079 561186 553157 546381 540345
60251 540345 534467 529155 525326 523127 521719 520238 518520 516960 516040 516041 516878 518103 519239 520155 520982 521655
60235 521655 521822 521336 520727 520915 522374 524692 527061 529055 530819 532716 535191 538910 544444 551501 558859
60220 558859 565371 570772 575272 578887 581693 584243 586938 589147 589753 588615 586845 585544 584921 584801 585273
60205 585273 586469 588156 589869 591196 591827 591751 591537 592016 593462 595461 597597 599780 601872 603608 605091
60190 605091 606737 608506 609817 610494 611107 611994 612673 612721 612630 613154 614392 616088 618244 620664 622426 622732 622009
$$ packed form
60287A018923k7631l3173l4680l2271k6905j9856j2168m397L017R279J3507J5367
60275H69012J5072J2687Q012J263o602j4450k1462k6985l0493l1953l1825l0444
60263G11832k7930k4745k1669j8918j5990j2827j0373r301q893q029o776o036
60251E40345n878n312l829k199j408j481j718j560r20JQ37J225J136R16Q27O73
60235E21655J67m86o09J88J459K318K369J994J764J897K475L719N534P057P358
60220E58859O512N401M500L615K806K550K695K209O06j138j770j301o23j20M72
60205E85273J196J687J713J327O31p6k14M79J446J999K136K183K092J736J483
60190F05091J646J769J311O77O13Q87O79M8r1N24J238J696K156K420J762L06p23
$$ plain form
60173 622009 621281 620699 619604 617975 616880 617287 619099 621593 624280 627198 630783 635607 641965 649729 658740
60158 658740 668921 679565 689031 696007 700824 704580 707125 706990 703462 697636 691017 684002 676242 667753
60144 667753 659008 650552 643150 637818 635079 634442 635078 636750 639727 644100 649652 656095 663086 670217 677248
60129 677248 684049 690081 694404 696503 696644 695067 691457 685797 679132 672716 666741 660681 654576 649146
60115 649146 644782 641293 638642 637130 636788 637322 638821 641763 646132 651223 656593 662592 669659 677733 686667
60100 686667 696593 707356 718160 728342 738056 747584 756257 762775 766480 767744 767134 764729 760402 754371
60086 754371 747301 740010 733087 726628 720408 714506 709587 706317 704559 703439 702138 700408 698429 696509
60072 696509 694800 693019 690489 686815 682375 677736 672708 666621 659613 652972 647853 644051 640449 636334
$$ packed form
60173F22009p28n82j095j629j095M07J812K494K687K918L585M824O358P764R011
60158F58740J0181J0644R466O976M817L756K545j35l528n826o619p015p760q489
60144F67753q745q456p402n332k739o37O36J672K977M373N552O443O991P131P031
60129F77248O801O032M323K099J41j577l610n660o665o416n975o060o105n430
60115F49146m364l489k651j512l42N34J499K942M369N091N370N999P067Q074Q934
60100F86667R926J0763J0804J0182R714R528Q673O518L705J264o10k405m327o031
60086G54371p070p291o923o459o220n902m919l270j758j120j301j730j979j920
60072F96509j709j781k530l674m440m639n028o087p008o641n119l802l602m115
$$ plain form
60058 636334 631892 627640 623827 620343 616867 613054 608726 603893 598597 592905 587066 581357 575651 569569
60044 569569 563287 557784 553830 551054 548552 546160 544508 543927 544024 544375 545002 545963 547145 548745 551407 555380
60028 555380 559917 563953 567113 569624 571570 572815 573574 574426 575609 576689 577151 577013 576672 576323 575776 574779
60012 574779 573358 571767 570132 568172 565426 561844 558115 555229 553708 553364 553749 554705 556426 559185 563080
59997 563080 567954 573456 579234 585128 591187 597481 603933 610283 616058 620541 622983 623096 621370 618716
59983 618716 615675 612050 607454 602122 596970 592777 589492 586492 583377 580334 577764 575736 573862 571612
59969 571612 568754 565655 563119 561737 561276 560819 559615 557780 556134 555433 555777 556653 557516 558304 559402 561085
59953 561085 563083 564785 565805 566231 566374 566442 566436 566185 565515 564534 563723 563614 564466 566323 569133 572461 575324
$$ packed form
60058F36334m442m252l813l484l476l813m328m833n296n692n839n709n706o082
60044E69569o282n503l954k776k502k392j652n81R7L51O27R61J182J600K662L973
60028E55380M537M036L160K511J946J245P59Q52J183J080M62j38l41l49n47r97
60012E74779j421j591j635j960k746l582l729k886j521l44L85R56J721K759L895
59997E63080M874N502N778N894O059O294O452O350N775M483K442J13j726k654
59983F18716l041l625m596n332n152m193l285l000l115l043k570k028j874k250
59969E71612k858l099k536j382m61m57j204j835j646p01L44Q76Q63P88J098J683
59953E61085J998J702J020M26J43O8ok51o70r81q11j09Q52J857K810L328K863
$$ plain form
59936 575324 576902 577360 577453 577300 576206 573854 570880 567892 564575 560487 556181 552735 550401 548518 546693
59921 546693 545278 544565 544223 543872 543718 544272 545700 547746 550132 552801 555818 559088 562149 564396 565664
59906 565664 566426 567109 567356 566413 564215 561637 559563 558134 557036 556061 555142 554130 552877 551430 549980 548764
59890 548764 548037 547897 548127 548503 549321 551212 554316 558100 562266 567395 574167 582234 590402 597836 604643
59875 604643 611210 617513 623276 628494 633401 637962 641631 643767 644226 643422 641762 639181 635362 630342 624712
59860 624712 619201 614188 609648 605384 601322 597608 594371 591291 587662 583251 578928 575910 574349 573215
59846 573215 571689 570100 569208 569185 569896 571738 575542 581718 590041 600205 612087 625488 640092 655687
59832 655687 671866 687302 699765 707396 710109 709806 709280 710653 714288 718824 722294 723354 721514 716488
$$ packed form
59936E75324J578M58R3j53j094k352k974k988l317m088m306l446k334j883j825
59921E46693j415p13l42l51j54N54J428K046K386K669L017L270L061K247J268
59906E65664P62O83K47r43k198k578k074j429j098r75r19j012j253j447j450j216
59890E48764p27j40K30L76Q18J891L104L784M166N129O772Q067Q168P434O807
59875F04643O567O303N763N218M907M561L669K136M59q04j660k581l819n020n630
59860F24712n511n013m540m264m062l714l237l080l629m411m323l018j561j134
59846E73215j526j589q92k3P11J842L804O176Q323J0164J1882J3401J4604J5595
59832F55687J6179J5436J2463P631K713l03n26J373L635M536L470J060j840n026
$$ plain form
59818 716488 707798 695170 679039 660456 640659 620816 601911 584574 569073 555589 544408 535608
59806 535608 528667 522656 516977 511753 507444 504177 501544 498979 496141 492944 489416 485692 482065 478870
59792 478870 476306 474376 472942 471699 470195 468101 465505 462834 460529 458934 458378 458961 460156 460978 460839
59777 460839 460043 459300 458950 458850 458696 458157 456928 455038 453000 451316 449927 448484 447057 446110 445791 445697 445485
59760 445485 445318 445529 446158 447035 448030 449016 449831 450537 451524 453066 454904 456609 458312 460757 464489 469200
59744 469200 474007 478293 482075 485649 489091 492214 494776 496486 496962 496125 494719 493997 494553 495717 496480
59729 496480 496763 497319 498501 499718 500211 499854 498964 497779 496441 495169 494047 492794 491061 488905 486747
59714 486747 484942 483573 482548 481697 480886 480263 480282 481289 483092 485122 486973 488632 490327 492311 494714
$$ packed form
59818G16488q690j2628j6131j8583j9797j9843j8905j7337j5501j3484j1181q800
59806E35608o941o011n679n224m309l267k633k565k838l197l528l724l627l195
59792D78870k564j930j434j243j504k094k596k671k305j595n56N83J195Q22j39
59777D60839p96p43l50j00j54n39j229j890k038j684j389j443j427r47l19r4k12
59760D45485j67K11O29Q77R95R86Q15P06R87J542J838J705J703K445L732M711
59744D69200M807M286L782L574L442L123K562J710M76q37j406p22N56J164P63
59729D96480K83N56J182J217M93l57q90j185j338j272j122j253j733k156k158
59714D86747j805j369j025q51q11o23J9J007J803K030J851J659J695J984K403
$$ plain form
59699 494714 497437 500279 503273 506751 510843 515097 518956 522473 526252 530687 535662 540948 546430 551794
59685 551794 556417 559880 562312 563983 564841 564784 564152 563501 562945 562119 560847 559492 558524 558008 557660 557163 556199
59668 556199 554414 551677 548291 544627 540613 535935 530871 526546 524028 523320 523483 523617 523412 522913 522278 521940
59652 521940 522552 524442 527354 530934 535169 539958 544606 548312 551166 554027 557249 560016 561241 560704 558974
59637 558974 556490 553271 549388 545172 540828 536211 531214 526121 521393 517202 513442 510149 507702 506506
59623 506506 506590 507559 508901 510226 511273 511965 512544 513443 514755 515868 515911 514558 512121 508832 504489 499058
59607 499058 493292 488318 484735 482404 480964 480118 479479 478616 477437 476306 475654 475618 476034 476490 476413 475482 474136
59590 474136 473396 473954 475582 477496 479040 479913 480068 479732 479361 479293 479399 479179 478148 476121 473324 470298 467501
$$ packed form
59699D94714K723K842K994L478M092M254L859L517L779M435M975N286N482N364
59685E51794M623L463K432J671Q58n7o32o51n56q26j272j355r68n16l48m97r64
59668E56199j785k737l386l664m014m678n064m325k518p08J63J34k05m99o35l38
59652E21940O12J890K912L580M235M789M648L706K854K861L222K767J225n37j730
59637E58974k484l219l883m216m344m617m997n093m728m191l760l293k447j196
59623E06506Q4R69J342J325J047O92N79Q99J312J113M3j353k437l289m343n431
59607D99058n766m974l583k331j440q46o39q63j179j131o52l6M16M56p7r31j346
59590D74136p40N58J628J914J544Q73J55l36l71o8J06k20j031k027k797l026k797
$$ plain form
59573 467501 464920 462225 459354 456644 454338 452329 450583 449390 448869 448588 448042 447211 446260 445049 443428
59558 443428 441803 440823 440580 440651 440798 441097 441424 441480 441467 442095 443706 445836 447887 449773 451698 453719 455907
59541 455907 458558 461936 466043 470941 477038 484770 494190 505165 517870 532827 550458 570383 590711
59528 590711 607887 617976 619014 612366 601614 590148 579761 570998 564125 559480 557214 557040 558422
59515 558422 561001 564673 569101 573451 576967 579729 582324 584723 585964 585149 582234 577706 572013 565606
59501 565606 558959 552107 544615 536464 528498 521499 515325 509514 504268 500006 496363 492556 488647 485537
59487 485537 483623 482302 480935 479576 478516 477844 477758 478707 480727 483074 484886 486037 487120 488878 491734
59472 491734 495537 499633 503510 507375 511692 516092 519418 521028 521514 521793 522013 521795 521102 520325 519704 519128
$$ packed form
59573D67501k581k695k871k710k306k009j746j193n21k81n46q31r51j211j621
59558D43428j625r80k43P1J47K99L27N6j3O28J611K130K051J886J925K021K188
59541D55907K651L378M107M898O097P732R420J0975J2705J4957J7631J9925K0328
59528E90711J7176J0089J038o648j0752j1466j0387q763o873m645k266j74J382
59515E58422K579L672M428M350L516K762K595K399J241q15k915m528n693o407
59501E65606o647o852p492q151p966o999o174n811n246m262l643l807l909l110
59487D85537j914j321j367j359j060o72q6R49K020K347J812J151J083J758K856
59472D91734L803M096L877L865M317M400L326J610M86K79K20k18o93p77o21n76
$$ plain form
59456 519128 518465 517933 518278 520573 525462 532488 540598 549430 559547 571243 583843 596655 609931 624148
59442 624148 638801 652647 664815 674907 682268 685980 685599 681307 673474 662750 650491 638232 626603
59429 626603 615354 604462 594439 585407 576731 568037 559948 553424 548916 546614 546913 550008 555478 562894
59415 562894 572582 585137 600387 617513 636146 656736 679771 705136 732283 760324 787476 810735
59403 810735 826635 832684 828466 815904 798661 780785 765275 753564 746169 743368 744911 749118 752611
59390 752611 751252 741780 723248 697509 668331 639502 613239 590058 569806 552454 537919 525619
59378 525619 514687 504674 495869 488943 484329 481847 480719 480013 479314 479022 479835 481852 484315 486295 487528
59363 487528 488509 489914 491998 494447 496689 498397 499768 501221 502785 503984 504576 505249 507256 511305 517043
$$ packed form
59456E19128o63n32L45K295M889P026Q110Q832J0117J1696J2600J2812J3276J4217
59442F24148J4653J3846J2168J0092P361L712l81m292p833j0724j2259j2259j1629
59429F26603j1249j0892j0023r032q676q694q089o524m508k302K99L095N470P416
59415E62894R688J2555J5250J7126J8633K0590K3035K5365K7147K8041K7152K3259
59403H10735J5900O049m218j2562j7243j7876j5510j1711p395k801J543M207L493
59390G52611j359r472j8532k5739k9178k8829k6263k3181k0252j7352j4535j2300
59378E25619j0932j0013q805o926m614k482j128p06o99k92Q13K017K463J980J233
59363D87528R81J405K084K449K242J708J371J453J564J199N92O73K007M049N738
$$ plain form
59348 517043 523747 531161 539424 548420 557722 567287 577796 589990 603872 618874 634651 651328 668906
59335 668906 686872 704580 721716 738095 753211 766331 776948 784878 790046 792563 792961 791861 789313
59322 789313 784863 778423 770672 762283 753151 742874 731835 721281 712211 704526 697409 690284 683242
59309 683242 676755 671247 666906 663681 661306 659423 657851 656821 656856 658286 660867 663982 667215 670689 674858
59294 674858 680117 686607 694278 703074 713123 724723 738096 753255 770292 789637 811696 836172
59282 836172 861845 886744 907995 921772 924586 915529 897116 873558 848506 824575 804025 788541
59270 788541 778228 771767 767910 766391 767368 770794 776600 784814 795010 806080 817009 827514 837516
59257 837516 846430 853479 858423 861375 862097 860089 855322 848319 839542 829252 817993 806583 795348
$$ packed form
59348E17043O704P414Q263Q996R302R565J0509J2194J3882J5002J5777J6677J7578
59335F68906J7966J7708J7136J6379J5116J3120J0617P930N168K517L98j100k548
59322G89313m450o440p751q389r132j0277j1039j0554r070p685p117p125p042
59309F83242o487n508m341l225k375j883j572j030L5J430K581L115L233L474M169
59294F74858N259O490P671Q796J0049J1600J3373J5159J7037J9345K2059K4476
59282H36172K5673K4899K1251J3777K814r057j8413k3558k5052k3931k0550j5484
59270G88541j0313o461l857j519R77L426N806Q214J0196J1070J0929J0505J0002
59257H37516Q914P049M944K952P22k008m767p003q777j0290j1259j1410j1235
$$ plain form
59244 795348 783903 772016 760319 749742 740534 732311 724849 718358 712994 708486 704339 700146 695721
59231 695721 691307 687668 685583 685032 685135 685075 684779 684467 683922 682686 680776 678594 676078 672459 667105 660199
59215 660199 652328 643821 634878 625980 617569 609406 600850 591875 583328 575940 569506 563368 557365 551877
59201 551877 547137 542983 539307 536272 534005 532422 531606 531934 533440 535259 536185 535878 535170 535083 535855 537124
59185 537124 538721 540907 543968 547984 552995 558995 565622 572142 578004 583263 588396 593838 599785 606175
59171 606175 612597 618477 623690 628939 635171 642549 650246 657302 663515 669456 675852 683110 691309 700450
59157 700450 710578 721583 732912 743654 753090 761059 767674 772843 776384 778428 779326 779117 777519 774536
59143 774536 770565 765698 759451 751662 743327 735959 730154 725282 720498 715551 710525 705433 700390 695804
$$ packed form
59244G95348j1445j1887j1697j0577r208q223p462o491n364m508m147m193m425
59231F95721m414l639k085n51J03o0k96l12n45j236j910k182k516l619n354o906
59215F60199p871q507q943q898q411q163q556q975q547p388o434o138o003n488
59201E51877m740m154l676l035k267j583q16L28J506J819R26l07p08q7P72J269
59185E37124J597K186L061M016N011O000O627O520N862N259N133N442N947O390
59171F06175O422N880N213N249O232P378P697P056O213N941O396P258Q199R141
59157G00450J0128J1005J1329J0742R436P969O615N169L541K044Q98k09j598k983
59143G74536l971m867o247p789q335p368n805m872m784m947n026n092n043m586
$$ plain form
59129 695804 691946 688561 685289 682352 680449 680003 680803 682413 684641 687606 691625 697108 704277 712856 722281
59114 722281 732424 743839 757043 771678 786696 801279 815298 828890 841961 854222 865404
59103 865404 875235 883466 890196 896029 901548 906623 910541 912898 914110 914870 915325 915086 913920 912067 909786
59088 909786 906948 903381 899445 895875 892930 889905 885610 879218 870662 860453 849343 838005 826741
59075 826741 815387 803541 790888 777290 762793 747778 732999 719208 706671 695163 684415
59064 684415 674397 665210 656953 649731 643596 638393 633792 629515 625425 621428 617515 613863 610676 607947
59050 607947 605587 603698 602271 600693 598148 594708 591482 589303 587811 586300 584978 584577 584949 584930 583763
59035 583763 581971 580589 580124 580634 582279 585111 588491 591299 592943 593994 595715 599077 604169 610404 617148
$$ packed form
59129F95804l858l385l272k937j903m46Q00J610K228K965M019N483P169Q579R425
59114G22281J0143J1415J3204J4635J5018J4583J4019J3592J3071J2261J1182
59103H65404R831Q231O730N833N519N075L918K357J212P60M55k39j166j853k281
59088I09786k838l567l936l570k945l025m295o392q556j0209j1110j1338j1264
59075H26741j1354j1846j2653j3598j4497j5015j4779j3791j2537j1508j0748
59064F84415j0018r187q257p222o135n203m601m277m090l997l913l652l187k729
59050F07947k360j889j427j578k545l440l226k179j492j511j322m01L72j9j167
59035E83763j792j382m65N10J645K832L380K808J644J051J721L362N092O235O744
$$ plain form
59020 617148 624208 631779 640062 649003 658428 668246 678405 688655 698520 707579 715695 722852 728784 732934
59006 732934 734905 734872 733424 731110 728343 725649 723675 722890 723481 725557 729092 733595 738259 742710 747270
58991 747270 752181 756917 760668 763240 764961 765832 765346 763159 759553 755084 750110 744698 738714 731940 724372
58976 724372 716441 708781 701829 695847 691105 687670 685191 683409 682835 684336 687968 692813 698208 704550
58962 704550 712542 722043 732068 741668 750468 758576 766308 773801 780604 785785 788754 789834 789732 788538
58948 788538 785507 779781 771164 760277 748198 735926 723960 712273 700671 689155 678061 667989
58936 667989 659570 653040 648018 643829 640006 636312 632482 628356 624234 620559 617188 613450 609087 604670
58922 604670 600871 597767 595066 592482 589650 586254 582739 580305 579603 579784 579530 578692 578211 578670 579749 581052
$$ packed form
59020F17148P060P571Q283Q941R425R818J0159J0250R865R059Q116P157N932M150
59006G32934J971l3j448k314k767k694j974p85N91K076L535M503M664M451M560
58991G47270M911M736L751K572J721Q71m86k187l606m469m974n412n984o774p568
58976G24372p931p660o952n982m742l435k479j782n74J501L632M845N395O342
58962G04550P992R501J0025R600Q800Q108P732P493O803N181K969J080j02j194
58948G88538l031n726q617j0887j2079j2272j1966j1687j1602j1516j1094j0072
58936F67989q419o530n022m189l823l694l830m126m122l675l371l738m363m417
58922F04670l799l104k701k584k832l396l515k434p02J81k54q38m81M59J079J303
$$ plain form
58906 581052 582672 584727 586993 589384 592400 596801 603080 611365 621472 632814 644481 655796 666810
58893 666810 678199 690628 704056 717597 730205 741687 752925 764966 778169 792524 808422
58882 808422 826488 846708 868224 890005 911263 931144 948617 963016 974386 983056 989001 991793
58870 991793 990953 986299 978083 966896 953372 938043 921669 905385 890101 875781 861860 848365
58858 848365 836086 825466 815834 806035 795382 783766 771266 758069 744524 730847 716988 703019
58846 703019 689395 676506 664214 652283 641086 631390 623419 616518 609817 602921 595868 588743 581599
58833 581599 574676 568454 563373 559511 556587 554295 552506 551070 549550 547429 544568 541263 537858 534607
58819 534607 531912 530316 530029 530695 531820 533169 534598 535815 536690 537598 539133 541581 544894 548937 553417
$$ packed form
58906E81052J620K055K266K391L016M401O279Q285J0107J1342J1667J1315J1014
58893F66810J1389J2429J3428J3541J2608J1482J1238J2041J3203J4355J5898
58882H08422J8066K0220K1516K1781K1258J9881J7473J4399J1370Q670N945K792
58870I91793q40m654q216j1187j3524j5329j6374j6284j5284j4320j3921j3495
58858H48365j2279j0620r632r799j0653j1616j2500j3197j3545j3677j3859j3969
58846G03019j3624j2889j2292j1931j1197r696p971o901o701o896p053p125p144
58833E81599o923o222n081l862k924k292j789j436j520k121k861l305l405l251
58819E34607k695j596k87O66J125J349J429J217Q75R08J535K448L313M043M480
$$ plain form
58804 553417 557770 561640 565368 569529 573950 577677 580022 581191 581679 581561 580712 579328 577721 575755 573029
58789 573029 569641 566392 564107 563017 562795 562992 563354 564048 565706 569017 574058 580153 586495 592771 599048
58774 599048 605317 611396 617102 622205 626296 628983 630157 629748 627391 622834 616684 610143 603798 597226
58760 597226 590110 583209 577610 573412 569805 566223 562749 559521 556536 554228 553478 554687 557324 560629
58746 560629 564270 568005 571342 574154 577240 581596 587259 593477 599851 606652 613994 621455 628858 636794
58732 636794 645870 655736 665389 674290 682692 690876 698595 705517 711853 718208 724903 731807 738722 745572
58718 745572 752075 757631 761922 765520 769556 774773 781097 788115 795617 803493 811404 818896 825793 832214
58704 832214 838068 842635 844749 843505 838878 831653 822553 811458 797624 780782 761801 742096 722530
$$ packed form
58804E53417M353L870L728M161M421L727K345J169M88j18q49j384j607j966k726
58789E73029l388l249k285j090k22J97L62O94J658L311N041O095O342O276O277
58774E99048O269O079N706N103M091K687J174m09k357m557o150o541o345o572
58760E97226p116o901n599m198l607l582l474l228k985k308p50J209K637L305
58746E60629L641L735L337K812L086M356N663O218O374O801P342P461P403P936
58732F36794R076R866R653Q901Q402Q184P719O922O336O355O695O904O915O850
58718G45572O503N556M291L598M036N217O324P018P502P876P911P492O897O421
58704H32214N854M567K114j244m627p225r100j1095j3834j6842j8981j9705j9566
$$ plain form
58691 722530 703198 684126 665777 648773 633450 619949 608448 598897 590633 582708 574765 567290
58679 567290 560778 554903 548893 542507 536247 530610 525611 521192 517625 515179 513710 512991 513239 514888 517960
58664 517960 522110 527293 533908 542140 551555 561458 571328 580644 588625 594499 597988 599322 598841 596729
58650 596729 593088 588226 582933 578408 575583 574357 573737 572901 571923 571285 570959 570361 569112 567445 565777 564184
58634 564184 562500 560749 559216 558090 557258 556579 556237 556536 557340 558014 558127 557988 558234 559079 560322 561879 563768
58617 563768 565644 566958 567730 568619 570012 571645 573473 576267 580718 586367 592164 597835 603897 610321 616001
58602 616001 619826 621743 622502 622760 622808 622777 622660 622205 621080 619172 616642 613813 611084 608838 607282 606469
58586 606469 606491 607489 609477 612378 616357 621827 628917 637134 645855 655058 665251 676634 688502 699553
$$ packed form
58691G22530j9332j9072j8349j7004j5323j3501j1501r551q264p925p943p475
58679E67290o512n875o010o386o260n637m999m419l567k446j469p19K48J649L072
58664E17960M150N183O615Q232R415R903R870R316P981N874L489J334m81k112
58650E96729l641m862n293m525k825j226o20q36r78o38l26n98j249j667j668j593
58634E64184j684j751j533j126q32o79l42K99Q04O74J13j39K46Q45J243J557J889
58617E63768J876J314P72Q89J393J633J828K794M451N649N797N671O062O424N680
58602F16001L825J917P59K58M8l1j17m55j125j908k530k829k729k246j556q13
58586F06469K2R98J988K901L979N470P090Q217Q721R203J0193J1383J1868J1051
$$ plain form
58572 699553 708701 715712 721241 726282 731393 736417 741069 745770 751653 759623 769677 781339 794578
58559 794578 809880 827440 846624 866388 885945 904857 922753 939289 954259 967326 977643
58548 977643 984095 986162 984375 979825 973354 965280 955714 944952 933633 922537 912110 902077 891641
58535 891641 880166 867611 854333 840657 826732 812612 798328 784029 770165 757359 745967
58524 745967 735899 727017 719467 713441 708797 705191 702455 700585 699491 699039 699265 700215 701634 703173 704886
58509 704886 707118 709800 712285 714136 715741 717784 720289 722615 724336 725749 727359 729166 730707 731635
58495 731635 732001 731992 731688 731150 730517 729823 728840 727283 725101 722464 719636 717034 715256 714666 714964 715532 716281
58478 716281 717901 721148 726171 732631 740137 748367 757072 766197 775773 785420 794185 801147 805989 808773
$$ packed form
58572F99553R148P011N529N041N111N024M652M701N883P970J0054J1662J3239
58559G94578J5302J7560J9184J9764J9557J8912J7896J6536J4970J3067J0317
58548I77643O452K067j787m550o471q074r566j0762j1319j1096j0427j0033j0436
58535H91641j1475j2555j3278j3676j3925j4120j4284j4299j3864j2806j1392
58524G45967j0068q882p550o026m644l606k736j870j094m52K26R50J419J539J713
58509G04886K232K682K485J851J605K043K505K326J721J413J610J807J541R28
58495G31635L66rl04n38o33o94r83j557k182k637k828k602j778n90K98N68P49
58478G16281J620L247N023O460P506Q230Q705R125R576R647Q765O962M842K784
$$ plain form
58464 808773 809504 808354 806031 803330 800336 796587 792077 787628 784126 781810 780536 780345 781446 783844 787332
58449 787332 791712 796826 802408 808122 813698 818863 823148 825992 827160 826933 825745 823676 820495 816345
58435 816345 812154 809106 807702 807611 808390 809979 812349 815089 817763 820481 823725 827675 832062 836746 842147
58420 842147 848985 857693 868086 879477 891165 902867 914598 926118 936750 945946 953798 960634
58408 960634 966249 969852 970768 968941 964834 959126 952436 945048 936932 928249 919745 912328 906340 901620
58394 901620 898198 896469 896574 897984 899883 901764 903580 905560 907923 910597 913198 915467 917588 919797
58380 919797 921822 923125 923683 924041 924568 925140 925711 926782 929041 932750 937591 942848 947771 952177 956823
58365 956823 962816 970558 979614 989551 1000317 1011672 1023007 1034160 1045853 1058750 1072484 1086092
$$ packed form
58464H08773P31j150k323k701k994l749m510m449l502k316j274j91J101K398L488
58449G87332M380N114N582N714N576N165M285K844J168k27j188k069l181m150
58435H16345m191l048j404r1P79J589K370K740K674K718L244L950M387M684N401
58420H42147O838Q708J0393J1391J1688J1702J1731J1520J0632R196P852O836
58408I60634N615L603R16j827m107n708o690p388q116q683q504p417n988m720
58394I01620l422j729J05J410J899J881J816J980K363K674K601K269K121K209
58380I19797K025J303N58L58N27N72N71J071K259L709M841N257M923M406M646
58365I56823N993P742R056R937J0766J1355J1335J1153J1693J2897J3734J3608
$$ plain form
58353 1086092 1099045 1111353 1122993 1133945 1144578 1155254 1165498 1174233 1181039 1186707 1192387 1198611
58341 1198611 1205362 1212693 1220814 1229760 1239327 1249400 1260146 1271809 1284416 1297741 1311535 1325722
58329 1325722 1340440 1355884 1372078 1388691 1405077 1420645 1435353 1449764 1464505 1479672 1494781
58318 1494781 1509149 1522238 1533922 1544710 1555529 1566934 1578650 1590220 1601906 1614367 1627558
58307 1627558 1640667 1653395 1666641 1681553 1698346 1716444 1735288 1754476 1773455 1791801 1809824
58296 1809824 1828463 1848520 1870217 1893377 1917617 1942332 1966913 1991231 2015834 2041591 2069121
58285 2069121 2098484 2129270 2160966 2193281 2226196 2259838 2294530 2330787 2368946 2408768 2449720
58274 2449720 2491652 2534797 2579067 2623883 2668972 2714941 2762818 2813384 2867175 2924532 2985140
$$ packed form
58353A086092J2953J2308J1640J0952J0633J0676J0244Q735O806N668N680O224
58341A198611O751P331Q121Q946R567J0073J0746J1663J2607J3325J3794J4187
58329A325722J4718J5444J6194J6613J6386J5568J4708J4411J4741J5167J5109
58318A494781J4368J3089J1684J0788J0819J1405J1716J1570J1686J2461J3191
58307A627558J3109J2728J3246J4912J6793J8098J8844J9188J8979J8346J8023
58296A809824J8639K0057K1697K3160K4240K4715K4581K4318K4603K5757K7530
58285B069121K9363L0786L1696L2315L2915L3642L4692L6257L8159L9822M0952
58274B449720M1932M3145M4270M4816M5089M5969M7877N0566N3791N7357O0608
$$ plain form
58263 2985140 3047915 3112028 3177853 3246392 3317923 3391832 3467697 3545874 3626821 3710395 3796080
58252 3796080 3883649 3973300 4065323 4159842 4256902 4356802 4460282 4568318 4681587 4800238
58242 4800238 4924288 5054192 5190893 5335415 5488517 5650735 5822638 6005021 6198788
58233 6198788 6404547 6622483 6852846 7096520 7354906 7629449 7921686 8233549 8567052
58224 8567052 8923788 9305455 9714879 10155676 10630807 11142540 11694325 12291794 12941327
58215 12941327 13648670 14419894 15262931 16187176 17202464 18320014 19554377 20923654 22448571
58206 22448571 24153330 26068105 28230386 30684956 33485439 36698445 40408137 44720058
58198 44720058 49765782 55709387 62754495 71150357 81193983 93221271 107580649 124593043
$$ packed form
58263B985140O2775O4113O5825O8539P1531P3909P5865P8177Q0947Q3574Q5685
58252C796080Q7569Q9651R2023R4519R7060R9900J03480J08036J13269J18651
58242D800238J24050J29904J36701J44522J53102J62218J71903J82383J93767
58233F198788K05759K17936K30363K43674K58386K74543K92237L11863L33503
58224H567052L56736L81667M09424M40797M75131N11733N51785N97469O49533
58215A2941327P07343P71224Q43037R24245J015288J117550J234363J369277J524917
58206B2448571J704759J914775K162281K454570K800483L213006L709692M311921
58198D4720058N045724N943605P045108Q395862J0043626J2027288J4359378J7012394
$$ plain form
58190 124593043 144511739 167491598 193561510 222576352 254109960 287255988 320370122
58183 320370122 350918366 375681108 391441018 395953209 388712997 371092270 345805457
58176 345805457 316057201 284802394 254336006 226188886 201212913 179753568 161833516
58169 161833516 147296320 135897733 127344745 121258212 117053467 113838917 110502246 106034726
58161 106034726 99908290 92230100 83576809 74665897 66093226 58234185 51260878 45198829
58153 45198829 39987069 35528785 31721488 28467134 25675947 23271746 21193742 19392299
58145 19392299 17825116 16457250 15260164 14207591 13273479 12434741 11673944 10978035 10336033
58136 10336033 9739012 9180861 8657834 8168159 7712363 7292342 6908847 6560341 6244419
$$ packed form
58190A24593043J9918696K2979859K6069912K9014842L1533608L3146028L3114134
58183C20370122L0548244K4762742J5759910M512191p240212j7620727k5286813
58176C45805457k9748256l1254807l0466388k8147120k4975973k1459345j7920052
58169A61833516j4537196j1398587q552988o086533m204745l214550l336671m467520
58161A06034726o126436p678190q653291q910912q572671p859041o973307o062049
58153D5198829n211760m458284l807297l254354k791187k404201k078004j801443
58145A9392299j567183j367866j197086j052573r34112q38738p60797o95909o42002
58136A0336033n97021n58151n23027m89675m55796m20021l83495l48506l15922
$$ plain form
58127 6244419 5959025 5701700 5468746 5255834 5058512 4871663 4689780 4508970 4328531
58118 4328531 4150275 3976795 3810409 3652598 3503600 3362864 3230131 3105551 2988764
58109 2988764 2878820 2775322 2678750 2589183 2505491 2426300 2351097 2279875 2212292 2147700 2085565
58098 2085565 2025501 1967377 1911637 1858920 1809104 1761338 1715288 1671660 1631092 1593326 1557933
58087 1557933 1525144 1495318 1468109 1442771 1418828 1395905 1373310 1350351 1326783 1302510 1277293
58076 1277293 1251235 1225129 1199737 1175009 1150440 1125934 1101870 1078656 1056703 1036464 1017945
58065 1017945 1000334 982646 964662 946988 930476 915850 903409 892527 881792 870261 858370
58054 858370 847058 836261 824969 812627 799744 787103 775061 763826 753729 744840 736655 728485
$$ packed form
58127F244419k85394k57325k32954k12912j97322j86849j81883j80810j80439
58118D328531j78256j73480j66386j57811j48998j40736j32733j24580j16787
58109B988764j09944j03498r6572q9567q3692p9191p5203p1222o7583o4592o2135
58098B085565o0064n8124n5740n2717m9816m7766m6050m3628m0568l7766l5393
58087A557933l2789k9826k7209k5338k3943k2923k2595k2959k3568k4273k5217
58076A277293k6058k6106k5392k4728k4569k4506k4064k3214k1953k0239j8519
58065A017945j7611j7688j7984j7674j6512j4626j2441j0882j0735j1531j1891
58054H58370j1312j0797j1292j2342j2883j2641j2042j1235j0097q889q185q170
$$ plain form
58042 728485 719959 711031 701836 692783 684499 677267 670554 663356 655078 645983 636793 627962 619401 610798
58028 610798 602008 593070 583983 574647 565086 555549 546282 537230 528066 518580 509073 500299 492904 486922
58014 486922 481901 477444 473336 469220 464665 459869 455835 453313 451799 450099 447691 445001 442456 440002
58000 440002 437578 435455 433827 432577 431638 431186 431288 431717 432281 433001 433848 434672 435418 436091 436557 436896 437898
57983 437898 440433 444221 447905 450561 452381 453628 453835 452675 450859 449355 448145 446444 443782 440253
57969 440253 436030 431413 427106 423722 420977 417927 414008 409497 405092 401469 399115 398062 397721 397240 396052
57954 396052 393997 391150 387782 384292 380983 378061 375793 374190 372533 369914 366541 363744 362378 361974
57940 361974 361981 362831 364941 367585 369909 372463 376434 381756 387271 392555 398273 404707 411158 417016 422425
$$ packed form
58042G28485q526q928r195r053q284p232o713p198q278r095r190q831q561q603
58028F10798q790q938r087r336r561r537r267r052r164r486r507q774p395n982
58014D86922n021m457m108m116m555m796m034k522j514j700k408k690k545k454
58000D40002k424k123j628j250r39m52J02M29N64P20Q47Q24P46O73M66L39J002
57983D37898K535L788L684K656J820J247K07j160j816j504j210j701k662l529
57969D40253m223m617m307l384k745l050l919m511m405l623k354j053l41m81j188
57954C96052k055k847l368l490l309k922k268j603j657k619l373k797j366m04
57940C61974PQ50K110K644K324K554L971N322N515N284N718O434O451N858N409
$$ plain form
57925 422425 427666 432761 437746 442457 446122 448273 450039 453137 457254 459846 459210 456452 453570 450748
57911 450748 446705 440877 433896 426274 417846 408533 398843 389440 380721 372764 365282 357692 349510 340600
57897 340600 330974 320797 310814 302210 295524 290055 284783 279521 274825 271192 268807 267613 267119 266568
57883 266568 265811 265641 266672 268359 269751 270769 272004 273654 275584 278169 282068 287094 292136 296304 299463
57868 299463 301627 302663 302814 302792 302997 303156 302871 302012 300391 297762 294465 291524 289743 289084 289226 290158 291774
57851 291774 293465 294840 296615 300063 305512 311842 317619 322421 326959 332097 337927 343639 348205 351278
57837 351278 353510 355929 358909 361704 363094 362495 360427 357835 355115 351961 348088 343656 338868 333575
57823 333575 327634 321404 315469 310007 304910 300482 297525 296598 297458 299347 301587 303890 306380 309379 312875
$$ packed form
57925D22425N241N095M985M711L665K151J766L098M117K592o36k758k882k822
57911D50748m043n828o981p622q428r313r690r403q719p957p482p590q182q910
57897C40600r626j0177r983q604o686n469n272n262m696l633k385j194m94n51
57883B66568p57j70J031J687J392J018J235J650J930K585L899N026N042M168L159
57868B99463K164J036J51k2K05J59k85q59j621k629l297k941j781o59J42R32J616
57851B91774J691J375J775L448N449O330N777M802M538N138N830N712M566L073
57837C51278K232K419K980K795J390n99k068k592k720l154l873m432m788n293
57823C33575n941o230n935n462n097m428k957r27Q60J889K240K303K490K999L496
$$ plain form
57808 312875 316170 318387 319423 320089 321161 322568 323575 323467 321857 318689 314202 308729 302355 294926 286495
57793 286495 277515 268475 259675 251516 244552 238839 233595 228050 222502 217955 214743 212088 209164 206062
57779 206062 203412 201457 200003 199055 198954 199769 201002 202172 203518 205823 209556 214401 219656 224923 230358
57764 230358 236442 243561 251622 259874 267225 272927 276908 279419 280571 280457 279447 277963 275991 273209
57750 273209 269651 265863 262337 259167 256405 254297 252816 251268 248786 245108 240595 235657 230517 225449
57736 225449 220881 217211 214687 213403 213097 213032 212490 211542 211032 211675 213412 215744 218348 221054 223467 225143
57720 225143 226257 227697 230174 233356 236165 237972 239220 240697 242412 243569 243674 243324 243594 244837 246386
57705 246386 247402 247683 247589 247500 247606 248085 249130 250758 252748 254819 256753 258359 259567 260719 262593 265771
$$ packed form
57808C12875L295K217J036O66J072J407J007j08j610l168m487n473o374p429q431
57793B86495q980r040q800q159o964n713n244n545n548m547l212k655k924l102
57779B06062k650j955j454r48j01Q15J233J170J346K305L733M845N255N267N435
57764B30358O084P119Q061Q252P351N702L981K511J152j14j010j484j972k782
57750B73209l558l788l526l170k762k108j481j548k482l678m513m938n140n068
57736B25449m568l670k524j284l06o5n42r48n10O43J737K332K604K706K413J676
57720B25143J114J440K477L182K809J807J248J477J715J157J05l50K70J243J549
57705B46386J016K81r4q9J06M79J045J628J990K071J934J606J208J152J874L178
$$ plain form
57689 265771 269920 273856 276409 277088 275931 273069 268700 263319 257657 252376 248043 245267 244632 246487 251121
57674 251121 259116 271198 287695 308584 334257 365871 404613 450920 504773 566489 636474 713731
57662 713731 794273 870591 932576 970069 976424 951232 900202 832317 756569 680182 608245 543778
57650 543778 487930 440559 400961 368248 341323 318852 299588 282859 268753 257668 249537 243573
57638 243573 238882 235162 232554 230951 229850 228852 227881 226845 225598 224428 224097 224949 226345 227423 228116
57623 228116 228912 229822 230232 229776 228732 227452 225907 224070 222289 220932 219967 219157 218440 217805 217013 215724
57607 215724 213821 211388 208563 205658 203226 201675 200846 200285 199798 199481 199220 198568 197173 195110 192739 190425
57591 190425 188398 186585 184555 181866 178582 175197 172064 169205 166741 165035 164035 162803 160171 155954
$$ packed form
57689B65771M149L936K553O79j157k862m369n381n662n281m333k776o35J855M634
57674B51121P995J2082J6497K0889K5673L1614L8742M6307N3853O1716O9985P7257
57662G13731Q0542P6318O1985L7493O355k5192n1030o7885p5748p6387p1937o4467
57650E43778n5848m7371l9598l2713k6925k2471j9264j6729j4106j1085q131n964
57638B43573m691l720k608j603j101r98r71j036j247j170l31Q52J396J078O93
57623B28116P96R10M10m56j044j280j545j837j781j357r65q10p17o35p92j289
57607B15724j903k433k825k905k432j551q29n61m87l17k61o52j395k063k371k314
57591A90425k027j813k030k689l284l385l133k859k464j706j000j232k632m217
$$ plain form
57577 155954 151280 147675 145931 145687 145880 145606 144718 143603 142378 140566 137787 134476 131496 129150 127062
57562 127062 125089 123722 123252 123014 122048 120370 119048 118947 119832 120924 121927 123154 124827 126745 128711
57547 128711 130860 133236 135265 136082 135495 134346 133777 134278 135634 137559 140066 143194 146683 150102 153190
57532 153190 156006 158749 161555 164397 167156 169757 172250 174775 177492 180579 184208 188365 192737 196919
57518 196919 200828 204833 209408 214596 219812 224155 227022 228483 229009 228822 227665 225346 222278 219228 216581
57503 216581 214074 211163 207331 202156 195547 188105 180847 174361 168505 163068 158310 154468 151126 147624
57489 147624 143963 140772 138359 136275 133999 131646 129761 128707 128455 128738 129175 129404 129384 129434 129679 129546 128219
57472 128219 125711 123129 121529 120637 119135 116326 113096 110907 110101 109697 108819 107675 106865 106262 105247 103852
$$ packed form
57577A55954m674l605j744k44J93k74q88j115j225j812k779l311k980k346k088
57562A27062j973j367m70k38r66j678j322j01Q85J092J003J227J673J918J966
57547A28711K149K376K029Q17n87j149n69N01J356J925K507L128L489L419L088
57532A53190K816K743K806K842K759K601K493K525K717L087L629M157M372M182
57518A96919L909M005M575N188N216M343K867J461N26j87j157k319l068l050k647
57503B16581k507k911l832n175o609p442p258o486n856n437m758l842l342l502
57489A47624l661l191k413k084k276k353j885j054k52K83M37K29k0N0K45j33j327
57472A28219k508k582j600q92j502k809l230k189q06m04q78j144q10o03j015j395
$$ plain form
57456 103852 102976 103288 104362 105169 105204 104898 105065 106140 107864 109588 110897 112015 113474 115399 117299 118630
57440 118630 119363 119865 120347 120688 120737 120623 120684 121146 121922 122707 123331 123899 124576 125322 126025 126795 127798 128806 129195
57421 129195 128599 127325 126054 125355 125552 126667 128191 129233 129341 128989 128894 129024 128726 127723 126459 125394
57405 125394 124538 123891 123879 124915 126753 128577 129654 129747 129084 128210 127712 127813 128299 129014 130206 132047 133980
57388 133980 135051 135038 134833 135477 137140 139358 142032 145614 150219 154970 158582 160505 161246 161628 161966 162028
57372 162028 161519 160438 159089 157931 157368 157435 157654 157409 156550 155512 154755 154237 153564 152547 151432 150583 150140
57355 150140 150010 150100 150514 151523 153305 155644 157902 159475 160368 161275 162990 165680 168677 170980 172039 172151
57339 172151 172170 172804 174201 176130 178376 180788 183077 184867 186060 186947 187820 188645 189272 189831 190663 191869
$$ packed form
57456A03852q76L12J074Q07L5l06J67J075J724J724J309J118J459J925J900J331
57440A18630P33N02M82L41M9j14O1M62P76P85O24N68O77P46P03P70J003J008L89
57421A29195n96j274j271o99J97J115J524J042J08l52r5J30k98j003j264j065
57405A25394q56o47j2J036J838J824J077R3o63q74m98J01M86P15J192J841J933
57388A33980J071j3k05O44J663K218K674L582M605M751L612J923P41L82L38O2
57372A62028n09j081j349j158n63O7K19k45q59j038p57n18o73j017j115q49m43
57355A50140j30R0M14J009J782K339K258J573Q93R07J715K690K997K303J059J12
57339A72151J9O34J397J929K246K412K289J790J193Q87Q73Q25O27N59Q32J206
$$ plain form
57323 191869 193191 194376 195449 196454 197188 197390 197138 196768 196474 196251 196281 196993 198506 200271 201653 202768
57307 202768 204328 206628 209023 210644 211314 211574 212020 212843 213818 214470 214404 213842 213712 214818 216901 218873 220009
57290 220009 220539 220994 221470 221811 222202 223138 224988 227826 231588 236032 240668 245026 249017 252827 256551 260191
57274 260191 263931 268025 272354 276405 279828 282837 285905 289199 292465 295331 297648 299594 301527 303675
57260 303675 305917 307905 309409 310500 311414 312300 313121 313806 314577 316039 318712 322406 326307 329826 333087
57245 333087 336410 339772 343160 347042 351787 356809 361104 364614 368312 372810 377680 382494 387695 393865
57231 393865 400781 407875 415149 422910 430956 438787 446421 454299 462502 470783 479257 488281 497605 506387
57217 506387 514322 522154 530764 540274 550320 560754 571672 583033 594613 606218 617819 629580
$$ packed form
57323A91869J322J185J073J005P34K02k52l70k94k23L0P12J513J765J382J115
57307B02768J560K300K395J621O70K60M46Q23R75O52o6n62j30J106K083J972J136
57290B20009N30M55M76L41L91R36J850K838L762M444M636M358L991L810L724L640
57274B60191L740M094M329M051L423L009L068L294L266K866K317J946J933K148
57260C03675K242J988J504J091R14Q86Q21O85P71J462K673L694L901L519L261
57245C33087L323L362L388L882M745N022M295L510L698M498M870M814N201O170
57231C93865O916P094P274P761Q046P831P634P878Q203Q281Q474R024R324Q782
57217E06387P935P832Q610R510J0046J0434J0918J1361J1580J1605J1601J1761
$$ plain form
57205 629580 641772 654409 667020 679112 690815 702613 714486 725942 737005 748479 760898
57194 760898 773831 786655 799452 812597 825946 839044 851754 864025 875362 885327 894416 903690
57182 903690 913463 923004 931652 939668 947802 956500 965763 975391 985190 995238 1006007 1017854 1030258
57169 1030258 1042017 1052397 1061812 1071211 1081176 1091797 1103001 1114661 1126646 1139120 1152637 1167685
57157 1167685 1184230 1201856 1220111 1238481 1256303 1273072 1288775 1303665 1317800 1330960 1342847
57146 1342847 1353128 1361470 1367919 1373207 1378355 1383878 1389536 1394792 1399261 1402834 1405732 1408514 1411750 1415591
57132 1415591 1419888 1424787 1430929 1438919 1448767 1459902 1471557 1483139 1494560 1506440 1519726 1534876
57120 1534876 1551577 1569439 1588719 1610016 1633401 1658265 1684063 1710937 1739591 1770877 1805699
$$ packed form
57205F29580J2192J2637J2611J2092J1703J1798J1873J1456J1063J1474J2419
57194G60898J2933J2824J2797J3145J3349J3098J2710J2271J1337R965R089R274
57182I03690R773R541Q648Q016Q134Q698R263R628R799J0048J0769J1847J2404
57169A030258J1759J0380R415R399R965J0621J1204J1660J1985J2474J3517J5048
57157A167685J6545J7626J8255J8370J7822J6769J5703J4890J4135J3160J1887
57146A342847J0281Q342O449N288N148N523N658N256M469L573K898K782L236L841
57132A415591M297M899O142P990R848J1135J1655J1582J1421J1880J3286J5150
57120A534876J6701J7862J9280K1297K3385K4864K5798K6874K8654L1286L4822
$$ plain form
57109 1805699 1845115 1890397 1943016 2004540 2076401 2159727 2255652 2365954 2493386 2641497 2814460
57098 2814460 3017245 3255850 3537193 3868755 4258130 4712419 5237525 5837618 6514554
57089 6514554 7266779 8087939 8966196 9884654 10822851 11759916 12679949 13576618 14451157
57080 14451157 15302353 16116549 16868193 17530967 18087593 18527766 18837357 18991572 18959888
57071 18959888 18718627 18261524 17602521 16771779 15808869 14756319 13654869 12540451 11442613
57062 11442613 10384235 9382206 8448384 7590289 6811663 6113139 5492818 4946488 4467939
57053 4467939 4049901 3685209 3367270 3089865 2847072 2633558 2444624 2275911 2123448
57044 2123448 1984272 1856733 1739861 1632485 1533169 1440813 1354978 1275560 1202286 1134625
$$ packed form
57109A805699L9416M5282N2619O1524P1861Q3326R5925J10302J27432J48111J72963
57098B814460K02785K38605K81343L31562L89375M54289N25106O00093O76936
57089F514554P52225Q21160Q78257R18458R38197R37065R20033Q96669Q74539
57080A4451157Q51196Q14196P51644O62774N56626M40173L09591J54215l1684
57071A8959888k41261m57103o59003q30742r62910j052550j101450j114418j097838
57062A1442613j058378j002029r33822q58095p78626o98524o20321n46330m78549
57053D467939m18038l64692l17939k77405k42793k13514j88934j68713j52463
57044B123448j39176j27539j16872j07376r9316r2356q5835p9418p3274o7661
$$ plain form
57034 1134625 1072044 1014249 961145 912588 868251 827842 791443 759501 732439 710356 693152
57023 693152 680842 673680 672143 677029 689692 712230 747484 798722 868788 958970 1068505 1195521
57011 1195521 1338454 1495231 1658791 1812070 1928691 1982369 1959767 1867051 1725304 1559512
57001 1559512 1389799 1228802 1082899 954062 841691 744600 662092 593458 537111 490847
56991 490847 452773 421581 396194 375788 360132 349320 342936 339827 338808 339274 340844 342712 343629
56978 343629 342463 338578 331811 322439 311249 299390 287843 276936 266517 256630 247864 240844 235502
56965 235502 231211 227766 225885 226446 229457 234141 239994 247336 256724 268144 280926 294060 306259
56952 306259 315892 321396 321945 317671 309236 297470 283491 268848 255121 243235 233301 225168 218972
$$ packed form
57034A134625o2581n7795n3104m8557m4337m0409l6399l1942k7062k2083j7204
57023F93152j2310p162j537M886J2663K2538L5254N1238P0066R0182J09535J27016
57011A195521J42933J56777J63560J53279J16621N3678k2602r2716j41747j65792
57001A559512j69713j60997j45903j28837j12371r7091q2508o8634n6347m6264
56991D90847l8074l1192k5387k0406j5656j0812o384l109j019M66J570J868R17
56978C43629j166l885o767r372j1190j1859j1547j0907j0419r887q766p020n342
56965B35502m291l445j881N61L011M684N853P342R388J1420J2782J3134J2199
56952C06259R633N504N49m274q435j1766j3979j4643j3727j1886r934q133o196
$$ plain form
56939 218972 215034 213392 213708 215688 219438 225340 233816 245343 260460 279294 300811 322662 341949
56926 341949 356259 364201 365332 359926 348786 333101 314331 294145 274185 255551 238471 222651
56914 222651 208006 194841 183355 173341 164576 157200 151348 146609 142266 138028 134070 130387 126607
56901 126607 122635 118983 116143 113952 111967 110233 109182 108959 109298 110121 111827 114906 119586 126008 134474
56886 134474 145348 158752 174354 191195 207689 222085 233169 240581 244503 245268 243356 239538 234866
56873 234866 230474 227315 225951 226575 229321 234539 242637 253801 268067 285588 306597 331200 359497
56860 359497 391762 428029 467350 507756 546800 581617 608572 623978 626103 616308 597838 573761
56848 573761 546416 518146 491411 468020 448909 434888 427020 426013 431797 444126 463326 490077
$$ packed form
56939B18972l938j642L16J980L750N902Q476J1527J5117J8834K1517K1851J9287
56926C41949J4310P942J131n406j1140j5685j8770k0186j9960j8634j7080j5820
56914B22651j4645j3165j1486j0014q765p376n852m739m343m238l958l683l780
56901A26607l972l652k840k191j985j734j051k23L39Q23J706L079M680O422Q466
56886A34474J0874J3404J5602J6841J6494J4396J1084P412L922P65j912l818m672
56873B34866m392l159j364O24K746N218Q098J1164J4266J7521K1009K4603K8297
56860C59497L2265L6267L9321M0406L9044L4817K6955J5406K125r795j8470k4077
56848E73761k7345k8270k6735k3391j9111j4021p868j007N784J2329J9200K6751
$$ plain form
56836 490077 524682 566920 616360 672338 733442 797113 859505 915429 958687 983477 986456 967934
56824 967934 931323 881687 824652 765695 709207 657666 611964 572677 540758 516922 500969
56813 500969 492248 490561 496167 509123 529150 556056 589620 628761 671160 713719 752909 784593
56801 784593 804232 808156 795064 766540 726425 679615 630720 583111 538849 499175 464687 435211
56789 435211 410299 390227 376044 368319 366301 368689 374776 384421 397417 413494 432503 453671
56777 453671 474635 491883 502297 504053 496417 479646 455314 426053 394457 362368 331206 302423
56765 302423 277146 255549 236843 219992 204523 190801 179453 170408 162599 154835 146846 139230
56753 139230 132640 127370 123452 120531 117658 113884 109251 104783 101372 99041 97342 95909 94437 92639
$$ packed form
56836D90077L4605M2238M9440N5978O1104O3671O2392N5924M3258K4790K979j8522
56824I67934l6611m9636n7035n8957n6488n1541m5702l9287l1919k3836j5953
56813E00969q721j687N606J2956K0027K6906L3564L9141M2399M2559L9190L1684
56801G84593J9639L924j3092k8524m0115m6810m8895m7609m4262l9674l4488k9476
56789D35211k4912k0072j4183p725k018K388O087R645J2996J6077J9009K1168
56777D53671K0964J7248J0414J756p636j6771k4332k9261l1596l2089l1162k8783
56765C02423k5277k1597j8706j6851j5469j3722j1348r045p809p764p989p616
56753A39230o590n270l918k921k873l774m633m468l411k331j699j433j472j798
$$ plain form
56739 92639 90545 88527 86756 84951 82888 80855 79307 78336 77699 77166 76635 76084 75595 75218 74732 73798 72457
56722 72457 71182 70339 69920 69894 70380 71293 72230 73019 73964 75217 76313 76752 76719 76754 76953 77039 77013 77165 77479 77597
56702 77597 77499 77750 78758 80111 80962 81000 80764 80972 81699 82436 82888 83387 84313 85378 85944 85941 85961 86305 86502 86061
56682 86061 85209 84494 83995 83475 83090 83356 84425 85834 87087 88172 89355 90651 91713 92233 92441 93089 94742
56665 94742 97126 99457 101466 103704 106594 109581 111640 112447 112717 113524 115563 118901 123113 127752 132907
56650 132907 139084 146293 153635 160220 166236 172501 179139 185364 190603 195104 199235 202749 205136 206260
56636 206260 206295 205347 203579 201489 199604 197885 195795 193039 190022 187427 185442 183583 181292 178601 176147
56621 176147 174615 174256 174879 176029 177113 177606 177328 176467 175301 174030 172902 172149 171615 170770 169341 167729
$$ packed form
56739I2639k094k018j771j805k063k033j548r71o37n33n31n51m89l77m86r34j341
56722G2457j275q43m19k6M86R13R37P89R45J253J096M39l3L5J99Q6k6J52L14J18
56702G7597r8K51J008J353Q51L8k36K08P27P37M52M99R26J065N66lK0L44J97m41
56682H6061q52p15m99n20l85K66J069J409J253J085J183J296J062N20K08O48J653
56665I4742K384K331K009K238K890K987K059Q07K70Q07K039L338M212M639N155
56650A32907O177P209P342O585O016O265O638O225N239M501M131L514K387J124
56636B06260L5r48j768k090j885j719k090k756l017k595j985j859k291k691k454
56621A76147j532l59O23J150J084M93k78q61j166j271j128p53n34q45j429j612
$$ plain form
56605 167729 166493 165697 165047 164432 163897 163298 162494 161823 161838 162521 163189 163214 162495 161198 159602 158265 157818 158232
56587 158232 158627 158118 156599 154521 152252 150067 148522 148284 149465 151419 153313 154819 156133 157516 158974
56572 158974 160405 161832 163292 164631 165728 166918 168803 171454 174196 176548 179113 183062 188888 196111
56558 196111 204065 212454 221112 229786 238330 246679 254467 261050 266153 270153 273492 276112 277711 278283
56544 278283 278141 277598 276881 276254 275948 275993 276209 276289 275865 274698 272943 271053 269280 267335 264670 261007 256556
56527 256556 251806 247144 242628 238096 233482 228891 224307 219551 214823 210897 208276 206330 203975 201193
56513 201193 199090 198291 197986 197029 195364 193782 192645 191495 189800 187548 185113 182930 181253 180009 178847
56498 178847 177514 176116 174887 173916 173207 172780 172481 171975 171147 170255 169465 168568 167521 166922 167393 168637 169588
$$ packed form
56605A67729j236p96o50o15n35n99q04o71J5O83O68K5p19j297j596j337m47M14
56587A58232L95n09j519k078k269k185j545k38J181J954J894J506J314J383J458
56572A58974J431J427J460J339J097J190J885K651K742K352K565L949N826P223
56558A96111P954Q389Q658Q674Q544Q349P788O583N103M000L339K620J599N72
56544B78283j42n43p17o27l06M5K16Q0m24j167j755j890j773j945k665l663m451
56527B56556m750m662m516m532m614m591m584m756m728l926k621j946k355k782
56513B01193k103p99l05r57j665j582j137j150j695k252k435k183j677j244j162
56498A78847j333j398j229r71p09m27k99n06q28q92p90q97j047n99M71J244R51
$$ plain form
56481 169588 169513 168612 167603 167056 167105 167428 167549 167412 167642 168908 171153 173786 176474 179297 182142 184501 186024
56464 186024 186844 187266 187497 187887 188957 190848 193011 194764 195999 197170 198742 200910 203700 207002 210499
56449 210499 213759 216491 218621 220192 221302 222144 222999 224071 225286 226280 226715 226670 226597 226736 226662 225636 223411
56432 223411 220514 217719 215485 213891 212776 211734 210265 208269 206298 205029 204528 204299 204098 204290 205183
56417 205183 206311 206807 206483 206151 206687 208018 209273 209760 209523 209008 208566 208375 208523 208975 209539 210027 210403 210766
56399 210766 211361 212653 215083 218462 221782 223960 224779 224907 225010 225106 224789 223834 222405 220790 219111 217323
56383 217323 215380 213370 211518 210109 209411 209632 210875 213067 215947 219065 221900 224205 226358 229162 232972
56368 232972 237086 240337 242268 243367 244153 244551 244477 244510 245407 247080 248647 249489 249842 250208 250635 250863 250936 251286
$$ packed form
56481A69588p5r01j009n47M9L23J21j37K30J266K245K633K688K823K845K359J523
56464A86024Q20M22K31L90J070J891K163J753J235J171J572K168K790L302L497
56449B10499L260K732K130J571J110Q42Q55J072J215R94M35m5p3J39p4j026k225
56432B23411k897k795k234j594j115j042j469j996j971j269n01k29k01J92Q93
56417B05183J128M96l24l32N36J331J255M87k37n15m42j91J48M52N64M88L76L63
56399B10766N95J292K430L379L320K178Q19J28J03R6l17r55j429j615j679j788
56383B17323j943k010j852j409o98K21J243K192K880L118K835K305K153K804L810
56368B32972M114L251J931J099P86L98p4L3Q97J673J567Q42L53L66M27K28P3L50
$$ plain form
56350 251286 252181 253336 254211 254611 254812 255063 255226 255132 255175 256120 258175 260564 262263 263011 263395 264159 265607 267559
56332 267559 269626 271592 273659 276227 279291 282298 284778 286927 289295 292081 295033 297818 300161 301843
56318 301843 303001 304321 306368 308737 310356 310731 310467 310413 310719 310907 310508 309394 307816 306371 305675 305806
56302 305806 306299 306869 307819 309405 311103 311994 311883 311581 312004 313265 314820 316270 317757 319554 321535 323276
56286 323276 324675 326198 328279 330636 332532 333749 334912 336735 339321 342443 346106 350308 354489 357895
56272 357895 360580 363487 367289 371617 375779 379797 384145 388771 393133 397235 401932 407870 414674 421566
56258 421566 428390 435554 443382 452116 462307 474346 487563 500556 512785 525418 540298 558458
56246 558458 579892 604294 631545 661702 694894 731133 769994 810677 852584 895607 939634
$$ packed form
56350B51286Q95J155Q75M00K01K51J63r4M3R45K055K389J699P48L84P64J448J952
56332B67559K067J966K067K568L064L007K480K149K368K786K952K785K343J682
56318C01843J158J320K047K369J619L75k64n4L06J88l99j114j578j445o96J31
56302C05806M93N70R50J586J698Q91j11l02M23J261J555J450J487J797J981J741
56286C23276J399J523K081K357J896J217J163J823K586L122L663M202M181L406
56272C57895K685K907L802M328M162M018M348M626M362M102M697N938O804O892
56258D21566O824P164P828Q734J0191J2039J3217J2993J2229J2633J4880J8160
56246E58458K1434K4402K7251L0157L3192L6239L8861M0683M1907M3023M4027
$$ plain form
56235 939634 984085 1028175 1071236 1112296 1149640 1181362 1206334 1224322 1235411 1239774 1237786 1229793
56223 1229793 1215842 1196178 1171939 1144720 1115405 1084035 1050894 1017074 983730 951326 919995
56212 919995 890096 861982 835533 810372 786330 763404 741480 720501 700805 682930 667086
56201 667086 653033 640415 628988 618597 609148 600633 593066 586382 580479 575302 570850 567182 564514
56188 564514 563154 563174 564163 565454 566621 567677 568796 569957 570944 571693 572480 573608 574998 576267 577269 578248
56172 578248 579409 580637 581791 582945 584043 584628 584392 583817 583831 584911 586947 589819 593494 597564 601352
56157 601352 604729 608380 612983 618541 624790 631851 640101 649586 659893 670469 680932 691266 701928
56144 701928 713611 726723 741236 757104 774570 793909 815133 838220 863440 891287 922338
$$ packed form
56235I39634M4451M4090M3061M1060L7344L1722K4972J7988J1089M363j988p993
56223A229793j3951j9664k4239k7219k9315l1370l3141l3820l3344l2404l1331
56212I19995k9899k8114k6449k5161k4042k2926k1924k0979j9696j7875j5844
56201F67086j4053j2618j1427j0391r449q515p567o684n903n177m452l668k668
56188E64514j360K0R89J291J167J056J119J161R87P49P87J128J390J269J002R79
56172E78248J161J228J154J154J098N85k36n75J4J080K036K872L675M070L788
56157F01352L377L651M603N558O249P061Q250R485J0307J0576J0463J0334J0662
56144G01928J1683J3112J4513J5868J7466J9339K1224K3087K5220K7847L1051
$$ plain form
56133 922338 957582 998752 1047949 1106799 1176084 1256136 1347255 1449480 1561866 1681927 1805629
56122 1805629 1927811 2042864 2145835 2233923 2307488 2369469 2423428 2471852 2515725 2554697 2587056
56111 2587056 2610151 2621860 2622027 2612402 2595418 2573258 2547294 2517225 2480504 2433339 2372742 2297656
56099 2297656 2208775 2108407 2000738 1891232 1785050 1686038 1596869 1519076 1452586 1396066
56089 1396066 1348405 1309423 1278784 1254938 1235808 1220172 1207835 1198829 1193043 1190319 1190337 1192511 1196415
56076 1196415 1202153 1209913 1219334 1229658 1240379 1251414 1262812 1274605 1286838 1299439 1312107 1324502
56064 1324502 1336461 1348051 1359682 1372207 1386559 1403073 1421413 1441168 1462171 1484223 1507023
56053 1507023 1530497 1554677 1579045 1602594 1624783 1646015 1667047 1688515 1711123 1735408 1760912
$$ packed form
56133I22338L5244M1170M9197N8850O9285Q0052R1119J02225J12386J20061J23702
56122A805629J22182J15053J02971Q8088P3565O1981N3959M8424M3873L8972L2359
56111B587056K3095J1709J67r625j6984k2160k5964l0069l6721m7165o0597p5086
56099B297656q8881j00368j07669j09506j06182r9012q9169p7793o6490n6520
56089A396066m7661l8982l0639k3846j9130j5636j2337r006n786k724J8K174L904
56076A196415N738P760R421J0324J0721J1035J1398J1793J2233J2601J2668J2395
56064A324502J1959J1590J1631J2525J4352J6514J8340J9755K1003K2052K2800
56053A507023K3474K4180K4368K3549K2189K1232K1032K1468K2608K4285K5504
$$ plain form
56042 1760912 1786396 1811466 1837343 1865458 1895880 1927668 1960146 1993174 2026742 2061094 2096815
56031 2096815 2134149 2172616 2211878 2252485 2295120 2339650 2385610 2433097 2482393 2533259 2585528
56020 2585528 2639947 2697415 2757592 2819210 2881643 2945403 3011301 3079989 3152220 3228644 3309267
56009 3309267 3393751 3482285 3575627 3674372 3778674 3888447 4003379 4123004 4247371 4377423
55999 4377423 4514279 4658533 4810668 4971553 5141817 5321376 5510365 5709962 5921442
55990 5921442 6145055 6380865 6630172 6895006 7176821 7476908 7797669 8142109 8512281
55981 8512281 8909563 9336369 9796455 10293781 10832392 11417412 12054962 12751063 13511762
55972 13511762 14344542 15258919 16266106 17379334 18614669 19991004 21530138 23258487
$$ packed form
56042A760912K5484K5070K5877K8115L0422L1788L2478L3028L3568L4352L5721
56031B096815L7334L8467L9262M0607M2635M4530M5960M7487M9296N0866N2269
56020B585528N4419N7468O0177O1618O2433O3760O5898O8688P2231P6424Q0623
56009C309267Q4484Q8534R3342R8745J04302J09773J14932J19625J24367J30052
55999D377423J36856J44254J52135J60885J70264J79559J88989J99597K11480
55990E921442K23613K35810K49307K64834K81815L00087L20761L44440L70172
55981H512281L97282M26806M60086M97326N38611N85020O37550O96101P60699
55972A3511762Q32780R14377J007187J113228J235335J376335J539134J728349
$$ plain form
55964 23258487 25209213 27422904 29948374 32845984 36192093 40082410 44635837 50001118
55956 50001118 56364234 63953334 73040471 83936670 96971589 112455601 130637662
55949 130637662 151674290 175606715 202322204 231462997 262248510 293228480 322108954
55942 322108954 345896288 361510589 366700981 360802453 344912349 321431776 293285966
55935 293285966 263219123 233380477 205205511 179493090 156569234 136454341 118991375
55928 118991375 103932806 90999428 79916573 70429472 62307058 55344532 49365151
55921 49365151 44217548 39771275 35915242 32557267 29620888 27041327 24764310 22746015
55913 22746015 20950762 19348061 17912039 16621713 15459408 14409026 13456625 12591359
$$ packed form
55964B3258487J950726K213691K525470K897610L346109L890317M553427N365281
55956E0001118O363116P589100R087137J0896199J3034919J5484012J8182061
55949A30637662K1036628K3932425K6715489K9140793L0785513L0979970K8880474
55942C22108954K3787334J5614301N190392n898528j5890104k3480573k8145810
55935B93285966l0066843k9838646k8174966k5712421k2923856k0114893j7462966
55928A18991375j5058569j2933378j1082855r487101q122414o962526n979381
55921D9365151n147603m446273l856033l357975k936379k579561k277017k018295
55913B2746015j795253j602701j436022j290326j162305j050382r52401q65266
$$ plain form
55905 12591359 11804161 11086123 10429189 9827165 9274425 8764459 8291323 7851842 7444811
55896 7444811 7068380 6719485 6395334 6094012 5813925 5553825 5313110 5091092 4886252
55887 4886252 4697088 4523184 4364608 4220867 4091462 3976827 3877637 3793765 3725041 3672459
55877 3672459 3637290 3619318 3616947 3628329 3650747 3678991 3705680 3723406 3725907 3707925 3665719 3598126
55865 3598126 3506144 3391472 3256458 3105413 2944741 2781366 2621531 2470481 2331669 2205786
55855 2205786 2091597 1988120 1895316 1812821 1739336 1673691 1615374 1563491 1516176 1471763 1429863
55844 1429863 1390680 1353861 1318562 1284180 1250486 1217442 1185386 1155050 1126931 1100783 1075955
55833 1075955 1051937 1028441 1005382 983097 962232 943067 925204 908099 891630 875933 861005
$$ packed form
55905A2591359p87198p18038o56934o02024n52740n09966m73136m39481m07031
55896G444811l76431l48895l24151l01322k80087k60100k40715k22018k04840
55887D886252j89164j73904j58576j43741j29405j14635r9190q3872o8724n2582
55877C672459l5169j7972k371J1382K2418K8244K6689J7726K501j7982m2206o7593
55865C598126r1982j14672j35014j51045j60672j63375j59835j51050j38812j25883
55855B205786j14189j03477r2804q2495p3485o5645n8317n1883m7315m4413m1900
55844A429863l9183l6819l5299l4382l3694l3044l2056l0336k8119k6148k4828
55833A075955k4018k3496k3059k2285k0865j9165j7863j7105j6469j5697j4928
$$ plain form
55822 861005 846774 833274 820473 808071 795661 782978 769882 756353 742657 729265 716433
55811 716433 704066 692164 681216 671833 664090 657421 651248 645584 640967 637796 635853 634600 633874 633986
55797 633986 635040 636485 637603 638237 638757 639536 640754 642478 644594 646776 648833 650851 652692 653625 652897
55782 652897 650432 646493 640978 633697 625096 615747 605091 591600 574634 555497 536303 518333 501898
55769 501898 487236 474831 465000 457667 452503 449002 446525 444542 442831 441270 439521 437101 433828 430087
55755 430087 426594 423816 421529 418967 415467 410870 405274 398778 391664 384492 377485 370075 361689 352873
55741 352873 344979 338613 333008 327178 321127 315611 311174 307807 305240 303170 301352 299708 298198 296554
55727 296554 294460 292048 289736 287371 284039 279087 272960 266635 260600 254849 249548 245038 241289 237949
$$ packed form
55822H61005j4231j3500j2801j2402j2410j2683j3096j3529j3696j3392j2832
55811G16433j2367j1902j0948r383p743o669o173n664m617l171j943j253p26J12
55797F33986J054J445J118O34N20P79J218J724K116K182K057K018J841R33p28
55782F52897k465l939n515p281q601r349j0656j3491j6966j9137j9194j7970j6435
55769E01898j4662j2405r831p333n164l501k477j983j711j561j749k420l273l741
55755D30087l493k778k287k562l500m597n596o496p114p172p007p410q386q816
55741C52873p894o366n605n830o051n516m437l367k567k070j818j644j510j644
55727B96554k094k412k312k365l332m952o127o325o035n751n301m510l749l340
$$ plain form
55713 237949 235005 232925 232042 232150 232875 234115 235899 238041 240251 242552 245367 249028 253228 256968 259071
55698 259071 258746 255841 250853 244809 238797 233294 228012 222626 217470 213204 209956 207338 205256 204065
55684 204065 203667 203040 201152 198131 195182 193487 193382 194353 195514 196163 196134 195646 194799 193422 191416 188897
55668 188897 185893 182268 178176 174279 171177 168901 167265 166435 166707 167877 169211 170059 170274 170142 170048 170110
55652 170110 170085 169809 169811 171003 173543 176493 178979 181234 183961 187098 189949 192260 194367 196315 197632 198084
55636 198084 197936 197269 195691 192994 189557 185753 181397 176201 170456 164914 160187 156428 153342 150294 146730
55621 146730 142863 139730 138292 138546 139672 140810 141519 141772 141827 142016 142379 142555 142157 141154 139748 138069
55605 138069 136144 134020 131744 129315 126809 124411 122219 120219 118529 117429 116897 116442 115662 114748 114087
$$ packed form
55713B37949k944k080q83J08P25J240J784K142K210K301K815L661M200L740K103
55698B59071l25k905m988o044o012n503n282n386n156m266l248k618k082j191
55684B04065l98o27j888l021k949j695j05R71J161O49k9m88q47j377k006k519
55668A88897l004l625m092l897l102k276j636q30K72J170J334Q48K15j32r4O2
55652A70110k5k76KJ192K540K950K486K255K727L137K851K311K107J948J317M52
55636A98084j48o67j578k697l437l804m356n196n745n542m727l759l086l048l564
55621A46730l867l133j438K54J126J138P09K53N5J89L63J76l98j003j406j679
55605A38069j925k124k276k429k506k398k192k000j690j100n32m55p80r14o61
$$ plain form
55590 114087 113582 112845 111975 111665 112415 113962 115606 116808 117423 117647 117884 118458 119307 120145 120998 122377 124791
55573 124791 128352 132960 138608 145168 152021 158433 164433 171046 179315 189071 198814 206832 212317 215440
55559 215440 216542 215515 211970 205814 197594 188326 178977 169969 161131 152179 143257 134907 127594 121490
55545 121490 116669 113134 110467 107771 104366 100439 96819 94230 92905 92619 92743 92486 91563 90508 89870
55530 89870 89260 87799 85510 83522 82609 82189 81232 79634 78108 77000 75862 74185 72038 69927 68298
55515 68298 67205 66192 64511 61726 58131 54428 51123 48448 46686 46105 46535 47371 48104 48641 49084 49477
55499 49477 49871 50377 51043 51791 52546 53299 54019 54653 55245 55889 56581 57240 57849 58426 58941 59453 60245 61538 63168
55480 63168 64839 66595 68643 70703 72037 72312 72039 71956 72280 72769 73213 73548 73674 73419 72680 71553 70463
$$ packed form
55590A14087n05p37q70l10P50J547J644J202O15K24K37N74Q49Q38Q53J379K414
55573A24791L561M608N648O560O853O412O000O613Q269R756R743Q018N485L123
55559B15440J102j027l545o156q220r268r349r008q838q952q922q350p313o104
55545A21490m821l535k667k696l405l927l620k589j325k86J24k57r23j055o38
55530H9870o10j461k289j988r13m20r57j598j526j108j138j677k147k111j629
55515F8298j093j013j681k785l595l703l305k675j762n81M30Q36P33N37M43L93
55499D9477L94N06O66P48P55P53P20O34N92O44O92O59O09N77N15N12P92J293J630
55480F3168J671J756K048K060J334K75k73q3L24M89M44L35J26k55p39j127j090
$$ plain form
55463 70463 70089 70836 72336 73807 74938 75949 76768 76832 76088 75450 75625 75989 75454 74130 73222 73281 73503 72975
55445 72975 71890 71065 70789 70703 70556 70592 71203 72447 73891 74834 74820 74151 73758 74383 75866 77350 78118 78131 77775
55426 77775 77294 76631 75746 74914 74563 74885 75808 77284 79313 81567 83345 84174 84291 84242 84202 84041 83947 84508 86022
55407 86022 87953 89242 89146 87847 86326 85542 85511 85347 84352 82889 81799 81212 80482 79269 78063 77458 77405
55390 77405 77540 77822 78414 79140 79516 79299 78723 78187 77882 77685 77236 76180 74546 72865 71749 71290 71052 70722
55372 70722 70656 71585 73763 76550 78915 80240 80525 79979 78752 77088 75370 73824 72425 71228 70443 70008
55356 70008 69497 68759 68241 68220 68110 67173 65643 64407 63738 63172 62658 62885 64173 65817 66991 67705 68377 68976
55338 68976 69198 69123 69165 69500 69982 70443 70753 70762 70527 70409 70653 71100 71532 71990 72390 72173 70879 68888 67111
$$ packed form
55463G0463l74P47J500J471J131J011Q19O4p44o38J75L64n35j324r08N9K22n28
55445G2975j085q25k76q6j47L6O11J244J444R43j4o69l93O25J483J484P68J3l56
55426G7775m81o63q85q32l51L22R23J476K029K254J778Q29J17m9m0j61r4N61J514
55407H6022J931J289r6j299j521p84l1j64r95j463j090n87p30j213j206o05n3
55390G7405J35K82N92P26L76k17n76n36l05j97m49j056j634j681j116m59k38l30
55372G0722o6R29K178K787K365J325K85n46j227j664j718j546j399j197p85m35
55356G0008n11p38n18k1j10r37j530j236o69n66n14K27J288J644J174P14O72N99
55338F8976K22p5M2L35M82M61L10Rk35j18K44M47M32M58M00k17j294j991j777
$$ plain form
55319 67111 66012 65360 64889 64734 65092 65795 66368 66402 65906 65382 65442 66217 67284 68284 69340 70669 72106 73311
55301 73311 74183 74698 74609 73722 72303 70721 68942 66885 65130 64564 65248 66266 66904 67473 68667 70517 72396
55284 72396 73770 74566 74863 74615 73773 72533 71343 70687 70888 72038 73943 76020 77463 77804 77312 76549 75628
55267 75628 74417 73436 73747 75509 77333 77797 77144 76660 76731 76551 75712 75031 75399 76619 77897 78888 79777 80702
55249 80702 81636 82551 83309 83562 83143 82374 81688 81073 80207 79016 77781 76676 75534 74144 72710 71803 71844
55232 71844 72686 73825 75001 76345 77805 78812 78905 78449 78228 78389 78259 77275 75615 73900 72716 72539 73540
55215 73540 75246 76819 77915 78891 80012 80991 81614 82233 83126 83784 83492 82419 81534 81516 82195 83038 83699 84022
55197 84022 83924 83452 82801 82192 81815 81763 81868 81699 81004 80065 79384 79145 79230 79647 80517 81657 82564 82942 82968 82835
$$ packed form
55319F7111j099o52m71j55L58P03N73L4m96n24O0P75J067J000J056J329J437J205
55301G3311Q72N15q9q87j419j582j779k057j755n66O84J018O38N69J194J850J879
55284G2396J374P96K97k48q42j240j190o56K01J150J905K077J443L41m92p63r21
55267G5628j211r81L11J762J824M64o53m84P1j80q39o81L68J220J278R91Q89R25
55249H0702R34R15P58K53m19p69o86o15q66j191j235j105j142j390j434r07M1
55232G1844Q42J139J176J344J460J007R3m56k21J61j30r84j660j715j184j77J001
55215G3540J706J573J096R76J121R79O23O19Q93O58k92j073q85j8O79Q43O61L23
55197H4022r8m72o51o09l77n2J05j69o95r39o81k39Q5M17Q70J140R07L78K6j33
$$ plain form
55177 82835 82352 81224 79631 78255 77697 77945 78443 78611 78337 78010 78103 78715 79521 80142 80523 80941 81664 82674
55159 82674 83727 84580 85055 84964 84272 83407 83145 83911 85378 86959 88461 89878 90787 90544 89145 87343 85757
55142 85757 84346 82996 82098 82028 82315 81882 80157 77693 75668 74903 75300 76099 76718 77326 78476 80228 81964
55125 81964 83095 83561 83513 82989 82222 81791 81960 82129 81446 79850 78134 77067 76823 77097 77443 77595 77765 78485
55107 78485 79765 80672 80233 78722 77548 77827 79444 81437 82879 83346 83070 82827 83310 84480 85758 86861
55091 86861 88027 89373 90528 91163 91511 92102 93166 94509 95747 96512 96590 96022 95016 93764 92521 91676
55075 91676 91360 91031 90023 88610 87908 88428 89266 89238 88397 87856 88295 89267 89908 89777 88943 87803 86989 87048 87901
55056 87901 88848 89381 89791 90734 92286 93773 94581 94790 94804 94550 93457 91340 88939 87282 86690 86688 86776 86867 86985
$$ packed form
55177H2835m83j128j593j376n58K48M98J68k74l27R3O12Q06O21L81M18P23J010
55159H2674J053Q53M75r1o92q65k62P66J467J581J502J417R09k43j399j802j586
55142H5757j411j350q98p0K87m33j725k464k025p65L97P99O19O08J150J752J736
55125H1964J131M66m8n24p67m31J69J69o83j596j716j067k44K74L46J52J70P20
55107G8485J280R07m39j511j174K79J617J993J442M67k76k43M83J170J278J103
55091H6861J166J346J155O35L48N91J064J343J238P65P8n68j006j252j243q45
55075I1676l16l29j008j413p02N20Q38k8q41n41M39R72O41j31q34j140q14N9Q53
55056H7901R47N33M10R43J552J487Q08K09J4k54j093k117k401j657n92kQ8R1J18
$$ plain form
55037 86985 86985 86798 86663 86860 87380 87995 88476 88618 88337 87880 87649 87559 86940 85450 83831 83285 84213 86002 87900
55018 87900 89549 90649 90860 90313 89743 89641 89635 89088 88081 87291 87055 87074 87100 87358 88006 88533 88182 86973 85971
54999 85971 86344 88222 90601 92302 92900 92775 92524 92568 93200 94620 96665 98649 99730 99590 98743 98155 98492
54982 98492 99604 100669 100966 100554 100102 100026 100011 99508 98443 97185 96060 95337 95506 96967 99282 101257 102029
54965 102029 101792 101235 100712 100298 100188 100463 100700 100495 100289 101045 102979 105186 106760 107793 108927 110353 111700
54948 111700 112656 113207 113370 113089 112470 111803 111284 110899 110651 110680 111052 111534 111752 111551 111153 110909 110938 111102 111290
54929 111290 111620 112283 113324 114649 116106 117436 118361 118991 119974 121835 124251 126456 128395 130989 135117
54914 135117 140768 147406 154663 162342 170108 177621 184706 190983 195538 197366 196165 192507 187441 182016
$$ packed form
55037H6985%j87j35J97N20O15M81J42k81m57k31r0o19j490j619n46R28J789J898
55018H7900J649J100K11n47n70j02on47j007p90k36J9K6K58O48N27l51j209j002
54999H5971L73J878K379J701N98j25k51M4O32J420K045J984J081j40q47n88L37
54982I8492J112J065K97m12m52p6j5n03j065j258j125p23J69J461K315J975P72
54965A02029k37n57n23m14j10K75K37k05k06P56J934K207J574J033J134J426J347
54948A11700R56N51J63k81o19o67n19l85k48K9L72M82K18k01l98k44K9J64J88
54929A11290L30O63J041J325J457J330R25O30R83J861K416K205J939K594M128
54914A35117N651O638P257P679P766P513P085O277M555J828j201l658n066n425
$$ plain form
54900 182016 176811 171613 165849 159637 153976 149416 145108 139891 133993 128774 124939 121981 119469 117830
54886 117830 117451 117842 118289 118759 119592 120747 122002 123514 125572 127936 129980 131457 132745 134415 136904
54871 136904 140507 145324 151208 157971 165498 173348 180468 185864 189577 192513 195120 196583 195554 191496
54857 191496 185144 177817 170540 163727 157479 151958 147343 143431 139515 134951 129899 125278 121874 119615
54843 119615 117817 115985 114218 112897 112113 111474 110436 108833 107088 105847 105386 105409 105407 105070 104288 102996 101312
54826 101312 99775 99087 99521 100735 102252 103828 105218 105957 105753 104965 104288 104014 103968 104110 104736 105987 107532
54809 107532 108962 110150 111099 111745 112088 112207 111984 111170 109864 108518 107271 105803 104151 103068 103040 103512
54793 103512 103729 103833 104267 104531 103691 102059 101178 101886 103332 104347 104892 105605 106721 108095 109729 111485
$$ packed form
54900A82016n205n198n764o212n661m560m308n217n898n219l835k958k512j639
54886A17830l79L91M47M70Q33J155J255J512K058K364K044J477J288J670K489
54871A36904L603M817N884O763P527P850P120N396L713K936K607J463j029m058
54857A91496o352p327p277o813o248n521m615l912l916m564n052m621l404k259
54843A19615j798j832j767j321p84o39j038j603j745j241m61K3kl37p82j292j684
54826A01312j537o88M34J214J517J576J390P39k04p88o77k74m6J42O26J251J545
54809A07532J430J188R49O46L43J19k23q14j306j346j247j468j652j083k8M72
54793A03512K17J04M34K64q40j632q81P08J446J015N45P13J116J374J634J756
$$ plain form
54777 111485 112632 112477 111401 110710 111408 113401 115829 117897 119514 121317 123937 127120 129965 132280 135241
54762 135241 140194 147107 154764 162312 169966 178195 186854 195365 203326 210590 216838 221352 223329 222457
54748 222457 219105 213847 206880 198247 188602 179284 171336 164836 159447 155151 151972 149415 146919 144659
54734 144659 143185 142249 140807 138438 136153 135273 135857 136668 136560 135535 134513 134402 135503 137589 140333 143579
54718 143579 147292 151423 155866 160508 165313 170455 176273 182870 189699 195786 200453 203494 204565 202902
54704 202902 198149 191243 183853 176907 170068 162729 155100 148094 142365 137776 133765 130053 126863 124478
54690 124478 122773 121427 120481 120300 120875 121575 121801 121539 120978 119961 118287 116264 114474 113176 112428 112555
54674 112555 113859 115872 117558 118335 118430 118134 117409 116392 115661 115496 115296 114261 112498 110952 110302 110268 110176
$$ packed form
54777A11485J147j55j076o91O98J993K428K068J617J803K620L183K845K315K961
54762A35241M953O913P657P548P654Q229Q659Q511P961P264O248M514J977q72
54748B22457l352n258o967q633r645r318p948o500n389m296l179k557k496k260
54734A44659j474r36j442k369k285q80N84Q11j08j025j022j11J101K086K744L246
54718A43579L713M131M443M642M805N142N818O597O829O087M667L041J071j663
54704B02902m753o906p390o946o839p339p629p006n729m589m011l712l190k385
54690A24478j705j346r46j81N75P00K26k62n61j017j674k023j790j298p48J27
54674A12555J304K013J686P77R5k96p25j017p31j65k00j035j763j546o50l4r2
$$ plain form
54657 110176 109930 110190 111499 113423 114819 115063 114694 114568 114683 114369 113547 113057 113476 114139 113860 112400 110754
54640 110754 110015 110348 111097 111614 111780 111889 112305 113251 114707 116273 117256 117241 116676 116551 117262 118100 118154 117459 116851
54621 116851 116862 117283 117730 118140 118569 118913 118964 118530 117523 116214 115347 115533 116461 117134 116965 116239 115444 114732 114253
54602 114253 114433 115439 116710 117516 117759 117841 117930 117820 117413 116921 116505 116054 115418 114691 114177 114132 114535 115022 115076
54583 115076 114422 113293 112276 111858 112109 112708 113282 113705 114095 114534 114922 115160 115328 115567 115908 116314 116743 117042
54565 117042 116998 116693 116546 116747 117003 117164 117671 118758 119552 118874 116879 115068 114513 114843 115184 115322 115507 115765
54547 115765 115965 116096 116051 115500 114356 113011 111854 111031 110923 112180 114725 117282 118584 118725 118769 119446 120875
54530 120875 123138 126207 129377 131622 132628 132981 133258 133481 133510 133461 133556 133901 134509 135271 135929 136341 136696 137148
$$ packed form
54657A10176k46K60J309J924J396K44l69j26J15l14q22m90M19O63k79j460j646
54640A10754p39L33P49N17J66J09M16R46J456J566R83j5n65j25P11Q38N4o95o08
54621A16851J1M21M47M10M29L44N1m34j007j309q67J86R28O73j69p26p95p12m79
54602A14253J80J006J271Q06K43Q2Q9j10m07m92m16m51o36p27n14m5M03M87N4
54583A15076o54j129j017m18K51N99N74M23L90M39L88K38J68K39L41M06M29K99
54565A17042m4l05j47K01K56J61N07J087P94o78j995j811n55L30L41J38J85K58
54547A15765K00J31m5n51j144j345j157q23j08J257K545K557J302J41M4O77J429
54530A20875K263L069L170K245J006L53K77K23K9m9R5L45O08P62O58M12L55M52
$$ plain form
54512 137148 137366 136840 135610 134289 133373 132811 132234 131266 129676 127587 125521 123917 122663 121450 120403 119976
54496 119976 120205 120537 120407 119684 118602 117599 117185 117583 118496 119495 120507 121577 122446 122899 123299 124099 124927
54479 124927 124985 124393 124259 125158 126344 126875 126826 126848 127172 127675 128471 129651 130734 131145 131207 131977 133918 136233
54461 136233 137726 138005 137604 137251 137325 137910 138920 139963 140364 139707 138378 137205 136418 135424 133910 132693 132849
54444 132849 134214 135507 135952 136013 136352 136803 136821 136339 135632 134716 133480 132179 131272 130917 130945 131142 131194 130640 129464
54425 129464 128547 128893 130369 131758 132210 132111 132298 132905 133428 133662 134067 135180 136988 139016 140785 142060 142792
54408 142792 143083 143238 143605 144198 144563 144235 143346 142605 142613 143251 143795 143611 142777 142076 142308 143494 144864 145772 146436
54389 146436 147480 148922 150104 150661 151024 151721 152633 153276 153435 153196 152611 151742 150804 149870 148660 147047 145563
$$ packed form
54512A37148K18n26j230j321r16n62n77r68j590k089k066j604j254j213j047m27
54496A19976K29L32j30p23j082j003m14L98R13R99J012J070Q69M53M00Q00Q28
54479A24927N8n92j34Q99J186N31m9K2L24N03P96J180J083M11O2P70J941K315
54461A36233J493K79m01l53P4N85J010J043M01o57j329j173p87r94j514j217J56
54444A32849J365J293M45O1L39M51J8m82p07r16j236j301r07l55K8J97N2n54j176
54425A29464r17L46J476J389M52r9J87O07N23K34M05J113J808K028J769J275P32
54408A42792K91J55L67N93L65l28q89p41QO38N44j84q34p01K32J186J370R08O64
54389A46436J044J442J182N57L63O97R12O43J59k39n85q69r38r34j210j613j484
$$ plain form
54372 145563 144855 144713 144229 142997 141609 140790 140624 140907 141692 142903 143807 143534 142098 140316 138677 136851
54356 136851 134555 132396 131383 131812 133024 134161 134778 134785 134278 133590 133209 133386 133963 134673 135375 135837 135596 134360
54338 134360 132430 130434 128724 127252 126003 125215 125098 125591 126460 127502 128556 129447 130001 130110 129865 129648
54322 129648 129923 130704 131414 131519 131220 131207 131791 132615 133206 133479 133675 134078 134827 135678 135993 135324 134089 133212 133023
54303 133023 132997 132748 132753 133655 135264 136721 137480 137686 137721 137816 138079 138581 139295 140143 141080 141999 142683 143028 143283 143825
54283 143825 144693 145464 145580 144799 143455 142257 141627 141221 140360 138978 137741 137096 136683 136009 135271 135000 135230
54266 135230 135613 136178 137293 138813 139886 139803 138704 137272 136079 135351 135052 134969 134935 135086 135739 136884 138054
54249 138054 138770 138962 138814 138447 137904 137314 136855 136618 136571 136633 136712 136771 136904 137211 137523 137371 136393 134768 133151
$$ packed form
54372A45563p08j42m84j232j388q19j66K83P85J211R04k73j436j782j639j826
54356A36851k296k159j013M29J212J137O17Pn07o88l81J77N77P10P02M62k41j236
54338A34360j930j996j710j472j249p88j17M93Q69J042J054Q91N54J09k45k17
54322A29648K75P81P10J05k99j3N84Q24N91K73J96M03P49Q51L15o69j235q77j89
54303A33023k6k49NR02J609J457P59K06L5R5K63N02P14Q48R37R19O84L45K55N42
54283A43825Q68P71J16p81j344j198o30m06q61j382j237o45m13o74p38k71K30
54266A35230L83N65J115J520J073q3j099j432j193p28k99q3l4J51O53J145J170
54249A38054P16J92j48l67n43n90m59k37m7O2P9N9J33L07L12j52r78j625j617
$$ plain form
54230 133151 132146 131835 131836 131726 131325 130617 129647 128696 128359 129028 130274 131141 131146 130647 130053 129190 127859 126567 126116
54211 126116 126594 127348 127861 128124 128173 127883 127285 126602 125853 124951 124345 124882 126641 128459 129197 129112 129352 130314 131204
54192 131204 131280 130874 130883 131632 132606 133082 132740 131776 130764 130394 131059 132523 134099 135257 135952 136304 136176 135364
54174 135364 134073 132845 131990 131452 131271 131688 132482 132690 131603 129841 128807 129079 129875 130200 129936 129585 129444
54157 129444 129480 129643 129897 130048 129953 129767 129678 129520 129067 128659 129015 130243 131419 131563 130905 130707 131732 133254
54139 133254 133923 133363 132482 132260 132765 133553 134409 135217 135496 134857 133782 133240 133358 133143 131829 129959 128705
54122 128705 128523 128918 129256 129276 128998 128666 128757 129622 130990 132151 132688 132824 133055 133700 134819 136266 137734 138922
54104 138922 139775 140413 140815 140806 140413 140008 139906 139998 139922 139538 139068 138811 138881 139202 139640 140021 140116 139728 138858 137728
$$ packed form
54230A33151j005l11Jj10m01p08r70r51l37O69J246Q67Nm99n94q63j331j292m51
54211A26116M78P54N13K63M9k90n98o83p49r02o06N37J759J818P38q5K40R62Q90
54192A31204P6m06RP49R74M76l42r64j012l70O65J464J576J158O95L52j28q12
54174A35364j291j228q55n38j81M17P94K08j087j762j034K72P96L25k64l51j41
54157A29444L6J63K54J51r5j86q9j58m53m08L56J228J176J44o58j98J025J522
54139A33254O69n60q81k22N05P88Q56Q08K79o39j075n42J18k15j314j870j254
54122A28705j82L95L38K0k78l32R1Q65J368J161N37J36K31O45J119J447J468J188
54104A38922Q53O38M02rl93m05j02R2p6l84m70k57P0L21M38L81R5l88q70j130
$$ plain form
54084 137728 136576 135454 134331 133362 132888 133087 133731 134431 135039 135707 136580 137589 138568 139451 140304 141208 142181
54067 142181 143199 144283 145523 146911 148130 148678 148373 147688 147406 147937 149111 150585 152185 153729 154795
54052 154795 155012 154526 153897 153507 153319 153242 153424 154030 155002 156229 157703 159208 160216 160637 161505 164180 168670
54035 168670 173460 177346 180858 185276 190736 196089 200494 204334 208484 213337 218794 224676 230764 236795
54021 236795 242704 248648 254544 259832 263892 266602 268381 269943 271993 274775 277737 279967 281165 281782
54007 281782 282023 281217 278673 274788 270757 267264 264027 260579 256981 253595 250497 247344 243712 239491 235045
53992 235045 230953 227485 224386 221273 218116 215234 212947 211401 210535 209988 209255 208162 207018 206028 204792
53977 204792 202752 200018 197339 195339 194090 193306 192550 191382 189778 188348 187665 187439 186860 185703 184460
$$ packed form
54084A37728j152j122j123r69m74J99O44P00O08O68Q73J009R79Q83Q53R04R73
54067A42181J018J084J240J388J219N48l05o85k82N31J174J474J600J544J066
54052A54795K17m86o29l90j88p7J82O06R72J227J474J505J008M21Q68K675M490
54035A68670M790L886L512M418N460N353M405L840M150M853N457N882O088O031
54021B36795N909N944N896N288M060K710J779J562K050K782K962K230J198O17
54007B81782K41q06k544l885m031l493l237l448l598l386l098l153l632m221m446
53992B35045m092l468l099l113l157k882k287j546q66n47p33j093j144r90j236
53977B04792k040k734k679k000j249p84p56j168j604j430o83k26n79j157j243
$$ plain form
53962 184460 183371 182114 180732 180134 181163 183643 186815 190196 193543 196423 198511 200079 201587 202982
53948 202982 203949 204734 206068 208326 211261 214506 217812 220843 223441 226206 230176 235671 241972 248388 255156
53933 255156 262952 272073 282541 294544 308145 322756 337391 351326 364005 374414 381203 383663
53921 383663 382246 378007 371847 364410 356385 348572 341716 336399 333007 331705 332458 335037 338966 343616
53907 343616 348600 354018 360089 366621 373192 379741 386458 393000 398351 401735 403267 403432 402414 400408
53893 400408 398150 396408 395102 393513 391322 388805 386046 382673 378551 374037 369244 363629 356779 349167
53879 349167 341711 334894 328718 323100 317778 312200 306146 300313 295593 291829 287954 283402 278734 274692
53865 274692 271304 268219 265325 262547 259541 256105 252648 249690 247145 244610 242191 240416 239333 238308
$$ packed form
53962A84460j089j257j382n98J029K480L172L381L347K880K088J568J508J395
53948B02982R67P85J334K258K935L245L306L031K598K765L970N495O301O416O768
53933B55156P796R121J0468J2003J3601J4611J4635J3935J2679J0409O789K460
53921C83663j417m239o160p437q025p813o856n317l392j302P53K579L929M650
53907C43616M984N418O071O532O571O549O717O542N351L384J532J65j018k006
53893D00408k258j742j306j589k191k517k759l373m122m514m793n615o850p612
53879C49167p456o817o176n618n322n578o054n833m720l764l875m552m668m042
53865B74692l388l085k894k778l006l436l457k958k545k535k419j775j083j025
$$ plain form
53851 238308 236867 235180 233470 231439 228723 225557 222533 219897 217497 215335 213701 212718 212158 211762 211407
53836 211407 210862 209765 208100 206437 205403 205024 204788 204228 203256 202061 200898 199902 198939 197711 196199 194876
53820 194876 194242 194257 194516 194860 195501 196477 197307 197332 196290 194586 193131 192779 193601 194794 195620 196277 197455 199190
53802 199190 200900 202592 205205 209325 214285 219154 224067 229760 236167 242311 247553 252169 256632 260962
53788 260962 264947 268479 271539 274280 277161 280473 283728 286095 287590 289134 291220 293216 294410 295023
53774 295023 295589 295885 295224 293473 290980 287795 283808 279618 276351 274339 272649 270251 267140 263977 261136
53759 261136 258556 256269 254598 253945 254659 256953 260666 265256 270323 276040 282824 290721 299314 307982 315737
53744 315737 320917 321692 317276 308496 297091 284692 272498 261421 251959 243982 237005 230827 225727
$$ packed form
53851B38308j441j687j710k031k716l166l024k636k400k162j634r83n60l96l55
53836B11407n45j097j665j663j034l79k36n60r72j195j163r96r63j228j512j323
53820A94876o34J5K59L44O41R76Q30K5j042j704j455l52Q22J193Q26O57J178J735
53802A99190J710J692K613M120M960M869M913N693O407O144N242M616M463M330
53788B60962L985L532L060K741K881L312L255K367J495J544K086J996J194O13
53774B95023N66K96o61j751k493l185l987m190l267k012j690k398l111l163k841
53759B61136k580k287j671o53P14K294L713M590N067N717O784P897Q593Q668P755
53744C15737N180P75m416q780j1405j2399j2194j1077r462p977o977o178n100
$$ plain form
53731 225727 221972 219317 217093 214763 212327 210172 208599 207554 206836 206412 206322 206363 206229 206011 206165 206744 207052
53714 207052 206444 205240 204379 204265 204458 204446 204240 204113 204197 204500 204884 204925 204255 203272 203050 204245 206409 208638
53696 208638 210495 212048 213493 215207 217689 220825 223537 224811 224951 225121 225822 226505 226692 226651 226675 226414 225412
53679 225412 223914 222630 221874 221272 220301 218927 217736 217447 218223 219487 220545 221240 221740 221941 221602 220951 220554
53662 220554 220479 220172 219328 218316 217492 216700 215812 215196 215176 215444 215583 215829 216767 218480 220508 222487 224389 226286
53644 226286 228326 230763 233539 235954 237207 237200 236431 235244 233671 231891 230276 228951 227785 226840 226318 226002
53628 226002 225343 224279 223446 223350 223758 224231 224804 225753 226994 228180 229269 230616 232534 235051 238072 241505
53612 241505 245175 248812 252205 255278 257990 260281 262169 263773 265139 266094 266440 266392 266624 267677 269356
$$ packed form
53731B25727l755k655k224k330k436k155j573j045p18m24r0M1j34k18J54N79L08
53714B07052o08j204q61j14J93j2k06j27Q4L03L84M1o70r83k22J195K164K229
53696B08638J857J553J445J714K482L136K712J274J40J70P01O83J87m1K4k61j002
53679B25412j498j284p56o02r71j374j191k89P76J264J058O95N00K01l39o51l97
53662B20554p5l07q44j012q24p92q88o16k0K68J39K46R38J713K028J979J902J897
53644B26286K040K437K776K415J253pp69j187j573j780j615j325j166r45n22l16
53628B26002o59j064q33r6M08M73N73R49J241J186J089J347J918K517L021L433
53612B41505L670L637L393L073K712K291J888J604J366R55L46m8K32J053J679
$$ plain form
53597 269356 270966 272149 273099 273876 273976 273015 271516 270469 270249 270494 270983 271967 273416 274551 274566 273533 272205
53580 272205 271053 269851 268176 266051 263987 262535 261821 261539 261359 261187 260949 260321 258996 257167 255428 254123
53564 254123 253054 251874 250480 249038 247911 247610 248406 249895 251306 252376 253515 254978 256360 257240 257886
53549 257886 258873 260341 262033 263772 265422 266682 267501 268537 270583 273608 276918 280264 284133 288826 293875
53534 293875 298720 303437 308439 313827 319486 325540 332262 339699 347777 356646 366444 376823 387192 397550
53520 397550 408637 420993 434229 447590 460994 475066 490171 505894 521708 537850 555184
53509 555184 574242 594637 615366 635543 654876 673697 692584 711813 731158 750367 769661
53498 769661 789430 809417 828687 846680 863931 881395 899335 917320 935090 952820 970517
$$ packed form
53597B69356J610J183R50P77J00r61j499j047k20K45M89R84J449J135J5j033j328
53580B72205j152j202j675k125k064j452p14k82j80j72k38o28j325j829j739j305
53564B54123j069j180j394j442j127l01P96J489J411J070J139J463J382Q80O46
53549B57886R87J468J692J739J650J260Q19J036K046L025L310L346L869M693N049
53534B93875M845M717N002N388N659O054O722P437Q078Q869R798J0379J0369J0358
53520C97550J1087J2356J3236J3361J3404J4072J5105J5723J5814J6142J7334
53509E55184J9058K0395K0729K0177J9333J8821J8887J9229J9345J9209J9294
53498G69661J9769J9987J9270J7993J7251J7464J7940J7985J7770J7730J7697
$$ plain form
53487 970517 987756 1004317 1020670 1037397 1054284 1070347 1084690 1097094 1107885 1117524 1126421 1134826
53475 1134826 1142626 1149307 1154271 1157284 1158587 1158626 1157689 1155691 1152160 1146443 1138177 1127702 1115889 1103397
53461 1103397 1090200 1076041 1061166 1046233 1031432 1016108 999542 981811 963567 945090 926015
53450 926015 906008 885403 865063 845759 827743 810711 794102 777577 761357 746029 732030
53439 732030 719430 708202 698442 690208 683268 677262 672135 668317 666424 666736 668908 672151 675787 679720
53425 679720 684432 690547 698423 708054 719274 731946 745985 761193 777155 793479 810297 828391
53413 828391 848543 870695 893900 917282 941000 966161 993799 1024033 1056253 1089973 1125293
53402 1125293 1162512 1201601 1242337 1284777 1329128 1375090 1421795 1468696 1516115 1564475 1613244
$$ packed form
53487I70517J7239J6561J6353J6727J6887J6063J4343J2404J0791R639Q897Q405
53475A134826P800O681M964L013J303L9r37j998l531n717q266j0475j1813j2492
53461A103397j3197j4159j4875j4933j4801j5324j6566j7731j8244j8477j9075
53450I26015k0007k0605k0340j9304j8016j7032j6609j6525j6220j5328j3999
53439G32030j2600j1228r760q234o940o006n127l818j893L12K172L243L636L933
53425F79720M712O115P876R631J1220J2672J4039J5208J5962J6324J6818J8094
53413H28391K0152K2152K3205K3382K3718K5161K7638L0234L2220L3720L5320
53402A125293L7219L9089M0736M2440M4351M5962M6705M6901M7419M8360M8769
$$ plain form
53391 1613244 1661182 1707619 1753057 1798429 1844130 1889813 1934727 1978075 2019316 2058332 2095112
53380 2095112 2129259 2160099 2187360 2211356 2232331 2249993 2263952 2274282 2281300 2285030 2285191 2281480
53368 2281480 2273432 2260186 2240992 2216076 2186560 2153317 2116177 2074523 2028464 1979109 1927757
53357 1927757 1875155 1821691 1768057 1715306 1664186 1614663 1566265 1518728 1472101 1426467 1381915
53346 1381915 1338702 1296960 1256249 1215838 1175646 1136520 1099328 1064101 1030276 997452 965570
53335 965570 934684 905029 877173 851704 828783 808237 789900 773549 758755 745255 733348
53324 733348 723472 715392 708264 701546 695450 690446 686759 684400 683285 683069 683213 683519 684458 686870 691409
53309 691409 698198 706735 716090 725614 735609 747031 760416 775354 791189 807841 825692 844948
$$ packed form
53391A613244M7938M6437M5438M5372M5701M5683M4914M3348M1241L9016L6780
53380B095112L4147L0840K7261K3996K0975J7662J3959J0330P018L730J61l711
53368B281480q048j3246j9194k4916k9516l3243l7140m1654m6059m9355n1352
53357A927757n2602n3464n3634n2751n1120m9523m8398m7537m6627m5634m4552
53346A381915m3213m1742m0711m0411m0192l9126l7192l5227l3825l2824l1882
53335I65570l0886k9655k7856k5469k2921k0546j8337j6351j4794j3500j1907
53324G33348r876q080p128o718o096n004l687k359j115k16J44L06R39K412M539
53309F91409O789Q537R355R524R995J1422J3385J4938J5835J6652J7851J9256
$$ plain form
53297 844948 865481 887176 910113 934416 960066 986843 1014316 1041925 1069138 1095530 1120765
53286 1120765 1144727 1167600 1189556 1210299 1229171 1245732 1259909 1271625 1280709 1287299 1291723 1293760
53274 1293760 1292608 1288137 1281603 1274391 1266330 1256060 1243026 1228212 1212764 1196609 1178913 1159348
53262 1159348 1138341 1116347 1093420 1069479 1044545 1018620 991613 963579 934912 906153 877605
53251 877605 849323 821503 794731 769593 746054 723501 701483 680104 659472 639056 618065
53240 618065 596408 574889 554325 534796 515852 497174 478888 461433 445302 430736 417486
53229 417486 404951 392722 381001 370479 361815 355139 349817 344664 338616 331416 323673 316243 309572
53216 309572 303523 297646 291633 285724 280628 276757 273452 269395 264029 258309 253708 250678 248494 246482
$$ packed form
53297H44948K0533K1695K2937K4303K5650K6777K7473K7609K7213K6392K5235
53286A120765K3962K2873K1956K0743J8872J6561J4177J1716R084O590M424K037
53274A293760j152m471o534p212q061j0270j3034j4814j5448j6155j7696j9565
53262A159348k1007k1994k2927k3941k4934k5925k7007k8034k8667k8759k8548
53251H77605k8282k7820k6772k5138k3539k2553k2018k1379k0632k0416k0991
53240F18065k1657k1519k0564j9529j8944j8678j8286j7455j6131j4566j3250
53229D17486j2535j2229j1721j0522q664o676n322n153o048p200p743p430o671
53216C09572o049n877o013n909n096l871l305m057n366n720m601l030k184k012
$$ plain form
53202 246482 244809 243839 243184 241939 239758 237222 235036 233290 231769 230574 229926 229546 228855 227952 227731 228638
53186 228638 229789 229908 228873 227682 227006 226467 225498 224211 223113 222377 221829 221305 220625 219508 217943 216481
53170 216481 215737 215663 215694 215548 215499 215862 216593 217500 218471 219291 219509 218855 217750 217067 217295 218003 218274 217598 216249
53151 216249 214821 213637 212721 212210 212436 213525 215081 216346 216621 215637 213778 212019 211309 211764 212593 212947
53135 212947 212674 212140 211634 211246 211112 211338 211701 211733 211117 209821 207909 205561 203253 201533 200507 199827 199290
53118 199290 199122 199443 199750 199323 198141 197087 197149 198534 200620 202637 204261 205581 206729 207658 208219 208262 207637
53101 207637 206290 204471 202690 201263 199926 198040 195207 191643 188054 185221 183578 183015 183098 183515 184215
53086 184215 185025 185414 184915 183701 182443 181637 181256 181014 180695 180242 179801 179642 179855 180159 180286 180413 180855 181405
$$ packed form
53202B46482j673r70o55j245k181k536k186j746j521j195o48l80o91r03k21R07
53186B28638J151J19j035j191o76n39r69j287j098p36n48n24o80j117j565j462
53170B16481p44p4L1j46m9L63P31R07R71Q20K18o54j105o83K28P08K71o76j349
53151B16249j428j184r16n11K26J089J556J265K75r84j859j759p10M55Q29L54
53135B12947k73n34n06l88j34K26L63L2o16j296j912k348k308j720j026o80n37
53118A99290j68L21L07m27j182j054O2J385K086K017J624J320J148R29N61M3o25
53101B07637j347j819j781j427j337j886k833l564l589k833j643n63Q3M17P00
53086A84215Q10L89m99j214j258q06l81k42l19m53m41j59K13L04J27J27M42N50
$$ plain form
53068 181405 181438 180678 179383 177783 175955 174395 173883 174323 174367 172969 170873 169782 170277 171433 172433 173580
53052 173580 175354 177240 178188 177878 176997 176374 176307 176711 177530 178815 180533 182381 183837 184443 184098 183040 181610
53035 181610 180171 179160 178888 179082 178869 177521 175202 172810 171152 170439 170454 170864 171237 171040 169955 168204
53019 168204 166381 164903 163768 162926 162630 163126 164074 164687 164626 164489 165148 166773 168756 170440 171488 171658 170733
53002 170733 168902 166872 165328 164404 163803 163279 162850 162749 163235 164270 165314 165767 165699 165792 166279 166426 165491 163877
52984 163877 162776 162788 163478 164224 164871 165385 165490 164997 164159 163365 162738 162290 162130 162250 162297 161965 161513 161569 162460
52965 162460 163978 165770 167694 169733 171770 173606 175136 176481 177862 179212 179931 179270 177172 174579 172713
52950 172713 172068 172197 172302 171814 170567 168739 166667 164531 162202 159592 157104 155483 155109 155570 156042 156020
$$ packed form
53068A81405L3p60j295j600j828j560n12M40M4j398k096j091M95J156J000J147
53052A73580J774J886R48l10q81o23o7M04Q19J285J718J848J456O06l45j058j430
53035A81610j439j011k72J94k13j348k319k392j658p13J5M10L73j97j085j751
53019A68204j823j478j135q42k96M96R48O13o1j37O59J625J983J684J048J70r25
53002A70733j831k030j544r24o01n24m29j01M86J035J044M53o8R3M87J47r35j614
52984A63877j101J2O90P46O47N14J05m93q38p94o27m48j60J20M7l32m52N6Q91
52965A62460J518J792J924K039K037J836J530J345J381J350P19o61k098k593j866
52950A72713o45J29J05m88j247j828k072k136k329k610k488j621l74M61M72k2
$$ plain form
52934 156020 155668 155537 155919 156485 156627 156237 155937 156326 157195 157822 157953 158091 158746 159827 160941 161918 162749 163259
52916 163259 163229 162797 162378 162155 161894 161341 160603 159957 159389 158624 157678 157151 157645 158873 159692 159207 157631 155827
52898 155827 154270 152818 151352 150116 149344 149029 149235 150231 152012 153962 155365 156075 156376 156390 156036 155580 155707
52881 155707 156755 158063 158471 157568 156212 155577 155787 155866 155070 153863 153259 153568 154339 155276 156495 157881 158956
52864 158956 159646 160502 161783 163001 163914 165311 167961 171161 173323 173914 173971 174545 175558 176554 177721 179477
52848 179477 181509 183007 183788 184511 185616 186559 186447 185170 183462 181832 179927 177229 174054 171272 169109
52833 169109 166862 164066 161356 159702 159189 159135 159079 158975 158615 157688 156561 156311 157667 160339 163524 166515
52817 166515 168626 169201 168207 166441 164725 163227 161939 161322 161819 162958 163622 163263 162389 161851 162123 163389
$$ packed form
52934A56020l52j31L82N66J42l90l00L89Q69O27J31J38O55J081J114R77Q31N10
52916A63259l0m32m19k23k61n53p38o46n68p65r46n27M94J228Q19m85j576j804
52898A55827j557j452j466j236p72l15K06R96J781J950J403P10L01J4l54m56J27
52881A55707J048J308M08r03j356o35K10P9p96j207o04L09P71R37J219J386J075
52864A58956O90Q56J281J218R13J397K650L200K162N91N7N74J013R96J167J756
52848A79477K032J498P81P23J105R43j12j277j708j630j905k698l175k782k163
52833A69109k247k796k710j654n13n4n6j04l60r27j127k50J356K672L185K991
52817A66515K111N75r94j766j716j498j288o17M97J139O64l59q74n38K72J266
$$ plain form
52801 163389 165815 169364 173447 177036 179153 179326 177702 174815 171298 167822 165173 163990 164116 164462 163862
52786 163862 162123 159993 158211 156891 155799 154834 154050 153453 153004 152723 152672 152878 153282 153689 153788 153429 152902 152791
52768 152791 153422 154589 155902 157179 158335 159050 158905 157939 156847 156433 156906 157825 158680 159394 160178 161092 161921
52751 161921 162399 162361 161661 160184 158111 156059 154732 154419 154900 155841 157131 158861 161045 163415 165470 166716
52735 166716 166910 166147 164780 163335 162460 162697 164139 166326 168576 170455 171914 173112 174224 175317 176220
52720 176220 176548 176037 174938 173920 173461 173335 172780 171117 168306 165044 162362 160893 160311 159634 158306 156937
52704 156937 156610 157435 158194 157738 156365 155378 155463 156097 156561 156849 157242 157530 157236 156390 155513 154930 154525 154172 153981
52685 153981 154075 154438 155013 155679 156215 156601 157268 158628 160386 161834 162821 163819 164888 165283 164493 163108 162188
$$ packed form
52801A63389K426L549M083L589K117J73j624k887l517l476k649j183J26L46o00
52786A63862j739k130j782j320j092r65p84n97m49k81n1K06M04M07R9l59n27j11
52768A52791O31J167J313J277J156P15j45r66j092m14M73R19Q55P14P84R14Q29
52751A61921M78l8p00j477k073k052j327l13M81R41J290J730K184K370K055J246
52735A66716J94p63j367j445q75K37J442K187K250J879J459J198J112J093R03
52720A76220L28n11j099j018m59j26n55j663k811l262k682j469n82o77j328j369
52704A56937l27Q25P59m56j373r87Q5O34M64K88L93K88k94q46q77n83m05l53j91
52685A53981R4L63N75O66N36L86O67J360J758J448R87R98J069L95p90j385r20
$$ plain form
52668 162188 162121 162577 163127 163369 162831 161469 160155 159987 161064 162403 163065 162897 162242 161606 161671 162993 165339
52651 165339 167775 169703 171478 173743 176598 179775 183187 186735 189797 191570 191997 191842 191669 191183 189810
52636 189810 187568 184930 182090 178906 175536 172580 170368 168563 166896 165878 166234 167728 169231 170012 170415
52621 170415 171080 172080 173157 174279 175423 176089 175660 174166 172278 170571 169160 167976 166990 166181 165617 165544
52605 165544 166042 166665 166814 166456 166125 166249 166868 167905 169218 170363 170932 171274 172297 174283 176462 178070
52589 178070 179268 180467 181282 180937 179511 178058 177386 177324 177332 177323 177584 178197 178889 179371 179628 179930 180628 181793 183012
52570 183012 183718 183837 183934 184522 185377 185785 185390 184547 183760 183044 182006 180452 178725 177455 177041 177352 177861 178137
52552 178137 178223 178443 178839 179018 178741 178395 178526 178995 179018 178094 176513 174865 173466 172444 172013 172270 172924 173526
$$ packed form
52668A62188o7M56N50K42n38j362j314j68J077J339O62j68o55o36O5J322K346
52651A65339K436J928J775K265K855L177L412L548L062J773M27j55j73m86j373
52636A89810k242k638k840l184l370k956k212j805j667j018L56J494J503P81M03
52621A70415O65J000J077J122J144O66m29j494j888j707j411j184r86q09n64p3
52605A65544M98O23J49l58l31J24O19J037J313J145N69L42J023J986K179J608
52589A78070J198J199Q15l45j426j453o72o2QrK61O13O92M82K57L02O98J165J219
52570A83012P06J19R7N88Q55M08l95q43p87p16j038j554j727j270m14L11N09K76
52552A78137Q6K20L96J79k77l46J31M69K3r24j581j648j399j022m31K57O54O02
$$ plain form
52534 173526 173842 173854 173647 173552 174140 175677 177727 179626 181199 182712 184257 185573 186357 186411 185632 184259 183027
52517 183027 182636 183082 183865 184715 185668 186539 186967 187029 187285 188060 189219 190721 192824 195529 198358 200977 203528
52500 203528 206029 207973 208952 209221 209118 208261 205983 202442 198783 196139 194848 194562 194745 194885 194590 193736
52484 193736 192551 191501 190975 190990 191227 191445 191798 192516 193427 194154 194741 195607 196773 197707 198175 198738 199991 201730
52466 201730 203311 204563 205831 207334 208932 210460 211873 213175 214531 216266 218395 220311 221342 221497
52452 221497 221229 220582 219137 216813 214245 212183 210868 210084 209461 208556 206995 204747 202172 199643 197297
52437 197297 195241 193778 193206 193447 193966 194102 193521 192427 191357 190731 190595 190694 190682 190366 189986 190211 191465 193165
52419 193165 194079 193663 192680 192179 192303 192533 192692 193049 193639 194176 194677 195538 196921 198573 200383 202639 205524
$$ packed form
52534A73526L16J2k07r5N88J537K050J899J573J513J545J316P84N4p79j373j232
52517A83027l91M46P83Q50R53Q71M28O2K56P75J159J502K103K705K829K619K551
52500B03528K501J944R79K69j03q57k278l541l659k644j291k86J83J40k95q54
52484A93736j185j050n26J5K37K18L53P18R11P27N87Q66J166R34M68N63J253J739
52466B01730J581J252J268J503J598J528J413J302J356J735K129J916J031J55
52452B21497k68o47j445k324k568k062j315p84o23r05j561k248k575k529k346
52437A97297k056j463n72K41N19J36n81j094j070o26j36R9j2l16l80K25J254J700
52419A93165R14m16r83n01J24K30J59L57N90N37N01Q61J383J652J810K256K885
$$ plain form
52402 205524 208817 212304 216147 220585 225551 230799 236211 241711 246914 251013 253071 252571 249837 245803
52388 245803 241160 235941 230207 224864 221189 219534 219002 218538 217863 217238 216876 216903 217518 218780 220403 221989
52372 221989 223334 224438 225510 226990 229196 231814 234127 235880 237423 238819 239417 238812 237702 237099 236960
52357 236960 236272 234489 232260 230600 229753 229095 227953 226412 225396 225887 227854 230096 231411 231774 232048 232715
52341 232715 233404 233732 234022 234904 236546 238643 240918 243281 245604 247658 249357 250888 252561 254631 257210
52326 257210 260270 263764 267814 272662 278251 283942 288971 293293 297702 302933 308810 314550 319749 324705
52312 324705 329758 334721 339148 342924 346321 349625 352984 356543 360411 364423 368133 371192 373660 375922
52298 375922 378320 380870 383354 385733 388433 392053 396667 401564 405781 408730 410211 410142 408706 406601 404741
$$ packed form
52402B05524L293L487L843M438M966N248N412N500N203M099K058n00k734m034
52388B45803m643n219n734n343l675j655n32m64o75o25l62K7O15J262J623J586
52372B21989J345J104J072J480K206K618K313J753J543J396N98o05j110o03j39
52357B36960o88j783k229j660q47o58j142j541j016M91J967K242J315L63K74O67
52341B32715O89L28K90Q82J642K097K275K363K323K054J699J531J673K070K579
52326B57210L060L494M050M848N589N691N029M322M409N231N877N740N199M956
52312C24705N053M963M427L776L397L304L359L559L868M012L710L059K468K262
52298C75922K398K550K484K379K700L620M614M897M217K949J481o9j436k105j860
$$ plain form
52283 404741 403514 402600 401549 400343 399343 398918 399208 400088 401307 402722 404342 406130 407953 409899 412335
52268 412335 415342 418354 420840 423156 426148 429953 433831 437269 440608 444376 448580 452917 457148 461000
52254 461000 464219 467074 470318 474262 478372 482181 486100 490784 496194 501887 507764 513749 519062 522682
52240 522682 524480 525163 525198 524639 524038 524501 526531 529525 532821 536580 541152 546180 550956 555299 559517 563739
52224 563739 567865 571990 576352 580853 585114 589028 592930 597193 601932 607075 612411 617553 622191 626422
52210 626422 630594 634791 638828 642802 647207 652248 657388 661979 666210 671081 677391 684925 692587 699168
52196 699168 704073 707567 710449 713357 716374 719328 722291 725508 728961 732392 735845 739721 744082 748173
52182 748173 751051 752538 753266 753911 754636 755243 755517 755367 754768 753614 751573 748259 743765 738811 734060 729338
$$ packed form
52283D04741j227r14j051j206j000m25K90Q80J219J415J620J788J823J946K436
52268D12335L007L012K486K316K992L805L878L438L339L768M204M337M231L852
52254D61000L219K855L244L944M110L809L919M684N410N693N877N985N313L620
52240E22682J798O83L5n59o01M63K030K994L296L759M572N028M776M343M218M222
52224E63739M126M125M362M501M261L914L902M263M739N143N336N142M638M231
52210F26422M172M197M037L974M405N041N140M591M231M871O310P534P662O581
52196F99168M905L494K882K908L017K954K963L217L453L431L453L876M361M091
52182G48173K878J487P28O45P25O07K74j50n99j154k041l314m494m954m751m722
$$ plain form
52166 729338 723921 717598 711154 705752 702088 700130 699250 698543 697373 695869 694709 694406 695062 696707 699337
52151 699337 702475 705220 707094 708444 709674 710488 710419 709810 709678 710577 712080 713440 714395 715168 715936 716534 716608
52134 716608 715975 714767 713210 711349 709143 706806 704726 703048 701656 700713 700819 702409 705363 709534 715237
52119 715237 722764 731662 741102 750844 761291 772591 784185 795359 805830 815565 824339 831634 836926
52106 836926 840046 841314 841245 839996 837330 833291 828617 824207 820473 817599 816027 816000 816875 817730 818634 820555
52090 820555 823918 828086 832504 837442 843003 848139 851366 852098 850630 847304 842523 837338 833002 829730
52076 829730 826614 823059 819714 817630 816989 817188 817873 819236 821251 823158 824111 824172 824350 825617 828064 830991
52060 830991 833576 835352 836287 836703 837041 837448 837561 836870 835279 833142 830784 828222 825374 822243 818787 814921
$$ packed form
52166G29338n417o323o444n402l664j958q80p07j170j504j160l03O56J645K630
52151F99337L138K745J874J350J230Q14o9o09j32Q99J503J360R55P73P68N98P4
52134G16608o33j208j557j861k206k337k080j678j392r43J06J590K954M171N703
52119G15237P527Q898R440R742J0447J1300J1594J1174J0471R735Q774P295N292
52106H36926L120J268o9j249k666m039m674m410l734k874j572k7Q75Q55R04J921
52090H20555L363M168M418M938N561N136L227P32j468l326m781n185m336l272
52076H29730l116l555l345k084o41J99O85J363K015J907R53O1J78J267K447K927
52060H30991K585J776R35M16L38M07J13o91j591k137k358k562k848l131l456l866
$$ plain form
52044 814921 810780 806724 802823 798614 793730 788630 784223 780678 776983 771993 765759 759489 754268 750221
52030 750221 747045 744905 744279 745106 746682 748551 751004 754432 758701 763552 769145 775532 781886 787083 791058
52015 791058 794771 798668 801919 803622 804132 804595 805558 806646 807432 807970 808421 808568 807869 805771 801897 796159
51999 796159 788773 780114 770493 760011 748505 735608 721054 705008 687915 670027 651422 632633
51987 632633 614918 599474 586498 575223 564719 554472 544469 535120 526952 519979 513468 506696
$$ packed form
52044H14921m141m056l901m209m884n100m407l545l695m990o234o270n221m047
52030G50221l176k140o26Q27J576J869K453L428M269M851N593O387O354N197L975
52015G91058L713L897L251J703N10M63R63J088P86N38M51J47o99k098l874n738
51999G96159p386q659r621j0482j1506j2897j4554j6046j7093j7888j8605j8789
51987F32633j7715j5444j2976j1275j0504j0247j0003r349q168o973o511o772
$$ [...]
##END NTUPLES=NMR SPECTRUM
##END=
