
##TITLE=AC1295_UGARS11106_6615348_fLFundBM2C
##JCAMPDX= 6.0         $$ Bruker NMR JCAMP-DX V2.0
##DATA TYPE= NMR SPECTRUM
##DATA CLASS= NTUPLES
##ORIGIN= BRUKER
##OWNER= Administrator
$$ 1.72 TOPSPIN		Version 2.1
$$ 2012-08-02 20:00:32.718 -0500  Administrator@TOPSPIN
$$ Compression mode = diff/dup
##.OBSERVE FREQUENCY= 400.02188249412
##.OBSERVE NUCLEUS= ^1H
##.ACQUISITION MODE= SIMULTANEOUS (DQD)
##.ACQUISITION SCHEME= undefined
##.AVERAGES= 64
##.DIGITISER RES= 22
##SPECTROMETER/DATA SYSTEM= spect
##.PULSE SEQUENCE= noesygpps1d.comp
##.SOLVENT NAME= COFFEE_meoh
##.SHIFT REFERENCE= INTERNAL, COFFEE_meoh, 1, 14.96292
##AUDIT TRAIL= $$ (NUMBER, WHEN, WHO, WHERE, PROCESS, VERSION, WHAT)
$$ ##TITLE= Audit trail, TOPSPIN		Version 2.1
$$ ##JCAMPDX= 5.01
$$ ##ORIGIN= Bruker BioSpin GmbH
$$ ##OWNER= Administrator
$$ $$ C:\Bruker\TOPSPIN/data/COFFEE/nmr/AC1295_UGARS11106_6615348_fLFundBM2C/12/pdata/1/auditp.txt
$$ ##AUDIT TRAIL=  $$ (NUMBER, WHEN, WHO, WHERE, PROCESS, VERSION, WHAT)
(   1,<2012-08-02 20:00:27.859 -0500>,<Administrator>,<TOPSPIN>,<go>,<TOPSPIN 2.1>,
      <created by zg
	started at 2012-08-02 19:48:57.640 -0500,
	POWCHK enabled, PULCHK disabled,
       configuration hash MD5:
       6B 1B 68 BB D9 2E 58 E2 7F 35 AD 54 07 DF 0E 41
       data hash MD5: 64K
       DE 31 9C 5D 2D 03 6E D7 D3 98 38 BD 10 34 A7 D8>)
(   2,<2012-08-02 20:00:30.828 -0500>,<Administrator>,<TOPSPIN>,<proc1d>,<TOPSPIN 2.1>,
      <Start of raw data processing
       efp LB = 0.3 FT_mod = 6 PKNL = 1 PHC0 = 0 PHC1 = 0 SI = 128K 
       data hash MD5: 128K
       94 EB 72 A4 59 96 41 09 1F E9 51 6B C6 51 99 09>)
(   3,<2012-08-02 20:00:31.953 -0500>,<Administrator>,<TOPSPIN>,<proc1d>,<TOPSPIN 2.1>,
      <pk PHC0 = 3.136597 PHC1 = 0 
       data hash MD5: 128K
       36 F3 26 80 55 42 B5 80 A6 71 C1 EA 28 58 6E 9A>)
(   4,<2012-08-02 20:00:32.203 -0500>,<Administrator>,<TOPSPIN>,<proc1d>,<TOPSPIN 2.1>,
      <abs ABSG = 1 
       data hash MD5: 128K
       69 44 06 7A 26 D1 55 50 37 1C F9 14 E7 22 8B 02>)
(   5,<2012-08-02 20:00:32.312 -0500>,<Administrator>,<TOPSPIN>,<proc1d>,<TOPSPIN 2.1>,
      <abs ABSG = 2 
       data hash MD5: 128K
       F5 7A 40 60 9F 52 BF 55 7D 25 C3 C0 47 19 1F 58>)
(   6,<2012-08-02 20:00:32.515 -0500>,<Administrator>,<TOPSPIN>,<proc1d>,<TOPSPIN 2.1>,
      <abs ABSG = 3 
       data hash MD5: 128K
       F1 78 EF D2 AE 70 3C 5E 17 25 5C 47 17 91 22 5A>)
(   7,<2012-08-02 20:00:32.562 -0500>,<Administrator>,<TOPSPIN>,<proc1d>,<TOPSPIN 2.1>,
      <abs ABSG = 4 
       data hash MD5: 128K
       64 35 03 A4 15 9C 37 7C AF 1A 38 AE A1 FC B0 A2>)
(   8,<2012-08-02 20:00:32.625 -0500>,<Administrator>,<TOPSPIN>,<proc1d>,<TOPSPIN 2.1>,
      <abs ABSG = 5 
       data hash MD5: 128K
       A3 AA 39 EB D7 75 51 5C EB 48 0A 4C E7 62 77 1F>)
$$ ##END=
$$ 
$$ $$ hash MD5
$$ $$ 85 66 35 41 CE 72 7C 2B B9 7B BC 7E A4 76 38 3E
##$RELAX= 
##$RELAX= 
##$RELAX= 
##$RELAX= 
##$RELAX= 
##$RELAX= 
##$RELAX= 
##$RELAX= 
$$ Bruker specific parameters
$$ [...]
150 150 150 150 150 150 150 150
##$TP07= 0
##$TPNAME0= <>
##$TPNAME1= <>
##$TPNAME2= <>
##$TPNAME3= <>
##$TPNAME4= <>
##$TPNAME5= <>
##$TPNAME6= <>
##$TPNAME7= <>
##$TPOAL= (0..7)
0.5 0.5 0.5 0.5 0.5 0.5 0.5 0.5
##$TPOFFS= (0..7)
0 0 0 0 0 0 0 0
##$TUNHIN= 0
##$TUNHOUT= 0
##$TUNXOUT= 0
##$USERA1= <user>
##$USERA2= <user>
##$USERA3= <user>
##$USERA4= <user>
##$USERA5= <user>
##$V9= 5
##$VALIST= <valist>
##$VCLIST= <CCCCCCCCCCCCCCC>
##$VD= 0
##$VDLIST= <DDDDDDDDDDDDDDD>
##$VPLIST= <PPPPPPPPPPPPPPP>
##$VTLIST= <TTTTTTTTTTTTTTT>
##$WBST= 1024
##$WBSW= 4
##$XGAIN= (0..3)
0 0 0 0
##$XL= 0
##$YL= 0
##$YMAX_a= 15227926
##$YMIN_a= -7728453
##$ZGOPTNS= <>
##$ZL1= 120
##$ZL2= 120
##$ZL3= 120
##$ZL4= 120
##$ABSF1= 14.96292
##$ABSF2= -5.595262
##$ABSG= 5
##$ABSL= 3
##$ALPHA= 0
##$AQORDER= 0
##$ASSFAC= 0
##$ASSFACI= 0
##$ASSFACX= 0
##$ASSWID= 0
##$AUNMP= <proc_prof1d_extract.lims>
##$AXLEFT= 0
##$AXNAME= <>
##$AXNUC= <1H>
##$AXRIGHT= 0
##$AXTYPE= 0
##$AXUNIT= <>
##$AZFE= 0.1
##$AZFW= 0.1
##$BCFW= 0
##$BC_mod= 0
##$BYTORDP= 0
##$COROFFS= 0
##$CY= 15
##$DATMOD= 1
##$DC= 0
##$DFILT= <>
##$DTYPP= 0
##$F1P= 0
##$F2P= 0
##$FCOR= 0.5
##$FTSIZE= 131072
##$FT_mod= 6
##$GAMMA= 0
##$GB= 0
##$INTBC= 1
##$INTSCL= 1
##$ISEN= 128
##$LB= 0.3
##$LEV0= 0
##$LPBIN= 0
##$MAXI= 10000
##$MC2= 0
##$MEAN= 0
##$ME_mod= 0
##$MI= 0
##$NCOEF= 0
##$NC_proc= -2
##$NLEV= 6
##$NOISF1= 0
##$NOISF2= 0
##$NSP= 0
##$NTH_PI= 0
##$NZP= 0
##$OFFSET= 14.96292
##$PC= 1
##$PHC0= 3.136597
##$PHC1= 0
##$PH_mod= 1
##$PKNL= yes
##$PPARMOD= 0
##$PPDIAG= 0
##$PPIPTYP= 0
##$PPMPNUM= 2147483647
##$PPRESOL= 1
##$PSCAL= 4
##$PSIGN= 0
##$PYNMP= <proc.py>
##$REVERSE= no
##$SF= 400.020008870108
##$SI= 131072
##$SIGF1= 0
##$SIGF2= 0
##$SINO= 400
##$SIOLD= 131072
##$SPECTYP= <>
##$SREGLST= <1H.CDCl3>
##$SSB= 0
##$STSI= 131072
##$STSR= 0
##$SW_p= 8223.68421052631
##$SYMM= 0
##$S_DEV= 0
##$TDeff= 65536
##$TDoff= 0
##$TI= <>
##$TILT= no
##$TM1= 0
##$TM2= 0
##$TOPLEV= 0
##$USERP1= <user>
##$USERP2= <user>
##$USERP3= <user>
##$USERP4= <user>
##$USERP5= <user>
##$WDW= 1
##$XDIM= 131072
##$YMAX_p= 441008603
##$YMIN_p= -25509
##$CURPLOT= <Network HP LaserJet P1505>
##$CURPRIN= <$Network HP LaserJet P1505>
##$DFORMAT= <normdp>
##$LAYOUT= <+/1D_H.xwp>
##$LFORMAT= <normlp>
##$PFORMAT= <normpl>
##$SURQMSG= 1
$$ End of Bruker specific parameters
$$ ---------------------------------
##NTUPLES= NMR SPECTRUM
##VAR_NAME=  FREQUENCY,     SPECTRUM/REAL,   SPECTRUM/IMAG
##SYMBOL=    X,             R,               I
##VAR_TYPE=  INDEPENDENT,   DEPENDENT,       DEPENDENT
##VAR_FORM=  AFFN,          ASDF,            ASDF
##VAR_DIM=   131072,        131072,          131072
##UNITS=     HZ,            ARBITRARY UNITS, ARBITRARY UNITS
##FACTOR=    0.0627417313425164, 1,          1
##FIRST=     8223.62146879497, -68,          -49493
##LAST=      0,             499,             -49823
##MIN=       0,             -25509,          0
##MAX=       8223.62146879497, 441008603,    0
$$ Real data points
##PAGE= N=1
##DATA TABLE= (X++(R..R)), XYDATA
$$ [...]
63395G65158j7799j8901j9689j9966j9656j8636j6863j4559j2163j0074q515p366
$$ 765158 747359 728458 708769 688803 669147 650511 633648 619089 606926 596852 588337 580971
63383E80971o130m461k682j413o22L79J883L415M566N519O509P423Q313R547J1092
$$ 580971 574841 570380 567698 566285 565663 566042 567925 571340 575906 581425 587934 595357 603670 613217 624309
63368F24309J2344J3152J4291J6252J8327J9592K0219K1063K2382K3770K4924
$$ 624309 636653 649805 664096 680348 698675 718267 738486 759549 781931 805701 830625
63357H30625K5712K5806K4966K3386K1141J7623J2376O222P58l187n937p940r162
$$ 830625 856337 882143 907109 930495 951636 969259 981635 987857 988615 985428 979491 971551 962389
63344I62389r554r453r350r547j0139j0963j1756j2641j4243j6864j9743k1654
$$ 962389 952835 943382 934032 924485 914346 903383 891627 878986 864743 847879 828136 806482
63332H06482k2124k1668k0925k0107j9230j8369j7619j7015j6558j6044j5044
$$ 806482 784358 762690 741765 721658 702428 684059 666440 649425 632867 616823 601779
63321F01779j3364j1430r912r077q690q380p782o674n306m393m319m558m295l491
$$ 601779 588415 576985 567073 557996 549306 540926 533144 526470 521164 516771 512452 507894 503599 500108
63307E00108k790k501k229j624j005r78j692k647l218l203k890k653k587k651
$$ 500108 497318 494817 492588 490964 489959 488981 487289 484642 481424 478221 475331 472678 470091 467440
63293D67440k914l390l778l764l555l636l999m149l910l608l344k755j829j184
$$ 467440 464526 461136 457358 453594 450039 446403 442404 438255 434345 430737 427393 424638 422809 421625
63279D21625j166j341j379j773k905m077m337l833l449l347k901k013j500j871
$$ 421625 420459 419118 417739 415966 413061 408984 404647 400814 397365 394018 391117 389104 387604 385733
63265C85733k540k664k219j807j745j784j579j143p75o95p81o67j99L34M88J88
$$ 385733 383193 380529 378310 376503 374758 372974 371395 370252 369477 368782 368001 367334 367135 367469 367957 368145
63249C68145k50n55q09j190j524j324m11O87J261J271J293J526J394M83o56j173
$$ 368145 367895 367340 366531 365341 363817 362493 362082 362769 364030 365301 366594 368120 369514 369997 369341 368168
63233C68168j008o43j06R65K383L444L977M575N583O584P088P150P026O738O173
$$ 368168 367160 366517 366411 367376 369759 373203 377180 381755 387338 393922 401010 408160 415186 421924 428097
63218D28097N154L442J114j087k413k959l145k650r55J173K119J565R28J236J891
$$ 428097 433251 436693 437807 436720 434307 431348 428203 425553 424598 425771 427890 429455 430383 431619 433510
63203D33510K087K157K680L358L700L908M215M154L364K369J765J443J305J768
$$ 433510 435597 437754 440434 443792 447492 451400 455615 459769 463133 465502 467267 468710 470015 471783
63189D71783K755L174K481J771K146K916K815K212K555M075N605O460P066P821
$$ 471783 474538 477712 480193 481964 484110 487026 489841 492053 494608 498683 504288 510748 517814 525635
63175E25635Q590R331J0144J0720J0752J0747J1379J2199J2133J1150J0306J0097
$$ 525635 534225 543556 553700 564420 575172 585919 597298 609497 621630 632780 643086 653183
63163F53183J0006R731R717J0146J0470J0283R860R467Q886P891O577M973K945
$$ 653183 663189 672920 682637 692783 703253 713536 723396 732863 741749 749640 756217 761190 764135
63150G64135O30j575l508n216o495p074p306p914r020r941j0059r431q522p816
$$ 764135 764765 763190 759682 754466 747971 740897 733591 725677 716657 706716 696657 687226 678704 670888
63136F70888p613p727p568o934o376o309o249n670n018m981n156m603l423k598
$$ 670888 663275 655548 647980 641046 634670 628361 622112 616442 611424 606443 601287 596684 593261 590663
63122E90663k427k297j984j938k111j722n13P25J246J117P35M31O56J700L061
$$ 590663 588236 585939 583955 582017 579906 578184 577671 578396 579642 580759 581494 581925 582581 584281 587342
63107E87342L980M634N805P322Q089P904P906Q759R614R594R103Q827Q369O941
$$ 587342 591322 595956 601761 609083 617172 625076 632982 641741 651355 660949 670052 678879 687248 694189
63093F94189M750K685J081l64j737k768l331l549l491l248l059l032l002k926
$$ 694189 698939 701624 702705 702341 700604 697836 694505 690956 687465 684217 681158 678126 675124 672198
63079F72198l099l626m077m038l607l059k337j322l06K45K76K30O29J693L171
$$ 672198 669099 665473 661396 657358 653751 650692 648355 647033 646727 646972 647248 647478 648107 649800 652971
63064F52971M466N122N306N508N835O003O012O281O867P061O117M165K119Q00
$$ 652971 657437 662559 667865 673373 679208 685211 691223 697504 704371 711432 717549 721714 723833 724633
63050G24633K69j34j081k503l624l919l700l459l109k405j732j620j759j413p17
$$ 724633 724902 724768 723687 721184 717560 713641 709941 706482 703373 700968 699236 697616 695857 694444 693727
63035F93727n80j203j732j609j350j499j710j447r55r31j591k573l451l964m083
$$ 693727 693147 691944 690212 688603 687253 685754 684044 682597 681642 680711 679120 676547 673096 669132 665049
63020F65049m079m320m832n348n737n967n765m957m144m249n156n612m766l168
$$ 665049 660970 656650 651818 646470 640733 634766 629001 624044 619900 615651 610495 604883 600117 596949
63006E96949j825r65k59L71Q00J271K328M143O218P822Q677R312J0531J2367J3884
$$ 596949 595124 594159 593900 594271 595071 596342 598670 602813 609031 616853 625530 634842 645373 657740 671624
62991F71624J4423J4620J5492J6876J7747J7836J7799J7745J6870J4919J2831
$$ 671624 686047 700667 716159 733035 750782 768618 786417 804162 821032 835951 848782
62980H48782J1434J0408R181P923O951N842L988J563p26k574m279o368r275j3006
$$ 848782 860216 870624 879805 887728 894679 900521 904509 906072 905346 902772 898493 892125 882850 869844
62966H69844j6794j9649k1533k3447k5998k8511k9914k9900k8829k7150k5440
$$ 869844 853050 833401 811868 788421 762423 733912 703998 674098 645269 618119 592679
62955E92679k4330k3847k3214k1849k0029j8221j6309j4075j1913j0477r910r832
$$ 592679 568349 544502 521288 499439 479410 461189 444880 430805 418892 408415 398505 388673
62943C88673r748r196p974o577n804n669n281m201l145k815k824k473j959j911
$$ 388673 378925 369729 361755 355178 349374 343705 338424 334223 331078 328263 325439 322966 321007 319096
62929C19096k257k362j984j401q47m14k93m81o05m38l13n42q48r22j012j425j813
$$ 319096 316839 314477 312493 311092 310245 309831 309538 309057 308452 308014 307701 307159 306311 305389 304377 302952 301139
62912C01139j688j232r34p71m19%O8k20n15o97q21p00j52N11P92O87N64M99K61
$$ 301139 299451 298219 297285 296514 296095 296095 296163 295943 295428 294731 293910 293210 293058 293569 294361 295048 295612 296111 296372
62893B96372j82n99q03p47m61k20m60j194j812j797j371j072j086j317j655j761
$$ 296372 296190 295591 294788 294041 293580 293360 292900 291706 289894 288097 286726 285654 284568 283251 281596 279835
62877B79835j150Q3J130J549J880K618L286L309L182L776M911N678N865O010O213
$$ 279835 278685 278768 279898 281447 283327 285945 289231 292540 295722 299498 304409 310087 315952 321962 328175
62862C28175O038N580N569O177O605O204N206M112K975J662K90r28j861k355k351
$$ 328175 334213 339793 345362 351539 358144 364348 369554 373666 376641 378303 378593 377665 375804 373449 371098
62847C71098k271k798l991n001m979m028l055k826l337l952m016l396k512j875
$$ 371098 368827 366029 362038 357037 352058 348030 344975 342149 338812 334860 330844 327448 324936 323061
62833C23061j644j628j588j468j494j994k868l311k573j044j7j67p81q35k21M54
$$ 323061 321417 319789 318201 316733 315239 313245 310377 307066 304493 303449 303432 303265 302484 301649 301428 301882
62817C01882P84P21K69m19r31j106j333j885k346k165j494r44p85r17j299j824
$$ 301882 302666 303387 303656 303237 302306 301200 299867 297982 295636 293471 291977 291033 290248 289331 288032 286208
62801B86208k100j921j718j961k349k208j478p58m57m85o22p33o65m00j17J27
$$ 286208 284108 282187 280469 278508 276159 273951 272473 271715 271258 270773 270151 269418 268753 268353 268236 268363
62785B68363N41J125J456J294R82P85M19k43n83j54M17K68l96p55p13p72q46l32
$$ 268363 268904 270029 271485 272779 273761 274546 274965 274722 274139 273985 274402 274670 274274 273519 272806 272034 271188 270856
62767B70856P34J593J864J822J635J265J194K082L585M462M214L634L382K999
$$ 270856 271590 273183 275047 276869 278504 279769 280963 283045 286630 291092 295306 298940 302322 305321
62753C05321J966R08Q85J884K773K668J768R35O87P81O02m6p10q71n62j81P7K55
$$ 305321 307287 308195 309080 310964 313737 316405 318173 319108 319795 320576 321178 321132 320422 319551 318989 318808 318885 319140
62735C19140L62M34O30Q34M07j021k727l534l257k907l360m470n494n924n676
$$ 319140 319502 319936 320566 321400 321807 320786 318059 314525 311268 308361 305001 300531 295037 289113 283437
62720B83437m966m167l537l000k435k000j910j999j923j631j298r86o83m52r5
$$ 283437 278471 274304 270767 267767 265332 263332 261422 259423 257500 255869 254571 253585 252902 252450 252355
62705B52355R16K674M346N085N081N080N266N428N858O983Q273Q657Q130P920
$$ 252355 253271 255945 260291 265376 270457 275537 280803 286231 292089 299072 307345 316002 324132 332052
62691C32052Q839J0422J1899J3194J4587J6203J8179K0634K3174K5110K6416K7767
$$ 332052 340891 351313 363212 376406 390993 407196 425375 446009 469183 494293 520709 548476
62679E48476K9365L0427L0260K9127K7576K5568K2731J9013J4602R625M301r62
$$ 548476 577841 608268 638528 667655 695231 720799 743530 762543 777145 786770 791071 790109
62667G90109n972j0906j5808k0278k3899k6531k8058k8374k7809k7079k6490k5695
$$ 790109 784137 773231 757423 737145 713246 686715 658657 630283 602474 575395 548905 523210
62655E23210k4479k3230k2343k1608k0610j9264j7622j5592j3330j1404j0165
$$ 523210 498731 475501 453158 431550 410940 391676 374054 358462 345132 333728 323563
62644C23563r204p958o569n668n472n514n296m892m797n237n678n199l586j849
$$ 323563 314359 306401 299832 294164 288692 283178 277882 272990 268193 262956 257278 252079 248493 246644
62630B46644j255j911k803l132l016k793k326j454n03O6K24K62L92O97J192J649
$$ 246644 245389 243478 240675 237543 234527 231734 229408 227954 227451 227517 227741 228003 228395 229092 230284 231933
62614B31933J703J365J120J264J429J132M99J35L98J052J561J523R82M11K93O46
$$ 231933 233636 235001 236121 237385 238814 239946 240445 240580 240978 242030 243591 245114 246096 246507 246800 247446
62598B47446J121J514J953K545L165L649L968M145M223M292M275L836K857J901
$$ 247446 248567 250081 252034 254579 257744 261393 265361 269506 273729 278021 282296 286132 288989 290890
62584B90890J696K189K636K694K762L084L142K393J105L4m69o46q11j034j257
$$ 290890 292586 294775 297411 300105 302867 305951 309093 311486 312591 312625 312156 311510 310699 309665 308408
62569C08408j441j576j625j512j222r57j059j619k266k610k680k701k647k374
$$ 308408 306967 305391 303766 302254 301032 300075 299016 297397 295131 292521 289841 287140 284493 282119
62555B82119j995j713j446j066p85r05j333j840k502l317l735l303k601k580l134
$$ 282119 280124 278411 276965 275899 275114 274209 272876 271036 268534 265217 261482 258179 255578 252998 249864
62540B49864l250k610k006j949j896j297n06j01N5L87Q66J173J276J341J343J176
$$ 249864 246614 244004 241998 240049 238153 236856 236350 236249 236304 236691 237557 238730 240006 241347 242690 243866
62524B43866Q64M77J07M9N96J501K098K169K216K695L457M104M450M473M262M237
$$ 243866 244730 245207 245314 245363 245959 247460 249558 251727 253943 256638 260095 264199 268649 273122 277384 281621
62508B81621M881O118P383Q419R472J0649J1690J2506J3339J4203J4827J5257
$$ 281621 286502 292620 300003 308422 317894 328543 340233 352739 366078 380281 395108 410365
62496D10365J5858J6582J6973J6971J6882J6404J4770J2120R636P808N627K176
$$ 410365 426223 442805 459778 476749 493631 510035 524805 536925 546561 554369 559996 562172
62484E62172j943n555q336j0458j1671j1831j1655j1920j2257j1784j0511r272
$$ 562172 560229 554674 546338 535880 524209 512378 500723 488803 476546 464762 454251 444979
62472D44979q580q375q538q776q374p002n534n026n129m584l129j782j114l95
$$ 444979 436399 428024 419486 410710 402336 395334 389800 384774 379645 375061 371932 370150 369036 368641
62458C68641J044K576L005K066O29k66k34L57Q00P06L92M63J010J533J636J504
$$ 368641 369685 372261 375266 377332 377961 377695 377461 377818 378618 379324 379716 380179 381189 382722 384358 385862
62442C85862J514J669J670J332O90k07j363k602l474l609l188k838k977l419l730
$$ 385862 387376 389045 390715 392047 392737 392530 391167 388565 385091 381482 378294 375456 372479 369060 365330
62427C65330l699l245k246r03L3Kn29n54J90J095J779K560L655M694N299N539
$$ 365330 361631 358386 356140 355237 355270 355272 354743 354189 354379 355474 357253 359813 363468 368162 373461 379000
62411C79000N579N455N477O149P405Q475Q918R069R275R385R377R674J0238J0188
$$ 379000 384579 390034 395511 401660 409065 417540 426458 435527 444802 454187 463564 473238 483476 493664
62397D93664Q982P373O363N773M698K913R64p67k229l103l039k476k410l169l991
$$ 493664 502646 510019 516382 522155 526853 529766 530730 529963 527734 524631 521592 519116 516706 513537 509546
62382E09546l975l022j703n19N48J900L813O029P983R487J0901J2605J4639J6901
$$ 509546 505571 502549 500846 500327 500875 502775 506588 512617 520600 530087 540988 553593 568232 585133
62368E85133J9274K1466K3263K5123K7913L1769L5854L9480M2874M6472N0151
$$ 585133 604407 625873 649136 674259 702172 733941 769795 809275 852149 898621 948772
62357I48772N3535N6335N7945N7560N5176N1643M7079M0305L0792K0164J0494
$$ 948772 1002307 1058642 1116587 1174147 1229323 1280966 1328045 1368350 1399142 1419306 1429800
62346A429800J863o899j5633k2743k7667l1655l5745l9328m1454m2416m3131m3674
$$ 1429800 1431663 1424764 1409131 1386388 1358721 1327066 1291321 1251993 1210539 1168123 1124992 1081318
62334A081318m3279m1490l8634l5251l1627k7926k4502k1752j9681j7754j5481
$$ 1081318 1038039 996549 957915 922664 891037 863111 838609 816857 797176 779422 763941
62323G63941j3092j1258j0124r109p850o675n734m411k273j08R02P52N22Q32J257
$$ 763941 750849 739591 729467 720358 712508 705833 700099 695688 693415 693307 694209 694961 695483 696315 697572
62308F97572J217P10J1p13j325j723k017k384k750k932l005l092k986k442j667
$$ 697572 698789 699499 699510 698797 697472 695749 693732 691348 688598 685666 682661 679569 676583 674141 672474
62293F72474j064o09PQ04J568K369L386M392N072N734P000Q635R481Q900P789
$$ 672474 671410 670801 670808 671612 673180 675549 678935 683327 688399 694133 701133 709768 719249 728149 735938
62278G35938P677R065J0994J2184J2293J1997J2083J2769J3987J5848J8327K0726
$$ 735938 743615 752680 763674 775858 788151 800148 812231 825000 838987 854835 873162 893888
62266H93888K2272K3304K5067K8095L1570L4653L7581M0933M4591M8188N1867
$$ 893888 916160 939464 964531 992626 1024196 1058849 1096430 1137363 1181954 1230142 1282009
62255A282009N5715N9017O0997O1716O1274N8566N2137M2183L0691J9525R325
$$ 1282009 1337724 1396741 1457738 1519454 1580728 1639294 1691431 1733614 1764305 1783830 1793155
62244A793155K48p277j3058j7658k1892k5984k9460l1682l2488l2395l1974l0988
$$ 1793155 1793403 1786126 1773068 1755410 1733518 1707534 1678074 1646392 1613904 1581509 1549535 1518547
62232A518547k8612k4778k0645j7258j4296j0893p143l999j982p98P2J056K526
$$ 1518547 1489935 1465157 1444512 1427254 1412958 1402065 1394922 1390923 1388941 1388143 1388215 1389271 1391797
62219A391797M410O010O841P321Q035Q772R050R078R387R911J0309J0788J1688
$$ 1391797 1396207 1402217 1409058 1416379 1424414 1433186 1442236 1451314 1460701 1470612 1480921 1491709 1503397
62206A503397J2651J3218J3802J5099J6870J8391J9710K1402K3451K5515K7838
$$ 1503397 1516048 1529266 1543068 1558167 1575037 1593428 1613138 1634540 1657991 1683506 1711344
62195A711344L0700L3436L5463L7696M1355M5722M8912N0698N2595N5033N6609
$$ 1711344 1742044 1775480 1810943 1848639 1889994 1935716 1984628 2035326 2087921 2142954 2199563
62184B199563N6412N5041N2698M8434M2310L6299L1768K7756K3225J9412J8215
$$ 2199563 2255975 2311016 2363714 2412148 2454458 2490757 2522525 2550281 2573506 2592918 2611133
62173B611133J9373K1142K2967K5805L0124L5251M0503M5680N0425N4175N6895
$$ 2611133 2630506 2651648 2674615 2700420 2730544 2765795 2806298 2851978 2902403 2956578 3013473
62162C013473N8933O0138N9803N7511N3492M8210M2145L5904L0104K5162K1347
$$ 3013473 3072406 3132544 3192347 3249858 3303350 3351560 3393705 3429609 3459713 3484875 3506222
62151C506222J8698J6650J4252J1167Q074N699M013K837K592L643N343O569P079
$$ 3506222 3524920 3541570 3555822 3566989 3575063 3580762 3584775 3587612 3590204 3593847 3599190 3605759 3612838
62138C612838P697R173J1367J3540J5018J5613J5699J5803J5973J5763J4985J4133
$$ 3612838 3620535 3629708 3641075 3654615 3669633 3685246 3700945 3716748 3732721 3748484 3763469 3777602
62126C777602J3774J3841J3833J3437J2634J1451J0020Q631P472O465N519M764
$$ 3777602 3791376 3805217 3819050 3832487 3845121 3856572 3866592 3875223 3882695 3889160 3894679 3899443
62114C899443M241L662K684J297j71j311j962k529l797n986q088q775p960o794
$$ 3899443 3903684 3907346 3910030 3911327 3911156 3909845 3907883 3905354 3901557 3895571 3887483 3878708 3870748 3863954
62100C863954o127n718n108m401l771k965j755l64J004K560M426O212P517Q535
$$ 3863954 3857827 3852109 3847001 3842600 3838829 3835864 3834109 3833745 3834749 3837309 3841735 3847947 3855464 3863999
62086C863999R802J1669J4188J7097J9845K2010K3789K5460K6430K5661K3164
$$ 3863999 3873801 3885470 3899658 3916755 3936600 3958610 3982399 4007859 4034289 4059950 4083114
62075D083114K0095J7079J3429Q600L379j078m610p643j0196j2221j4346j7266
$$ 4083114 4103209 4120288 4133717 4142317 4145696 4144618 4140008 4132365 4122169 4109948 4095602 4078336
62063D078336k0576k3160k4610k5710k7576l0784l5170l9955m4223m7531m9949
$$ 4078336 4057760 4034600 4009990 3984280 3956704 3925920 3890750 3850795 3806572 3759041 3709092
62052C709092n1444n1734n0940m9730m8405m6499m3799m1273m0411m2044m6142
$$ 3709092 3657648 3605914 3554974 3505244 3456839 3410340 3366541 3325268 3284857 3242813 3196671
62041C196671n1965n7807o1321o1001n7181n1241m4463l8304l4825l5589m0144
$$ 3196671 3144706 3086899 3025578 2964577 2907396 2856155 2811692 2773388 2738563 2702974 2662830
62030B662830m6375n2123n5968n7041n5331n2087m8974m6641m4669m2774m1214
$$ 2662830 2616455 2564332 2508364 2451323 2395992 2343905 2294931 2248290 2203621 2160847 2119633
62019B119633l9978l8484l6409l4251l2678l1646l0477k8701k6594k4821k3572
$$ 2119633 2079655 2041171 2004762 1970511 1937833 1906187 1875710 1847009 1820415 1795594 1772022
62008A772022k2184j9908j6915j4020j1404q254l998P27M698P143P821O615L673
$$ 1772022 1749838 1729930 1713015 1698995 1687591 1679337 1675339 1676066 1680764 1687907 1695728 1702343 1706016
61995A706016n54n875j2546k0394k8318l5270m1131m6013m9278n0128m8829m6463
$$ 1706016 1705462 1699587 1687041 1666647 1638329 1603059 1561928 1515915 1466637 1416509 1367680 1321217
61983A321217m3716m0637l7345l4168l1185k8324k5818k3837k1934j9529j6852
$$ 1321217 1277501 1236864 1199519 1165351 1134166 1105842 1080024 1056187 1034253 1014724 997872
61972I97872j4730j3460j2612j1852j1259j0744r860q357o502m764l559l185l555
$$ 997872 983142 969682 957070 945218 933959 923215 913355 904998 898496 893732 890173 886988 883433
61959H83433l988l728k658j177M79K293M049N410O466P745R615J1985J4553J7049
$$ 883433 879445 875717 873059 871882 872361 874654 878703 884113 890579 898324 907939 919924 934477 951526
61945I51526J9327K1520K3949K6637K9149L1174L2894L4374L5025L4358L3014
$$ 951526 970853 992373 1016322 1042959 1072108 1103282 1136176 1170550 1205575 1239933 1272947
61934A272947L2245L2469L2895L2643L1623L0288K8964K7598K5887K3614K1131
$$ 1272947 1305192 1337661 1370556 1403199 1434822 1465110 1494074 1521672 1547559 1571173 1592304
61923A592304J9365J9135K0576K3458K7758L3655M1185N0283O0934P2922Q5694
$$ 1592304 1611669 1630804 1651380 1674838 1702596 1736251 1777436 1827719 1888653 1961575 2047269
61912B047269R8850J12566J27271J43117J59985J77671J95965K15071K36054K60097
$$ 2047269 2146119 2258685 2385956 2529073 2689058 2866729 3062694 3277765 3513819 3773916
61902C773916K86875L14330L40218L62558L77693L79168L60134L16731K48799
$$ 3773916 4060791 4375121 4715339 5077897 5455590 5834758 6194892 6511623 6760422
61893F760422J58979N3389n7472j61189k48322l14703l59797l84741l92194l86170
$$ 6760422 6919401 6972790 6915318 6754129 6505807 6191104 5831307 5446566 5054372 4668202
61883D668202l70608l48557l22778k95902k69350k43118k17316j93050j71236
$$ 4668202 4297594 3949037 3626259 3330357 3061007 2817889 2600573 2407523 2236287
61874B236287j51480j32945j15677j00327q7172p6038o6722n8709n0982m2821
$$ 2236287 2084807 1951862 1836185 1735858 1648686 1572648 1505926 1447217 1396235 1353414
61864A353414l4602k7194k0816j5011r393l818J936Q039J4186J9835K4879K9623
$$ 1353414 1318812 1291618 1270802 1255791 1246398 1242580 1244516 1252555 1266741 1286576 1311455 1341078
61852A341078L4088L7710L9924M0769M0758M0218L8872L6131L1790K6308K0258
$$ 1341078 1375166 1412876 1452800 1493569 1534327 1574545 1613417 1649548 1681338 1707646 1727904
61841A727904J3672O314j319p734j1513j2493j1640r872p291l545J278O391J0774
$$ 1727904 1741576 1747890 1746571 1738837 1727324 1714831 1703191 1693319 1686028 1682483 1683761 1690152 1700926
61828A700926J3720J4976J4579J2815J0067O317R27o601j5499k3901l0400l5067
$$ 1700926 1714646 1729622 1744201 1757016 1767083 1773400 1774327 1767726 1752227 1728326 1697926 1662859
61816A662859l8666m1304m2356m1414l8797l5127l0855k6155k1072j5783j0774
$$ 1662859 1624193 1582889 1540533 1499119 1460322 1425195 1394340 1368185 1347113 1331330 1320556
61805A320556o557l078K55L868P726J1872J6616K1774K6419K9996L3255L7277
$$ 1320556 1313999 1310921 1311176 1315044 1322770 1334642 1351258 1373032 1399451 1429447 1462702 1499979
61793A499979M2060M6833N1527N7037O4017P2169Q0856Q9909R9728J11095J24809
$$ 1499979 1542039 1588872 1640399 1697436 1761453 1833622 1914478 2004387 2104115 2215210 2340019
61782B340019J41117J59582J79916K02750K29051K59115K92774L30466L73211
$$ 2340019 2481136 2640718 2820634 3023384 3252435 3511550 3804324 4134790 4508001
61773D508001M21466M74480N30595N87212O40137O83315P09280P09480O74729
$$ 4508001 4929467 5403947 5934542 6521754 7161891 7845206 8554486 9263966 9938695
61764I938695N97215M74043L10064J18150q3203k74008m37474n63291o48062o93583
$$ 9938695 10535910 11009953 11320017 11438167 11354964 11080956 10643482 10080191 9432129 8738546
61754H738546p04980o89508o55239o09543n58272n05685m54478m05818l60111
$$ 8738546 8033566 7344058 6688819 6079276 5521004 5015319 4560841 4155023 3794912
61745C794912l17998k80345k47488k18973j94126j72387j53187j36000j20569
$$ 3794912 3476914 3196569 2949081 2730108 2535982 2363595 2210408 2074408 1953839
61736A953839j06742r4220q2864p2923o4360n6299m7964m0004l3833k9636k6025
$$ 1953839 1847097 1752877 1670013 1597090 1532730 1476431 1428467 1388463 1354630 1324994 1298969
61725A298969k2036j8538j7125j8292k1214k4789k8320l1426l3812l5123l4979
$$ 1298969 1276933 1258395 1241270 1222978 1201764 1176975 1148655 1117229 1083417 1048294 1013315
61714A013315l3323l0797k8390k6573k4953k2924k0409j7959j6279j5576j5222
$$ 1013315 979992 949195 920805 894232 869279 846355 825946 807987 791708 776132 760910
61703G60910j4278j2590j1033j0319j0024r428q783q860r482r606q893q222q296
$$ 760910 746632 734042 723009 712690 702666 693238 684455 675595 666113 656507 647614 639392 631096
61690F31096q652q433p549o634o303o779p804q696q836q264p544o989o495o060
$$ 631096 622444 614011 606462 599828 593525 586746 578942 570246 561410 553146 545602 538613 532118 526058
61676E26058n865n763n310m463l783l755m229m744m981m846m424l924l433k822
$$ 526058 520193 514430 509120 504657 500874 497119 492890 488146 483165 478319 473895 469971 466538 463716
61662D63716k163j875k046j936r00N23J265J214J206J620J982K086K496L687N322
$$ 463716 461553 459678 457632 455696 454796 455319 456584 457798 459004 460624 462606 464692 467188 470875 476197
61647D76197O643P026O202M646L625M018N031N009L565J955J250J287J664K622
$$ 476197 482840 489866 496068 500714 504339 508357 513388 518397 521962 523917 525167 526454 528118 530740
61633E30740M309O151P644R052J0730J2343J3326J3558J3067J1556Q697M589l43
$$ 530740 535049 541200 548844 557896 568626 580969 594295 607853 620920 632476 641173 645762 645419
61620F45419n508j0073j3345j5448j7064j8322j8673j7962j6806j5588j3905j1471
$$ 645419 639911 629838 616493 601045 583981 565659 546986 529024 512218 496630 482725 471254
61608D71254q834o785n584n155n361n721n506m602l764l645m038m292l935k778
$$ 471254 462420 455635 450051 444896 439535 433814 428308 423706 419942 416297 412259 407967 404032 401254
61594D01254j096K46O15O14J345K637L275L130L547N155O730P226P480Q721J0544
$$ 401254 400158 400404 401019 401633 402978 405615 408890 412020 415567 420722 427452 434678 442158 450879 461423
61579D61423J1703J2045J2263J2400J2029J1489J1586J2238J2639J2589J2577
$$ 461423 473126 485171 497434 509834 521863 533352 544938 557176 569815 582404 594981
61568E94981J2645J2267J1426J0815J0865J1296J1763J2221J2578J2632J2457
$$ 594981 607626 619893 631319 642134 652999 664295 676058 688279 700857 713489 725946
61557G25946J2365J2355J2096J1465J0761J0317J0153J0036R658Q929Q144P608
$$ 725946 738311 750666 762762 774227 784988 795305 805458 815494 825152 834081 842225 849833
61545H49833P001N587L259P42j555m144p353j0374j2142j2721j2945j3089j2756
$$ 849833 856834 862421 865680 866422 864867 860723 853370 842996 830854 818133 805188 792099 779343
61532G79343j1862j0793r633q039n992l957k188l52J921M559P215R704J2128J4732
$$ 779343 767481 756688 747055 739016 733024 729067 726879 726527 728448 733007 740222 749926 762054 776786
61518G76786J7716K1091K4843K9085L3792L8425M2422M6143N0742N6839O3910
$$ 776786 794502 815593 840436 869521 903313 941738 984160 1030303 1081045 1137884 1201794
61507A201794P1364P9508Q8931R9392J09975J19957J28854J35861J39765J39275
$$ 1201794 1273158 1352666 1441597 1540989 1650964 1770921 1899775 2035636 2175401 2314676
61497B314676J33170J20544J01490P7355M9987K1032p827l4543n7347p5483q8904
$$ 2314676 2447846 2568390 2669880 2747235 2797222 2818254 2810427 2775884 2718537 2643054 2554150
61486B554150r7572j01576j01614r8826r4153q8181q1327p3820o5779n7516m9516
$$ 2554150 2456578 2355002 2253388 2154562 2060409 1972228 1890901 1817081 1751302 1693786 1644270
61475A644270m1947l4628k7645k1414j5875j0330m462J138N890R968J3659J6741
$$ 1644270 1602323 1567695 1540050 1518636 1502761 1492431 1487969 1489107 1494997 1504965 1518624 1535365
61463A535365J9110K1324K3785K6001K7356K8013K8316K7961K6600K4789K3471
$$ 1535365 1554475 1575799 1599584 1625585 1652941 1680954 1709270 1737231 1763831 1788620 1812091
61452A812091K2937K3056K3971K5769K7990L0292L3026L6218L8539L8520L6370
$$ 1812091 1835028 1858084 1882055 1907824 1935814 1966106 1999132 2035350 2073889 2112409 2148779
61441B148779L3494L0519K7020K2965J9025J5382J1446O995K580j436n365r440
$$ 2148779 2182273 2212792 2239812 2262777 2281802 2297184 2308630 2315625 2318205 2316769 2311404 2301964
61429B301964j3356j6845k0016k2911k5316k7134k8433k9081k8860k7892k6390
$$ 2301964 2288608 2271763 2251747 2228836 2203520 2176386 2147953 2118872 2090012 2062120 2035730
61418B035730k4137k0967j7566j4937j2978j0559p148l609j081J36L84O1m51r05
$$ 2035730 2011593 1990626 1973060 1958123 1945145 1934586 1927438 1923829 1922748 1922884 1923268 1923329 1922878 1921973
61404A921973j645l347o051q855j0851j1913j2231j1615r714o580k588K061P539
$$ 1921973 1920328 1916981 1910930 1902075 1891224 1879311 1867080 1855465 1845751 1839171 1836583 1838644 1846183
61391A846183J4115K1820L0319L9123M8107N7708O8394Q0044R2082J04076J15837
$$ 1846183 1860298 1882118 1912437 1951560 1999667 2057375 2125769 2205813 2297895 2401971 2517808
61380B517808J27031J37041J45168J50561J51964J47928J37527J20827R8739P2687
$$ 2517808 2644839 2781880 2927048 3077609 3229573 3377501 3515028 3635855 3734594 3807281
61370C807281M4328J5351j2585l7824n9062p5981q9429j00680j10502j18820j24963
$$ 3807281 3851609 3866960 3854375 3816551 3757489 3681508 3592079 3491399 3380897 3262077 3137114
61359C137114j28127j28067j25467j21352j16021j09205j01232r3265q5977p8888
$$ 3137114 3008987 2880920 2755453 2634101 2518080 2408875 2307643 2214378 2128401 2049513
61349B049513p1538o4480n8354n2692m6683m0591l5382l1154k6930k1955j6366
$$ 2049513 1977975 1913495 1855141 1802449 1755766 1715175 1679793 1648639 1621709 1599754 1583388
61338A583388j0621m986L43N246R812J4068J7611J9899K0770K0337J8754J6571
$$ 1583388 1572767 1567781 1568124 1573370 1583182 1597250 1614861 1634760 1655530 1675867 1694621 1711192
61326A711192J4843J4216J4206J3894J3026J1832J0320Q535P080O385N825M545
$$ 1711192 1726035 1740251 1754457 1768351 1781377 1793209 1803529 1812064 1819144 1825529 1831354 1835899
61314A835899K982K435L158L822L210J596J67l11q6r6j229l519o027p794q765
$$ 1835899 1838881 1841316 1844474 1848296 1851506 1853102 1853269 1852958 1852872 1852776 1851547 1848028 1842001 1834207 1825442
61299A825442r544j0538j1738j2987j3909j3927j2927j1560j0375r127p540o253
$$ 1825442 1815898 1805360 1793622 1780635 1766726 1752799 1739872 1728312 1717937 1708810 1701270 1695017
61287A695017o194p375r112j1033j3044j4678j5399j5332j4825j3697j1804r956
$$ 1695017 1688823 1681448 1672336 1661303 1648259 1633581 1618182 1602850 1588025 1574328 1562524 1552568
61275A552568r072q773p912o353m967l959k453K9K871N389P547R401J0779J1849
$$ 1552568 1543496 1534723 1526811 1520458 1515491 1511532 1509079 1509108 1511979 1517368 1524915 1534316 1545095 1556944
61261A556944J3211J5123J7328J9774K2757K6167K9377L2215L5389L9670M5138
$$ 1556944 1570155 1585278 1602606 1622380 1645137 1671304 1700681 1732896 1768285 1807955 1853093
61250A853093N1345N7666O3407O7937P0708P0787O6756N7659M3747K5784M195
$$ 1853093 1904438 1962104 2025511 2093448 2164156 2234943 2301699 2359358 2403105 2428889 2433084
61239B433084k0134m4736o6400q3117r4495j00703j02173r9953r5111q7873p8422
$$ 2433084 2412950 2368214 2301814 2218697 2124202 2023499 1921326 1821373 1726262 1638389 1559967
61228A559967o8170n8909n0852m2963l5155k8611k3917k0473j7887j6358j5360
$$ 1559967 1491797 1432888 1382036 1339073 1303918 1275307 1251390 1230917 1213030 1196672 1181312
61217A181312j3624j1037q979q069p058m764j799N51J973K753K899K670K986M311
$$ 1181312 1167688 1156651 1147672 1139603 1132545 1127781 1125982 1126533 1128506 1131259 1134158 1136828 1139814 1144125
61203A144125N830O668P221Q404J0218J1868J2760J2665J1447R345P047M957K846
$$ 1144125 1149955 1156623 1163844 1172248 1182466 1194334 1207094 1219759 1231206 1240551 1247598 1252555 1255401
61190A255401O35j172k220k783k990k484j381o74q79j129m63O60J040K62j497
$$ 1255401 1256036 1254864 1252644 1249861 1246871 1244387 1243006 1242332 1241453 1240324 1239861 1240521 1241561 1241823 1240326
61175A240326m492r105j4623j9483k2763k4723k5875k6285k5948k5216k4567k4236
$$ 1240326 1235834 1226729 1212106 1192623 1169860 1145137 1119262 1092977 1067029 1041813 1017246 993010
61163I93010k4175k4236k4375k4643k4910k4685k3560k1810k0094j8601j6974
$$ 993010 968835 944599 920224 895581 870671 845986 822426 800616 780522 761921 744947
61152G44947j5075j3197j1384r289o949m998l689k375m09K011M338O532Q872J1316
$$ 744947 729872 716675 705291 696002 689053 684055 680366 677991 677582 679593 683931 690463 699335 710651
61138G10651J3601J5746J7955K0127K1744K2211K1198J8797J5372J1175O310J303
$$ 710651 724252 739998 757953 778080 799824 822035 843233 862030 877402 888577 894887 896190
61126H96190k691m926o018p089q151q258p211o025n523n499n577n837o119n758
$$ 896190 893499 888573 882555 875466 867315 859057 851846 845821 840298 834799 829222 823385 817266 811508
61112H11508m676l920m362n478o171o126n642m723l275j881j451k054k770k807
$$ 811508 806832 802912 798550 793072 786901 780775 775133 770410 767135 765254 763803 761749 758979 756172
61098G56172k265j683j235o21M19J713K857L631M005L805K858J469K15j092l430
$$ 756172 753907 752224 750989 750368 750787 752500 755357 758988 762993 766798 769656 771125 771340 770248 766818
61083G66818p034j0550j2567j3372j4146j4869j4410j2478j0174q426p099n869
$$ 766818 759784 749234 736667 723295 709149 694280 679870 667392 657218 648792 641693 635824
61071F35824m862m105l347k759k845l375l330k338j234q13q18o10n0P29J681K539
$$ 635824 630962 626857 623510 620751 617906 614531 611201 608863 607629 606816 605998 605388 605338 606067 607748 610287
61055F10287K852K767L154M491O115P024P004O635O507O667O639N984N054M899
$$ 610287 613139 615906 619060 623551 629666 636690 643694 650329 656836 663503 670142 676126 681180 686079
61041F86079O026P620Q583Q895R155R340R067Q762R206J0103J0335R665R005Q787
$$ 686079 692105 699725 708308 717203 726358 735698 744765 753527 762733 772836 783171 792836 801841 810628
61027H10628Q331P035N158L152J158o01j781k500l169l760l971l969m083l988
$$ 810628 818959 825994 831152 834304 835462 834861 833080 830580 827411 823651 819680 815711 811628 807640
61013H07640l146j887j049p24l55K13Q47J789L161M294M834N826Q233J1078J2820
$$ 807640 804494 802607 801558 800834 800479 800692 801539 803328 806489 810783 815617 821443 829676 840754 853574
60998H53574J3875J5806J8573K0714K1978K3447K5344K6947K8558L1070L3615
$$ 853574 867449 883255 901828 922542 944520 967967 993311 1020258 1048816 1079886 1113501
60987A113501L4243L3076L2271L2561L2416L0999K9269K7598K5018K1590J8995
$$ 1113501 1147744 1180820 1213091 1245652 1278068 1309067 1338336 1365934 1390952 1412542 1431537
60976A431537J7859J6925J5694J5430J6715J8392J9894K2145K5381K8505L1508
$$ 1431537 1449396 1466321 1482015 1497445 1514160 1532552 1552446 1574591 1599972 1628477 1659985
60965A659985L5957M2170M8481N4279O1113O9829P9241Q8635R8767J09307J18072
$$ 1659985 1695942 1738112 1786593 1840872 1901985 1971814 2051055 2139690 2238457 2347764 2465836
60954B465836J23985J28271J32113J36091J42506J54659J72855J94603K19225
$$ 2465836 2589821 2718092 2850205 2986296 3128802 3283461 3456316 3650919 3870144
60945C870144K48000K79215L08368L35057L64934M03476M53315N18952O06919
$$ 3870144 4118144 4397359 4705727 5040784 5405718 5809194 6262509 6781461 7388380
60936G388380P18564Q50139J003834J191508J425062J714627K082791K566650
$$ 7388380 8106944 8957083 9960917 11152425 12577487 14292114 16374905 18941555
60928A8941555L190221L936389M742697N490019N963620N863037M956325L311389
$$ 18941555 22131776 26068165 30810862 36300881 42264501 48127538 53083863 56395252
60920E6395252J373317k49128j129423j200661o61977J98048J054819J519327
$$ 56395252 57768569 57519441 56390018 55189357 54527380 54725428 55780247 57299574
60912E7299574J222106M2818j734704l549344m892179n552241n607596n258035
$$ 57299574 58521680 58564498 56829794 53280450 48388271 42836030 37228434 31970399
60904C1970399m691271m048203l425895k872769k394725j983299j635795j349580
$$ 31970399 27279128 23230925 19805030 16932261 14537536 12554237 10918442 9568862
60896I568862j113735r17063p56856o32652n37848m63713m05978l61745l25038
$$ 9568862 8455127 7538064 6781208 6148556 5610708 5146995 4741017 4379272 4054234
60887D054234k91159k61162k36795k14930j91691j68293j47921j30328j14389
$$ 4054234 3763075 3501913 3265118 3050188 2858497 2690204 2542283 2411955 2297566
60878B297566j02638r7981r8097r7930r5806r2934q8864q2121p3900o6805o0793
$$ 2297566 2194928 2096947 1998850 1900920 1805114 1712180 1623316 1541195 1467295 1400490 1339697
60867A339697n4085m7087m1839l8386l5066l1669k9206k7160k4072k0373j7872
$$ 1339697 1285612 1238525 1196686 1158300 1123234 1091565 1062359 1035199 1011127 990754 972882
60856I72882j6830j5984j4992j4455j4026j2810j1267j0569j0522r941q636p310
$$ 972882 956052 940068 925076 910621 896595 883785 872518 861949 851427 841486 832850 825540
60844H25540o201n396n699p408r126r497r232r755j0861j1470j1714j2354j2994
$$ 825540 819339 813943 808244 800836 791710 782213 772981 763226 752365 740895 729181 716827 703833
60831G03833j2771j2062j1755j1549j0635r242p975o494m438k708k202k204j694
$$ 703833 691062 679000 667245 655696 645061 635819 627844 621350 616912 614204 612002 609798 608104
60818F08104j164j432j767j080M0L74K81Q92K030K827L610N135O759P420P745
$$ 608104 606940 605508 603741 602661 602701 603075 603356 604248 606278 609105 612715 617850 624609 632029 639774
60803F39774R114J1181J2334J2206J1694J0998R643Q197P928Q797R463R225Q380
$$ 639774 648888 660069 672403 684609 696303 707301 716944 725141 733069 741866 751329 760554 768934
60790G68934O908M471J537r63k997n069o807p362o921o406n999n350m826n046
$$ 768934 775842 780313 781850 780887 777890 772821 766014 758652 751731 745325 739326 733976 729150 724104
60776G24104n540n422n014n318o122o298n725n318n312n029m385m080m229m165
$$ 724104 718564 713142 708128 702810 696688 690390 684665 679347 674035 669006 664621 660541 656312 652147
60762F52147l722l474l606l662l536l612l896l878l261k139o58Q26J634J701K051
$$ 652147 648425 644951 641345 637683 634147 630535 626639 622761 619500 617361 616703 617529 619163 620864 622915
60747F22915L457N201O181O563P212P991P992P054N759M204K016n86k863m512
$$ 622915 626372 631573 637754 644317 651529 659520 667512 674566 680325 684529 686545 685959 683096 678584
60733F78584n672o298o420o631p379q218q561q605q702q528p865p352p419p284
$$ 678584 672912 666614 660194 653563 646184 637966 629405 620800 612098 603570 595705 588353 580934 573650
60719E73650o287n308n514o455o804o359n830n362m814m829o005p434p708o944
$$ 573650 567363 562055 556541 550086 543282 536923 531093 525731 520917 516088 510083 502649 494941 487997
60705D87997o313o071n686n451o111p096p022n901n146n256n151m086k672j690
$$ 487997 481684 475613 469927 464476 458365 451269 444247 438346 433200 427944 422793 418707 416035 414345
60691D14345j063m47J98Q12J318J474J375J716K760L600L437L001L411M280M360
$$ 414345 413282 412835 413033 413845 415163 416637 418012 419728 422488 426088 429525 432526 435937 440217 444577
60676D44577L619L185L504M062M688N693O782P240P095O917O699O201O023O886
$$ 444577 448196 451381 454885 458947 463635 469328 476110 483350 490445 497362 504061 510262 516285 523171
60662E23171Q133Q480P986P833Q322Q640Q537Q634R066R316R453J0129J1296J2244
$$ 523171 531304 539784 547770 555603 563925 572565 581102 589736 598802 608118 617571 627700 638996 651240
60648F51240J2870J3584J4058J3539J2320J1438J0901R615P130M091R58k276n123
$$ 651240 664110 677694 691752 705291 717611 729049 739950 749565 756695 760786 761744 759468 754345
60635G54345o835p724q815j0165j0882j0906j1205j2012j2335j1493r899q167
$$ 754345 747510 739786 730971 720806 709924 699018 687813 675801 663466 651973 642074 633907
60623F33907o665n992o528p415p287o065m818l906k803j652j315j679j518l69
$$ 633907 627242 621250 614722 607307 600020 593955 589137 585231 582428 580776 579461 577782 576264 575895
60609E75895R54J886K734L520L778L807M580O106P286P773Q457R791J1179J2425
$$ 575895 576849 578735 581469 584989 588767 592574 597154 603260 610546 618319 626776 636567 647746 660171
60595F60171J4251J6810J9166K0863K2618K4873K6930K8168K8871K9260K8892
$$ 660171 674422 691232 710398 731261 753879 778752 805682 833850 862721 891981 920873
60584I20873K7454K4975K0918J4468O233j716q113j3576j8903k3615k6893k8637
$$ 920873 948327 973302 994220 1008688 1014921 1013205 1005092 991516 972613 948998 922105 893468
60572H93468k8914k7554k5020k2569k0843j9290j7520j6014j4964j3617j1626
$$ 893468 864554 837000 811980 789411 768568 749278 731758 715744 700780 687163 675537
60561F75537r898r280r324r089q245o797m698k396q35k38K77J339K532L436M368
$$ 675537 665639 656359 647035 637946 629701 622904 618206 615810 614975 614737 615014 616353 618885 622321 626689
60546F26689N442N981N613N045M930M884M337L492K726J851P71K07R13K691M832
$$ 626689 632131 638112 643725 648770 653700 658584 662921 666413 669139 670990 671761 671968 672881 675572 680404
60531F80404O973R104J1153J3114J5120J7166J9271K1964K5831L0491L4943L9163
$$ 680404 687377 696481 707634 720748 735868 753034 772305 794269 820100 850591 885534 924697
60519I24697M4383N1453N9956O9257P9416R0568J02323J14280J26168J36777J43552
$$ 924697 969080 1020533 1080489 1149746 1229162 1319730 1422053 1536333 1662501 1799278 1942830
60508A942830J43848J36214J20453R7518O9824M0831J3733r024k5169l3004l3023
$$ 1942830 2086678 2222892 2343345 2440863 2510687 2551518 2565251 2556227 2531058 2498054 2465031
60497B465031k8286k2521j8343j7246k0067k6652l5815m6110n6233o4609o9540
$$ 2465031 2436745 2414224 2395881 2378635 2358568 2331916 2296101 2249991 2193758 2129149 2059609
60486B059609p0118o6362n8523m7075l3337j8956m520J0419K6003M1803N7772
$$ 2059609 1989491 1923129 1864606 1817531 1784194 1765238 1760718 1771137 1797140 1838943 1896715
60475A896715P4049Q9649J02556J11218J14720J11680J00846Q3224O2115M0695
$$ 1896715 1970764 2060413 2162969 2274187 2388907 2500587 2601433 2684657 2746772 2787467
60465B787467K1063N752k054q38Q314K3904M5594P2909J04176J38048J74764K15032
$$ 2787467 2808530 2814282 2812228 2811390 2819704 2843608 2889202 2962111 3066287 3204335 3379099 3594131
60453C594131K59019L07478L62380M25192M95560N72350O54242P37682Q14951
$$ 3594131 3853150 4160628 4523008 4948200 5443760 6016110 6670352 7408034 8222985
60444H222985Q74908R04441Q89157Q16158O80013M86867K52264m019k60554m94990
$$ 8222985 9097893 10002334 10891491 11707649 12387662 12874529 13126793 13122774 12862220 12367230
60434A2367230o87047q23424r00493r23279r02512q51154p81128p01861o20838
$$ 12367230 11680183 10856759 9956266 9032987 8130475 7279321 6498193 5796332 5175494
60425E175494n43870m74021m11466l55585l06569k64457k28089j96261j68928
$$ 5175494 4631624 4157603 3746137 3390552 3083983 2819526 2591437 2395176 2226248
60416B226248j46134j26730j09462r4451q2342p2726o4578n7521n1513m6067m0887
$$ 2226248 2080114 1953384 1843922 1749471 1667129 1594403 1529825 1472304 1420791 1374724 1333837
60405A333837l6474l2991k9446k5202k1371j9217j8090j6486j4514j3576j4049
$$ 1333837 1297363 1264372 1234926 1209724 1188353 1169136 1151046 1134560 1120046 1106470 1092421
60394A092421j4953j5701j6597j7586j8010j7745j7465j7546j7622j7325j6739
$$ 1092421 1077468 1061767 1045170 1027584 1009574 991829 974364 956818 939196 921871 905132
60383I05132j6017j5231j4515j3836j2873j1515j0155r035p929o857o408o666
$$ 905132 889115 873884 859369 845533 832660 821145 810990 801955 794026 787169 780761 774095
60371G74095o659n623m032k634j280K89J412J452J075J347K068K214J637J145
$$ 774095 767436 761813 757781 755147 753867 754156 755568 757020 758095 759442 761510 763724 765361 766506
60357G66506J189J572K227L251M367N178N860O841Q151R679J1683J4306J7021
$$ 766506 767695 769267 771494 774745 779112 784290 790150 796991 805142 814821 826504 840810 857831
60344H57831J9211K0781K1683K1513K0287J8744J7144J4646J0918P404N830O240
$$ 857831 877042 897823 919506 941019 961306 980050 997194 1011840 1022758 1030162 1035992 1042232
60332A042232P685J0007J3511J7519K0836K3319K5511K6923K6082K2287J6197
$$ 1042232 1049917 1059924 1073435 1090954 1111790 1135109 1160620 1187543 1213625 1235912 1252109
60321A252109Q714M37p853j5180k0948k4923k6883k7065k6561k6378k6321k5576
$$ 1252109 1260823 1261260 1253407 1238227 1217279 1192356 1165473 1138408 1111847 1085469 1059148 1033572
60309A033572k3941k1782j9342j6964j5376j4790j4409j3778j3806j5134j6341
$$ 1033572 1009631 987849 968507 951543 936167 921377 906968 893190 879384 864250 847909
60298H47909j5432j2546r503o997m144p10K156L914N585P997J0392J1666J2008
$$ 847909 832477 819931 810428 803431 799287 798577 800733 804647 810232 818229 828621 840287 852295
60285H52295J2394J2965J2725J0733P124K994o35l720o897j0301j3079j4353j4092
$$ 852295 864689 877654 890379 901112 908236 911230 910595 906875 899978 889677 876598 862245 848153
60272H48153j2802j0916q853p013n189k738K09K542L783M906O727Q493R228R484
$$ 848153 835351 824435 815582 808569 803380 800642 800851 803393 807176 812082 818809 827302 836530 846014
60258H46014J0528J2405J4231J5794J7643J9943K2524K5641K9572L3846L8009
$$ 846014 856542 868947 883178 898972 916615 936558 959082 984723 1014295 1048141 1086150
60247A086150M2641M8285N3944N7966O0174O1748O3254O4158O4079O3148O1207
$$ 1086150 1128791 1177076 1231020 1288986 1349160 1410908 1474162 1538320 1602399 1665547 1726754
60236A726754N7862N3355M8324M2891L6972L1087K5633J9806J2609M671k415q267
$$ 1726754 1784616 1837971 1886295 1929186 1966158 1997245 2022878 2042684 2055293 2059964 2057549 2049282
60224B049282j3764j9051k3149k5668k7291k8263k7887k5896k2958j9353j4360
$$ 2049282 2035518 2016467 1993318 1967650 1940359 1912096 1884209 1858313 1835355 1816002 1801642
60213A801642p576J90P892J5353K2965L0976L9355M7774N5473O1707O6338O9492
$$ 1801642 1794066 1794256 1802148 1817501 1840466 1871442 1910797 1958571 2014044 2075751 2142089 2211581
60201B211581P0818O9816O6667O1891N5444M7018L7112K6852J6868P169k207j1274
$$ 2211581 2282399 2352215 2418882 2480773 2536217 2583235 2620347 2647199 2664067 2671236 2669029 2657755
60189B657755k0491k9973l8589m5005m9387n2805n5160n5109n2085m7048m1004
$$ 2657755 2637264 2607291 2568702 2523697 2474310 2421505 2366345 2311236 2259151 2212103 2171099
60178B171099l4028k6017j7310q180J369J1057K0391K9349L8234M6855N4615O1247
$$ 2171099 2137071 2111054 2093744 2085564 2086933 2097990 2118381 2147730 2185964 2232819 2287434 2348681
60166B348681O6481O9345O8982O6168O2826N9966N7233N4471N2350N1210N0491
$$ 2348681 2415162 2484507 2553489 2619657 2682483 2742449 2799682 2854153 2906503 2957713 3008204
60155C008204M9814M9651N0401N1548N1990N0666M6857M0686L3478K7009K2372
$$ 3008204 3058018 3107669 3158070 3209618 3261608 3312274 3359131 3399817 3433295 3460304 3482676
60144C482676K0156K1278K6701L6423M9616O5565Q3385J01108J16241J27352J34318
$$ 3482676 3502832 3524110 3550811 3587234 3636850 3702415 3785800 3886908 4003149 4130501 4264819
60133D264819J37325J36766J33983J30742J27826J24958J22083J19634J17508
$$ 4264819 4402144 4538910 4672893 4803635 4931461 5056419 5178502 5298136 5415644
60124E415644J14819J10680J04411R5164Q2390O6591M8684K8926P206j5965l9866
$$ 5415644 5530463 5641143 5745554 5840718 5923108 5989699 6038383 6067309 6074515 6058550 6018684
60113F018684o4378q9194j12757j33317j50512j64422j73714j76603j73305j65636
$$ 6018684 5954306 5865112 5752355 5619038 5468526 5304104 5130390 4953787 4780482 4614846
60103D614846j54410j39283j21128j02379q4627o7731n1628l7048k3947j1048
$$ 4614846 4460436 4321153 4200025 4097646 4013019 3945288 3893660 3856612 3832665 3821617
60093C821617K312J5404K7627L9220M9894N8368O3845O6458O5871O1131N2518
$$ 3821617 3823929 3839333 3866960 3906180 3956074 4014442 4078287 4144745 4210616 4271747 4324265
60082D324265M1885L0393J7479K860j2050k5633l7643m8388n7731o5753p3159
$$ 4324265 4366150 4396543 4414022 4416882 4404832 4379199 4341556 4293168 4235437 4169684 4096525
60071D096525q0138q5839q9626r1690r1949q9756q5289p9739p3337o4763n3446
$$ 4096525 4016387 3930548 3840922 3749232 3657283 3567527 3482238 3402499 3329162 3264399 3210953
60060C210953m0845k8415j5707j772J3028K7967M3448N9890P5949Q9415R9322
$$ 3210953 3170108 3141693 3125986 3124214 3137242 3165209 3208657 3268547 3344496 3433911 3533233
60049C533233J05963J09317J08755J04026R5537Q3936P0173N5628M1380K7574
$$ 3533233 3639196 3748513 3857268 3961294 4056831 4140767 4210940 4266568 4307948 4335522
60039D335522J3954N18j2783k6378m0493n4629o8037q0230r0781r9209j05364
$$ 4335522 4349476 4349994 4337211 4310833 4270340 4215711 4147674 4067444 3976663 3877454 3772090
60028C772090j09212j10175j07554j01909r5050q8224q1238p3697o6098n9122
$$ 3772090 3662878 3552703 3445149 3343240 3248190 3159966 3078728 3005031 2938933 2879811
60018B879811n2676m6173l9126l1147k2136j2632l176O684J7736K9499M0674N1254
$$ 2879811 2827135 2780962 2741836 2710689 2688553 2675921 2672745 2679429 2697165 2726664 2767338 2818592
60006B818592O2510P4401Q4622R1005R3481R2827Q8992Q1705P1627N9726M6381
$$ 2818592 2881102 2955503 3040125 3131130 3224611 3317438 3406430 3488135 3559762 3619488 3665869
59995C665869L1847J6812J684j3679k8955m2977n4952o4972p2720p6940p7002
$$ 3665869 3697716 3714528 3716212 3702533 3673578 3630601 3575649 3510677 3437957 3361017 3284015
59984C284015p3923o9027o2669n5076m7193l9702l2180k4147j5979p959N21R856
$$ 3284015 3210092 3141065 3078396 3023320 2976127 2936425 2904245 2880098 2864119 2856160 2856681 2866537
59972B866537J9362K8389L7372M6780N5973O4030P0828P6415Q0284Q2334Q3682
$$ 2866537 2885899 2914288 2951660 2998440 3054413 3118443 3189271 3265686 3345970 3428304 3511986
59961C511986Q5538Q7816Q9656R0487Q9804Q6717Q0614P1537N9381M3672K5026
$$ 3511986 3597524 3685340 3774996 3865483 3955287 4042004 4122618 4194155 4253536 4297208 4322234
59950D322234N811j1486k5736l6398m2447m3027l8264k8483j3544O195K9188N3889
$$ 4322234 4328045 4316559 4290823 4254425 4211978 4168951 4130687 4102204 4088660 4094855 4124043 4177932
59938D177932P9823J06676J33348J58699J82227K03127K19518K29495K31950K25671
$$ 4177932 4257755 4364431 4497779 4656478 4838705 5041832 5261350 5490845 5722795 5948466
59928E948466K08785J80140J40442R1498L5639k3368q0449j31607j75214k10242
$$ 5948466 6157251 6337391 6477833 6569331 6604970 6581602 6501153 6369546 6194332 5984090
59918E984090k34927k48449k52389k48920k38871k23107k04302j85207j66079
$$ 5984090 5749163 5500714 5248325 4999405 4760534 4537427 4333125 4147918 3981839
59909C981839j45787j24666j04322q5188o6267m7089k8177r714Q704K6979M4479
$$ 3981839 3836052 3711386 3607064 3521876 3455609 3408520 3380343 3370629 3379333 3406312 3450791
59898C450791O0995P6617R0785J02438J10892J15718J16137J11376J01194Q5326
$$ 3450791 3511786 3588403 3679188 3781626 3892518 4008236 4124373 4235749 4336943 4422269
59888D422269O3178L5058L039l0357o3547r5081j22603j44085j59458j69718j75021
$$ 4422269 4485447 4520505 4523544 4493187 4429640 4334559 4211956 4067871 3908413 3738695 3563674
59877C563674j75062j70675j63597j54935j44960j33994j22437j10330r7956q6298
$$ 3563674 3388612 3217937 3054340 2899405 2754445 2620451 2498014 2387684 2289728 2203430
59867B203430p5916o6093n6122m6618l8467l1338k4601j8851j5091j3082j1975
$$ 2203430 2127514 2061421 2005299 1958681 1920214 1888876 1864275 1845424 1830333 1817251 1805276
59856A805276j1791j2830j4160j4432j3704j2899j1836r411n475j022L280P370
$$ 1805276 1793485 1780655 1766495 1752063 1738359 1725460 1713624 1704213 1698738 1697716 1700996 1708366
59844A708366J0741J2486J2318J0429O647Q65o050j2914j9496k5958l1577l5280
$$ 1708366 1719107 1731593 1743911 1754340 1760987 1761852 1755802 1742888 1723392 1697434 1665857 1630577
59832A630577l7109l7870l7630l5892l2854k9308k5533k1393j7174j3219r195
$$ 1630577 1593468 1555598 1517968 1482076 1449222 1419914 1394381 1372988 1355814 1342595 1333400
59821A333400m857r29J987M758Q589J3214J7604K1813K6485L1053L4208L5848
$$ 1333400 1328543 1327614 1329601 1334359 1342948 1356162 1373766 1395579 1422064 1453117 1487325 1523173
59809A523173L6884L7315L6203L3438K9894K5805K0626J4580Q859M127R3l282
$$ 1523173 1560057 1597372 1633575 1667013 1696907 1722712 1743338 1757918 1766777 1770904 1770997 1767715
59797A767715n352n675m269j098L700R233J4639K0254K6895L4394M2072N0285
$$ 1767715 1762363 1756688 1752419 1751321 1755021 1764254 1778893 1799147 1826042 1860436 1902508 1952793
59785A952793O0055P1496Q4128R8525J16017J36687J59172J82530K06733K30723
$$ 1952793 2012848 2084344 2168472 2266997 2383014 2519701 2678873 2861403 3068136 3298859
59775C298859K50799K61124K55309K28348J79140J12155L6272l8310j02606j50431
$$ 3298859 3549658 3810782 4066091 4294439 4473579 4585734 4622006 4583696 4481090 4330659
59765D330659j79871j93390j95515j90236j80669j69491j57818j44442j27928
$$ 4330659 4150788 3957398 3761883 3571647 3390978 3221487 3063669 2919227 2791299
59756B791299j09124r0247p2252n4966l9094k5945j5304n490M361J3800K2653
$$ 2791299 2682175 2591928 2519676 2464710 2425616 2399671 2384367 2378877 2383238 2397038 2419691
59745B419691L1428M0150M8450N6771O5894P5395Q4306R3164J03501J15368J27198
$$ 2419691 2451119 2491269 2539719 2596490 2662384 2737779 2822085 2915249 3018750 3134118 3261316
59734C261316J38432J50443J64510J80495J97871K16569K36352K56630K77143
$$ 3261316 3399748 3550191 3714701 3895196 4093067 4309636 4545988 4802618 5079761
59725E079761K97621L16643L31987L42088L46022L42463L30332L10489K85497
$$ 5079761 5377382 5694025 6026012 6368100 6714122 7056585 7386917 7697406 7982903
59716G982903K57965K30540K06895J90626J83081J83853J92960K10575K34819
$$ 7982903 8240868 8471408 8678303 8868929 9052010 9235863 9428823 9639398 9874217
59707I874217K62029K89341L15034L36377L49490L51617L41532L17775K79070
$$ 9874217 10136246 10425587 10740621 11076998 11426488 11778105 12119637 12437412 12716482
59698A2716482K27133J66742J02281L6298k7993q5501j31943j65955j87494j95996
$$ 12716482 12943615 13110357 13212638 13248936 13220943 13135442 13003499 12837544 12650050 12454054
59688A2454054j91348j75089j49312j15636p5931l2454J3784O3499J17047J73275
$$ 12454054 12262706 12087617 11938305 11822669 11746738 11714284 11728068 11791567 11908614 12081889
59678A2081889K31155K91046L53147M15848M76344N31509N77230O08001O18169
$$ 12081889 12313044 12604090 12957237 13373085 13849429 14380938 14958168 15566169 16184338
59669A6184338O02782N57208M77881L64839K22936O0431j12119k81622m33922
$$ 16184338 16787120 17344328 17822209 18187048 18409984 18470415 18358296 18076674 17642752
59660A7642752n57981o48496p04400p26672p18551o86099o36556n76478n12075
$$ 17642752 17084771 16436275 15731875 15005203 14286652 13600553 12963997 12387519 11875444
59651A1875444m50127l97415l59707l41473l44763l66982m00549m35944m65165
$$ 11875444 11425317 11027902 10668195 10326722 9981959 9614977 9214428 8778484 8313319
59642H313319m82881m86455m76373m55682m27888l95673l61509l27898k96131
$$ 8313319 7830438 7343983 6867610 6411928 5984040 5588367 5226858 4898960 4602829
59633D602829k65998k37525k11816j89474j69485j50682j33240j17795j04141
$$ 4602829 4336831 4099306 3887490 3698016 3528531 3377849 3244609 3126814 3022673
59624C022673r1721q0543p0649o1479n2596m4353l7141l0669k4655j9490j5690
$$ 3022673 2930952 2850409 2779760 2718281 2665685 2621332 2584191 2553522 2528867 2509377 2493687
59613B493687j3379j2698j3963j6967k0972k5601l0936l6547m1532m5617m9172
$$ 2493687 2480308 2467610 2453647 2436680 2415708 2390107 2359171 2322624 2281092 2235475 2186303
59602B186303n1948n3094n2554n1144m9048m5742m1589l7803l4538l0727k6282
$$ 2186303 2134355 2081261 2028707 1977563 1928515 1882773 1841184 1803381 1768843 1738116 1711834
59591A711834k2526j9803j6638j2278q117n392l159j1L633O465Q362J0031J1504
$$ 1711834 1689308 1669505 1652867 1640589 1632472 1627080 1623921 1623910 1627543 1634008 1642370 1652401 1663905
59578A663905J2274J2341J2033J1427J0706J0378J0441J0265R843J0268J2254
$$ 1663905 1676179 1688520 1700553 1711980 1722686 1733064 1743505 1753770 1763613 1773881 1786135
59567A786135J5206J8311K1578K5231K9134L3358L8237M3419M8126N2744N8723
$$ 1786135 1801341 1819652 1841230 1866461 1895595 1928953 1967190 2010609 2058735 2111479 2170202
59556B170202O6316P3965Q0765Q7936R6877J07118J17248J26688J35511J43597
$$ 2170202 2236518 2310483 2391248 2479184 2576061 2683179 2800427 2927115 3062626 3206223
59546C206223J50837J57218J62021J63997J62910J59665J54537J46734J36356
$$ 3206223 3357060 3514278 3676299 3840296 4003206 4162871 4317408 4464142 4600498
59537D600498J25155J14560J04407R4419Q5321P7681P1156O5545O0789N5327M6852
$$ 4600498 4725653 4840213 4944620 5039039 5124360 5202041 5273197 5338742 5399531 5454858 5501710
59526E501710L6082K7758K6177L1284M0363N1411O2836P1682P4780P1025O0814
$$ 5501710 5537792 5565550 5591727 5623011 5663374 5714785 5777621 5849303 5924083 5995108 6055922
59515F055922M4086K0579q812m2437p8922j16474j52211j83681k10229k31647
$$ 6055922 6100008 6120587 6111775 6069338 5990416 5873942 5721731 5538050 5327821 5096174
59505E096174k46517k53421k52914k46932k36864k23449k07677j90490j72233
$$ 5096174 4849657 4596236 4343322 4096390 3859526 3636077 3428400 3237910 3065677
59496C065677j53526j35894j20427j06588r3290q0404o8347n7146m6820l7666
$$ 3065677 2912151 2776257 2655830 2549242 2455952 2375548 2307201 2250055 2203235 2165569
59486B165569k9469k1402j3405o293J25P381J5948K4232L1098L7603M5021N2904
$$ 2165569 2136100 2114698 2101293 2095000 2095125 2102506 2118454 2142686 2173784 2211387 2256408 2309312
59474B309312O0648O9151P9243Q9936J00038J10055J20776J31286J40089J46842
$$ 2309312 2369960 2439111 2518354 2608290 2708328 2818383 2939159 3070445 3210534 3357376
59464C357376J51254J51632J46334J35528J19869R8748P1704M0372P286k6145
$$ 3357376 3508630 3660262 3806596 3942124 4061993 4160741 4232445 4272817 4280103 4253958
59454D253958n8848q8652j13600j33568j48929j59010j63572j64258j62558j57778
$$ 4253958 4195110 4106458 3992858 3859290 3710361 3551351 3387779 3223521 3060963 2903185
59444B903185j49167j38581j28558j19127j08970r8615q9608q1561p2855o3785
$$ 2903185 2754018 2615437 2486879 2367752 2258782 2160167 2070559 1988998 1916143 1852358
59434A852358n6182n0265m4474l8341l3089k9196k5604k1562j7402j3349r236
$$ 1852358 1796176 1745911 1701437 1663096 1630007 1600811 1575207 1553645 1536243 1522894 1513658
59423A513658n371k237O18L955P395R954J1623J3124J4504J5373J5974J6865J8171
$$ 1513658 1508287 1506050 1506668 1510623 1518018 1527972 1539595 1552719 1567223 1582596 1598570 1615435 1633606
59410A633606K0253K4091K9795L5787M0657M4311M6005M3379L5841K7292K2803
$$ 1633606 1653859 1677950 1707745 1743532 1784189 1828500 1874505 1917884 1953725 1981017 2003820
59399B003820K3661K7996L4820M4534N6443O8890Q1298R3300J02570J06701J07142
$$ 2003820 2027481 2055477 2090297 2134831 2191274 2260164 2341462 2434762 2537332 2644033 2751175
59388B751175J08596J14538J25620J41848J63212J88065K13760K39360K65576
$$ 2751175 2859771 2974309 3099929 3241777 3404989 3593054 3806814 4046174 4311750
59379D311750K91989L16579L37791L54525L64273L64078L53844L36422L14264
$$ 4311750 4603739 4920318 5258109 5612634 5976907 6340985 6694829 7031251 7345515
59370G345515K88238K59734K31245K04265J78860J55577J35587J18490J02148
$$ 7345515 7633753 7893487 8124732 8328997 8507857 8663434 8799021 8917511 9019659
59361I019659Q5121O7301M7995K5656M6k7305n5016q2207j06752j25436j36480
$$ 9019659 9104780 9172081 9220076 9245732 9245778 9218473 9163457 9081250 8974498 8849062 8712582
59350H712582j40260j37528j29033j17025j04910r4941q8041q5704q9673r9452
$$ 8712582 8572322 8434794 8305761 8188736 8083826 7988885 7900844 7815140 7725467 7626015
59340G626015j12549j27575j44774j63165j79786j92718k02604k10314k15122
$$ 7626015 7513466 7385891 7241117 7077952 6898166 6705448 6502844 6292530 6077408
59331F077408k16154k13814k08870k01740j93234j84333j74773j63462j50695
$$ 6077408 5861254 5647440 5438570 5236830 5043596 4859263 4684490 4521028 4370333
59322D370333j38105j26240j14207j02021r1073q1661p2298o2269n2795m4831
$$ 4370333 4232228 4105988 3991781 3889760 3798687 3717026 3644728 3582459 3529664 3484833
59312C484833l7686l0691k4371j9015j3773q098k493K867Q584J4569J9823K4398
$$ 3484833 3447147 3416456 3392085 3373070 3359297 3351199 3348706 3351573 3360157 3374726 3394549 3418947
59300C418947K9724L6291M2715M7746N1545N4256N5240N4469N2956N0989M7674
$$ 3418947 3448671 3484962 3527677 3575423 3626968 3681224 3736464 3790933 3843889 3894878 3942552
59289C942552M2917L8032L3488K7955K0607J2636N444r33o415r660r753p881n854
$$ 3942552 3985469 4023501 4056989 4084944 4105551 4118187 4123631 4122698 4116283 4106623 4096870 4088989 4083135
59276D083135l860r35L107P197R844R798O463J59q559j9879l4116n0318o6622
$$ 4083135 4079275 4078340 4081447 4088644 4098488 4108286 4114749 4114908 4106349 4086470 4052354 4002036 3935414
59263C935414q1998r6308j08740j17756j22812j24625j23602j19560j13140j05798
$$ 3935414 3853416 3757108 3648368 3530612 3407800 3283175 3159573 3040013 2926873 2821075
59253B821075r8089q9465p9989p0630o1644n2316m2628l3548k5416j7631j0082
$$ 2821075 2722986 2633521 2553532 2482902 2421258 2368942 2326314 2292766 2267350 2249719 2239637
59242B239637l261L242J0583J8906K7400L6203M6302N7566O8934Q0736R4644J11046
$$ 2239637 2236376 2239618 2250201 2269107 2296507 2332710 2379012 2436578 2505512 2586248 2680892 2791938
59230B791938J28652J47054J67412J90191K14386K39357K65120K90123L10771
$$ 2791938 2920590 3067644 3235056 3425247 3639633 3878990 4144110 4434233 4745004
59221D745004L23512L25351L12500K81971K35760J80883J23889O7215J1462m1767
$$ 4745004 5068516 5393867 5706367 5988338 6224098 6404981 6528870 6596085 6607547 6565780
59211F565780r0723j34800j73088k03418k24130k35235k37105k30044k16044j98706
$$ 6565780 6475057 6340257 6167169 5963751 5739621 5504386 5267281 5037237 4821193 4622487
59201D622487j80212j60314j39063j18192r8743p9809o0983m3755k9071j5776
$$ 4622487 4442275 4281961 4142898 4024706 3925963 3846154 3785171 3741416 3712345 3696569
59191C696569l044P792J5370K0339K3783K5532K5405K4088K1421J5912P346k211
$$ 3696569 3693525 3701317 3716687 3737026 3760809 3786341 3811746 3835834 3857255 3873167 3880513 3878302
59179C878302j1350k0983l1649m1655m9719n6961o4255o9906p2317p2753p3024
$$ 3878302 3866952 3845969 3814320 3772665 3722946 3665985 3601730 3531824 3459507 3386754 3313730
59168C313730p2330o9082o4130n9494n5137m9665m3245l7237l1750k5836j9662
$$ 3313730 3241400 3172318 3108188 3048694 2993557 2943892 2900647 2863410 2831660 2805824 2786162
59157B786162j4401j0336o758l344k60K646N600Q550J1878J6437K1981K6928L0669
$$ 2786162 2771761 2761425 2754667 2751323 2751063 2753709 2759309 2767859 2779737 2796174 2818155 2845083 2875752
59144B875752L4627L9872M5318M9637N3217N6671N9025N9261N8201N6918N4588
$$ 2875752 2910379 2950251 2995569 3045206 3098423 3155094 3214119 3273380 3331581 3388499 3443087
59133C443087M9841M3200L6218K9074K0828J1466K123o172j2827j7543k0751k3334
$$ 3443087 3492928 3536128 3572346 3601420 3622248 3633714 3635837 3629665 3616838 3599295 3578544 3555210
59121C555210k5041k4406k0977j6179j1080n071K223R623J6456K4015L3302M2934
$$ 3555210 3530169 3505763 3484786 3468607 3457527 3452456 3454679 3464302 3480758 3504773 3538075 3581009
59109C581009N0999N7376O2481O5271O4426O0184N3207M2826K8130R746j1029
$$ 3581009 3632008 3689384 3751865 3817136 3881562 3941746 3994953 4037779 4065909 4075655 4064626
59098D064626l3597n7133p9606r9357j16465j31215j42642j50058j54583j57527
$$ 4064626 4031029 3973896 3894290 3794933 3678468 3547253 3404611 3254553 3099970 2942443
59088B942443j58579j57011j53168j47388j39113j28563j17651j07724r8074q8174
$$ 2942443 2783864 2626853 2473685 2326297 2187184 2058621 1940970 1833246 1735172 1646998
59078A646998p9312p2351o5878n8597n1598m6190m1511l6447l1965k9176k6946
$$ 1646998 1567686 1495335 1429457 1370860 1319262 1273072 1231561 1195114 1163149 1133973 1107027
59067A107027k3889k0915j9312j8012j5520j2841j1707j1367j0054q296p835q368
$$ 1107027 1083138 1062223 1042911 1024899 1009379 996538 984831 973464 963410 955114 947279 938911
59055I38911q284p647p608p746o858n553n280n466m301j840L75K167M684P917
$$ 938911 930627 922980 915372 907626 900768 895215 889935 884469 880168 878328 878703 880870 885554 893471
59041H93471J0744J3015J5339J7194J7460J6334J4833J3127J1354J1075J3626
$$ 893471 904215 917230 932569 949763 967223 983557 998390 1011517 1022871 1033946 1047572
59030A047572J7820K1547K4697K8134L0766L0381K6759K1485J5211P612m52p217
$$ 1047572 1065392 1086939 1111636 1139770 1170536 1200917 1227676 1249161 1264372 1271984 1271532 1264315
59018A264315j2172j5821j7827j7490j5441j2742r036l689K084O547J0018J3791
$$ 1264315 1252143 1236322 1218495 1201005 1185564 1172822 1163786 1160097 1162181 1168728 1178746 1192537
59006A192537J7326J8945J8514J6927J3767Q025M66p174j4522k1664k7027k9055
$$ 1192537 1209863 1228808 1247322 1264249 1278016 1286041 1286507 1279333 1264811 1243147 1216120 1187065
58994A187065k9072k9521l0039k8397k4696k1325j9073j6478j3007r799p139m103
$$ 1187065 1157993 1128472 1098433 1070036 1045340 1024015 1004942 988464 975457 965658 958519 954416
58982I54416r53R41J772L266N788P930R203J0734J3081J5616J8086K0610K2268
$$ 954416 953463 954404 956176 959442 965230 973160 982363 993097 1006178 1021794 1039880 1060490 1082758
58969A082758K1983K0672K0234K0638K0369J9339J8820J8746J7792J5973J4591
$$ 1082758 1104741 1125413 1145647 1166285 1186654 1205993 1224813 1243559 1261351 1277324 1291915
58958A291915J3656J2041J0073R379J0095J0858J1489J3060J5326J6873J7873
$$ 1291915 1305571 1317612 1327685 1337064 1347159 1358017 1369506 1382566 1397892 1414765 1432638
58947A432638J9960K3219K6043K8172L1285L6091M1380M6307N1235N6118O0406
$$ 1432638 1452598 1475817 1501860 1530032 1561317 1597408 1638788 1685095 1736330 1792448 1852854
58936A852854O4769P0477P6960Q2373Q6698R1819R8481J05715J13383J22683J33870
$$ 1852854 1917623 1988100 2065060 2147433 2234131 2325950 2424431 2530146 2643529 2766212 2900082
58925B900082J45993J59157J74626J92495K11693K32232K54999K79327L03502
$$ 2900082 3046075 3205232 3379858 3572353 3784046 4016278 4271277 4550604 4854106
58916D854106L27617L53007L78739M01632M19869M33477M40761M37502M20504
$$ 4854106 5181723 5534730 5913469 6315101 6734970 7168447 7609208 8046710 8467214
58907H467214L89247L43423K82088K06436J20911L0472o1004j49108k28401k94991
$$ 8467214 8856461 9199884 9481972 9688408 9809319 9839791 9778787 9629679 9401278 9106287
58897I106287l47802l86741m11610m23269m23780m14846l97968l76051l52410
$$ 9106287 8758485 8371744 7960134 7536865 7113085 6698239 6300271 5924220 5571810
58888E571810l28083l02508k76778k53404k32846k13383j94796j79069j66760
$$ 5571810 5243727 4941219 4664441 4411037 4178191 3964808 3770012 3590943 3424183
58879C424183j55751j44571j34068j24935j16263j07592r9726r2563q4606p5693
$$ 3424183 3268432 3123861 2989793 2864858 2748595 2641003 2541277 2448714 2364108 2288415
58869B288415o7781o2053n7522n3333n0032m7658m4961m1427l7998l5037l1707
$$ 2288415 2220634 2158581 2101059 2047726 1997694 1950036 1905075 1863648 1825650 1790613 1758906
58858A758906k7947k4805k2328j9328j5697j2543r796o204k012J078L074N912
$$ 1758906 1730959 1706154 1683826 1664498 1648801 1636258 1626462 1620258 1618246 1619324 1622398 1628310
58846A628310J0088J3881J6557J9444K3140K6625K9869L4344M0097M5171M8869
$$ 1628310 1638398 1652279 1668836 1688280 1711420 1738045 1767914 1802258 1842355 1887526 1936395
58835A936395N2751N7566O2199O6566P2485Q0519Q8850R6484J04777J14613J24940
$$ 1936395 1989146 2046712 2108911 2175477 2247962 2328481 2417331 2513815 2618592 2733205 2858145
58824B858145J35265J46862J60307J74515J89238K05864K24745K44551K65174
$$ 2858145 2993410 3140272 3300579 3475094 3664332 3870196 4094941 4339492 4604666
58815D604666K88225L13602L38557L61241L82056M00340M12886M17068M12166
$$ 4604666 4892891 5206493 5545050 5906291 6288347 6688687 7101573 7518641 7930807
58806G930807L96375L66004L19464K59037J87207J04743J4344p7171j62857k39336
$$ 7930807 8327182 8693186 9012650 9271687 9458894 9563637 9577981 9500810 9337953 9098617
58796I098617l04915l57140l94568m18392m30180m30316m20343m04144l84681
$$ 9098617 8793702 8436562 8041994 7623602 7193422 6763106 6342763 5938619 5553938
58787E553938l62077l36601l10856k86946k64188k41678k20578k01840j84241
$$ 5553938 5191861 4855260 4544404 4257458 3993270 3751592 3531014 3329174 3144933
58778C144933j66848j51040j37922j26047j13878j02375r3165q6233q1176p8431
$$ 3144933 2978085 2827045 2689123 2563076 2449198 2346823 2253658 2167425 2086249 2007818
58768B007818p7347p5308p0747o5019n9752n4543m8821m3455l8790l3481k7083
$$ 2007818 1930471 1855163 1784416 1719397 1659645 1605102 1556281 1512826 1474036 1440555 1413472
58757A413472k1391j7524j4068r778n603k460M52L529N703P012R360J3133J6067
$$ 1413472 1392081 1374557 1360489 1350711 1345108 1342648 1343100 1346629 1352332 1359344 1368704 1381837 1397904
58744A397904J7188J8578K1171K2211J9358J4119Q676K406n566j3288j8484k1758
$$ 1397904 1415092 1433670 1454841 1477052 1496410 1510529 1519205 1521611 1516045 1502757 1484273 1462515
58732A462515k4544k6277k6335k6366k7950l0005l1085l2062l4090l6138l6920
$$ 1462515 1437971 1411694 1385359 1358993 1331043 1301038 1269953 1237891 1203801 1167663 1130743
58721A130743l7126l7477l6883l4778l2788l1930l0637k7823k5091k3587k1624
$$ 1130743 1093617 1056140 1019257 984479 951691 919761 889124 861301 836210 812623 790999
58710G90999j7952j4514j3075j1973r197n995m368l605k333j536k364l427l349
$$ 790999 773047 758533 745458 733485 724288 718293 713925 710320 707987 706451 704087 700660 697311
58697F97311l608n731q003q101o746n679m370j855N11J311J773L147L758J928
$$ 697311 693703 687972 679969 671868 665122 659443 655073 653218 653729 655040 656813 659960 663718 665646
58683F65646o12j588k049l915n885n593l740k448j255J595N477Q374J0017J0917
$$ 665646 665034 663446 661397 657482 651597 646004 642264 639816 638561 640156 645633 654007 664024 674941
58669F74941J0014O504K382J19o21j238j179M82K468L211L192K794L91m348q153
$$ 674941 684955 691459 693841 693960 693339 692101 690922 691404 693872 697083 700275 703069 703460 699112 690959
58654F90959q495p522q148r092p802n426m513m112j796J542L330L982N582P666
$$ 690959 682464 674942 666794 657702 649900 644474 639961 635849 634053 635595 638925 642907 648489 656155
58640F56155Q577R274J1506J3959J4517J4600J6790J9804K0599K0027K1567K5531
$$ 656155 664732 674006 685512 699471 713988 728588 745378 765182 785781 805808 827375 852906
58628H52906K9211L1980L5642M0398M4925M9787N6685O4810P2050P9113Q8501
$$ 852906 882117 914097 949739 990137 1035062 1084849 1141534 1206344 1278394 1357507 1446008
58617A446008J00040J11239J21278J30687J37861J39998J36889J30081J18931
$$ 1446008 1546048 1657287 1778565 1909252 2047113 2187111 2324000 2454081 2573012
58608B573012J01337P7709N0596K1214r958m0093o5511q5574j01594j12834j17511
$$ 2573012 2674349 2752058 2802654 2823868 2813910 2773817 2708306 2622732 2521138 2408304 2290793
58597B290793j16816j13937j09745j03148r4841q6845p9065p0118o0823n3167
$$ 2290793 2173977 2060040 1950295 1847147 1752306 1665461 1586396 1516278 1455455 1402288
58587A402288m6625l9218l1422k5291k0600j5566j0553p371n734l966k232j641
$$ 1402288 1355663 1316445 1285023 1259732 1239132 1223566 1213013 1205642 1199908 1195942 1193710 1192069
58575A192069j315J12J496J316J164L328O549Q250R127J1149J2738J0665N220
$$ 1192069 1190754 1190866 1192362 1193678 1194842 1198170 1204719 1212969 1222096 1233245 1245983 1256648 1261868
58562A261868j130q644j8943l0133l8483m3877m8628n2009n1234m7037m2977l9747
$$ 1261868 1260738 1252094 1233151 1203018 1164535 1120658 1072030 1020021 968787 921750 878773 839026
58550H39026l5259k9824k6016k3767k0654j6837j4821j4594j3691j1786j0556
$$ 839026 803767 773943 747927 724160 703506 686669 671848 657254 643563 631777 621221
58539F21221r578p046m068l313l995l043p20l3j109j317n21j058k819l432l052
$$ 621221 611643 604597 600529 597216 593221 590178 589458 589425 588316 586999 586478 585420 582601 579169 576117
58524E76117l950n624n435l685l075l533k686q50l68n78J034L372L122J109J334
$$ 576117 572167 566543 561108 557423 554348 550815 548129 547279 546911 546333 547367 550739 553861 554970 556304
58509E56304L946N213M380M466O079O547N593N920P612P747O231O313Q664J0575
$$ 556304 560250 565463 569843 574309 580388 586935 592528 598448 606060 613807 620038 626351 635015 645590
58495F45590J1417J3408J6461J7838J7379J7432J7428J4306Q721M868L593J568
$$ 645590 657007 670415 686876 704714 722093 739525 756953 771259 779980 784848 788441 790009
58483G90009k229n222o957r973j4212j6491j6334j6536j7393j6315j3582j2322
$$ 790009 787780 782558 775601 765628 751416 734925 718591 702055 684662 668347 654765 642443
58471F42443j2316j0172o231m661n960o061l769k380k763j735J359L092K512K739
$$ 642443 630127 619955 613724 609063 603103 597042 593273 590893 588130 586395 587754 590846 593358 596097
58457E96097M587N093L790L882N797O130M409M276O479P458O354O569Q865R912
$$ 596097 600684 605777 609567 613449 619246 625376 629785 634061 640540 647998 654352 660921 669786 679698
58443F79698R230J0444J3958J5651J4765J5542J8895J9919J6276J1701Q513L971
$$ 679698 688928 699372 713330 728981 743746 759288 778183 798102 814378 826079 834592 838563
58431H38563l009q670j1049j3101j6287j7666j6110j4685j4326j1884p022l951
$$ 838563 835554 826884 815835 802734 786447 768781 752671 737986 723660 711776 704754 700803
58419G00803l784k279K068N044M774N227Q538J1194J1280J2224J5837J8685J8823
$$ 700803 697019 694740 696808 701852 706626 711853 720391 731585 742865 755089 770926 789611 808434
58406H08434J9054K0097J7846J1055M586J311k103p736j2024j2651j2712j4187
$$ 808434 827488 847585 865431 876486 881072 882383 880280 872544 860520 847869 835157 820970
58394H20970j4245j1660r877j0138q757m652k217l090k852M46K345N29o97J347
$$ 820970 806725 795065 785188 775050 766293 761641 759424 756334 753482 753928 756273 756802 756105 757452
58380G57452K960J800J426L711M746K863K635O215Q785P459O584R247J1644J0996
$$ 757452 760412 762212 763638 767349 772095 774958 777593 783808 792593 800052 806636 815883 827527 838523
58366H38523J0956J3867J5802J4552J4463J7965K0526J9333J8644K1057K1984
$$ 838523 849479 863346 879148 893700 908163 926128 946654 965987 984631 1005688 1027672
58355A027672J8600J5663J6513J6802J3255J0024J0039Q695K695l285n219o578
$$ 1027672 1046272 1061935 1078448 1095250 1108505 1118529 1128568 1137263 1139958 1136673 1131454 1124876
58343A124876j0125j1616q374n484o532o848k851Q04L92M78M764Q638Q277Q197
$$ 1124876 1114751 1103135 1094761 1089277 1082745 1075897 1073046 1073850 1074242 1074720 1079484 1088122 1096399 1104596
58329A104596J2098J5249J3819J2731J6134J9229J7719J6327J9535K2969K2387
$$ 1104596 1116694 1131943 1145762 1158493 1174627 1193856 1211575 1227902 1247437 1270406 1292793
58318A292793K2126K6071K9431K8083K6721K9015K9334K3302J6813J5280J3747
$$ 1292793 1314919 1340990 1370421 1398504 1425225 1454240 1483574 1506876 1523689 1538969 1552716
58307A552716P274J195J069K290j63j534K834P361O534N531R938J4793J4604J4225
$$ 1552716 1559990 1561185 1562254 1564544 1564381 1562847 1565681 1573042 1579576 1585107 1595045 1609838 1624442 1638667
58293A638667J8791K3002K1600K0249K4716K9641K9416K9393L4700L9173L7491
$$ 1638667 1657458 1680460 1702060 1722309 1747025 1776666 1806082 1835475 1870175 1909348 1946839
58282A946839L6836M3878N1736N2927N3404O0224O7309O7492O6554P0669P2123
$$ 1946839 1983675 2027553 2079289 2132216 2185620 2245844 2313153 2380645 2447199 2517868 2589991
58271B589991O2847N0207M3827L8827K7919J7802J6893J8985J5913J4213K1938
$$ 2589991 2652838 2703045 2746872 2785699 2813618 2831420 2848313 2867298 2883211 2897424 2919362
58260B919362L1441L3081L3526M2274N2703N5138N5920O4310P3508P4310P4260
$$ 2919362 2950803 2983884 3017410 3059684 3112387 3167525 3223445 3287755 3361263 3435573 3509833
58249C509833Q3127R2975R3465R2811J02064J13065J14364J14297J24885J37874
$$ 3509833 3592960 3685935 3779400 3872211 3974275 4087340 4201704 4316001 4440886 4578760
58239D578760J40938J42421J54870J69591J73734J76682J92211K10708K17417
$$ 4578760 4719698 4862119 5016989 5186580 5360314 5536996 5729207 5939915 6157332
58230F157332K21761K39132K60520K70919K80355L04569L32877L48734L63724
$$ 6157332 6379093 6618225 6878745 7149664 7430019 7734588 8067465 8416199 8779923
58221H779923L96145M35121M62640M91003N39554N95439O38787O84811P57143
$$ 8779923 9176068 9611189 10073829 10564832 11104386 11699825 12338612 13023423 13780566
58212A3780566Q42423R18143J001478J120562J262670J404740J568749J789030
$$ 13780566 14622989 15541132 16542610 17663172 18925842 20330582 21899331 23688361
58204B3688361K053267K339032K679007L121805L660691M275922N011194N925004
$$ 23688361 25741628 28080660 30759667 33881472 37542163 41818085 46829279 52754283
58196E2754283P009968Q261513R787964J1749869J4251510J7428466K1563359
$$ 52754283 59764251 68025764 77813728 89563597 103815107 121243573 142806932
58189A42806932K6888355L3228901L9904964M5751294M8856528M6506208L6388762
$$ 142806932 169695287 202924188 242829152 288580446 337436974 383943182 420331944
58182D20331944J8748035k675121k2408263l6347714m3414752m4823753m2470741
$$ 420331944 439079979 436404858 413996595 377648881 334234129 289410376 246939635
58175B46939635l8037836l2842380k7769501k3205616j9216565j5816525j3017579
$$ 246939635 208901799 176059419 148289918 125084302 105867737 90051212 77033633
58168G7033633j0744704q873222p337304o113888n139126m329063l653993l117556
$$ 77033633 66288929 57415707 50078403 43964515 38825389 34496326 30842333 27724777
58160B7724777k688297k316870j995406j739673j533991j346489j177632j044656
$$ 27724777 25036480 22719610 20724204 18984531 17450540 16104051 14926419 13881763
58152A3881763r36951q30907p30782o54074n93313n29423m66703m20221l84039
$$ 13881763 12944812 12113905 11383123 10729049 10135736 9606313 9139610 8719389 8335350
58143H335350l43258l02491k73446k48971k16097j80489j53587j29740r8422o4699
$$ 8335350 7992092 7689601 7416155 7167184 6951087 6770598 6617011 6487271 6388849 6324150
58133F324150l6977q744K8577O8846J03781J37587J73977K03793K19572K28657
$$ 6324150 6287173 6278429 6307006 6375852 6479633 6617220 6791197 6994990 7214562 7443219
58123G443219K41554K62471K98967L63604M59138N78703P23237R00442J109100
$$ 7443219 7684773 7947244 8246211 8609815 9068953 9647656 10370893 11271335 12380435
58114A2380435J348209J638482K011024K486678L098223L913446M984504O273513
$$ 12380435 13728644 15367126 17378150 19864828 22963051 26876497 31861001 38134514
58106C8134514P643767Q849931R441162Q766228O349583K433434j942376n556900
$$ 38134514 45778281 54628212 64069374 72835602 79185185 81618619 79676243 74119343
58098G4119343p743983q557565q398913p658294o641974n593495m649949l830929
$$ 74119343 66375360 57817795 49418882 41760588 35118614 29525119 24875170 21044241
58090B1044241l122766k537078k075536j702313j386297j129534r31900p68539
$$ 21044241 17921475 15384397 13308861 11606548 10220251 9090717 8158817 7390278
58082G390278o23765n10546m36338l82219l33235k98361k83831k75250k61518
$$ 7390278 6766513 6255967 5819629 5437410 5104175 4805814 4521983 4246733 3985215
58073C985215k49881k43368k28654j99645j69395j46766j24136r9012q4693q7806
$$ 3985215 3735334 3491966 3263312 3063667 2894272 2747506 2623370 2524358 2439665 2351859
58063B351859r6254r9989j03663j09469j08047r6358q5416q0978p4830o3298n5595
$$ 2351859 2255605 2155616 2051953 1942484 1834437 1738079 1652663 1571685 1496855 1433557 1377962
58052A377962n5463n3073m3735l6784l7459l7358l1323k6805k8122k7884k2257
$$ 1377962 1322499 1269426 1225691 1188907 1151448 1114090 1082767 1055962 1027840 999956 977699
58041I77699j8890k1541k2352j7297j4014j6574j7488j2609r218j1545j2709q858
$$ 977699 958809 937268 914916 897619 883605 867031 849543 836934 827716 816171 803462 794604
58029G94604p082j1341j4337j1377r048j2002j4132j0815p562q597q802m765k142
$$ 794604 787522 776181 761844 750467 741419 729417 715285 704470 696908 688311 679509 674744 672602
58016F72602m445n726j812K092J964K288O006P940N064K903N016O435L919K453
$$ 672602 668157 662431 660619 662711 664675 666963 672969 680909 685973 688876 693892 700327 704246 706699
58002G06699N071O544L465N58P13j001p098j1707j1349j1516j5939j9287j7419
$$ 706699 711770 718314 721779 722337 723050 722049 714951 703244 691895 680379 664440 645153 627734
57989F27734j5113j6506j7333j3822j0274j0569j0830p646n134o787q364n855
$$ 627734 612621 596115 578782 564960 554686 544117 533287 525641 520507 513720 505356 499501
57977D99501k773k916l396j353j9j780k670M4K224P30n23J627L328J341n19J211
$$ 499501 496728 493812 490416 489063 489044 487264 484594 484638 486862 487592 487069 488696 492024 493365 492846 494057
57961D94057L094J862Q26K956M532K040j312k104l016o657r686r199q489j0443
$$ 494057 497151 499013 499839 502795 507327 509367 508055 505951 502935 496278 486592 477393 468904 458461
57947D58461j1639q976n841n686n793l375j549l042m252j776J052L67j221n4J833
$$ 458461 446822 437846 432005 426319 420526 417151 415602 412560 408308 406532 407584 407951 406730 406676 408509
57932D08509J400O43J911K548P6k426j810m98j156j100K305N988O676O819R399
$$ 408509 409909 410552 412463 415011 415087 412661 410851 410353 409197 408097 410402 416390 423066 429885 439284
57917D39284J1911J1277R717J0079J0303Q095O048O493O255K273k503m497n769
$$ 439284 451195 462472 472189 482268 492571 500666 506714 513207 519462 521735 519232 514735 508966
57904E08966r160j2161j1698j0333j1701j4068j4221j3343j3411j2332q362m941
$$ 508966 499806 487645 475947 465614 453913 439845 425624 412281 398870 386538 378176 373235
57892C73235n266o429m700k152k205l025j530L53l64j562L0K564K778K215L721
$$ 373235 367969 361540 356840 354688 352483 349458 347928 348281 347917 346355 346385 348949 351727 353942 357663
57877C57663N472M583L072M180O180N841M569N177O008M260J830J754K147k03
$$ 357663 363135 367718 370790 374970 381150 386991 391560 396737 402745 407005 408835 410589 412736 412533
57863D12533l440l970l095m110n749m829k770l066m715m307k363j661j417Q70
$$ 412533 409093 405123 402028 397918 392169 387340 384570 381504 376789 372482 370119 368458 367041 367911
57849C67911L914M755M385N635P559P510O725Q162J0655J0936R640R764J0911
$$ 367911 371825 376580 380965 386600 394159 401669 408394 416556 427211 438147 447787 457551 468462
57836D68462J0475Q914Q482Q295N978K528N49p44l701p275q893r425j1123j2645
$$ 468462 478937 487851 496333 504628 510606 513134 513683 512939 509238 501963 493070 483645 472522 459877
57822D59877j1400r028r035j0582j0076p583o215o318n525l633k435j665K17K219
$$ 459877 448477 439449 430414 419832 409756 402173 395958 389640 384115 380482 378047 376382 376599 378818
57808C78818K367J759K684M140L750K400K329K339o1l368m093k732k668m317n359
$$ 378818 381185 382944 385628 389768 393518 395918 398247 400586 400525 397157 393064 390332 387664 383347 377988
57793C77988n555o429p258o251m630m781n480l870r11Q3p75o03P44R09q8o9Q80
$$ 377988 372433 366004 358746 352495 347865 343084 337604 333734 332823 332906 332131 331528 332272 333181 333093 333024 333904
57776C33904R17N47J653L310L197K229L017M804M806L638M363O868Q259Q235R125
$$ 333904 334821 335368 337021 340331 343528 345757 348774 353578 358384 362022 366385 373253 381512 389747 398872
57761C98872J0913J1206R824Q801Q117O006L112J862K158K024J793L091M476K952
$$ 398872 409785 420991 430815 439616 447733 453739 456851 458713 460871 462895 464688 467779 472255 475207
57747D75207q03l423m397n758p130o298m253m249o001o093m092l061l762l602
$$ 475207 474404 470981 466584 460826 453696 447398 443145 438896 432895 426802 422710 419649 415887 412285
57733D12285j834p15r09m66R53J438R47J620L486M242L712M138N628N805M384
$$ 412285 410451 409736 408827 408361 409314 410752 411699 413319 416805 421047 424759 428897 434525 440330 444714
57718D44714L738M473M838M850O531R538J1065J0637J0680J1877J2363J1983J2752
$$ 444714 448452 452925 457763 462613 469144 478682 489747 500384 511064 522941 535304 547287 560039
57705E60039J4588J5086J4261J4943J7787K0392K2076K4969K9520L3526L6612
$$ 560039 574627 589713 603974 618917 636704 657096 679172 704141 733661 767187 803799
57694H03799M0979M6653N0615N1952N3422N6556N9696O2335O6972P4831Q3844
$$ 803799 844778 891431 942046 993998 1047420 1103976 1163672 1226007 1292979 1367810 1451654
57683A451654R2582J02263J13182J22886J29478J33103J32626J24770J08350Q5989
$$ 1451654 1544236 1646499 1759681 1882567 2012045 2145148 2277774 2402544 2510894 2596883
57673B596883O0241L1665K146k3673m2293n3567n7659n3150l9692j9288O332L6038
$$ 2596883 2657124 2688789 2690935 2667262 2624969 2571402 2513743 2460593 2420901 2401613 2407945 2443983
57661B443983O5162Q4294Q4341O1287J6582m2867j04156j52642j80257j88296
$$ 2443983 2509145 2593439 2677780 2739067 2755649 2712782 2608626 2455984 2275727 2087431
57651B087431j82040j66011j44769j23318j04070q6168o9329n5256m4285l4296
$$ 2087431 1905391 1739380 1594611 1471293 1367223 1281055 1211726 1156470 1112185 1077889
57641A077889k4429j6494j1166o289o08M324P710J1561J7258K3212K7928L2502
$$ 1077889 1053460 1036966 1025800 1019511 1018903 1023227 1030937 1042498 1059756 1082968 1110896 1143398
57629A143398L8298M4898N1925O0168O9450P8171Q6162R5071J04701J12233J16214
$$ 1143398 1181696 1226594 1278519 1338687 1408137 1486308 1572470 1667541 1772242 1884475 2000689
57618B000689J17934J17411J11603R8291P8651N4433K6014n092l5195o1769q4825
$$ 2000689 2118623 2236034 2347637 2445928 2524579 2579012 2605026 2599934 2564739 2502970 2418145
57607B418145j03569j15315j19598j19753j18294j14096j06261r7236q9555q2577
$$ 2418145 2314576 2199261 2079663 1959910 1841616 1727520 1621259 1524023 1434468 1351891
57597A351891p5010o7760o1846n6206m9958m4297m0060l6014l1532k8212k6793
$$ 1351891 1276881 1209121 1147275 1091069 1041111 996814 956754 920740 889208 860996 834203
57586H34203k5288k2262j9187j7466j5974j3706j1961j1622j1119r314p690p428
$$ 834203 808915 786653 767466 750000 734026 720320 708359 696737 685618 676304 668614 661186
57574F61186p101n559m226m234m114k801j951k751l265j685N05J404J974L561
$$ 661186 654085 648526 644300 640066 635952 633151 631200 628449 625184 623499 624004 625408 627382 630943
57560F30943M852M377L649M680O523P275P440Q316R078Q477P590P987Q937R243
$$ 630943 635795 640172 643821 648501 655024 662299 669739 678055 687133 695610 703200 711187 720124 729367
57546G29367J0003J2708J6259J8717K0395K2591K4918K6605K8722L2427L6525
$$ 729367 739370 752078 768337 787054 807449 830040 854958 881563 910285 942712 979237
57535I79237L9495M2328M6707N1954N6527O1027O6935P3727P9979Q5898R2028
$$ 979237 1018732 1061060 1107767 1159721 1216248 1277275 1344210 1417937 1497916 1583814 1675842
57524A675842R6635R7165R3176Q5434P3388N6185L5030J2050j2016l6451n8335
$$ 1675842 1772477 1869642 1962818 2048252 2121640 2177825 2212855 2224905 2212889 2176438 2118103
57513B118103p4551q5170r2241r6098r5494r0705q3834p6338o8465o0697n3846
$$ 2118103 2043552 1958382 1866141 1770043 1674549 1583844 1500010 1423672 1355207 1294510 1240664
57502A240664m7891m2383l7443l3164k8883k4347k0511j7882j5367j2024q563
$$ 1240664 1192773 1150390 1112947 1079783 1050900 1026553 1006042 988160 972793 960769 952206
57491I52206n798l278q22N14N86J251L561N901O828P632R971J3096J5778J8874
$$ 952206 946408 943130 942308 942822 943408 944659 948220 954121 960949 968581 978552 991648 1007426 1026300
57477A026300K3357K7792L0557L2955L7225M2976M8399N3601N9888O6888P3234
$$ 1026300 1049657 1077449 1108006 1140961 1178186 1221162 1269561 1323162 1383050 1449938 1523172
57466A523172P9067Q5266R0992R4438R5008R2532Q5501P2500N4364L2813Q344
$$ 1523172 1602239 1687505 1778497 1872935 1967943 2060475 2145976 2218476 2272840 2305653 2313997
57455B313997j8101m3022o2758p7013q7474r4211r6126r3819q9205q3041p5406
$$ 2313997 2295896 2252874 2190116 2113103 2025629 1931418 1835292 1741473 1652268 1569227 1493821
57444A493821o7651o1246n5474m8838m1907l6289l1777k7103k2660j9731j7811
$$ 1493821 1426170 1364924 1309450 1260612 1218705 1182416 1150639 1123536 1100876 1081145 1063334
57433A063334j5270j2171r938q704p368n621l870j916K40J263M26m78N26K454
$$ 1063334 1048064 1035893 1025955 1017251 1009883 1004262 1000392 998476 998716 999979 1000405 999927 1000453 1002907
57419A002907L064K489K525L387L962M333N291O124N730N119O047P848Q463P920
$$ 1002907 1005971 1008460 1010985 1014372 1018334 1022667 1027958 1034082 1039812 1044931 1050978 1058826 1067289 1075209
57405A075209Q004R027R753J0070J0979J2304J2990J3239J3895J4307J3384J2087
$$ 1075209 1083213 1092240 1101993 1112063 1123042 1135346 1148336 1161575 1175470 1189777 1203161 1215248
57393A215248J2221J3360J3726J3469J4177J5692J6296J5696J5032J4364J2973
$$ 1215248 1227469 1240829 1254555 1268024 1282201 1297893 1314189 1329885 1344917 1359281 1372254
57382A372254J1731J2219J3759J4217J3457J3167J3514J3054J1757J1129J1268
$$ 1372254 1383985 1396204 1409963 1424180 1437637 1450804 1464318 1477372 1489129 1500258 1511526
57371A511526J0751R525R060R510R505Q944R198J0361J0992J0822J1088J1960
$$ 1511526 1522277 1531802 1540862 1550372 1559877 1568821 1578019 1588380 1599372 1610194 1621282 1633242
57359A633242J2303J2131J2614J3504J3289J2186J2249J4008J5633J5980J5987
$$ 1633242 1645545 1657676 1670290 1683794 1697083 1709269 1721518 1735526 1751159 1767139 1783126
57348A783126J6510J7064J7274J7487J7538J6956J6555J7727K0021K1589K1971
$$ 1783126 1799636 1816700 1833974 1851461 1868999 1885955 1902510 1920237 1940258 1961847 1983818
57337A983818K2291K2794K2574K1797K1735K2495K3021K3340K4385K5612K5408
$$ 1983818 2006109 2028903 2051477 2073274 2095009 2117504 2140525 2163865 2188250 2213862 2239270
57326B239270K3948K3117K3470K3827K3928K4825K6421K7283K7217K7547K8575
$$ 2239270 2263218 2286335 2309805 2333632 2357560 2382385 2408806 2436089 2463306 2490853 2519428
57315B519428K9271K9627L0768L2538L3515L3624L4097L4818L4515L3697L4304
$$ 2519428 2548699 2578326 2609094 2641632 2675147 2708771 2742868 2777686 2812201 2845898 2880202
57304B880202L6134L6713L5270L3803L3589L3639L3409L3959L5401L6155L5788
$$ 2880202 2916336 2953049 2988319 3022122 3055711 3089350 3122759 3156718 3192119 3228274 3264062
57293C264062L6009L7625L9128L9374L9162L9146L8668L7810L8109M0014M1930
$$ 3264062 3300071 3337696 3376824 3416198 3455360 3494506 3533174 3570984 3609093 3649107 3691037
57282C691037M2801M3443M4306M4363M3226M2160M1784M0924L8832L6532L4877
$$ 3691037 3733838 3777281 3821587 3865950 3909176 3951336 3993120 4034044 4072876 4109408 4144285
57271D144285L3248L1087K8884K6954K5067K3777K4087K5422K6147K6375K7699
$$ 4144285 4177533 4208620 4237504 4264458 4289525 4313302 4337389 4362811 4388958 4415333 4443032
57260D443032K9930L0946L0400L0491L2231L3918L4385L4748L5644L5707L4387
$$ 4443032 4472962 4503908 4534308 4564799 4597030 4630948 4665333 4700081 4735725 4771432 4805819
57249D805819L3449L3989L4490L3615L2556L2801L3685L3990L4025L4525L5227
$$ 4805819 4839268 4873257 4907747 4941362 4973918 5006719 5040404 5074394 5108419 5142944 5178171
57238E178171L5910L7094L8561L9109L8843L9629M2126M4550M5504M5827M6434
$$ 5178171 5214081 5251175 5289736 5328845 5367688 5407317 5449443 5493993 5539497 5585324 5631758
57227E631758M6677M6191M6089M6838M7063M5881M4362M3310M1792L9238L6828
$$ 5631758 5678435 5724626 5770715 5817553 5864616 5910497 5954859 5998169 6039961 6079199 6116027
57216F116027L5411L4127L2458L1402L1239L0502K8609K7287K7754K8806K9214
$$ 6116027 6151438 6185565 6218023 6249425 6280664 6311166 6339775 6367062 6394816 6423622 6452836
57205F452836K9743L1151L2433L2820L3342L4685L5758L6006L6789L8676L9823
$$ 6452836 6482579 6513730 6546163 6578983 6612325 6647010 6682768 6718774 6755563 6794239 6834062
57194F834062L9069L8209L8926L9843L9026L7277L6280L5383L2981K9560K6693
$$ 6834062 6873131 6911340 6950266 6990109 7029135 7066412 7102692 7138075 7171056 7200616 7227309
57183G227309K4231K0967J7086J3693J0847Q027N609M033K414k66l530o385q828
$$ 7227309 7251540 7272507 7289593 7303286 7314133 7322160 7327769 7331802 7334216 7333950 7330420 7324035 7315207
57170G315207j1044j2416j2771j3162j4053j4134j2386r769p470n083k073O72
$$ 7315207 7304163 7291747 7278976 7265814 7251761 7237627 7225241 7215472 7208002 7202919 7200846 7201518
57158G201518K390M006O478R108J1046J2909J5255J7070J7276J6281J4412J0533
$$ 7201518 7203908 7207914 7214392 7223500 7234546 7247455 7262710 7279780 7297056 7313337 7327749 7338282
57146G338282L868m339j2582k0951k9749l7987m4761n0499n5348n8119n8249n6937
$$ 7338282 7342150 7337811 7325229 7304278 7274529 7236542 7191781 7141282 7085934 7027815 6969566 6912629
57134F912629n4832n0706m4133l7377l2740k9990k8230k8208l0782l4950l9408
$$ 6912629 6857797 6807091 6762958 6725581 6692841 6662851 6634621 6606413 6575631 6540681 6501273
57123F501273m4201m8972n1557n0288m5916l9565l1030k0948j2253p162m649k978
$$ 6501273 6457072 6408100 6356543 6306255 6260339 6220774 6189744 6168796 6156543 6149381 6144732 6141754
57111F141754k363k777j382N265J8030L6226N9679Q7747J18610J51967J90726
$$ 6141754 6139391 6136614 6135232 6140497 6158527 6194753 6254432 6342179 6460789 6612756 6803482
57100F803482K38350K96871L69060M59275N69757O99141Q46841J015589J206982
$$ 6803482 7041832 7338703 7707763 8167038 8736795 9435936 10282777 11298366 12505348
57091A2505348J417862J643489J879840K119053K346177K543785K695723K783768
$$ 12505348 13923210 15566699 17446539 19565592 21911769 24455554 27151277 29935045
57083B9935045K788150K699167K524912K282259J986395J656473J321657J001720
$$ 29935045 32723195 35422362 37947274 40229533 42215928 43872401 45194058 46195778
57075D6195778O76658K89126k10589q19166j475060k089574k584835k919113l093412
$$ 46195778 46872436 47161562 46950973 46131807 44656747 42567173 39982338 37063225 33969813
57066C3969813l138294l090031k974589k808024k603329k372867k128052j880687
$$ 33969813 30831519 27741488 24766899 21958875 19355546 16982679 14854627 12973940
57058A2973940j642820j422983j224243j047305q93225p61906o50714n56539m77453
$$ 12973940 11331120 9908137 8683894 7636589 6743364 5981458 5330744 4774205 4296752
57049D296752m11358l55360l07811k68759k37228k10244j85697j64037j46061
$$ 4296752 3885394 3530034 3222223 2953464 2716236 2505992 2320295 2156258 2010197
57040B010197j31040j18049j07116r8006q9744q2120p5904p0870o5612n9818n4710
$$ 2010197 1879157 1761108 1653992 1555986 1466242 1384122 1308218 1237348 1171736 1111918 1057208
57029A057208n0688m6645m2253l8706l6524l4599l2183k9880k8045k6112k4017
$$ 1057208 1006520 959875 917622 878916 842392 807793 775610 745730 717685 691573 667556
57018F67556k2608k1996k1273k0142j9212j8558j7662j6723j6204j5400j3393
$$ 667556 644948 622952 601679 581537 562325 543767 526105 509382 493178 477778 464385
57007D64385j1099j0089r876q809p201o780p402p245o193n842o139n229k995j491
$$ 464385 453286 443197 433321 424512 417311 410531 403129 395884 389691 383849 377710 372481 369486 367995
56993C67995j313o07J619M108O046Q337J1449J4654J8079K2866K8499L2519L3431
$$ 367995 366682 366075 367694 371802 377848 386185 397634 412288 430367 453233 481732 514251 547682
56980E47682L1602K7158J9917J1792O270M698N594P922J2289J8554K5216L1777
$$ 547682 579284 606442 626359 638151 644421 649119 654713 662635 674924 693478 718694 750471
56968G50471L9229M7992N7930P0277Q6678J06738J29507J56745J91489K34751
$$ 750471 789700 837692 895622 965899 1052577 1159315 1288822 1445567 1637056 1871807
56958A871807K87670L54955M40510N40137O42463P32005P80912P42153N72401
$$ 1871807 2159477 2514432 2954942 3495079 4137542 4869547 5650459 6392612 6965013
56949F965013K76841p4544l86620n96965o96762p09700o65702n91431n08376m29264
$$ 6965013 7241854 7167310 6780690 6183725 5486963 4777263 4111561 3520130 3011754 2582490
56939B582490l57839k94376k39369j92343j51396j15559q5147n9520l7052j7771
$$ 2582490 2224651 1930275 1690906 1498563 1347167 1231608 1146461 1086941 1049889 1032118
56929A032118m054J509k366j5206l3650n1548o3582o8677o8648o4807n7794m9379
$$ 1032118 1028064 1029573 1027207 1012001 978351 926803 863221 794544 725896 661089 603295 553916
56917E53916m1730l5407k9947k5605k2608j9841j6266j2815j0913j0120r093p832
$$ 553916 512186 476779 446832 421227 398619 378778 362512 349697 338784 328664 319571 311739
56905C11739p000o124m502k930k469k414j447N5Q62J145J975L412M905O763R475
$$ 311739 304739 298615 294113 291183 288714 286300 284853 284908 285770 286915 288890 292302 297207 303970 313445
56890C13445J2377J4725J7192K0698K4636K7646K8968K7585K1675J0978j462j1876
$$ 313445 325822 340547 357739 378437 403073 430719 459687 487272 508947 519925 518463 506587
56878E06587j9124k3843k5861k4650k1241j7363j3370q820m110L01N186J1222
$$ 506587 487463 463620 437759 413109 391868 374505 361135 352315 348205 348506 353692 364914
56866C64914J7357K2505K7779L5114M4569N4919O5676P6135Q3110Q1837O9296
$$ 364914 382271 404776 432555 467669 512238 567157 632833 708968 792078 873915 943211
56855I43211M5819J4836j7413m3547n9027o4400o2755n6339m6841l6788k8014
$$ 943211 989030 1003866 986453 942906 883879 819479 756724 700385 653544 616756 588742
56844E88742j9927j1268k402O035J5121K6044L8019N0204O4197Q1887J01845J20008
$$ 588742 568815 557547 555145 561180 576301 602345 640364 690568 754765 836652 938497 1058505
56832A058505J32273J33849J18262Q1752K9215k7041p4854j07269j22371j22304
$$ 1058505 1190778 1324627 1442889 1524641 1553856 1526815 1451961 1344692 1222321 1100017
56822A100017j12757r9929q6597p2415n7517m3519l1233j9906q933J621J2323
$$ 1100017 987260 887331 800734 728319 670802 627283 596050 576144 567211 568832 581155
56811E81155K4199L7339N1217O6003Q1428R4306R8878Q9951O5378K7329j6850
$$ 581155 605354 642693 693910 759913 841341 935647 1034525 1124476 1189854 1217183 1200333
56800A200333n6441q3184r5799r7867r2743q2511p0035n8345m8075l8152k8700
$$ 1200333 1143892 1060708 964909 867042 774299 691788 621753 563408 515333 477181 448481
56789D48481k0864j4212p083O37P690J4308K2279L1983M1540M8809N2029M8673
$$ 448481 427617 413405 406322 406959 414649 428957 451236 483219 524759 573568 625597 674270
56777F74270L6540J6686o457k8163m5245n5655n8879n6816n2267m6428l9390l2363
$$ 674270 710810 727496 721039 692876 647631 591976 533097 476281 424014 377586 338196 305833
56765C05833k7007k3016j8851j4659j2019j0948r741p857o541o338o259n689n002
$$ 305833 278826 255810 236959 222300 210281 199333 189592 181735 175194 168856 162597 156908 151906
56752A51906m165k763j434j256j787j692j125j265j765j164K83P42j75j006j185
$$ 151906 147741 144978 143544 142288 140501 138809 137684 136419 134654 133490 133773 134515 134340 133334 132149
56737A32149j642k446k477j791j816k669k738j525n43p48j329j654k190k757k107
$$ 132149 130507 128061 125584 123793 121977 119308 116570 115045 114502 113754 112425 110771 108581 105824 103717
56722A03717j35J389J233K16l98m55l06j53l44r63j110k3J231J017k23o20Q7M15
$$ 103717 103582 104971 106204 106420 106022 105567 105261 105108 104764 103801 102691 102668 103899 104916 104693 104073 104160 104575
56704A04575l9j17M71P46P31J614L250L890K998J986J660J263O24Q38K006K591
$$ 104575 104536 104419 104890 105636 106367 107981 111231 115121 118119 120105 121765 123028 123652 124490 126496 129087
56688A29087J920J221J379J641J413J363J839K004J428R13R95J206J337J831K459
$$ 129087 131007 132228 133607 135248 136661 138024 139863 141867 143295 144208 145203 146409 147746 149577 152036
56673A52036K265J265N04K25l17j022q71Q7N68J49l17n08q52r97j41J067J219
$$ 152036 154301 155566 156070 156295 155978 154956 154085 154172 154740 154889 154572 154064 153212 152215 152074 153141 154360
56656A54360O42Q28J479Q80p50j277m04k63j662k783k571k408l239l865l408k930
$$ 154360 155002 155830 157309 158189 157439 156162 155758 155495 153833 151050 148479 146071 142832 138967 135559 132629
56640A32629l252l552l377l611m263l729j571L12O19M73J044J646J567J573K145
$$ 132629 129377 125825 122448 118837 114574 110845 109274 109586 110205 110678 111722 113368 114935 116508 118653
56625A18653K350J812J727K574K913J852O66N65Q33N83M09Q91J299J056P68O49
$$ 118653 121003 122815 124542 127116 130029 131881 132547 133112 133945 134528 134937 135828 137127 138183 138951 139600
56609A39600j60j639k240j315k18L4J27M62J08j136j822j292p87r69o76O08J486
$$ 139600 139440 137801 135561 134246 134028 134062 134189 134651 134759 133623 131801 130509 129722 128753 128077 128685 130171
56592A30171J200J033J702J891R63N81J784K892K373J453J792K654K558J826J395
$$ 130171 131371 132404 134106 135997 136960 137541 139325 142217 144590 146043 147835 150489 153047 154873 156268
56577A56268R50J80J41J393K565K504K120K346K324J443J083K229L354K917K083
$$ 156268 157218 157398 157539 158932 161497 164001 166121 168467 170791 172234 173317 175546 178900 181817 183900
56562A83900K613L822M085L795M363N561O195O376O966P785Q245Q812J0007J1027
$$ 183900 186513 190335 194420 198215 202578 208139 214334 220710 227676 235461 243706 252518 262525 273552
56548B73552J0999J0521J0508J0670J0533J0548J0863J0517R288Q577R028R105
$$ 273552 284551 295072 305580 316250 326783 337331 348194 358711 367999 376576 385604 394709
56536C94709P635N851N115M540K840P07o85j872l749n593o485p168q525r774j0063
$$ 394709 402344 408195 413310 417850 420690 421397 420712 418840 415091 409498 403013 395845 387320 377546 367483
56521C67483j0308j1440j2420j2024j1102j0979j1129j0440r322q643p997o947
$$ 367483 357175 345735 333315 321291 310189 299210 288081 277641 268319 259676 251679 244732
56509B44732o386o824o941n736m444m321m382l430k446k651l011k081p17m81q95
$$ 244732 238346 231522 224581 218845 214401 210080 205698 202268 199822 197171 194160 192079 191362 190881 189986
56494A89986o90l04p08j152n29L27J19m65q8P54Q25M02L37K41k79j54J202K112
$$ 189986 189296 188992 188284 187132 186603 186930 187049 186584 186496 187250 188075 188477 188814 189055 188776 188622 189824 191936
56476A91936J099m13k72J134K066K316K523K234J062K95R78K013K247K619L952
$$ 191936 193035 192622 192350 193484 195550 197866 200389 202623 203685 203980 204958 206971 209218 211837 215789
56461B15789M781L991L286M341N680N451M911N824O706N451L601L991N837O343
$$ 215789 220570 224561 227847 232188 237868 243319 248230 254054 260760 266211 269812 273803 279640 285983
56447B85983N699O228P683P773O565O221O830O528N373N147N582M695K804K404
$$ 285983 291682 297910 305593 313366 319931 326152 332982 339510 344883 350030 355612 360307 363111 365515
56433C65515L917N062M677L899L413K643J878K152K906K543J264O22M66p64k880
$$ 365515 369432 374494 379171 383070 386483 389126 391004 393156 396062 398605 399869 400491 400957 400193 397313
56418C97313l999l705l396l615l690l829m898o351o940p109q135r465r532q595
$$ 397313 393314 389609 386213 382598 378908 375079 370181 363830 356890 349781 341646 332181 322649 314054
56404C14054q129q030p188o036n698n430l906k156k104l034k826j867k281l876
$$ 314054 305925 297895 290707 284671 278973 273543 269637 267481 265377 262343 259517 257650 255369 251493
56390B51493m456l758l566m127l940k839k061j437K41K368L253L317M401O351
$$ 251493 247037 243279 239713 235586 231646 228807 226746 225309 225550 227918 231171 234488 238889 245240
56376B45240P491P860Q605Q887O983L899K087J155j254m776o558n998n220m969
$$ 245240 252731 260591 269196 278083 285066 288965 291052 292207 290953 286177 279619 273621 268401 263432
56362B63432l957k321j679j771q60M91R1j515j497K94J079J77p6J087J599P39
$$ 263432 259475 257154 255475 253704 252844 253335 253426 251911 250414 250708 251787 251964 251888 252975 254574 255313
56346B55313M61J550K207J477O30M00Q4p7R88K487K599K030L030M964M972L091
$$ 255313 255774 257324 259531 261008 261638 262038 262122 262045 263033 265520 268119 270149 273179 278143 283115 286206
56330B86206K365L546M189L579L926N811O847O067N488O132O470N938O036O994
$$ 286206 288571 292117 296306 299885 303811 309622 316469 322536 328024 334156 340626 346564 352600 359594
56316C59594P091O261O469P775P957O735O247O722O069M408M414O198O636M867
$$ 359594 366685 372946 379415 387190 395147 401882 408129 414851 420920 425328 429742 435940 442576 447443
56302D47443L718M319M171K157O83J035J146r8p89j26k59k041l222k730k632l900
$$ 447443 451161 455480 459651 461808 462491 463526 464672 464574 463785 463659 463400 461359 458137 455407 452775 448875
56286D48875m455l329k508k866k532j060p87k063j737J382M106M147L400L631
$$ 448875 444420 441091 438583 435717 433185 432125 431338 429275 427538 428920 433026 437173 440573 444204
56272D44204L476K280K434N038P382P526P413Q748R897R602R833J2060J4472J5579
$$ 444204 447680 449960 452394 457432 464814 472340 479753 488501 498398 508000 517833 529893 544365 559944
56258E59944J6878J9399K1505K2580K4959K9557L3643L5605L7840M2172M6457
$$ 559944 576822 596221 617726 640306 665265 694822 728465 764070 801910 844082 890539
56247H90539M8686N0406N3124N5246N5532N5642N6283N4834M9857M4027L9381
$$ 890539 939225 989631 1042755 1098001 1153533 1209175 1265458 1320292 1370149 1414176 1453557
56236A453557L3669K4712J4596O157j100q293j4060j7357j9907k2733k3721k1588
$$ 1453557 1487226 1511938 1526534 1532691 1531591 1523298 1509238 1491881 1471974 1449241 1425520 1403932
56224A403932j8704j7067j5230j2065r706r630r721q388p744r486j1566j2235
$$ 1403932 1385228 1368161 1352931 1340866 1331160 1321530 1311809 1303421 1295677 1286191 1274625 1262390
56212A262390j3453j6909k0514k2267k3742k6523k8911k9478k9976l1538l1962
$$ 1262390 1248937 1232028 1211514 1189247 1165505 1138982 1110071 1080593 1050617 1019079 987117
56201I87117k9950k7904k7372k6080k2713j9990j9471j8184j4234j0965j1285
$$ 987117 957167 929263 901891 875811 853098 833108 813637 795453 781219 770254 758969
56190G58969j2436j0909q203p201p002n802m896n473n357l102j222j452j169J462
$$ 758969 746533 735624 727421 720220 713218 707416 702520 697047 691690 688588 687366 685914 684745 686207
56176F86207L514K752K103M150O093N119L759M800N697L538P60L85K57k262m551
$$ 686207 689721 692473 694576 698726 704819 709938 713697 718497 724194 727732 728492 728877 729134 726872 722321
56161G22321l634k271l967o276n421l426m076n715m731k627l010m671m239k609
$$ 722321 718687 716416 712449 706173 700752 697326 693250 687535 682804 680177 677167 672496 668257 665648
56147F65648k587l082j616L65N33P99L736P156P899P643R285J1226J0979J0618
$$ 665648 663061 659979 658363 658728 659261 660060 663796 670952 678851 686494 695779 707005 717984 728602
56133G28602J2800J5259J5221J5217J8357K2019K2645K2566K5568K9800L1870
$$ 728602 741402 756661 771882 787099 805456 827475 850120 872686 898254 928054 959924
56122I59924L3671L8362M3765M6945N1013O0108P1844Q2260R3936J11461J32842
$$ 959924 993595 1031957 1075722 1122667 1173680 1233788 1305632 1387892 1481828 1593289 1726131
56111A726131J53378J73771J96034K15129K23223K19249K06657J85881J57484
$$ 1726131 1879509 2053280 2249314 2464443 2687666 2906915 3113572 3299453 3456937
56102C456937J28878J08721R7076Q8552Q1225P4386O2122L9037R593j6736l6542
$$ 3456937 3585815 3694536 3791612 3880164 3961389 4035775 4097897 4136934 4146527 4129791 4093249
56091D093249n1068n8828n9455o0906p2667r4375j19512j46096j74125j97072
$$ 4093249 4042181 3983353 3923898 3862992 3790325 3695950 3576438 3430342 3256217 3059145
56081C059145k06971k05034j97450j84361j63164j38604j18330j01600q3206o5132
$$ 3059145 2852174 2647140 2449690 2265329 2102165 1963561 1845231 1743631 1660425 1595293
56071A595293n3185m5408l5442k4468j8400j6133j2052p154o126o510k640K820
$$ 1595293 1542108 1496700 1461258 1436790 1418390 1402257 1390205 1383051 1376925 1370415 1367775 1370595
56059A370595L365J345L740Q698R211O983R157J4198J4837J2422J4318J9432K0558
$$ 1370595 1373960 1375305 1379045 1387743 1396954 1403937 1413094 1427292 1442129 1454551 1468869 1488301 1508859
56046A508859J8810K1293K6520K6851K3613K4923L0150L1538K9603L1740L7151
$$ 1508859 1527669 1548962 1575482 1602333 1625946 1650869 1681019 1712557 1742160 1773900 1811051
56035A811051L8550L7289M1016M7773M8588M4424M4304M7933M6994M2343M2693
$$ 1811051 1849601 1886890 1927906 1975679 2024267 2068691 2112995 2160928 2207922 2250265 2292958
56024B292958M7310M7463M4055M6011N2238N3399N0554N3377O0917O3359O1835
$$ 2292958 2340268 2387731 2431786 2477797 2530035 2583434 2633988 2687365 2748282 2811641 2873476
56013B873476O6506P5948P9096P6869Q0603Q9655R2669R0632R5657J07040J12104
$$ 2873476 2939982 3015930 3095026 3171895 3252498 3342153 3434822 3525454 3621111 3728151 3840255
56002C840255J11189J17396J30826J38168J38889J46128J60417J68946J72249
$$ 3840255 3951444 4068840 4199666 4337834 4476723 4622851 4783268 4952214 5124463
55993E124463J84105K03389K14571K18036K30303K51989K66521K73023K88312
$$ 5124463 5308568 5511957 5726528 5944564 6174867 6426856 6693377 6966400 7254712
55984G254712L13398L31739L43927L68869M06761M37938M62425N01664N56430
$$ 7254712 7568110 7899849 8243776 8612645 9019406 9457344 9919769 10421433 10977863
55975A0977863O04594O45974P05579P86076Q63709R38675J040110J172799J311922
$$ 10977863 11582457 12228431 12934010 13720086 14583795 15522470 16562580 17735379 19047301
55966A9047301J460101J653119J898665K171100K479396K873853L371828L949677
$$ 19047301 20507402 22160521 24059186 26230286 28709682 31583535 34955363 38905040
55958C8905040M623267N454878O464671P632466R014882J0761553J2998312J5828457
$$ 38905040 43528307 48983185 55447856 63080322 72095204 82856757 95855069 111683526
55950A11683526J9478975K4253758L0205131L6904375M3441272M8255741M8861762
$$ 111683526 131162501 155416259 185621390 222525765 265967037 314222778 363084540
55943C63084540M2465895K7929949P528219j3652261l0565621m0758817m4604360
$$ 363084540 405550435 433480384 441008603 427356342 396790721 356031904 311427544
55936C11427544m3835358m0254177l5339059l0187973k5408775k1174353j7501251
$$ 311427544 267592186 227338009 191998950 161810977 136402202 115227849 97726598
55929I7726598j4417817j1900254r835082q124987o742829n650898m761417m012269
$$ 97726598 83308781 71408527 61573445 53448458 46705629 41054731 36293314 32281045
55921C2281045l402755k924422k526590k176356j887519j664118j472689j293108
$$ 32281045 28878290 25953868 23427278 21250922 19363403 17699285 16226596 14933488
55913A4933488j143033j030013r28413q24026p35580o72569o14362n49418m95028
$$ 14933488 13790455 12760442 11832029 11008003 10272423 9599854 8985492 8436074 7941046
55904G941046m60469m28121l87902l54909l36730l16961k86818k61235k48481
$$ 7941046 7480577 7052456 6664554 6309645 5972915 5655954 5369136 5107901 4859420
55895D859420k34199k10208j90130j82054j73190j55635j41123j36779j31262
$$ 4859420 4625221 4415013 4224883 4042829 3869639 3714004 3572881 3436102 3304840
55886C304840j18013j08131j07552j04691r3057q3713q3331q1594p2146o4984
$$ 3304840 3186827 3078696 2971144 2866453 2773396 2689683 2606352 2524758 2452612 2387628
55876B387628o6193o5777n7191m9536m8948m6746l7169k8644k6498k2170j0189
$$ 2387628 2321435 2255658 2198467 2148931 2099983 2053237 2016068 1987424 1960926 1938756 1928567
55865A928567J347P487J6496L2853M6893N1704N4033N8078N4670L7537J5204l935
$$ 1928567 1929914 1937401 1953897 1986750 2033643 2085347 2139380 2197458 2252128 2289665 2304869 2300934
55853B300934k3687m6947o5378p3236p7839q5479q9940q5332p7650p3162o7649
$$ 2300934 2277247 2230300 2164922 2091686 2013847 1928368 1838428 1753096 1675446 1602284 1534635
55842A534635n7329m8506m6156m4320l7827l2425l3499l5657l3310l1011l3568
$$ 1534635 1477306 1428800 1382644 1338324 1300497 1268072 1234573 1198916 1165606 1134595 1101027
55831A101027l6098l3531l0203l0593l0105k4352j8350j7273j7045j3063r371
$$ 1101027 1064929 1031398 1001195 970602 940497 916145 897795 880522 863477 850414 841043
55820H41043j0193j1030p094k358j303J79O956J5499K1035K6307L4581M1036L9410
$$ 841043 830850 819820 812726 810368 809065 809244 816200 831699 852734 879041 913622 954658 994068
55807I94068L0746J8346J371j9089l5090m1067m1452m2022m0892l5304k9590k8321
$$ 994068 1024814 1043160 1044531 1025442 990352 949285 907833 865811 824919 789615 760025 731704
55795G31704k8338k5515k2757k3551k4214k0541j5859j4617j4187j0759p315p800
$$ 731704 703366 677851 655094 631543 607329 586788 570929 556312 542125 531366 524051 516251
55783E16251r179p221m611n535p438n949l026k630l049q32K192K774K565L888
$$ 516251 507072 499851 495240 489705 482267 476318 473292 470662 467613 466781 468973 471747 474312 478200
55769D78200L941j27n150p359q940j2628j5113j2752q865q116q480n911k387j991
$$ 478200 482141 482014 476864 469505 460565 447937 432824 420072 411207 403091 394611 388700 386313 384322
55755C84322l317l022k821n711r233r579q592r716j0905q673n396n342o875n799
$$ 384322 381005 377983 375162 369451 360218 350639 342047 332331 321426 312753 307357 302015 295140 289341
55741B89341l291l230m694m157k517l027m634m133k502k767l811k652n41o72k053
$$ 289341 286050 282820 278126 273969 271452 268425 263791 259658 257156 254389 250578 247926 247385 246713 244660
55726B44660j658m68j472l730m216l464l898m687l675k198k674l701k673q94r20
$$ 244660 243002 242534 241062 237332 233116 229652 225754 221067 217392 215194 212520 208819 206146 205252 204332
55711B04332j512l55R62Q6q53J296M790O121O262Q015R847Q476N317M231M964
$$ 204332 202820 202465 203427 203513 202660 203956 208746 214867 221129 229144 238991 247467 252784 257015 261979
55696B61979M634L707M572O031N107K678J767J852L38k161l427m562p749j0967
$$ 261979 266613 270320 274892 280923 286030 288708 290475 292327 292665 290504 287077 282515 274766 263799
55682B63799j0655p924o557o449m807k262j892l409l968l673m834o791o880n556
$$ 263799 253144 245220 238663 232214 227407 225145 223253 219844 215876 212203 207369 200578 193698 188142
55668A88142n367n950n157l841m320n351l929r04M36J62Q73K250J866L54L51J309
$$ 188142 182775 176825 171668 167827 163507 158156 154227 153323 153759 153921 154794 157044 158910 159264 159615 160924
55652A60924O94o77j8J653P74k353m008l442l329m134l583j730j206k274k513
$$ 160924 161618 160941 160923 162576 163350 160997 156989 153547 150218 146084 142501 140771 139565 137291 134778
55637A34778j595j637k712k658j388r75j544j347o17r95j712p45Q35L54j337j034
$$ 134778 133183 131546 128834 126176 124788 123813 122269 120922 120305 119310 117598 116853 117688 118042 116705 115671
55621A15671J067J839R66J088K410K407R40O31J829K053Q14K80Q17M60q81j193
$$ 115671 116738 118577 119543 120631 123041 125448 126388 127019 128848 130901 131715 131995 132812 133272 132391 131198
55605A31198n78j202k824k971j724j707l072l230j937j834l362l813k287j067
$$ 131198 130620 129418 126594 123623 121899 120192 117120 113890 111953 110119 106757 102944 100657 99590
55591I9590j220j182n56r77k380k517j103m39j175j384m79q2m11J71J469J407
$$ 99590 98370 97188 96632 95655 93275 90758 89655 89216 88041 86657 86178 86096 85685 85856 87325 88732
55575H8732J68K46J916K874K877M199O808P749O466O211Q738J1808J3486J4767
$$ 88732 88900 89146 91062 93936 96813 101012 107820 115569 122035 128246 136984 148792 162278 177045
55561A77045J6398J6950J5700J3918J1888Q085K493k595o191r631j3151j5055
$$ 177045 193443 210393 226093 240011 251899 259984 262477 259882 253691 244060 230909 215854
55549B15854j5178j5456j6088j4971j1969r833r652r252p475o091o038n570l819
$$ 215854 200676 185220 169132 154161 142192 132359 122707 113455 105980 99889 93851 88281 84462
55536H4462k566k787k868j885j280j736j795j065j401l236m331l740l613n189
$$ 84462 81896 79109 76241 74356 73076 71340 69545 68480 67079 63843 59512 55772 52159 46970
55522D6970o464n854m950n520o697p249B414f450q917o801l341N98N192R562A263
$$ 46970 40506 34652 29702 24182 17485 10236 2414 -6450 -15367 -22168 -25509 -24911 -19719 -10157 1263
55506A1562Q408P144N447K964J518J869K080R44K7M98Q57j82j325j304j246k316
$$ 11562 19970 27114 32561 35525 37043 38912 40992 41936 41963 42461 43318 43136 41811 40507 39261 36945
55490C6945l413l276k694k706k701k071j627j803j508l58J34q70j914j715j101
$$ 36945 33532 30256 27562 24856 22155 20084 18457 16654 15146 14788 14922 14052 12138 10423 9322
55475I322j003p00M75J709K366L042L797L522K258J814K768L224J844j02j073
$$ 9322 8319 7619 8094 9803 12169 15211 19008 22530 24788 26602 29370 32594 34438 34336 33263
55460C3263j331j394p63M97J076N77K37N31L71l89k95Q56J233J69o53l50k54q98
$$ 33263 31932 30538 29775 30272 31348 31925 32162 32693 33064 32675 32380 33236 34469 34638 33985 33635 33381 32483
55442C2483p25O37J060l79j394l13J082P67k05m3O52N89M36J270K255K095J202
$$ 32483 31758 32395 33455 33076 31682 31369 32451 33218 33013 32970 33622 34211 34647 35917 38172 40267 41469
55425D1469N62J08k41K26J318J516M84j28K64kj553k337j141J25l01j085m51P70
$$ 41469 42031 42139 41898 42124 43442 44958 45442 45314 45578 45576 44023 41686 40545 40670 40369 39284 38833 39603
55407C9603J119J229K103K879K698K763M153N618N809N706O501P033N717L244
$$ 39603 40722 41951 44054 46933 49631 52394 56547 62165 67974 73680 80181 87214 92931 96175
55393I6175J126o91k593l635l349l293m585n747n196l982l724l866l284k703l025
$$ 96175 97301 96610 94017 90382 87033 83740 79155 73408 68212 64230 60506 56640 53356 50653 47628
55378D7628l153k023r66j513k518k128r15l97j61Q37J610O95r09j219n16n03j212
$$ 47628 44475 42452 41486 39973 37455 35327 34412 34015 33854 34691 36301 36996 36087 34868 34352 33849 32637
55361C2637j413j072r54o36N89J720J330L3m97j75r3l06j27J81m0m13m02n61j336
$$ 32637 31224 30152 29198 28562 29151 30871 32201 32234 31737 31562 31469 31163 31036 31217 31177 30764 30362 29801 28465
55342B8465j754j070l08m36m95N03J486J234P71J534K617K323J081L59j6r17j563
$$ 28465 26711 25641 25333 24897 24402 24905 26391 27625 28396 29930 32547 34870 35951 36310 36294 35377 33814
55325C3814p98L91K48p25p42R1J85o18r85n34rM27J084J437R04K28L03M66k25
$$ 33814 33016 33407 33655 32930 32188 32279 32464 31846 30861 30327 30318 30745 31829 33266 34170 34398 34701 35167 34942
55306C4942j066r91o63j189j880j442l52J32K71Q61J154J15j208j051J23M93j40
$$ 34942 33876 32885 32222 31033 29153 27711 27359 27491 27762 28623 29777 29892 28684 27633 27756 28249 28109
55289B8109n71n53o41m65M86J141K46j224j388l59M41R20J845K613K067Q67N20
$$ 28109 27538 26985 26344 25879 26365 27506 27752 26528 25140 24781 25222 26142 27987 30600 32667 33534 34054
55272C4054P50K28p48q05r0K64N48J786L280L409K391J698J329K92q59p68J0j85
$$ 34054 34804 35032 34284 33479 33389 33653 34201 35987 39267 42676 45067 46765 48094 48386 47527 46759 46769 46584
55254D6584r93o44O09O82p95j990k057j946j933j091L72R08K40j84K50N61L10
$$ 46584 45591 44947 45556 46238 45443 43453 41396 39450 37517 36426 36798 37706 37946 37762 38012 38573 38883
55237C8883K69O06M55l15q35r45j282j626j075N0M72J08J8L07J03n24o48l65n45
$$ 38883 39152 39758 40213 39898 39063 38118 36836 35210 34135 34185 34657 34765 34783 35090 35193 34669 34021 33656 33111
55218C3111r04m29M88N94J57N43J581J782J127J079J819J956J149N93O04J81p44
$$ 33111 32207 31778 32266 32860 33017 33560 35141 36923 38050 39129 40948 42904 44053 44646 45250 45431 44687
55201D4687r64l09k3m23m04L30O99K60j57j85k84k30P05J925J985R44J75j17q44
$$ 44687 43723 43414 43391 42968 42564 42894 43593 43853 43696 43511 43227 42997 43702 45627 47612 48556 48731 48614 47770
55182D7770j683j317j57o6j106j329j96N22j08q70r56j172j691j252L16J203M69
$$ 47770 46087 44770 44613 44547 43441 42112 41916 42438 42330 41460 40504 39332 37641 36389 36705 37908 38377
55165C8377m54k84K23R3k12j02l4k59j34L78K85n50q68j70M15K36J30N59O55L9
$$ 38377 37923 37639 37862 37955 37743 37641 37607 37348 37214 37592 37877 37327 36459 36289 36704 36940 37070 37629 38284 38323
55145C8323k81J92M85N2k04K92O99M45K64O23Q07M31K16M22K24n19p45j82o2q99
$$ 38323 38042 38234 38719 38771 38567 38859 39558 40003 40267 40890 41697 42128 42344 42766 42990 42471 41726 41544 41482 40583
55125D0583j471r46j99kK51R51J333J220J792L389M351L489J938J124N64p41k173
$$ 40583 39112 38166 37967 37965 38216 39167 40500 41720 43512 46901 51252 54741 56679 57803 58367 57626 55453
55108E5453k466j705q89m32k57m59q43p07qK95k53q56q60o41m70J18J096J509
$$ 55453 52987 51282 50393 49961 49704 49245 48402 47695 47687 47982 47729 46873 46013 45372 44902 45020 46116 47625
55090D7625J030N78P08Q73Q34J158J658J198j50o60L77J407J184N72N83N49j48
$$ 47625 48655 49233 49941 50814 51648 52806 54464 55662 55512 54852 55229 56636 57820 58392 58975 59524 59376
55073E9376m67M91J575J355L60j12j76n69q70l64K56j74j327j876j412n39K99
$$ 59376 58909 59400 60975 62330 62690 62578 62402 61833 60963 60599 60855 60681 59354 57478 56066 55527 55826
55056E5826Q98Q45J46l21N3O80Q07O61O93O27K36Q5N39R58Q01N84P81Q23K02m68
$$ 55826 56724 57569 57715 57394 57447 58127 58934 59595 60288 60915 61151 61236 61775 62733 63534 64118 64899 65722 65924 65456
55036F5456m78k36l29l78K01J057J559J777J907J704J215J173J750J970J226L76
$$ 65456 64978 64742 64413 64035 64236 65293 66852 68629 70536 72240 73455 74628 76378 78348 79574 79950
55020G9950L47P06O21K84K96N09M84L81N31Q08J010J131Q25l34j714k007j236
$$ 79950 80297 81003 81624 81908 82204 82713 83197 83578 84109 84917 85927 87058 87883 87549 85835 83828 82592
55003H2592r76j934k911k907k635k904l115k530j694j367j309j128j097j178o50
$$ 82592 81616 79682 76771 73864 71229 68325 65210 62680 60986 59619 58310 57182 56085 54907 54257
54988E4257L03K81j073k113j694q94q96r55j50N81J13o12p1J270J851J554J371
$$ 54257 54560 54841 53768 51655 49961 49067 48171 47216 47066 47647 47760 47148 47077 48347 50198 51752 53123
54971E3123J385R97N14P60J531J969J963J895J683J277J328K161K917K931K990
$$ 53123 54508 55505 56019 56779 58310 60279 62242 64137 65820 67097 68425 70586 73503 76434 79424
54956G9424L950N163N723O125P154Q221Q415Q305Q981J0195J1053J1722J2809
$$ 79424 83374 88537 94260 100385 107539 115760 124175 132480 141461 151656 162709 174431 187240
54943A87240J3837J3997J3612J3226J1987Q699L880q67m990q909j2468j4938j6153
$$ 187240 201077 215074 228686 241912 253899 262598 266478 265611 260621 251712 239244 224306 208153
54930B08153j6266j5088j2893j0976r999q856o662m748m717n694n572m229l219
$$ 208153 191887 176799 163906 152930 142931 134075 127413 122665 117948 112254 106682 102453 99234
54917I9234k932k316j131k75N3O00J505K174K609L249L776L712L841N393Q057
$$ 99234 96302 93986 92855 92580 92633 93233 94738 96912 99521 102770 106546 110258 114099 119492 127549
54902A27549J0404J1989J3383J4501J4565J3484J1640Q696M302m69m135o888r854
$$ 127549 137953 149942 163325 177826 192391 205875 217515 226211 230513 230044 225909 219021 209167
54889B09167j2689j3915j3415j2505j1673j0245q310o945o303n378l917k796k291
$$ 209167 196478 182563 169148 156643 144970 134725 126415 119470 113167 107789 103872 101076 98785
54876I8785j665p56k63k23J50Q79J056M76j33o52j681k895l044j994j130j295
$$ 98785 97120 96364 96101 95878 96028 96907 97963 98439 98306 97654 95973 93078 90034 88040 86910 85615
54860H5615j882k343l031l962m299l701k923k425j675l54Q46J251J037O43K20
$$ 85615 83733 81390 78359 74397 70098 66397 63474 61049 59374 59020 59866 61117 62154 62797 63017
54845F3017j3K40O88O95K80K5k0k97p45r31j008j382j602r55njp93r60j25N36
$$ 63017 63004 63244 63932 64627 64907 64932 64912 64615 63870 62939 61931 60549 58947 57992 57987 57986 57193 56233 56108 56644
54825E6644L46K4L5k50j096j521p80M43J057Q59K76k94m17K44J299J868J739J480
$$ 56644 56990 57014 57049 56799 55703 54182 53402 53845 54902 55761 56037 55743 55326 55570 56869 58737 60476 61956
54807F1956J413J411J689K575L536L658L211L373M265M803M718N126O522P832
$$ 61956 63369 64780 66469 69044 72580 76238 79449 82822 87087 91890 96608 101734 108256 116088
54793A16088Q314Q975J1011J3905J6178J7210J7332J6731J5169J2511Q898M638
$$ 116088 124402 133377 144388 158293 174471 191681 209013 225744 240913 253424 262322 266960
54781B66960K30l822p379j0398j2374j2735j1874j0976j0636j0349r504q187o801
$$ 266960 267190 263368 255989 245591 233217 220482 208608 197632 186996 176647 167143 158956 152155
54768A52155n511m335l173j797k78P97J116J376K441M105N534O564P610Q672R529
$$ 152155 146644 142309 139136 137339 137061 137858 138974 140350 142791 146896 152430 158994 166604 175276 184805
54753A84805J0645J2626J5059J7097J8848K0845K2451K2320K0460J8124J5706
$$ 184805 195450 208076 223135 240232 259080 279925 302376 324696 345156 363280 378986
54742C78986J2258P346J818l566q796j3591j7193j9518k1197k2173k1642j9670
$$ 378986 391244 398590 400408 396842 388046 374455 357262 337744 316547 294374 272732 253062
54730B53062j7478j5650j3592j1108r080p988p148o042n112m622m010l010k252
$$ 253062 235584 219934 206342 195234 186154 178166 171018 164976 159864 155242 151232 148222 145970
54717A45970k091k040j856k054k800l388l422l342l328k898k052j601j796j922
$$ 145970 143879 141839 139983 137929 135129 131741 128319 124977 121649 118751 116699 115098 113302 111380
54703A11380j722j866k445k454j574r51j321j729j212m48m91r81r10k98J38K91
$$ 111380 109658 107792 105347 102893 101319 100368 99047 97318 96106 95658 95167 94186 93276 92978 93116 93407
54687I3407M85N27O2n31m92K74J227J932K251K164J926J990K420K800K928L068
$$ 93407 93892 94419 94481 93950 93458 93732 94959 96891 99142 101306 103232 105222 107642 110442 113370 116438
54671A16438L358L635M003M715N361N109M010L104K936K907K459J896J607J463
$$ 116438 119796 123431 127434 132149 137510 142619 146629 149733 152669 155576 158035 159931 161538 163001
54657A63001J440J853K575K974L040L571M870O241P234Q332R908J1569J3030J4667
$$ 163001 164441 166294 168869 171843 174883 178454 183324 189565 196799 205131 215039 226608 239638 254305
54643B54305J6690J8741K0724K2982K5276K6616K6466K5003K1868J6077P755j336
$$ 254305 270995 289736 310460 333442 358718 385334 411800 436803 458671 474748 482503 481167
54631D81167r638j6864k2766k6356k7241k6435k4937k2677j9646j6755j4665j2870
$$ 481167 471529 454665 431899 405543 378302 351867 326930 304253 284607 267852 253187 240317
54619B40317j0831q900p343n750m159l445l589l048j058P94O21j190k807l363
$$ 240317 229486 220586 213243 207493 203334 199889 196300 193252 192194 192988 193609 192419 189612 186249
54605A86249l243k926k785l342m479n116m620l794l585l749l754l878m359m533
$$ 186249 183006 180080 177295 173953 169474 164358 159738 155944 152359 148610 144856 140978 136619 132086
54591A32086l976l472l616l617k764j965k313l121k997k031j352j229j170j250
$$ 132086 128110 124638 121022 117405 114641 112676 110363 107242 104245 102214 100862 99633 98463 97213
54577I7213j751k041j453o88q08j329r88k4Q9r69j886j744j058o01m24k95j24
$$ 97213 95462 93421 91968 91280 90472 89143 88155 88131 88220 87251 85365 83621 82563 81962 81538 81243 81119
54560H1119J89O41Q79P44P03J059J206N75j89o8Q23J568J890K119K210J945J767
$$ 81119 81308 81949 82828 83572 84275 85334 86540 87115 86926 86858 87681 89249 91139 93258 95468 97413 99180
54543I9180K308L247L755L759L778L853L773L937M927O441P781R029J0630J2131
$$ 99180 101488 104735 108490 112249 116027 119880 123653 127590 132517 138958 146739 155768 166398 178529
54529A78529J2638J2244J1811J1412J0229P908M906J578j960n176p416q860j0166
$$ 178529 191167 203411 215222 226634 236863 244771 249677 251255 249295 244119 236703 227843 217677
54516B17677j1226j1268j0147q598p281o391o011n952n485m198k875k473k647
$$ 217677 206451 195183 185036 176438 169157 162766 156755 150803 145318 141120 138245 135772 133125
54503A33125k342j565j269j624j823j564j437j678j801j670j748k050j908j086
$$ 133125 130783 129218 127949 126325 124502 122938 121501 119823 118022 116352 114604 112554 110646 109560
54489A09560k11K43M83O79N95K22mJ41L89N44P03P96N70J19j50r9J02M14P98Q20
$$ 109560 109349 109592 110075 110754 111349 111571 111567 111708 112097 112641 113344 114140 114710 114829 114679 114580 114682 115096 115894 116714
54469A16714J56o69q11l07N9k8j44p6k30q42j541j828j625j281j267j733k125
$$ 116714 116870 116201 115390 115083 115142 115114 114970 114894 114664 113822 112281 110453 108828 107547 106280 104547 102422
54452A02422j678n68J16j9m4O38J030J11j291j638j002p03j055j170p99o54q59
$$ 102422 100744 100176 100292 100273 100229 100867 101897 102008 100717 99079 98077 97374 96319 95149 94350 93696 92837
54435I2837p20k09j49n99o26q2j14j194j959j019J050K393K062P39k93l42K75
$$ 92837 92117 91908 91759 91160 90534 90452 90338 89144 87185 86166 87216 89609 91671 92410 92117 91775 92050
54418I2050O92M73J03K78J008J881K820L844M414M001L098K731L032L272L170
$$ 92050 92742 93215 93318 93596 94604 96485 99305 103149 107563 111564 114662 117393 120425 123697 126867
54403A26867L222L681M259M862N654O319O233N457M656L969K941J607N94N1n23
$$ 126867 130089 133770 138029 142891 148545 154864 161097 166554 171210 175179 178120 179727 180321 180372 179849
54388A79849j215j528j518j981l185m352m771m636m392m165m094m421m852m646
$$ 179849 178634 177106 175588 173607 170422 166070 161299 156663 152271 148106 144012 139591 134739 130093
54374A30093l626k464j731j365j190j220j335j350j533k227k956k762j599m68
$$ 130093 126467 124003 122272 120907 119717 118497 117162 115812 114279 112052 109096 106334 104735 104267
54360A04267p5j44j36K40J188K507L156K268O98L33J640L172L669L416L133K896
$$ 104267 104192 104048 103912 104152 105340 107847 111003 113271 113969 114302 115942 119114 122783 126199 129332 132228
54344A32228K765L144L873M027L325K649K506K150J059Q7J03M15k07j625k587
$$ 132228 134993 138137 142010 146037 149362 152011 154517 156667 157726 157813 157916 158331 158124 156499 153912
54329A53912k576k320k626l504m378m664m281l807l903m430m673m485m473m766
$$ 153912 151336 149016 146390 142886 138508 133844 129563 125756 121853 117423 112750 108265 103792 99026
54315I9026m587l537k418k128k423k558k418k310k121j580r31o17n82n15m21m47
$$ 99026 94439 90902 88484 86356 83933 81375 78957 76647 74526 72946 72015 71398 70816 70301 69880 69433
54299F9433m42l09m25j100j870j954j296o58p08j376k025k021j258k55L75N38
$$ 69433 68991 68682 68257 67157 65287 63333 62037 61379 60671 59295 57270 55249 53991 53736 54111 54649
54283E4649M75J09p97j850k098j265j90K71K15K28M73P31Q38O69J51l61j86P57
$$ 54649 55124 55233 54436 52586 50488 49223 49033 49304 49519 49747 50220 50951 51789 52458 52609 52248 52062 52819
54265E2819J591J549R25M92L85J78k29m41k34J71N30Q95J340J599J246K64o77
$$ 52819 54410 55959 56884 57376 57761 57939 57710 57269 57035 57206 57736 58631 59971 61570 62816 63080 62403
54248F2403p69J3R11J407J729K023J682K90j231j437k34J016J236O72R6j18N1
$$ 62403 61634 61647 62558 63965 65694 67717 69399 69689 68458 67021 66787 67803 69039 69711 69807 69689 69740
54231F9740M27N49P9o41r92j041j286j556j201l99j26n99r11n45j15j83m03m74
$$ 69740 70167 70716 70795 70154 69162 68121 66835 65279 64078 63679 63553 62954 62043 61498 61383 61200 60797 60323
54213F0323q28j634k081j536o65m89r51j257j204j247j528j629j189l38M46O70
$$ 60323 59495 57861 55780 54244 53579 53090 52139 50882 49678 48431 46903 45274 44085 43747 44193 44863
54197D4863L04k1L19R08O73n62j619j455m01N35R01Q56N65J60q4j4K40O15J166
$$ 44863 45167 45146 45465 46373 47046 46484 44865 43410 43009 43544 44445 45301 45866 46026 45942 45928 46168 46783 47949
54178D7949J603J361L65p79j564k020k204k013j634j455j311o16M63R41M27k85
$$ 47949 49552 50913 51278 50499 48935 46915 44711 42698 41064 39609 38298 37682 38145 39086 39513 39228
54162C9228m39k36n5K50P21Q54M58J45L63O72O05L62J10m56j223j257j51J078
$$ 39228 38789 38553 38498 38748 39469 40323 40781 40926 41289 41961 42566 42928 43038 42582 41359 40102 39951 41029
54144D1029J340R21P11P85P42P26J010J100L59q15j428j195n86Q8P86J229J116
$$ 41029 42369 43290 44001 44786 45528 46254 47264 48364 48723 47908 46480 45285 44699 44787 45573 46802 47918
54127D7918P11N61Q16J219J482J274M48l98k47Q40J462P07n70j132j077j094r30
$$ 47918 48629 49190 50006 51225 52707 53981 54429 54031 53784 54624 56086 56793 56223 55091 54014 52920 51990
54110E1990N4J342J728J152P09R83J425J476J222Q58L73p2k43l24o96j167j148
$$ 51990 52044 53386 55114 56266 56975 57958 59383 60859 62081 62939 63312 63240 62997 62673 61977 60810 59662
54093E9662n93j72l56q53j066p30j05K65K9n22p52m87j37RN8ol24n00Q8J004R01
$$ 59662 59069 58897 58541 57688 56622 55892 55787 56052 56081 55559 54807 54320 54183 54192 54250 54244 53920 53420 53508 54512 55413
54072E5413m40j463j065j87j05l53J57R68Q21n2k32N22R83N81J37K66M37J35k40
$$ 55413 54973 53510 52445 52258 52153 51800 51957 52925 53746 53694 53462 53984 54967 55548 55685 55951 56388 56523 56283
54053E6283j30M07J005J478J745J868K169K689K766J950J015J077J851J993J191
$$ 56283 56153 56560 57565 59043 60788 62656 64825 67514 70280 72230 73245 74322 76173 78166 79357
54038G9357O53J231K216K502K013J397R84O66L36N6J2M73J495K645L334L454L324
$$ 79357 80010 81241 83457 85959 87972 89369 90353 91019 91355 91411 91423 91896 93391 96036 99370 102824 106148
54021A06148L191L214L645M480N078M853M118L653L571L398L065K992L191L123
$$ 106148 109339 112553 116198 120678 125756 130609 134727 138380 141951 145349 148414 151406 154597 157720
54007A57720K566J922J550J406J355J336J195Q77O20N21J53p63j730k203k499
$$ 157720 160286 162208 163758 165164 166519 167855 169050 169927 170547 171068 171221 170458 168728 166525 164026
53992A64026l057l325k574j460j320k022k060j023l47j100k386k776k237j641
$$ 164026 160969 157644 155070 153610 152290 150268 148208 147185 146838 145738 143352 140576 138339 136698
53978A36698j295r75q32j245k020k611k890l120l292l060k311j424q63q17j134
$$ 136698 135403 134428 133596 132351 130331 127720 124830 121710 118418 115358 113047 111623 110760 109943 108809
53963A08809j464j499j157n79k9J05m35j350j801j304l54K27L19L83N91P54R15
$$ 108809 107345 105846 104689 104110 104081 104186 103751 102401 100600 99296 98942 99169 99488 99871 100462 101216 102131
53946A02131J269J574J386Q95Q21J335J789J666J247J097J434K199L211M128M685
$$ 102131 103400 104974 106360 107255 108076 109411 111200 112866 114113 115210 116644 118843 122054 126182 130867
53931A30867N118N835O637O847O351N916O207O970P450P191O254M900L411J924
$$ 130867 135985 141820 148457 155304 161655 167571 173778 180748 188198 195389 201643 206543 209954 211878
53917B11878L56j304k667l223k972k425j935j404o76Q9O17Q85J187J878K916L745
$$ 211878 212234 210930 208263 205040 202068 199643 197708 196304 195628 195717 196334 197219 198406 200284 203200 206945
53901B06945L852L542L675M531N455N939O292O736O641N383L444J812P77R5j58
$$ 206945 210797 214339 218014 222545 228000 233939 240231 246967 253608 258991 262435 264247 265024 265119 264961
53886B64961J39M52J67m50p86j005j620k317k405k193k661l899m998n531n807
$$ 264961 265100 265552 265719 265269 264483 263478 261858 259541 257136 254943 252282 248383 243385 237854 232047
53871B32047n771m984l864l541m136m484l959l348l363l563l375l172l453l855
$$ 232047 226276 221292 217428 213887 209751 205267 201308 197960 194597 191034 187659 184487 181034 177179
53857A77179l778l328l004k966l195l778m504m702m018k911k061j720j859k352
$$ 177179 173401 170073 167069 164103 160908 157130 152626 147924 143906 140995 138934 137214 135355 133003
53843A33003k752k588k090k017k502k825k556k128j879j459o56k7o4m54p36j018
$$ 133003 130251 127663 125573 123556 121054 118229 115673 113545 111666 110207 109551 109524 109460 109006 108270 107252
53827A07252j436j567j061l69j60l94n71n06l24j0M41P13N08K8k30l9M15P64O70
$$ 107252 105816 104249 103188 102819 102659 102265 101694 101188 100864 100854 101295 102008 102516 102544 102314 102275 102690 103454 104124
53808A04124J09m52m61N3N63P79Q04O36J99j28K22J055J504J356J459K389L513
$$ 104124 104233 103781 103320 103373 103936 104715 105519 106155 106354 106226 106448 107503 109007 110363 111822 114211 117724
53791A17724L896L472K821K342K191K536L377M341N047N400N358M900M327M036
$$ 117724 121620 125092 127913 130255 132446 134982 138359 142700 147747 153147 158505 163405 167732 171768
53777A71768L820L105K078J720K378L114L011K330J813J508R84K09n00j042j457
$$ 171768 175588 178693 180771 182491 184869 187983 190994 193324 195137 196645 197629 197838 197338 196296 194839
53762A94839j619j472j314j440j776k127k424k480k097j610j740k575l316l368
$$ 194839 193220 191748 190434 188994 187218 185091 182667 180187 178090 176480 174740 172165 168849 165481
53748A65481l059k834k544k061j853k250k739k689k259j941j676j194p97r62j470
$$ 165481 162422 159588 157044 154983 153130 150880 148141 145452 143193 141252 139576 138382 137585 136623 135153
53733A35153j710j588j497j532j479j398j538j696j329l59O35J088R33L76l50
$$ 135153 133443 131855 130358 128826 127347 125949 124411 122715 121386 121027 121662 122750 123683 124059 123709
53718A23709r22r33k93N31Q41L96l05n99m85n69j062j312o92M29J120J013L65
$$ 123709 122787 121854 121561 122092 122933 123329 123024 122425 121940 121371 120309 118997 118305 118734 119854 120867 121232
53701A21232n89j535j702n70J116K047K033J988K221J973Q73l09q16p95n79j02
$$ 121232 120643 119108 117406 116836 117952 119999 122032 124020 126241 128214 129087 128778 127962 127167 126588 126486
53685A26486M97O49L56N16J583K794L230K934K415J866J548K029L273M181L727
$$ 126486 126983 127632 127988 128504 130087 132881 136111 139045 141460 143326 144874 146903 150176 154357 158084
53670A58084K056kj720k422j624N2J056P18L2K7L34K63J00L29M64o8o60m36K10
$$ 158084 160140 160138 158418 155996 154372 154424 155480 156198 156230 156257 156591 156854 156954 157283 157747 157679 157019 156583 156793
53651A56793K45k88n33l52l29m25k9P47R97M42j32j22J03o2n77r21p99m74m90
$$ 156793 157038 156750 156217 155865 155536 155111 155082 155829 156826 157268 157136 157014 157117 157055 156478 155557 154758 154284 153794
53632A53794j015j487j265o21m18p18o38O2L93k59r42n74M39J042J214J611K134
$$ 153794 152779 151292 150027 149406 148988 148270 147632 147694 148087 147828 146886 146312 146751 147793 149007 150618 152752
53615A52752K164J794J618J545J009J55k42L3N31J051J756K504K955L268L847
$$ 152752 154916 156710 158328 159873 160882 161037 160795 160828 161359 162410 164166 166670 169625 172893 176740
53600A76740M525M754M468M048L657L297L183L361L327K767K246K357K662K474
$$ 176740 181265 186019 190487 194535 198192 201489 204672 208033 211360 214127 216373 218730 221392 223866
53586B23866K142K489L354L875L881L853L765L205K465K257K468K369K007K129
$$ 223866 226008 228497 231851 235726 239607 243460 247225 250430 252895 255152 257620 259989 261996 264125
53572B64125K709K830K203J675J840K177J899R16l26j270j409p17P3K44J6L1K17
$$ 264125 266834 269664 271867 273542 275382 277559 279458 280374 280048 278778 277369 276652 276725 276969 276985 277016 277233
53555B77233O4k67j88J82J99j02j59j60q07j838k060j137n5L99M46L11k66j085
$$ 277233 277297 277030 276842 277024 277223 277121 276962 276802 275995 274157 272097 270960 270905 271304 271750 272061 271795 270710
53537B70710j225l93N00O94O00Q19J170J323J556K126K545K341J968K214L064
$$ 270710 269485 269092 269592 270286 270886 271705 272875 274198 275754 277880 280425 282766 284734 286948 290012
53522B90012L850M285M721N452O209O444O037N638O106P464Q727R117R083R550
$$ 290012 293862 298147 302868 308320 314529 320973 327010 332648 338754 346218 354945 364062 373145 382695
53508C82695J0544J1323J1684J2195J3186J4332J5271J5917J6226J6327J6811
$$ 382695 393239 404562 416246 428441 441627 455959 471230 487147 503373 519700 536511
53497E36511J8031J9299J9723J9730K0631K2659K4525K5174K4918K4554K4361
$$ 536511 554542 573841 593564 613294 633925 656584 681109 706283 731201 755755 780116
53486G80116K4333K4579K4981K5222K5303K5482K5578K5210K4699K4809K5553
$$ 780116 804449 829028 854009 879231 904534 930016 955594 980804 1005503 1030312 1055865
53475A055865K6230K6781K7893K9522L0512L0120K8851K7379K5740K3969K2451
$$ 1055865 1082095 1108876 1136769 1166291 1196803 1226923 1255774 1283153 1308893 1332862 1355313
53464A355313K1096J9223J6853J5013J4183J3507J2176J0574R349Q452P788P771
$$ 1355313 1376409 1395632 1412485 1427498 1441681 1455188 1467364 1477938 1487287 1495739 1503527 1511298
53452A511298Q283Q087O329L766J559l52k553m742o280p592r716j2693j5606j8024
$$ 1511298 1519581 1527668 1533997 1537763 1539322 1538970 1536417 1531675 1525395 1517803 1508087 1495394 1479788 1461764
53438A461764k0382k2821k4742k5610k5611k5317k5224k5563k6228k6842k7240
$$ 1461764 1441382 1418561 1393819 1368209 1342598 1317281 1292057 1266494 1240266 1213424 1186184
53427A186184k7614k7975k7863k6971k5694k4576k3592k2469k1340k0581k0225
$$ 1186184 1158570 1130595 1102732 1075761 1050067 1025491 1001899 979430 958090 937509 917284
53416I17284j9958j9454j8363j6299j3328j0157p430n066k652j75K112M209O345
$$ 917284 897326 877872 859509 843210 829882 819725 812295 807229 804577 804402 806514 810723 817068
53403H17068Q582J0803J2933J4995J7066J9321K1765K3962K5456K6551K7983K9792
$$ 817068 825650 836453 849386 864381 881447 900768 922533 946495 971951 998502 1026485 1056277
53391A056277L1250L2111L3083L4655L6356L7673L8961M0779M3026M5389M7919
$$ 1056277 1087527 1119638 1152721 1187376 1223732 1261405 1300366 1341145 1384171 1429560 1477479
53380A477479N0545N2626N3781N4619N5888N7484N9031O0812O3153O5375O6378
$$ 1477479 1528024 1580650 1634431 1689050 1744938 1802422 1861453 1922265 1985418 2050793 2117171
53369B117171O6041O5172O4290O3252O1914O0266N7985N4728N0836M7033M3475
$$ 2117171 2183212 2248384 2312674 2375926 2437840 2498106 2556091 2610819 2661655 2708688 2752163
53358B752163L9658L5350L0960K7008K3713K0987J8399J5297J1499P701M603J856
$$ 2752163 2791821 2827171 2858131 2885139 2908852 2929839 2948238 2963535 2975034 2982735 2987338 2989194
53346B989194j458n580j0009j4709k0438k7674l5844m4004n1744n9098o5854p1305
$$ 2989194 2987736 2982156 2972147 2957438 2937000 2909326 2873482 2829478 2777734 2718636 2652782 2581477
53334B581477p4701p5880p5498p4562p3669p2801p1876p1020p0041o8204o5150
$$ 2581477 2506776 2430896 2355398 2280836 2207167 2134366 2062490 1991470 1921429 1853225 1788075
53323A788075o1816n9714n9288n9539n9283n8252n6792n4959n2362m8794m4816
$$ 1788075 1726259 1666545 1607257 1547718 1488435 1430183 1373391 1318432 1266070 1217276 1172460
53312A172460m1467l9287l7664l5413l2068k8359k5181k2517j9634j6112j2278
$$ 1172460 1130993 1091706 1054042 1018629 986561 958202 933021 910504 890870 874758 862480
53301H62480q783o001l866j975R7K435M693O394P342P806Q330R222J0144J0445
$$ 862480 853697 847696 843830 841855 841952 844387 849080 855474 862816 870622 878952 888174 898318 908763
53287I08763J0175J0331J1654J3584J5162J6549J8700K1565K3878K4915K5414
$$ 908763 918938 929269 940923 954507 969669 986218 1004918 1026483 1050361 1075276 1100690
53276A100690K6326K7702K9234L0883L2242L2338L0928K9239K8497K8343K7651
$$ 1100690 1127016 1154718 1183952 1214835 1247077 1279415 1310343 1339582 1368079 1396422 1424073
53265A424073K6298K5105K4421K3818K2911K1590J9638J7033J4489J2884J2167
$$ 1424073 1450371 1475476 1499897 1523715 1546626 1568216 1587854 1604887 1619376 1632260 1644427
53254A644427J1565J0755J0044R388Q094N667K397j069m352p415j0467j3844j7720
$$ 1644427 1655992 1666747 1676791 1686179 1694273 1699940 1702337 1701268 1696916 1689501 1679034 1665190 1647470
53241A647470k1912k6058k9883l3140l5646l7622l9625m1784m3460m4000m3503
$$ 1647470 1625558 1599500 1569617 1536477 1500831 1463209 1423584 1381800 1338340 1294340 1250837
53230A250837m2500m1219l9642l7866l6008l4073l2294l1132l0625l0236k9778
$$ 1250837 1208337 1167118 1127476 1089610 1053602 1019529 987235 956103 925478 895242 865464
53219H65464k9787l0447l0904l0439k9618k9308k9125k8027k6080k4425k3455
$$ 865464 835677 805230 774326 743887 714269 684961 655836 627809 601729 577304 553849
53208E53849k2237j9949j7066j4722j3494j3060j2648j1693j0332r180q503p925
$$ 553849 531612 511663 494597 479875 466381 453321 440673 428980 418648 409468 400965 393040
53196C93040p228o851p121p504p371o968o849o894o694o465o506o299n266m116
$$ 393040 385812 378961 371840 364336 356965 349997 343148 336254 329560 323095 316589 310290 305024 300908
53182C00908m069m977n536n397n530o275o516n456l972l327l478l591l466l604
$$ 300908 296839 291862 286326 280929 275399 269124 262608 257152 253180 249853 246375 242784 239318 235714
53168B35714m206m883n242n181m718l906k898j927j279j246j807k445k625k421
$$ 235714 231508 226625 221383 216202 211484 207578 204680 202753 201474 200228 198421 195976 193351 190930
53154A90930k287k393k593k895l286l253k337j110p57j486k197k055j430r89o68
$$ 190930 188643 186250 183657 180762 177476 174223 171886 170776 170019 168533 166336 164281 162851 161862 161194
53139A61194j97J13j27n65n86k47p6j26Q1O74J208J374J462J840K385K682K677
$$ 161194 160997 161110 160983 160418 159832 159585 159509 159383 159464 160138 161346 162720 164182 166022 168407 171089 173766
53122A73766K702K940L156L136L105L358L678L607L178K831K495J529j78j729
$$ 173766 176468 179408 182564 185700 188805 192163 195841 199448 202626 205457 207952 209481 209303 207574
53108B07574k397k596l068l648l729l462l479l692l362k418j747j984k797l527
$$ 207574 205177 202581 199513 195865 192136 188674 185195 181503 178141 175723 173976 171992 169195 165668
53094A65668l873l757l272k909l182l818l951l343k698k560k609k389k084k005
$$ 165668 161795 158038 154766 151857 148675 144857 140906 137563 134865 132305 129696 127307 125223 123218
53080A23218j938j484q09m89p89j438j945j932j341n67k19m92r48j011o44l26
$$ 123218 121280 119796 118987 118498 117709 116271 114326 112394 111053 110486 110267 109775 108827 107816 107172 106846
53064A06846m18p08o67k18K4m12r64o48L48O23m17j445j029K16N44l06q69l36
$$ 106846 106428 105720 105053 104835 104859 104447 103483 102835 103183 103806 103389 101944 100915 101131 101675 101369 100500 100164
53046A00164L90L16j89k75L1J70N2q8l00o81r06o43k20k62p76j131r77p25r87
$$ 100164 100554 100870 100681 100406 100437 100607 100659 100571 100271 99590 98684 98041 97821 97559 96783 95652 94675 93950 92963
53027I2963j744k300k116j464j070j138j194r00n53m42l40q0j40r01j787j938
$$ 92963 91219 88919 86803 85339 84269 83131 81937 81037 80484 80042 79702 79622 79482 78581 76794 74856
53011G4856j407r53q14o40l81l39l86j49J38m3l95p2Q66J444J310J124J146P83
$$ 74856 73449 72496 71682 71042 70661 70322 69936 69787 69925 69882 69487 69415 70281 71725 73035 74159 75305 76088
52993G6088j07o04j88L95M54M55R76J491J258O52N48R17J069R01R07J248J618
$$ 76088 75981 75377 75189 75584 76038 76493 77469 78960 80218 80870 81418 82335 83404 84305 85212 86460 88078
52976H8078J946K433L113L890M819N771O205N794M968M202L205J498m89j793k252
$$ 88078 90024 92457 95570 99460 104279 110050 116255 122049 127017 131219 134424 135922 135433 133640 131388
52961A31388k568l088l300k796k010j632j795k141k459k845l325l564l142k100
$$ 131388 128820 125732 122432 119636 117626 115994 114199 112058 109599 106754 103429 99865 96723 94623
52947I4623j129r54j530k126k209j967j850j939j990j804j414j003q39j006j220
$$ 94623 93494 92540 91010 88884 86675 84708 82858 80919 78929 77125 75711 74708 73869 72863 71643
52932G1643j141q41o64o08m25j95k83n78m80J25N35K62k73m47l31l94q03j424
$$ 71643 70502 69661 68997 68389 67964 67769 67486 66908 66428 66553 67088 67350 67077 66630 66299 65905 65102 63678
52914F3678k066k320j687l60O09M77k78p41p28o25n42l73l27n71o71j60N06M44
$$ 63678 61612 59292 57605 57245 57854 58331 58053 57312 56584 55959 55417 55044 54717 54146 53475 53315 53821 54265
52896E4265k66n67K1O81M93l06p15k67N45R57P07R5m22n96m54j37J82L29K29J0
$$ 54265 53999 53432 53453 54134 54627 54321 53606 53339 53884 54841 55548 55643 55221 54625 54171 54034 54216 54545 54774 54784
52876E4784j34j58r5J76P48J289J260O32l2l71o21r77j043l45Q79J939K448K507
$$ 54784 54650 54492 54397 54573 55321 56610 57870 58502 58470 58099 57478 56501 55458 55113 55992 57931 60379 62886
52858F2886K259J776J319J255J708K483L312L955M174L865L280K866K798K837
$$ 62886 65145 66921 68240 69495 71203 73686 76998 80953 85127 88992 92272 95138 97936 100773
52844A00773K670K283J945J796J629J149M48q3l92q64j623k156k043j628j401
$$ 100773 103443 105726 107671 109467 111096 112245 112693 112610 112218 111354 109731 107575 105532 103904 102503
52829A02503j141m74N1m84j772k370j728r78j219j909j869j108o87j077j631j656
$$ 102503 101362 100888 100939 100455 98683 96313 94585 93607 92388 90479 88610 87502 86815 85738 84107 82451
52813H2451j290j113j315j510j251n90o1n9l99o95q87j073j065o94l81o69j291
$$ 82451 81161 80048 78733 77223 75972 75382 75321 75262 74863 74168 73281 72208 71143 70449 70068 69399 68108
52796F8108j468j099p87o31k7J043J597J024p4r33j641k336k427j492l29k9m62
$$ 68108 66640 65541 64754 64123 64096 65139 66736 67760 67686 66753 65112 62776 60349 58857 58528 58499 58037
52779E8037o45k67Q5K6j58j67j15j94l50l74r4M00O01R9o13m24Q98K097J904O12
$$ 58037 57392 57125 57210 57236 57078 56911 56796 56602 56252 55878 55784 56184 56785 56884 56271 55847 56745 58842 60746 61358
52759F1358m44n55r6L64O97R38J004O96j30j297k093j766m60Q07J280J088N88
$$ 61358 60914 60359 60263 60627 61324 62262 63266 63962 63832 62535 60442 58676 58216 59023 60303 61391 61979
52742F1979j71r83j259q45m13m99q02r16j038j299j171l54M65N29J04j48k39m50
$$ 61979 61808 60825 59566 58721 58308 57809 57007 56091 55053 53754 52583 52229 52694 53223 53327 53179 52940 52490
52724E2490m99r8L03K19J37P03J461J530J074R32J150J096Q13R76J583J922J838
$$ 52490 51991 51893 52196 52415 52552 53255 54716 56246 57320 58252 59402 60498 61311 62287 63870 65792 67630
52707F7630J921K369K753L016L596M437M840M512L917L379K748K036J588J349
$$ 67630 69551 71920 74673 77689 81285 85722 90562 95074 98991 102370 105118 107154 108742 110091
52693A10091P79k93j393k088k356k231j786j496j849k579k940k759k502k314j901
$$ 110091 110870 110577 109184 107096 104740 102509 100723 99227 97378 94799 91859 89100 86598 84284 82383
52678H2383j407j454k119k659k580k223k047j965j715j319r55p42p82r77r35n08
$$ 82383 80976 79522 77403 74744 72164 69941 67894 65929 64214 62895 61940 61198 60416 59439 58504 57996
52662E7996k44o57j295j267n63ML4j17k13l88n08j77M82Q69Q58Q02O85J86m00
$$ 57996 57752 57095 55800 54533 53970 53974 54008 53891 53678 53290 52782 52605 53087 53956 54814 55616 56301 56487 56087
52643E6087l89L3q1p46p60M40J708J741P58j66o33r51j149r56m27O8L77N92P26
$$ 56087 55698 55731 55650 54904 54144 54584 56292 58033 58791 58625 57992 57041 55892 54936 54509 54577 54954 55546 56272
52624E6272P08O54Q24J293J789J796J023p4n82k69J6m22r92p65p6l7o55q29k70
$$ 56272 56980 57634 58458 59751 61540 63336 64359 64285 63703 63434 63450 63028 62036 61271 61195 61158 60503 59674 59404
52605E9404m9p68j525j291l75K41K28j11m55m85J57J259J884J377J51q28r62k80
$$ 59404 59355 58587 57062 55771 55396 55637 55865 55754 55299 54814 54971 56230 58114 59491 59642 58814 57852 57572
52587E7572O93J104M96m55n72K50R52Q38L69Q3j78m42j39Q37J455Q39l87r31m45
$$ 57572 58265 59369 59865 59410 58838 59088 60040 60878 61247 61330 61152 60710 60571 61408 62863 63702 63315 62384 61939
52568F1939M37J143J506J429J017O97P05O84L06r6o2K50L75K67J59L5k44m99l57
$$ 61939 62376 63519 65025 66454 67471 68168 68873 69557 69863 69767 69705 69955 70330 70597 70756 70791 70547 70048 69691
52549F9691L26J362K291K458J499o7j186j404j119o43J50J096J584J501J486J755
$$ 69691 70017 71379 73670 76128 77627 77560 76374 74970 73851 73208 73358 74454 76038 77539 79025 80780
52533H0780J629Q13J39L30P83N38k27o19l65J23N53Q35P66L74J18J11k30j044
$$ 80780 82409 83222 83361 83691 84474 85012 84785 84166 83801 83924 84477 85312 86078 86452 86570 86681 86451 85407
52515H5407j284j63J309J456K35q20p33mN76Q87J052J022Q59P94Q35Q11Q00R90
$$ 85407 84123 83960 85269 86725 86960 86140 85407 85403 85979 86866 87918 88940 89799 90593 91428 92239 93039 94029
52497I4029J198J138R64J021J179J089R20J094J406J184L51m16o20m04l5M49R14
$$ 94029 95227 96365 97329 98350 99529 100618 101538 102632 104038 105222 105573 105157 104537 104133 104098 104547 105461
52480A05461J091J013R80J030Q68L77k88j047j885k512k539k024j425j007p04
$$ 105461 106552 107565 108545 109575 110443 110820 110532 109485 107600 105088 102549 100525 99100 98093 97389
52465I7389n04m88n50n23n12o64p50m62QK53L24N10O13J85m93n29L39J278J463
$$ 97389 96885 96397 95847 95324 94812 94148 93398 92936 92944 93197 93521 94031 94644 94829 94336 93807 94146 95424 96887
52446I6887J035O43N67O38O52N39L91M67R44J504J505P50k60r43j219j328j387
$$ 96887 97922 98565 99132 99770 100422 100961 101352 101819 102763 104267 105772 106522 106262 105319 104100 102772 101385
52429A01385j325j056n19K21Q07P94J96m14n41l13j90l16m00k14N0L5k91n53m52
$$ 101385 100060 99004 98485 98706 99513 100307 100503 100089 99548 99235 99045 98729 98329 98115 98165 98200 97909 97356 96904
52410I6904j43l1k44n39o80o54m63n0N28J008J216J179R39M82m8m20o43r14j143
$$ 96904 96761 96730 96486 95947 95267 94613 94150 94100 94628 95636 96852 98031 98970 99452 99404 98984 98341 97427 96284
52391I6284r64l87M6Rj74j53p0p9J53Q42J469J377Q27O63J128J556J324M95m28
$$ 96284 95320 94933 94979 94988 94814 94661 94591 94512 94665 95507 96976 98353 99180 99843 100971 102527 103851 104346 103918
52372A03918r90r14k04O78J080P55N3m80n80m17l40n12o62l44M60J205J327P66
$$ 103918 102928 102014 101810 102488 103568 104323 104376 103896 103316 102899 102559 102047 101385 101041 101501 102706 104033 104799
52354A04799l8m29R6J389K445K274J093J82L26R49J163R93J051J496J933K085
$$ 104799 104761 104332 104428 105817 108262 110536 111629 111811 112137 113086 114249 115242 116293 117789 119722 121807
52338A21807J953J589J084O56M29L57N17J113J896K193J784J248J045Q65L66j70
$$ 121807 123760 125349 126433 127089 127518 127875 128392 129505 131401 133594 135378 136626 137671 138536 138902 138732
52322A38732m04o08j046j399j424j568k140k529k139j481j295j216m77M86N09
$$ 138732 138328 137720 136674 135275 133851 132283 130143 127614 125475 123994 122699 121483 121006 121492 122001
52307A22001m05r77n41J77L85K96M94J076J710J968J489M27l06RQ58J126P35O60
$$ 122001 121596 120619 120078 120255 120640 120936 121430 122506 124216 126184 127673 128100 127794 127803 128661 129787 130522 131182
52289A31182J344K122K375K356K502K765K959L088L099K882K666K751K886K662
$$ 131182 132526 134648 137023 139379 141881 144646 147605 150693 153792 156674 159340 162091 164977 167639
52275A67639K481L139M311M612L479J960J195J117J175J337J608J454N92l08m67
$$ 167639 170120 173259 177570 182182 185661 187621 188816 189933 191108 192445 194053 195507 196099 195791 195324
52260A95324j08J17K26O42J211J436J421J702K203K180J385N48M64J033J525J469
$$ 195324 195216 195333 195559 196201 197412 198848 200269 201971 204174 206354 207739 208287 208751 209784 211309 212778
52244B12778J042P41Q90J442K067K416K404K278K412K955L646M078M084L755L188
$$ 212778 213820 214561 215451 216893 218960 221376 223780 226058 228470 231425 235071 239149 243233 246988 250176
52229B50176K481K011K225L009L699L899L881L861L531K735K045K006K291K338
$$ 250176 252657 254668 256893 259902 263601 267500 271381 275242 278773 281508 283553 285559 287850 290188
52215B90188K337K757L277L209K729K612K867K735K055J509J374J141O74O29J243
$$ 290188 292525 295282 298559 301768 304497 307109 309976 312711 314766 316275 317649 318790 319464 320093 321336
52200C21336J759J710J792K705L824L932K862J684J420K145L217L927M054L987
$$ 321336 323095 324805 326597 329302 333126 337058 339920 341604 343024 345169 348386 352313 356367 360354
52186C60354M213M609M598L997L255K736K352K072K203K803L362L420L080K708
$$ 360354 364567 369176 373774 377771 381026 383762 386114 388186 390389 393192 396554 399974 403054 405762
52172D05762K460K405K608K818K559J746R09N34O15R45J312J315O33k67l65M99
$$ 405762 408222 410627 413235 416053 418612 420358 421267 421801 422416 423361 424673 425988 426621 426354 425989 426488
52156D26488J144M54j192k487k706k177j539j143j032j104j279j611k091k338
$$ 426488 427632 428086 426894 424407 421701 419524 417985 416842 415810 414706 413427 411816 409725 407387
52142D07387j910r94l21l05o77j074j403j496j133o33p31j561k316k310j793j363
$$ 407387 405477 404483 404162 403857 403180 402106 400703 399207 398074 397441 396710 395149 392833 390523 388730 387367
52126C87367j242j502k305l401l959l504k521j710j149p01o08j067j690k013k128
$$ 387367 386125 384623 382318 378917 374958 371454 368933 367223 366074 365373 364765 363698 362008 359995 357867
$$ [...]
##END NTUPLES=NMR SPECTRUM
##END=
