
##TITLE=AC1296_UGARS11108_6534421_xA5jigeR2I
##JCAMPDX= 6.0         $$ Bruker NMR JCAMP-DX V2.0
##DATA TYPE= NMR SPECTRUM
##DATA CLASS= NTUPLES
##ORIGIN= BRUKER
##OWNER= Administrator
$$ 1.72 TOPSPIN		Version 2.1
$$ 2012-07-17 15:35:34.546 -0500  Administrator@TOPSPIN
$$ Compression mode = diff/dup
##.OBSERVE FREQUENCY= 400.02188249412
##.OBSERVE NUCLEUS= ^1H
##.ACQUISITION MODE= SIMULTANEOUS (DQD)
##.ACQUISITION SCHEME= undefined
##.AVERAGES= 64
##.DIGITISER RES= 22
##SPECTROMETER/DATA SYSTEM= spect
##.PULSE SEQUENCE= noesygpps1d.comp
##.SOLVENT NAME= COFFEE_meoh
##.SHIFT REFERENCE= INTERNAL, COFFEE_meoh, 1, 14.96091
##AUDIT TRAIL= $$ (NUMBER, WHEN, WHO, WHERE, PROCESS, VERSION, WHAT)
$$ ##TITLE= Audit trail, TOPSPIN		Version 2.1
$$ ##JCAMPDX= 5.01
$$ ##ORIGIN= Bruker BioSpin GmbH
$$ ##OWNER= Administrator
$$ $$ C:\Bruker\TOPSPIN/data/COFFEE/nmr/AC1296_UGARS11108_6534421_xA5jigeR2I/22/pdata/1/auditp.txt
$$ ##AUDIT TRAIL=  $$ (NUMBER, WHEN, WHO, WHERE, PROCESS, VERSION, WHAT)
(   1,<2012-07-17 15:35:29.765 -0500>,<Administrator>,<TOPSPIN>,<go>,<TOPSPIN 2.1>,
      <created by zg
	started at 2012-07-17 15:23:59.578 -0500,
	POWCHK enabled, PULCHK disabled,
       configuration hash MD5:
       6B 1B 68 BB D9 2E 58 E2 7F 35 AD 54 07 DF 0E 41
       data hash MD5: 64K
       E7 87 04 D3 8A 46 58 79 DA F6 38 36 A3 F2 1A BC>)
(   2,<2012-07-17 15:35:32.500 -0500>,<Administrator>,<TOPSPIN>,<proc1d>,<TOPSPIN 2.1>,
      <Start of raw data processing
       efp LB = 0.3 FT_mod = 6 PKNL = 1 PHC0 = 0 PHC1 = 0 SI = 128K 
       data hash MD5: 128K
       CA F9 DD 23 26 35 FE AF E8 52 74 68 BE 2E AE A2>)
(   3,<2012-07-17 15:35:33.703 -0500>,<Administrator>,<TOPSPIN>,<proc1d>,<TOPSPIN 2.1>,
      <pk PHC0 = -0.01098633 PHC1 = 0 
       data hash MD5: 128K
       E1 A6 83 CC 48 50 B1 44 27 3C B9 F6 42 01 E2 F8>)
(   4,<2012-07-17 15:35:34.171 -0500>,<Administrator>,<TOPSPIN>,<proc1d>,<TOPSPIN 2.1>,
      <abs ABSG = 1 
       data hash MD5: 128K
       52 55 67 7B 16 F8 3D BD 00 12 77 83 6C 11 26 5C>)
(   5,<2012-07-17 15:35:34.296 -0500>,<Administrator>,<TOPSPIN>,<proc1d>,<TOPSPIN 2.1>,
      <abs ABSG = 2 
       data hash MD5: 128K
       67 26 FC AE 6D 31 85 05 12 1E 49 E5 2E 79 63 00>)
(   6,<2012-07-17 15:35:34.375 -0500>,<Administrator>,<TOPSPIN>,<proc1d>,<TOPSPIN 2.1>,
      <abs ABSG = 3 
       data hash MD5: 128K
       BD 35 58 9C 7A 4B F1 28 E9 65 41 9D DF CA E9 CC>)
(   7,<2012-07-17 15:35:34.421 -0500>,<Administrator>,<TOPSPIN>,<proc1d>,<TOPSPIN 2.1>,
      <abs ABSG = 4 
       data hash MD5: 128K
       E6 97 68 91 B7 6D 34 37 65 23 A5 85 5C 6D 19 FB>)
(   8,<2012-07-17 15:35:34.484 -0500>,<Administrator>,<TOPSPIN>,<proc1d>,<TOPSPIN 2.1>,
      <abs ABSG = 5 
       data hash MD5: 128K
       23 37 D4 4B 92 61 A9 DA 91 4E 8D 29 FF 68 63 1A>)
$$ ##END=
$$ 
$$ $$ hash MD5
$$ $$ DD 49 CF 2D CA 2D EE C6 1C 1B 98 17 60 77 5A 22
##$RELAX= 
##$RELAX= 
##$RELAX= 
##$RELAX= 
##$RELAX= 
##$RELAX= 
##$RELAX= 
##$RELAX= 
$$ Bruker specific parameters
$$ [...]
##$TP07= 0
##$TPNAME0= <>
##$TPNAME1= <>
##$TPNAME2= <>
##$TPNAME3= <>
##$TPNAME4= <>
##$TPNAME5= <>
##$TPNAME6= <>
##$TPNAME7= <>
##$TPOAL= (0..7)
0.5 0.5 0.5 0.5 0.5 0.5 0.5 0.5
##$TPOFFS= (0..7)
0 0 0 0 0 0 0 0
##$TUNHIN= 0
##$TUNHOUT= 0
##$TUNXOUT= 0
##$USERA1= <user>
##$USERA2= <user>
##$USERA3= <user>
##$USERA4= <user>
##$USERA5= <user>
##$V9= 5
##$VALIST= <valist>
##$VCLIST= <CCCCCCCCCCCCCCC>
##$VD= 0
##$VDLIST= <DDDDDDDDDDDDDDD>
##$VPLIST= <PPPPPPPPPPPPPPP>
##$VTLIST= <TTTTTTTTTTTTTTT>
##$WBST= 2048
##$WBSW= 25
##$XGAIN= (0..3)
0 0 0 0
##$XL= 0
##$YL= 0
##$YMAX_a= 11056761
##$YMIN_a= -7758828
##$ZGOPTNS= <>
##$ZL1= 120
##$ZL2= 120
##$ZL3= 120
##$ZL4= 120
##$ABSF1= 14.96091
##$ABSF2= -5.597272
##$ABSG= 5
##$ABSL= 3
##$ALPHA= 0
##$AQORDER= 0
##$ASSFAC= 0
##$ASSFACI= 0
##$ASSFACX= 0
##$ASSWID= 0
##$AUNMP= <proc_prof1d_extract.lims>
##$AXLEFT= 0
##$AXNAME= <>
##$AXNUC= <1H>
##$AXRIGHT= 0
##$AXTYPE= 0
##$AXUNIT= <>
##$AZFE= 0.1
##$AZFW= 0.1
##$BCFW= 0
##$BC_mod= 0
##$BYTORDP= 0
##$COROFFS= 0
##$CY= 15
##$DATMOD= 1
##$DC= 0
##$DFILT= <>
##$DTYPP= 0
##$F1P= 0
##$F2P= 0
##$FCOR= 0.5
##$FTSIZE= 131072
##$FT_mod= 6
##$GAMMA= 0
##$GB= 0
##$INTBC= 1
##$INTSCL= 1
##$ISEN= 128
##$LB= 0.3
##$LEV0= 0
##$LPBIN= 0
##$MAXI= 10000
##$MC2= 0
##$MEAN= 0
##$ME_mod= 0
##$MI= 0
##$NCOEF= 0
##$NC_proc= -2
##$NLEV= 6
##$NOISF1= 0
##$NOISF2= 0
##$NSP= 0
##$NTH_PI= 0
##$NZP= 0
##$OFFSET= 14.96091
##$PC= 1
##$PHC0= -0.01098633
##$PHC1= 0
##$PH_mod= 1
##$PKNL= yes
##$PPARMOD= 0
##$PPDIAG= 0
##$PPIPTYP= 0
##$PPMPNUM= 2147483647
##$PPRESOL= 1
##$PSCAL= 4
##$PSIGN= 0
##$PYNMP= <proc.py>
##$REVERSE= no
##$SF= 400.020009674477
##$SI= 131072
##$SIGF1= 0
##$SIGF2= 0
##$SINO= 400
##$SIOLD= 131072
##$SPECTYP= <>
##$SREGLST= <1H.CDCl3>
##$SSB= 0
##$STSI= 131072
##$STSR= 0
##$SW_p= 8223.68421052631
##$SYMM= 0
##$S_DEV= 0
##$TDeff= 65536
##$TDoff= 0
##$TI= <>
##$TILT= no
##$TM1= 0
##$TM2= 0
##$TOPLEV= 0
##$USERP1= <user>
##$USERP2= <user>
##$USERP3= <user>
##$USERP4= <user>
##$USERP5= <user>
##$WDW= 1
##$XDIM= 131072
##$YMAX_p= 389377616
##$YMIN_p= -12655
##$CURPLOT= <Network HP LaserJet P1505>
##$CURPRIN= <$Network HP LaserJet P1505>
##$DFORMAT= <normdp>
##$LAYOUT= <+/1D_H.xwp>
##$LFORMAT= <normlp>
##$PFORMAT= <normpl>
##$SURQMSG= 1
$$ End of Bruker specific parameters
$$ ---------------------------------
##NTUPLES= NMR SPECTRUM
##VAR_NAME=  FREQUENCY,     SPECTRUM/REAL,   SPECTRUM/IMAG
##SYMBOL=    X,             R,               I
##VAR_TYPE=  INDEPENDENT,   DEPENDENT,       DEPENDENT
##VAR_FORM=  AFFN,          ASDF,            ASDF
##VAR_DIM=   131072,        131072,          131072
##UNITS=     HZ,            ARBITRARY UNITS, ARBITRARY UNITS
##FACTOR=    0.0627417313425164, 1,          1
##FIRST=     8223.62146879497, -1102,        -46055
##LAST=      0,             -370,            -47435
##MIN=       0,             -12655,          0
##MAX=       8223.62146879497, 389377616,    0
$$ Real data points
##PAGE= N=1
##DATA TABLE= (X++(R..R)), XYDATA
$$ [...]
61500C26163j78M22M09p7p93j289j131n89m29o72m25O01J415J244P50Q72J242
61483C27535Q81j46r26j151j304j574j541j002l08J89M47M92L39J64J43K10K14
61466C22662J01k26r11j661j721p70N45J387J633J612J371Q27K72J14K96M71O14
61449C26616R10J257J334J128R74J105J374J428J067N95O56J459K248K136J336
61434C45623R23J340K008K461K916L389L292K437J561J240J101O59J48j42m83
61419C68473r66r70k09N16N01L59R90K015K391K056J812J895J799J285N94k07
61403C82334j191k011k230k056k002j991j592r46p03j157k003k764k949k250j165
61388C55324q33j520j979j191j9Q9o76r78n90m71p16k29J224K277J963J139J212
$$ plain form
61500 326163 325985 326407 326816 326739 325946 324657 323526 322937 322508 321836 321411 322012 323427 324671 325421 326293 327535
61483 327535 328416 328270 327344 326193 324889 323315 321774 320772 320464 320653 321100 321592 321931 322095 322238 322448 322662
61466 322662 322763 322537 321626 319965 318244 317474 318019 319406 321039 322651 324022 324849 325121 325235 325531 326002 326616
61449 326616 327526 328783 330117 331245 332219 333324 334698 336126 337193 337788 338444 339903 342151 344287 345623
61434 345623 346546 347886 349894 352355 355271 358660 361952 364389 365950 367190 368291 368950 369098 368956 368473
61419 368473 367507 366537 366328 366844 367345 367704 368694 370709 373100 375156 376968 378863 380662 381947 382541 382334
61403 382334 381143 379132 376902 374846 372844 370853 369261 368315 367612 366455 364452 361688 358739 356489 355324
61388 355324 354491 352971 350992 349801 349782 349871 349195 348217 347627 347156 346440 346211 347435 349712 351675 352814 354026
61371C54026K339L592M178L897K972J979J462J323J036N81N29J009J387J278J133
61356C82721J326J434R84L81M04J135J964K416K559K669K986L724M964O469P846
61341D23982Q918R852J0824J1643J1906J1550J1023J0543R476P087L900J472M71
61328E32647j40j445k965l563l335l406m170m880m969m762m688m651m444m086
61314D81143l507k511j314n03k99k52J9L17L20J43J71N39J053J519K015K819M006
61297D85678N234O178P130Q653J0506J1482J0708Q595O103L638J142j302l594
61284E60151n797p600q140p173n853n482n907o060n605m978m120k489l22J220
61270D91845J558J410J787K919M363N625O480P077P789Q634R047Q645P924P604
$$ plain form
61371 354026 356365 359957 364135 368032 371004 372983 374445 375768 376804 377385 377914 378923 380310 381588 382721
61356 382721 384047 385481 386465 386846 387250 388385 390349 392765 395324 397993 400979 404703 409667 416136 423982
61341 423982 432900 442752 453576 465219 477125 488675 499698 510241 519717 526804 530704 532176 532647
61328 532647 532507 531062 528097 524534 521199 517793 513623 508743 503774 499012 494324 489673 485229 481143
61314 481143 477636 475125 473811 473308 473009 472757 472776 473093 473413 473556 473727 474266 475319 476838 478853 481672 485678
61297 485678 490912 497090 504220 512873 523379 534861 545569 554164 560267 563905 565047 563745 560151
61284 560151 554354 546754 538614 531441 525588 520106 514199 508139 502534 497556 493436 490947 490625 491845
61270 491845 493403 494813 496600 499519 503882 509507 515987 523064 530853 539487 548534 557179 565103 572707
61256E72707P643P564P414P692Q546R762J1280J3030J4532J5363J5651J5411J3893
61243G20488J0482N823J183k912o464r031j0193j0535j0943j1237j0705r642q956
61230F47358q495p314n403l716k545j345j71L10K77O19J235J176O63J163K974
61215F26786M523M744M441M455M148K811J174K57j58p10j040l85J063K426L173
61200F57708L147K156L60j432k533k958k861k061o27Q46K101L689O049Q769J1243
61185F83596J3385J5254J6701J7871J9275K0784K1271J9813J6744J3119R822P477
61173H75112O426O287O167N725N324M953L927J997j16j786l220m789o447q210
61159H91350j0247j2188j3237j3425j3653j4239j4492j4179j4085j4494j4339
$$ plain form
61256 572707 580350 587914 595328 603020 611566 621328 632608 645638 660170 675533 691184 706595 720488
61243 720488 730970 736793 737976 735064 728600 719569 709376 698841 687898 676661 665956 656314 647358
61230 647358 638863 631549 626146 622430 619885 618540 618369 618679 618956 619575 620810 621986 622649 623812 626786
61215 626786 631309 636053 640494 644949 649097 651908 653082 653339 653181 652471 651431 651046 652109 654535 657708
61200 657708 660855 663011 663371 661939 659406 656448 653587 651526 650899 651745 653846 657535 663584 672353 683596
61185 683596 696981 712235 728936 746807 766082 786866 808137 827950 844694 857813 867635 875112
61173 875112 881538 887825 893992 899717 905041 909994 913921 915918 915802 914016 910796 906007 899560 891350
61159 891350 881103 868915 855678 842253 828600 814361 799869 785690 771605 757111 742772
61148G42772j2764j0466q616p312n947m276k391k82J845L555M928O544Q353R377
61134G25320Q855O803L333j196n217o850o356o026o886p321n955l880k649j737
61120F90238J57K649M503N892P961J0702J3007J4406J5340J6127J6883J8069J9922
61107H35856K1694K2465K2312K1928K1639K1523K1668K1550K0235J7970J6440
61096A065280J6398J6310J4582J1931J0059R038P518M730P77m123r303j3325j5522
61083A114350j7060j9158k1163k1846k1544k1346k1082j9969j8498j7724j7277
61072H97683j5910j3676j1750j0414q959p306o112n385m478l277k182j140P9J092
61058H08265J571K097L195M299M864N622P204Q562Q503P914Q667J0878J3066J4463
$$ plain form
61148 742772 730008 719542 710926 703614 697667 693391 691000 690718 692563 696118 701046 707590 715943 725320
61134 725320 734175 740978 744311 743115 737898 731048 724692 718666 711780 704459 698504 694624 691975 690238
61120 690238 690395 693044 697547 703439 711400 722102 735109 749515 764855 780982 797865 815934 835856
61107 835856 857550 880015 902327 924255 945894 967417 989085 1010635 1030870 1048840 1065280
61096 1065280 1081678 1097988 1112570 1124501 1134560 1143598 1151116 1155846 1156623 1152500 1143197 1129872 1114350
61083 1114350 1097290 1078132 1056969 1035123 1013579 992233 971151 951182 932684 914960 897683
61072 897683 881773 868097 856347 845933 836974 829668 823556 818171 813693 810416 808234 807094 807173 808265
61058 808265 809836 811933 815128 819427 824291 829913 837117 845679 854182 862096 870763 881641 894707 909170
61044I09170J5477J6441J7537J9372K2016K4229K5088K5589K6999K8799K9979
61033A160696L1091L2942L4522L4534L3869L4197L5251L5907L6777L9030M1805
61022A550621M3635M5327M8454N2182N4793N7258O1850O8022P3127P6343P8445
61011B210057P9007P7828P8096Q3604R3744J05557J19514J37807J57980J74598
61001C317792J87194K00522K17241K37357K64990L07621L67416M41541N32496
60992F074170O49110P96143R74790J196809J485112J857091K324713K909196L603153
60983B1870287M264133M571617M193017L076029J573215K29086n77042p84867
60975C8415475n17536Q9293Q62925J476908J516318P62563n90266k045778l146360
$$ plain form
61044 909170 924647 941088 958625 977997 1000013 1024242 1049330 1074919 1101918 1130717 1160696
61033 1160696 1191787 1224729 1259251 1293785 1327654 1361851 1397102 1433009 1469786 1508816 1550621
61022 1550621 1594256 1639583 1688037 1740219 1795012 1852270 1914120 1982142 2055269 2131612 2210057
61011 2210057 2289064 2366892 2444988 2528592 2622336 2727893 2847407 2985214 3143194 3317792
61001 3317792 3504986 3705508 3922749 4160106 4425096 4732717 5100133 5541674 6074170
60992 6074170 6723280 7519423 8494213 9691022 11176134 13033225 15357938 18267134 21870287
60983 21870287 26134420 30706037 34899054 37975083 39548298 39777384 39200342 38415475
60975 38415475 37897939 37987232 38850157 40327065 41843383 42605946 42015680 39969902 36823542
60966C6823542l717774l842159l683384l370702k990700k606015k251012j930358
60958A2431438j639280j379822j155344r62297p95898o57069n47572m63317l97265
60949D433574l44897l03173k68201k37625k12093j91436j72535j53351j35616
60940B414647j20915j07489r3980q3091p8183p8413q0241q1685q2335q1089p7016
60929A450210p1329o6052o1533n7170n3190m9931m6571m2453l8468l5454l2538
60918H95521k8779k5138k2934k1532j9515j7131j5686j5243j4757j3940j3296
60907F87570j2711j1446r316o909m934l977m208m774m386l118k427k799k893j959
60893F11713j331k217l560l779l267l363l909l782l045k693k763k522k195k756
$$ plain form
60966 36823542 33105768 29263609 25580225 22209523 19218823 16612808 14361796 12431438
60958 12431438 10792158 9412336 8256992 7294695 6498797 5841728 5294156 4830839 4433574
60949 4433574 4088677 3785504 3517303 3279678 3067585 2876149 2703614 2550263 2414647
60940 2414647 2293732 2186243 2092263 2009172 1930989 1852576 1772335 1690650 1608315 1527226 1450210
60929 1450210 1378881 1312829 1251296 1194126 1140936 1091005 1044434 1001981 963513 928059 895521
60918 895521 866742 841604 818670 797138 777623 760492 744806 729563 714806 700866 687570
60907 687570 674859 663413 654097 647188 642254 638277 634069 629295 624909 621791 619364 616565 613672 611713
60893 611713 610382 608165 604605 600826 597559 594196 590287 586505 583460 580767 578004 575482 573287 570531
60879E70531m189n316n324m409l162k247k318l220l817l489l154l807m857n165
60865E16057m949n148n567n305m557m370m750m655l790k982k677k423j961j597
60851D61326j334p35K03R82J439J818J995J665J154J086J388J604K006L132M344
60836D82073M228K593Q30J6j79l47l61m6K45L56P20J470J847J234J44m11p4P92
60818D95130J709K275K146J345L56l73p97r78q60n89o66j400k490l465m276n200
60802D81867o323p360p887p632o734n763n294n339n401n105m589m209m065l955
60788D02211l628l026k356j935j907k103k217j988j236m2J018J166K81q26j345
60773C82067j310j169q55PJ123J557R87L43P61K221L645M325M762N780P137P607
$$ plain form
60879 570531 566342 561026 555702 551293 548131 545884 543566 540346 536529 533040 529886 526079 521222 516057
60865 516057 511108 505960 500393 495088 490531 486161 481411 476756 472966 469984 467307 464884 462923 461326
60851 461326 459992 459257 459460 460442 461881 463699 465694 467359 468513 469599 470987 472591 474597 477729 482073
60836 482073 486301 488894 489724 489740 489561 489214 488853 488807 489052 489408 490128 491598 493445 494679 494823 494412 494338 495130
60818 495130 496839 499114 501260 502605 502961 502588 501791 500813 499953 499364 498698 497298 494808 491343 487067 481867
60802 481867 475544 468184 460297 452665 445931 440168 434874 429535 424134 419029 414440 410231 406166 402211
60788 402211 398583 395557 393201 391266 389359 387256 385039 383051 381815 381773 382791 383957 384238 383412 382067
60773 382067 380757 379588 378733 378740 379863 381420 382407 382750 383511 385732 389377 393702 398464 404244 411381 418988
60757D18988O655N401N300O329P226P374P343P489P172N909M304L174K523K125
60743D97312K313L274M242M319L602K567R27j634m085m859l994l134l293l893
60729D93664m254m756n876p111p646p454p084o791o490o218o144o237o295o150
60715D05158n753n189m672m281l743k832j878j424j442j358q54j37N76J246J744
60700C75161J963K255L070M159M759M704M620M908N253N401N587N856N721N007
60686D38424M305M040L701K642J150Lo41j247j966k364k111j426q10n95p69j018
60670D41318j035q91r29j228j382r65L6J398K833L884M006L109J743N31l35q19
60654D51274o93J65J352K237K659L164M538P040R881J1603J1483J0455J0122J0808
$$ plain form
60757 418988 425643 431044 436344 442673 449899 457273 464616 472105 479277 485186 489490 492664 495187 497312
60743 497312 499625 502899 507141 511460 515062 517629 518556 516922 512837 507978 503984 500850 497557 493664
60729 493664 489410 484654 478778 471667 464021 456567 449483 442692 436202 429984 423840 417603 411308 405158
60715 405158 399405 394216 389544 385263 381520 378688 376810 375386 373944 372586 371732 371595 372171 373417 375161
60700 375161 377124 379379 382449 386608 391367 396071 400691 405599 410852 416253 421840 427696 433417 438424
60686 438424 442729 446769 450470 453112 454262 454265 453624 452377 450411 448047 445936 444510 443700 443105 442336 441318
60670 441318 440283 439392 438463 437235 435853 434888 434924 436322 439155 443039 447045 450154 451897 452428 452093 451274
60654 451274 450581 450746 452098 454335 456994 460158 464696 471736 481617 493220 504703 515158 525280 536088
60640E36088J1325J0867J0227J0571J1850J3150J4127J5173J6401J7407J8047
60629F85233J8684J9550K0314K0489J9932J8800J7292J5446J3110J0179O950M004
60617H69983J563p74l438o351r180j1723j3675j4488j4063j3314j3390j4409j5434
60604G41307j5605j4850j3658j2626j2150j2090j1806j0929r931r593j0006j0625
60592E97438j1062j1288j1175j0510r518q757q331p733o529m827l011j446m40
60579E02811k9K68R88J980K531K357J980K021K608L528M511N250N680O390Q232
60564E51106J1269J4590J7424K0008K2994K6421K9500L1188L0769K8093K3521
60553H06883J7485J0155J883o212j2681j6847j8933j9117j7264j3781r868o333
$$ plain form
60640 536088 547413 558280 568507 579078 590928 604078 618205 633378 649779 667186 685233
60629 685233 703917 723467 743781 764270 784202 803002 820294 835740 848850 859029 865979 869983
60617 869983 871546 870772 867334 860983 851803 840080 826405 811917 797854 784540 771150 756741 741307
60604 741307 725702 710852 697194 684568 672418 660328 648522 637593 627662 618069 608063 597438
60592 597438 586376 575088 563913 553403 543885 535128 526797 519064 512535 507708 504697 503251 502811
60579 502811 502782 503050 504038 506018 508549 510906 512886 514907 517515 521043 525554 530804 536484 542874 551106
60564 551106 562375 576965 594389 614397 637391 663812 693312 724500 755269 783362 806883
60553 806883 824368 834523 836406 830194 817513 800666 781733 762616 745352 731571 721703 715370
60541G15370k854J149N617J0400J5948K2632K9800L6385M1995M6537M9091M8204
60529A020274M3361L5328K5087J3286R01j0441j9213k4655k6612k5351k1816j7475
60517I92674j3476j0163p544n781n042n235o097p245q003p611n903l479r71J499
60503I07623M007O330Q250J0086J2581J6348K1588K8212L6025M4941N5134O6722
60491A217847P9155R1151J01616J10325J17341J21934J22620J18451J09878R8062
60481B288380Q3465O5428M3207J7285j0448l7790o3309q6240j05651j20131j28545
60470A945651j30847j28091j21712j12949j02754r1948q1354p1716o3444n6386
60460I84450m9975m3707l7586l2166k8119k5656k4190k2742k0790j8665j6954
$$ plain form
60541 715370 712516 713665 719282 729682 745630 768262 798062 834447 876442 922979 972070 1020274
60529 1020274 1063635 1098963 1124050 1137336 1138237 1127796 1108583 1083928 1057316 1031965 1010149 992674
60517 992674 979198 969035 961491 955710 950668 945433 939336 932091 924088 916477 910574 907095 906124 907623
60503 907623 911630 917960 926210 936296 948877 965225 986813 1015025 1051050 1095991 1151125 1217847
60491 1217847 1297002 1388153 1489769 1600094 1717435 1839369 1961989 2080440 2190318 2288380
60481 2288380 2371845 2437273 2480480 2497765 2487317 2449527 2386218 2299978 2194327 2074196 1945651
60470 1945651 1814804 1686713 1565001 1452052 1349298 1257350 1175996 1104280 1040836 984450
60460 984450 934475 890768 853182 821016 792897 767241 743051 720309 699519 680854 663900
60449F63900j5671j4285j2546j0872r886r746r958r712q451o418m528l400k615
60436E45812j403J22J084J260J568K694M020M451L815K690J327m50k425l978m884
60421E55703n459n816n702n161m668m335l593k078l75N75N03j34q04j186j141
60406E16329p88n15m64k03O53J652J863J071Q9k90j29J11L99J016J821K299K352
60389E27266K496L019L358K820J664R26J130J699J895J812K025K596K985K900
60375E58591K630K390J932J112M08M36J229K464M129O301Q319Q940P719N808M917
60360F17325N644P139Q206Q315P707O946O503O415O205N346L873K375J358R08
60346F94265J018J898L762O472R599J2737J5721J8723K2250K6698L1597L5432
$$ plain form
60449 663900 648229 633944 621398 610526 600640 590894 580936 571224 562773 556355 551827 548427 545812
60436 545812 544409 544531 545615 546875 548443 551137 555157 559608 563423 566113 567440 566990 564565 560587 555703
60421 555703 550244 544428 538726 533565 528897 524562 520969 518891 518516 519091 519594 519460 518656 517470 516329
60406 516329 515541 515026 514562 514359 515012 516664 518527 519598 519687 519397 519268 519379 519778 520794 522615 524914 527266
60389 527266 529762 532781 536139 538959 540623 541549 542679 544378 546273 548085 550110 552706 555691 558591
60375 558591 561221 563611 565543 566655 567063 567499 568728 571192 575321 581622 589941 598881 606600 612408 617325
60360 617325 622969 630108 638314 646629 654336 661282 667785 674200 680405 685751 689624 691999 693357 694265
60346 694265 695283 697181 700943 707415 717014 729751 745472 764195 786445 813143 844740 880172
60334H80172L6529L4136K8690K1208J2687L816n062j3643k1164k6432k8662k8265
60322H94010k6531k4563k2744k1005j9183j7149j4963j2928j1239r599p520m959
60310G01627k361p2J955L865N705P553R507J1460J3278J5329J8615K4107L1829
60297H42397M0228M6346M7305M2475L3969K4271J3520J76j5628l0631m0952m5166
60285I58310m4429m0512l4704k7921k0729j3182n260K551R477J4889J8164J8603
60273H35257J6139J1722O318j20p860j5931k2410k6175k7598k7529k6437k4585
60261F90791k2262j9542j6380j3128j0369q226o399m928m269m366m490m232m023
60248E68177m253m517m221l451k690k092j576j299j479j871j910j424q22o04q48
$$ plain form
60334 880172 916701 950837 979527 1000735 1013422 1017238 1012176 998533 977369 950937 922275 894010
60322 894010 867479 842916 820172 799167 779984 762835 747872 734944 723705 714106 706586 701627
60310 701627 699266 699194 701149 705014 710719 718272 727779 739239 752517 767846 786461 810568 842397
60297 842397 882625 928971 976276 1018751 1052720 1076991 1090511 1090687 1075059 1044428 1003476 958310
60285 958310 913881 873369 838665 810744 790015 776833 771573 774124 783601 798490 816654 835257
60273 835257 851396 863118 869436 869316 861456 845525 823115 796940 769342 741813 715376 690791
60261 690791 668529 648987 632607 619479 609110 600884 594485 589557 585288 580922 576432 572200 568177
60248 568177 563924 559407 555186 551735 549045 546953 545377 544078 542599 540728 538818 537394 536572 535968 535120
60233E35120j220j251o95K79J284K090K668K891K615K201K545M159O332P636P285
60218E73939N798M313L483L123K710J963R57q8q96j156q22l95n10j027r82K18
60202E90628J882K831K789K430K250K171K151K417K807K670J730N76q3j87l4K60
60186F17288N76N10j60r10r28m4J108J776J673J055M27J52J24r0o48j175j221
60169F19513p82j99L44R82J932L183M352M948N034N426O849Q854J0188J0298R745
60154F90667Q859O868L075j617n289o953p240p210p254p242p087o742o034m812
60140F41989l205j513O0J529L026M557N840O578O936P470Q298Q654P665N434K913
60125G06231P80j153l307n583p412q343q355p697o556m983l169j679j097j261
$$ plain form
60233 535120 533900 532649 531954 532233 533517 535607 538275 541166 543781 545982 548527 552686 559018 566654 573939
60218 573939 579737 584050 587533 590656 593366 595329 596286 596198 595302 594146 593324 592929 592419 591392 590410 590628
60202 590628 592510 595341 598130 600560 602810 604981 607132 609549 612356 615026 616756 617332 617249 617062 617028 617288
60186 617288 617864 618374 618214 617304 616376 616332 617440 619216 620889 621944 622371 622523 622647 622557 621909 620734 619513
60169 619513 618731 618532 618876 619858 621790 624973 629325 634273 639307 644733 651582 660436 670624 680922 690667
60154 690667 699526 706394 709469 707852 702563 695610 688370 681160 673906 666664 659577 652835 646801 641989
60140 641989 638784 637271 637331 638860 641886 646443 652283 658861 665797 673267 681565 690219 697884 703318 706231
60125 706231 707011 705858 702551 696968 689556 681213 672858 665161 658605 653622 650453 648774 647677 646416
60111F46416j212k24J339K606L351M043M877N427N505N747O859Q619R989J0192
60097G13534R361Q234P412O857N941M035J226j523l133l361k948k855l413m176
60083G35191m475m033l139k338k002k104k343k418k246j996j971k374l189m266
60069F96297n512o840p912q182p432o203n352n089m823m084l252k966l137l157
60055F22356k909k908l329l645l538l531m209n293o049o262o114n506m249k781
60041E62033j865j530j047j14O81Q01O14R22K050L656N102N751N318M142K950
60026E89464K167J737J588J725J804J258R5r80j559k026k644k810j973q63r27
60011E86056k514m388n153m683l907l565l513l177k397j662j432j425r13L15J674
$$ plain form
60111 646416 645204 644980 646319 648925 652276 656319 661196 666623 672128 677875 684734 693353 703342 713534
60097 713534 722895 731129 738541 745398 751339 755374 756600 755077 751944 748583 745635 742780 739367 735191
60083 735191 730716 726683 723544 721206 719204 717100 714757 712339 710093 708097 706126 703752 700563 696297
60069 696297 690785 683945 676033 667851 660419 654216 648864 643775 638952 634868 631616 628650 625513 622356
60055 622356 619447 616539 613210 609565 606027 602496 598287 592994 586945 580683 574569 569063 564814 562033
60041 562033 560168 558638 557591 557477 558158 558959 559573 560495 562545 566201 571303 577054 582372 586514 589464
60026 589464 591631 593368 594956 596681 598485 599743 599838 598858 597299 595273 592629 589819 587846 586983 586056
60011 586056 583542 579154 574001 569318 565411 561846 558333 555156 552759 551097 549665 548240 547327 547642 549316
59996E49316K627L377M394N616O531O932P115P271P022N765L426P53j268k303
59982F06574k783l091k940j984p30k48q88j866k272j963j352q47q00j474k640
59967E80696l550l600k869j853j057q63j287j739j508p32k65m39o59m83l05m64
59951E59023n12q2K42k85j339j944j692q11N35K152L326L330K412J561J365J667
59935E68948K097K312J917Q21m51j383k117k860l085k209p78N6J04J82O53R72
59919E65179Q95R38J351J580J273R15R44R88N76%k20j73l05o79j099j626k388
59902E68149l067l209k858k439k115j744j377j222j083l91R34K080K185J364N23
59887E55730L01O31J308K403L787M841N169N281N928O965P567P498P282P144O691
$$ plain form
59996 549316 551943 555320 559714 565330 571861 578793 585908 593179 600201 605966 609392 610145 608877 606574
59982 606574 603791 600700 597760 595776 595046 594798 593910 592044 589772 587809 586457 585610 584810 583336 580696
59967 580696 577146 573546 570677 568824 567767 566904 565617 563878 562370 561638 561373 560934 560275 559792 559487 559023
59951 559023 558511 558429 558671 558386 557047 555103 553411 552600 553135 555287 558613 561943 564355 565916 567281 568948
59935 568948 571045 573357 575274 576095 575644 574261 572144 569284 566199 563990 563212 563268 563372 563554 564207 565179
59919 565179 566074 567012 568363 569943 571216 572131 573075 574063 574639 574639 574419 574246 573941 573262 572163 570537 568149
59902 568149 565082 561873 559015 556576 554461 552717 551340 550118 549035 548644 549578 551658 553843 555207 555730
59887 555730 556031 556662 557970 560373 564160 569001 574170 579451 585379 592344 599911 607409 614691 621835 628526
59872F28526N881N277M953M093K311M55p30j795l523n444o494o617o444n947m792
59857F09710l711l939n258o042n510m619m311m222l732l145k990k945k365j315
59843E55606k95O08J679L003M517O379Q790J1626J4581J7397J9613K0317J8614
59830F82435J4410Q668L020q90k098o63K552O253Q757Q205L716l462j0477j4993
59816G05433j6647j6633j6354j6564j7148j7348j6450j4463j2017r759q066p109
59804E36875o701o249n407m653m614n010m957m184l210k380j611j075j206j887
59790D83731k441k588k543k128r45L99N14p30j640r34M59P93j38j144j531j641
59774D67493j838k007j973j644p92N48J587J425K09r58j285r46m58n7K00K30Q5
$$ plain form
59872 628526 634407 639684 644637 648730 651041 651496 650766 648971 645448 640004 633510 626893 620449 614502 609710
59857 609710 605999 602060 596802 590760 585250 580631 576320 572098 568366 565221 562231 559286 556921 555606
59843 555606 555311 555919 557598 560601 565118 571497 580287 591913 606494 623891 643504 663821 682435
59830 682435 696845 705513 708533 707643 705545 704882 707434 713687 722444 730649 734365 730903 720426 705433
59816 705433 688786 672153 655799 639235 622087 604739 588289 573826 561809 552050 543984 536875
59804 536875 530174 523925 518518 513865 509251 504241 499284 495100 491890 489510 487899 486824 485618 483731
59790 483731 481290 478702 476159 474031 473086 473485 473999 473269 471629 470695 471154 471947 471809 470665 469134 467493
59774 467493 465655 463648 461675 460031 459239 459787 461374 462799 463008 462050 460765 459819 459361 459304 459504 459734 459819
59757D59819K0K06N45Q98J289J754K132K183J923J705J841K232K553K786L217
59742D85103L853M172L801L062K537K304K083J773J433R72L71r8l69q99j818k289
59726E05991j615n71m87j255j471o10K87K66m02j156k005k925l356k988k247j517
59710D83939n89O00J467J486Q85K50L0N56J822L132L754L960M472N034M854M387
59694E20039M949O324O775O090O418Q778J0723R398N435J789j74j321k270k561
59680E80392k139j717j524j160o95o31q18o75l98o71j264j276p31o48j396k198
59664E62451k421k325k285k254k190k172k033j657j464j724j642k55J845K963
59650E44837K509J596J328J648K116K593K766K088O99n12j208k040l414m662m999
$$ plain form
59757 459819 459839 460045 460590 461488 462777 464531 466663 468846 470769 472474 474315 476547 479100 481886 485103
59742 485103 488956 493128 496929 499991 502528 504832 506915 508688 510121 511093 511464 511366 510997 510098 508280 505991
59726 505991 504376 503805 503318 502063 500592 499982 500269 500535 500133 498977 496972 494047 490691 487703 485456 483939
59710 483939 483350 483950 485417 486903 487788 488038 488068 488624 490446 493578 497332 501292 505764 510798 515652 520039
59694 520039 524988 531312 538087 544177 550595 559373 570096 579494 584929 586718 586544 585223 582953 580392
59680 580392 578253 576536 575012 573852 573157 572526 571708 571033 570635 569964 568700 567424 566693 566045 564649 562451
59664 562451 560030 557705 555420 553166 550976 548804 546771 545114 543650 541926 540284 540029 541874 544837
59650 544837 547346 548942 550270 551918 554034 556627 559393 561481 562180 561668 560460 558420 555006 550344 545345
59635E45345m581m042l663l438l351l152k454j386o48m72j75Q16J996K361J686
59620E24842P47M85J205K425L251L059J916K32j758l872n521o049n518m657l939
59605E06848l195k193j052k5P36J065Q57L51n5k30l44m81o17p44o85j19P98J210
59587E02125O49r4P3R35J325Q28J14l78r48j676k100k181k614l684m641m712m044
59570D78977l249k618k269k449l110l618l367k446j400n97j26M8M0k8j46k64j36
59553D53242M01J099J664K124K477K285J435Q79J624L118L792L212K523K617L144
59538D85636L735M869O819Q912J0883J3954J9087K4458K6005K1009J0758l95q287
59525F27443j1450j1077r092o600m020j887o46Q9J165K632L702M044M254M725
$$ plain form
59635 545345 540764 536722 533059 529621 526270 523118 520664 519278 518630 518158 517983 518799 520795 523156 524842
59620 524842 525589 526074 527279 529704 532955 536014 537930 538162 536404 532532 527011 520962 515444 510787 506848
59605 506848 503653 501460 500408 500383 501119 502184 503041 503392 503337 503107 502763 502282 501665 500921 500236 500117 500915 502125
59587 502125 502774 502680 502753 503688 505013 505841 505955 505577 504629 502953 500853 498672 496058 492374 487733 483021 478977
59570 478977 475728 473110 470841 468392 465282 461664 458297 455851 454451 453854 453728 453776 453816 453788 453642 453378 453242
59553 453242 453643 454742 456406 458530 461007 463292 464727 465606 467230 470348 474140 477352 479875 482492 485636
59538 485636 489371 494240 501059 509971 520854 534808 553895 578353 604358 625367 636125 635730 627443
59525 627443 615993 604916 595824 589224 585204 583317 582671 582760 583925 586557 590259 594303 598557 603282
59511F03282M901M130K601R16o64k138l446m640n897o992p325o852o386o544o965
59496E57981o947o343n382m240l273l043l487l630k762j427o06l59k3N71R86J095
59480E19111J330K006K969M066N408P079Q879J0481J1689J2439J2708J2313J0901
59467F21379Q313N013J839p52k816m295m827m386l558k757j683J01K402M653O555
59452F25181Q089R245J0173J1345J3175J5626J8467K1518K4381K6304K6700K5312
59440H35516K1626J4836N210m957j2771j7070j8786j9234j8947j8143j7286j6782
59428G33212j6666j6928j7579j8097j7387j4881j1356q186n915m007j757J044
59416F01497M251P620J0870J3851J6714J9680K2788K6378L1269L7130M0531L6446
$$ plain form
59511 603282 608183 612313 614914 615830 615166 613028 609582 604942 599045 592053 584728 577876 571490 564946 557981
59496 557981 551034 544691 539309 535069 531796 528753 525266 521636 518874 517447 516841 516482 516459 517030 518016 519111
59480 519111 520441 522447 525416 529482 534890 541969 550848 561329 573018 585457 598165 610478 621379
59467 621379 629692 634705 636544 635792 632976 628681 623854 619468 615910 613153 611470 611571 613973 618626 625181
59452 625181 633270 642515 652688 664033 677208 692834 711301 732819 757200 783504 810204 835516
59440 835516 857142 871978 877188 872231 859460 842390 823604 804370 785423 767280 749994 733212
59428 733212 716546 699618 682039 663942 646555 631674 620318 612132 606217 602210 600453 601497
59416 601497 605748 613368 624238 638089 654803 674483 697271 723649 754918 792048 832579 869025
59404H69025K3245N394j0107j9556k3714k4297k1764j6451r268n71R269J6976
59392G98181J6712N907j0572k4475l1643l3564l2850l0318k6470k2690j9693j6711
59380E71814j3280j0321q574p369n900m517l791l358k649j879j453j167o99k49
59366E06608N0N92J512K148J963J386J083R69O28J35j42r0K90J110K208L083L667
59349E27200M574O132P718Q666R235J0146J1525J2896J3901J4640J5495J6825
59337F58953J8521J9800J9869J8824J7361J5676J3402J0604P891N425K802N8k170
59324H07016l761n337p074q354q940r378r902r968r428q898q558p812o715o293
59310F96598o723o636n231l645l082k866j820l64K87K20M58J195J894K572L529
$$ plain form
59404 869025 892270 897664 887557 868001 844287 819990 798226 781775 772507 771936 781205 798181
59392 798181 814893 820800 810228 785753 754110 720546 687696 657378 630908 608218 588525 571814
59380 571814 558534 548213 539639 532270 526370 521853 518062 514704 512055 510176 508723 507556 506857 506608
59366 506608 506658 507250 508762 510910 512873 514259 515342 516311 516939 517074 516932 516842 517132 518242 520450 523533 527200
59349 527200 531774 537906 545624 554290 563525 573671 585196 598092 611993 626633 642128 658953
59337 658953 677474 697274 717143 735967 753328 769004 782406 793010 800901 806326 809128 809186 807016
59324 807016 803255 797918 790844 782490 773550 764172 754270 744302 734874 725976 717418 709606 702891 696598
59310 696598 689875 683239 678008 674363 671281 668415 666595 666231 666518 666738 667196 668391 670285 672857 676386
59295F76386M246M069L708M530O531Q330R162R640J0512J1892J3943J7304K2423
59282H02676K8769L4448L6253L0993J8228J717j2839k1787k5060k4566k2237j9293
59270H27302j6092j2291p711k978J153M671P805J0094J0984J0938J0947J1038
59258H55860J0346Q516O074L426N16k499n169p492r803j1847j2790j2464j1789
59245H10885j1655j1911j1795j0908r483p971o634n497m638m362m780n236m767
59232G11248l361k063j575j377p15L30J323K294L253L536K464K77k242m611o538
59217G02243p653q066q555r450r963r471q665q511q759q550p884p314o773n865
59203E86764m927m545m389l696k621j967j852j741j489j234o41N55J574J409M13
$$ plain form
59295 676386 680632 684701 688409 692939 699470 707800 716962 726602 737114 749006 762949 780253 802676
59282 802676 831445 865893 902146 933139 951367 953084 940245 918458 893398 868832 846595 827302
59270 827302 811210 798919 791208 788230 789383 794054 801859 811953 822937 833875 844822 855860
59258 855860 866206 874722 880796 884222 884738 882239 877070 869578 859775 847928 835138 822674 810885
59245 810885 799230 787319 775524 764616 755133 747162 740528 735031 730393 726031 721251 716015 711248
59232 711248 707887 705824 704249 702872 702157 702487 703810 706104 709357 712893 715357 715634 713392 708781 702243
59217 702243 694590 686524 677969 668519 658556 649085 640420 631909 623150 614600 606716 599402 592629 586764
59203 586764 581837 577292 572903 569207 566586 564619 562767 561026 559537 558303 557662 558217 559791 561200 561613
59188E61613j51R0N52J134K322L897M967N386N853O422O220M981L688L326L834
59173F14134M606N220N492N487N565N905O111N954O046O865P632P371O696P174
59159G00258Q994J0651J1021J0443R605Q643P638O866O232N276L966K713J540
59146G93846P9j629l192m600n999o942o942o479o443o719o523n875n471n270m640
59131G17201l767l471l639l321k395j654j218m07O93J270J597L036N794Q399R955
59116G28073J1216J2759J3779J3678J3347J3755J4499J4729J4499J4175J3512
59105H78021J2201J0623R192P781O366N417N040M566L672K930K675K238J002n95
59091I51129j865k826l703m231m191l909l683l378l106l536m993o936q713j0207
$$ plain form
59188 561613 561462 561552 562104 563238 565560 569457 574424 579810 585663 592085 598305 603286 606974 610300 614134
59173 614134 618740 623960 629452 634939 640504 646409 652520 658474 664520 671385 679017 686388 693084 700258
59159 700258 709252 719903 730924 741367 750972 759615 767253 774119 780351 785627 789593 792306 793846
59146 793846 793925 792296 789104 784504 778505 771563 764621 758142 751699 744980 738457 732582 727111 721841 717201
59131 717201 713434 709963 706324 703003 700608 698954 697736 697329 698022 699292 700889 703925 709719 718118 728073
59116 728073 739289 752048 765827 779505 792852 806607 821106 835835 850334 864509 878021
59105 878021 890222 900845 910037 917818 924184 929601 934641 939207 942879 945809 948484 950722 951724 951129
59091 951129 949264 946438 942735 938504 934313 930404 926721 923343 920237 916701 911708 904772 896059 885852
59077H85852j1381j2151j2944j4367j5936j6253j5068j3908j3965j4484j4114
59066G31281j2855j1573j0499r279p929o756n751m853m378m436m423l789k915
59053F41845k520k616k687k551k459k535k598k387j788j055q06j346j982j732
59039F12783o95Jk89j016j366j042m8J402K631L019K928L204L772L862L592L998
59023F36736N252O326O760P337Q451R345R644J0192J1414J2212J1546R986Q614
59010G53815P382N661L562J641l5j510k335k180j508q92k54N89J390K092L148
58995G70566M564N484N437N158N324N357M329K391M98p63j401j772k665m806p686
58980G90015r675r942r454r356r440q939p912o840n597l837j779J40J855L309
$$ plain form
59077 885852 874471 862320 849376 835009 819073 802820 787752 773844 759879 745395 731281
59066 731281 718426 706853 696354 687075 679146 672390 666639 661786 657408 652972 648549 644760 641845
59053 641845 639325 636709 634022 631471 629012 626477 623879 621492 619704 618649 617843 616497 614515 612783
59039 612783 612088 612089 611800 610784 609418 608376 608328 609730 612361 615380 618308 621512 625284 629146 632738 636736
59023 636736 641988 648314 655074 662411 670862 680207 689851 700043 711457 723669 735215 745201 753815
59010 753815 761197 766858 770420 772061 772026 770516 768181 766001 764493 763601 763347 763936 765326 767418 770566
58995 770566 775130 780614 786051 791209 796533 801890 806219 808610 809108 808345 806944 805172 802507 797701 790015
58980 790015 780340 770398 760944 751588 742148 733209 725297 718457 712860 709023 707244 707384 709239 712548
58966G12548M168M604N473P088Q551R043Q991R207R650R811R548Q783P103M379
58952H18947J250j621m159o334p833q715r480j0105j0089r680r825j0379r878
58939G22099p769n368l731k219k47J075N31j290l092m721o486p720p645o821o234
58924F60362n679m491l173k796l310l779l852l783l527k954k456k333k026r91
58910F15212L02J150J722K439L024L160L383M298N635O965Q568J0658J2626J3961
58896F93103J5022J5959J5963J4552J2600J0992R497P914P124P697Q840R998J2057
58883H41318J5451J8583J9914K0212K0767K0725J8465J4595J1207Q771O058K589
58871A018655r81m565q557j2289j4545j5389j5754j5548j4068j1985j0934j1217
$$ plain form
58966 712548 716716 721320 726793 733881 742432 751475 760466 769673 779323 789134 798682 807465 814568 818947
58952 818947 820197 818576 814417 808083 800250 791535 782055 771950 761861 752181 742356 731977 722099
58939 722099 714330 708962 705231 703012 702765 703840 704371 703081 699989 695268 688782 681062 673417 666596 660362
58924 660362 654683 650192 647019 644223 640913 637134 633282 629499 625972 623018 620562 618229 616203 615212
58910 615212 615514 616664 618386 620825 623849 627009 630392 634690 640325 647290 655858 666516 679142 693103
58896 693103 708125 724084 740047 754599 767199 778191 787688 795602 802726 810423 819263 829261 841318
58883 841318 856769 875352 895266 915478 936245 956970 975435 990030 1001237 1010008 1016066 1018655
58871 1018655 1017674 1013109 1004552 992263 977718 962329 946575 931027 916959 904974 894040 882823
58859H82823j1672j1677j1665j1815j1916j2317j3451j4645j4969j4830j5108
58848G38758j5309j4416j3022j2518j2536j1413r135p515p303p287o588n841n565
58835F10310n234m471l708l183k667k404k917l763l850l176k717k634k111j119
58821E66356o60j005j212p15oN17J053J578J806K033K763L505L374K719K634K993
58805E87733K667J718J558K686L961M470M500M321L558K255J132L86n64j834k830
58790F15717l378l820l924l116j834j156r95k07J400K812L701M866O474P585P919
58775F32044Q442R582J0354R871Q391O292L467L02k007k917l331m264n644o807
58761F63775p375p232o477n643n259n157m858m455m250l841k653j036K66J342
$$ plain form
58859 882823 871151 859474 847809 835994 824078 811761 798310 783665 768696 753866 738758
58848 738758 723449 709033 696011 683493 670957 659544 650409 642894 635591 628304 621716 615875 610310
58835 610310 605076 600605 596897 593714 591047 588643 585726 581963 578113 574937 572220 569586 567475 566356
58821 566356 565696 564691 563479 562764 562758 563275 564328 565906 567712 569745 572508 576013 579387 582106 584740 587733
58805 587733 590400 592118 593676 596362 600323 604793 609293 613614 617172 619427 620559 620945 620381 618547 615717
58790 615717 612339 608519 604595 601479 599645 598489 597494 597287 598687 601499 605200 610066 616540 624125 632044
58775 632044 640486 650068 660422 670293 678684 684976 688443 688745 686738 683821 680490 676226 670582 663775
58761 663775 656400 649168 642691 637048 631789 626632 621774 617319 613069 609228 606575 605539 605805 607147
58747F07147K595L527L464L044L415M375M899N062N719O680P165P644R161J1034
58733F84931J1494J0593J0135J0584J0383Q822P236O705O614O304O262O785P100
58720G93948O656N951N441M995M789N378O532P342P638P935Q102P625P044P210
58706H86586P322N788K945O67q11l167o842j0164j2246j4188j6639j8601j9524
58693H01126k0310k1195k0928j9147j7343j6368j5077j2703j0499r616r280q452
58681F20208p612p496p681p664p816q112p490n636l859l094k555j496n87l48K50
58666E49012K201M793O857Q470J0259J2073J3427J4221J4134J2396R062N483K824
58653F65212J003l77j323k066l070m023m126l646l699m339m480l972l832m197
$$ plain form
58747 607147 609742 613269 616733 619777 623192 627567 632466 637528 643247 649927 657092 664736 673897 684931
58733 684931 696425 707018 717153 727737 738120 746942 754178 760883 767497 773801 780063 786848 793948
58720 793948 800604 806555 811996 816991 821780 827158 833690 841032 848670 856605 864707 872332 879376 886586
58706 886586 893908 899696 902641 903308 902497 899330 892488 882324 870078 855890 839251 820650 801126
58693 801126 780816 759621 738693 719546 702203 685835 670758 658055 647556 637940 628660 620208
58681 620208 612596 605100 597419 589755 581939 573827 566337 560701 556842 553748 551193 549697 549110 548762 549012
58666 549012 551213 556006 562863 571333 581592 593665 607092 621313 635447 647843 656905 662388 665212
58653 665212 666215 665838 664515 662449 659379 655356 651230 647584 643885 639546 635066 631094 627262 623065
58639F23065m040l308l178l758l752k956k711l240k954j244M08J026J432J972
58625E96762J494k08j380j080n98q57p75L02J037N77L22J478L070M137N706Q612
58609F18599J1362J2286J2023J1937J1661J0169P861N772L951K199J084Q11M79
58596G10194l96j047j221j971l529m363l598k454j935j163O91K826M579O671R184
58581G12468J0580J0271J0013J1039J2005J1541J0541J0080R329P571O050N744
58569H27232N420M081L217M378O461P768Q874J1114J3946J6101J7748J9428K0437
58556I66205K0259J9925J9963J8942J5936J2474R967P308L163j398m869p759j0781
58543A069335j2716j2594j1924j2250j2536j1532j0585j1379j2884j3459j3918
$$ plain form
58639 623065 619025 615717 612539 608781 605029 602073 599362 596122 593168 591924 592332 593358 594790 596762
58625 596762 598256 598048 596668 595588 594990 594133 593358 593660 594697 595274 595596 597074 600144 604281 609987 618599
58609 618599 629961 642247 654270 666207 677868 688037 695898 701670 705621 707820 708904 709715 710194
58596 710194 709798 708751 707530 705559 702030 697667 694069 691615 689680 688517 689208 692034 696613 703284 712468
58581 712468 723048 733319 743332 754371 766376 777917 788458 798538 807867 815438 821488 827232
58569 827232 832652 836733 839950 844328 850789 858557 867431 878545 892491 908592 926340 945768 966205
58556 966205 986464 1006389 1026352 1045294 1061230 1073704 1083671 1090979 1094142 1092744 1087875 1080116 1069335
58543 1069335 1056619 1044025 1032101 1019851 1007315 995783 985198 973819 960935 947476 933558
58532I33558j5540j6925j6092j4019j2889j2310j0475p793o190n839n441m772
58520H05273m343l639k175j038j062r65L77J574J171M76J207K313K081J450K010
58505H04710K709J968J189K501M613M771L409L078L857L766K776K567K947K185
58491H47046N19j91J45j0p19o76Q3M46O30J512K340J965J502K860N450P194P903
58474H77999Q813R867J0265J0595J1546J1712R686O885N287L953J100k034l148
58461I62526l111m356o280o321m530l080k146l39J630J835J049J736L682M613
58447I46908M527N349O663N998L285J053J77r40k839m139m202l647k417k73J455
58432I56958J594J670L583N984O426N689O150P201O543M889M995O842Q093Q563
$$ plain form
58532 933558 918018 901093 885001 870982 858093 845783 835308 827515 821325 815486 810045 805273
58520 805273 800930 797291 795116 794078 793016 792051 792428 794002 795173 795649 796856 799169 801250 802700 804710
58505 804710 807419 809387 810576 813077 817690 822461 825870 828948 832805 836571 839347 841914 844861 847046
58491 847046 847565 847374 847519 847509 846790 846114 846197 846643 847273 848785 851125 853090 854592 857452 862902 870096 877999
58474 877999 886812 896679 906944 917539 929085 940797 950483 957368 962655 966608 967708 965674 962526
58461 962526 959415 955059 948779 942458 937928 934848 932702 932363 933993 935828 936877 938613 942295 946908
58447 946908 951435 956784 963447 969445 972730 973783 973960 973020 970181 966042 961840 958193 955776 955503 956958
58432 956958 958552 960222 963805 969789 976215 981904 988054 995255 1001798 1006687 1011682 1018524 1026617 1035180
58418A035180R886J1490J1315R900R435R498Q103O147O215P683P661O130N330
58405A143973M876K436j236l102l235m312o127n956m128l783n023m714k344o50
58391A106675j56J498M282N271M074L610M729N155M426M762O288O505N267N248
58377A167634O745P013N546M967N935O109M997M808N872O118N742P240J0310J1871
58363A260907J1671J2540J4620J4939J3342J3085J4764J5326J4075J3792J4915
58352A413976J4481J2023J0658J1106J0448Q137P335Q887R853R426J0357J3061
58340A539748J4316J3410J3643J6053J7537J6888J6780J8095J8237J6765J6763
58329A718235J8888J9899J8782J8357J9410J9308J7903J8381K0739K0943J8225
$$ plain form
58418 1035180 1045066 1056556 1067871 1077771 1087206 1096704 1104807 1110954 1117169 1124852 1132513 1138643 1143973
58405 1143973 1148849 1151285 1150049 1146947 1143712 1139400 1133273 1127317 1123189 1119406 1114383 1109669 1107325 1106675
58391 1106675 1106519 1108017 1112299 1117570 1121644 1125254 1129983 1135138 1139564 1144326 1150614 1157119 1162386 1167634
58377 1167634 1174379 1181392 1186938 1191905 1197840 1203949 1208946 1213754 1219626 1225744 1231486 1238726 1249036 1260907
58363 1260907 1272578 1285118 1299738 1314677 1328019 1341104 1355868 1371194 1385269 1399061 1413976
58352 1413976 1428457 1440480 1451138 1462244 1472692 1480829 1488164 1497051 1506904 1516330 1526687 1539748
58340 1539748 1554064 1567474 1581117 1597170 1614707 1631595 1648375 1666470 1684707 1701472 1718235
58329 1718235 1737123 1757022 1775804 1794161 1813571 1832879 1850782 1869163 1889902 1910845 1929070
58318A929070J6608J7545J7728J5968J5315J6528J6397J4506J4552J7010J7776
58307B109003J6102J6429K0086K2792K2704K3333K5958K7026K5744K6306K9724
58296B365207L1405K9786K9380L2167L4115L3371L3723L6593L7951L6524L6670
58285B736892L9692M0914L8907L8818M2680M5394M4343M3988M6724M8354M7059
58274C213765M7613N2051N5316N4934N5702O0009O2884O1693O1377O5035O8706
58263C859085P0417P4593Q2431Q7929Q8684R0511R6166J00032R9344R9639J03519
58252D852350J05322J02931J03257J09657J15557J17082J20101J28066J35193
58243E889516J38620J44710J56148J65709J70282J77670J91770K04773K12133
$$ plain form
58318 1929070 1945678 1963223 1980951 1996919 2012234 2028762 2045159 2059665 2074217 2091227 2109003
58307 2109003 2125105 2141534 2161620 2184412 2207116 2230449 2256407 2283433 2309177 2335483 2365207
58296 2365207 2396612 2426398 2455778 2487945 2522060 2555431 2589154 2625747 2663698 2700222 2736892
58285 2736892 2776584 2817498 2856405 2895223 2937903 2983297 3027640 3071628 3118352 3166706 3213765
58274 3213765 3261378 3313429 3368745 3423679 3479381 3539390 3602274 3663967 3725344 3790379 3859085
58263 3859085 3929502 4004095 4086526 4174455 4263139 4353650 4449816 4549848 4649192 4748831 4852350
58252 4852350 4957672 5060603 5163860 5273517 5389074 5506156 5626257 5754323 5889516
58243 5889516 6028136 6172846 6328994 6494703 6664985 6842655 7034425 7239198 7451331
58234G451331K21080K35930K49670K58837K71568K91727L10726L24560L42564
58225I957993L69449L95780M16751M42598M79169N16742N49927N89360O41173
58216A4358942O94892P44994Q03677Q78424R58792J039932J136039J255219J385636
58207B3256547J522932J685308J884336K109246K359064K660253L032816L472482
58199D1982984L988990M627063N427008O405590P602782R103229J0982845J3284306
58191A03404797J6075089J9465287K3516424K8152075L3074617L7497809L9820150
58184C01006248L7903233L0304199J7615968K547968j1502755k2146490k8659486
58177C27068885l1535071l1729459l0180351k7623504k4566862k1338469j8132596
$$ plain form
58234 7451331 7672411 7908341 8158011 8416848 8688416 8980143 9290869 9615429 9957993
58225 9957993 10327442 10723222 11139973 11582571 12061740 12578482 13128409 13717769 14358942
58216 14358942 15053834 15798828 16602505 17480929 18439721 19479653 20615692 21870911 23256547
58207 23256547 24779479 26464787 28349123 30458369 32817433 35477686 38510502 41982984
58199 41982984 45971974 50599037 56026045 62431635 70034417 79137646 90120491 103404797
58191 103404797 119479886 138945173 162461597 190613672 223688289 261186098 301006248
58184 301006248 338909481 369213680 386829648 389377616 377874861 355728371 327068885
58177 327068885 295533814 263804355 233624004 206000500 181433638 160095169 141962573
58170A41962573j5029540j2042236r169591o370992l564410q59957J146578J572353
58162I7644778K4928k836189n695576p559179q266644q177215p648104o887042
58154E0599757o054638n274760m574659l929735l350719k866581k463071k105301
58146A9980293j793829j544976j342429j157557r94844q73289p83024o99926o25084
58137A0165335n73361n38950n04929m72086m48555m25437l90380l51639l23108
58128F136890k99040k67380k34126k10995j92562j69022j48849j45550j52945
58119D316421j55346j52097j51529j50761j42081j30409j25083j22211j12955
58110C073949j01048r5034r1423q2401p2122o8901o8989o4204n8138n8895o2807
$$ plain form
58170 141962573 126933033 114890797 105721206 99350214 95785804 94925847 96072425 97644778
58162 97644778 97669706 94833517 89137941 81578762 73312118 65134903 57486799 50599757
58154 50599757 44545119 39270359 34695700 30765965 27415246 24548665 22085594 19980293
58146 19980293 18186464 16641488 15299059 14141502 13146658 12273369 11490345 10790419 10165335
58137 10165335 9591974 9053024 8548095 8076009 7627454 7202017 6811637 6459998 6136890
58128 6136890 5837850 5570470 5336344 5125349 4932787 4763765 4614916 4469366 4316421
58119 4316421 4161075 4008978 3857449 3706688 3564607 3434198 3309115 3186904 3073949
58110 3073949 2972901 2877867 2786444 2704043 2631921 2563020 2494031 2429827 2371689 2312794 2249987
58099B249987o0984n5426n3673n3802m9421m3473m2685m3987m0362l4636l3918
58088A737620l5808l3298k8186k6722k7126k4089k0575k2433k6223k4833k0579
58077A447748k0438k2866k1614j8274j8778k1362k0071j6636j7110j9986j9215
58066A231398j5878j5603j7338j5731j1966j1403j3071j1905q966r157j1242j0260
58054A078878p487q119j1237j1696r789r589j0151p743m467n139p904p351m698
58041I73508n338q446q720o552o764q830p977m873m641p117p383n293n464q226
58027H77884r309q153q140q982p102l386k312l757l512j577j915m299m550k753
58013H08137l277o340p388n325l902m394m092k576k505l594k558M96K134K236
$$ plain form
58099 2249987 2189003 2133577 2079904 2026102 1976681 1933208 1890523 1846536 1806174 1771538 1737620
58088 1737620 1701812 1668514 1640328 1613606 1586480 1562391 1541816 1519383 1493160 1468327 1447748
58077 1447748 1427310 1404444 1382830 1364556 1345778 1324416 1304345 1287709 1270599 1250613 1231398
58066 1231398 1215520 1199917 1182579 1166848 1154882 1143479 1130408 1118503 1109537 1100380 1089138 1078878
58054 1078878 1071391 1063272 1052035 1040339 1030550 1020961 1010810 1003067 998600 993461 985557 978206 973508
58041 973508 968170 959724 951004 944452 937688 928858 920881 916008 911367 904250 896867 891574 886110 877884
58027 877884 868575 860422 852282 843300 836198 832812 830500 826743 823231 821654 819739 815440 810890 808137
58013 808137 804860 798520 791132 785807 781905 777511 773419 770843 768338 764744 762186 762682 764816 767052
57999G67052L913O708O734M051L140N243O811O288O107O968O365L971K732L473
57985H39556L697K554J863J697J21k244k581j081p84k127k755k601l741n389m658
57970H21527k352k311m780o118n399n471o952p004m991l775m266l951j894k67
57956G61996Q7Q38K089J766r0r85n11p53j805j476K13Q95M66J082K390J774l30
57939G67646m60J935L686L592L886N357O060N831P049R770J0888R338P638P160
57925H49376O369M743L977M230L462J528P35J456J437K40L1J203J478K24o15n82
57909H79292j415l088l575l135m254o726p481o080n576p015p935p419p637r030
57895G98926q851o170l797l472l477k551k016k380k054q29n51j071J99L368N176
$$ plain form
57999 767052 770965 777673 784407 788458 791598 796841 803652 809940 816047 823015 829380 833351 836083 839556
57985 839556 843253 845807 847670 849367 849488 847244 844663 843582 842798 840671 837916 835315 831574 826185 821527
57970 821527 819175 816864 812084 805966 800567 795096 788144 781140 776149 772374 768108 764157 762263 761996
57956 761996 762083 762921 765010 766776 766686 765701 765190 764437 762632 761156 761369 762264 762730 763812 766202 767976 767646
57939 767646 767186 769121 772807 776399 780285 785642 791702 797533 804582 814352 825240 834578 842216 849376
57925 849376 855745 860488 864465 868695 872157 873685 874420 875876 877313 877553 877584 878787 880265 880489 879874 879292
57909 879292 877877 874789 871214 868079 863825 857099 849618 843538 837962 830947 823012 815593 807956 798926
57895 798926 790075 783905 780108 776636 773159 770608 768592 766212 764158 763329 762778 761707 761906 765274 770450
57880G70450M418L798M872N716N293N528P094P581O062N181O534P976P676O902
57866H55081O686N665L353J700J397L92j953l175k122j028j231r35O18J034o62
57851H64820j590J30K127K222K159L811N448N119M408N402O924P111O972Q135
57837I23198R491R208P899P051O395N276M412M100K909L68j554j639j496k386
57823I73232k837j693o83j427k526k169j065l91O02K477L664L214L015M641O403
57808I84457O149M746M155M234M025M053M765M706K754K73j229k505m440n838
57794A010305n677n356o210o965o111m696m211l857k475j126j035r43P12K811
57780I65166L466L182L473M039L933L929N037O177N893M998M974N220M419L306
$$ plain form
57880 770450 774868 778666 783538 789254 794547 800075 807169 814750 820812 825993 832527 840503 848179 855081
57866 855081 861767 867432 870785 872485 873882 874274 872321 869146 867024 865996 864765 863830 864448 865482 864820
57851 864820 863230 863360 865487 867709 869868 873679 879127 884246 888654 894056 900980 908091 915063 923198
57837 923198 932689 941897 949796 956847 963242 968518 972930 977030 979939 980307 978753 977114 975618 973232
57823 973232 970395 968702 968019 966592 964066 961897 960832 960441 961043 963520 967184 970398 973413 978054 984457
57808 984457 990606 995352 999507 1003741 1007766 1011819 1016584 1021290 1024044 1024317 1023088 1020583 1016143 1010305
57794 1010305 1004628 999272 993062 986097 979986 975290 971079 967222 964747 963621 962586 961643 962355 965166
57780 965166 968632 971814 975287 979326 983259 987188 992225 998402 1004295 1009293 1014267 1019487 1023906 1027212
57766A027212L491M768N960P266R386J1423J2051J1744J1747J1886J1309J0335
57754A138578R673Q947P721O655O036M722K283L88K09K85q65j959j210L55N47
57739A182365m48p88j43L97O53J294K157K733L425M545N051M122K954L077M055
57724A215449M582M674M942N008M469M255N174O354O828P239Q254Q895Q300P588
57710A302011P917Q316P601O749P114P784P242O261O529P569P689P064P279Q497
57696A405622R518J0058J0781J1557J1740J1657J1893J1714R941O884L858J435
57684A516658l63j117o83Q4O65J850M103O385P972R913J3129J6625J9398K2596
57670A617215K7923L5418M4470N5601O9378Q4793R9700J10644J11148R3926N8465
$$ plain form
57766 1027212 1030703 1035471 1041431 1048697 1058083 1069506 1081557 1093301 1105048 1116934 1128243 1138578
57754 1138578 1148251 1157198 1164919 1171574 1177610 1182332 1184615 1185003 1185212 1185497 1184632 1182673 1181463 1181818 1182365
57739 1182365 1181917 1181129 1180986 1181383 1182036 1183330 1185487 1188220 1191645 1196190 1201241 1205363 1208317 1211394 1215449
57724 1215449 1220031 1224705 1229647 1234655 1239124 1243379 1248553 1254907 1261735 1268974 1277228 1286123 1294423 1302011
57710 1302011 1309928 1318244 1325845 1332594 1339708 1347492 1354734 1360995 1367524 1375093 1382782 1389846 1397125 1405622
57696 1405622 1415140 1425198 1435979 1447536 1459276 1470933 1482826 1494540 1504481 1511365 1515223 1516658
57684 1516658 1516295 1515178 1514495 1514579 1515244 1517094 1521197 1527582 1535554 1545467 1558596 1575221 1594619 1617215
57670 1617215 1645138 1680556 1725026 1780627 1850005 1934798 2034498 2145142 2256290 2350216 2408681
57659B408681J4578k4651n2270o8268p4431p2579o6048n8316n0146m0850l1551
57648A884149k4257j8738j3398q517n565m093k348l60N53P42J675L032L347L094
57634A819316M083O133P323P319P529Q124P830O710O410P439Q674R518J0217J0200
57620A926825Q694O805O495P514P831O973O467O952P401P289P238P374P204P153
57606B028215Q059R278R375Q509Q037Q107P874P694Q562R768R655Q545Q273Q947
57592B148898Q927Q021P878Q883R354Q438P362P247P735Q323R049R487Q962Q069
57578B266633Q220R493J0619J0986J0914J0294Q964Q048Q784J0264J0585R832
57566B383636R603R970R636Q814R056J0195J0381R388R088J0124J0969J0810J0791
$$ plain form
57659 2408681 2423259 2398608 2346338 2278070 2203639 2131060 2065012 2006696 1956550 1915700 1884149
57648 1884149 1859892 1841154 1827756 1819239 1813674 1809581 1807233 1806873 1807426 1808168 1809843 1812875 1816222 1819316
57634 1819316 1823399 1829532 1836855 1844174 1851703 1859827 1867657 1874367 1880777 1888216 1896890 1906408 1916625 1926825
57620 1926825 1935519 1942324 1948819 1956333 1964164 1971137 1977604 1984556 1991957 1999246 2006484 2013858 2021062 2028215
57606 2028215 2036274 2045552 2054927 2063436 2071473 2079580 2087454 2095148 2103710 2113478 2123133 2131678 2139951 2148898
57592 2148898 2157825 2165846 2173724 2182607 2191961 2200399 2207761 2215008 2222743 2231066 2240115 2249602 2258564 2266633
57578 2266633 2274853 2284346 2294965 2305951 2316865 2327159 2336123 2344171 2352955 2363219 2373804 2383636
57566 2383636 2393239 2403209 2412845 2421659 2430715 2440910 2451291 2460679 2469767 2479891 2490860 2501670 2512461
57553B512461J1587J2256J2277J2490J3243J3681J3529J3557J3818J3478J2747
57542B655124J2835J3660J3839J3233J3230J4146J4816J5099J6220J8043J8628
57531B818873J7322J5784J5177J4721J3902J3674J4402J4988J5009J5554J6922
57520B986328J7723J7346J7080J7692J8117J7698J7485J8082J8276J7286J6349
57509C179462J6655J7451J7672J7729J8256J8596J8015J7093J6612J6285J5673
57498C369499J5179J5058J4733J3917J3329J3509J4162J5171J6805J8423J8649
57487C538434J7501J6658J6913J7137J6576J6288J7238J8666J9464J9670J9643
57476C734188J9223J8638J8715J9322J9087J7642J6499J6792J7734J8270J8623
$$ plain form
57553 2512461 2524048 2536304 2548581 2561071 2574314 2587995 2601524 2615081 2628899 2642377 2655124
57542 2655124 2667959 2681619 2695458 2708691 2721921 2736067 2750883 2765982 2782202 2800245 2818873
57531 2818873 2836195 2851979 2867156 2881877 2895779 2909453 2923855 2938843 2953852 2969406 2986328
57520 2986328 3004051 3021397 3038477 3056169 3074286 3091984 3109469 3127551 3145827 3163113 3179462
57509 3179462 3196117 3213568 3231240 3248969 3267225 3285821 3303836 3320929 3337541 3353826 3369499
57498 3369499 3384678 3399736 3414469 3428386 3441715 3455224 3469386 3484557 3501362 3519785 3538434
57487 3538434 3555935 3572593 3589506 3606643 3623219 3639507 3656745 3675411 3694875 3714545 3734188
57476 3734188 3753411 3772049 3790764 3810086 3829173 3846815 3863314 3880106 3897840 3916110 3934733
57465C934733J9167J9372J9008J8886J9329J9373J8592J8236J9336K1030K1967
57454D149029K2096K2019K1774K1378K1364K1843K2128K2028K2272K2982K3173
57443D392086K2580K2355K3104K3802K3616K3247K3428K3664K3551K3747K4478
57432D649658K4672K3768K2893K3034K3493K3448K3478K4192K4817K4677K4648
57421D912778K5586K6593K6457K5694K5541K5920K5960K5652K5500K5292K4635
57410E195608K4004K3935K3940K3403K2892K3287K4315K5045K5253K5225K4920
57399E461827K4352K4211K5034K6262K6919K6787K6296K5867K5874K6457K7032
57388E746918K6781K5933K5493K5494K4972K3982K3915K5205K6434K6597K6536
$$ plain form
57465 3934733 3953900 3973272 3992280 4011166 4030495 4049868 4068460 4086696 4106032 4127062 4149029
57454 4149029 4171125 4193144 4214918 4236296 4257660 4279503 4301631 4323659 4345931 4368913 4392086
57443 4392086 4414666 4437021 4460125 4483927 4507543 4530790 4554218 4577882 4601433 4625180 4649658
57432 4649658 4674330 4698098 4720991 4744025 4767518 4790966 4814444 4838636 4863453 4888130 4912778
57421 4912778 4938364 4964957 4991414 5017108 5042649 5068569 5094529 5120181 5145681 5170973 5195608
57410 5195608 5219612 5243547 5267487 5290890 5313782 5337069 5361384 5386429 5411682 5436907 5461827
57399 5461827 5486179 5510390 5535424 5561686 5588605 5615392 5641688 5667555 5693429 5719886 5746918
57388 5746918 5773699 5799632 5825125 5850619 5875591 5899573 5923488 5948693 5975127 6001724 6028260
57377F028260K7053K7409K6913K6389K6621K6832K6170K5340K5258K5352K4777
57366F316374K4153K4425K5091K5137K4840K5046K5503K5424K5040K5041K5216
57355F591290K4967K4626K4882K5502K5770K5660K5468K5073K4549K4687K5814
57344F868288K6962K7260K7233K7518K7460K6416K5431K5888K7167K7378K6080
57333G163081K4685K4318K4653K4852K4602K4094K3689K3583K3456K2868K2209
57322G426090K2371K3151K3126K1738K0300K0116K0773K1272K1588K1963K1798
57311G664286K0564J9025J8285J8418J8981K0006K1295K1743K0652J8958J8020
57300G880233J7862J7730J7551J7606J7492J6651J5474J4782J4683J4724J4626
$$ plain form
57377 6028260 6055313 6082722 6109635 6136024 6162645 6189477 6215647 6240987 6266245 6291597 6316374
57366 6316374 6340527 6364952 6390043 6415180 6440020 6465066 6490569 6515993 6541033 6566074 6591290
57355 6591290 6616257 6640883 6665765 6691267 6717037 6742697 6768165 6793238 6817787 6842474 6868288
57344 6868288 6895250 6922510 6949743 6977261 7004721 7031137 7056568 7082456 7109623 7137001 7163081
57333 7163081 7187766 7212084 7236737 7261589 7286191 7310285 7333974 7357557 7381013 7403881 7426090
57322 7426090 7448461 7471612 7494738 7516476 7536776 7556892 7577665 7598937 7620525 7642488 7664286
57311 7664286 7684850 7703875 7722160 7740578 7759559 7779565 7800860 7822603 7843255 7862213 7880233
57300 7880233 7898095 7915825 7933376 7950982 7968474 7985125 8000599 8015381 8030064 8044788 8059414
57289H059414J4165J3089J1745J0994J0946J0770J0209R936R853Q754O588N285
57277H181748O035P384P542O977P041P488P237O517O308O573O712O945P586P865
57263H279958P116O234O298O670O084M753L702K909J866J128J373J744R81l49
57249H330467p28j62j1p91j954l437n562p730q960r504j0388j1678j2651j3335
57235H243576j4319j5429j6058j6424j7103j7787j7966j8191j9175k0298k0614
57224H050212k0674k1588k2893k3310k3047k3412k4426k4868k4573k4650k5405
57213G791366k5908k5785k5754k6207k6716k7131k7744k8282k8063k7260k6789
57202G495727k6938k7238k7583k8269k9077k9473k9576k9862l0160l0042k9797
$$ plain form
57289 8059414 8073579 8086668 8098413 8109407 8120353 8131123 8141332 8151268 8161121 8169875 8176463 8181748
57277 8181748 8187783 8195167 8202709 8209686 8216727 8224215 8231452 8237969 8244277 8250850 8257562 8264507 8272093 8279958
57263 8279958 8287074 8293308 8299606 8306276 8312360 8317113 8320815 8323724 8325590 8326718 8328091 8329835 8330816 8330467
57249 8330467 8329739 8329577 8329566 8328775 8326821 8323384 8317822 8310092 8301132 8291628 8281240 8269562 8256911 8243576
57235 8243576 8229257 8213828 8197770 8181346 8164243 8146456 8128490 8110299 8091124 8070826 8050212
57224 8050212 8029538 8007950 7985057 7961747 7938700 7915288 7890862 7865994 7841421 7816771 7791366
57213 7791366 7765458 7739673 7713919 7687712 7660996 7633865 7606121 7577839 7549776 7522516 7495727
57202 7495727 7468789 7441551 7413968 7385699 7356622 7327149 7297573 7267711 7237551 7207509 7177712
57191G177712k9927l0125k9887k9591k9780l0045k9829k9668l0199l0731l0353
57180F847577k9660k9716l0085k9701k9035k9364l0375l0596k9881k9549l0153
57169F519462l1037l1918l3032l3837l3424l2129l1096l0391k9317k8298k8544
57158F176439k9905l0996l1398l1896l2663l3129l3656l5335l7974m0140m1318
57147E798029m2299m3404m4184m4955m6587m8571m9254m8318m7174m6626m5945
57136E290712m4695m3514m2646m1423l9819l8831l8795l8752l8019l6993l5996
57125D851229l4767l3425l2605l2237l1423k9749k7452k4409k0407j6327j3334
57114D555094j0779o703n79O161J2603J9517K7704L7004M7486O0036P5176R2730
$$ plain form
57191 7177712 7147785 7117660 7087773 7058182 7028402 6998357 6968528 6938860 6908661 6877930 6847577
57180 6847577 6817917 6788201 6758116 6728415 6699380 6670016 6639641 6609045 6579164 6549615 6519462
57169 6519462 6488425 6456507 6423475 6389638 6356214 6324085 6292989 6262598 6233281 6204983 6176439
57158 6176439 6146534 6115538 6084140 6052244 6019581 5986452 5952796 5917461 5879487 5839347 5798029
57147 5798029 5755730 5712326 5668142 5623187 5576600 5528029 5478775 5430457 5383283 5336657 5290712
57136 5290712 5246017 5202503 5159857 5118434 5078615 5039784 5000989 4962237 4924218 4887225 4851229
57125 4851229 4816462 4783037 4750432 4718195 4686772 4657023 4629571 4605162 4584755 4568428 4555094
57114 4555094 4544315 4537612 4537033 4543194 4555797 4575314 4603018 4640022 4687508 4747544 4822720 4915450
57102D915450J13145J37808J67673K02942K44471K94144L53529M23406N04657
57093G357225N98178P03483Q18335R39447J062038J178720J280477J358924J406744
57084A6703571J416741J382343J298865J163592R77329P49599N00694K52470J4429
57075B4459633k18356m51964o80827q89292j062746j194883j286941j343641j369831
57066A5961152j368681j342044j292368j223478j139591j045109r45601q47176
57058F757104p53922o67162n87553n16223m53322l97389l47283l03290k65546
57049B465414k32868k04108j79225j58173j40041j24159j10724r9624q9875q0905
57039A045712p3175o6815o0912n4756m8640m3037l8113l4303l2001l0432k8262
$$ plain form
57102 4915450 5028595 5166403 5334076 5537018 5781489 6075633 6429162 6852568 7357225
57093 7357225 7955403 8658886 9477221 10416668 11478706 12657426 13937903 15296827 16703571
57084 16703571 18120312 19502655 20801520 21965112 22942441 23692040 24192734 24445204 24459633
57075 24459633 24241277 23789313 23108486 22219194 21156448 19961565 18674624 17330983 15961152
57066 15961152 14592471 13250427 11958059 10734581 9594990 8549881 7604280 6757104
57058 6757104 6003182 5336020 4748467 4232244 3778922 3381533 3034250 2730960 2465414
57049 2465414 2232546 2028438 1849213 1691040 1550999 1426840 1316116 1216492 1126617 1045712
57039 1045712 972537 905722 844810 790054 741414 698377 660264 625961 593960 563528 535266
57028E35266k5448k3008k1024j8554j5467j2569r813o369k304J864O994J4527
57016D24095K4181L5008M8160O5875Q8857J18157J56831K01734K32956K21455
57006A617309J55267N5181m0864j07144j41510j53952j53120j44019j30716j16328
56996H40104j02093q8361p5589o4004n3649m4848l7567l0801k3795j7310j2355
56985B89732q469m723j525J02K53m62k312n571r047j1190j2013j2433j2458j1632
56971A98252j0451r676q891p273n207l653k581j364k9J222K909N430Q152J0565
56957A77405J3230J6205J7741J6074J1613N918k41o274j0658j2393j2547j2565
56945B03508j2073j0222q021p097p067o260m361k220J82L429O903R484J1569J4409
$$ plain form
57028 535266 509818 486810 465786 447232 431765 419196 409383 403014 400710 402574 409568 424095
57016 424095 448276 483284 531444 597319 686176 804333 961164 1162898 1395854 1617309
57006 1617309 1772576 1827757 1786893 1679749 1538239 1384287 1231167 1087148 956432 840104
56996 840104 738011 649650 574061 510057 456408 411560 373993 343192 319397 302087 289732
56985 289732 281263 276540 275015 275117 275370 274908 272596 267025 257978 246788 234775 222342 209884 198252
56971 198252 187801 178125 169234 161961 156754 153101 150520 149156 149127 150349 153258 158688 166840 177405
56957 177405 190635 206840 224581 240655 252268 258186 257945 251671 241013 228620 216073 203508
56945 203508 191435 181213 173192 166095 159028 152768 148407 146187 146369 149798 156701 166185 177754 192163
56931A92163J7832K0462K1590K0929J7251R654j73r070j5576k0076k2452k2004
56919B10530j9543j7141j5529j3727j1269q933p055n167l447k776l068l236k987
56906I6652l000l205k614j072M34J456K579L970M987N517O320P753R392J1024
56892A40193J2772J4236J4859J5246J6762J9574K2296K3614K3142K0708J6166
56881C39568J0111L735k199p352j1116j3037j3724j4157j4230j3105j0720p748
56869B46026m465q10K772N935R410J3998J9040K3430K7720L3375L9979M4806M5197
56856E06413M0030K9288J4132k372j6401k5878l1036l2751l1691k8825k5137k0627
56844C75145j4906q650l076J884P436J4022K1078K8575L7184M6886N6836O6361
$$ plain form
56931 192163 209995 230457 252047 272976 290227 299881 299708 290638 275062 254986 232534 210530
56919 210530 190987 173846 158317 144590 133321 124388 117333 112166 108719 105943 102875 99639 96652
56906 96652 93652 90447 87833 86761 87195 88651 91230 95200 100187 105704 112024 119777 129169 140193
56892 140193 152965 167201 182060 197306 214068 233642 255938 279552 302694 323402 339568
56881 339568 349679 353414 351215 343863 332747 319710 305986 291829 277599 264494 253774 246026
56869 246026 241561 240751 243523 249458 258868 272866 291906 315336 343056 376431 416410 461216 506413
56856 506413 546443 575731 589863 587491 571090 545212 514176 481425 449734 420909 395772 375145
56844 375145 360239 351589 348513 350397 357833 371855 392933 421508 458692 505578 562414 628775
56832F28775P4293P7316P1085N3888K8332m63k7139m7199n8438o2168o1679n8898
56820F17705n3666m6114l7845l0267k3307j6442r728l154L808J1410J9318K7457
56808D59175L6121M4867N2001N5236N2245M1207K2501j4k0781l6121m5535n0036
56796F10866n0737m8860m5485m0893l5135k9090k3807j9032j3836q362l494R02
56784B93037N769J1060J5945K0503K5225K8797K8428K2832J3266J606j0691k1654
56772D34123k9036l2352l3077l2394l0333k7272k4334k1778j8812j5514j3147
56761A56074j2054j1042r516q346p945p331n947m688m234l906l103k370k229k312
56747G1051k347k612k821k097o78nm98r33o53n28r32p48M82J313O63m18o02l86
$$ plain form
56832 628775 703068 780384 851469 905357 933689 933226 906087 858888 800450 738282 676603 617705
56820 617705 564039 517925 480080 449813 426506 410064 400336 397182 400990 412400 431718 459175
56808 459175 495296 540163 592164 647400 699645 740852 763353 763339 742558 706437 660902 610866
56796 610866 560129 511269 465784 424891 389756 360666 336859 317827 303991 295629 292135 293037
56784 293037 298806 309866 325811 346314 371539 400336 428764 451596 464862 466468 455777 434123
56772 434123 405087 372735 339658 307264 276931 249659 225325 203547 184735 169221 156074
56761 156074 144020 132978 123462 115116 107171 99840 93893 89205 84971 81065 77962 75592 73363 71051
56747 71051 68704 66092 63271 61174 60496 60491 59993 59060 58407 57879 56947 56199 56681 57994 58657 58239 57637 57251
56729E7251q11j460j353o85j75L63J324K077J798Q48J19k84n94l91O99J952K303
56712F2981J750J132R29J013J145J130R55J084J878K577J885r2j674j813j273
56697G3607j092j147r91q56r22p21p7L42J68l1O5j07p41j001m69J2j61j87O91
56678F6382J745J883J258O55J89l03m39R1P66J019J124J458J676J438J157J246
56662H1345J346J011M48K6k11j03N10Q83j07k000k737j433L33R19Q17J211J807
56645H4065J668J092J062J516J610J267J165J559K102K426K222J279J22j55O47
56630A03647J350J061L50J09K74N03J028J871K225J686J127J321J614J082J36
56615A19384k38q2k18q95j672k131k006j185j96O2m59q76r06j257k009k079j058
$$ plain form
56729 57251 56440 54980 53627 52942 52767 53130 54454 56531 58329 59177 59296 59012 58418 58027 58726 60678 62981
56712 62981 64731 65863 66792 67805 68950 70080 71035 72119 73997 76574 78459 78367 76693 74880 73607
56697 73607 72515 71368 70377 69521 68599 67878 67801 68143 68311 68280 68345 68238 67497 66496 66027 66039 65878 65691 66382
56678 66382 68127 70010 71268 71923 72112 71809 71370 71461 72227 73246 74370 75828 77504 78942 80099 81345
56662 81345 82691 83702 84150 84176 83965 83862 84372 85255 85148 83148 80411 78978 79311 80230 81047 82258 84065
56645 84065 85733 86825 87887 89403 91013 92280 93445 95004 97106 99532 101754 103033 103155 103000 103647
56630 103647 104997 106058 106408 106517 106791 107294 108322 110193 112418 114104 115231 116552 118166 119248 119384
56615 119384 119146 119064 118846 117951 116279 114148 112142 110957 110761 110823 110364 109488 108582 107325 105316 103237 102179
56598A02179r1K3Q4P40J108M30k90Q2Q60Q24L11L26O10L16k38j32M52P05O78R00
56578A09877J102Q03N50J093J953K132J750J594J674J508J309J528J763J505J396
56563A31537K434M306N786O445O838P463Q474R948J1364J1434R471O408L669J808
56549B27385R18J253K349K735J736N57L49M40j68q61o02N0j20r30j478j911k810
56532B28892l639l631l396l870m416l874k769k558l322m028m445m967n175m526
56518A74276l852m156m617l866k565k433l208l078j862j212j564j490l74O13P40
56503A41352P90J304J657J546J601J903J544K86p83q53l46J18M26K99o91k018
56487A48135k445j691o97n3N72J215J299Q29O35J052J499J620J706J793J530J098
$$ plain form
56598 102179 102088 102111 102195 102935 104043 104473 104183 104265 105125 105949 106260 106586 107196 107512 107274 107142 107594 108299 108977 109877
56578 109877 110979 111782 112332 113425 115378 117510 119260 120854 122528 124036 125345 126873 128636 130141 131537
56563 131537 133971 138277 144063 150508 157346 164809 173283 183231 194595 206029 215500 221908 225577 227385
56549 227385 228303 229556 231905 234640 236376 236933 237282 237722 237554 236693 236091 236141 236021 235091 233613 231702 228892
56532 228892 225253 221622 218226 214356 209940 206066 203297 200739 197417 193389 188944 183977 178802 174276
56518 174276 170424 166268 161651 157785 155220 152787 149579 146501 144639 143427 141863 140373 139999 140612 141352
56503 141352 142142 143446 145103 146649 148250 150153 151697 151983 151200 150347 150001 150119 150545 150844 150153 148135
56487 148135 145690 143999 143302 143249 143821 145036 146335 147164 147799 148851 150350 151970 153676 155469 156999 158097
56471A58097J124J450J211K81m54m84j99Q4N32J101J437J568J753J772J398J267
56455A71938K131L461M091M080M385M944M615L129J556O80K76J67N07Q40K99j006
56439B06093k038k475k950l594l713l177k716k557k043r90j93j89n81q40q83p42
56423A76412n35o94j205j008O48K632L268K845L055M129M554L770L083L328L582
56408B07864K958K049J642J381O82j03l91m04o81j165j408j205p39m11n76j013
56392B08480r61k07L14j55r36r50m22l42p99j186j473j773j365K53J862J958J194
56375B03492J364K459K925K683L376N407P087P312O929O804O497N632M772M200
56361B70939L327K036J055N07m38j969l165l570l740l790k987j300J22N66N76
$$ plain form
56471 158097 159221 160671 161882 162163 161709 161225 161026 161110 161642 162743 164180 165748 167501 169273 170671 171938
56455 171938 174069 177530 181621 185701 190086 195030 199645 202774 204330 205010 205286 205453 205960 206800 207099 206093
56439 206093 204055 201580 198630 195036 191323 188146 185430 182873 180830 179840 179647 179458 178877 178037 177154 176412
56423 176412 175877 175183 173978 172970 173618 176250 179518 182363 185418 189547 194101 197871 200954 204282 207864
56408 207864 210822 212871 214513 215894 216576 216473 216082 215678 214997 213832 212424 211219 210480 210069 209493 208480
56392 208480 207519 207312 207626 207471 206535 205585 205163 204821 204022 202836 201363 199590 198225 198478 200340 202298 203492
56375 203492 204856 207315 210240 212923 216299 221706 228793 236105 243034 249838 256335 261967 266739 270939
56361 270939 274266 276302 277357 277864 277426 275457 272292 268722 264982 261192 258205 256905 257027 257593 258169
56346B58169P98J269K052L168L799K981J234Lm59r76j427q59L78Q18M10O65J921
56329B73944K719K441K245K707K755J872J227J646K340K629L036L762L874L025
56315C10222K256K177K032J358Q95R57O33m80j408j451j130q16p6R77J417J272
56299C18835J738L046L970M006M010M064L047J064l3L92O18m44j415r11L13J065
56283C43365J558K102K030J329J397K747L818L446K635K491K385J745J698L135
56269C75881M896N477N040M292L106J699J374K562L777M020M433O000P520P526
56255D37603O614O129O140O326P258R153J0902J1851J2956J4801J6302J6866J7892
56242E80793K0367K2881K3869K4068K4842K5823K6098K6119K6513K6501K5238
$$ plain form
56346 258169 258967 260236 262288 265456 269255 272236 273470 273473 273014 272038 270611 269752 270130 270948 271358 272023 273944
56329 273944 276663 279104 281349 284056 286811 288683 289910 291556 293896 296525 299561 303323 307197 310222
56315 310222 312478 314655 316687 318045 318940 319897 320530 320050 318642 317191 316061 315245 315169 316146 317563 318835
56299 318835 320573 323619 327589 331595 335605 339669 342716 343780 343747 344139 344757 344313 342898 341987 342300 343365
56283 343365 344923 347025 349055 350384 351781 354528 358346 361792 364427 366918 369303 371048 372746 375881
56269 375881 380777 386254 391294 395586 398692 400391 401765 404327 408104 412124 416557 422557 430077 437603
56255 437603 444217 450346 456486 462812 470070 479223 490125 501976 514932 529733 546035 562901 580793
56242 580793 601160 624041 647910 671978 696820 722643 748741 774860 801373 827874 853112
56231H53112K3225K0839J7283J2557Q475N868K863j983o968r863j1233j2807j4446
56218H86922j5257j5910j7236j8085j7231j5909j5898j6495j5956j4640j4100
56207G10205j4272j4037j3468j3088j2125r851p478o373n702m124k399j828j530
56194F03930M8K151K968K699K790L160K838K253K365K584K030J642K533L517K976
56179F40484J857K042L020L164L027M204N929O052M663L635L299K599J923K585
56165F88483M004M406L876L891M288L705K506K366L252L704L710M454N602N745
56151G43992N269N903P652Q937R501J0481J1826J2438J2658J3953J6232J8015
56139H76857J9027K0156K1271K1597K1963K4091K7976L2374L7411M4323N3207
$$ plain form
56231 853112 876337 897176 914459 927016 935491 941359 944222 942239 935271 925408 914175 901368 886922
56218 886922 871665 855755 838519 820434 803203 787294 771396 754901 738945 724305 710205
56207 710205 695933 681896 668428 655340 643215 633364 625886 619513 613811 609687 607288 605460 603930
56194 603930 603978 606129 609097 611796 614586 617746 620584 622837 625202 627786 629816 631458 633991 637508 640484
56179 640484 642341 644383 647403 650567 653594 657798 663727 669779 674442 678077 681376 683975 685898 688483
56165 688483 692487 696893 700769 704660 708948 712653 715159 717525 720777 724481 728191 732645 738247 743992
56151 743992 749261 755164 762816 771753 781254 791735 803561 815999 828657 842610 858842 876857
56139 876857 895884 916040 937311 958908 980871 1004962 1032938 1065312 1102723 1147046 1200253
56128A200253O3495P5863R1063J07503J22483J34731J43079J44094J34792J17237
56118B334593R7342P9581O5673N7059N4424N4825N2995M6045L4563K0018M344
56107B901462q635j5251j5960j4659j4729j8408k8456m6182o8084q8153j03388
56096B479557j13889j18694j15970j07134r6391q5729p4105o1563n0348m1449
56086A614285l3643k6353k0221j4842r200m177j381J06K457N279O743P617J0113
56073A536783J3410J4748J4453J5308J7335J7911J6928J7041J8741J9876K0154
56062A722688K1459K3587K4346K4065K5230K7625K8623K8330K9375L1611L2247
56051B019186L1343L1757L3404L3215L1167L0565L1787L1711L0080L0410L3387
$$ plain form
56128 1200253 1263748 1339611 1430674 1538177 1660660 1795391 1938470 2082564 2217356 2334593
56118 2334593 2431935 2511516 2577189 2634248 2688672 2743497 2796492 2842537 2877100 2897118 2901462
56107 2901462 2892827 2877576 2861616 2846957 2832228 2813820 2785364 2739182 2671098 2582945 2479557
56096 2479557 2365668 2246974 2131004 2023870 1927479 1841750 1767645 1706082 1655734 1614285
56086 1614285 1580642 1554289 1534068 1519226 1510026 1505849 1504468 1504574 1507031 1512310 1519053 1526670 1536783
56073 1536783 1550193 1564941 1579394 1594702 1612037 1629948 1646876 1663917 1682658 1702534 1722688
56062 1722688 1744147 1767734 1792080 1816145 1841375 1869000 1897623 1925953 1955328 1986939 2019186
56051 2019186 2050529 2082286 2115690 2148905 2180072 2210637 2242424 2274135 2304215 2334625 2368012
56040B368012L5418L5057L5061L6789L8261L9101M1562M5375M7411M7685M9658
56029B819390N3436N4986N3523N3217N5930N8815O0677O4146O9626P3783P5944
56018C493473P9325Q4179Q6667Q6413Q7915R2434R5886R6946R9570J05225J10440
56007D518473J14523J21376J31030J37876J40432J44243J51834J58700J62863
55998E781350J69244J80312J91491K00219K10621K24703K38041K48719K61430
55989G706130K78112K94027L07703L24867L47771L70987L92545M18372M50697
55980A0891211M83676N15877N54754O02976O53283P03214P61156Q31033R05707
55971A6902887R83177J073949J184028J306784J440523J597016J783371J994363
$$ plain form
56040 2368012 2403430 2438487 2473548 2510337 2548598 2587699 2629261 2674636 2722047 2769732 2819390
56029 2819390 2872826 2927812 2981335 3034552 3090482 3149297 3209974 3274120 3343746 3417529 3493473
56018 3493473 3572798 3656977 3743644 3830057 3917972 4010406 4106292 4203238 4302808 4408033 4518473
56007 4518473 4632996 4754372 4885402 5023278 5163710 5307953 5459787 5618487 5781350
55998 5781350 5950594 6130906 6322397 6522616 6733237 6957940 7195981 7444700 7706130
55989 7706130 7984242 8278269 8585972 8910839 9258610 9629597 10022142 10440514 10891211
55980 10891211 11374887 11890764 12445518 13048494 13701777 14404991 15166147 15997180 16902887
55971 16902887 17886064 18960013 20144041 21450825 22891348 24488364 26271735 28266098
55963B8266098K233393K521049K872095L286820L778271M384133N138906O063806
55955E8544571P201093Q626778J0411060J2602860J5273188J8525213K2423956
55948A53608719K6928020L1808599L6381737L9157868L8022099L1354439J9412901
55941C76674382M640634r579370k0675838k7737062l1150527l1815728l0648882
55934B29707609k8420793k5694412k2812142j9969602j7299136j4882113j2739138
55927H7890273j0862360r249874p892731o755372n795674m989593m319264l755422
55919C4269983l270731k856227k508334k212357j952811j727471j537369j373657
55911A6831026j226601j097113r87864q92428q03881p25092o60318o04898n52768
$$ plain form
55963 28266098 30499491 33020540 35892635 39179455 42957726 47341859 52480765 58544571
55955 58544571 65745664 74372442 84783502 97386362 112659550 131184763 153608719
55948 153608719 180536739 212345338 248727075 287884943 325907042 357261481 376674382
55941 376674382 381315016 371735646 351059808 323322746 292172219 260356491 229707609
55934 229707609 201286816 175592404 152780262 132810660 115511524 100629411 87890273
55927 87890273 77027913 67778039 59885308 53129936 47334262 42344669 38025405 34269983
55919 34269983 30999252 28143025 25634691 23422334 21469523 19742052 18204683 16831026
55911 16831026 15604425 14507312 13519448 12627020 11823139 11098047 10437729 9832831 9280063
55902I280063n06170m68751m36452m04007l73640l49118l27494l04493k82041
55893E827897k63252k45684k26400k08049j93500j79922j64376j49681j38688
55884D058345j28174j14481r9887q7324p3973n6208l6194j7544R43K1057L8792
55873C505352M8107M7701L8990K1505m000l1469n4504p3189r1426j10260j28056
55862C168751j44031j56880j62784j59468j50038j38998j27060j13439j00070
55853A915983q9315q0215p1023o2990n7895n4371n0378m6801m4988m3337m0008
55842A274662l6463l4693l3363l0348k6719k4597k3260k1041j8896j8495j8692
55831I88095j7382j5129j3711j2932j1867j1405j2466j3547j3056j2237j2950
$$ plain form
55902 9280063 8773893 8305142 7868690 7464683 7091043 6741925 6414431 6109938 5827897
55893 5827897 5564645 5318961 5092561 4884512 4691012 4511090 4346714 4197033 4058345
55884 4058345 3930171 3815690 3715803 3628479 3554506 3498298 3462104 3444560 3445503 3466560 3505352
55873 3505352 3553459 3601160 3640150 3661655 3657655 3626186 3571682 3498493 3407067 3296807 3168751
55862 3168751 3024720 2867840 2705056 2545588 2395550 2256552 2129492 2016053 1915983
55853 1915983 1826668 1746453 1675430 1612440 1554545 1500174 1449796 1402995 1358007 1314670 1274662
55842 1274662 1238199 1203506 1170143 1139795 1113076 1088479 1065219 1044178 1025282 1006787 988095
55831 988095 970713 955584 941873 928941 917074 905669 893203 879656 866600 854363 841413
55820H41413j4473j5226j5606j6366j6365j4781j3284j3178j2718j0348p976p751
55808F83341p978n981k933j835k435k098m45O53P70J109J693J605J235J496J678
55793F69875P54j80N12K095K688K271J937J424J9j382j627j379j406o55J163R88
55777F77097m101j2238j8960k2755k5021k5834k3728j9177j4614j0912o873k131
55765D90753K096M887N851M143j65m455n994n442n355o174o460o231o814p959
55751D52681q161p577p695q454q589q353q961r789r160p551o902p059o154m339
55737C43937l707m419m363l019k347l181l941l800m071n441o568o553o378o791
55723B79358p049o649o234n892m755l032k280k843l072j942m07O20J569K619K941
$$ plain form
55820 841413 826940 811714 796108 779742 763377 748596 735312 722134 709416 699068 691092 683341
55808 683341 675363 669382 666449 664614 662179 660081 659636 660289 661059 662168 663861 665466 666701 668197 669875
55793 669875 670629 670449 670961 673056 675744 678015 679952 681376 681395 680013 678386 677007 675601 674946 676109 677097
55777 677097 672996 660758 641798 619043 594022 568188 544460 525283 510669 499757 492884 490753
55765 490753 492849 497736 503587 507730 507565 503110 497116 491674 486319 480145 473685 467454 460640 452681
55751 452681 444520 436943 429248 420794 412205 403852 394891 385102 375942 368391 361489 354430 348276 343937
55737 343937 340230 335811 331448 328429 326082 322901 318960 315160 311089 305648 299080 292527 286149 279358
55723 279358 272309 265660 259426 253534 248779 245747 243467 240624 237552 235610 235203 235823 237392 240011 242952
55708B42952K509K849M772O949P692O701M412J182k133m346n406o332p243p123
55694B47435n960n214n490n586m704l691l169k179m8J956K201P90r84k338l131
55679B09888l247k820k359k067j692j410j830k838l531l611l750m180m218l545
55665A68790k762k202j504p62q05j727k412k062j155l41M51J327J951K301K857
55650A61945L615L927L614L201K858K250J673J988L169M126M256L916L216J805
55636B05559M2j192k075l650n701o713o314n929o309o342n187l768l045k510j544
55621A45322p45p19q80o70o22j101j344q66n49j051j438p81R5j23j161j791j772
55604A29804j754j954k087k092j933j298l92j93r85j508o14J066K109K090J404
$$ plain form
55708 242952 245461 248310 253082 260031 267723 274424 278836 280018 277885 273539 268133 261801 254558 247435
55694 247435 241475 236261 230771 225185 220481 216790 213621 211442 211394 213350 215551 216341 215357 213019 209888
55679 209888 206641 203821 201462 199395 197703 196293 194463 191625 188094 184483 180733 176553 172335 168790
55665 168790 166028 163826 162322 161560 160755 159028 156616 154554 153399 153058 153509 154836 156787 159088 161945
55650 161945 165560 169487 173101 176302 179160 181410 183083 185071 188240 192366 196622 200538 203754 205559
55636 205559 205601 204409 202334 198684 192983 186270 179956 174027 167718 161376 156189 152421 149376 146866 145322
55621 145322 144577 143858 142978 142308 141686 140585 139241 138375 137826 136775 135337 134556 134651 134528 133367 131576 129804
55604 129804 128050 126096 124009 121917 119984 118686 118294 118101 117116 115608 114994 116060 118169 120259 121663
55589A21663K33j089j603r17j73n58j457j432m19L61L24J2l7J85O56J321J853
55572A18923K170K907M545O533Q097R415J1042J2553J2819J1448R074O434L899
55559B19859J693j79k081m260o457q379j0102j1540j2118j1547j0396r307q292
55546A26894p237o407n851n178m418m155m160l168r51O81L20q26p46K83K76j302
55530H4055k956l520l300k812k021j218j131j755k119j664q56j34P62K031L178
55515F6540L622L394K887K380J978J691J471J360J468J587J225L33m19o46q51
55500H8020j450j779j074J28N30j91j167j617j523j158q52j018j658k060j744
55485G1387j288j439j850j664r89o24o34l87J25K56k7N6Q79J992K953L675L925
$$ plain form
55589 121663 121896 120807 119204 118287 118114 117556 116099 114667 114248 114609 114933 114945 114908 115093 115749 117070 118923
55572 118923 121093 124000 128545 135078 143175 152590 163632 176185 189004 200452 209526 215960 219859
55559 219859 221552 221373 219292 215032 208575 200196 190094 178554 166436 154889 144493 135186 126894
55546 126894 119657 113250 107399 102221 97803 93648 89488 86320 85369 86050 86370 85544 84798 85081 85357 84055
55530 84055 81099 77579 74279 71467 69446 68228 67097 65342 63223 61559 60703 60569 61331 63362 66540
55515 66540 70162 73556 76443 78823 80801 82492 83963 85323 86791 88378 89603 89936 89517 88871 88020
55500 88020 86570 84791 83717 83845 84375 84184 83017 81400 79877 78719 77867 76849 75191 73131 71387
55485 71387 70099 68660 66810 65146 64157 63533 62899 62512 62637 62893 62866 62922 63801 65793 68746 72421 76346
55468G6346L447K635K189K095J815J408J465J979K312K294K204J786N00j105j635
55453I9735q07L1k33j214k044k536k775k576k051j826k066j990r79M62J398J501
55437H2030R53K1q36j014m77J32L92N37P14N72Km36l26j8J16L15P83J021N06m53
55417H4534j098j104n93K99J297J848J646J106Q84J138J554J776J586R75K97k7
55401I6118j28n60j376j938j874j640j732j990k039j872j527q09J95Q53Q02N09
55385H0992N00N33J44m18n29r6M31P35P22K93m02p83m43K25N68N25M16K17k88
55366H3342q53j034q84q09p25j74P13J117O34j56n22m83n46q19q99m66K81Q22
55348G8539P92K80k37k79K49Q55Q08j54j375j847j358p49p90j174j117o17k76
$$ plain form
55468 76346 79793 82428 84617 86712 88527 89935 91400 93379 95691 97985 100189 101975 102475 101370 99735
55453 99735 98928 98959 98726 97512 95468 92932 90157 87581 85530 83704 81638 79648 78669 79131 80529 82030
55437 82030 82983 83004 82168 81154 80677 80809 81201 81738 82452 83024 83026 82590 82264 82246 82362 82677 83460 84481 84987 84534
55417 84534 83436 82332 81739 82038 83335 85183 86829 87935 88819 89957 91511 93287 94873 95848 96145 96118
55401 96118 95990 95430 94054 92116 90242 88602 86870 84880 82841 80969 79442 78633 78828 79681 80483 80992
55385 80992 81492 82025 82169 81751 81222 81126 81557 82292 83014 83307 82905 82122 81679 81904 82472 82997 83413 83630 83342
55366 83342 82489 81455 80571 79762 79037 78863 79576 80693 81327 81171 80649 80166 79620 78801 77902 77436 77717 78539
55348 78539 79331 79611 79374 79095 79344 80199 81007 80853 79478 77631 76273 75524 74734 73560 72443 71826 71550
55331G1550j47L46J145J325M87n06q43r33j448j887j189N31J936K143J617J236
55315G5363J202J141P73J40n13r46j085j019p92l83J7L7l14m71j14K60J02k34
55297G3164N0R39J620J594J160P05L10J10L20O71N65M0m8P72J764J929J291O31
55279H7587L06Jn05r68j121j017q26o18m73m50l91m6M59O02R4o30q29l01L97N36
55259H1807p1r47j394j085l45J64J08j73q9M85J093J322J247J174J124Q74M02
55242H5696Pm6J55K92J79m1l8L13O60M74k74r34r08l76lp1k88m38o88j116j341
55221H1214r60j50M55M67J26m6J92N51N64J61k07r3L80P12O49L63R7p9j21M1L43
55200H4659N80O73P35Q22Q50P63O00L87J81J14J42r8p98j448j322n05J61K07L8
$$ plain form
55331 71550 71403 71749 72894 74219 74706 74200 73357 72424 70976 69089 67900 68431 70367 72510 74127 75363
55315 75363 76565 77706 78479 78619 78106 77160 76075 75056 74264 73881 73898 73935 73621 73150 73036 73296 73398 73164
55297 73164 73214 74153 75773 77367 78527 79232 79542 79652 79972 80643 81208 81248 81200 81972 83736 85665 86956 87587
55279 87587 87893 87894 87389 86421 85300 84283 83457 82839 82366 81916 81525 81479 81938 82540 82634 82004 81175 80874 81271 81807
55259 81807 81736 80789 79395 78310 77965 78129 78237 78064 77975 78460 79553 80875 82122 83296 84420 85294 85696
55242 85696 85703 85657 85812 86104 86283 86242 86204 86517 87177 87651 87377 86443 85535 85159 85156 85085 84797 84359 83671 82555 81214
55221 81214 80254 80104 80559 81026 81152 81106 81298 81849 82413 82574 82367 82274 82654 83366 84015 84378 84475 84396 84275 84316 84659
55200 84659 85239 85912 86647 87469 88319 89082 89682 90069 90250 90364 90506 90408 89610 88162 86840 86335 86496 86703 86741
55181H6741J32L70M94O28Q84Q90K55p72j564j770j404o06L02P92O37K53J56L31
55163H6749M66N17O01N60J91l03n73o96r64j244j097n26L4M13Q34J211J034K12
55145H7419m93l62K68M19k17r11r20m96n06j159j609j065M3N49J48j99L07J060
55127H2276R05j05o47J40J510K068J353P9r47j573j994k122j661o54L81R85J148
55110H1142J048O23j86r47j002k70O34J214J566J862J856J294M77%Q1M62Q45J066
55092I1765J104J144J442J835J672N95q32j618j467r48p41r53j194r76j59Q08
55076I1477J176O94n6l71k71k86o69j207j626j809j700j363j049q38m01M63J256
55059H3420J314P83N34J027J731J808R93k65j233j386q63m40p09j284j198j71
$$ plain form
55181 86741 86873 87243 87737 88365 89249 90139 90394 89622 88058 86288 84884 84278 84580 85372 86009 86262 86418 86749
55163 86749 87215 87732 88333 88893 89084 88781 88208 87512 86548 85304 84207 83681 83715 84128 84962 86173 87207 87419
55145 87419 86926 86564 86832 87251 87034 86123 85203 84707 84201 83042 81433 80368 80411 80960 81108 80909 81216 82276
55127 82276 83181 83076 82429 82569 84079 86147 87500 87579 86632 85059 83065 80943 79282 78628 79009 79994 81142
55110 81142 82190 82813 82627 81680 80678 80408 81042 82256 83822 85684 87540 88834 89311 89311 89392 89854 90699 91765
55092 91765 92869 94013 95455 97290 98962 99557 98725 97107 95640 94692 93951 92998 91804 90828 90669 91477
55076 91477 92653 93347 93291 92920 92649 92363 91694 90487 88861 87052 85352 83989 82940 82102 81701 82164 83420
55059 83420 84734 85517 86051 87078 88809 90617 91610 91345 90112 88726 87863 87423 86714 85430 84232 84061
55043H4061R62J213N39k22k93K74P07L88l54n33K49J218J396Q31L25K39K21J1
55025I1232k48m84q33j141r62k89K77L63K82M06N63M34J34j0M9J68L41O16Q46
55006I1744Q76P92P57P37N92L36O7j94m85p77r61r29n66J09Q20J186J090P53M07
54987I6354J16j14k28j76j1J83K86K32J59L17O59P18J70o12r22n27K40R51J346
54968I9141J280Q87O37Q12J069R50N89L36L1o17j144p95J67O01J27l94k49J77
54950A03605L22L75P00J020Q99M98K04rk92m19j68K01L58M46O87Q54O59K81K1
54931A10242j93m13k32N94J475J602J030M72K79L08O21J523K835L869M230M265
54915A32507M589N513O972Q617R957J0568J0220Q713N991K591m59k627m356o158
$$ plain form
55043 84061 85023 86236 86775 86553 86260 86534 87241 87629 87275 86742 86991 88209 89605 90436 90761 91000 91221 91232
55025 91232 90984 90500 89667 88526 87564 87275 87552 87915 88197 88603 89166 89600 89734 89724 89773 89941 90282 90898 91744
55006 91744 92620 93412 94169 94906 95498 95834 95901 95707 95222 94445 93484 92555 91989 92098 92918 94104 95194 95947 96354
54987 96354 96470 96356 96128 95952 95941 96124 96410 96642 96801 97118 97777 98495 98665 98053 97131 96604 96844 97795 99141
54968 99141 100421 101308 101945 102757 103826 104776 105365 105701 105732 105115 103971 103176 103343 103944 104071 103677 103428 103605
54950 103605 103927 104302 105002 106022 106921 107419 107623 107614 107322 106903 106735 106936 107294 107740 108427 109281 109940 110221 110242
54931 110242 110049 109636 109404 109998 111473 113075 114105 114577 114856 115164 115785 117308 120143 124012 128242 132507
54915 132507 137096 142609 149581 158198 168155 178723 188943 197656 203647 206238 205779 203152 198796 192638
54901A92638p651q129p667o914o094n074m158l919m225m251l646k922k571k466
54887A22951k322k051j518n62N12J107J245J626K537L366L594L566L787M059L939
54872A45836L653L868M755N888O997Q164R215R399P914M678N53l142n462o385
54858A95931o535o387n987n375m890m803m957n094n276n630n890n602m756l792
54844A20957l019k385j811j402j208j074r19q68r53r23o13l22m78r91j292j055
54828A01644n83l33l18k54m6J37J80J21J0j01q8O1J11n7r3L44Q09M64o20j259
54808A00129o77M54J092J283J686K076J523P0q87m17O63R90N02K61O96J009L94
54791A10847p88j509j297n90NL26M85M84K46q6k02J7L41M53K65j5O8R46K507L807
$$ plain form
54901 192638 184987 176858 169191 162277 156183 151109 146951 143032 138807 134556 130910 127988 125417 122951
54887 122951 120629 118578 117060 116498 117010 118117 119362 120988 123525 126891 130485 134051 137838 141897 145836
54872 145836 149489 153357 158112 164000 170997 179161 188376 197775 205689 210367 210920 207778 202316 195931
54858 195931 189396 183009 177022 171647 166757 161954 156997 151903 146627 140997 135107 129505 124749 120957
54844 120957 117938 115553 113742 112340 111132 110058 109139 108271 107318 106395 105782 105460 104982 103991 102699 101644
54828 101644 101061 100728 100410 100156 100110 100247 100427 100548 100558 100457 100369 100430 100541 100484 100391 100735 101544 102008 101388 100129
54808 100129 99452 99906 100998 102281 103967 106043 107566 107636 106749 106332 106995 107985 108487 108748 109444 110453 110847
54791 110847 110059 108550 107253 106663 106668 106994 107479 107963 108209 108123 107921 107938 108279 108732 108997 108982 109050 109996 112503 116310
54771A16310L834K677J584J525K147K515K535L003M410O344Q125R467J0346J0693
54757A85515J0512R977R247Q276O907M959K235j214m760p456q806r091q847q351
54743A89103p682o968o221n178l719k342j888k584l570l624k392q05p8l89p95
54728A40868m89K58O28M17J63K91O51R82J368K082L199M516N681O412O820P411
54712A81258Q380Q950P995N413K352k07k483n095p745r413r588q726p533o453
54698A57105n839n918o365o388n609m447l378k224p18O12Q90J62m33o1P70R52
54682A19111J06j187k211k615k291j407n42l05o65j054j084q20l07M83J178J149
54666A07539M42n0K45P77P55K70n7j24k52m28m15m52r97j725j676n33Q31J386
$$ plain form
54771 116310 120144 122821 124405 125930 128077 130592 133127 136130 140540 146884 155009 164476 174822 185515
54757 185515 196027 206004 215251 223527 230434 235393 237628 236414 231654 224198 215392 206301 197454 189103
54743 189103 181421 174453 168232 163054 159335 156993 155105 152521 148951 145327 142935 142130 142052 141663 140868
54728 140868 140379 140637 141265 141682 141845 142136 142787 143769 145137 147219 150418 154934 160615 167027 173847 181258
54712 181258 189638 198588 206583 211996 214348 214141 211658 206563 198818 189405 179817 171091 163558 157105
54698 157105 151266 145348 138983 132595 126986 122539 119161 116937 116219 116831 117721 117883 117450 117389 118159 119111
54682 119111 119217 118030 115819 113204 110913 109506 108964 108659 107994 106940 105856 105036 104729 105212 106390 107539
54666 107539 107981 107931 108176 108953 109708 109978 109921 109797 109545 109117 108702 108250 107253 105528 103852 103319 104150 105536
54648A05536J003L43J14N96J473K027J843J367J276J414J002k1o54k19O16P59
54632A18475J44k96O3Q29J182Q11K23J32N67P65J78o46p68k33l6o17j285j343
54614A18145j027p96m90P2L71j20r11j044m07K45M55L98K14k08o64o40q2M65O70
54595A14646P88J013J013N25j00l44k28j29j55p2K40O01P13L43n29j513j952j589
54577A13271q96m51j20N90J464J581O16m15l32O71J318R56K70J61N34N88j8p95
54559A18993j054o32l1M4o49j570j917j494q01k25L41R35J164Q05K92J50K80L48
54541A14979L79M65L20j12j34P62J752J616N64M4O74J635K179K498K681K195J037
54524A33534K83O09J194R97K92n3n2l17p96r22p18o34o05k38J90J2n66n21M39
$$ plain form
54648 105536 106539 106882 106996 107592 109065 111092 112935 114302 115578 116992 117994 117973 117319 117100 117716 118475
54632 118475 118619 118323 118386 119215 120397 121208 121431 121563 122130 122895 123073 122427 121659 121426 121390 120773 119488 118145
54614 118145 117118 116322 115832 115904 116275 116155 115244 114200 113793 114038 114493 114891 115105 114897 114233 113593 113511 113976 114646
54595 114646 115434 116447 117460 117985 117885 117541 117313 117184 117029 116957 117197 117798 118511 118854 118325 116812 114860 113271
54577 113271 112375 111924 111804 112394 113858 115439 116055 115640 115308 115979 117297 118253 118523 118684 119218 119806 119788 118993
54559 118993 117939 117307 117276 117320 116671 115101 113184 111690 110889 110664 111005 111940 113104 113909 114201 114351 114631 114979
54541 114979 115358 115823 116143 116031 115897 116659 118411 120027 120591 120635 121309 122944 125123 127621 130302 132497 133534
54524 133534 133817 134426 135620 136617 136909 136856 136804 136487 135691 134769 134051 133417 132812 132574 132764 132776 132210 131689 132128
54505A32128J282R74k87j487j882j429n31K30L84q5p03q57k35Q61J599J337M47
54488A31746l4K25M49Q8k53P7M44j10j104j136PJ095J320J168J043N07n76j231
54470A33725o66N20J257J472J747K059J909J340R38Q37N94O2l22k01K68P84J226
54453A47549J428J060J0j298k113j871o44P33J138J42j373j976j169Q0M81j69
54437A42008r69j141q81q49j184j360r93l14K79P28J087J110N01m33r12n71J20
54420A36226M60K58j53l94k50L51J281K126K385J863R02J39j8K31L46J08r2J69
54402A45938P11R75P92N68O69R81J121Q44J30p98j454j290k01J278K353K502J754
54385A56873O72NL5K44r0r23j508j481j364j661j935j371r7P05J29j370k493k495
$$ plain form
54505 132128 133410 134384 134097 132610 130728 129299 128768 128998 129382 129297 128594 127737 127502 128363 129962 131299 131746
54488 131746 131712 131937 132386 132474 132221 132298 132742 132632 131528 130392 130399 131494 132814 133982 135025 135532 134956 133725
54470 133725 133059 133579 134836 136308 138055 140114 142023 143363 144301 145138 145732 145794 145472 145271 145539 146323 147549
54453 147549 148977 150037 150047 148749 146636 144765 144121 144854 145992 146134 144761 142785 141616 141696 142177 142008
54437 142008 141039 139898 139017 138168 136984 135624 134631 134317 134596 135324 136411 137521 138022 137589 136677 136106 136226
54420 136226 136686 136944 136791 136397 136147 136498 137779 139905 142290 144153 145055 145194 145176 145407 145753 145861 145769 145938
54402 145938 146649 147624 148416 148984 149653 150634 151755 152599 152729 151931 150477 149187 148986 150264 152617 155119 156873
54385 156873 157545 157550 157585 157829 157739 156816 155308 153827 152463 150802 148867 147496 147399 148104 148233 146863 144370 141875
54367A41875j750j043o24k22K94N85L64j39m47m39l48k80o2M15R79J323J256P55
54349A42492Q9k20J94J046J547J141k5j298k039j984j385q17o59p51p66p59j023
54332A34783j484j650j257n65L3M13O00O06M99L31j9o35j179j184p04k47j9K20
54314A28542M52K96j53j43N72J093O32j93j85O23R81K18q77j211o95k0L60N53
54296A30845Q15J073R82L88k53k34M62Q82K97o54p40J04P24N61M53J138J905J633
54278A40381N65j17j45l94j180j537o93O17J087N18j77l77l49n19q39j033j016
54261A34792r17r09j066j161p77J51J063J471J622J907J899R04o17j233n18K03
54245A36814k71j320j523o62L20Q60J146J120L58r29j784j682j084n86k76j74
$$ plain form
54367 141875 140125 139082 138458 138236 138530 139115 139479 139340 138893 138454 138106 137826 137764 138179 139158 140481 141737 142492
54349 142492 142581 142361 142555 143601 145148 146289 146264 144966 142927 140943 139558 138741 138082 137331 136565 135806 134783
54332 134783 133299 131649 130392 129827 129860 130273 130873 131479 131978 132309 132290 131655 130476 129292 128588 128341 128322 128542
54314 128542 128994 129290 129137 128994 129566 130659 131291 131098 130913 131536 132517 132735 131858 130647 129952 129932 130292 130845
54296 130845 131660 132733 133715 134103 133850 133616 134078 134960 135257 134603 133863 133967 134691 135252 135705 136843 138748 140381
54278 140381 140946 140829 140684 140290 139110 137573 136880 137497 138584 139102 138925 138548 138199 137680 136841 135808 134792
54261 134792 133875 132966 131900 130739 129962 130113 131176 132647 134269 136176 138075 138979 138362 137129 136611 136814
54245 136814 136543 135223 133700 133038 133358 134218 135364 136484 136842 135913 134129 132447 131363 130777 130501 130327
54229A30327m90j062j239p60k21j71k53J44Q76J238R31K91k62m99k40M83J152
54212A30245J080K06p07q61l21K3n70j801k573k198j129l21j14j52j62k24k55
54195A20166Q5P65J172R10L78L08R51J979K758K616J242p53k098k077j190l65
54179A26847J09M63O94N50Q3k85k72M9M56P14N62m9p79j138r30l01M64J020J074
54160A29331O21L3l28m03k68K4L01K92Mj92p5J66L31N59Q96R88O06J61K25P33
54140A34005J075Q30K7j072k027k265j565m71J99J73j34j83L21J286K168K251
54124A34618J417L88j21k14l84o55p33o54o08l54M11J240J300N43k47o34q84j001
54106A33428l82J071K237J991P15j33J70Q83R52L44j32K4M12L53k45q09q11l01
$$ plain form
54229 130327 129837 128775 127536 126776 126555 126384 126131 126275 127151 128389 129320 129611 129349 128850 128610 129093 130245
54212 130245 131325 131531 130824 129963 129642 129665 129095 127294 124721 122523 121394 121073 120959 120807 120645 120421 120166
54195 120166 120251 121016 122188 123098 123476 123784 124735 126714 129472 132088 133330 132577 130479 128402 127212 126847
54179 126847 126956 127419 128113 128663 128746 128461 128189 128238 128694 129408 129970 129921 129142 128004 127074 126773 127237 128257 129331
54160 129331 129952 129985 129657 129254 128986 129010 129311 129603 129607 129415 129340 129506 129837 130396 131292 132280 132886 133047 133272 134005
54140 134005 135080 135910 135937 134865 132838 130573 129008 128537 128736 128909 128775 128592 128913 130199 132367 134618
54124 134618 136035 136423 136302 136088 135704 135049 134316 133662 133054 132700 133111 134351 135651 136194 135947 135313 134429 133428
54106 133428 133046 134117 136354 138345 139060 138927 139097 139980 140932 141276 141144 141168 141580 141933 141688 140879 140068 139767
54088A39767K51M28J71k13k96M5M16M14J85J47K52P3l36l70J23N61O21P34J105
54069A44078J112L81l33k01L61M59K17L41P58Q41P41J065J406O96q67j712j067
54052A48276N2N03M36M32M07K12L08R71J596J597J411J751K380K513J989J347
54036A66181J111J531K633L946M638M555M582N331O031N620M459L923M486N212
54022B24239N194M609M116L951L884L664L172K398J489O97L26O45J563K252J640
54007B63839k71k116k665k235k015k431k972l259l399l408l180l062l537m255
53993B25034m232l260k279k048k235k210k017j938j738j077k93j40q07j782k506
53978A96472k744k441j708r54o03o31o68n98o95j060j283q87J3P33P10Q1m22j69
$$ plain form
54088 139767 140018 140446 140617 140404 140108 140153 140569 140983 141168 141315 141567 141640 141304 140934 141057 141618 142239 142973 144078
54069 144078 145190 145571 145238 145037 145398 145857 146074 146415 147173 148014 148755 149820 151226 151922 151055 149343 148276
54052 148276 148328 148831 149267 149699 150106 150318 150626 151597 153193 154790 156201 157952 160332 162845 164834 166181
54036 166181 167292 168823 171456 175402 180040 184595 189177 194508 200539 206159 210618 214541 219027 224239
54022 224239 229433 234042 238158 242109 245993 249657 252829 255227 256716 257413 257739 258384 259947 262199 263839
54007 263839 263568 261452 258787 256552 254537 252106 249134 245875 242476 239068 235888 232826 229289 225034
53993 225034 220802 217542 215263 213215 210980 208770 206753 204815 203077 202000 201707 201567 200760 198978 196472
53978 196472 193728 191287 189579 188625 188022 187391 186723 186125 185430 184370 183087 182200 182213 182946 183656 183737 183315 183146
53960A83146P23J451J350O47K28N59J089R71K42p9P67K318L413L467K888K330
53944B05510K025J865J822J992K419L026L658M162M462M619M687M653M734N476
53930B55110P061Q592Q704P079M798K976J665N41j05K78J495K787L809M750N707
53915C15247O734Q353J1058J4140J5883J5226J2630R133N320J698q67j857j872
53902D10826j818j726j089j65Jj012k402l260l598l887m084l835l274l000l212
53887C74465l470l509l732m586n799o664o931o963p052p032o653n987n249m566
53873B96272m097m055m307m238l431k345j829k061k435k527k677l354m323m822
53859B49771m414l429k572k307k535k778k671k321k129k257k422k216j500m76
$$ plain form
53960 183146 183869 185320 186670 187317 187545 188104 189193 190164 190406 190327 191094 193412 196825 200292 203180 205510
53944 205510 207535 209400 211222 213214 215633 218659 222317 226479 230941 235560 240247 244900 249634 255110
53930 255110 262171 270763 279467 286546 291344 294320 295985 296526 296421 296699 298194 300981 304790 309540 315247
53915 315247 321981 330334 341392 355532 371415 386641 399271 408404 413724 415422 414555 412698 410826
53902 410826 409008 407282 406193 406028 406029 405017 402615 399355 395757 391870 387786 383951 380677 377677 374465
53887 374465 370995 367486 363754 359168 353369 346705 339774 332811 325759 318727 312074 306087 300838 296272
53873 296272 292175 288120 283813 279575 276144 273799 271970 269909 267474 264947 262270 258916 254593 249771
53859 249771 245357 241928 239356 237049 234514 231736 229065 226744 224615 222358 219936 217720 216220 215744
53845B15744M29O92O3j077j922k043j758j578j522j354j145j148j274j156q05
53830B00146o43q00q57n54l18o05j061q74J13J117J288N72m00r08n99L47J243
53813A97207J403Q08J80J25M47M56o9o31o12J3O87Q50N12L17R98K608M357N335
53795B14991N360M986M756M718M626M381M085L876L817L837L705L124K036Q71
53781B69169L30Q22J984K858K735J827R34L71l15j422k360k403j886j821k440
53766B68383k939k905l041l967m978m885l691k566k253k417k530k679l109l578
53752B22845l631l146k350j492q38p11j145j699j826j446r31o17m65j37P05K014
53736B05130L171L510L261L653N637Q697J1385J2956J3801J4189J3354J0309N226
$$ plain form
53845 215744 216173 216865 216928 215851 213929 211886 210128 208550 207028 205674 204529 203381 202107 200951 200146
53830 200146 199503 198703 197846 197292 196974 196369 195308 194434 194547 195664 196952 197524 197124 196216 195617 195964 197207
53813 197207 198610 199418 199598 199723 200170 200626 200557 199926 199314 199327 200014 200864 201376 201693 202691 205299 209656 214991
53795 214991 220351 225337 230093 234811 239437 243818 247903 251779 255596 259433 263138 266262 268298 269169
53781 269169 269499 270321 272305 275163 277898 279725 280659 281030 280715 279293 276933 274530 272644 270823 268383
53766 268383 265444 262539 259498 255531 250553 245668 241977 239411 237158 234741 232211 229532 226423 222845
53752 222845 219214 216068 213718 212226 211388 210677 209532 207833 206007 204561 203630 203013 202548 202411 203116 205130
53736 205130 208301 211811 215072 218725 224362 233059 244444 257400 271201 285390 298744 309053 314279
53723C14279n80n758r573j1702j2140j1463j0582r877q905p178m971l071j988
53710B16491j632j561j282n70K31M11k53j013r98l18J15j17m41j88N61J301J786
53693B12523K008J890J445J026R58R68M97m39j115r96m12j00l13o51p10m92j63
53676B15924K78Q64J320J196M41l93o67l22J46K61qm20q23j194j415j248o33O6
53658B13373K96q3n98p03m65m38q73j319j241o83j27J29J75J88K41L42M34M16
53640B09064L24M01P74J173J270J134J032R42N88lm16l08K79J018J513J458R55
53623B21198O21J011J982K915L475L771L889L754L473L336L399L507L647L842
53609B63820L744L004K053J730K033K021J246M66M79R77J202J113J113J068L82
$$ plain form
53723 314279 313699 307941 298368 286666 274526 263063 252481 242604 233699 226521 221550 218479 216491
53710 216491 214859 213298 212016 211446 211677 212088 211835 210822 209824 209506 209621 209504 209063 208875 209436 210737 212523
53693 212523 214531 216421 217866 218892 219850 220818 221315 220876 219761 218765 218353 218253 217940 217289 216579 216087 215924
53676 215924 216202 217066 218386 219582 220023 219630 218963 218641 218787 219048 219040 218620 217797 216603 215188 213940 213307 213373
53658 213373 213669 213586 212988 212285 211820 211382 210509 209190 207949 207266 207139 207268 207443 207631 207872 208214 208648 209064
53640 209064 209388 209789 210563 211736 213006 214140 215172 216114 216702 216699 216283 215975 216254 217272 218785 220243 221198
53623 221198 221819 222830 224812 227727 231202 234973 238862 242616 246089 249425 252824 256331 259978 263820
53609 263820 267564 270568 272621 274351 276384 278405 279651 280117 280596 281573 282775 283888 285001 286069 286451
53594B86451r97k325k863k581k071j953k271k404j795q20m44r47j567j659j522
53579B60232j641j781j477q67l96j33pk59r36j333p93K50P70M94m2m57p57p61
53561B50106k19N48R01P91O78O44L46j10j63L04P85J054J397J879K094J958J952
53544B64945K379K953L372L709L983L986L787L738L870L856L787M230N234O075
53530C19904O394O789P772Q844R259R160R232R652J0038J0206J0334J0603J1070
53517D39257J1741J2401J2700J2761J3393J5172J7608J9660K0811K1177K0928
53506F17609K0232J9591J9536J9948K0182J9872J9187J8314J7226J6112J5544
53495H23353J5878J6684J7078J6616J5706J5172J5446J6248J6946J7127J6746
$$ plain form
53594 286451 285454 283129 280266 277685 275614 273661 271390 268986 267191 266371 265927 264980 263413 261754 260232
53579 260232 258591 256810 255333 254466 254070 253937 253930 253671 252735 251402 250609 250859 251629 252123 252081 251624 250867 250106
53561 250106 249887 250435 251336 252127 252805 253449 253795 253685 253522 253826 254611 255665 257062 258941 261035 262993 264945
53544 264945 267324 270277 273649 277358 281341 285327 289114 292852 296722 300578 304365 308595 313829 319904
53530 319904 326298 333087 340859 349703 358962 368122 377354 387006 397044 407250 417584 428187 439257
53517 439257 450998 463399 476099 488860 502253 517425 535033 554693 575504 596681 617609
53506 617609 637841 657432 676968 696916 717098 736970 756157 774471 791697 807809 823353
53495 823353 839231 855915 872993 889609 905315 920487 935933 952181 969127 986254 1003000
53484A003000J5969J5046J4220J3472J2508J1279J0362J0332J0827J0768R565
53473A137348P616N528L415J144j274l779o300q473r898j0840j2100j3859j5335
53460A073193j5978j6261j6740j7069j6806j6586j7436j9183k0551k0813k0416
53449H75354j9960j9402j8527j7406j6163j4807j3625j3109j3218j3140j2129
53438G03868j0248q038n906m080k832k237j872j137J06J476K561L348M146N288
53424F84443O927Q971J1126J2953J4118J4711J5334J6610J8474K0108K0768K0616
53412H65159K0627K1680K3765K6033K7584K8364K9225L0921L3166L5064L6402
53401A177990L7908M0032M2180M3602M4493M5513M6662M7306M7150M6464M5541
$$ plain form
53484 1003000 1018969 1034015 1048235 1061707 1074215 1085494 1095856 1106188 1117015 1127783 1137348
53473 1137348 1144964 1150492 1153907 1155051 1153777 1149998 1143698 1135225 1125327 1114487 1102387 1088528 1073193
53460 1073193 1057215 1040954 1024214 1007145 990339 973753 956317 937134 916583 895770 875354
53449 875354 855394 835992 817465 800059 783896 769089 755464 742355 729137 715997 703868
53438 703868 693620 685582 679676 675596 672764 670527 668655 667518 667624 669100 671661 675009 679155 684443
53424 684443 691370 700341 711467 724420 738538 753249 768583 785193 803667 823775 844543 865159
53412 865159 885786 907466 931231 957264 984848 1013212 1042437 1073358 1106524 1141588 1177990
53401 1177990 1215898 1255930 1298110 1341712 1386205 1431718 1478380 1525686 1572836 1619300 1664841
53390A664841M4609M4158M4492M4992M4559M2958M0982L9115L6849L3736L0267
53379B111558K7140K4259K1103J7618J4065J0326O167J981j539m490p798j2031
53367B208359j6795k1500k6132l0838l5344l9284m2831m6374m9685n2003n3002
53356A794571n3180n3072n2562n1354m9773m8521m7705m6610m4667m2276m0410
53345A264441l9601l9520l9500l9133l8326l7075l5413l3573l1892l0463k8990
53334H70955k7213k5320k3694k2268k0502j8112j5499j3190j1240r469p944o806
53322F69698n872m910m040l346k331m95J622K855K973L058M015N512O742P544
53308F83025Q302R237J0391J1827J3348J4524J5394J6583J8297J9783K0468K0952
$$ plain form
53390 1664841 1709450 1753608 1798100 1843092 1887651 1930609 1971591 2010706 2047555 2081291 2111558
53379 2111558 2138698 2162957 2184060 2201678 2215743 2226069 2232236 2234217 2232678 2228188 2220390 2208359
53367 2208359 2191564 2170064 2143932 2113094 2077750 2038466 1995635 1949261 1899576 1847573 1794571
53356 1794571 1741391 1688319 1635757 1584403 1534630 1486109 1438404 1391794 1347127 1304851 1264441
53345 1264441 1224840 1185320 1145820 1106687 1068361 1031286 995873 962300 930408 899945 870955
53334 870955 843742 818422 794728 772460 751958 733846 718347 705157 693917 684448 676504 669698
53322 669698 663826 658916 654876 651530 649199 648704 650326 653181 656154 659212 663227 668739 675481 683025
53308 683025 691327 700564 710955 722782 736130 750654 766048 782631 800928 820711 841179 862131
53296H62131K2066K3473K4187K4188K4432K5364K6366K6723K6305K5234K3657
53285A134126K1930K0294J8344J5546J2262R481P509N799M088K677J312j018m599
53272A247751q170j0341j1150j1682j2659j4075j5655j7066j8018j8726j9896
53261A090313k1776k3657k4874k5728k6870k8187k9071k9423k9604k9622k9119
53250G92382k8058k6762k5375k3931k2797k2363k2326k1932k0985k0021j9453
53239E38379j9111j8714j8238j7679j6899j5863j4682j3409j2141j1224j0823
53228C69596j0463r601q547q105q209p861o600n197m478m312m259m434n017n525
53214B76988n379m836m575m661m596m161l501k596j456o43q26j788k573k724k635
$$ plain form
53296 862131 884197 907670 931857 956045 980477 1005841 1032207 1058930 1085235 1110469 1134126
53285 1134126 1156056 1176350 1194694 1210240 1222502 1231983 1239492 1245291 1249379 1252056 1253368 1252350 1247751
53272 1247751 1239581 1229240 1218090 1206408 1193749 1179674 1164019 1146953 1128935 1110209 1090313
53261 1090313 1068537 1044880 1020006 994278 967408 939221 910150 880727 851123 821501 792382
53250 792382 764324 737562 712187 688256 665459 643096 620770 598838 577853 557832 538379
53239 538379 519268 500554 482316 464637 447738 431875 417193 403784 391643 380419 369596
53228 369596 359133 349532 340985 332880 324671 316810 310210 305013 300535 296223 291964 287530 282513 276988
53214 276988 271609 266773 262198 257537 252941 248780 245279 242683 241227 240584 239758 237970 235397 232673 230038
53199B30038k647k528k103j638j313q42n2P32J127J167R94N95J06r0O6J37p5j54
53181B23520J16J54o08j742k363k284j998j734j327q62o46n98k94L21Q87J253
53165B11795J515J498R59L32M39J181J382L33j159j847j565j162j217j532j640
53150B09312j366q67m66m65q53j229j143m76M43R80O37l80j135q94QO81Q76J044
53132B04707J309J192N10l05r92j718k268j937p70K9l03r69q81k64J0q6p1k22
53114A96971j110k114j849j64J500J991J585R74K65n52j055j030r80j418k093
53099A90921k452k421k251j931j250k97M76O85K90m24j051j406j650j899j830
53084A73510j068J92J306J866J854J256J04j092j606j287o28q3K12P7n52j130
$$ plain form
53199 230038 227391 224863 222760 221122 219809 218967 218915 219647 220774 221941 222935 223530 223636 223546 223612 223749 223674 223520
53181 223520 223636 223790 223182 221440 219077 216793 214795 213061 211734 210872 210226 209628 209334 209655 210542 211795
53165 211795 213310 214808 215767 216099 216538 217719 219101 219434 218275 216428 214863 213701 212484 210952 209312
53150 209312 207946 207079 206613 206148 205295 204066 202923 202447 202890 203870 204507 204127 202992 202098 202106 202787 203663 204707
53132 204707 206016 207208 207718 207413 206421 204703 202435 200498 199728 199757 199454 198485 197604 197340 197350 197264 197193 196971
53114 196971 195861 193747 191898 191734 193234 195225 196810 197784 198049 197497 196442 195412 194432 193014 190921
53099 190921 188469 186048 183797 181866 180616 180319 180795 181480 181770 181346 180295 178889 177239 175340 173510
53084 173510 172442 172634 173940 175806 177660 178916 179020 177928 176322 175035 174407 174324 174536 174613 174061 172931
53068A72931r67l28k28q73j278q44l51p12j503j644r77k72%Q6L27P24J125J258
53050A66474P91k08j034j035l85K54O29R33J189J125O21j54j003j678j810j268
53034A63441n17j45j77j94n0Oj17j84J4M22Q24R05L62o66j425j273n19j21n43
53015A60043j305j646j225k54O60Q41J61n98m81N30J516J723J251O15J32q2k5
52998A61856O3j55o24q98p70n30l87r2M98R60Q46L55l9l67j004j787j977j277
52980A54671k60M50R95J739K362K111R59j11k36L54P43M66j79o80p74m47J03M93
52962A62759M85L67O30J193J378Q43J39l4J93N8p22j553j755j402j132j255j317
52945A58875o74O31J757J898J101M1q01j404j752j611r67l48l45r31j495j514
$$ plain form
53068 172931 171964 171636 171408 170535 169257 168413 168062 167350 165847 164203 163226 162954 162954 163040 163367 164091 165216 166474
53050 166474 167265 167057 166023 164988 164603 164857 165486 166419 167608 168733 169354 169200 168197 166519 164709 163441
53034 163441 162924 162779 162602 162408 162358 162364 162247 162063 162077 162499 163323 164228 164590 163924 162499 161226 160707 160586 160043
53015 160043 158738 157092 155867 155613 156273 157114 157275 156677 156196 156726 158242 159965 161216 161831 161963 161881 161856
52998 161856 161919 161764 161140 160242 159472 158942 158555 158463 158961 159921 160767 161122 161083 160716 159712 157925 155948 154671
52980 154671 154411 154861 155856 157595 159957 162068 163027 162916 162680 163034 163777 164243 164064 163384 162610 162163 162266 162759
52962 162759 163244 163611 164241 165434 166812 167655 167794 167760 167953 168011 167289 165736 163981 162579 161447 160192 158875
52945 158875 158201 158832 160589 162487 163588 163629 162828 161424 159672 158061 157094 156746 156401 155470 153975 152461
52929A52461j021m86l30m38k60M57J140R77O3n72k97L31M66J42j0R7m4n98j067
52910A51011j028o38k26J15L39K49j86n71m57J08N79M90j25p77r39m96J78O18
52892A48244P70R17J166J194O99n4m06q3M52N50J64k46n09r62j725k169j661n47
52874A45794J64J19q8N8K92K24P1K58O76Q23N38J40j1J86N99R74J125J182J445
52855A54569J889K191K331K643L054K871J895J044J174J794J788J082N49M22r7
52840A79199j457k932l567l259k553j961j786k030k088j194M06J274L67j557k742
52825A54120k416j353n76j29O50K003L229L253J678o71k400k791k316j844j557
52810A48880r49J92J278J601J322J334K125L121L502L306L232L361K858J218q10
$$ plain form
52929 152461 151440 150954 150624 150186 149926 150383 151523 152500 152563 151991 151694 152025 152491 152633 152623 152720 152676 152078 151011
52910 151011 149983 149345 149119 149234 149573 149822 149636 149065 148608 148716 149295 149785 149660 148883 147944 147448 147626 148244
52892 148244 149014 149931 151097 152291 152990 152936 152530 152447 152899 153449 153613 153367 152858 151896 150171 148002 146341 145794
52874 145794 145958 146077 145989 146047 146339 146563 146634 146892 147568 148391 148929 149069 149058 149244 149843 150817 151942 153124 154569
52855 154569 156458 158649 160980 163623 166677 169548 171443 172487 173661 175455 177243 178325 178874 179296 179199
52840 179199 177742 174810 171243 167984 165431 163470 161684 159654 157566 156372 156778 158052 158419 156862 154120
52825 154120 151704 150351 149775 149646 150296 152299 155528 158781 160459 159788 157388 154597 152281 150437 148880
52810 148880 147931 148123 149401 151002 152324 153658 155783 158904 162406 165712 168944 172305 175163 176381 175571
52795A75571k088k470k644k947l102l025l049l238l179k686k086j588r51j09M67
52780A42876L90m0k57j30J75O34J219J652J657J352R84N24j22o84p80m35j8K76
52762A49273M92N83M31J59Q6L17O31P92P28M76K08J61L35L45q3o23p29m40l13
52743A52829n54p56o08l76l48k72K90J236J993K127J670R68N01O69J376K003K029
52726A64777J584J071N21j82o24j41J134K194K349J856J140J45j060j734j429
52711A71601r70j437k494k798k035j370j600k017j719j045q09q73m55M51J010
52696A53440P83K07j84l73m84m14n6M47Q08P77K31n51q79l23O51J112P58J29k38
52677A55841l56m11l52j04K16M91P66R61P39j01j254k088k145j428l68M12N85
$$ plain form
52795 175571 173483 171013 168369 165422 162320 159295 156246 153008 149829 147143 145057 143469 142518 142409 142876
52780 142876 143266 143226 142969 142839 143014 143648 144867 146519 148176 149528 150512 151036 150914 150230 149450 149015 148997 149273
52762 149273 149765 150348 150779 150938 151024 151341 151972 152764 153492 153968 154176 154337 154672 155017 154934 154311 153582 153142 152829
52743 152829 152275 151519 150911 150535 150187 149915 150205 151441 153434 155561 157231 158199 158700 159369 160745 162748 164777
52726 164777 166361 167432 167953 167771 167147 167006 168140 170334 172683 174539 175679 175824 174764 173030 171601
52711 171601 170631 169194 166700 163902 161867 160497 158897 156880 155161 154116 153307 152434 151979 152430 153440
52696 153440 154223 154430 154246 153873 153389 152975 152919 153366 154174 154951 155182 154631 153752 153429 154080 155192 155950 156079 155841
52677 155841 155485 155074 154722 154618 154834 155325 156091 157052 157791 157690 156436 154348 152203 150775 150407 150819 151404
52660A51404L98L81P36J200J470J560J645J833K056K110J816J300J010J232J777
52645A71928K333K904L414L233J732o59k615l355l318l226l086k487j461m91Q3
52630A64929L01L00J01l29r27j357j089J13J654K473K045Q64k07p30p88o27m48
52613A66278l41k17J8K06J17n7J51P29J024O24ok12n6r1m84q91j093j244j426
52594A63029j334o88K94J026J167R93J091J668K248K219J521O72J02k37n54p57
52578A72460n31J91R91J259Q42K87K89Q17J174J031R07J216J412P80l00p76m47
52561A81602j51l75p12q46j125j699j984j554q67n21l87j04J66J01j41k60l89
52544A70754p00q73o07k14n9J91R43J698J572O34j28j32K87O58Q40O92N5p18r40
$$ plain form
52660 151404 151802 152183 152919 154119 155589 157149 158794 160627 162683 164793 166609 167909 168919 170151 171928
52645 171928 174261 177165 180579 183812 185544 184885 182270 178915 175597 172371 169285 166798 165337 164846 164929
52630 164929 165230 165530 165631 165302 164375 163018 161929 162042 163696 166169 168214 169078 168871 168141 167353 166726 166278
52613 166278 165937 165720 165738 165944 166061 166004 166155 166884 167908 168532 168526 168314 168258 168167 167683 166792 165699 164455 163029
52594 163029 161695 161007 161301 162327 163494 164487 165578 167246 169494 171713 173234 173906 174008 173771 173217 172460
52578 172460 171929 172120 173111 174370 175212 175499 175788 176605 177779 178810 179717 180933 182345 183125 182825 182049 181602
52561 181602 181451 181076 180364 179518 178393 176694 174710 173156 172289 171768 171381 171277 171443 171544 171403 171143 170754
52544 170754 170054 169181 168574 168360 168301 168492 169435 171133 172705 173339 173211 173079 173366 174024 174864 175556 175611 174893 173953
52525A73953n51k52m46o66l46L36Q05Q66P26N73M97O03Q78J067J009R98J447K285
52507A83782K904K829K243J745J635J642J405J037R32J071Q97L9j202k241k820
52492A95898k905k411j396l37K49L74L54K33r8l93k77j2l65j382j956j107O32
52475A85101J710J401N80M97J200J655J291P96J074J921K327J893J266R94P97
52460B04503L78K64J105K429K973K203Q33k73j076j908k539k309j105J86M32o03
52444B05493k059k904k915k540k111j586j035p24n81j24O52R35J57r47j145k82
52428A88284O11P59M45K21J2n82j481k099k030j480r47o39k90L88J219J735J785
52411A85911J635J441J112P68Q73J525K128K189K043K329L040L709M232M895N693
$$ plain form
52525 173953 173402 173150 172704 172038 171692 172028 172833 173699 174425 174998 175495 176098 176976 178043 179052 180050 181497 183782
52507 183782 186686 189515 191758 193503 195138 196780 198185 199222 200154 201225 202122 202161 200959 198718 195898
52492 195898 192993 190582 189186 188849 189098 189472 189826 190059 189961 189568 189291 189279 188914 187532 185576 184469 185101
52475 185101 186811 188212 188792 189289 190489 192144 193435 194231 195305 197226 199553 201446 202712 203706 204503
52460 204503 204881 205145 206250 208679 211652 213855 214688 214415 213339 211431 208892 206583 205478 205664 206096 205493
52444 205493 203434 200530 197615 195075 192964 191378 190343 189619 189038 188914 189566 190501 190658 189711 188566 188284
52428 188284 188895 189654 190099 190320 190332 189750 188269 186170 184140 182660 181713 181074 180784 181172 182391 184126 185911
52411 185911 187546 188987 190099 190867 191740 193265 195393 197582 199625 201954 204994 208703 212935 217830 223523
52396B23523O171N911M766K734J27k230l511l620l122k548k156k094k280k344
52382B19327k048j636j273o61K77P43O1j086j336m79M67Q89J206J730K109K240
52366B20530K583L110K893J507r7q30r08j231j831j898j119j46K41l2m50m90o1
52349B21771M45N74L51J61J11r4n66r11p24p9O53J198J453J517J748K368K989
52332B32965L023K577K329K453K381J953J872K621L642M204M501N176O253P169
52318B83119P528P228O208M670L292K625K435K150J667J321J341J767K536L238
52304C31125L195K330J485J356J588J578J637K430L612M116L689L101K785K252
52290C66279J143l6n85m48o5J11k81j300k290k260j058K84P34M02J18K55M87M97
$$ plain form
52396 223523 229694 235605 240371 243105 243232 241002 237491 233871 230749 228201 226045 223951 221671 219327
52382 219327 217279 215643 214370 213709 213986 214729 214790 213704 212368 211889 212356 213245 214451 216181 218290 220530
52366 220530 223113 226223 229116 230623 230526 229696 228788 227557 225726 223828 222709 222563 222804 222772 222322 221832 221771
52349 221771 222216 222790 223141 223302 223413 223319 222753 221842 221118 221039 221692 222890 224343 225860 227608 229976 232965
52332 232965 235988 238565 240894 243347 245728 247681 249553 252174 255816 260020 264521 269697 275950 283119
52318 283119 290647 297875 304083 308753 312045 314670 317105 319255 320922 322243 323584 325351 327887 331125
52304 331125 334320 336650 338135 339491 341079 342657 344294 346724 350336 354452 358141 361242 364027 366279
52290 366279 367422 367386 366801 366353 366288 366399 366118 364818 362528 360268 359210 359494 360228 360630 360748 361003 361490 361987
52272C61987M04M90Q22J292J797K256K562K597K411K349K780L628M294M300L901
52257C97870L753M075M398M232L684L279L330L637L822L792L839M179M538M377
52243D52805L545K504J760J395J245J296J538J708J556J259J239J605K099K533
52229D78087K984L515M010M269M204L951L891M350N110N466N062M453M449N110
52215E38911N736N723N018L914K890K561L203M301N032N232N401N740N793N273
52201F04728M650M515M702M560L839K872K016J351J009J318K329L398L635K953
52187F47875K338K808M146N121M887L840K816K020J118Q2o64r14r80j310k066
52172F71117l147m294n142n374m920l955k892k328k634l307l199j826j41N84L31
$$ plain form
52272 361987 362391 362881 363703 364995 366792 369048 371610 374207 376618 378967 381747 385375 389669 393969 397870
52257 397870 401623 405698 410096 414328 418012 421291 424621 428258 432080 435872 439711 443890 448428 452805
52243 452805 456350 458854 460614 462009 463254 464550 466088 467796 469352 470611 471850 473455 475554 478087
52229 478087 481071 484586 488596 492865 497069 501020 504911 509261 514371 519837 524899 529352 533801 538911
52215 538911 544647 550370 555388 559302 562192 564753 567956 572257 577289 582521 587922 593662 599455 604728
52201 604728 609378 613893 618595 623155 626994 629866 631882 633233 634242 635560 637889 641287 644922 647875
52187 647875 650213 653021 657167 662288 667175 671015 673831 675851 676969 677051 676387 675473 674493 673183 671117
52172 671117 667970 663676 658534 653160 648240 644285 641393 639065 636431 633124 629925 628099 627958 628542 628873
52157F28873J99R11K167L340M014L851K745J271L07J2j62l84j89N19J082J166
52141F49722J345K024K543K117J071L44J42j17p89j693k612l434l818l442k513
52126F40890j517n09P99K325L640M752O128P864R406J0348J0960J1567J1930J1623
52112G30206J0721R670Q642P411N725L504P25k492n576p628q099p306o102n051
52098G34350m073k935j764q23L4J206K619L615L823L776M234N107N508M720K739
52083G62136m1l096n707p114p081o089m762l340j842m57M57P19M53k8l31j36N84
52066G24325J454J993K041J852J793J968K137K018J592J119P87L96m70j931l552
52051G37522m592m574l717k793k443k523k367j735j219j488k395l293l943m599
$$ plain form
52157 628873 629072 629983 632150 635490 639504 643355 646100 647371 647678 647690 647528 647144 646955 647474 648556 649722
52141 649722 651067 653091 655634 657751 658822 659166 659308 659191 658402 656709 654097 650663 646845 643403 640890
52126 640890 639373 638864 639663 641988 645628 650380 656508 664372 673778 684126 695086 706653 718583 730206
52112 730206 740927 750597 759239 766650 772375 775879 776604 774112 768536 760908 752809 745503 739401 734350
52098 734350 730277 727342 725578 724755 724789 725995 728614 732229 736052 739828 744062 749169 754677 759397 762136
52083 762136 762095 758999 753292 746178 739097 733008 728246 724906 723064 722607 723064 723783 724236 724208 723877 723741 724325
52066 724325 725779 727772 729813 731665 733458 735426 737563 739581 741173 742292 743079 743475 743005 741074 737522
52051 737522 732930 728356 724639 721846 719403 716880 714513 712778 711559 710071 707676 704383 700440 695841
52037F95841n296n663n532n142m537l430j961r26p70q19j16J270K457K956K950
52022F71282K648K184K152L286N264O644O481N455M836M806M549L672K839K863
52008G28961L721M670M982M415L162J543l30k613n270p748r392j0237j1097j2621
51994F92146j4478j5775j6119j6000j6023j6083j5546j4116j2234j0537r242q197
51982E27796p319o646o143n763n654n863n965n454m619m419n257o396p021p336
51968D43941p926q437p778n646l024j007L12J465K777M241N834P488Q933R914
51954D51087J0444J0565J0114Q940P224N262L121P91j469l229m283m673m421l557
51940D85916k361j158J89K192M928P654R512J0503J1336J2336J3028J2916J2334
$$ plain form
52037 695841 690545 684882 679350 674208 669671 666241 664280 663354 662584 661765 661649 662919 665376 668332 671282
52022 671282 673930 676114 678266 681552 686816 693460 699941 705396 710232 715038 719587 723259 726098 728961
52008 728961 732682 737352 742334 746749 749911 751454 751124 748511 743241 735493 726101 715864 704767 692146
51994 692146 677668 661893 645774 629774 613751 597668 582122 568006 555772 545235 535993 527796
51982 527796 520477 513831 507688 501925 496271 490408 484443 478989 474370 469951 464694 458298 451277 443941
51968 443941 436015 427578 419800 414154 411130 410123 410435 411900 414677 418918 424752 432240 441173 451087
51954 451087 461531 472096 482210 491150 498374 503636 506757 507548 506079 502850 498567 493894 489473 485916
51940 485916 483555 482397 482586 484778 489706 497360 506872 517375 528711 541047 554075 566991 579325
51927E79325J1924J1437R649N763M61m764r008j2277j4731j6322j7230j7991j8793
51914E07443j9096j8291j6608j4853j3491j2286j0926r547q536p939p302o103
51902C62465m255k173l49J089K337L546M579N249N679O323P449Q569Q552O613
51888D15673L169m93l511o026q291r776r722q288o500n107m031k953j741k49J656
51873C53810L635N038N808O659Q020R355J0028J0165J0132R593P919N317K755
51860D48234P10j287l761o401q357r086q783q104p516o804n332l001o69O49Q84
51845C81376P92Q80J034J112J301J640J823J834K300L756N760P365Q372R440J0736
51830D39521J1070Q978M540n08m485p017q463q908q422p756p841q565q974q685
$$ plain form
51927 579325 591249 602686 612335 618098 618559 613795 604787 592510 577779 561457 544227 526236 507443
51914 507443 488347 470056 453448 438595 425104 412818 401892 392345 383809 375870 368568 362465
51902 362465 358210 356037 355688 356777 359114 362660 367239 372488 378167 384490 391939 400508 409060 415673
51888 415673 418842 418349 414838 408812 400521 390745 381023 372735 366235 361128 357097 354144 352403 352154 353810
51873 353810 357445 362483 368291 374950 382970 392325 402353 412518 422650 432243 440162 445479 448234
51860 448234 448944 447657 443896 437495 429138 420052 411269 403165 395649 388845 383513 380512 379843 380492 381376
51845 381376 382168 383048 384082 385194 386495 388135 389958 391792 394092 397848 403608 410973 419345 428785 439521
51830 439521 450591 459569 464109 463601 459116 452099 443636 434728 426306 418550 410709 402144 393170 384485
51816C84485q280q058p386n830m119l181k796k020n65J115K745M418N853O386
51802C62767N838M738L523K064J86j889l726m993n425m908l717k401j300m96j27
51787C50134l86j165k037k676k952k747k077j321q59n32K2N40L67m05q47n26j68
51770C32365n17j174j256p03j66R1M81J286K324L488N008O907Q598R376R095Q137
51754C83340O923N592M020J917q95m053o574p677p624p416p507p290o190m706
51740C41860l783l408k695j350j67K84O65J995M308O870R250J1487J3335J4055
51726C92706J3071J0436O812L271R41K91R46K410M567O894P813N881J620k732
51712D54927n377o212n955n044l737k532k003k491m087o373q205q363o770m454
$$ plain form
51816 384485 376205 368147 360761 354931 350812 347631 344835 342815 342250 343365 346110 350528 356381 362767
51802 362767 368605 373343 376866 378930 379116 377227 373501 368508 363083 358175 354458 352057 350757 350261 350134
51787 350134 349748 348583 346546 343870 340918 338171 336094 334773 333914 333382 333404 333944 334311 333906 333059 332533 332365
51770 332365 331848 330674 329418 328715 328549 328640 329121 330407 332731 336219 341227 348134 356732 366108 375203 383340
51754 383340 390263 395855 399875 401792 400897 396844 390270 382593 374969 367553 360046 352756 346566 341860
51740 341860 338077 334669 331974 330624 330457 330741 331406 333401 337709 344579 353829 365316 378651 392706
51726 392706 405777 416213 423025 426296 427237 427528 428474 430884 435451 442345 450158 456039 457659 454927
51712 454927 449550 443338 437383 432339 428602 426070 424067 421576 417489 411116 402911 394548 387778 383324
51698C83324k224n3K020L196K714Q76j227k711l285l038k166o95J592M475O582
51683C89380O206L176p82l927n984p303p601o599n115m333m102l124q61J721L492
51668C54244M396N021N588N864N761N628O086P640J0328J3507J6106J7106J5851
51655D73126J2105O184q73p499j2184j4185j3876j2412j0756q922o423l346n22
51642D00417J482K864L725L283P19l473p595j0193j0966j0480r570q956q797q488
51628C33972p349n639m432m326m708m542l572k441j833j807j924j734j126l87
51614B88152L4j42p33j151q44J51J190J694J718J677J622J176K04q35j428j539
51598B90946j423j188q34l92J80J056K196L189L817M534N996Q109R926J0473R458
$$ plain form
51698 383324 381100 381047 383067 386263 388977 389853 388626 385915 382630 379592 377426 376731 378323 382798 389380
51683 389380 395586 398762 397980 394053 388069 380766 373165 366566 361451 357118 353016 349892 349031 350752 354244
51668 354244 358640 363661 369249 375113 380874 386502 392588 400228 410556 424063 440169 457275 473126
51655 473126 485231 491415 490542 483043 470859 456674 442798 430386 419630 410708 404285 400939 400417
51642 400417 401899 404763 408488 411771 412490 409017 401422 391229 380263 369783 360213 351257 342460 333972
51628 333972 326623 320984 316552 312226 307518 302976 299404 296963 295130 293323 291399 289665 288539 288152
51614 288152 288186 288044 287311 286160 285316 285467 286657 288351 290069 291746 293368 294544 294748 293913 292485 290946
51598 290946 289523 288335 287501 287109 287289 288345 290541 293730 297547 302081 308077 316186 326112 336585 346043
51583C46043P281M671K322N96n61j251j266l00J427L098M077M661N863Q386J1846
51568C96893J5092J7205J8122J8380J8679J9663K1689K4185K5619K4733K2090
51557F22350J9912K0222K3353K8239L3617L8713M3153M6464M7640M5179L8047
51546A006889K6807J3578O65j0586j9868k7486l3992l9750m4439m7369m8316m7690
51534G28443m5830m2791l8863l4694l0545k6135k1567j7650j4839j2572j0289
51523D32668q395p440o951n990m530l414l074l167l338l557l669l344k638k118
51509C71043k247k935l654l825l279k629k802l840m590m172l278l236m073m492
51495C21991l751k600k126k368k506j924p49L89R08P25L28K23M43P09Q73R66R48
$$ plain form
51583 346043 353324 357995 360317 360913 360352 359101 357835 357535 358962 362060 366137 370798 376661 385047 396893
51568 396893 411985 429190 447312 465692 484371 504034 525723 549908 575527 600260 622350
51557 622350 642262 662484 685837 714076 747693 786406 829559 876023 923663 968842 1006889
51546 1006889 1033696 1047274 1047939 1037353 1017485 989999 956007 916257 871818 824449 776133 728443
51534 728443 682613 639822 600959 566265 535720 509585 488018 470368 455529 442957 432668
51523 432668 424273 416833 409882 403892 399362 395948 392874 389707 386369 382812 379143 375799 373161 371043
51509 371043 368796 365861 362207 358382 355103 352474 349672 345832 341242 337070 333792 330556 326483 321991
51495 321991 318240 315640 313514 311146 308640 306716 305967 306356 307264 307989 308317 308540 308983 309692 310565 311531 312479
51478C12479P53L62k87j244k113k222j568j107j443j784j045M36J195N34q22j899
51462C00225k396k323j730j016p83j018j100q30p88j301j751j419m88L06P14J165
51446B85467K036L113L889M161M250M607N328O299P837J0547J4213J7202J7653
51433C86602J5202J1069O736L103P27N8J135L282N190N263K408k823q171j1429
51419D18352j2211j1575j0328q505o264m233k846k034j621j421j033l25Q8l74
51405C55670j082p83O08J815J890J211N73K83L82Q58J357J468J545K317L576M300
51389C75988M360M904O434P749P667O869O997Q558J0691J2617J4437J6736K0084
51376E04091K4762L0467L6365M1864M7070N2268N7206O0948O2090N9226N1910
$$ plain form
51478 312479 313232 313594 313307 312063 309950 307728 306160 305053 303610 301826 300781 301217 302412 302946 302124 300225
51462 300225 297829 295506 293776 292760 291977 290959 289859 289029 288241 286940 285189 283770 283282 283588 284302 285467
51446 285467 287503 290616 294505 298666 302916 307523 312851 319150 326987 337534 351747 368949 386602
51433 386602 401804 412873 419609 422712 423439 423497 424632 427914 433104 438367 440775 437952 429781 418352
51419 418352 406141 394566 384238 375733 369469 365236 362390 360356 358735 357314 356281 355956 356044 355670
51405 355670 354588 353805 354413 356228 358118 359329 359902 360185 360567 361425 362782 364250 365795 368112 371688 375988
51389 375988 380348 385252 391686 399435 407102 413971 420968 429526 440217 452834 467271 484007 504091
51376 504091 528853 559320 595685 637549 684619 736887 794093 855041 917131 976357 1028267
51365A028267M1325K9362J6882L699r797k2165l2481m1152m8510n3796n6362n6873
51353G98399n6268n4407n0813m6036m1101l6181l0944k5763k1413j7912j4762
51342D02799j2116j0582j0005r514q671p767p059o528o287o343o098m981l436
51329C03412k448k208k105j948k136k659k893k641k398k379k075j182j61L59L15
51314B76853j2l09k37L53J035J221J077J381K252K758K167R71K03J88N23Q47J152
51297B92423J395J386J023M74Rk46m02o93j195j660j783j580j380j474j804k029
51281B82464j795j175p72j083j662j422l7J456J925J553J361J705J982J644Q19
51266B86963j50j049j620j569q76K20J507K646L014K313J240Q50J261J638J516
$$ plain form
51365 1028267 1069592 1098954 1115836 1119535 1109738 1087573 1055092 1013940 965430 911634 855272 798399
51353 798399 742131 687724 636911 590875 549774 513593 482649 456886 435473 417561 402799
51342 402799 390683 380101 370096 360582 351911 344144 337085 330557 324270 317927 311829 306848 303412
51329 303412 300964 298756 296651 294703 292567 289908 287015 284374 281976 279597 277522 276340 276179 276538 276853
51314 276853 276841 276532 276295 276648 277683 278904 279981 281362 283614 286372 288539 289510 289713 289901 290424 291271 292423
51297 292423 293818 295204 296227 296701 296710 296464 296062 295369 294174 292514 290731 289151 287771 286297 284493 282464
51281 282464 280669 279494 278722 277639 275977 274555 274518 275974 277899 279452 280813 282518 284500 286144 286963
51266 286963 286813 285764 284144 282575 281699 281919 283426 286072 289086 291399 292639 293489 294750 296388 297904
51251B97904J386J760K351K538K095J172O4q12j100r66r69j288j559j655k008
51236B98913k793l414l313k864k801l108l110k583k048j845j521m76J029K023
51222B72089J864R16R1r3J78N14P71J001J226J459J716J907J911J870K135K664
51206B92219K857K319J501J131J312J628J962K563L351L826L783L559L403L086
51192C28500K388J550R94Q32Q94R69Q68M72j40p01r60q03k59L48M19l83j616k485
51174C30887k754k832k961k876k411j928j860k152k422k434k120j522r10p60j187
51159B99758j568j101L30J976K885K642J519K23n61n31J16R08J417J467J075L10
51143C10865p37j816k470k338j569q14o53j132j774j959j365l47K02k51j128j367
$$ plain form
51251 297904 299290 301050 303401 305939 308034 309206 309270 308458 307358 306392 305423 304135 302576 300921 298913
51236 298913 296120 292706 289393 286529 283728 280620 277510 274927 272879 271034 269513 269037 270066 272089
51222 272089 273953 274869 274960 274867 275045 275559 276330 277331 278557 280016 281732 283639 285550 287420 289555 292219
51206 292219 295076 297395 298896 300027 301339 302967 304929 307492 310843 314669 318452 322011 325414 328500
51192 328500 330888 332438 333432 334264 335158 336127 336995 337467 337327 336626 335666 334863 334604 334952 335371 334988 333372 330887
51174 330887 328133 325301 322340 319464 317053 315125 313265 311113 308691 306257 304137 302615 301705 300945 299758
51159 299758 298190 297089 297419 299395 302280 304922 306441 306664 306103 305572 305688 306596 308013 309480 310555 310865
51143 310865 310128 308312 305842 303504 301935 301121 300468 299336 297562 295603 294238 293891 294093 293842 292714 291347
51127B91347q68o14j077j376n98O95J268J020J021J843K899L548L967M553N176
51112C12804N421N180M664M140L839L852L918L555K534J090l02j178j276q00l08
51097C47133RO70K075L571M043L335K365J776J253K93j002k263l334m164m597
51082C51163m533m051l259k319j583j241r11j30P75J028O01L85R09J651J904J682
51066C42071J416J331J476J894K393K612K573K738L362M373N995Q582J1513J3008
51052D05337J1854Q699N150K175P4o46N19L014N238N868M960L768L639M883O457
51037D70989O969O094M749L858L608M056N553P831R317Q271M485o71n578r232
51023E20299j1227j1774j1650j1519j1307j0632r570q415p007n041k935j562j054
$$ plain form
51127 291347 290479 289865 288788 287412 286814 287509 288777 289797 290818 292661 295560 299108 303075 307628 312804
51112 312804 318225 323405 328069 332209 336048 339900 343818 347373 349907 350997 350695 349517 348241 347441 347133
51097 347133 347142 347812 349887 353458 357501 360836 363201 364977 366230 366523 365521 363258 359924 355760 351163
51082 351163 346630 342579 339320 337001 335418 334177 333266 333136 333911 334939 335540 335925 336834 338485 340389 342071
51066 342071 343487 344818 346294 348188 350581 353193 355766 358504 361866 366239 372234 380816 392329 405337
51052 405337 417191 425890 431040 433215 433289 432643 433162 436176 441414 447282 452242 456010 459649 464532 470989
51037 470989 477958 484052 488801 492659 496267 500323 505876 513707 523024 531295 535780 535109 529531 520299
51023 520299 509072 497298 485648 474129 462822 452190 442620 434205 427198 422157 419222 417660 416606
51010D16606n13Q80K905M599N211M769L996L653L837L977L706L332L158K813J882
50995D64811Q01L27L51N8p18j230j038o90q26j241j294p38J89J194K110K973M145
50978D69184O008Q385J0631J2466J4175J5777J6475J5429J2659Q804M435J40l123
50965E91445m678n002n333o210o999o988o352n773n528n394n080m418l315j904
50951E18471n68N81K055M338P005R023J0098J1150J3193J6216J9480K2514K5454
50938F59010K8637L2330L6530M0446M2304M0378L4549K6570J8714J2354P731M506
50926I84059K203L68j390l447o059r108j2110j4769j7373k0202k2736k3988k3705
50913H31743k2694k1883k1460k1102k0480j9368j7717j5844j4214j2868j1470
$$ plain form
51010 416606 416093 416973 419878 424477 429688 434457 438453 442106 445943 449920 453626 456958 460116 462929 464811
50995 464811 465612 465939 466290 466348 465630 464400 463362 462672 461846 460605 459311 458573 458762 459956 462066 465039 469184
50978 469184 475192 483577 494208 506674 520849 536626 553101 568530 581189 589993 594428 594568 591445
50965 591445 586767 581765 576432 570222 563223 556235 549883 544110 538582 533188 528108 523690 520375 518471
50951 518471 517903 518484 520539 524877 531882 540905 551003 562153 575346 591562 611042 633556 659010
50938 659010 687647 719977 756507 796953 839257 879635 914184 940754 959468 971822 979553 984059
50926 984059 986262 986630 985240 981793 975734 966626 954516 939747 922374 902172 879436 855448 831743
50913 831743 809049 787166 765706 744604 724124 704756 687039 671195 656981 644113 632643
50902F32643j0042r071q691q400p897p594p744p736o885n577m812m796m707l894
50888E34797k693j869j688j790j744j535j466j645j652j044j29J93m38j286j471
50873E14540j033p02q61j277j594j623j204k90P70J407J325O81q2l95K28J771
50857E11661L549M794N310N347N078M549M007L837M132M658N183N591N753N618
50843E79067N429N584O161O884P559Q400R776J1741J3871J5581J6657J7451J8489
50830G22650J9951K1682K3576K5698K8055L0626L3563L6975M0570M3900M7020
50819A074266N0350N3859N6914N9078O0319O0281N8095N3401M6885L9334L0786
50808A643568K1124J0866P27r073j8428k6744l3488l8834m3092m5917m6813m6072
$$ plain form
50902 632643 622601 613530 604839 596439 588542 580948 573204 565468 558583 553006 548194 543398 538691 534797
50888 534797 532104 530235 528547 526757 525013 523478 522012 520367 518715 517671 517542 517735 517297 516011 514540
50873 514540 513507 512805 511944 510667 509073 507450 506246 505956 506726 508133 509458 510139 510057 509662 509890 511661
50857 511661 515210 520004 525314 530661 535739 540288 544295 548132 552264 556922 562105 567696 573449 579067
50843 579067 584496 590080 596241 603125 610684 619084 628860 640601 654472 670053 686710 704161 722650
50830 722650 742601 764283 787859 813557 841612 872238 905801 942776 983346 1027246 1074266
50819 1074266 1124616 1178475 1235389 1294467 1354786 1415067 1473162 1526563 1573448 1612782 1643568
50808 1643568 1664692 1675558 1676285 1667212 1648784 1622040 1588552 1549718 1506626 1460709 1413896 1367824
50796A367824m4341m1709l8056l4002l0422k7234k3618j9395j5189j1241p130
50785A075487k892O21K914M585O411Q284R545R937R732R128P957N975L393R35
50771A152012p90k053l749o258r016j1523j4096j7054j9846k1820k3284k4839
50759I97684k6133k6418k5996k5773k5551k4180k1567j9196j8210j8063j7553
50748G49044j6185j4133j1775r754q545p602n817l235j192k70O76K703N032O297
50734F85244O596P199Q648J0305J1514J2181J2385J2206J1947J1884J1846J1493
50722H13448J0830J0068R284Q655Q577R091R579R522R151Q814Q306P470O938P434
50708I37167Q704J0030J1417J3396J5903J8326K0522K2830K5150K6973K8433L0199
$$ plain form
50796 1367824 1323483 1281774 1243718 1209716 1179294 1152060 1128442 1109047 1093858 1082617 1075487
50785 1075487 1072595 1073216 1076130 1080715 1087126 1095410 1104955 1114892 1124624 1133752 1141709 1147684 1151077 1152012
50771 1152012 1151222 1149169 1145420 1139162 1130146 1118623 1104527 1087473 1067627 1045807 1022523 997684
50759 997684 971551 945133 919137 893364 867813 843633 822066 802870 784660 766597 749044
50748 749044 732859 718726 706951 697197 688652 681050 675233 671998 670806 670536 671212 673915 678947 685244
50734 685244 691840 699039 707687 717992 729506 741687 754072 766278 778225 790109 801955 813448
50722 813448 824278 834346 843630 852285 860862 869953 879532 889054 898205 907019 915325 922795 929733 937167
50708 937167 945871 955901 967318 980714 996617 1014943 1035465 1058295 1083445 1110418 1138851 1169050
50696A169050L2172L3223L2534L0369K7120K2644J7052J1394O686K866n17l080
50684A381513l995l399k465j915j277L5J513K013J186n4n19J83J713L877P051
50669A385460J1673J7539K3781K9405L3731L6352L7042L5971L3899L1851L0410
50658A707114K9380K8237K6820K5423K4278K3263K2133K0745J8877J6233J3044
50647A955547J0367R204R381R891J0392J1776J4918J9393K3963K8008L1934L6190
50635B170964M0353M3303M4169M3021M0684L7824L4266K9412K3323J7009J1451
50624B535779O777K750k67j585j717l286r739k2549l9215n4169o2234o1763n4707
50611B234075m4103l2000j9673q536J25O003R514J0696Q997M166l264j2487k2939
$$ plain form
50696 1169050 1201222 1234445 1266979 1297348 1324468 1347112 1364164 1375558 1382244 1385110 1384593 1381513
50684 1381513 1377518 1374119 1371654 1369739 1368462 1368497 1370010 1372023 1373209 1373155 1372636 1372819 1374532 1378409 1385460
50669 1385460 1397133 1414672 1438453 1467858 1501589 1537941 1574983 1610954 1644853 1676704 1707114
50658 1707114 1736494 1764731 1791551 1816974 1841252 1864515 1886648 1907393 1926270 1942503 1955547
50647 1955547 1965914 1975118 1984499 1994390 2004782 2016558 2031476 2050869 2074832 2102840 2134774 2170964
50635 2170964 2211317 2254620 2298789 2341810 2382494 2420318 2454584 2483996 2507319 2524328 2535779
50624 2535779 2542556 2545306 2545039 2543454 2541737 2538451 2528712 2506163 2466948 2412779 2350545 2288782 2234075
50611 2234075 2189972 2157972 2138299 2129763 2129888 2135891 2145405 2156101 2165098 2169264 2166000 2153513 2130574
50598B130574l3985m4627n3824o0900o5473o7435o7285o6211o5207o4147o2070
50587A479410n8456n3870m9276m5045m0906l6596l2137k7568k2872j8304j4393
50576A079987j1343q607n425j713J893M865P366R948J2847J5716J7967J9239J9588
50563A162328J9137J7684J4937J1277P933O040N635N990O748Q220J0673J3943
50551A290545J7949K2980K9063L5418M0950M5068M7808M9410N0061M9937M9200
50540A728389M8031M6816M6104M6248M7240M8979N1463N4577N7984O1524O5537
50529B302892P0588P6931Q4314R2149R9700J06475J12560J18469J24501J30452
50519C319031J35859J40120J42211J40828J35158J25233J11282R3237P1305M6553
$$ plain form
50598 2130574 2096589 2051962 1998138 1937238 1871765 1804330 1737045 1670834 1605627 1541480 1479410
50587 1479410 1420954 1367084 1317808 1272763 1231857 1195261 1163124 1135556 1112684 1094380 1079987
50576 1079987 1068644 1060037 1054612 1052899 1054792 1059657 1067023 1076971 1089818 1105534 1123501 1142740 1162328
50563 1162328 1181465 1199149 1214086 1225363 1233296 1239336 1244971 1250961 1257709 1265929 1276602 1290545
50551 1290545 1308494 1331474 1360537 1395955 1436905 1481973 1529781 1579191 1629252 1679189 1728389
50540 1728389 1776420 1823236 1869340 1915588 1962828 2011807 2063270 2117847 2175831 2237355 2302892
50529 2302892 2373480 2450411 2534725 2626874 2726574 2833049 2945609 3064078 3188579 3319031
50519 3319031 3454890 3595010 3737221 3878049 4013207 4138440 4249722 4342959 4414264 4460817
50509D460817K0268o995l5031o2801q8312j09862j26800j38938j45754j46595
50499C619997j41452j31160j16860r9388p9140n6434l2076p567J5210L4477M8688
50488C054295N6438N6644M8999L4201J3784j0272l5810o0675q2817j00543j12931
50477B861313j20198j23562j24508j23973j22016j18137j12042j04303r6211q8782
50467A727581q2018p5360o8720o2531n6928n1540m6265m1620l8000l5099l2387
50456A137113k9728k7083k4221k1168j8507j6592j4870j2654j0283q679p923p102
50444I38303n607l801k262r79L28J653K820L816M784N909P376R139J0668J1378
50430I83525J1447J1812J3112J5016J6831J8418K0067K1872K3636K5330K7173
$$ plain form
50509 4460817 4481085 4474090 4439059 4376258 4287946 4178084 4051284 3912346 3766592 3619997
50499 3619997 3478545 3347385 3230525 3131137 3051997 2995563 2963487 2955920 2971130 3005607 3054295
50488 3054295 3110733 3167377 3216376 3250577 3264361 3254089 3218279 3157604 3074787 2974244 2861313
50477 2861313 2741115 2617553 2493045 2369072 2247056 2128919 2016877 1912574 1816363 1727581
50467 1727581 1645563 1570203 1501483 1438952 1382024 1330484 1284219 1242599 1204599 1169500 1137113
50456 1137113 1107385 1080302 1056081 1034913 1016406 999814 984944 972290 962007 953328 945405 938303
50444 938303 932696 928895 926633 925654 925982 927635 930455 934271 939055 944964 952340 961479 972147 983525
50430 983525 994972 1006784 1019896 1034912 1051743 1070161 1090228 1112100 1135736 1161066 1188239
50419A188239K9270L1462L3617L5820L8212M0801M3600M6799N0693N5375O0590
50408A654478O5849P0657P4606P7389P8812P8915P8019P6547P4742P2485O9320
50397B471819O4655N7978M8944L7313K2957O081j2485l1289m8663o3294p4575
50386B479441q2488q7037q7870q4778p8592p0942o2692n3039m0983k7389j4646
50375A788985m206M437J1968J7460J9184J6622J0658K250q181k0003l1951m2671
50363A764552n1290n7404o1033o2685o3025o2344o0638n8183n5560n3043n0350
50352A128997m7160m3522l9677l5836l2325k9517k7408k5413k2938k0034j7291
50341G87876j5172j3518j1785r658p458n833n029m632m102l374k738k325k114
$$ plain form
50419 1188239 1217509 1248971 1282588 1318408 1356620 1397421 1441021 1487820 1538513 1593888 1654478
50408 1654478 1720327 1790984 1865590 1942979 2021791 2100706 2178725 2255272 2330014 2402499 2471819
50397 2471819 2536474 2594452 2643396 2680709 2703666 2709747 2697262 2665973 2617310 2554016 2479441
50386 2479441 2396953 2309916 2222046 2137268 2058676 1987734 1925042 1872003 1831020 1803631 1788985
50375 1788985 1784779 1789216 1801184 1818644 1837828 1854450 1865108 1867358 1859177 1839174 1807223 1764552
50363 1764552 1713262 1655858 1594825 1532140 1469115 1406771 1346133 1287950 1232390 1179347 1128997
50352 1128997 1081837 1038315 998638 962802 930477 900960 873552 848139 825201 805167 787876
50341 787876 772704 759186 747401 737743 730285 724452 719423 714791 710689 707315 704577 702252 700138
50328G00138k267l063m330n352n551n059m448m053l714l163k422j752j259o56
50314F53049M23J921L357M351N021N697O469P199P849Q511R154R599R772R853
50300G42225J0041J0225J0050R286Q174P259O889O914O965O815O343N401M010
50287H40597K478J007n52k233l464l729l342k912k130j9L777Q986J5667K3358
50273H77489K8861K7160J6471J371j0943j7044j8516j7830j5502j1566p390m554
50261H48007l091k085j213o68j23J128L074M789N307M226J629k002n868r177j1542
50246H32391j2794j2668j1064q601o449n388n149m913m258l368k380j034O61J904
50232G56890J884J037O97J303J787J155k02j389k352l422m170l962l354l627m907
$$ plain form
50328 700138 697871 694808 690478 685126 679575 674516 670068 666015 662301 659138 656716 654964 653705 653049
50314 653049 653472 655393 658750 663101 668122 673819 680288 687487 695336 703847 713001 722600 732372 742225
50300 742225 752266 762491 772541 781827 790001 797260 804149 811063 818028 824843 831186 836587 840597
50287 840597 843075 844082 843530 841297 837833 834104 830762 827850 825720 825701 829478 838464 854131 877489
50273 877489 906350 933510 949981 951352 940409 923365 904849 887019 871517 859951 852561 848007
50261 848007 844916 842831 841618 840950 840827 841955 845029 849818 855125 859351 860980 858978 853110 843933 832391
50246 832391 819597 806929 795865 787264 780815 775427 770278 765365 761107 757739 755359 754325 754986 756890
50232 756890 758774 759811 760508 761811 763598 764753 764551 763162 760810 757388 753218 749256 745902 742275 737368
50217G37368o000o241o371p128q027q173p507o599n766n007m387l954l648l542
50203F55018l859m412m552m010l286k911k738k382j828j193l65O54J447J723J778
50188F29084J975K168K154K240K781L445L684L668M106N212O586Q066J0008J2533
50174F97710J5195J7657K0171K3000K5695K7373K7544K6350K4217K1562J8797
50163I45271J6266J4130J2520J1756J2085J3077J3592J2657J0239O837K590k685
50151A068335q596j3955j7742j9920k1007k1303k0934k0258j9637j8917j7631
50140H68435j5681j3472j1479j0002r130q539p547n920m507m484n996p991r400
50127G54287r917r654q736p457o347n785n651n546n135m388l681l508l801l847
$$ plain form
50217 737368 731368 725127 718756 711628 703601 695428 687921 681322 675556 670549 666162 662208 658560 655018
50203 655018 651159 646747 642195 638185 634899 631988 629250 626868 625040 623847 623482 624136 625583 627306 629084
50188 629084 631059 633227 635381 637621 640402 643847 647531 651199 655305 660517 667103 675169 685177 697710
50174 697710 712905 730562 750733 773733 799428 826801 854345 880695 904912 926474 945271
50163 945271 961537 975667 988187 999943 1012028 1025105 1038697 1051354 1061593 1068430 1071020 1068335
50151 1068335 1059739 1045784 1028042 1008122 987115 965812 944878 924620 904983 886066 868435
50140 868435 852754 839282 827803 817801 808671 800132 792585 786665 782158 777674 771678 763687 754287
50127 754287 744370 734716 725980 718523 712176 706391 700740 695194 690059 685671 681990 678482 674681 670834
50113F70834l281k764k964l310k684j203j71j48j85N93J692K179K118K255K754
50098F65715L080K922K637K735L302L907L950L201K003Q44j16p70o46N84K276
50083F95624L302L416L414L845M458N042N840O739O972O311N679N939O696P134
50069G70411P377Q200R700J1133J1992J2617J3767J5873J8659K1269K3109K4711
50057I48818K7245L1032L5066L8338M0816M2594M2927M1043L7538L4019L1469
50046A350905K9706K8273K7142K6475K6218K6000K5148K2853J8627J2595N199
50035A599141l151j1957k0476k7922l3639l7144l8494l8673l8854l9053l8188
50024A271590l5795l2900l0682k9042k7190k4935k2624k0298j7789j5303j3257
$$ plain form
50113 670834 667553 664789 661825 658515 655831 654628 654457 654309 654124 654717 656409 658588 660706 662961 665715
50098 665715 668795 671717 674354 677089 680391 684298 688248 691449 693452 694296 694180 693410 692764 693348 695624
50083 695624 698926 702342 705756 709601 714059 719101 724941 731680 738652 744963 750642 756581 763277 770411
50069 770411 777788 785988 795688 806821 818813 831430 845197 861070 879729 900998 924107 948818
50057 948818 976063 1007095 1042161 1080499 1121315 1163909 1206836 1247879 1285417 1319436 1350905
50046 1350905 1380611 1408884 1436026 1462501 1488719 1514719 1539867 1562720 1581347 1593942 1599141
50035 1599141 1595990 1584033 1563557 1535635 1501996 1464852 1426358 1387685 1348831 1309778 1271590
50024 1271590 1235795 1202895 1172213 1143171 1115981 1091046 1068422 1048124 1030335 1015032 1001775
50013A001775j1748j0721j0349j0754j1743j3198j5199j7309j8483j8312j7715
50002H46244j7670j7929j7763j7185j6590j5778j4401j2698j0797p956l725P42
49990F94494L858N608O948P717O825M436K266J391J229R51N46j5j326l639o334
49975G24955q812j1043j2883j3760j3520j2730j1773j0401q508o518m771l301
49963F06935k412k470k901k513j213k49k66l19M97J633K243K746M085O193Q343
49948F20332J0441J2821J5150J6760J7935J9720K2385K4898K6126K5897K4844
49937H37309K3788K3454K4221K5844K7566K8566K8211K6015K1768J5745Q760K012
49925A093259l180n888o143m853k997j147K78P13k50k591o198j1078j6998k3111
$$ plain form
50013 1001775 990027 979306 968957 958203 946460 933262 918063 900754 882271 863959 846244
50002 846244 828574 810645 792882 775697 759107 743329 728928 716230 705433 697477 693752 694494
49990 694494 698352 703960 710908 718625 725450 729886 732152 733543 734772 735723 736269 736254 734928 731289 724955
49975 724955 716143 705100 692217 678457 664937 652207 640434 630033 621525 615007 610236 606935
49963 606935 604523 602053 599152 596639 595426 595177 594911 594592 595089 596722 598965 601711 605796 611989 620332
49948 620332 630773 643594 658744 675504 693439 713159 735544 760442 786568 812465 837309
49937 837309 861097 884551 908772 934616 962182 990748 1018959 1044974 1066742 1082487 1091247 1093259
49925 1093259 1090079 1084191 1078048 1073195 1070198 1069051 1069329 1070042 1069792 1067201 1061003 1049925 1032927 1009816
49911A009816k8361l2107l4164l4593l3611l1562k8693k5182k1431j7956j4856
49900G07300j1805q721n987l705j320J669N039Q252J0982J2776J2798J0721P566
49887G45565M875L168J813K35j490l225n093p105r003j0781j2758j4909j6541
49874F74751j7095j6889j6647j6541j6135j5202j3981j2555j0462p417m218k301
49862E25308k237l043l246k337q63N71J822K899L740M429N245O296P429Q610J0015
49847E64638J1700J3423J4855J5645J5350J3730J1233Q678O413M297K497J500
49835F83959J073L2k335n262p581r183j0599j1677j1765j1015j0368j0068r221
49822E85990p263n061l888l799l661k573o63J365K993M143N092O274P923R792
$$ plain form
49911 1009816 981455 949348 915184 880591 846980 815418 786725 761543 740112 722156 707300
49900 707300 695495 686774 680787 677082 675762 677431 682470 690722 701704 714480 727278 737999 745565
49887 745565 750440 753608 755421 755656 754166 750941 745848 738743 729740 718959 706201 691292 674751
49874 674751 657656 640767 624120 607579 591444 576242 562261 549706 539244 531827 527609 525308
49862 525308 523071 520028 516782 514445 513582 514153 515975 518874 522614 527043 532288 538584 546013 554623 564638
49847 564638 576338 589761 604616 620261 635611 649341 660574 669252 675665 679962 682459 683959
49835 683959 685032 685064 682729 677467 669886 660703 650104 638427 626662 615647 605279 595211 585990
49822 585990 578727 573666 569778 565979 562318 559745 559082 560447 563440 567583 572675 578949 586872 596664
49808E96664J1362J2363J2855J2783J1807R852P575N913N182M909M510L751K484
49795G02010N23j911m045n378o473q355j1150j3759j4991j4717j3794j3066j2612
49782E82282j1761r843p027m322k628j938j714j732k126k744l025k619j648l24
49768E28831J207K636L659M564O019Q010R543R861R476R494J0176J0676J0097
49755F24249Q403O393N084M968N526N484L864P61k949o518r669j2241j3889j4243
49741F05223j3278j1490r733q688q236p493n728l252j233n74j059j651j464m01
49727E30943J099K665M092M938M561K911J099N75J691L396M500M900N468P012
$$ plain form
49808 596664 608026 620389 633244 646027 657834 667686 675261 681174 686356 691265 695775 699526 702010
49795 702010 702533 700622 696577 691199 684726 676371 665221 651462 636471 621754 607960 594894 582282
49782 582282 570521 560678 553651 549329 546701 544763 543049 541317 539191 536447 533422 530803 529155 528831
49768 528831 530038 532674 536333 540897 546916 554926 564469 574330 583806 593300 603476 614152 624249
49755 624249 632652 639045 644129 649097 654623 660107 663971 664732 661783 655265 645596 633355 619466 605223
49741 605223 591945 580455 570722 562034 553798 546305 540577 537325 536092 535518 534459 532808 531344 530943
49727 530943 532042 534707 538799 543737 548298 551209 552308 552883 554574 557970 562470 567370 572838 579850
$$ [...]
##END NTUPLES=NMR SPECTRUM
##END=
