
##TITLE=AC1297_GUAAH11109_6534985_0RUWSTfItb
##JCAMPDX= 6.0         $$ Bruker NMR JCAMP-DX V2.0
##DATA TYPE= NMR SPECTRUM
##DATA CLASS= NTUPLES
##ORIGIN= BRUKER
##OWNER= Administrator
$$ 1.72 TOPSPIN		Version 2.1
$$ 2012-07-16 20:13:45.984 -0500  Administrator@TOPSPIN
$$ Compression mode = diff/dup
##.OBSERVE FREQUENCY= 400.02188249412
##.OBSERVE NUCLEUS= ^1H
##.ACQUISITION MODE= SIMULTANEOUS (DQD)
##.ACQUISITION SCHEME= undefined
##.AVERAGES= 8
##.DIGITISER RES= 22
##SPECTROMETER/DATA SYSTEM= spect
##.PULSE SEQUENCE= zg30
##.SOLVENT NAME= COFFEE_meoh
##.SHIFT REFERENCE= INTERNAL, COFFEE_meoh, 1, 14.98509
##AUDIT TRAIL= $$ (NUMBER, WHEN, WHO, WHERE, PROCESS, VERSION, WHAT)
$$ ##TITLE= Audit trail, TOPSPIN		Version 2.1
$$ ##JCAMPDX= 5.01
$$ ##ORIGIN= Bruker BioSpin GmbH
$$ ##OWNER= Administrator
$$ $$ C:\Bruker\TOPSPIN/data/COFFEE/nmr/AC1297_GUAAH11109_6534985_0RUWSTfItb/10/pdata/1/auditp.txt
$$ ##AUDIT TRAIL=  $$ (NUMBER, WHEN, WHO, WHERE, PROCESS, VERSION, WHAT)
(   1,<2012-07-16 20:13:38.250 -0500>,<Administrator>,<TOPSPIN>,<go>,<TOPSPIN 2.1>,
      <created by zg
	started at 2012-07-16 20:12:31.656 -0500,
	POWCHK enabled, PULCHK disabled,
       configuration hash MD5:
       6B 1B 68 BB D9 2E 58 E2 7F 35 AD 54 07 DF 0E 41
       data hash MD5: 64K
       EC 71 02 6A 96 97 4C BB 09 22 BC CD 28 42 A6 65>)
(   2,<2012-07-16 20:13:41.687 -0500>,<Administrator>,<TOPSPIN>,<proc1d>,<TOPSPIN 2.1>,
      <Start of raw data processing
       efp LB = 0 FT_mod = 6 PKNL = 1 PHC0 = 0 PHC1 = 0 SI = 32K 
       data hash MD5: 32K
       BC BD 37 BE 5D 9F F0 35 19 55 54 62 28 FC A1 E2>)
(   3,<2012-07-16 20:13:42.062 -0500>,<Administrator>,<TOPSPIN>,<proc1d>,<TOPSPIN 2.1>,
      <pk PHC0 = 175.979 PHC1 = 0 
       data hash MD5: 32K
       AE 63 E4 7C C3 3D 3F 5F BD 30 A4 A2 A8 29 82 14>)
(   4,<2012-07-16 20:13:42.125 -0500>,<Administrator>,<TOPSPIN>,<proc1d>,<TOPSPIN 2.1>,
      <abs ABSG = 1 
       data hash MD5: 32K
       80 1A AB 05 72 1E 23 DF 09 32 19 DE 42 B5 D8 D8>)
(   5,<2012-07-16 20:13:42.156 -0500>,<Administrator>,<TOPSPIN>,<proc1d>,<TOPSPIN 2.1>,
      <abs ABSG = 2 
       data hash MD5: 32K
       E3 98 0A C9 A0 48 1C 4D F8 6E 77 32 71 D5 67 5B>)
(   6,<2012-07-16 20:13:42.187 -0500>,<Administrator>,<TOPSPIN>,<proc1d>,<TOPSPIN 2.1>,
      <abs ABSG = 3 
       data hash MD5: 32K
       03 88 5C 3E 5D E6 44 7E A2 51 29 20 10 9E F1 FB>)
(   7,<2012-07-16 20:13:42.234 -0500>,<Administrator>,<TOPSPIN>,<proc1d>,<TOPSPIN 2.1>,
      <abs ABSG = 4 
       data hash MD5: 32K
       87 F6 8B C3 25 64 7D 30 67 11 0A E4 D6 00 1E 5A>)
(   8,<2012-07-16 20:13:42.265 -0500>,<Administrator>,<TOPSPIN>,<proc1d>,<TOPSPIN 2.1>,
      <abs ABSG = 5 
       data hash MD5: 32K
       73 40 18 49 A0 41 6E 17 FF D9 15 2B 7E 82 8B 06>)
$$ ##END=
$$ 
$$ $$ hash MD5
$$ $$ DC F7 41 A9 F7 B9 58 D3 2A E3 82 BD 29 1D AC C4
##$RELAX= 
##$RELAX= 
##$RELAX= 
##$RELAX= 
##$RELAX= 
##$RELAX= 
##$RELAX= 
$$ Bruker specific parameters
$$ --------------------------
$$ [...]
150 150 150 150 150 150 150 150
##$TP07= 0
##$TPNAME0= <>
##$TPNAME1= <>
##$TPNAME2= <>
##$TPNAME3= <>
##$TPNAME4= <>
##$TPNAME5= <>
##$TPNAME6= <>
##$TPNAME7= <>
##$TPOAL= (0..7)
0.5 0.5 0.5 0.5 0.5 0.5 0.5 0.5
##$TPOFFS= (0..7)
0 0 0 0 0 0 0 0
##$TUNHIN= 0
##$TUNHOUT= 0
##$TUNXOUT= 0
##$USERA1= <user>
##$USERA2= <user>
##$USERA3= <user>
##$USERA4= <user>
##$USERA5= <user>
##$V9= 5
##$VALIST= <valist>
##$VCLIST= <CCCCCCCCCCCCCCC>
##$VD= 0
##$VDLIST= <DDDDDDDDDDDDDDD>
##$VPLIST= <PPPPPPPPPPPPPPP>
##$VTLIST= <TTTTTTTTTTTTTTT>
##$WBST= 2048
##$WBSW= 25
##$XGAIN= (0..3)
0 0 0 0
##$XL= 0
##$YL= 0
##$YMAX_a= 503069
##$YMIN_a= -639976
##$ZGOPTNS= <>
##$ZL1= 120
##$ZL2= 120
##$ZL3= 120
##$ZL4= 120
##$ABSF1= 14.98509
##$ABSF2= -5.573092
##$ABSG= 5
##$ABSL= 3
##$ALPHA= 0
##$AQORDER= 0
##$ASSFAC= 0
##$ASSFACI= 0
##$ASSFACX= 0
##$ASSWID= 0
##$AUNMP= <proc_prof1d_extract_pilot.lims>
##$AXLEFT= 0
##$AXNAME= <>
##$AXNUC= <1H>
##$AXRIGHT= 0
##$AXTYPE= 0
##$AXUNIT= <>
##$AZFE= 0.1
##$AZFW= 0.1
##$BCFW= 0
##$BC_mod= 0
##$BYTORDP= 0
##$COROFFS= 0
##$CY= 15
##$DATMOD= 1
##$DC= 0
##$DFILT= <>
##$DTYPP= 0
##$F1P= 0
##$F2P= 0
##$FCOR= 0.5
##$FTSIZE= 32768
##$FT_mod= 6
##$GAMMA= 0
##$GB= 0
##$INTBC= 1
##$INTSCL= 1
##$ISEN= 128
##$LB= 0
##$LEV0= 0
##$LPBIN= 0
##$MAXI= 10000
##$MC2= 0
##$MEAN= 0
##$ME_mod= 0
##$MI= 0
##$NCOEF= 0
##$NC_proc= -8
##$NLEV= 6
##$NOISF1= 0
##$NOISF2= 0
##$NSP= 0
##$NTH_PI= 0
##$NZP= 0
##$OFFSET= 14.98509
##$PC= 1
##$PHC0= 175.979
##$PHC1= 0
##$PH_mod= 1
##$PKNL= yes
##$PPARMOD= 0
##$PPDIAG= 0
##$PPIPTYP= 0
##$PPMPNUM= 2147483647
##$PPRESOL= 1
##$PSCAL= 4
##$PSIGN= 0
##$PYNMP= <proc.py>
##$REVERSE= no
##$SF= 400.02
##$SI= 32768
##$SIGF1= 0
##$SIGF2= 0
##$SINO= 400
##$SIOLD= 32768
##$SPECTYP= <>
##$SREGLST= <1H.CDCl3>
##$SSB= 0
##$STSI= 32768
##$STSR= 0
##$SW_p= 8223.68421052631
##$SYMM= 0
##$S_DEV= 0
##$TDeff= 65536
##$TDoff= 0
##$TI= <>
##$TILT= no
##$TM1= 0
##$TM2= 0
##$TOPLEV= 0
##$USERP1= <user>
##$USERP2= <user>
##$USERP3= <user>
##$USERP4= <user>
##$USERP5= <user>
##$WDW= 1
##$XDIM= 32768
##$YMAX_p= 473271788
##$YMIN_p= -702287
##$CURPLOT= <Network HP LaserJet P1505>
##$CURPRIN= <$Network HP LaserJet P1505>
##$DFORMAT= <normdp>
##$LAYOUT= <+/1D_H.xwp>
##$LFORMAT= <normlp>
##$PFORMAT= <normpl>
##$SURQMSG= 1
$$ End of Bruker specific parameters
$$ ---------------------------------
##NTUPLES= NMR SPECTRUM
##VAR_NAME=  FREQUENCY,     SPECTRUM/REAL,   SPECTRUM/IMAG
##SYMBOL=    X,             R,               I
##VAR_TYPE=  INDEPENDENT,   DEPENDENT,       DEPENDENT
##VAR_FORM=  AFFN,          ASDF,            ASDF
##VAR_DIM=   32768,         32768,           32768
##UNITS=     HZ,            ARBITRARY UNITS, ARBITRARY UNITS
##FACTOR=    0.250966925370066, 1,           1
##FIRST=     8223.43324360094, -71970,       -22842
##LAST=      0,             140544,          -314016
##MIN=       0,             -702287,         0
##MAX=       8223.43324360094, 473271788,    0
$$ Real data points
##PAGE= N=1
##DATA TABLE= (X++(R..R)), XYDATA
$$ [...]
$$ plain form
19561 -143569 46514 -670440 -57123 -116187 124528 -118985 -67164 52815 -136601 -90976 -118187
19550 -118187 -135638 -57629 47144 2995 -496333 -163034 -38394 170332 -29027 -22242 -424352
19539 -424352 228651 114615 -50267 -180017 -33697 66591 -298639 -87293 -266670 -109184
19528 -297001 -19544 12655 -215448 -50248 -115833 105918 -204439 7513 -378703 -188240 -113158
19517 -113158 266575 -219215 2124 -224011 94298 -322118 -47500 -275277 350109 -324867
19506 -24143 139827 -98227 -28167 68722 98839 292185 220129 140483 46500 11411 -75681
19494 -7183 -103919 181704 -22437 63804 -65709 -80534 307243 -99595 78242 -227234 -119702
19483 -119702 -18866 -309241 -171234 -175342 431894 -528157 282211 -100661 39797 -331366
$$ packed form
19561a43569D6514f70440e7123n9064A24528a18985N1821E2815a36601M5625k7211
19550a18187j7451e7629D7144B995d96333a63034c8394A70332b9027O785m02110
19539d24352B28651j14036e0267j29750c3697F6591b98639h7293j79377a09184
19528b97001a9544A2655b15448e0248o5585A05918b04439G513c78703a88240P5082
19517a13158B66575b19215B124b24011I4298c22118d7500k27777C50109c24867
19506b4143A39827i8227b8167F8722L0117J93346p2056p9646D6500A1411g5681
19494g183r6736A81704b2437F3804f5709j4825C07243i9595G8242b27234J07532
19483a19702a8866k90375J38007m108D31894e28157B82211a00661C9797c31366
$$ plain form
19472 47599 -242510 71438 -362665 -360299 -216815 4660 -185474 -29455 50370 -143385 -39225
19460 -111711 9532 487162 11383 -115454 -330747 128829 242247 -171832 -71801 -287513
19450 -287513 -309930 -287744 -115136 130109 196153 -24605 -116603 449755 -164434 8466 70381
19439 70381 -130416 238565 -15186 -329155 -195385 82142 62024 -32938 166494 9410 -87959
19427 -236989 -399 265295 -412685 -85946 2535 -130943 168350 106120 120606 -33440 -192964
19416 -192964 -184200 -401513 -170335 -129552 -249804 74444 -218586 -143348 141665 -215247
19405 -153349 -320417 361565 -132748 30670 -40383 -19119 -168960 9516 36419 -42129 125644
19393 41244 -240617 -204841 -13977 380591 135964 -30038 -233889 54452 15942 -82586 -311325
$$ packed form
19472D7599b42510G1438c62665K366J43484D660a85474b9455E0370a43385c9225
19460a11711I532M77630A1383a15454k15293A28829J13418a71832g1801k15712
19450b87513k2417K2186a15136A30109O6044b4605r1998D49755a64434H466O1915
19439G0381a30416B38565a5186l13969J33770H2142k0118c2938A66494I410h7959
19427b36989c99B65295d12685h5946B535a30943A68350o2230J4486c3440j59524
19416a92964Q764k17313a70335M0783j20252G4444b18586P5238A41665b15247
19405a53349j67068C61565a32748C0670d0383a9119j49841I516K6903d2129A25644
19393D1244b40617L5776a3977C80591A35964c0038k03851E4452A5942h2586k28739
$$ plain form
19382 -311325 83827 165130 27333 167536 53407 -106084 -298818 -398956 -174580 -291016
19372 -291016 -133673 -360937 -82622 171534 -255958 186015 4584 13901 107110 -124964 16160
19360 -185050 -298876 -59575 -220752 -72677 81739 285824 226640 -32559 -93914 -110068 1871
19348 23860 -152245 -157875 -17048 52185 -291506 124383 115413 248544 37330 247404 -106199
19336 -217041 328662 -65778 -22351 -283346 14507 -122591 39683 -233663 -11734 161458
19325 1262 -197643 -146227 84169 -125503 -103915 -105378 167559 -22823 -74343 -237721 -115777
19313 -121485 175579 -208828 -10878 -107341 147060 -218550 99578 -288598 -333403 124046
19302 -47070 91651 -74756 -115625 -114120 -175401 -161779 -32978 -180013 -74848 94503 -273113
$$ packed form
19382c11325H3827Q1303B7333J40203E3407a06084j92734j00138a74580j16436
19372b91016a33673k27264h2622A71534b55958A86015D584R317R3209a24964A6160
19360a85050j13826e9575j61177g2677H1739K04085n9184c2559o1355j6154A871
19348B3860a52245n630a7048E2185b91506A24383q970J33131C7330K10074a06199
19336b17041C28662f5778b2351k60995A4507a22591C9683b33663a1734A61458
19325A262a97643N1416H4169a25503K1588j463A67559b2823n1520j63378a15777
19313a21485A75579b08828a0878r6463A47060b18550I9578b88598m4805A24046
19302d7070I1651g4756m0869J505o1281J3622c2978j47035g4848I4503b73113
$$ plain form
19290 -126642 -25546 330947 -108663 -22916 -185923 41965 -189946 80318 72244 -261483 -150808
19279 -150808 -89906 -204726 40626 -302047 -205725 67296 -272898 -155004 -222719 154588
19268 -334098 -110328 -332349 -150049 3813 -247535 -25545 20345 -126566 -319857 35570
19257 54746 -23083 66409 -5239 20850 -223615 -317243 -25394 78402 -397334 213596 94322
19245 -134222 241701 2676 -206776 -237552 -281408 -19344 -293867 287780 -44161 -53943 -139745
19234 -139745 86747 47035 -223517 -298661 -116611 -135485 -285026 -242958 49040 -437807 -1729
19222 140443 -28866 26498 -276143 -183751 246338 459710 -102610 -89767 -246967 -174070
19212 -174070 -215623 147575 86965 -32512 81941 95964 -524826 -320833 -32097 -107949 4413
$$ packed form
19290a26642b5546C30947a08663b2916j63007D1965a89946H0318q074b61483J10675
19279a50808O0902j14820D0626c02047R6322F7296b72898J17894o7715A54588
19268c34098a10328k22021a50049C813b47535b5545B0345a26566j93291C5570
19257E4746b3083F6409e239B0850b23615r3628b5394G8402c97334B13596I4322
19245a34222B41701B676b06776l0776m3856a9344k74523B87780d4161r782q5802
19234a39745H6747l9712b23517p5144a16611j8874j49541M2068D9040d37807a729
19222A40443b8866B6498b76143R2392B46338K13372a02610J2843j57200P2897
19212a74070m1553A47575o0610c2512H1941J4023e24826K03993c2097p5852D413
$$ plain form
19200 136946 -97035 2279 -37170 -47353 -349000 -263967 190986 -120689 -156298 -521382 -51712
19188 -355459 -96316 -106370 -4403 7225 2182 142712 -101238 110872 -31616 -133502 -46732
19176 92330 26724 335736 -157149 -138761 -207348 -173817 -43971 14983 86661 -334 -193431
19165 -193431 116942 -422073 11727 172192 145489 -337004 -139336 244960 95112 322639
19155 322639 70033 -283693 -141281 -112851 -325321 238180 -117150 -70767 -14727 37227
19144 -36587 -11827 -90463 -47125 -287179 133282 14614 100722 75304 -65319 -289310 -222942
19133 -222942 156229 -257371 203684 -357909 -169093 -376379 -252147 -232821 182922 -216069
19122 -48872 -186973 -114978 81506 -91363 -308495 -78798 -61887 40976 -178057 -165111 136055
$$ packed form
19200A36946i7035B279c7170j0183l01647Q5033A90986a20689l5609l65084e1712
19188c55459i6316j0054d403G225B182J40530a01238A10872c1616j01886d6732
19176I2330B6724L09012a57149J8388o8587L3531d3971A4983P1678c34j93097
19165a93431A16942d22073A1727J60465k6703c37004a39336B44960I5112K27527
19155C22639G0033b83693a41281K8430k12470B38180a17150M6383a4727C7227
19144c6587a1827p8636M3338k40054A33282A4614Q6108k5418f5319k23991O6368
19133b22942A56229b57371B03684c57909a69093k07286J24232J9326A82922b16069
19122d8872j38101P1995H1506i1363k17132g8798J6911D0976a78057J2946A36055
$$ plain form
19110 150401 61150 24731 -14299 -197208 -26870 -148789 -215708 12544 -404174 215119 -48001
19098 28790 -71920 -7783 74532 121100 -142066 -239440 -117428 -113360 -204564 -216947 139055
19086 -49226 185805 66979 -307550 28530 -62697 80416 -50298 -1125 -186016 213096 -13940
19074 -33494 -89822 -102339 378541 -304639 -12628 -97551 -212828 -275635 185810 12950 -315315
19062 -266809 -145031 -60536 -44244 -246576 -50557 -336341 -94298 69735 211718 -101615
19051 244929 153751 -209729 -154367 -247816 -204110 -294374 -179088 114082 -148879 66153 -281542
19039 -261655 125566 115530 -94573 130473 109369 280888 20549 226224 159594 -283873
19028 372027 -4472 161854 132947 82475 -127828 283435 298644 88383 -60989 268570 126890
$$ packed form
19110A50401F1150B4731a4299j82909b6870j21919o6919A2544d04174B15119d8001
19098B8790g1920g783G4532M6568a42066r7374a17428M068r1204j2383A39055
19086d9226A85805F6979c07550B8530f2697H0416e0298a125j84891B13096a3940
19074c3494n6328j2517C78541c04639a2628q4923j15277o2807A85810A2950c15315
19062b66809J21778f0536J6292k02332e0557k85784i4298F9735J41983a01615
19051B44929r1178b09729N5362r3449M3706r0264J15286A14082a48879F6153b81542
19039b61655A25566j0036i4573A30473k1104J71519B0549K05675o6630b83873
19028C72027d472A61854k8907n0472a27828B83435J5209H8383f0989B68570A26890
$$ plain form
19016 -149643 26312 -238932 -225213 37092 -27116 63051 -43208 17389 31586 45671 -20191
19004 68067 -96390 -204006 -148919 -73629 -393441 62486 -80657 -87615 -291997 190362 118967
18993 118967 -180041 -162992 85252 -71130 66123 98202 147117 -23061 -144667 -229386 -268442
18982 -268442 404970 -269821 -76314 -231948 265835 171660 -465614 33159 58596 -84302
18971 137157 71360 177030 59467 -5931 -48211 67646 -469067 -65725 -410353 -123041 128579
18959 -391764 -268555 209296 -32383 -331001 101337 20187 231118 -262289 -120710 -178991
18949 -178991 -120828 -287926 -107904 -353028 -5920 103514 -17689 341910 40574 -6273 -309911
18938 -309911 -84111 118121 233617 -112168 -231215 -376891 63469 168869 -230870 -75234
$$ packed form
19016a49643B6312b38932J3719C7092b7116F3051d3208A7389J4197J4085b0191
19004F8067i6390j07616N5087g3629l19812F2486h0657o958k04382A90362p1395
18993A18967a80041J7049H5252g1130F6123L2079M8915b3061j21606q4719l9056
18982b68442D04970b69821g6314j55634B65835r4175d65614C3159K5437h4302
18971A37157o5797J05670E9467e931m2280F7646d69067f5725l44628a23041A28579
18959c91764J23209B09296c2383k98618A01337B0187K10931b62289a20710n8281
18949a78991N8163j67098a07904k45124e920A03514a7689C41910D0574f273l03638
18938c09911h4111A18121J15496a12168j19047j45676F3469J05400b30870g5234
$$ plain form
18927 -49113 -355204 -225358 -92721 -272410 -225984 168931 -65567 -40383 -11062 7138 47690
18916 47690 45583 123971 -1038 -47324 -133289 111231 -179678 186529 -126161 -21879 87040
18904 -203151 -49203 -273275 -404051 -43154 190459 -91291 135405 101407 -114712 216522
18893 -297260 311432 217840 947 -99345 -359510 -63526 -173654 -152041 183916 268643 83799
18881 130564 59796 -112681 -30548 -264931 155877 -133234 -197248 181550 -36907 61009
18870 166717 207726 -9543 109807 -43714 -257375 380270 23067 107158 -205154 -124294 14441
18858 116878 -392629 -157018 -337500 125943 421678 269196 -92005 368699 235213 200575
18848 200575 -3037 243704 -147532 -8681 7979 151921 -258651 -19370 167069 322586 -233880
$$ packed form
18927d9113l06091J29846i2721j79689M6426A68931f5567K5184a1062G138M0552
18916D7690k107P8388a038m6286q5965A11231a79678A86529a26161b1879H7040
18904b03151d9203k24072j30776d3154A90459i1291A35405l3998a14712B16522
18893b97260C11432r3592I47i9345k60165f3526j10128K1613A83916Q4727H3799
18881A30564E9796a12681c0548k34383A55877a33234o4014A81550c6907F1009
18870A66717M1009i543A09807d3714k13661C80270B3067Q4091b05154Q0860A4441
18858A16878c92629a57018j80482A25943K95735j52482i2005C68699j33486l4638
18848B00575c037B43704a47532h681G979J43942b58651a9370A67069J55517b33880
$$ plain form
18836 -52929 -255754 -83806 36172 23914 -11799 102916 79913 -67510 94171 125479 9046
18824 -98902 -397243 -260017 -58216 -156265 -86136 238539 -176050 -249982 -48149 22386 -1132
18812 447609 -99732 9837 315678 270992 -31117 84896 246113 215239 -97552 27737 -168292
18800 101059 -67380 -214891 158422 390280 29709 87476 70598 -73218 -695948 -130189
18789 -310832 -20560 -302106 196299 -240915 -106123 -4873 -148678 -231113 -171773 -171755 91781
18777 63275 -375689 72129 115 10986 141503 57155 98506 -105513 233242 68675 -163395
18765 67811 -214560 -110941 -229509 60954 -73209 -307443 -172942 -16951 -129072 -274410
18755 -274410 331841 -179380 -337627 -213729 -97251 -311927 127781 -133736 2012 -27075
$$ packed form
18836e2929k02825h3806C6172j2258a1799A02916k3003f7510I4171L1308I046
18824i8902k98341J37226e8216r8049P0129B38539a76050p3932d8149B2386a132
18812D47609i9732I837L05841m4686c1117H4896J61217l0874i7552B7737a68292
18800A01059f7380j47511A58422K31858B9709N7767j6878g3218o22730a30189
18789c10832b0560k81546A96299b40915a06123d873j43805q2435N9340J8I1781
18777F3275c75689G2129A15J0871J30517E7155M1351a05513B33242F8675a63395
18765F7811b14560J03619j18568F0954g3209k34234J34501a6951j12121j45338
18755b74410C31841a79380j58247J23898i7251k14676A27781a33736B012b7075
$$ plain form
18744 68750 216325 -376608 112925 151571 -169881 2064 -103082 -263070 -210709 -136908 -144206
18733 -144206 14420 -195082 -134718 244804 99878 -106195 -264120 -399356 100996 1506
18722 -106937 -341475 109434 78064 -15072 101604 2817 -96496 -179218 -216846 134991 60679
18710 16278 -97115 164993 134917 157870 149188 -323148 37157 -179742 -159999 -124830 42829
18698 118425 127903 -127026 -197379 -12533 -392820 161878 -9969 -400598 -135993 -42077 -227495
18687 -227495 -87347 -431902 10367 -161820 462615 -176918 142559 328535 40954 -57107
18676 -191469 176447 -33682 -131993 33771 -61650 201821 164161 50786 -59848 102212 -68119
18664 113230 -132927 -105287 -265849 43873 38136 30540 232352 -121844 184429 -197754 -146468
$$ packed form
18744F8750J47575c76608A12925L8646a69881B064a03082j59988N2361P3801p298
18733a44206A4420a95082O0364B44804I9878a06195j57925j35236A00996A506
18722a06937k34538A09434l1370a5072A01604B817i6496q2722l7628A34991F0679
18710A6278i7115A64993l0076K2953q682c23148C7157a79742J9743L5169D2829
18698A18425R478a27026p0353a2533l80287A61878i969l90629a35993d2077j85418
18687b27495h7347l44555A0367a61820D62615a76918A42559J85976D0954e7107
18676a91469A76447c3682r8311C3771f1650B01821l7660E0786e9848A02212f8119
18664A13230a32927K7640j60562D3873n737p596K01812a21844A84429a97754N1286
$$ plain form
18653 -146468 -129726 32827 -177413 174192 -88907 11146 -20111 -252637 12104 -57762 -272303
18642 -272303 -266391 -40788 173572 219707 28405 -63797 73372 86932 -78964 43657 129659
18631 129659 -182190 153081 133020 -97161 -359908 76493 -544532 274638 -147199 23917
18620 -316587 125335 -312518 -174109 -338600 -67125 -41199 49060 -469987 -99418 -232419
18610 -232419 -292602 -154712 -130469 -146520 53490 340524 -122519 -113885 -130028 136909 -164626
18598 165318 -341655 -156925 -5859 -290867 -175098 121956 -218764 -177471 254298 192650
18588 192650 -294235 -245459 48242 80524 -4990 77600 134983 184815 -84172 355671 124409
18576 300226 74063 14585 -223935 -233503 -129671 -37104 66415 34280 -223119 -389402 -124141
$$ packed form
18653a46468J6742C2827a77413A74192h8907A1146b0111k32526A2104e7762k14541
18642b72303N912d0788A73572M6135B8405f3797G3372J3560g8964D3657Q6002
18631A29659a82190A53081k0061i7161k62747G6493e44532B74638a47199B3917
18620c16587A25335c12518J38409j64491f7125K5926D9060d69987i9418j33001
18610b32419o0183J37890K4243j6051E3490K87034a22519Q634j6143A36909a64626
18598A65318c41655a56925e859k85008J15769A21956b18764M1293B54298o1648
18588A92650b94235M8776D8242L2282d990G7600N7383M9832h4172C55671A24409
18576C00226G4063A4585b23935r568J03832c7104F6415l2135b23119j66283a24141
$$ plain form
18564 128267 47779 188568 -14427 -84545 -1681 -55931 -20068 26902 -145976 10911 -138890
18552 -41296 233171 281160 88114 195935 71163 297774 -14598 -89974 -198970 202112 19053
18540 96134 -134611 -417772 39889 219461 104781 -104671 -187855 -276185 -102328 -65487
18530 -65487 143723 -90377 -127742 347486 33326 -45778 -63918 147813 -66775 265654 51507
18518 210400 -101835 -178068 -36114 276770 -28632 -53930 253121 298497 -473597 -183008
18507 -159090 39137 -212753 41939 -133404 61008 -13699 -210223 -275391 -84249 -233394 -384926
18496 -384926 -180887 33243 -7673 -241314 122281 -50265 -42710 -114920 70168 131044 194137
18485 194137 -259775 143889 91121 -242261 -209248 151067 151961 84644 -320581 102709 -77655
$$ packed form
18564A28267D7779J40789a4427p0118a681n4250b0068B6902a45976A0911a38890
18552d1296B33171M7989H8114J07821G1163K26611a4598p5376j08996B02112A9053
18540I6134a34611k83161C9889J79572A04781a04671q3184q8330a02328L6841
18530f5487A43723i0377l7365C47486C3326d5778j8140A47813f6775B65654E1507
18518B10400a01835p6233c6114B76770b8632k5298B53121M5376d73597a83008
18507a59090C9137b12753D1939a33404F1008a3699j96524o5168h4249j49145j51532
18496c84926a80887C3243g673k33641A22281e0265P555p2210G0168O0876O3093
18485A94137b59775A43889n2768b42261L3013A51067Q94o7317c20581A02709g7655
$$ plain form
18473 -37799 97314 -92819 143526 150603 173370 -10171 -157655 -304453 113919 177780 54108
18461 17598 -151474 -104551 -178708 -75726 -166217 420187 54555 13831 -126633 -114670 -49795
18449 -67492 146841 119035 -21536 92328 181712 -251439 59346 -376153 8514 -27516 -185139
18438 -185139 -312534 232132 -331992 -9105 -163634 35621 -191086 -76414 127339 165373
18428 165373 -376838 221515 279538 -399061 -130096 -3700 133354 -140245 -245855 99942
18417 -50734 79552 199407 -487458 -316768 -161244 -10372 74404 197439 272669 -79593 98667
18405 -131836 -131867 219446 62397 171518 -152426 96134 265730 145392 -305396 -105040 -309482
18394 -309482 -163848 -46374 79998 76580 55253 -177302 -73724 -179623 50532 78401 -43587
$$ packed form
18473c7799I7314i2819A43526P077K2767a0171j47484j46798A13919O3861E4108
18461A7598a51474M6923p4157g5726r0491D20187E4555A3831a26633J1963d9795
18449f7492A46841k7806b1536I2328Q9384b51439E9346c76153H514b7516j57623
18438a85139j27395B32132c31992i105j54529C5621a91086g6414A27339L8034
18428A65373c76838B21515N8023c99061a30096c700A33354a40245j05610I9942
18417e0734G9552J19855d87458J70690J55524a0372G4404J23035P5230g9593I8667
18405a31836l1B19446F2397J09121a52426I6134J69596j20338c05396a05040k04442
18394c09482J45634d6374G9998l418k1327a77302g3724j05899E0532K7869d3587
$$ plain form
18382 -154494 -9464 -313756 210497 -157733 156468 81040 -37318 16285 -288999 -219639 182974
18370 284047 -90751 99753 10611 -139003 253593 311976 232112 364517 21403 -109767 -329994
18359 -329994 -50982 16030 -55629 -96889 -34791 -422364 57131 95246 -195475 178390 -178650
18347 -185974 -73405 -15667 -186873 -278417 -308871 -188686 -216696 31251 59041 -90556 -109578
18336 -109578 117289 -99591 -127807 -125714 -11037 21903 -216969 -112205 40743 -95878 -240651
18325 -240651 111349 73987 -51392 86220 -236386 92333 -62403 -116354 161881 -237089 30832
18313 182245 -144356 -129569 58157 -81340 -43299 150000 95001 -88949 -62613 -208842 -5507
18301 251289 -225406 -338177 -46735 -83709 -2091 17357 28602 152440 -211635 -54124 -216614
$$ packed form
18382a54494i464l04292B10497a57733A56468p5428c7318A6285b88999O9360A82974
18370B84047i0751I9753A0611a39003B53593N8383p9864J32405B1403a09767k20227
18359c29994e0982A6030e5629m1260c4791l87573E7131L8115a95475A78390a78650
18347a85974g3405a5667j71206r1544l0454J20185k8010C1251K7790i0556j9022
18336a09578A17289i9591k8216K093a1037B1903b16969J04764D0743i5878j44773
18325b40651A11349l7362e1392H6220b36386I2333f2403n3951A61881b37089C0832
18313A82245a44356J4787E8157h1340L8041A50000n4999h8949K6336j46229e507
18301B51289b25406j12771d6735l6974b091A7357J1245J23838b11635e4124j62490
$$ plain form
18290 -216614 -319558 -19159 -321252 -160002 -140819 34486 324630 2033 -48990 46717 73024
18279 73024 -5020 -324320 124428 189078 -134318 -273045 -104767 -247495 -262149 -39792 -23980
18268 -23980 85040 157928 238448 9197 -339221 -220763 63266 -66835 -31045 27247 -378763
18256 -140317 -364218 88602 128925 -143064 -92793 -204821 -319139 -72342 -141219 27606 -240
18244 -95017 108845 381054 -49976 197607 -42869 -140244 9747 -34088 -34019 -272956 45862 364795
18232 364795 -187447 -93209 -341765 81517 123173 -135454 -112133 131308 -137285 -14376
18221 59131 116040 112759 76903 -246096 -231324 210939 -113246 114930 -234188 -77380 427573
18209 122111 47408 107083 162776 122091 232337 -99008 -276680 -50922 -413647 268039 339103
$$ packed form
18290b16614j02944a9159l02093a60002J9183C4486K90144B033d8990D6717K6307
18279G3024e020l19300A24428O4650a34318j38727a04767j42728j4654c9792J5812
18268b3980H5040P2888Q0520I197c39221J18458F3266f6835c1045B7247c78763
18256a40317k23901H8602M0323a43064N0271j12028j14318g2342o8877B7606b40
18244i5017A08845K72209d9976A97607d2869r7375I747c4088O9k38937D5862L18933
18232C64795a87447i3209k48556H1517M1656a35454K3321A31308a37285a4376
18221E9131N6909l281l5856b46096J4772B10939a13246A14930b34188g7380D27573
18209A22111D7408N9675N5693m0685J10246i9008j77672e0922l62725B68039P1064
$$ plain form
18198 339103 -142557 -67832 64122 -109525 -98018 -128446 254978 213067 31317 -118510 -43504
18186 16489 216620 8709 3588 -93196 -88417 136173 -176735 45752 182224 -65494 -1972 184489
18173 15844 213643 -241420 259192 269050 -89205 -177993 9611 152027 -118302 -219393 -70593
18161 -212017 199308 70669 -30214 21964 -374253 -216456 192426 -209056 -298678 -126422
18150 -20529 -87719 90013 -55516 -77026 222146 -351982 -120564 -208144 -304549 -118196 58912
18138 247691 -50837 -30064 120671 152942 -112293 -499706 -169691 -232090 51432 -63028 178285
18126 92901 107045 234373 202284 59930 70849 78562 65974 99797 -182827 -408024 137215
18114 203140 -31744 -29645 143693 -362534 84891 -156708 -72186 50276 -65036 79813 212057
$$ packed form
18198C39103a42557f7832F4122a09525J1507l0428B54978m1911C1317a18510d3504
18186A6489K00131H709C588i3196M779A36173a76735D5752J36472f5494a972A84489
18173A5844J97799b41420B59192R858h9205q8788I611J42416a18302j01091g0593
18161b12017A99308G0669c0214B1964c74253J57797A92426b09056q9622a26422
18150b0529o7190I0013e5516k1510B22146c51982a20564q7580r6405a18196E8912
18138B47691e0837K0773A20671L2271a12293l87413a69691o2399E1432f3028A78285
18126I2901J4144J27328l2089E9930J0919P713j2588L3823a82827k25197A37215
18114B03140c1744K099A43693c62534H4891a56708g2186E0276f5036G9813J32244
$$ plain form
18103 212057 -244761 -289900 -149108 -140306 -103634 -36808 25449 -299830 70165 -102430 100319
18091 115519 -149931 265667 -396397 -63147 -100499 -88899 -109168 32365 -231263 231641
18080 304115 -73979 -145601 -173958 136355 -302274 169502 87238 -24666 -36117 200706 -287355
18068 -108764 185624 195562 243080 54567 330991 -171670 -248889 -92561 -116619 14778 -59589
18056 -98808 -106840 93746 -151898 -64115 -86637 27673 160372 -360055 -248679 -163250 304739
18044 -99163 -381562 -65232 -46585 -127284 199844 -306425 67628 -327861 -381159 -151171 46673
18032 -9935 -197595 -239885 -18646 -299252 86955 9264 -259222 212880 -133791 -290841 -45925
18020 114977 -20985 -103473 145158 -24580 363829 -17712 -384178 -90363 19652 261251 -125213
$$ packed form
18103B12057b44761m5139J40792Q802L6672c6808B5449b99830G0165a02430A00319
18091A15519a49931B65667c96397f3147l7352J1600k0269C2365b31263B31641
18080C04115g3979p1622k8357A36355c02274A69502q2264b4666j1451B00706b87355
18068a08764A85624R938M7518E4567K76424a71670p7219i2561k4058A4778e9589
18056i8808q032I3746a51898f4115k2522B7673J32699c60055J11376Q5429C04739
18044i9163k82399f5232J8647q0699A99844c06425F7628c27861n3298a51171D6673
18032i935j87660m2290a8646k80606H6955I264b59222B12880a33791j57050d5925
18020A14977b0985q2488A45158b4580C63829a7712l66466i0363A9652K41599a25213
$$ plain form
18008 -41568 -17328 -302666 83354 -9265 -7065 -114241 -76154 -176619 -39563 -13483 -78403
17997 -78403 44557 10930 -35569 380006 63790 -266303 98117 53283 -15101 442101 193215
17985 -14499 25360 -65788 83879 -39818 5007 -62049 142047 -57711 101148 -194050 -7452
17973 -245314 396143 -84926 -251599 36339 -8600 -10053 38620 227989 -284409 159830 209655
17962 209655 -150180 -302703 -80213 -321384 -468292 -153734 -233058 242447 -109318 -353841
17952 -353841 98579 -96736 -282770 -256807 -346641 -85231 142506 387362 -83671 199848 11153
17940 42958 109474 -166068 99191 -118860 -14115 -127854 -187827 12499 85423 209483 41370
17928 -274010 -385018 -43419 -57504 20332 -121506 118487 163738 -174631 209479 238741
$$ packed form
18008d1568a7328k85338H3354i265K200j07176L8087j00465c9563a3483o4920
17997g8403D4557A0930c5569C80006F3790b66303I8117m4834a5101D42101A93215
17985a4499B5360f5788H3879c9818E007f2049A42047e7711A01148a94050g452
17973b45314C96143h4926j66673C6339h600j453C8620J89369b84409A59830M9825
17962B09655a50180j52523h0213k41171j46908a53734p9324B42447a09318k44523
17952c53841I8579i6736j86034K5963q9834h5231A42506K44856h3671A99848A1153
17940D2958O6516a66068I9191a18860a4115j13739n9973A2499P2924J24060D1370
17928b74010j11008d3419j4085B0332a21506A18487M5251a74631B09479K9262
$$ plain form
17918 238741 -15012 167188 401757 -223536 153907 -95086 -112144 -292806 -152745 83961
17907 28510 54878 -53978 107714 -25503 214253 -178279 -72687 110956 2923 169683 -257587
17895 -130291 100170 81263 -481779 -43885 -159759 166284 -177230 23455 223956 -202905
17884 335003 105123 113984 481141 -299468 230520 -120664 -216907 -52493 -42614 74560 165722
17873 165722 -249473 -115161 81081 62430 100589 -35868 -158233 177897 -32619 215027
17862 -509455 -158975 95413 -56926 -88915 46279 -200794 85306 94061 20600 -247073 -117075
17850 -101723 366103 1309 -46110 -226365 170434 -293250 -135123 -294137 -138813 279469
17839 -306957 121474 152260 195411 -246226 -315176 37314 -54158 168658 6551 345480 -83732
$$ packed form
17918B38741a5012A67188K34569b23536A53907i5086j7058j80662J40061H3961
17907B8510K6368e3978A07714b5503B14253a78279g2687A10956B923J66760b57587
17895a30291A00170j8907d81779d3885j15874A66284a77230B3455K00501b02905
17884C35003A05123Q861L67157b99468B30520a20664r6243e2493R879G4560R1162
17873A65722b49473a15161H1081j8651L8159c5868j22365A77897c2619B15027
17862e09455a58975I5413e6926l1989D6279b00794H5306Q755B0600b47073a17075
17850a01723C66103A309d6110j80255A70434b93250a35123j59014a38813B79469
17839c06957A21474L0786M3151b46226o8950C7314e4158A68658F551L38929h3732
$$ plain form
17827 -65401 227965 192768 162540 52732 -157295 -348 -200834 27254 -411 -12323 62449 -19590
17814 -162364 45045 -17621 27326 -111255 151289 2779 -10934 1481 -70180 -119005 -48835
17802 107234 6105 432451 386202 -254662 411130 30218 350087 180807 61758 88785 34180
17790 -107377 132031 42295 217145 52842 -157315 -103559 84272 137558 227439 -137382 -125860
17779 -125860 -111030 298878 153798 81776 -164749 2796 -3215 95681 -300303 -102069 -243358
17768 -243358 -171342 -21267 -224 -23928 96610 62077 -87272 -256154 120291 -208502 227325
17756 42315 -13039 -55107 47657 -83278 148482 -86916 270865 431075 -49245 -48543 347050
17744 -201368 -169414 -47042 -205754 -158327 -62822 -80433 -71660 -137689 116541 173026 133517
$$ packed form
17827f5401B27965l5197l0228E2732a57295c48k00486B7254d11j1912F2449a9590
17814a62364D5045a7621B7326a11255A51289B779a0934A481g0180m8825d8835
17802A07234F105M26346m6249b54662D11130C0218L19869j69280F1758K7027C4180
17790a07377A32031D2295J74850E2842a57315N3756H4272N3286Q9881a37382J1522
17779a25860J4830B98878j45080p2022a64749B796c215I5681c00303a02069j41289
17768b43358P2016b1267b24k3704I6610l4533h7272j68882A20291b08502B27325
17756D2315a3039m2068D7657h3278A48482h6916B70865J60210d9245P02C47050
17744b01368L1954d7042j58712M7427f2822j7611Q773o6029A16541N6485l9509
$$ plain form
17733 133517 154580 -216016 -186067 183451 112512 -337036 -186052 -270696 -45027 -113203 78663
17721 110499 58507 -21199 28295 -56766 -100212 -196017 20762 -151457 177102 -61809 -163215
17710 -163215 164682 -13962 -2905 346844 110592 -88381 -204749 63619 253890 -231481
17699 -105488 20507 -89862 122745 -26099 -112096 150580 124627 241603 -23088 -26649 -45314
17688 -45314 -237463 -7307 -422532 -18436 169492 -126257 8477 -412795 130182 -139694 -14560
17676 208432 12234 -12350 4357 -83142 114218 136407 -16217 -146954 298455 320595 101705
17664 -23140 -187018 139209 219112 -244916 91286 -17271 -318327 87751 349371 -10577 79135
17652 139433 -58881 76764 -103589 -71428 96274 167603 -207317 74259 -67418 116822 -252779
$$ packed form
17733A33517K1063b16016K9949A83451p0939c37036J50984q4644d5027o8176G8663
17721A10499n1992b1199B8295e6766m3446r5805B0762a51457A77102f1809j01406
17710a63215A64682a3962b905C46844A10592h8381j16368F3619J90271b31481
17699a05488B0507h9862A22745b6099q5997A50580k5953J16976b3088l561j8665
17688d5314j92149g307m15225a8436A69492a26257H477d12795A30182a39694a4560
17676B08432A2234a2350D357h3142A14218K2189a6217j30737B98455K2140A01705
17664b3140j63878A39209P9903b44916I1286a7271l01056H7751K61620a0577G9135
17652A39433e8881G6764a03589L2161I6274P1329b07317G4259f7418A16822b52779
$$ plain form
17640 126822 143463 -68400 -123654 236973 -51118 -180531 -114559 -36546 -298719 258183 -10499
17628 38513 319637 224238 136610 434476 384221 7018 183684 37495 -30443 176442 -347017
17616 324923 -37640 144366 363383 99385 -137636 349773 -121326 -141928 -487825 -318779
17606 -318779 -106042 -99474 53057 -123512 -379065 129027 116615 -86805 65094 137014 272780
17595 272780 39353 281569 -230145 -113565 40971 442 -120321 45688 -84355 -264628 -131126
17583 188750 -139466 139418 -79929 81525 199075 226710 13125 -271990 -37479 33376 87628
17572 87628 114329 106036 -145178 30414 83138 -83168 -177512 79043 192536 -2150 -302109
17561 -302109 -24940 87698 92768 471824 504499 23014 -280690 -13652 -49470 81933 81227 26582
$$ packed form
17640A26822J6641f8400n5254B36973e1118j29413O5972c6546k62173B58183a0499
17628C8513K81124r5399q7628K97866n0255G018J76666C7495c0443A76442c47017
17616C24923c7640A44366K19017I9385a37636C49773a21326k0602l45897J69046
17606c18779a06042O568E3057a23512k55553A29027j2412h6805F5094P1920J35766
17595B72780C9353K42216b30145a13565D0971D42a20321D5688h4355j80273a31126
17583A88750a39466A39418g9929H1525J17550K7635A3125b71990c7479C3376N4252
17572H7628K6701q293a45178C0414N2724h3168r4344G9043J13493b150k99959
17561c02109b4940H7698N070L79056L2675B3014b80690a3652l5818H1933p06B6582
$$ plain form
17548 125242 -30257 230161 95140 557231 21164 239426 -231349 -129766 -13522 -98538
17538 -98538 116563 -10042 371936 -18666 56716 76201 93793 -52159 365561 88779 56321
17527 56321 37013 -106862 239834 322651 -83225 -39329 207565 113202 -174394 189205 43587
17515 3584 99333 168 -72144 80142 188517 273788 -69181 68953 -197754 127139 288873
17504 288873 177313 49661 31126 60742 80863 60078 92236 83217 246613 150309 150433 179777
17492 179777 274189 48287 -47840 -102724 336346 -79295 70168 -105172 -7081 259468 161241
17481 161241 -181813 282906 104270 -78149 265885 -263694 -244469 354213 62941 525448
17471 525448 92688 148730 517192 203960 96748 -72325 107521 161973 97218 -215581 131959
$$ packed form
17548A25242c0257B30161I5140M62091B1164K18262b31349J01583a3522q5016
17538i8538A16563a0042C71936a8666E6716J9485J7592e2159C65561H8779l2458
17527E6321j9308a06862B39834Q2817h3225c9329B07565r4363a74394A89205D3587
17515C584R5749A68g2144H0142J08375Q5271f9181F8953a97754A27139J61734
17504B88873j11560D9661j8535K9616K0121k0785L2158r019J63396r6304J24K9344
17492A79777R4412D8287d7840n4884C36346g9295G0168a05172g081B59468r8227
17481A61241a81813B82906A04270g8149B65885b63694J9225C54213F2941M62507
17471E25448I2688N6042L68462B03960I6748g2325A07521N4452o4755b15581A31959
$$ plain form
17459 99303 -101981 69887 216613 213077 41272 226251 -158607 114586 106142 263606 110117
17447 341232 192670 135482 25427 200350 55949 337415 133523 327249 59810 367050
17437 367050 -185754 207278 439341 4630 87874 208038 115251 522164 42583 -93166 -108948
17426 -108948 281805 297535 316749 343409 69314 37884 337959 302795 153774 -148479 277376
17414 -33584 -79611 254125 -78724 205482 118222 13490 126289 301377 -94711 380234 154629
17402 177605 -138764 -23513 18591 113294 186511 116247 -70307 329537 150458 433187 -47023
17390 201171 253957 251700 368034 -135825 268790 259902 87430 199605 427336 -152224 292867
17378 -78368 93341 152455 305485 249584 26009 240415 144211 -68805 68927 137966 394306
$$ packed form
17459I9303a01981F9887J46726l536D1272J84979a58607A14586q444J57464A10117
17447C41232j48562n7188B5427J74923E5949K81466A33523J93726E9810L07240
17437C67050a85754B07278K32063D630Q3244J20164r2787M06913D2583i3166j5782
17426a08948B81805J5730J9214K6660F9314l1430L00075l5164j49021a48479B77376
17414c3584m6027B54125g8724B05482q7260A3490J12799J75088i4711C80234A54629
17402A77605a38764b3513A8591R4703P3217p0264g0307C29537A50458K82729d7023
17390B01171N2786k257J16334a35825B68790q888H7430J12175K27731a52224B92867
17378g8368I3341N9114J53030n5901B6009K14406r6204f8805F8927O9039K56340
$$ plain form
17367 394306 -21343 364625 227391 -166171 -168582 -201542 359171 17167 517644 59225 -69572
17355 335706 175148 -81417 265867 -13824 235807 410319 178102 64442 243238 253496
17345 253496 309582 241827 222568 429 242190 -176955 125909 461985 119423 -134783 141263
17333 95133 58342 29128 13148 16419 91561 159630 164227 142407 259303 129135 200124 274495
17321 274495 2419 2604 62397 -46118 477045 210628 162807 35306 181683 -214493 258600
17309 217460 435863 283525 110467 237283 137029 146726 -73780 168802 141508 53971
17298 -118735 2813 527276 347773 -41377 100656 390100 129988 282168 189285 64160
17287 237785 -3949 261312 517478 376688 499674 277092 441442 259071 -7964 285577
$$ packed form
17367C94306b1343C64625j37234a66171k411l2960C59171A7167N00477E9225f9572
17355C35706j60558h1417B65867a3824B35807J74512A78102F4442J78796J0258
17345B53496N6086o7755j9259D29K41761a76955A25909L36076A19423a34783A41263
17333I5133l6791B9128A3148L271P5142O8069M597k1820J16896A29135P0989P4371
17321B74495B419J85N9793d6118D77045B10628m7821C5306J46377b14493B58600
17309B17460K18403j52338A10467J26816j00254R697g3780A68802k7294E3971
17298a18735B813N24463j79503d1377A00656K89444A29988J52180r2883F4160
17287B37785c949B61312K56166j40790J22986k22582J64350j82371g964B85577
$$ plain form
17276 194889 36447 -3869 -24935 306552 235890 216896 705070 389275 187756 53410 213887
17265 213887 318742 492232 57089 146994 231528 372797 64328 540438 182366 139842
17255 139842 187749 -39151 107794 238570 558284 423179 770 366268 358470 66382 322280
17244 322280 97125 61796 289940 37719 260621 13564 415986 105331 230793 240439 167348
17233 167348 120340 300904 313187 261860 -161572 -180632 225290 -2296 272555 11551 131013
17222 131013 256459 145061 136688 -106170 114122 139853 93049 189684 123230 31735 31967
17211 31967 240839 84015 198915 123990 498850 -10596 382383 114092 63884 375309
17201 375309 -216513 126748 95027 549778 636685 120175 166545 283893 321763 171145
$$ packed form
17276A94889C6447c869k1066C06552p0662j8994M88174l15795A87756E3410J60477
17265B13887J04855J73490E7089Q9905Q4534J41269F4328M76110A82366m2524
17255A39842M7907c9151A07794J30776L19714j35105G70L65498p798F6382K55898
17244C22280I7125l5329K28144C7719K22902A3564M02422A05331J25462R646p3091
17233A67348m7008J80564J2283n1327a61572j9060B25290b296B72555A1551J19462
17222A31013J25446j11398q373a06170A14122K5731m6804R6635o6454C1735K32
17211C1967K08872H4015J14900p4925L74860a0596C82383A14092n0208L11425
17201C75309b16513A26748l1721M54751Q6907A20175M6370J17348L7870j50618
$$ plain form
17191 171145 207202 232174 143249 -70908 129479 89787 159179 314793 116810 548827 317447
17180 317447 47081 336901 15972 92429 178574 208898 373944 184380 225901 266804 261710
17169 261710 424952 283513 468100 275457 56375 208911 9371 -156926 311468 17827
17158 303920 479145 -296290 573241 219318 145355 180868 463129 283809 -81650 350352
17147 -42063 158259 215325 587501 -117405 -62856 219783 273004 676040 284703 138568
17136 439942 288264 665608 224408 75981 342094 18804 128663 254689 404440 -314
17125 520665 4934 118323 287457 545247 604778 292241 102846 254756 188083 181615 85169
17113 -239593 304738 264071 263704 440897 317014 382421 127209 -491 346413 560839 591545
$$ packed form
17191A71145L6057K4972q8925g0908A29479l9692O9392J55614A16810M32017k31380
17180C17447D7081K89820A5972P6457Q6145L0324J65046A84380M1521M0903n094
17169B61710J63242j41439J84587j92643E6375J52536I371a56926C11468A7827
17158C03920J75225b96290E73241B19318p3963L5513K82261j79320h1650C50352
17147d2063A58259N7066L72176a17405N4549B19783N3221M03036B84703A38568
17136D39942j51678L77344B24408G5981K66113A8804J09859J26026J49751c14
17125E20665D934J13389J69134K57790N9531B92241A02846J51910o6673o468H5169
17113b39593C04738m0667l67J77193j23883O5407A27209d91C46413K14426L0706
$$ plain form
17102 591545 610489 537717 254787 -15394 337250 -24414 334761 344403 852262 444983 560033
17091 560033 470256 577455 46525 421993 305684 219962 496166 572159 504665 517541 547488
17080 547488 731415 533939 190327 485805 522422 609571 583133 399295 433990 718823
17070 718823 296514 505566 398655 330013 306350 365640 488049 832041 169270 748709
17060 748709 194930 492876 216841 543860 166160 487115 189680 568178 436326 572514
17050 572514 628042 528057 651589 479487 279925 283846 275793 543804 532404 484085 529197
17039 529197 542099 463139 490139 708270 568817 658439 599999 643886 474414 353968 646329
17028 646329 530387 524532 521315 805064 632703 667280 465738 674190 443225 251005
$$ packed form
17102E91545J8944p2772B54787a5394C37250b4414C34761R642N07859m07279J15050
17091E60033q9777J07199D6525L75468j16309q5722K76204P5993o7494J2876K9947
17080E47488J83927j97476A90327K95478L6617Q7149k6438j83838L4695K84833
17070G18823B96514K09052j06911o8642k3663N9290J22409L43992A69270N79439
17060G48709A94930K97946B16841L27019A66160L20955A89680L78498j31852J36188
17050E72514N5528r9985J23532j72102j99562L921q053K68011j1400m8319M5112
17039E29197J2902p8960K7000K18131j39453Q9622n8440M3887j69472j20446K92361
17028F46329j15942n855l217K83749j72361L4577k01542K08452k30965j92220
$$ plain form
17018 251005 437787 506943 752460 395931 360400 361519 430096 689826 559049 534790 530637
17007 530637 827098 877633 770503 760913 1109118 560429 737743 505935 961814 612006
16997 612006 452126 608962 948954 753676 622463 903042 677498 836094 927113 687746
16987 687746 834969 753498 651058 865974 734004 944621 779548 771536 1020814 1057451
16977 1057451 795195 641575 909252 737314 814151 554157 530924 1054461 1096141 921889
16967 921889 851239 774385 960661 982610 892752 682875 786674 443787 848370 752589
16957 752589 786075 1079677 1009106 951257 1430188 996238 1029614 870616 912667 1062171
16947 1062171 1182567 1299309 1111043 984035 1253502 1103960 1551363 1376257 912786
$$ packed form
17018B51005J86782O9156K45517l56529l5531J119O8577K59730j30777k4259m153
17007E30637K96461N0535j07130r590L48205n48689J77314k31808M55879l49808
16997F12006j59880J56836L39992j95278j31213K80579k25544J58596R1019k39367
16987F87746J47223q1471j02440K14916j31970K10617j65073q012K49278L6637
16977A057451k62256j53620K67677j71938P6837k59994k3233N23537M1680j74252
16967I21889p0650p6854J86276K1949q9858k09877J03799l42887M04583r5781
16957G52589L3486K93602p0571n7849M78931m33950L3376j58998M2051J49504
16947A062171J20396J16742j88266j27008K69467j49542M47403j75106m63471
$$ plain form
16938 912786 1207262 1382714 1501565 1131611 1645208 1237895 1515994 1379875 1137062 1181755
16928 1181755 1125285 1203118 1019791 1087745 1490434 1555221 1409074 996103 1227374 1203924
16918 1203924 1387867 1296963 1505950 1730919 1506373 1471523 1481123 1344010 1502363 1481277
16908 1481277 1444509 1656477 1448264 1352985 1576900 1853483 1734067 1871958 1900473 1690159
16898 1690159 1449313 1725592 1918894 1438398 1920786 1508642 1852023 2011846 1771879
16889 1771879 2230185 2066694 1996143 2041900 1962534 1818967 2032303 2149268 2019670 2303141
16879 2303141 1863332 2545750 2171490 2149366 2326251 2303916 2337095 2286905 2498548 2457870
16869 2457870 2498934 2498246 2642538 2599822 2594917 2566731 2933503 2541594 2889155 2628218 2723766
$$ packed form
16938I12786K94476J75452J18851l69954N13597m07313K78099j36119k42813M4693
16928A181755n6470P7833j83327O7954M02689O4787j46147m12971K31271k3450
16918A203924J83943r0904K08987K24969k24546l4850R600j37113J58353k1086
16908A481277l6768K11968k08213r5279K23915K76583j19416J37891K8515k10314
16898A690159k40846K76279J93302m80496M82388m12144L43381J59823k39967
16889A771879M58306j63491p0551M5757p9366j43567K13336J16965j29598K83471
16879B303141m39809O82418l74260k2124J76885k2335L3179n0190K11643m0678
16869B457870M1064o88J44292m2716m905k8186L66772l91909L47561k60937R5548
$$ plain form
16858 2723766 2814909 3220056 3131122 3100740 2932737 3041403 3136042 3468362 3232053 3316931
16848 3316931 3480108 3231804 3309108 3567888 3382593 3824960 3962085 3936976 3581807 3777613
16838 3777613 4132695 3678517 3940299 4043026 4067003 4269888 4326948 4295003 4470983 4365578
16828 4365578 4868104 4878570 5124578 4803172 4706022 5148472 5110315 5300200 5369044 5331304
16818 5331304 5652702 5140470 6004524 5803825 5999886 5970007 6726167 6283308 6522560 6650995
16808 6650995 6708042 7001425 7131243 7365223 7053310 7654152 7718997 7946174 7911609 8010278
16798 8010278 8489752 8471679 8759575 8908404 9236870 9628536 9594617 9902132 10326914 10195474
16788 10195474 10996773 11174366 11195283 11710132 11968575 12567032 12983215 13471124 13848442
$$ packed form
16858B723766R1143M05147q8934l0382j68003J08666R4639L32320k36309Q4878
16848C316931J63177k48304P7304K58780j85295M42367J37125k5109l55169J95806
16838C777613L55082m54178K61782J02727K3977K02885N7060l1945J75980j05405
16828D365578N02526J0466K46008l21406r7150M42450l8157J89885O8844l7740
16818E331304L21398n12232Q64054k00699J96061k9879P56160m42859K39252J28435
16808F650995N7047K93383J29818K33980l11913O00842O4845K27177l4565R8669
16798H010278M79474j8073K87896J48829L28466L91666l3919L07515M24782j31440
16788A0195474Q01299J77593K0917N14849K58443N98457M16183M87909L77318
$$ plain form
16779 13848442 14026504 14397788 14828200 15101727 15900329 16346558 16528446 17247741 17860789
16770 17860789 18285049 19111395 19948894 20588514 21197400 22043045 22775300 23873949 24641845
16761 24641845 25541274 26828899 27902978 28577004 30196733 31414204 32420815 34412910
16753 34412910 35812206 37199778 39295950 41187740 43042556 45113252 47312344 50195956
16745 50195956 52584944 55341313 58606366 61601839 64927630 68627861 72500633 76856976
16737 76856976 81487739 86161998 91631273 97174138 103256640 109609361 116214796 123601784
16729 123601784 131184465 138471601 146962192 154856721 163205779 171517488 179434721 186501850
16721 186501850 193160436 199351639 203738271 207096124 209187137 209525076 207897570 205657731
$$ packed form
16779A3848442J78062L71284M30412K73527P98602M46229J81888P19295O13048
16770A7860789M24260Q26346Q37499O39620O08886Q45645P32255J098649P67896
16761B4641845Q99429J287625J074079O74026J619729J217471J006611J992095
16753C4412910J399296J387572K096172J891790J854816K070696K199092K883612
16745E0195956K388988K756369L265053K995473L325791L700231L872772M356343
16737G6856976M630763M674259N469275N542865O082502O352721O605435P386988
16729A23601784P582681P287136Q490591P894529Q349058Q311709P917233P067129
16721A86501850O658586O191203M386632L357853K091013L37939j627506k239839
$$ plain form
16713 205657731 201125277 195897476 189204898 181565294 173710551 164935728 156588447 147837343
16705 147837343 139918878 131634151 123774706 115914740 108737927 102201868 95747126 90105911
16697 90105911 84670526 79222042 74315060 70211872 65804691 62392442 58743223 55202054
16689 55202054 52346048 49478321 47236994 44428853 42179335 40122137 38090818 36200843
16681 36200843 34210524 33049914 31114089 29835737 28588331 27416229 26042687 24784728
16673 24784728 24235379 23208837 22457027 21543790 20211709 19497880 18983551 17984462 17784293
16664 17784293 16908645 16378560 16021662 15028228 14803213 14224004 13886320 13129187 12690395
16655 12690395 12764460 12180674 11734676 11458279 10677661 10621283 10331068 10474065 10124124 9314090
$$ packed form
16713B05657731m532454n227801o692578p639604p854743q774823q347281q751104
16705A47837343p918465q284727p859445p859966p176813o536059o454742n641215
16697I0105911n435385n448484m906982m103188m407181l412249l649219l541169
16689E5202054k856006k867727k241327k808141k249518k057198k031319j889975
16681C6200843j990319j160610j935825j278352j247406j172102j373542j257959
16673B4784728n49349j026542p51810r13237j332081p13829n14329r99089k00169
16664A7784293q75648n30085l56898r93434k25015n79209l37684p57133m38792
16655A2690395P4065n83786m45998k76397p80618n6378k90215J42997l49941q10034
$$ plain form
16645 9314090 9585341 9191087 8735394 8728033 8134541 8073711 7889893 7619151 7446024 7293797
16635 7293797 6996167 7222486 6908049 6359406 6383567 6106384 5773964 5878810 5663012 5664514
16625 5664514 5399611 5427138 5788741 5497827 5232468 4982561 4877816 4866360 4815920 4759559
16615 4759559 4660182 4325804 4356837 4609293 4360862 3743464 4093791 4011393 3895860 3941393
16605 3941393 3723433 3811044 3509035 3424074 3518329 3512396 3509407 3278201 3192624 3500403 3193050
16594 3193050 3282347 3157336 2841484 3032381 3114250 2473838 2884686 2491980 3002741 2567463
16584 2567463 2576827 2792084 2319941 2412253 2398670 2416001 2379445 2347715 2441457 2315684 2197908
16573 2197908 2221233 2065831 2129809 2181801 2170784 1939767 2057356 2041269 1843839 1824205
$$ packed form
16645I314090K71251l94254m55693p361n93492o0830j83818k70742j73127j52227
16635G293797k97630K26319l14437n48643K4161k77183l32420J04846k15798J502
16625E664514k64903K7527L61603k90914k65359k49907j04745j1456n0440n6361
16615D759559r9377l34378L1033K52456k48431o17398L50327q2398j15533M5533
16605C941393k17960Q7611l02009q4961R4255n933k989k31206q5577L07779l07353
16594C193050Q9297j25011l15852J90897Q1869o40412M10848l92706N10761m35278
16584B567463R364K15257m72143R2312j3583J7331l6556l1730R3742j25773j17776
16573B197908K3325j55402O3978N1992j1017k31017J17589j6087j97430j9634
$$ plain form
16563 1824205 1626479 1980711 1776685 2022025 1723670 1882867 1600253 1500697 1517218 1412361
16553 1412361 1333942 1661508 1678434 1373855 1343081 1708406 1661096 1835978 1379051 1300504
16543 1300504 1442459 1897039 1192087 1516747 1411210 1813908 1330021 1374813 1242276 1465676
16533 1465676 1263000 995133 1349270 1488954 1355710 903437 1256174 1051973 873465
16524 873465 1262105 881569 1104687 1041678 1087525 1039674 1141105 1268572 1078371 970647
16514 970647 778934 1418756 902639 1192276 807178 818828 994287 1067734 963861 1088787
16504 1088787 1225458 971147 786266 848352 812940 870031 896807 881914 1093749 859685
16494 859685 991310 462262 813979 934313 695430 531815 533420 1013230 548235 801856
$$ packed form
16563A824205j97726L54232k04026K45340k98355J59197k82614r9556J6521j04857
16553A412361p8419L27566J6926l04579l0774L65325m7310J74882m56927p8547
16543A300504J41955M54580p04952L24660j05537M02698m83887M4792j32537K23400
16533A465676k02676k67867L54137J39684j33244m52273L52737k04201j78508
16524H73465L88640l80536K23118o3009M5847m7851J01431J27467j90201j07724
16514I70647j91713O39822n16117K89637l85098J1650J75459P3447j03873J24926
16504A088787J36671k54311j84881O2086l5412N7091K6776j4893K11835k34064
16494H59685J31625D62262L51717J20334k38883j63615J605M79810m64995K53621
$$ plain form
16484 801856 639646 961251 557739 818784 605301 542744 636155 1148821 595136 812916
16474 812916 419787 504400 572052 708649 468528 542264 937015 927405 560017 546571 590356
16463 590356 940460 503060 272903 518429 814031 499160 500637 972545 556305 1114585
16453 1114585 538022 469375 487998 382167 569418 489068 225340 410638 540006 874098
16443 874098 516179 231644 641783 657553 737062 346177 470133 538123 866873 323073
16432 443245 560400 397375 607318 56727 451519 431300 280655 481404 286579 450129
16422 450129 388867 646048 290970 303518 342417 435538 532257 554600 365855 273631 286881
16411 286881 669756 175787 244533 630191 285476 560786 443889 521766 212503 735448
$$ packed form
16484H01856j62210L21605m03512K61045k13483o2557R3411N12666n53685K17780
16474H12916l93129Q4613O7652J36597k40121P3736L94751r610l67388j3446M3785
16463E90356L50104m37400k30157K45526K95602l14871J477M71908m16240N58280
16453A114585E38022o8647J8623j05831J87251q0350B25340J85298J29368L34092
16443H74098l57919B31644M10139J5770P9509C46177J23956O7990L28750C23073
16432D43245J17155j63025K09943E6727L94792k0219j50645K00749j94825J63550
16422D50129o1262K57181B90970J2548L8899R3121R6719K2343j88745r2224J3250
16411B86881L82875A75787O8746L85658B85476K75310j16897P7877B12503N22945
$$ plain form
16401 735448 360410 409161 576869 365152 321299 225113 364559 366451 448602 435803 418693
16390 418693 484751 272462 433266 322318 294151 217934 231741 78814 593375 227770
16379 200159 358262 405213 794283 620673 86643 382612 406944 355521 247885 658151
16369 658151 432192 480793 399718 133501 374520 281288 293523 489681 206942 355033
16359 355033 276372 -45039 203637 432799 368350 153949 146382 47823 28245 284227 175869
16348 175869 -72364 284123 162342 59184 395463 268335 137649 46556 87615 -60137
16337 403712 258801 301629 271202 159874 419869 343276 188766 294115 193625 197356
16327 197356 216472 289513 326712 25521 141583 304655 265130 443662 112988 -29241 39000
$$ packed form
16401G35448C60410M8751J67708k11717m3853r6186J39446J892Q2151j2799j7110
16390D18693O6058k12289J60804j10948k8167p6217J3807G8814N14561B27770
16379B00159J58103M6951L89070j73610H6643K95969K4332n1423j07636M10266
16369F58151k25959M8601q1075A33501K41019r3232J2235J96158B06942J48091
16359C55033p8661d5039B03637K29162o4449A53949p567D7823j9578K55982j08358
16348A75869g2364B84123j21781E9184L36279j27128j30686D6556M1059f0137
16337D03712j44911M2828l0427j11328K59995p6593j54510J05349j00490L731
16327A97356J9116P3041L7199B5521J16062J63072l9525J78532A12988b9241C9000
$$ plain form
16315 227432 223556 217682 158731 331776 189818 89256 158256 57534 311877 56316 230223
16304 230223 98625 52473 153297 269628 4415 -2347 -79323 186310 121437 296723 -100848
16292 178277 248297 323811 469926 225456 137261 338524 -80941 18067 243312 91210 537385
16281 537385 -59803 -2387 -80598 -171350 385290 376095 248 -66502 164046 186046 -64287 231920
16268 288272 266631 707373 136300 380982 110505 258024 48635 -69659 359599 129987
16257 -67010 -119425 134290 -139525 -21780 202649 216148 -77135 332609 -118732 -199615 -60540
16245 129479 155585 432701 285630 -108867 312465 -299755 -116237 244689 -159033 126649
16234 391684 362537 -8953 295665 -169070 146694 -35331 209031 205483 373918 121446 -114065
$$ packed form
16315B27432l876n874n8951J73045j41958H9256O9000E7534K54343E6316J73907
16304B30223I8625m6152J00824J16331D415b347p6976A86310o4873J75286a00848
16292A78277P0020P5514J46115B25456q8195K01263h0941A8067K25245I1210M46175
16281E37385e9803b387p8211r0752C85290r195B48f6502A64046K2000f4287B31920
16268B88272k1641M40742A36300K44682A10505J47519D8635f9659C59599A29987
16257f7010n2415A34290a39525b1780B02649J3499g7135C32609a18732q0883f0540
16245A29479K6106K77116j47071a08867C12465b99755a16237B44689a59033A26649
16234C91684k9147h953B95665a69070A46694c5331B09031l548J68435A21446a14065
$$ plain form
16222 182166 17967 -197393 -96414 -149136 110654 130614 150212 -35991 206116 -121375 44073
16210 306275 286071 76600 7601 181382 -330609 18978 -72758 -61081 -139243 288469 94054
16198 -160819 167313 46081 224077 -3502 -52280 -233183 113190 -100549 -49589 -163377
16188 -163377 20120 51532 -170176 -14503 25563 47703 198447 -190241 94565 -91647 -8864
16176 -164752 185243 -227594 -19364 278043 383720 -218498 -52037 -171627 23309 191332
16166 191332 293277 90310 50266 -279005 -41445 -169208 -247144 -206985 -46261 -143908 174632
16154 5704 151089 -93787 33135 -131919 -65607 55109 -189166 216297 -137461 168592 -44870
16142 -207846 -40944 -18686 -159245 -262884 36276 -97052 292088 193966 1836 -200253 34659
$$ packed form
16222A82166A7967a97393i6414n2722A10654J9960J9598c5991B06116a21375D4073
16210C06275k0204G6600G601J73781c30609A8978g2758J1677p8162B88469I4054
16198a60819A67313D6081J77996c502m8778j80903A13190a00549d9589j13788
16188a63377B0120L1412a70176a4503B5563K2140J50744a90241I4565i1647h864
16176a64752A85243b27594a9364B78043J05677b18498e2037j19590B3309J68023
16166A91332J01945I0310m0044b79005d1445j27763p7936M0159d6261r7647A74632
16154E704J45385i3787C3135a31919f5607E5109a89166B16297a37461A68592d4870
16142b07846d0944a8686j40559j03639C6276i7052B92088r8122A836b00253C4659
$$ plain form
16130 190746 139387 198311 125706 -303407 -114559 -64198 84698 136595 -42597 358342 -76253
16118 190754 170712 -198483 -69834 16300 115934 -53705 -97672 7641 117643 194921 204371
16107 204371 334220 -192416 124909 54857 78411 304905 106018 -83267 -142024 38082
16096 -7872 8770 -104869 6238 -5066 187427 -205754 167241 127128 183879 -239698 -290903
16085 -290903 -160566 326372 -313797 279846 -90979 265403 35865 -68225 160132 -210457
16074 -24076 -375507 -70323 -90220 3240 71137 108603 64853 -76409 258009 -87702 72202
16062 -195234 57147 -192075 20536 58887 37252 121335 -255476 -309730 -209877 231262 61022
16050 144654 226123 -152630 291274 183450 -105782 -164607 -112141 25224 5920 2111 102749
$$ packed form
16130A90746n1359N8924p2605c03407a14559N0361H4698N1897d2597C58342g6253
16118A90754k0042a98483f9834A6300R9634e3705m3967G641J10002P7278R450
16107B04371J29849a92416A24909E4857K3554K26494A06018h3267n8757C8082
16096g872H770a04869F238e066A87427b05754A67241m0113N6751b39698n1205
16085b90903J30337C26372c13797B79846i0979B65403C5865f8225A60132b10457
16074b4076l51431g0323j9897C240O7897L7466m3750g6409B58009h7702G2202
16062a95234E7147a92075B0536L8351k1635Q4083b55476n4254R9853B31262F1022
16050A44654Q1469a52630B91274j07824a05782n8825N2466B5224E920B111J00638
$$ plain form
16039 102749 31430 57512 -97329 117857 -68681 -34111 -82980 -45367 -66675 190873 328315
16028 328315 -178045 17569 -202883 -56054 -119906 -14694 137026 -171021 -53598 -135771 283737
16016 -96555 -5903 38390 344936 -91519 -111656 -65270 -67117 -406758 6151 -296910 112290
16004 -84839 -294112 -391360 232811 21568 -185009 -169323 112046 23840 -90412 -239349 31642
15992 -162855 138433 250335 -44571 156701 209610 24745 166094 206529 305647 507259
15982 507259 380341 201282 124147 90961 468649 108906 89026 99954 27184 -424302
15971 213941 -63328 -203481 -109131 -191558 -103032 432044 -176117 348008 -144211 188229
15960 -65802 59862 -36591 -60475 -215037 -30052 -326339 -39722 -84946 237123 59201 -242904
$$ packed form
16039A02749C1430K6082i7329A17857f8681c4111m8869L7613k1308A90873J37442
16028C28315a78045A7569b02883e6054o3852a4694A37026a71021e3598q2173B83737
16016i6555e903C8390L06546i1519k0137M6386j847l39641F151b96910A12290
16004h4839k09273r7248B32811B1568a85009J5686A12046B3840i0412j48937C1642
15992a62855A38433J11902d4571A56701N2909B4745J41349M0435R9118K01612
15982E07259j26918j79059p7135l3186L77688A08906j9880J0928B7184d24302
15971B13941f3328j40153R4350q2427Q8526D32044a76117C48008a44211A88229
15960f5802E9862c6591k3884j54562c0052k96287c9722m5224B37123E9201b42904
$$ plain form
15948 -38890 46070 29720 94379 -99126 -74376 -331132 -52015 191592 -74792 -308084 -3821
15936 -17093 -250776 92169 91109 -11262 29029 -29345 78082 -250951 48476 -365886 344 -200228
15923 -398956 25809 123580 -55372 238671 -262144 102066 40586 -211427 273175 113737
15912 -130512 -158121 145365 -154540 -5475 247902 222634 153001 -96102 -55125 -42664 -31674
15901 -31674 -132007 37134 -91913 -243600 -189056 -194452 411037 -39181 -114799 -14850 76788
15889 -436330 179266 -163508 -67317 -156888 8670 75214 -363902 18104 138352 -34597 -42030
15878 -42030 118637 -210776 -222566 -152994 -68419 -88458 -70316 -150621 -75973 5421 -270708
15866 -328521 228968 -246342 -223322 -412367 -104690 65721 305141 -112845 109557 135266
$$ packed form
15948c8890D6070j6350O4659i9126K4750k56756e2015A91592g4792k33292c821
15936a7093k33683I2169j060a1262B9029b9345G8082b50951D8476c65886C44b00228
15923c98956B5809R7771e5372B38671b62144A02066D0586b11427B73175A13737
15912a30512k7609A45365a54540e475B47902k5268o9633i6102M0977J2461J0990
15901c1674j00333C7134i1913j51687N4544n396D11037c9181p5618a4850G6788
15889d36330A79266a63508f7317q9571H670O6544c63902A8104J20248c4597p433
15878d2030A18637b10776j1790O9572f8419k0039J8142q0305P4648E421b70708
15866c28521B28968b46342K3020j89045a04690F5721K39420a12845A09557K5709
$$ plain form
15856 135266 34181 367249 -92147 -13963 53738 438459 -162444 -195760 -42704 -177955 -129672
15845 -129672 -130048 49942 -73815 5768 -348836 -42942 174234 58207 -5820 -63005 -164807 -42643
15832 -48561 95811 528867 235022 -159328 58141 65537 -54228 26415 117163 -70457 -339453
15821 -339453 -163138 3984 -33932 99017 -315990 -200375 -475404 -53078 -41936 -391291 -130432
15809 -50643 222605 -229316 -74188 -119252 -89504 4728 -66004 -2499 -88691 -118005 64081 50969
15797 50969 103579 278651 -52687 -194158 -37782 -49625 50405 -266634 -170153 -209445 171671
15785 -71232 -509296 130243 178978 98146 24339 -217093 -119148 -41273 211429 391068 135448
15773 251809 -103494 76937 195259 -123769 -189293 33744 -23376 -370661 26591 -68959 -169596
$$ packed form
15856A35266C4181L33068i2147a3963E3738L84721a62444l3316d2704j35251M8283
15845a29672l76D9942g3815E768c48836d2942A74234E8207e820n7185j01802d2643
15832d8561I5811M33056B35022a59328E8141P396e4228B6415R0748g0457k68996
15821c39453a63138C984c3932I9017c15990J15615k75029e3078J1142l49355a30432
15809e0643B22605b29316g4188m5064K9748D728f6004b499q6192k9314F4081j3112
15797E0969N2610J75072e2687j41471c7782j1843E0405b66634R6481l9292A71671
15785g1232m38064A30243M8735q0832B4339b17093R7945d1273B11429J79639A35448
15773B51809a03494G6937J18322a23769o5524C3744b3376l47285B6591f8959j00637
$$ plain form
15762 -169596 -13861 -63133 -144146 49779 260874 -17602 -178502 88987 -52839 195538 -514413
15750 -3553 -17336 31842 -101356 132404 424207 41200 7436 347856 194454 56112 58292
15739 58292 -114499 -400098 4985 -112701 -108192 -70849 -415572 79849 -79461 -284705 41510
15727 139102 37975 -210605 -327682 -73800 -67304 -121610 -284504 -319100 173708 -104171 142256
15715 3549 -79323 96879 56610 -53490 230653 211446 -568364 -170861 -68145 59408 -42960
15703 -393359 -17732 -409101 -111458 -35658 134630 179759 223465 -34004 -69053 -431949 27769
15691 67610 62375 240855 -10721 -32007 -152645 -4509 191910 -158827 -3179 -41462 -78549
15680 -78549 102096 -48539 102159 62363 99719 -70578 15600 48777 131853 -98897 -205125
$$ packed form
15762a69596a3861m9272q1013D9779K11095a7602j60900H8987e2839A95538e14413
15750c553j3783C1842a01356A32404K91803D1200G436L40420j53402E6112K180
15739E8292a14499k85599D985a12701M509L7343l44723G9849g9461k05244D1510
15727A39102C7975b10605j17077g3800O496n4306j62894l4596A73708a04171A42256
15715C549g9323I6879m0269e3490B30653j9207e68364a70861f8145E9408d2960
15703c93359a7732l91369a11458c5658A34630M5129M3706c4004l5049l62896B7769
15691F7610n235J78480a0721k1286j20638d509A91910a58827c179l8283l7087
15680g8549A02096d8539A02159l9796L7356g0578A5600L3177Q3076i8897j06228
$$ plain form
15669 -205125 205104 107470 -75138 -68361 -201906 -260339 216905 39233 -158455 -432811 -296652
15658 -296652 -128765 -138698 264282 137595 -130990 -211579 -43447 -53589 169319 -116348
15647 27076 176723 24933 -19499 -307920 215195 593132 -38606 -91383 -234415 -55454 -128938
15636 -128938 -2670 -276600 26996 117593 -265084 10281 60575 145687 319131 53254 154864
15625 154864 30483 341214 94534 -131968 102151 113265 -10015 214742 204255 -95945 299201
15613 -87873 9746 -43915 13471 -72675 -187318 14408 -359411 55962 140828 -159222 -183899
15602 -183899 -142987 -75115 -40971 156036 231309 -318484 154318 -195884 -84196 -273494
15592 -273494 -269590 -145970 15634 -93244 14279 331593 -30468 241658 90970 26513 51806
$$ packed form
15669b05125B05104r7634g5138O777j33545n8433B16905C9233a58455k74356J36159
15658b96652a28765r933B64282j26687a30990q0589d3447j0142A69319a16348
15647B7076J49647B4933a9499k88421B15195L77937c8606n2777j43032e5454p3484
15636a28938b670k73930B6996R0597b65084A0281N0294Q5112J73444E3254J01610
15625A54864C0483L10731I4534a31968A02151J1114a0015B14742j0487i5945B99201
15613h7873I746d3915A3471g2675j14643A4408c59411E5962Q4866a59222k4677
15602a83899M0912O7872L4144A56036P5273c18484A54318a95884h4196j89298
15592b73494L904J23620A5634i3244A4279L17314c0468B41658I0970B6513K5293
$$ plain form
15581 51806 176211 -146069 -27532 -104088 -208404 -180036 161514 -18876 -106062 53537 -305890
15569 152286 -65342 -176865 279824 -76981 -16328 207405 -104981 -212342 110796 140246
15559 140246 151549 -140324 -147073 -248088 158373 262373 59788 -218603 -85377 148041
15548 323260 -40960 472092 -88265 151485 145220 -214600 86188 160404 -216798 -161174 211709
15536 380863 -199555 -196380 -72317 19243 -228788 48252 348097 -236434 -173780 -255431 -13157
15524 -209326 -7853 1380 -246888 127317 -466894 107529 260790 39675 101954 -69134 -5417
15512 192656 -117337 223781 8862 168575 -100491 -120898 -32475 -21597 5828 -9185 -98567
15501 -98567 79824 -359217 18858 51960 -85536 -330839 153477 -38386 50188 -177955 433472
$$ packed form
15581E1806J24405a46069b7532p6556j04316K8368A61514a8876q7186E3537c05890
15569A52286f5342j11523B79824g6981a6328B07405a04981j07361A10796K9450
15559A40246J1303a40324o749j01015A58373J04000E9788b18603h5377A48041
15548C23260d0960D72092h8265A51485o265b14600H6188P4216b16798N5624B11709
15536C80863a99555L175g2317A9243b28788D8252K99845b36434O2654q1651a3157
15524b09326g853A380b46888A27317d66894A07529J53261C9675O2279f9134e417
15512A92656a17337B23781H862J59713a00491k0407c2475J0878E828i185q9382
15501i8567G9824c59217A8858L3102h5536k45303A53477c8386E0188a77955D33472
$$ plain form
15489 85754 230237 -194268 34609 60635 -4558 11813 1728 -321062 286589 -46128 -162971
15478 -162971 307497 33428 -3234 -151693 -221050 -117840 -84766 -195131 -215538 -143955 -61846
15466 -226149 167700 -206809 85450 -40336 -53493 31783 59296 -246508 -189862 431630 -61027
15454 -74336 -32806 31768 161228 -184723 -72813 176399 -192838 -9431 -104637 -151157 -67856
15442 284639 -211193 73496 -119857 61628 414834 32992 -6750 -428579 141769 28919 310862
15431 310862 108103 -437226 -345821 -231213 11271 -286806 313186 -101357 -202418 33208
15420 67808 -173377 79466 -70593 85677 24312 52596 -135602 -141785 37282 87209 126712
15409 126712 16319 -4713 270976 -180939 -192268 25324 40867 -122869 94301 -275710 -117769
$$ packed form
15489H5754J44483a94268C4609K6026d558A1813A728c21062B86589d6128j16843
15478a62971C07497C3428c234j48459o9357J03210L3074j10365k0407P1583f1846
15466b26149A67700b06809H5450d0336j3157C1783K7513b46508N6646D31630f1027
15454g4336c2806C1768J29460a84723g2813A76399a92838i431r5206m6520f7856
15442B84639b11193G3496a19857F1628L53206C2992f750m21829A41769B8919K81943
15431C10862A08103d37226R1405J14608A1271b86806C13186a01357j01061C3208
15420F7808a73377G9466g0593H5677B4312K8284a35602o183C7282M9927L9503
15409A26712A6319d713B70976a80939j1329B5324J5543a22869I4301b75710a17769
$$ plain form
15397 -96132 -15405 19398 291320 -95111 -193256 -61676 -197584 -272523 -86482 386120 177638
15385 77474 -153326 105398 -197448 -192819 123070 -187919 75240 14211 -7081 185935 202080
15374 202080 38585 -87459 110690 -186178 41896 -83778 -348886 56488 157247 -109698
15363 -248825 -65175 196922 10235 12011 228164 -206157 126369 78068 35512 -24940 -52834
15352 -52834 -363293 58246 269993 132426 109504 5956 18646 121099 23358 28812 -213247
15340 -216431 -83351 219348 178755 -58631 -138117 192144 182271 -160333 73066 234337 -59996
15328 -189565 113695 58233 235025 172777 277755 350227 332300 433745 -71772 -247187
15318 -247187 -8125 40026 211684 -179518 160301 44891 -6460 186431 152674 168212 -238394
$$ packed form
15397i6132a5405A9398K71922i5111r8145f1676j35908p4939h6482C86120A77638
15385G7474a53326A05398a97448M629A23070a87919G5240A4211g081A85935J6145
15374B02080C8585h7459A10690a86178D1896h3778k65108E6488J00759a09698
15363b48825f5175A96922A0235J776K16153b06157A26369m8301C5512b4940k7894
15352e2834l10459E8246K11747A32426k2922E956J2690J02453B3358N454b13247
15340b16431h3351B19348m0593e8631p9486A92144r873a60333G3066J61271e9996
15328a89565A13695n5462J76792o2248J04978P2472j7927J01445g1772j75415
15318b47187h125D0026J71658a79518A60301D4891f460A86431l3757J5538b38394
$$ plain form
15306 -16975 280775 94174 -222601 41468 29981 327128 142346 -206829 271518 119376
15295 -128317 212543 -89199 101962 50591 40740 36353 -122302 -178038 -34287 238769 -124262
15283 216528 -21803 -121170 -281206 -43151 125368 75565 228376 -81086 -157210 159684 27552
15271 -81803 295253 157387 272957 -70734 -198396 -188026 76865 291200 181397 -269824
15260 -159135 130757 -45555 -52731 182964 392153 -25650 -23045 133418 -149370 327108 542359
15249 542359 732215 1926156 900313 1109799 1027877 364241 381557 349835 173699 -37150
15238 -33200 95735 -143324 241717 292051 15014 -38303 46903 -56358 -428195 -326494 86321
15226 438830 112483 111199 -78990 -186856 -65455 362654 -197766 181757 -27605 -40780 -114700
$$ packed form
15306a6975B80775I4174b22601D1468j1487K97147A42346b06829B71518A19376
15295a28317B12543h9199A01962E0591r851m387a22302n5736c4287B38769a24262
15283B16528b1803r9367j60036d3151A25368m9803J52811h1086p6124A59684B7552
15271h1803B95253j37866J15570g0734j27662J0370G6865K14335j09803b69824
15260a59135A30757d5555p176A82964K09189b5650K605A33418a49370C27108K15251
15249E42359J89856J193941I00313K09486q1922C64241J7316l1722A73699c7150
15238c3200I5735a43324B41717N0334A5014c8303D6903e6358l71837J01701H6321
15226D38830A12483j284g8990j07866f5455C62654a97766A81757b7605j3175p3920
$$ plain form
15215 -114700 61468 -103783 -26511 139823 252519 -133891 19171 34781 445465 -103905
15204 -146874 -350935 173328 161145 400352 236428 -162639 162372 154968 -231939 207984
15193 -23248 -83615 -190311 -209496 -391495 -104629 -149771 253234 179280 110962 -995 222158
15181 -58036 -21062 138831 -31326 280597 -226534 367189 301734 205101 -121530 222713
15170 256304 23636 94555 373072 72125 -58414 164160 -21752 363756 -60672 263219 146932
15159 146932 -30727 -74920 10803 3993 113397 -399971 -74708 -160305 52248 -11070 183739
15147 -93252 202953 329091 175124 275261 265114 295036 208813 55834 62774 85283 -56629
15135 310999 78891 271000 340897 440679 -29733 104954 132954 306785 -96863 251263 94435
$$ packed form
15215a14700F1468a03783b6511A39823J12696a33891A9171J5610M10684a03905
15204a46874k04061A73328j2183K39207j63924a62639A62372p404b31939B07984
15193b3248o0367j06696j9185j81999a04629m5142B53234p3954o8318i95B22158
15181e8036b1062A38831c1326B80597b26534C67189o5455r6633a21530B22713
15170B56304B3636P0919K78517G2125e8414A64160b1752C63756f0672B63219j16287
15159A46932c0727m4193A0803C993J09404c99971g4708q5597E2248a1070A83739
15147i3252B02953J26138j53967J00137j0147K9922q6223E5834O940K2509e6629
15135C10999G8891J92109O9897R9782b9733A04954K8000J73831i6863B51263I4435
$$ plain form
15123 220070 -252406 -8514 61771 377071 15652 10177 134627 164394 -83755 -78758 150819
15111 168037 -70914 -73965 233184 131558 55383 -18999 -82252 232183 10073 206591 221686
15100 221686 -117170 406110 -128172 291123 122823 236894 238373 151600 89401 -147382
15089 158351 85558 117474 80391 538076 -128733 183842 -86007 -176040 91382 336638 -52556
15077 321302 21743 101582 -150802 246814 147092 58552 108543 90989 448880 -64383 360236
15065 35209 -193747 52636 308245 79808 -217675 185231 163681 190253 86609 99194 -73652
15053 61062 387635 -839 155654 282148 231399 107437 285811 269277 152850 -32871 674476
15041 -169105 -78913 393104 414062 79697 -110948 173108 133556 -9835 95368 -57371 160550
$$ packed form
15123B20070b52406h514F1771L15300A5652n475J24450K9767h3755M997A50819
15111A68037g0914l051B33184j01626E5383a8999o3253B32183A0073J96518J5095
15100B21686a17170D06110a28172B91123A22823J14071J479q6773o2199a47382
15089A58351p2793L1916l7083M57685a28733A83842h6007r0033I1382K45256e2556
15077C21302B1743P9839a50802B46814r9722E8552M9991j7554L57891f4383C60236
15065C5209a93747E2636K55609G9808b17675A85231k1550K6572H6609J2585g3652
15053F1062L26573h39A55654J26494n0749A07437J78374j6534j16427c2871F74476
15041a69105g8913C93104K0958G9697a10948A73108l9552i835I5368e7371A60550
$$ plain form
15029 479741 218240 166632 433512 67910 285171 74175 146509 325111 247453 455354
15019 455354 134247 116749 69926 46627 189786 406282 14533 292817 513589 297522
15009 297522 120416 225791 3127 -121161 186755 206798 224903 348727 72044 760458
14999 760458 337320 30323 -22334 107257 353034 66845 480425 289205 96513 157701
14989 157701 154152 209970 295572 165557 23634 280682 221210 394347 258519 319585 253509
14978 253509 84908 208611 292823 243204 165264 295578 157944 66394 117668 327172 475659
14967 475659 -37425 47927 110336 300880 109597 107548 426065 315772 -14507 168058 201724
14956 201724 324930 356606 134525 612667 413799 392658 93884 451986 382581 328688
$$ packed form
15029D79741B18240n1608K66880F7910K17261G4175P2334J78602p7658K07901
15019D55354A34247j7498m6823k3299J43159K16496A4533K78284K20772k16067
15009B97522A20416J05375C127a21161A86755K0043J8105J23824G2044O88414
14999G60458C37320C0323b2334A07257K45777F6845M13580j91220I6513O1188
14989A57701l549N5818Q5602j30015B3634K57048n9472J73137j35828O1066o6076
14978B53509H4908J23703Q4212m9619p7940J30314j37634F6394N1274K09504J48487
14967D75659c7425D7927O2409J90544A09597k049L18517j10293a4507A68058L3666
14956B01724J23206L1676A34525M78142j98868k1141I3884L58102o9405n3893
$$ plain form
14946 328688 255317 -66996 606826 287366 430 773316 480141 319166 167830 109106 206462
14935 206462 139221 321158 185944 11254 -13244 576989 305059 188716 214314 564724
14925 564724 402114 273020 234655 492330 475485 282972 480781 243678 25996 8659
14914 288128 198752 253891 -78586 434419 611880 405560 265017 209941 444845 452253 663857
14903 663857 298351 521231 192807 584527 -105186 129828 -16042 -61540 559199 -105995
14892 387656 504248 228764 651160 145188 113481 603450 369071 419897 88072 294863
14882 294863 676399 423577 258558 298695 327028 189612 731613 345770 216773 142562
14872 142562 587105 514425 488745 280064 193884 759047 486080 242411 555 487242 615927
$$ packed form
14946C28688p3371f6996F06826B87366D30P72886k93175j60975j51336n8724R7356
14935B06462o7241J81937j35214A1254a3244E76989k71930j16343K5598L50410
14925E64724j62610j29094l8365K57675j6845j92513J97809k37103B5996H659
14914B88128q9376N5139g8586D34419J77461k06320j40543n5076K34904P408K11604
14903F63857B98351K22880A92807L91720a05186A29828a6042m5498E59199a05995
14892C87656J16592B28764M22396A45188l1707M89969k34379N0826H8072K06791
14882B94863L81536k52822j65019M0137K8333j37416N42001C45770j28997p4211
14872A42562M44543p2680k5680k08681q6180N65163k72967B42411E55M86687J28685
$$ plain form
14861 615927 301692 676959 358745 672967 66719 437950 320984 717346 310106 328064
14851 328064 433865 324226 574772 548077 526150 367832 347604 -47836 155065 518978
14841 518978 497224 413275 214971 345016 512571 692215 538274 314055 663181 565252
14831 565252 601489 376732 756833 178225 393681 610444 276169 294055 489044 280523
14821 280523 380226 427158 531150 383300 623997 334077 723810 635147 21022 724857
14811 724857 420441 510436 499574 798555 537119 530228 668098 445419 658846 281504
14800 517192 313314 680181 745247 507806 484993 410145 509904 554219 770739 581939
14790 581939 266759 686538 502362 685988 665280 586923 833362 834253 419308 364761 804437
$$ packed form
14861F15927C01692L75267l18214L14222F6719L71231j16966L96362C10106J7958
14851C28064J05801j09639K50546k6695k1927j58318k0228d7836A55065L63913
14841E18978k1754q3949j98304J30045J67555J79644j53941k24219L49126r7929
14831E65252L6237k24757L80101A78225K15456K16763B76169J7886J94989k08521
14821B80523R9703M6932J03992j47850K40697k89920L89733q8663B1022P03835
14811G24857l04416Q9995j0862K98981k61436o891J37870k22679K13427B81504
14800E17192k03878L66867O5066k37441k2813p4848R9759M4315K16520j88800
14790E81939B66759M19779j84176J83626k0708p8357K46439Q91m14945n4547M39676
$$ plain form
14779 804437 738808 826707 836554 707194 580528 645405 565687 691799 669456 493172 423456
14768 423456 1002678 728982 438234 605855 569982 908365 558832 998083 548223 841204
14758 841204 764439 711681 400621 427782 854613 805695 892068 767402 538036 344597
14748 344597 804639 484749 596408 875533 612928 701404 624305 576389 665555 827364
14738 827364 602596 587097 527755 709690 447908 782947 1188362 695927 803885 493517
14728 493517 807025 832145 479714 777933 676742 733269 958743 675892 1097504 994470
14718 994470 722022 727970 1280982 976620 626382 672892 866880 828238 1043432 876315
14708 876315 351923 1144984 1083263 969320 779178 1095687 1074942 856469 630407 1020519
$$ packed form
14779H04437o5629Q7899R847j29360j26666O4877p9718J26112k2343j76284o9716
14768D23456N79222k73696k90748J67621l5873L38383l49533M39251m49860K92981
14758H41204p6765n2758l11060K7161M26831m8918Q6373j24666k29366j93439
14748C44597M60042l19890J11659K79125k62605Q8476p7099m7916Q9166J61809
14738H27364k24768j5499n9342J81935k61782L35039M05415m92435J07958l10368
14728D93517L13508K5120l52431K98219j01191N6527K25474k82851M21612j03034
14718I94470k72448N948N53012l04362l50238M6510J93988l8642K15194j67117
14708H76315C51923P93061o1721j13943j90142L16509k0745k18473k26062L90112
$$ plain form
14698 1020519 897965 770609 943661 729588 798763 1059155 890411 1188279 996951 834807
14688 834807 1032535 889206 1438127 773361 1137362 1024220 1094028 848759 1124755 1379852
14678 1379852 539426 1105011 1416018 1105000 971279 1033416 1034433 982582 1163812 794162
14668 794162 1057607 1088377 1051456 1135242 975338 1070579 870906 942995 649192 1215789
14658 1215789 1257702 1152912 1104163 1151968 1099838 1346578 989923 1217921 1183254 1068837
14648 1068837 1209468 1177564 1160834 1523767 1331389 987681 1059423 1500036 1295341 1351141
14638 1351141 1313826 1322651 1503173 1220231 1345779 1329340 1577408 1511836 1183514 1424739
14628 1424739 1399773 1661170 1319249 1634354 1155859 1547092 1454129 1583336 1576016 1815319
$$ packed form
14698A020519j22554j27356J73052k14073O9175K60392j68744K97868j91328j62144
14688H34807J97728j43329N48921o64766L64001j13142O9808k45269K75996K55097
14678A379852E39426N65585L11007l11018j33721O2137J017n1851J81230l69650
14668G94162K63445L0770l6921Q3786j59904R5241j99673P2089k93803N66597
14658A215789M1913j04790m8749M7805n2130K46740l56655K27998l4667j14417
14648A068837J40631l1904j6730L62933j92378l43708P1742M40613k04695N5800
14638A351141l7315Q825J80522k82942J25548j6439K48068o5572l28322K41225
14628A424739k4966K61397l41921L15105m78495L91233r2963J29207p320K39303
$$ plain form
14618 1815319 1458459 1322921 1499301 1454253 1429594 1275570 1554285 1784701 1855923 1569247
14608 1569247 1572152 1349717 1496806 1869182 1684090 1833433 1470264 1882357 1797115 1972832
14598 1972832 1921101 1678327 1981420 2121014 1831834 2077355 2043141 1978260 1896538 2144518
14588 2144518 1559847 1919752 2102365 2125714 2286587 1796884 1885451 2189597 2006967 2079650
14578 2079650 2382059 2252050 2285626 2224391 2327775 2472680 2540031 2135702 2177680 2385537
14568 2385537 2428772 2505596 2882123 2835346 2758134 2792592 2358889 3227284 3136015 3081754 3217381
14557 3217381 3282954 3441374 3606657 3961043 4570254 4871883 5410147 6606838 8396119
14548 8396119 12561245 21561837 40680804 45432965 21317396 8912126 4854495 3125780
$$ packed form
14618A815319l56860j35538J76380m5048k4659j54024K78715K30416P1222k86676
14608A569247K905k22435J47089L72376j85092J49343l63169M12093q5242J75717
14598A972832n1731k42774L03093J39594k89180K45521l4214o4881q1722K47980
14588B144518n84671L59905J82613K3349J60873m89703Q8567L04146j82630P2683
14578B079650L02409j30009L3576o1235J03384J44905O7351m04329M1978K07857
14568B385537M3235P6824L76527m6777p7212L4458m33703Q68395r1269n4261J35627
14557C217381O5573J58420J65283L54386O09211L01629N38264J196691J789281
14548H396119M165126R000592J9118967M752161B1317396H912126m057631j728715
$$ plain form
14540 3125780 2428532 2367143 2026785 2188346 2328932 1914377 2358138 2504998 2447397 2438138
14530 2438138 2481461 2247864 2739424 2642796 2714599 2532116 2398211 2471623 2627493 2481579
14520 2481579 2710829 2608410 2730967 2690122 2991098 2694384 2832872 2918166 2854557 2922990
14510 2922990 2780394 2807539 3008634 3056755 3130450 3286833 3220946 3271296 2996810 3463071
14500 3463071 3357757 3169406 3163393 3319075 3528408 3488439 3611509 3743940 3842782 3803499
14490 3803499 3721522 3986119 3931056 3897025 4140156 4105672 3997542 4035893 4025460 3997171 4091401
14479 4091401 4063588 4282736 4447395 4145353 4331563 4408306 4703716 4396292 4085293 4465279
14469 4465279 4581962 4717379 4837486 5040946 4832957 5239342 5100016 5032248 5151039 5015284
$$ packed form
14540C125780o97248o1389l40358J61561J40586m14555M43761J46860n7601r259
14530B438138M3323k33597M91560r6628P1803j82483j33905P3412J55870j45914
14520B481579K29250j02419J22557m0845L00976k96714J38488Q5294o3609O8433
14510B922990j42596K7145K01095M8121P3695J56383o5887N0350k74486M66261
14500C463071j05314j88351o013J55682K09333l9969J23070J32431R8842l9283
14490C803499q1977K64597n5063l4031K43131l4484j08130L8351j0433k8289R4230
14479D091401k7813K19148J64659l02042J86210P6743K95410l07424l10999L79986
14469D465279J16683J35417J20107K03460k07989M06385j39326o7768J18791j35755
$$ plain form
14459 5015284 5135091 5710458 5502959 5679367 5567377 5902852 5922761 5693974 5717082 5849633
14449 5849633 6066688 5934850 6117891 6163646 6006457 6493716 6404320 6727473 6440179 6663891
14439 6663891 6876651 7019503 7153102 6771911 6847868 7198308 7124016 7582402 7667353 7747422
14429 7747422 7693648 7436781 7984791 8258849 7918924 8193354 8157016 8378619 8632314 8507748
14419 8507748 8925719 9165741 9209670 9341111 9488872 9566221 9654268 10018200 10054192 9791970
14409 9791970 10224225 10365435 10505399 10836665 10997319 11005656 11167736 11404746 11290812 11409260
14399 11409260 11959646 12264717 12290529 12636127 12758491 12966268 12893534 13525291 13310946 13675805
14389 13675805 13988462 14285076 14432130 14807788 15316310 15323632 15349100 15858142 15889884 16673292
$$ packed form
14459E015284J19807N75367k07499J76408j11990L35475J9909k28787K3108J32551
14449E849633K17055j31838J83041M5755j57189M87259q9396L23153k87294K23712
14439F663891K12760J42852J33599l81191P5957L50440p4292M58386Q4951Q0069
14429G747422n3774k56867N48010K74058l39925K74430l6338K21603K53695j24566
14419H507748M17971K40022M3929J31441J47761P7349Q8047L63932L5992k62222
14409I791970M32255J41210J39964L31266J60654Q337J62080K37010j13934J18448
14399A1409260N50386L05071K5812L45598J22364K07777p2734O31757k14345L64859
14389A3675805L12657K96614J47054L75658N08522P322K5468N09042L1742P83408
$$ plain form
14379 16673292 16682917 17186011 17244371 17396377 18064459 18265832 18580277 19282368 19227910 19792829
14369 19792829 20511966 20543856 21301765 21474703 22048763 22673073 23020518 23561611 23917582
14360 23917582 24402960 25169482 25952855 26190270 26716274 27142955 27909722 28759141 29413480
14351 29413480 30261751 30998641 31865665 32527524 33419885 34294647 35156764 35711868 36757709
14342 36757709 37750865 38713825 40037718 41009129 41849469 43358718 44624804 45953824 47067049
14333 47067049 48449271 49700472 51455816 53241048 55002780 56800471 58447987 60298101
14325 60298101 62197261 64137568 66712699 68883474 71190072 73518690 76112255 78877778
14317 78877778 82230129 85167137 88198493 91861441 95301360 98993892 102905657 107184363
$$ packed form
14379A6673292R625N03094N8360J52006O68082K01373L14445P02091n4458N64919
14369A9792829P19137L1890P57909J72938N74060O24310L47445N41093L55971
14360B3917582M85378P66522P83373K37415N26004M26681P66767Q49419O54339
14351B9413480Q48271P36890Q67024O61859Q92361Q74762Q62117N55104J045841
14342C6757709R93156R62960J323893R71411Q40340J509249J266086J329020J113225
14333D7067049J382222J251201J755344J785232J761732J797691J647516J850114
14325F0298101J899160J940307K575131K170775K306598K328618K593565K765523
14317G8877778L352351K937008L031356L662948L439919L692532L911765M278706
$$ plain form
14309 107184363 111340410 116358174 121208151 126429739 132042188 137897590 143694879 150038366
14301 150038366 156769967 163846047 171334613 179576729 188012288 196580771 206130968 215874544
14293 215874544 226032975 236992422 248679655 260834859 272873621 285984559 299410257
14286 299410257 313278774 327368497 341740270 356594940 371146106 385760928 400140465
14279 400140465 413965779 426709178 438936323 449636338 458804519 466402767 471665520
14272 471665520 473271788 472173435 469924637 467511669 462728876 456938633 447934503 437179781
14264 437179781 424789700 411064676 396524267 381143246 365353911 349700539 333746415
14257 333746415 318203384 303122125 289529432 275695063 262139607 249176062 236720585
$$ packed form
14309A07184363M156047N017764M849977N221588N612449N855402N797289O343487
14301A50038366O731601P076080P488566Q242116Q435559Q568483R550197R743576
14293B15874544J0158431J0959447J1687233J2155204J2038762J3110938J3425698
14286B99410257J3868517J4089723J4371773J4854670J4551166J4614822J4379537
14279D00140465J3825314J2743399J2227145J0700015R168181P598248N262753
14272D71665520J606268j098353k248798k412968m782793n790243r004130j0754722
14264D37179781j2390081j3725024j4540409j5381021j5789335j5653372j5954124
14257C33746415j5543031j5081259j3592693j3834369j3555456j2963545j2455477
$$ plain form
14250 236720585 225084664 214587599 203748443 193963775 184593460 176182300 167980206
14243 167980206 160020081 152627703 145758108 139273179 133132941 127678911 122537482 117035623
14235 117035623 111540786 107307221 103023750 98653820 95486234 91313529 88136468 84744749
14227 84744749 81296367 78368123 75870758 72870738 70102500 67641258 65715066 63675310
14219 63675310 61281459 59402123 56828985 55301758 53832335 52356502 51012046 49473544
14211 49473544 47632003 46553411 44847472 43948187 43302160 41689783 40603154 39375443
14203 39375443 37889968 37176527 36513906 35576637 34668586 33617729 32824614 31937686 30811613
14194 30811613 30787640 29682749 28734379 28258597 27419620 26653773 26094338 25492590 25267133
$$ packed form
14250B36720585j1635921j0497065j0839156r784668r370315q411160q202094
14243A67980206p960125p392378o869595o484929o140238n454030n141429n501859
14235A17035623n494837m233565m283471m369930l167586m172705l177061l391719
14227H4744749l448382k928244k497365l000020k768238k461242j926192k039756
14219F3675310k393851j879336k573138j527227j469423j475833j344456j538502
14211D9473544j841541j078592j705939q99285o46027j612377j086629j227711
14203C9375443j485475p13441o62621r37269r08051j050857p93115q86928j126073
14194C0811613k3973j104891r48370m75782q38977p65847n59435o01748k25457
$$ plain form
14185 25267133 24934887 23941815 23573619 23064821 22696433 22144081 21422835 21298863 20687654
14176 20687654 20065055 19756997 19319456 18790010 18468678 18140892 17891943 17338601 17221113
14167 17221113 17021398 16548724 16367253 15911131 15709525 15462487 15333133 14722100 14816366
14158 14816366 14353367 14263446 14090511 13552608 13349120 13130634 12932394 12487706 12683096
14149 12683096 12616702 12318496 12034342 11696717 11864737 11467827 11468162 11195903 11173510 10828368
14139 10828368 10651106 10331813 10595590 10109659 10370928 9958625 9394112 9399082 9710919 9439666
14129 9439666 9324195 9037149 9211971 8925518 8464652 8636380 8718725 8439849 8413882 8023174
14119 8023174 7835640 8142640 8128995 7871093 7471514 7909050 7596544 7408075 6955743 7521836
$$ packed form
14185B5267133l32246r93072l68196n08798l68388n52352p21246j23972o11209
14176B0687654o22599l08058m37541n29446l21332l27786k48949n53342j17488
14167A7221113j99715m72674j81471m56122k01606k47038j29354o11033R4266
14158A4816366m62999q9921j72935n37903k03488k18486j98240m44688J95390
14149A2683096o6394k98206k84154l37625J68020l96910L35k72259k2393l45142
14139A0828368j77262l19293K63777m85931K61269m12303n64513M970L11837k71253
14129I439666j15471k87046J74822k86453m60866J71728Q2345k78876k5967l90708
14119H023174j87534L07000j3645k57902l99579M37536l12506j88469m52332N66093
$$ plain form
14109 7521836 7126146 7012865 7054839 6794379 6800160 6731626 6348865 6490395 6301916 6508308
14099 6508308 6326518 6343589 6117876 6165041 5826150 5692267 5870923 5879241 5733670 5532397
14089 5532397 5449488 5455322 5537960 5438524 5404580 5315194 5173866 5355601 4822443 5106423 4969986
14078 4969986 4929340 4882447 4727138 4725684 4777101 5024568 4697938 4519033 4598307 4752981
14068 4752981 4463641 4523781 4415644 4324517 4505441 4223460 4395458 4413163 4541266 4245314
14058 4245314 4505356 4036730 4144899 4112026 4225675 3807610 4255953 3631662 4025777 3970938
14048 3970938 4031181 3520921 3611408 3425777 3488497 3402300 3473905 3169592 3587256 3592644 3465649
14037 3465649 3745348 3271709 3331198 3101570 3665557 2975971 3156583 3357069 2940910 3133353
$$ packed form
14109G521836l95690j13281M1974k60460N781o8534l82761J41530j88479K06392
14099F508308j81790J7071k25713M7165l38891j33883J78656Q318j45571k01273
14089E532397q2909N834Q2638r9436l3944q9386j41328J81735n33158K83980j36437
14078D969986m0646m6893j55309j454N1417K47467l26630j78905P9274J54674
14068D752981k89340O0140j08137r1127J80924k81981J71998J7705J28103k95952
14058D245314K60042m68626J08169l2873J13649m18065M48343o24291L94115n4839
14048C970938O0243n10260R0487j85631O2720q6197P1605l04313M17664N388j26995
14037C465649K79699m73639N9489k29628N63987o89586J80612K00486m16159J92443
$$ plain form
14027 3133353 2795327 2868376 2999174 2940732 3138679 2766684 3049004 2926766 2741306 2915566
14017 2915566 3449865 2894238 2294024 2820345 2520763 2741450 2327641 2711905 2389980
14008 2389980 2193241 2745156 2560865 2585948 2534769 2306754 2444560 2170928 2464797 2481605
13998 2481605 2537564 2445716 2416204 2373770 2356381 2618859 2434554 2719818 3133124 3909922
13988 3909922 7182782 14690092 33420176 45084032 25478380 12866823 8353346 5935826
13980 5935826 4900407 4135053 3968843 3383478 3666925 3443928 2956319 3011982 2734033
13971 2734033 3075956 2753828 2554020 2267022 2718251 2248887 2362630 2374904 2641111 2297796
13961 2297796 2361407 2264891 2113613 2302456 2115321 1781805 2283551 2184413 2139644 1994357
$$ packed form
14027C133353l38026P3049J30798n8442J97947l71995K82320j22238j85460J74260
14017B915566N34299n55627o00214N26321k99582K20687m13809L84264l21925
14008B389980j96739N51915j84291K5083n1179k28015J37806k73632K93869J6808
13998B481605N5959r1848k9512m2434j7389K62478j84305K85264M13306P76798
13988C909922L272860P507310J8730084J1663856j9605652j2611557m513477k417520
13980E935826j035419p65354j66210n85365K83447k22997m87609N5663k77949
13971B734033L41923l22128j99808k86998M51229m69364J13743J2274K66207l43315
13961B297796O3611r6516j51278J88843j87135l33516N01746r9138m4769j45287
$$ plain form
13951 1994357 1711867 2095785 2133178 2183615 2268121 2089061 2127840 2151345 2094803 1956966
13941 1956966 1718490 2050060 2033299 1660319 2130312 1896959 1683035 1829282 1716404 1629479
13931 1629479 2065956 1745604 1644697 1904892 1609213 1710542 1589196 1672519 1754238 1842005
13921 1842005 1708423 1531177 1296494 1543482 1542182 1654561 1457271 1554977 1651621 1536795
13911 1536795 1456746 1814747 1340343 1580483 1446242 1662178 1805944 1739122 1710165 1212755
13901 1212755 1492410 1385445 1361132 1053633 1457828 1423910 1416815 1112524 1266295 1222502
13891 1222502 1367838 1170720 1051979 1319050 1443470 1226364 1296549 1421637 810179 1485002
13881 1485002 1566236 1561981 1452810 1202741 1165014 1243139 1253813 1335668 1108593 920147 1154024
$$ packed form
13951A994357k82490L83918L7393N0437Q4506j79060L8779K3505n6542j37837
13941A956966k38476L31570j6761l72980M69993k33353k13924J46247j12878q6925
13931A629479M36477l20352j00907K60195k95679J01329j21346Q3323Q1719Q7767
13921A842005j33582j77246k34683K46988j300J12379j97290R7706R6644j14826
13911A536795q0049L58001m74404K40140j34241K15936J43766o6822k8957m97410
13901A212755K79655j06965k4313l07499M04195l3918p095l04291J53771m3793
13891A222502J45336j97118j18741K67071J24420k17106P0185J25088o11458O74823
13881A485002Q1234m255j09171k50069l7727P8125J0674Q1855k27075j88446K33877
$$ plain form
13870 1154024 1042944 1287969 1218131 1157827 1231605 1095016 1266282 1025189 1228219 905202
13860 905202 1062855 846124 928430 822502 1290328 1217806 1093867 1028775 1157265 1338171
13850 1338171 1139415 904215 876677 775454 1002667 905183 1126039 1094711 1153018 1057193
13840 1057193 816588 1057790 1322963 1037168 1092488 1463328 956516 760441 843494 1278159
13830 1278159 1157638 1054600 961351 1201463 1092087 918400 1152618 1159751 991634 929742
13820 929742 793247 730498 1004965 1207931 981462 828131 666645 1089746 751739 948843
13810 948843 982668 708202 975905 1261134 756500 1166683 1036926 876078 562238 811887
13800 811887 888778 1160804 988042 745347 504659 957184 733378 945211 829819 640908
$$ packed form
13870A154024j11080K45025o9838o0304P3778j36589J71266k41093K03030l23017
13860I05202J57653k16731Q2306j05928M67826p2522j23939o5092J28490J80906
13850A338171j98756k35200k7538j01223K27213r7484K20856l1328N8307r5825
13840A057193k40605K41202K65173k85795N5320L70840n06812j96075Q3053M34665
13830A278159j20521j03038r3249K40112j09376j73687K34218P133j68117o1892
13820I29742j36495o2749K74467K02966k26469j53331j61486M23101l38007J97104
13810I48843L3825k74466K67703K85229n04634M10183j29757j60848l13840K49649
13800H11887P6891K72026j72762k42695k40688M52525k23806K11833j15392j88911
$$ plain form
13790 640908 723895 791864 489774 746472 865778 1091284 819252 885215 922097 768522
13780 768522 784654 609339 553174 924684 846465 841326 1333820 607260 897596 564825
13770 564825 980213 662944 642635 709117 623321 720913 694401 963437 625821 759743
13760 759743 551669 710841 968083 734212 680750 596014 365744 690048 642129 1018636
13750 1018636 924395 498660 665631 794889 727467 787295 1048111 734250 741203 494596
13740 494596 741465 616464 774591 668947 596744 595615 532491 782461 816037 739627 621467
13729 621467 626109 309275 636684 619518 812477 603662 338605 704164 662094 573689
13719 573689 713515 600531 608781 423523 394436 660730 693362 605252 699435 582233 821622
$$ packed form
13790F40908Q2987O7969l02090K56698J19306K25506k72032O5963L6882j53575
13780G68522J6132j75315n6165L71510p8219n139M92494F07260K90336l32771
13770E64825M15388l17269k0309O6482q5796R7592k6512K69036l37616J33922
13760G59743k08074J59172K57242k33871n3462q4736k30270L24304m7919L76507
13750A018636r4241m25735J66971J29258o7422N9828K60816l13861O953k46607
13740D94596K46869j25001J58127j05644p2203j129o3124K49970L3576p6410j18160
13729F21467M642C09275L27409j7166J92959k08815k65057L65559m2070q8405
13719E73689J39826j12984Q250j85258k9087K66294L2632q8110R4183j17202K39389
$$ plain form
13708 821622 366424 623175 669559 676458 547899 190854 400044 500801 417908 480466
13698 480466 705674 500334 283814 399648 496468 450854 518840 625381 452653 309455
13688 309455 252303 275983 350124 548088 678028 479944 787321 906969 840637 424703
13678 424703 468393 616790 459107 374399 372187 592813 460301 762193 358699 702024
13668 702024 642630 429642 416756 684528 516966 326220 566287 634982 36411 518955
13658 518955 475172 384222 427720 40672 266626 605661 449062 491860 266147 913940
13648 913940 329782 532160 460602 630354 348902 488768 579839 611310 380344 448996
13638 448996 350946 240935 341662 354063 411002 393957 623226 462385 711577 540581
$$ packed form
13708H21622C66424K56751M6384O899j28559A90854K09190J00757q2893O2558
13698D80466K25208k05340k16520J15834R6820m5614O7986J06541j72728j43198
13688C09455n7152K3680P4141J97964J29940j98084L07377J19648o6332m15934
13678D24703M3690J48397j57683q4708k212K20626j32512L01892C58699L43325
13668G02024n9394k12988j2886K67772j67562j90746K40067O8695C6411M82544
13658E18955m3783r0950M3498D0672K25954L39035j56599M2798k25713O47793
13648I13940C29782K02378p1558J69752k81452J39866R1071L1471k30966O8652
13638D48996r8050j10011J00727J2401N6939j7045K29269j60841K49192j70996
$$ plain form
13628 540581 384948 344580 427856 217841 222445 573922 277862 541585 240827 571419
13618 571419 40346 705908 354077 753522 487497 532304 380278 509278 394682 358313
13608 358313 554902 448709 523821 571113 468945 216625 377163 478238 151071 600419
13598 600419 372733 405215 241414 429767 499980 434696 429760 431168 652491 387813 197774
13587 197774 369449 435708 655404 198087 315294 206431 301852 94879 134906 673189
13577 673189 277811 118694 299755 378760 425508 380717 754683 183063 272131 372233
13567 372233 494244 172943 348403 418816 27085 226568 544834 244128 313995 336288
13557 336288 442292 58876 653604 188315 160310 384036 153358 308700 188472 123852
$$ packed form
13628E40581j55633m0368Q3276k10015M604L51477B77862K63723B40827L30592
13618E71419D0346O65562l51831L99445k66025M4807j52026J29000j14596l6369
13608C58313J96589j06193P5112M7292j02168B16625J60538J01075A51071M49348
13598F00419k27686L2482j63801J88353P0213o5284m936J408K21323k64678j90039
13587A97774J71675O6259K19696A98087J17207j08863R5421I4879M0027N38283
13577F73189B77811A18694J81061P9005M6748m4791L73966A83063Q9068J00102
13567C72233J22011A72943J75460P0413B7085J99483L18266B44128O9867K2293
13557C36288J06004E8876N94728A88315k8005K23726A53358J55342j20228o4620
$$ plain form
13547 123852 322172 261602 307983 179118 268704 458379 148271 240012 364124 179574
13536 375295 123710 321359 100590 430571 248352 682148 259088 552234 396133 745021
13526 745021 537815 115962 158131 220831 259395 -103875 309674 166324 356236 152888
13515 176497 297088 736314 223377 251603 406884 169443 326904 249503 176394 382981
13505 382981 132289 287471 326794 586940 318237 398654 119348 146712 166371 -65996
13494 60291 238662 372770 502260 269412 116424 338531 37657 531307 426391 217233
13484 217233 459941 143850 167735 303034 210881 199844 490139 548490 111475 565566
13474 565566 268430 122391 374534 428049 121498 396966 209010 391753 507146 384440
$$ packed form
13547A23852J98320o0570M6381j28865Q9586J89675A48271R1741J24112A79574
13536C75295A23710J97649A00590L29981j82219M33796B59088K93146j56101L48888
13526G45021k07206A15962M2169O2700L8564a03875C09674j43350J89912A52888
13515A76497J20591M39226B23377K8226J55281A69443J57461p7401p3109K06587
13505C82981A32289J55182L9323K60146k68703Q0417A19348K7364J9659f5996
13494F0291J78371J34108J29490k32848A16424K22107C7657M93650j04916k09158
13484B17233K42708A43850K3885J35299r2153j1037K90295N8351A11475M54091
13474E65566B68430A22391K52143N3515A21498K75468j87956J82743J15393j22706
$$ plain form
13464 384440 189092 319876 346160 274289 208625 245180 115194 356912 367365 129413
13453 131687 311435 114147 182676 34407 319754 409676 161671 444845 206237 186214
13443 186214 64196 476985 291215 264004 16476 268928 109907 217626 381966 -21388
13432 152658 575421 331106 294033 426013 143744 339244 4369 -33015 534257 539898 -44850
13420 113321 517595 389894 369887 248241 -146252 170449 307563 -22699 222396 215021
13410 215021 364594 175306 158134 132738 -27360 156106 175556 -25105 248284 200976 144803
13399 144803 311732 95071 108709 238942 38826 32137 274962 309153 292327 97234 20993
13387 251691 -113359 -78666 96868 289936 514344 55372 -165148 367569 291010 84438
$$ packed form
13464C84440A89092J30784K6284p1871o5664L6555A15194K41718J0453A29413
13453A31687J79748A14147O8529C4407K85347Q9922A61671K83174B06237k0023
13443A86214F4196M12789j85770k7211A6476K52452A09907J07719J64340b1388
13432A52658M22763k44315l7073J31980A43744J95500D369c3015E34257N641d4850
13420A13321M04274j27701k0007j21646a46252A70449J37114b2699B22396p375
13410B15021J49573A75306j7172k5396b7360A56106J9450b5105B48284m7308n6173
13399A44803J66929I5071J3638J30233C8826o689K42825L4191j6826I7234B0993
13387B51691a13359L4693I6868J93068K24408E5372a65148C67569p6559H4438
$$ plain form
13376 172461 274700 315895 118093 -16418 458729 112464 278870 641250 425788 225816
13366 225816 188185 448174 -4299 231866 167571 79925 105040 -95784 283894 167738 265705
13355 265705 319048 450260 127355 531826 194536 214157 -127723 351827 130272 8908
13344 151363 -66444 295957 321477 208508 235639 168284 -95552 235127 -44518 321670 189997
13333 189997 110019 170079 39384 324179 341960 17296 314814 360879 82630 -161164 331958
13321 549712 309502 425521 496945 117041 345343 -80285 -39072 513502 316943 282101
13311 282101 5689 31826 279125 133313 220944 558317 203405 166158 127617 342164 307082
13300 307082 339254 -27244 -193051 202091 -35036 205887 177403 262119 500973 59055 109809
$$ packed form
13376A72461J02239M1195A18093a6418D58729A12464J66406L62380k15462j99972
13366B25816l7631K59989d299B31866o4295G9925K5115i5784B83894j16156R7967
13355B65705N3343J31212A27355M04471A94536J9621a27723C51827A30272H908
13344A51363f6444B95957K5520j12969K7131o7355i5552B35127d4518C21670j31673
13333A89997p9978O0060C9384K84795J7781A7296K97518M6065H2630a61164C31958
13321E49712k40210J16019P1424A17041K28302h0285c9072E13502j96559l4842
13311B82101E689K6137K47299A33313Q7631L37373B03405l7247l8541K14547l5082
13300C07082L2172b7244j65807B02091c5036B05887k8484Q4716K38854E9055N0754
$$ plain form
13289 109809 67811 -254738 164104 271456 511857 159286 251520 -94908 136984 323804
13279 323804 178373 43855 193096 5548 107447 -57339 52139 -54336 161753 -266979 157992
13267 258618 -145202 384394 -85908 -31225 -162778 205347 181449 223626 199058 194034 81500
13255 148881 -10727 127030 52537 368764 4217 -292768 68132 233218 382892 235586
13245 235586 359179 145377 209693 33535 345092 -23173 224877 -111193 180407 -121038
13234 176845 273333 120780 415899 5245 -18344 82193 -181750 286199 -80363 286947 -14863
13222 45118 32598 102784 130792 274268 88358 229384 332639 367115 164238 133547 110266
13211 110266 339555 207105 98871 123505 -18251 260625 94103 563243 241050 62617
$$ packed form
13289A09809m1998b54738A64104J07352K40401A59286R2234i4908A36984J86820
13279C23804j45431D3855J49241E548J01899e7339E2139e4336A61753b66979A57992
13267B58618a45202C84394h5908c1225j31553B05347k3898M2177k4568n024H1500
13255A48881a0727A27030E2537L16227D217b92768F8132J65086J49674j47306
13245B35586J23593A45377O4316C3535L11557b3173B24877a11193A80407a21038
13234A76845R6488A20780K95119E245a8344H2193a81750B86199h0363B86947a4863
13222D5118j2520P0186K8008J43476H8358J41026J03255L4476A64238l0691k3281
13211A10266K29289j32450I8871K4634a8251B60625I4103M69140B41050F2617
$$ plain form
13200 -43008 -215973 43392 156809 111158 45133 -249667 57260 -383513 -5886 226503 175492
13189 175492 -48464 -40053 117209 130724 155210 82648 119969 128879 -223861 282380 128007
13177 359965 231790 6583 19583 81989 -13391 -7859 101559 152989 263244 -232138 -251174
13166 -251174 236328 206382 179097 362184 -126931 -190025 132164 109698 60323 91498 339298
13155 339298 -138456 -27790 70705 271148 103623 72867 -176540 -79171 -32405 263477
13144 117778 147772 205457 252481 164491 -204932 70692 256812 228465 18089 -194000 70088
13132 78989 -37261 175213 -137974 -131720 126263 -30290 -247033 -2419 -1404 71074 121209
13121 121209 -203613 -119491 -77687 -35502 4510 -8412 78590 146714 263211 239091 -13995
$$ packed form
13200d3008j72965D3392J13417m5651D5133b49667E7260c83513e886B26503n1011
13189A75492d8464Q411A17209J3515K4486p2562L7321Q910b23861B82380A28007
13177C59965j28175F583J3000O2406a3391N532A01559N1430J10255b32138j9036
13166b51174B36328k9946k7285J83087a26931o3094A32164k2466m9375L1175K47800
13155C39298a38456b7790G0705K00443A03623l0756a76540g9171c2405B63477
13144A17778K9994N7685M7024q7990b04932G0692J86120k8347A8089a94000G0088
13132G8989c7261A75213a37974O254A26263c0290k16743b419J015G1074N0135
13121A21209b03613Q4122M1804c5502D510h412G8590O8124J16497k4120a3995
$$ plain form
13109 -81939 56737 -34104 160333 177102 -86100 305567 27420 141939 163621 349231 253751
13098 253751 -12768 118713 169544 -178935 178987 68449 -10969 -61827 37336 349595 -96745
13086 -59093 323079 286364 163445 115709 192258 35305 111191 88145 -56597 214623 2007
13074 227928 -13906 -115316 352580 233858 12271 -133875 156460 234952 288225 95002
13063 -81568 302942 254999 217719 148741 175340 53056 1723 258742 171706 270197 -43092
13051 109878 32618 205401 20945 89159 18837 310523 78284 36223 47880 270362 -20304
13039 20495 -42933 387547 366203 340991 -83767 229033 130867 179600 186985 7049 61563 186968
13027 186968 -144682 108600 153729 79151 49601 380068 246036 91143 595276 -2835 91528
$$ packed form
13109h1939E6737c4104A60333J6769h6100C05567B7420J14519K1682J85610r5480
13098B53751a2768A18713N0831a78935A78987F8449a0969n0858C7336L12259i6745
13086e9093C23079l6715j22919m7736P6549C5305P5886k3046e6597B14623B007
13074B27928a3906j01410C52580j18722A2271a33875A56460P8492N3273I5002
13063h1568C02942m7943l7280o8978K6599E3056A723K57019q7036R8491d3092
13051A09878C2618J72783B0945O8214A8837K91686G8284C6223J1657K22482b0304
13039B0495d2933C87547k1344k5212h3767B29033r8166M8733P385G049N4514J25405
13027A86968a44682A08600M5129p4578k9550L30467j34032I1143N04133b835I1528
$$ plain form
13015 33815 -144553 -23632 133543 125382 47559 222773 124285 -239295 244767 330924 -147617
13003 17621 267688 38152 46385 18921 21413 226457 155087 -447189 -240149 -251919 337712
12991 183970 212472 99556 -101256 14388 316120 4669 -681 -176392 166929 -228757 132601
12979 87194 -46840 -254381 -101879 -82667 218254 119375 -60089 92287 -384884 203317 215559
12968 215559 157754 -27188 297217 -41938 -255991 -77398 -83220 137253 -108486 64364 58919
12957 58919 -317773 197861 218934 259710 534582 209541 -280643 -305536 -33077 87901 58153
12946 58153 -249619 238617 -20889 -98646 -95213 -70958 -186774 195252 -52091 -180568 68576
12934 308897 -47238 34705 -25329 173423 -23252 -96331 66874 76108 4931 1304 607295 -324631
$$ packed form
13015C3815a44553b3632A33543q161D7559J75214r8488b39295B44767Q6157a47617
13003A7621K50067C8152Q233A8921K492K05044p1370d47189K07040j1770C37712
12991A83970K8502I9556a01256A4388L01732D669f81j75711A66929b28757A32601
12979H7194d6840k07541a01879J9212B18254r8879f0089I2287c84884B03317J2242
12968B15559n7805b7188B97217d1938k14053g7398n822A37253a08486F4364n445
12957E8919c17773A97861K1073M0776K74872B09541b80643k4893c3077H7901k9748
12946E8153b49619B38617b0889p7757L433K4255j15816A95252e2091j28477F8576
12934C08897d7238C4705b5329A73423b3252p3079F6874R234D931A304O05991c24631
$$ plain form
12921 -122907 46953 26712 292908 174564 65592 298720 -82041 51245 -102288 -47221 -42829
12910 -42829 229036 203581 141572 23914 207417 30493 -43386 -64992 113956 -128854 -206531
12899 -206531 9180 111533 221611 66627 64930 -243548 254161 43401 255623 238794 -190258
12887 87148 254629 138925 -295058 130565 52677 -339230 -30461 214168 -102884 -178823
12877 -178823 -32396 -80043 478860 207216 -79689 474604 -345178 -57365 -16505 396754
12866 25231 120886 437220 -458183 -84291 144686 27716 -46799 16356 -70184 189452 -52818
12854 369832 -170451 29145 65041 289661 158311 -43996 -135724 -254328 4065 338745 3041
12842 -146039 -224180 -66980 271329 177528 -55870 154662 10164 -90834 131824 -274173 -241521
$$ packed form
12921a22907D6953k0241K66196j18344F5592K33128h2041E1245a02288d7221M392
12910d2829B29036k5455o2009B3914J83503C0493d3386k1606A13956a28854p7677
12899b06531I180J02353J10078F6627j697b43548B54161D3401K12222j6829a90258
12887H7148J67481j15704b95058A30565E2677c39230c0461B14168a02884p5939
12877a78823c2396m7647D78860B07216g9689D74604c45178e7365a6505C96754
12866B5231R5655L16334d58183h4291A44686B7716d6799A6356g0184A89452e2818
12854C69832a70451B9145L5896K24620j31350d3996r1728j18604D065L34680C041
12842a46039p8141f6980B71329r3801e5870A54662A0164i0834A31824b74173L2652
$$ plain form
12831 -241521 185198 -64491 -42963 49525 -308214 -293572 -65681 350745 -83110 -153653 -219072
12820 -219072 84620 307195 225665 -118457 -20311 67790 -23753 -115565 -211547 -49903 17042
12808 124361 -210062 302539 -210784 -87790 133587 -158398 228433 31895 140541 49633
12797 189720 -46507 7382 240053 25089 151462 -385190 -101895 131068 -104489 92284
12786 -471808 140365 68123 -88532 379461 183485 75306 -189420 -27936 35871 -102544
12775 400298 278255 186503 -53631 104536 45688 -168069 32555 16173 -227476 -73431 -60603
12764 -60603 -123467 169003 -4245 94752 160241 -273517 124114 -134671 9428 249585 78173
12752 -93303 -91353 201853 49035 342576 141071 116144 -12661 51348 114921 92734 -91871
$$ packed form
12831b41521A85198f4491K1528D9525c08214J4642f5681C50745h3110p0543o5419
12820b19072H4620K22575q1530a18457b0311F7790b3753r1812r5982d9903A7042
12808A24361b10062C02539b10784h7790A33587a58398B28433C1895J08646D9633
12797A89720d6507G382K32671B5089J26373c85190a01895A31068a04489I2284
12786d71808A40365F8123h8532C79461A83485G5306a89420b7936C5871a02544
12775D00298j22043r1752e3631A04536D5688a68069C2555A6173b27476g3431J2828
12764f0603o2864A69003d245I4752O5489b73517A24114a34671I428K40157G8173
12752i3303J950B01853D9035K93541A41071k4927a2661E1348O3573k2187i1871
$$ plain form
12740 190447 123828 331419 492928 192407 -36952 80681 72937 219076 -544 78344 -88770
12728 30995 261428 223255 37702 79326 -87888 126568 236001 -141285 -41729 401351 -195680
12716 358035 -248098 88197 28096 268695 137718 149907 52074 183286 126951 74123 200803
12705 200803 289287 188290 470701 607183 164624 22288 94069 71083 -186547 136491
12694 -2834 81081 -110281 -68433 82195 -80161 132723 -211271 377691 -15793 -144410 68044
12682 240202 -267942 -77525 95933 256080 160412 -412087 286230 298833 -53852 389519
12671 -32554 58835 -17663 185680 -48940 -203898 370263 267608 32410 -22449 87788 -97078
12659 -78618 209666 206894 138331 145281 180805 73018 54176 30771 171917 284507 131534
$$ packed form
12740A90447o6619K07591J61509A92407c6952H0681p744J46139e44G8344h8770
12728C0995K30433l8173C7702M1624h7888A26568J09433a41285d1729D01351a95680
12716C58035b48098H8197B8096K40599j30977J2189E2074J31212n6335n2828J26680
12705B00803Q8484j00997K82411J36482A64624B2288P1781k2986a86547A36491
12694b834H1081a10281M1848H2195h0161A32723b11271C77691a5793j28617F8044
12682B40202b67942g7525I5933J60147r5668d12087B86230J2603e3852C89519
12671c2554E8835a7663A85680d8940j54958C70263j02655C2410b2449H7788i7078
12659g8618B09666k772o8563O950L5524G3018j8842k3405J41146J12590A31534
$$ plain form
12647 275946 270410 -60957 122401 401843 -66967 -39508 -93343 -50371 -221407 -126408 388406
12635 164864 323580 84127 18717 37724 251973 -131131 141783 308526 198792 152644
12625 152644 293115 170502 131643 77244 224636 49880 -1761 446240 -11264 250509 -108910
12613 -264690 180094 -202857 316648 275345 138114 -127000 -132025 180642 134926 189891
12603 189891 -102066 202795 158026 -106060 -157408 167008 251571 36599 -313116 -182900
12593 -182900 191116 -14336 304287 240116 -238587 -70697 171196 -189174 92015 10933
12582 313700 397650 -59798 132433 -447121 -5054 -82503 262524 -11457 -345354 38088 -136635
12570 148730 189634 377395 -74884 179532 390843 -474774 -217823 183944 240204 125075
$$ packed form
12647B75946n536f0957A22401K79442f6967K7459n3835M2972j71036R4999C88406
12635A64864J58716H4127A8717J9007K14249a31131A41783J66743j09734m6148
12625A52644J40471j22613l8859n4399J47392D9880a761D46240a1264B50509a08910
12613b64690A80094b02857C16648m1303j37231a27000n025A80642m5716N4965
12603A89891a02066B02795m4769a06060n1348A67008Q4563C6599c13116J30216
12593a82900A91116a4336C04287o4171b38587g0697A71196a89174I2015A0933
12582C13700Q3950e9798A32433d47121e054p7449B62524a1457l33897C8088a36635
12570A48730M0904J87761g4884A79532K11311d74774b17823A83944N6260j15129
$$ plain form
12560 125075 34747 57481 -51720 -163336 115577 185443 -14673 -101830 -2433 -182665 1658
12548 -36457 225214 10366 49061 282182 -140259 383446 33820 -34933 -201802 -162257 59741
12536 114219 -124400 155474 -78568 -59225 -238679 -215560 38544 67479 -104946 161068
12525 -289540 270361 199948 -156881 183370 225938 74145 223620 69151 35635 -7972 -200202
12514 -200202 -291295 148854 -124000 331276 36862 -138224 -10949 41800 -157923 47404
12503 -84034 354730 233328 -48291 22966 356908 146563 -45396 170253 -107936 13499
12492 85959 -116916 -7203 218177 -171249 293140 311510 -181450 -27676 16852 279718 93711
12480 225502 3086 -87712 217429 -180789 87361 -293283 -340665 104268 -138595 106643
$$ packed form
12560A25075C4747K2734e1720j11616A15577O9866a4673q7157b433j80232A658
12548c6457B25214A0366L8695K33121a40259C83446C3820c4933j66869L9545E9741
12536A14219a24400A55474g8568J9343j79454K3119C8544K8935a04946A61068
12525b89540B70361p0413a56881A83370M2568G4145J49475F9151l3516g972j92230
12514b00202r1093A48854a24000C31276C6862a38224a0949D1800a57923D7404
12503h4034C54730j21402d8291B2966L33942A46563d5396A70253a07936A3499
12492H5959a16916g203B18177a71249B93140J8370a81450b7676A6852K62866I3711
12480B25502C086h7712B17429a80789H7361b93283m7382A04268a38595A06643
$$ plain form
12469 -49056 258797 -219785 99745 -80544 -83166 101813 63561 23723 -47425 -859 -184925
12458 -184925 68597 71814 -256736 -120946 25190 -186061 333900 -119347 114765 -75623
12447 149840 78316 73731 90950 -73192 -253704 173259 -67365 -96902 24 79165 154224 -61162
12434 -27803 -295870 175148 8530 -84834 5445 45772 -70407 -67812 107044 -160135 -43071
12422 318194 50988 193289 150261 -61181 4174 8268 259480 86830 -101470 89249 -71158
12410 46949 -165369 47845 -28877 -1052 -59294 -254401 37219 -125400 131380 -149307 -314305
12399 -314305 45385 57469 98084 146196 -6480 100743 156108 -56925 -44826 236522 67754
12387 -30244 -17363 -12432 -120848 -119749 271690 -127050 -157386 -110133 80669 -72178 41058
$$ packed form
12469d9056B58797b19785I9745h0544k622A01813l8252B3723d7425h59j84066
12458a84925F8597L217b56736a20946B5190a86061C33900a19347A14765g5623
12447A49840p1524m585J7219g3192j80512A73259f7365k9537B4P9141P5059f1162
12434b7803k68067A75148H530h4834E445M0327g0407K595A07044a60135d3071
12422C18194E0988J42301m3028f1181D174M094K51212H6830a01470H9249g1158
12410D6949a65369D7845b8877a052n8242j95107C7219a25400A31380a49307j64998
12399c14305D5385J2084M0615M8112f480A00743N5365e6925J2099B36522F7754
12387c0244J2881M931j08416J099B71690a27050l0336M7253H0669g2178D1058
$$ plain form
12375 -226328 -77243 115955 -234742 103017 2755 165930 -91213 -404593 161454 70136
12364 133798 -134106 -326358 191002 -25326 -61122 -204597 -31208 -107881 -12632 -204959
12354 -204959 -68991 -109502 -378126 110667 -291339 93914 -23261 297078 87658 -27089 254247
12342 -291266 -147060 -3178 84786 138986 402099 -221577 -355138 234298 -134405 -239858
12332 -239858 -75960 272414 272681 -41384 -120716 59496 206328 -68934 23041 -129688 173070
12320 -105437 56442 -2013 39120 -36757 96957 177385 177163 119575 -94906 31891 -25413 241258
12307 203330 132729 188870 -139567 -24206 -851 130883 -65216 104059 -102475 52642 -44369
12295 -7792 127618 21720 -31271 274454 331372 -203618 289829 287097 75250 -114740 147077
$$ packed form
12375b26328g7243A15955b34742A03017B755J63175i1213l13380A61454G0136
12364A33798a34106j92252A91002b5326l5796j43475c1208p6673a2632j92327
12354b04959f8991m0511k68624A10667b91339I3914b3261B97078H7658b7089B54247
12342b91266J44206c178H4786N4200K63113b21577j33561B34298a34405j05453
12332b39858g5960B72414K67d1384p9332E9496J46832f8934B3041a29688A73070
12320a05437E6442b013C9120c6757I6957Q0428k22n7588i4906C1891b5413B41258
12307B03330p0601N6141a39567b4206h51A30883f5216A04059a02475E2642d4369
12295g792A27618B1720c1271B74454N6918b03618B89829k732G5250a14740A47077
$$ plain form
12283 -86650 388905 -26377 418133 96028 -31704 -190950 -156612 -197194 331808 480575 279629
12272 279629 254823 -25686 -44586 85692 23990 -10046 2275 210041 363762 373932 22725
12260 -23942 76192 181799 -76211 55380 -71178 79976 -177095 307859 166968 25019 -86702
12248 444963 -42932 225800 205760 -525 219592 93905 205120 25405 -73047 145458 -187950
12236 3620 285432 -97476 197857 48119 331471 -18452 171355 239327 194656 511324 190984
12224 -11510 412952 190822 121346 383528 -48309 281902 104662 253039 185790 276343
12214 276343 78779 135211 -73390 79911 -96244 204173 145922 -256232 460796 304912 23651
12202 312729 375012 204043 216432 198954 172394 198949 80765 48180 93508 113558 504740
$$ packed form
12283h6650C88905b6377D18133I6028c1704j59246L4338m0582C31808J48767k00946
12272B79629k4806b5686j8900H5692B3990a0046B275K07766J53721J0170B2725
12260b3942G6192J05607g6211E5380g1178G9976a77095C07859j40891B5019h6702
12248D44963d2932B25800k0040e25B19592I3905J11215B5405g3047A45458a87950
12236C620K81812i7476A97857D8119K83352a8452A71355O7972m4671L16668A90984
12224a1510D12952A90822o9476K62182d8309B81902A04662J48377o7249R0553
12214B76343G8779N6432g3390G9911i6244B04173n8251b56232D60796j55884B3651
12202C12729O2283j70969J2389j7478k6560K6555H0765l2585M5328K0050L91182
$$ plain form
12191 504740 -186924 6704 106921 171212 33956 -133148 76395 52067 -232201 275654 -80180
12179 176293 -16476 -33357 113875 148740 61710 140169 54602 18702 149712 -47216 -80218
12168 -80218 -35018 -40736 228879 232068 -102266 92047 -15395 -64433 44769 -98043 -53837 230854
12155 214041 188030 71987 151492 112312 -259311 141247 80527 287992 256855 -2354 -45994
12144 -45994 321865 328543 -84875 55019 -37690 -169822 399151 -267990 -64739 -55114 8193
12132 162007 123110 -154611 -196350 4424 -4893 -77056 217211 -163561 203452 -96931 180803
12120 257930 -34619 -398969 -289285 -143229 92177 -23940 -123777 -62646 -23102 -11512 29546
12108 -109088 -332233 212328 257971 267932 79809 245140 213094 -16779 333176 58694 -184405
$$ packed form
12191E04740a86924F704J00217O4291C3956a33148G6395k4328b32201B75654h0180
12179A76293a6476j6881A13875L4865F1710P8459E4602A8702J31010d7216l3002
12168h0218c5018n718B28879L189a02266I2047a5395m9038D4769i8043M4206B30854
12155B14041k6011G1987P9505l9180b59311A41247o0720K07465l1137b354m3640
12144d5994C21865O678h4875E5019c7690j32132C99151b67990f4739R625H193
12132A62007l8897a54611m1739D424d893p2163B17211a63561B03452i6931A80803
12120B57930c4619l64350J09684a43229I2177b3940r9837O1131b3102a1512B9546
12108a09088k23145B12328M5643R961G9809J65331l2046a6779C33176E8694a84405
$$ plain form
12096 312333 217278 -216270 89906 90347 65758 312366 135966 -159512 130286 168711 19506
12084 -80051 80231 -178491 -141987 -71759 56431 83925 294243 88505 93187 271296 290031
12073 290031 1355398 1776059 449026 -15840 254841 105480 -53153 260402 -49809 -335599
12063 -335599 -346598 -36801 575179 88305 52940 244378 -299932 150746 17478 148664
12053 148664 179321 -119546 127259 16325 99537 107036 14874 123120 88987 -47609 -117376
12042 -117376 39677 -214350 154519 320703 -200963 225787 112153 367991 73381 189505
12032 189505 12121 -120550 294148 -242131 -404094 -19538 168153 -266289 73715 -116842
12021 182224 201086 143658 -313740 278190 -90106 -359387 105125 -214890 -61327 7373 95777
$$ packed form
12096C12333r5055b16270H9906M41k4589K46608A35966a59512A30286L8425A9506
12084h0051H0231a78491L6504P0228E6431K7494K10318H8505M682J78109J8735
12073B90031J065367M20661D49026a5840B54841A05480e3153B60402d9809k85790
12063c35599j0999c6801E75179H8305l5365J91438b99932A50746A7478J31186
12053A48664L0657a19546A27259A6325Q3212P499A4874J08246l4133d7609o9767
12042a17376C9677b14350A54519J66184b00963B25787A12153K55838G3381J16124
12032A89505A2121a20550B94148b42131j61963a9538A68153b66289G3715a16842
12021A82224J8862n7428c13740B78190i0106k69281A05125b14890f1327G373Q8404
$$ plain form
12010 95777 57099 -100690 -94402 -128444 180802 90619 227401 35624 -193357 34796 -43492
11998 -378397 -133119 279440 -534873 -215505 -257570 139750 187998 -378856 291364 -236623
11987 -83371 34048 -111149 -171471 80416 -112734 124931 171729 148780 -272939 30886 -169478
11975 -341198 -344217 -120310 -183174 22631 -141728 -199879 -127083 -186539 206860 110612 135069
11964 135069 -44962 10963 -80798 75298 -215021 -89811 237583 -134299 -177583 245458 149891
11953 149891 -55236 -235878 -116924 -2749 -316527 -143088 -398741 38184 244578 29697
11942 -226215 227162 -40516 133966 147077 -344722 -112930 -224886 -26622 292265 -125936
11931 -5518 29312 273341 159508 -134477 325556 -136009 90644 -38623 23739 -311524 58194
$$ packed form
12010I5777l8678a00690O288l4042A80802r0183J36782C5624a93357C4796d3492
11998c78397a33119B79440e34873b15505m2065A39750M8248c78856B91364b36623
11987h3371C4048a11149o0322H0416a12734A24931M6798k2949b72939C0886a69478
11975c41198l019a20310o2864B2631a41728n8151P2796n9456B06860r6248K4457
11964A35069d4962A0963h0798G5298b15021h9811B37583a34299m3284B45458r5567
11953A49891e5236j80642a16924b749l13778a43088k55653C8184K06394B9697
11942b26215B27162d0516A33966J3111c44722a12930j11956b6622B92265a25936
11931e518B9312K44029j13833a34477C25556a36009I0644c8623B3739c11524E8194
$$ plain form
11919 231406 218881 -144945 223913 -40346 -189974 -463873 -405317 -33802 -51632 -94336 346053
11907 108611 187583 93373 -169172 121543 -423259 341793 102057 -261101 -23983 -91426
11897 -91426 18590 61663 135349 -272564 -116444 13360 23914 -179801 93004 -37748 87949
11885 -188650 -234967 59420 107200 106837 202050 86474 -117170 65224 -287324 -240005 49822
11873 -229217 -48078 278275 134990 135273 -177284 -154231 -34432 304009 -328430 132036 -90962
11861 48549 -184770 -232168 195758 -135730 7782 54333 127504 -12271 117484 -6616 -251201
11850 -251201 28227 61476 -269836 142167 138814 -205148 52367 -129963 -236295 -61109 311787
11838 -69062 71566 -211061 -156256 -65783 -102418 92698 83297 -317237 -57537 -147874 -11759
$$ packed form
11919B31406j2525a44945B23913d0346j49628k73899N8556c3802j7830m2704C46053
11907A08611P8972I3373a69172A21543d23259C41793A02057b61101b3983o7443
11897i1426A8590M3073P3686b72564a16444A3360J0554a79801I3004c7748H7949
11885a88650m6317E9420M7780l63R5213H6474a17170F5224b87324M7319D9822
11873b29217d8078B78275A34990K83a77284K3053c4432C04009c28430A32036i0962
11861D8549a84770m7398A95758a35730G782M6551P3171a2271A17484f616k44585
11850b51201B8227L3249b69836A42167l353b05148E2367a29963j06332f1109C11787
11838f9062G1566b11061N4805f5783l6635I2698r401c17237e7537r0337a1759
$$ plain form
11826 -45465 -28150 -175942 147231 -412240 251008 -2116 -285742 -161060 -292207 187928
11815 98866 65212 -46223 -116722 53307 273456 -152487 265065 -137301 173401 138385 -71282
11803 -324528 62506 41571 89014 363004 -32726 13012 45931 89511 26052 228749 6241
11791 136356 -406981 116412 -63371 -51501 512 145578 -140735 49954 -203828 -72712 -136570
11780 -136570 122824 -222311 103854 -271734 -75733 180405 139847 126687 -93482 -93878 -375869
11769 -375869 -86793 -119945 145999 28151 -10737 -39883 77425 15859 -85018 -72223 25117
11757 -271530 111306 -213203 -25430 30432 -20146 -76844 109723 -296725 -136966 -76059
11747 -76059 -71801 -308229 133314 -284313 120078 -73426 32171 -77954 30753 -24500 -83473
$$ packed form
11826d5465J7315j47792A47231d12240B51008b116k83626J24682j31147A87928
11815I8866l3654d6223p0499E3307K20149a52487B65065a37301A73401l5016g1282
11803c24528F2506k0935M7443K73990c2726A3012L2919M3580B6052K02697F241
11791A36356d06981A16412f3371J1870E12J45066a40735D9954b03828g2712o3858
11780a36570A22824b22311A03854b71734g5733A80405m0558j3160i3482l96k81991
11769c75869h6793l3152A45999B8151a0737k9146G7425A5859h5018J2795B5117
11757b71530A11306b13203b5430C0432b0146n6698A09723b96725a36966O0907
11747g6059M258k36428A33314b84313A20078g3426C2171g7954C0753b4500n8973
$$ plain form
11736 -83473 105476 233621 -111023 388731 -130378 -182159 237484 -176656 -200618 10516
11725 -29450 186038 60353 -79329 52770 47138 -155146 82358 -54409 34810 -110371 -102191
11714 -102191 -45826 177816 191462 132623 48636 -154499 -89300 34802 -82836 140276 177233
11703 177233 145027 204302 80420 152138 -64051 46512 128563 263642 -91199 87496 1392
11691 35716 -258967 65209 -98326 -15844 128646 325906 -350098 -234612 97985 124551 136239
11680 136239 50542 152960 10273 86140 29759 260946 167810 173057 225261 -28441 -212445
11669 -212445 226828 -166753 314141 110026 166242 -184400 5190 -68226 -347691 543942
11658 37833 -86204 159459 118123 -148052 -52626 156492 -174799 -190765 111820 79261 -275402
$$ packed form
11736h3473A05476J28145a11023C88731a30378n1781B37484a76656k3962A0516
11725b9450A86038F0353g9329E2770n632a55146H2358e4409C4810a10371Q180
11714a02191d5826A77816J3646n8839D8636a54499O5199C4802h2836A40276L6957
11703A77233l2206N9275H0420P1718f4051D6512Q2051J35079i1199H7496A392
11691C5716b58967F5209i8326a5844A28646J97260c50098J15486I7985K6566J1688
11680A36239E0542J02418A0273P5867B9759K31187r3136N247N2204b8441j84004
11669b12445B26828a66753C14141A10026N6216a84400E190f8226k79465E43942
11658C7833h6204A59459m1336a48052e2626A56492a74799j5966A11820l2559b75402
$$ plain form
11646 234273 -144541 -1276 -44595 -118600 131180 -495177 -7861 -43660 166463 -215429 43475
11634 -139289 62099 -127778 251814 119810 53080 22710 69434 198416 199478 121062 220490
11623 220490 152166 -222621 11982 -51229 -182151 -52965 3080 -129002 148152 53613 108380
11612 108380 134640 60108 20659 -375833 212517 73358 370160 31010 147577 140967 154427
11601 154427 90479 55117 -22359 367006 183910 -218559 178070 10955 330338 -76660
11590 104666 207032 91984 212423 446 84758 412553 60182 193213 -47442 -356170 -181240
11579 -181240 192832 -81186 -162548 83919 -136889 -17861 -257561 42562 144389 -77165 173713
11567 -23484 -57123 333907 62729 135251 -233449 106227 24761 34634 -180936 -262294 -31826
$$ packed form
11646B34273a44541a276m3319p4005A31180d95177g861l5799A66463b15429D3475
11634a39289F2099a27778B51814A19810E3080B2710M6724J28982J062p8416R9428
11623B20490o8324b22621A1982e1229j30922e2965C080a29002A48152E3613N4767
11612A08380K6260F0108B0659c75833B12517G3358K96802C1010J16567o610J3460
11601A54427o3948l5362b2359C67006j83096b18559A78070A0955L19383g6660
11590A04666J02366I1984J20439D46Q4312L27795F0182J33031d7442l08728J74930
11579a81240A92832h1186q1362H3919a36889a7861k39700D2562J01827g7165A73713
11567b3484l3639C33907F2729P2522b33449A06227B4761R873a80936q1358c1826
$$ plain form
11555 41918 125506 -28343 -87112 -189714 72 -8152 -68187 19233 66886 66180 303979 212983
11543 212983 -23226 313103 15767 246409 140015 391886 -72681 35504 210822 100169
11532 58835 112331 83109 -51534 115186 343836 -256043 265239 -24385 158599 54494 -53597
11520 -136786 228007 -212183 369434 278134 451041 220888 113193 -111793 -170853 508436
11509 240729 32315 135507 272511 99763 234441 -36057 453222 234851 123709 75902
11499 75902 28665 -67380 179546 472259 395648 472452 104118 -48582 172275 356687 -114489
11487 183251 143327 252985 140227 44380 -58313 512430 -136667 246611 49527 45228 159859
11476 159859 139791 114101 -97191 -79269 80763 422831 129250 51207 234795 -254216 91574
$$ packed form
11555D1918Q3588b8343n8769j02602G2h152o0035A9233M7653p06K37799r0996
11543B12983b3226C13103A5767K30642j06394K51871g2681C5504J75318A00169
11532E8835N3496k9222e1534A15186K28650b56043B65239b4385A58599E4494e3597
11520a36786B28007b12183C69434r1300J72907B20888j07695a11793n9060E08436
11509B40729C2315J03192J37004I9763J34678c6057D53222k18371j11142m7807
11499G5902B8665f7380A79546K92713p6611P6804A04118d8582A72275J84412a14489
11487A83251l9924J09658j12758D4380e8313E12430a36667B46611D9527m299J14631
11476A59859k0068k5690i7191J7922H0763L42068A29250E1207J83588b54216I1574
$$ plain form
11464 367156 -56314 350425 116750 178790 55355 63016 58475 25673 -90984 166066 17310
11452 259219 -230790 126381 365405 120200 365335 298440 298578 -71612 -195914 100926
11441 332889 369673 95531 108061 95084 211416 -125105 213280 72987 205233 132957 367699
11430 367699 338131 46379 69547 -116569 8243 145704 93273 127908 58985 92380 78038
11419 78038 5310 -2489 -31806 -215361 -3129 123157 69860 -141953 -92117 -182404 -290037
11408 -290037 182187 45263 -163468 -161329 -122241 5190 -51025 271831 117382 10983 -220957
11396 -72104 93710 25493 119035 180046 53904 -251098 211249 -211924 -260169 45679 -255506
11384 234686 24297 150942 -110110 -118303 50700 315946 -88192 81219 284232 204466 -72350
$$ packed form
11464C67156e6314C50425A16750O2040E5355P661m541B5673i0984A66066A7310
11452B59219b30790A26381K39024A20200K45135o6895J38g1612j24302A00926
11441C32889L6784I5531J2530j2977J16332a25105B13280G2987J32246p2276K34742
11430C67699k9568D6379K3168a16569H243J37461n2431L4635E8985L3395j4342
11419G8038E310b489k9317j83555c129A23157n3297a41953M9836r0287j07633
11408b90037A82187D5263a63468K139L9088E190e1025B71831A17382A0983b20957
11396g2104I3710B5493R3542O1011E3904b51098B11249b11924m8245D5679b55506
11384B34686B4297J26645a10110q193E0700K65246h8192H1219K03013p9766g2350
$$ plain form
11372 258928 12250 -197854 -29936 56162 150273 -38812 -120713 -157240 -53068 -33383 -101107
11361 -101107 188185 -319230 -114066 321327 54235 26198 -218171 -112084 -81987 -171460
11351 -171460 -219906 14969 159387 -23132 -65026 -36303 -139381 33517 -277370 10204 539435
11340 539435 43645 -399113 57630 19206 -91069 -60696 33767 122186 -79197 -83663 -10866
11328 45780 60632 -22079 -72708 162577 37818 170258 273413 51518 -37643 -47755 -106832
11317 -106832 -266753 54581 263209 94518 322343 -126819 122736 139923 167164 98539
11307 98539 -426220 333582 -140793 -214957 -147832 269669 -95001 86355 -112358 -45197 97337
11295 -73472 306481 -9137 -53335 80717 -294014 222394 274528 -187899 -264139 35729 1994
$$ packed form
11372B58928A2250a97854b9936E6162R4111c8812q1901l6527e3068J9685o7724
11361a01107A88185c19230a14066C21327E4235B6198b18171J06087L0097q9473
11351a71460m8446A4969J44418b3132m1894K8723j03078C3517b77370A0204N29231
11340E39435D3645c99113E7630A9206i1069L0373C3767Q8419g9197m466a0866
11328D5780J4852b2079n0629A62577C7818J32440J03155E1518c7643j0112n9077
11317a06832j59921E4581K08628I4518K27825a26819A22736J7187K7241o8625
11307I8539d26220C33582a40793p4164O7125B69669i5001H6355a12358d5197I7337
11295g3472C06481i137m4198H0717b94014B22394N2134a87899p6240C5729A994
$$ plain form
11283 -95721 167272 -155567 60823 -154022 -179594 335374 -29231 109756 -119191 -169486
11273 -169486 -87178 -98529 8808 16339 177199 -19649 390483 10641 156257 118557 469568
11262 469568 2203 -239904 -459621 -52399 -61863 -75819 245821 -188735 -44308 141347 -170399
11250 3244 193024 4541 21600 174847 -38551 -26993 49363 134664 -88406 104029 -23925
11238 -12212 153250 13776 -195918 34794 45663 17994 44629 -380688 -220556 233577 -13083
11226 -89902 -95020 -120501 170330 -27245 -139524 -15281 -304306 -105632 -63736 -12494 -122079
11215 -122079 -193504 -25760 -65618 -31666 -426711 -196939 11409 -83343 -217886 -269013 -198386
11204 -198386 -269852 -107859 -284259 -183324 -10876 -194518 -84927 -208010 -51915 -357394
$$ packed form
11283i5721A67272a55567F0823a54022k5572C35374b9231A09756a19191n0295
11273a69486Q2308j1351H808P531J60860a9649C90483A0641J45616l7700L51011
11262D69568B203b39904k19717e2399r464j3956B45821a88735d4308A41347a70399
11250C244J89780D541J7059J53247c8551J1558D9363Q5301h8406A04029b3925
11238a2212A53250A3776a95918C4794J0869A7994K6635c80688J60132B33577a3083
11226h9902n118k5481A70330b7245j12279a5281k89025a05632M1896a2494j09585
11215a22079p1425b5760l9858c1666l95045a96939A1409h3343j34543n1127P0627
11204a98386p1466a07859j76400J00935a0876j83642h4927j23083e1915l05479
$$ plain form
11194 -357394 -101328 -219189 -460553 -206860 29185 130608 60890 83619 -284395 -81090
11183 -115686 282394 104789 -91240 -17773 44972 37361 246778 -176778 127638 -7193 100469
11171 -244736 80687 216973 105304 -44453 85629 98920 130012 15318 22073 -31014 -220985
11160 -220985 -16285 234172 216305 -84550 149963 -120739 -11122 -8542 29792 -33580 -23855
11149 -23855 9802 45978 116367 32552 -148111 440924 -181497 59263 90193 -331388 -250252
11138 -250252 -43542 -100590 -162002 -99745 36741 -158534 104993 -156478 181382 49478 -208833
11126 68608 3262 -156153 145366 42651 30197 90035 -232462 82288 227673 96045 -118809
11114 196465 -133011 153086 88538 -90015 58405 24114 52966 -55433 41913 -130360 93050
$$ packed form
11194c57394a01328j17861k41364b06860B9185J01423F0890K2729b84395h1090
11183a15686B82394A04789i1240a7773D4972p611K09417a76778A27638g193A00469
11171b44736H0687J36286A05304d4453H5629J3291L1092A5318O755c1014j89971
11160b20985a6285B34172j7867h4550A49963a20739a1122K580B9792c3580R725
11149b3855I802L6176P0389C2552a48111D40924a81497E9263L0930c31388Q1136
11138b50252d3542n7048o1412O2257C6741a58534A04993a56478A81382D9478b08833
11126F8608C262a56153A45366D2651j2454N9838b32462H2288J45385I6045a18809
11114A96465a33011A53086o4548i0015E8405B4114K8852e5433D1913a30360I3050
$$ plain form
11102 305484 173448 289383 -27537 160935 119081 -39475 272677 -225400 200672 -125186
11091 170275 274716 66908 314658 300115 784829 526743 239080 470680 453396 283777
11081 283777 368267 171431 134919 139018 324762 -58175 57818 333330 290903 -4903 104296
11069 221769 485613 115809 290753 555417 352726 630029 614199 306916 796039 355264
11058 695314 642229 757191 489751 609425 624005 532576 785753 559741 629908 827970
11048 827970 873577 748203 851828 466579 775855 661279 367826 903764 751134 428637
11038 428637 722992 758788 323197 800926 802823 742647 542095 664554 836242 672068
11028 672068 849320 576068 699929 783816 383624 626038 678853 338595 794262 735788
$$ packed form
11102C05484j32036J15935b7537A60935m1854c9475B72677b25400B00672a25186
11091A70275J04441F6908K47750j4543M84714k58086B39080K31600j7284j69619
11081B83777Q4490A71431l6512M099J85744e8175E7818K75512m2427d903A04296
11069B21769K63844A15809J74944K64664k02691K77303j5830C06916M89123C55264
11058F95314n3085J14962k67440J19674J4580r1429K53177k26012P0167J98062
11048H27970M5607j25374J03625l85249L09276j14576k93453N35938j52630l22497
11038D28637K94355L5796C23197M77729J897o0176k00552J22459J71688j64174
11028F72068J77252k73252J23861Q3887C83624K42414N2815C38595M55667n8474
$$ plain form
11018 735788 600433 537379 644837 476276 737783 607685 782722 399879 366030 606118
11008 606118 386261 746751 1002929 739244 453492 434260 875255 694723 861301 902356
10998 902356 571250 468463 363753 546127 847217 810360 754968 617226 813520 557565
10988 557565 590414 759511 1287281 1109529 828759 963709 1055389 1090362 1294358 1816450
10978 1816450 1916038 1380775 2159044 2428984 2448462 2930004 2483123 2677013 2679890 2331668
10968 2331668 2560751 2070222 1850266 1736030 1489738 1782710 1597286 1699408 1780732 1579730
10958 1579730 1980819 1981514 2006023 1542337 1453750 1341416 1220446 1284122 650646 342586
10948 342586 644853 262064 145614 409214 457598 114953 29212 308144 313294 423214
$$ packed form
11018G35788j35355o3054J07458j68561K61507j30098J75037l82843l3849K40088
11008F06118k19857L60490K56178k63685k85752j9232M40995j80532J66578M1055
10998I02356l31106j02787j04710J82374L01090l6857n5392j37742J96294k55955
10988E57565L2849J69097N27770j77752k80770J34950R1680L4973K03996N22092
10978A816450R9588n35263P78269K69940J9478M81542m46881J93890K877l48222
10968B331668K29083m90529k19956j14236k46292K92972j85424J02122Q1324k01002
10958A579730M01089O95K4509m63686q8587j12334j20970O3676o33476l08060
10948C42586L02267B62064j16450K63600M8384A14953B9212K78932N150J09920
$$ plain form
10938 423214 168347 162512 8168 161061 347166 111249 -114821 159217 182654 125848 298917
10927 298917 192945 248315 346499 213801 -74236 209924 -103095 -145864 -210704 212396
10916 240993 -134777 -11459 153322 -127966 31792 -16409 -167314 136318 -70034 -35008
10905 -199682 -14277 -73405 -462960 -23467 5300 286897 -165524 -134374 -241552 -26650 109185
10893 3028 462652 -312884 -256980 91763 230733 -314065 -43827 -254849 210760 -28797 -22853
10882 -22853 12158 -3895 -150013 -462983 6660 -4545 -165163 211678 -241242 46842 -52137
10870 -271804 99379 -172681 -18017 63474 -16530 235687 193464 -159564 -14610 -269494 -84237
10858 -54800 27974 -284283 -3858 277180 472481 127351 -30897 117789 346733 -180218
$$ packed form
10938D23214A68347n835H168J52893J86105A11249a14821A59217K3437n6806J73069
10927B98917j05972N5370R8184j32698g4236B09924a03095m2769o4840B12396
10916B40993a34777a1459A53322a27966C1792a6409j50905A36318g0034c5008
10905a99682a4277n9128l89555b3467E300K81597a65524L1150j07178b6650A09185
10893C028M59624c12884N5904I1763J38970c14065d3827k11022B10760b8797N944
10882b2853A2158c895j46118l12970F660d545j60618B11678b41242D6842e2137
10870b71804I9379a72681a8017F3474a6530B35687m2223a59564a4610k54884h4237
10858e4800B7974b84283c858B77180J95301A27351c0897A17789K28944a80218
$$ plain form
10847 73186 -184062 -151269 -229034 -259243 -26459 -52546 -19060 -322500 110031 120179 28759
10835 125839 -141067 98263 -167294 -255923 347607 -61548 32927 21964 -189988 -467090
10825 -467090 326037 282455 -102911 -64530 118127 -295276 -45916 127814 -320257 -75164
10814 -97118 -212109 -87159 -17530 38639 158009 109787 93104 -226235 10896 -212730 -106346
10802 -515194 262828 136018 -74116 -333265 -82376 275093 -61206 -223458 -27140 94810
10791 91800 166260 -29446 50083 131567 145916 -158547 102675 -212103 80352 -28304 -207881
10780 -207881 -272379 -158522 352804 -180151 -46223 -82005 122135 -110754 -300422 197556
10769 15406 -367456 126268 303479 28729 -67652 133689 41345 -208403 172465 25354
$$ packed form
10847G3186a84062L2793p7765l0209b6459k6087a9060l03440A10031J0148B8759
10835A25839a41067I8263a67294q8629C47607f1548C2927j0963a89988k77102
10825d67090C26037m3582a02911L8381A18127b95276d5916A27814c20257g5164
10814i7118j14991h7159a7530C8639J19370m8222j6683b26235A0896b12730a06346
10802e15194B62828j26810g4116k59149h2376B75093f1206j62252b7140I4810
10791I1800P4460b9446E0083Q1484J4349a58547A02675b12103H0352b8304j79577
10780b07881o4498J13857C52804a80151d6223l5782A22135a10754j89668A97556
10769A5406c67456A26268J77211B8729f7652A33689D1345b08403A72465B5354
$$ plain form
10758 88951 75623 67577 -202562 25453 -94411 13195 63109 42116 -321243 68008 -174671
10746 -131257 -162255 240748 -7350 -96293 -463834 64003 -41681 188308 255867 156775 13772
10734 28977 -10035 -366466 -206283 -166627 -188131 101100 207410 183438 -281982 -220120 63218
10722 -70977 84420 20540 -34582 -196794 25143 73181 46300 -10770 24386 -61015 -174034
10711 -174034 -133255 48010 84285 -107930 -115022 -283293 -216439 -11963 -157574 -234965 -154809
10700 -154809 -287357 -153509 -20042 176188 -130249 59398 -42067 124878 -427377 150909
10689 37451 86021 -239382 29021 -259797 -25879 -55226 -17164 32117 -37719 201022 -92846
10677 51803 -649 -168984 99894 -102837 -90623 -59503 -105009 -13747 -238955 -142768 54586
$$ packed form
10758H8951j3328q046b02562B5453i4411A3195M9914k0993c21243F8008a74671
10746a31257l0998B40748g350q8943l67541F4003d1681A88308O7559r9092A3772
10734B8977a0035l56431J60183L9656k1504A01100J06310k3972b81982O1862F3218
10722g0977H4420B0540c4582j62212B5143M8038k6881a0770B4386f1015j13019
10711a74034M0779D8010L6275a07930p092j68271O6854a1963j45611p7391Q0156
10700a54809j32548J33848b0042A76188a30249E9398d2067A24878d27377A50909
10689C7451M8570b39382B9021b59797b5879k9347a7164C2117c7719B01022i2846
10677E1803f49j68335I9894a02837J2214L1120m5506a3747k25208R6187E4586
$$ plain form
10665 -48766 72897 -119768 -43546 -302350 -161551 5575 -289254 33858 82727 -382155 83889
10653 349148 -212139 128105 105018 -174005 109100 -185787 99637 292093 176319 -352036
10642 247597 281354 -292389 367686 -405843 -90147 29790 144920 259970 -144444 -96911
10632 -96911 149192 25718 7109 40631 32159 -157217 -261514 -208378 -169885 243442 27147
10620 -129732 227018 -3234 -286787 -50699 -262990 -76737 -102033 -305987 -133777 -168613 -185108
10609 -185108 -73227 -197327 -26422 -75184 -305275 -284788 234490 -235068 -255788 -18903 1416
10597 35047 -224796 -238170 -440824 -177797 -125272 -44457 25205 -74544 73185 244966 -207825
10585 -61541 111163 -125162 -216975 -75449 -339322 -120393 -59256 -75835 -104890 -24806 -183445
$$ packed form
10665d8766G2897a19768d3546k58804J40799E575b89254C3858M8869c82155H3889
10653C49148b12139A28105k3087a74005A09100a85787I9637J92456j15774c52036
10642B47597L3757b92389C67686d05843i0147B9790J15130J15050a44444M7533
10632i6911A49192B5718G109L3522q472a57217j04297N3136L8493B43442B7147
10620a29732B27018c234k83553e0699k12291g6737k5296k03954a33777l4836j6495
10609a85108g3227j24100b6422m8762k30091K0487B34490b35068k0720a8903A416
10597C5047b24796j3374k02654a77797N2525d4457B5205g4544G3185J71781b07825
10585f1541A11163a25162r1813g5449k63873a20393e9256j6579k9055b4806j58639
$$ plain form
10574 -183445 -301071 21121 -292087 -63548 57930 -11890 -92950 276987 -197054 -89750 42228
10562 -87376 -522112 2160 -272972 290822 -13802 -15009 -177204 -23087 -127303 140940 90379
10551 90379 48767 -15079 105016 -14407 65960 105530 -256345 28231 -190621 -15523 -83444
10540 -83444 -61793 -376408 -106477 20449 -279069 312609 212649 -66082 -75648 -265410 -53180
10528 50401 31544 220740 92001 80979 146815 85287 104020 150531 -54370 -109742 204613
10516 65048 -64183 96981 22856 69810 -9873 -63295 284327 -14171 108744 -33209 -6143 -119276
10504 -119276 -1668 82650 254839 58566 -301095 -89857 24011 132301 -281219 -104646 -22682
10492 -90205 -180503 -92142 39302 142756 -330392 -49738 144233 65798 164984 216107 720073
$$ packed form
10574a83445j17626B1121b92087f3548E7930a1890q1060B76987a97054h9750D2228
10562h7376m34736B160b72972B90822a3802j207j62195b3087j04216A40940n0561
10551I0379m1612a5079A05016a4407F5960L9570b56345B8231a90621a5523o7921
10540h3444K1651l14615a06477B0449b79069C12609r9960f6082r566j89762e3180
10528E0401j8857J89196I2001j1022O5836o1528J8733M6511e4370n5372B04613
10516F5048f4183I6981B2856M6954i873n3422B84327a4171A08744c3209f143j13133
10504a19276a668H2650J72189E8566c01095h9857B4011J08290b81219a04646b2682
10492i0205r0298Q8361C9302J03454c30392d9738A44233F5798R9186N1123N03966
$$ plain form
10481 720073 240864 333223 268202 239152 260637 -61960 -36926 -56835 -301796 11276 -10535
10469 -176895 -90556 206161 171952 70310 -54819 106396 -108994 -11603 -20701 217724 67145
10457 -49948 38816 240915 -168600 -1187 -14671 37906 -178091 271741 -380083 -12651 118756
10445 -319001 -38998 -170483 -83898 -40022 306714 -65885 114821 -75166 218388 -248534
10434 59069 -92123 67698 -46033 -67409 -250892 42094 173046 -112981 28579 -293386 -206893
10423 -206893 -78963 -128782 61879 -381060 -39664 -359230 148157 -160757 41527 -305137
10412 81981 91157 -173233 -194498 -150232 197 -164937 -85816 245492 37487 29918 -178571 7497
10399 304081 -245332 -326464 188651 -39746 357558 96819 -111978 86427 323600 199967
$$ packed form
10481G20073B40864R2359o5021k9050K1485f1960K5034j9909k44961A1276a0535
10469a76895Q6339B06161l4209G0310e4819A06396a08994a1603r098B17724F7145
10457d9948C8816K02099a68600a187j3484C7906a78091B71741c80083a2651A18756
10445c19001c8998j31485h3898d0022C06714f5885A14821g5166B18388b48534
10434E9069i2123F7698d6033k1376j83483D2094J30952a12981B8579b93386Q6493
10423b06893g8963m9819F1879c81060c9664l19566A48157a60757D1527c05137
10412H1981R176a73233k1265M4266A97a64937P9121B45492C7487p569a78571G497
10399C04081b45332q1132A88651c9746C57558I6819a11978H6427K37173j23633
$$ plain form
10389 199967 271367 -10899 215572 33030 -26266 -144962 129034 249548 484226 516693
10379 516693 189984 261325 112302 118066 128878 173535 282751 156979 -132563 166925
10368 400991 499173 247051 292004 447932 396926 456599 199594 83550 501333 255490
10358 255490 255705 368637 215535 53699 188085 398156 218826 328530 415705 385203 300476
10347 300476 134865 472813 284649 489790 281380 186021 143022 219373 69238 248155
10337 248155 170585 253124 -22233 -87563 -113439 56252 316302 4916 139440 454694 117
10325 -1444 -45920 212273 175773 63399 368278 180342 211670 202259 230198 348468 -133105
10313 213064 272323 68093 15665 -46101 106580 -72395 80797 187844 -52102 6286 -237867
$$ packed form
10389A99967P1400a0899B15572C3030b6266j18696A29034J20514K34678L2467
10379E16693A89984P1341A12302N764J0812M4657J09216j25772a32563A66925
10368D00991R8182B47051M4953J55928n1006N9673A99594H3550M17783k45843
10358B55490K15J12932j53102E3699J34386K10071j79330J09704Q7175l0502q4727
10347C00476A34865L37948j88164K05141k08410r5359m2999P6351F9238J78917
10337B48155p7570Q2539b2233o5330k5876E6252K60050D916J34524L15254A17
10325a444m4476B12273l6500F3399L04879A80342L1328r411K7939J18270a33105
10313B13064N9259F8093A5665d6101A06580g2395H0797J07047e2102F286b37867
$$ plain form
10301 -263584 -274733 -177171 134475 48808 306239 -32467 257317 -104900 251170 1312 -151245
10289 -202989 68636 62607 -165683 42670 -326880 -198589 -214024 202757 6070 -348006 327410
10277 -187142 -3051 -108776 147614 78007 162352 103660 10732 -218723 100506 228369 -329023
10265 -154349 292201 -174637 -8884 234060 63902 145359 253886 302566 333373 -1837 -278236
10254 -278236 157119 -111601 -120785 -36800 -102039 -22916 183051 112417 128513 425047 69833
10242 -195717 54895 -61287 466720 -422106 -285031 172547 156720 -94534 -124354 26879 -8903
10230 -124952 103155 -467779 -7051 -7648 -7337 -95721 185125 -68234 -462796 187760 -88573
10218 13579 107484 139913 66697 -245788 157363 77879 81537 -71797 -236862 -55605 -35835
$$ packed form
10301b63584j1149R7562A34475D8808K57431c2467B57317a04900B51170A312a51245
10289b02989F8636o029a65683D2670c26880J28291j5435B02757F070c48006C27410
10277a87142c051j05725A47614o9607Q4345n8692A0732b18723A00506J27863c29023
10265a54349B92201a74637h884B34060F3902Q1457J08527M8680L0807a837k76399
10254b78236A57119a11601r184c6800o5239b2916A83051p0634J6096K96534F9833
10242a95717E4895f1287D66720d22106J37075A72547j5827i4534k9820B6879h903
10230a24952A03155d67779g051n97L11q8384A85125f8234l94562A87760h8573
10218A3579R3905L2429F6697b45788A57363G7879L658g1797j65065e5605J9770
$$ plain form
10207 -35835 123811 -47769 -157941 269738 -491966 8091 -59985 -226412 -150898 -327837 -275035
10196 -275035 153989 -327086 -89895 -141836 266959 -304703 -115319 -172943 -371566 15030
10185 60262 -316913 167405 -197025 -192910 -294217 -312338 132146 -135212 34403 3227 67070
10174 67070 -254646 -66253 -27075 -111669 -130871 246485 8286 -221716 5950 -4907 -241247
10163 -241247 -189318 -25926 -152536 -31990 -153787 22620 35320 -63699 -129109 148782 -165947
10151 -267962 125721 -298135 -369028 -268588 -128257 171539 -210028 191820 -56425 -73605
10141 -73605 75066 -191651 -255892 -74946 -252314 -244270 -329904 -46402 -99192 166346 -53353
10129 -104124 -97101 -360560 24580 -89945 -276348 16859 -118495 -127678 -400632 -112978 243901
$$ packed form
10207c5835A23811d7769j10172B69738d91966H091e9985j66427P5514j76939N2802
10196b75035A53989c27086h9895n1941B66959c04703a15319n7624j98623A5030
10185F0262c16913A67405a97025M115j01307j8121A32146a35212C4403C227O3843
10174F7070b54646f6253b7075q4594j9202B46485H286b21716E950d907k36340
10163b41247N1929b5926j26610c1990j21797B2620J2700f3699o5410A48782a65947
10151b67962A25721b98135p0893J00440a28257A71539b10028A91820e6425j7180
10141g3605G5066a91651o4241g4946j77368Q044q5634d6402n2790A66346e3353
10129a04124P023k63459B4580h9945j86403A6859a18495r183k72954a12978B43901
$$ plain form
10117 -195842 -89290 -164825 -222811 -31721 205041 99358 3932 138451 148964 53971 -359532
10105 79171 90770 -71440 75096 452658 -45991 -367483 -63038 9074 -126038 205319 315612
10094 315612 124030 -118482 -215891 -160927 -257522 236547 -56746 -496879 55268 -287567
10083 -75818 -216175 155113 41472 16206 43604 -149721 -145385 -116606 -45284 -319968 -156575
10071 54701 104996 -112264 -261164 -495584 -72771 26465 -45620 -1463 101351 -97667 -86232
10060 -86232 67502 -235738 140827 138142 -195747 -235763 159499 -256091 142487 -374977
10049 -432083 -223272 -279898 -99984 -42729 -139245 -201441 -133087 -159342 168714 -302873 -20595
10037 128859 33775 -72591 -226227 153548 91902 156631 21728 -73496 -319972 -131719 -229947
$$ packed form
10117a95842h9290p5535n7986c1721B05041I9358C932J34519J0513E3971c59532
10105G9171J1599g1440G5096L77562d5991l21492f3038I074a26038B05319J10293
10094C15612A24030a18482r7409N4964r6595B36547e6746m40133E5268b87567
10083g5818j40357A55113D1472A6206K7398a49721M336K8779d5284k74684a56575
10071E4701N0295a12264j48900k34420g2771B6465d5620a463A01351i7667J1435
10060h6232F7502b35738A40827k685a95747m0016A59499b56091A42487c74977
10049d32083K08811n6626i9984d2729r6516o2196O8354k6255A68714c02873b0595
10037A28859C3775g2591j53636A53548o1646O4729B1728g3496k46476a31719r8228
$$ plain form
10026 -229947 -191271 -246302 -165386 -107305 -189622 -82426 -22337 -64885 295514 52398 -117683
10014 -106547 42764 -246145 -103922 -141688 -120757 -206216 -259247 78004 88219 -113427 146513
10002 291998 -46593 -214427 121168 -282455 219397 -327328 -244645 -14520 1032 -240254
9991 -174439 118761 152466 -117451 96079 95337 45060 259 -68896 -166678 -117914 36117 -299410
9978 -83668 -107116 127614 231312 -87707 -19802 -194432 95527 -55701 -163690 194298 195158
9967 195158 -332440 420827 48124 161682 52847 526 -285396 139154 -263999 -133695 -248677
9956 -248677 9586 -102485 -193680 208955 -106345 -319581 278828 -287417 338800 -219169
9945 -6905 72078 -551745 -255184 -422706 -200857 -438698 77837 105745 -38029 119218 172038
$$ packed form
10026b29947L8676n5031Q0916N8081q2317h2426b2337m2548B95514E2398a17683
10014a06547D2764b46145a03922l7766K0931q5459n3031G8004J0215a13427A46513
10002B91998d6593j67834A21168b82455B19397c27328Q2683a4520A032b40254
9991a74439A18761L3705a17451I6079p42D5060B59f8896r7782M8764C6117b99410
9978h3668k3448A27614J03698h7707a9802j74630I5527e5701j07989A94298Q60
9967A95158c32440D20827D8124J13558E2847E26b85396A39154b63999J30304j14982
9956b48677I586a02485r1195B08955a06345k13236B78828b87417C38800b19169
9945f905G2078e51745b55184j67522b00857k37841G7837K7908c8029A19218N2820
$$ plain form
9934 172038 -115733 34556 284768 201015 81238 -26611 143668 -65205 -286090 41324 -587788
9922 -223177 -129492 -1650 -50906 -98685 -210582 -173441 -254682 55444 -154800 -174882 -78944
9910 -333984 -263723 -53829 18818 -101764 -262615 -29317 80800 1236 -147627 -459101 -252126
9899 -252126 -45115 2595 34319 35259 -21922 35043 -150893 -292322 -126619 105456 48109
9887 84210 92914 -244339 -56967 300935 -34671 -352950 -81529 -131314 98834 -318710 -496159
9876 -496159 -178384 -288082 -39457 -276652 -137353 331088 113977 -614 -167605 -68542 154913
9864 -219750 -112840 162114 -190624 -203340 270593 -118914 -59217 -185441 -357945 19730
9853 -275153 -207225 -71690 65004 -58683 167596 125742 -44688 -12851 -193525 -317227 -186747
$$ packed form
9934A72038a15733C4556K50212q3753H1238b6611A43668f5205k20885D1324e87788
9922b23177R3685a650m9256m7779j11897L7141q1241E5444a54800k0082g8944
9910c33984P0261e3829A8818a01764j60851b9317H0800A236a47627l11474K06975
9899b52126d5115B595L1724R40b1922C5043a50893j41429a26619A05456D8109
9887H4210Q704b44339e6967C00935c4671l18279h1529m9785I8834c18710j77449
9876d96159a78384j09698c9457k37195a37353C31088A13977f14j66991f8542A54913
9864b19750J06910A62114a90624j2716B70593a18914e9217j26224j72504A9730
9853b75153O7928g1690F5004e8683A67596m1854d4688a2851j80674j23702J30480
$$ plain form
9842 -186747 116925 235184 -474068 20426 -208175 -65367 -17118 -73142 114872 -85606 -146688
9831 -146688 -181330 42045 -79115 68064 -77031 -109736 -253221 -85327 91693 77506 -177553
9819 -167823 -40001 66240 -36911 -236874 -76662 -261590 -261676 -225863 -60823 -277848 -258268 152691
9806 -58881 124 -137246 -124873 -268909 -53501 39988 -37275 229679 -120464 -15112 -103324
9795 -103324 75106 -142261 -16386 -70098 -83312 -99922 -65065 -331599 -160149 -18316 -141779
9784 -141779 -197741 -126100 -82790 -263531 20864 -184112 -190 92799 29044 41230 6785 -170420
9771 -210858 -109009 52932 -187672 -125554 -264347 -115023 21526 63397 -275380 -89334 77486
9759 92982 -227545 -110953 71287 21774 -208184 224117 -126593 26679 -199117 -29263 7497
$$ packed form
9842a86747A16925J18259d74068B0426b08175f5367a7118n6024A14872h5606o1082
9831a46688l4642D2045g9115F8064g7031l2705j43485h5327I1693j4187a77553
9819a67823d0001F6240c6911j99963g6662j84928q6L5813f0823k17025J9580A52691
9806e8881A24a37246J2373j44036e3501C9988c7275B29679a20464a5112q8212
9795a03324G5106a42261a6386n3712j3214j6610L4857k66534a60149a8316j23463
9784a41779n5962P1641M3310j80741B0864a84112a90I2799B9044J2186F785a70420
9771b10858J01849E2932a87672O2118j38793a15023B1526M1871b75380h9334G7486
9759I2982b27545a10953G1287B1774b08184B24117a26593B6679a99117b9263G497
$$ plain form
9747 -71558 -215205 193047 149922 -226788 -67937 -33711 -34525 18816 75051 -66058 -22432 -123550
9735 -123550 -30444 -233194 -218273 -55226 -283811 -163143 36195 -71560 116599 -166892 60334
9723 -226673 -284564 3586 -36027 -160844 -102367 281925 79394 -4167 -26061 322038 24885
9711 -141815 94216 -148358 119984 95326 -129424 306618 16448 -20746 -359082 -122676
9700 43896 -327242 -252839 -218458 -134939 288991 11965 88089 14669 115497 244666 59287
9688 187096 -105620 -96394 -204055 -238617 -13818 -225276 54618 162616 24848 -85000 -229383
9677 -229383 -133907 112429 -238624 5677 -173939 53406 23217 -25365 -224168 -88251 32753
9665 -188765 -177427 -110050 -16 -108590 -1065 -12553 17905 7740 204524 -80192 -132853 -189753
$$ packed form
9747g1558j43647A93047m3125b26788f7937c3711q14A8816N6235f6058b2432j01118
9735a23550c0444k02750J4921e5226k28585J20668C6195g1560A16599a66892F0334
9723b26673n7891C586c6027j24817N8477B81925G9394d167k1894C22038B4885
9711a41815I4216a48358A19984k4658a29424C06618A6448b0746l38336a22676
9700D3896c27242P4403L4381Q3519B88991A1965P6124A4669J00828J29169E9287
9688A87096a05620R226j07661l4562a3818k11458E4618J07998B4848h5000j44383
9677b29383R5476A12429b38624E677a73939E3406B3217b5365j98803h8251C2753
9665a88765J1338O7377a6j08574a065j1488A7905G740J96784h0192n2661n6900
$$ plain form
9653 -189753 -50017 -317349 -440756 205725 -85525 92453 -164146 67438 -214707 -159700 -51461
9641 -207919 -180615 -182657 -47592 472838 57564 -120717 627 -133208 -193295 -256206 72730 -81852
9628 -294288 -79265 18511 -402566 73322 -253011 87521 -199077 -21377 -35723 -166206 -170169
9617 -170169 -5559 -24505 -277246 -243924 -335839 116096 -213873 239370 59339 172265 -117677
9605 -168410 -33602 -149576 97748 -108236 -45532 -56804 291801 177336 -230810 47495 81297
9594 81297 38326 88582 -119701 118551 -85390 73220 -205566 76859 -143013 186925 -184158
9582 -265047 -78163 314383 120367 -240942 198944 109536 -325198 7062 -223580 -199457 -124796
9571 -124796 -10881 -115482 200972 -309544 -22381 -240700 220234 -5597 -60283 23745 204431
$$ packed form
9653a89753e0017k67332j23407B05725h5525I2453a64146F7438b14707N5007e1461
9641b07919K7304k042d7592D72838E7564a20717F27a33208o0087o2911G2730h1852
9628b94288g9265A8511d02566G3322b53011H7521a99077b1377j4346j30483l963
9617a70169e559j8946k52741L3322r1915A16096b13873B39370E9339J12926a17677
9605a68410c3602j15974I7748a08236d5532j1272B91801j14465b30810D7495L3802
9594H1297C8326N0256a19701A18551h5390G3220b05566G6859a43013A86925a84158
9582b65047g8163C14383A20367b40942A98944q9408c25198G062b23580K4123P4661
9571a24796a0881j04601B00972c09544b2381k18319B20234e597n4686B3745J80686
$$ plain form
9560 204431 123369 209422 281858 -373373 -252956 207389 -199893 -229842 -177289 248687 387986
9549 387986 -247787 -65183 47667 -229395 -429436 -2228 188263 54692 222542 -310848 -60262
9537 -134699 -280813 -148188 -350105 27430 76407 53871 29844 -222328 -54460 187954 -310481
9525 -229724 38006 183214 -358903 -89840 -50620 177144 -130017 -122480 75445 28321 -371525
9513 -22554 42711 -33167 233372 200891 -8970 -70153 -166232 -12860 -210902 155280 -21844
9501 -124339 -391681 -188494 201661 -35648 80866 345243 -81345 -127800 -40837 58822 -54681
9489 -216754 -152394 -235364 -256031 52579 -249616 250121 -420661 83801 235468 -409282 -298286
9478 -298286 -209154 -41579 -156137 -378019 -242047 -304244 -19270 -240177 36661 -110197 135387
$$ packed form
9560B04431q1062Q6053P2436c73373J20417B07389a99893k9949N2553B48687J39299
9549C87986b47787f5183D7667b29395k00041b228A88263E4692J67850c10848f0262
9537a34699j46114J32625k01917B7430M8977k2536k4027b22328e4460A87954c10481
9525b29724C8006J45208c58903h9840L9220A77144a30017P537G5445B8321c71525
9513b2554D2711c3167B33372l2481h970o1183r6079a2860j98042A55280b1844
9501a24339k67342a88494B01661c5648H0866K64377h1345m6455d0837E8822e4681
9489b16754O4360q2970k0667E2579b49616B50121d20661H3801J51667d09282J10996
9478b98286Q9132d1579j14558k21882J35972o2197a9270k20907C6661a10197A35387
$$ plain form
9466 -171226 128991 -211606 120220 258152 79501 -119514 154393 -201106 11246 -106179
9455 -61825 -51553 74457 -169604 -88662 89405 204973 -161839 357368 100464 -74279 -125830
9444 -125830 59170 45243 -243369 -194184 -123868 -97794 68652 -244242 -73669 -19829 -260120
9433 -260120 -87535 45335 236304 67097 212720 -50984 -80149 -147970 215355 2626 -187959
9421 195095 194143 -189213 -53850 -249876 122474 -172343 -161314 -98256 -302448 87693 25025
9409 -374156 -86302 -183577 -248852 -85095 -5631 125338 -181187 226750 -132510 -601777 -70828
9397 3598 -104225 -11419 -337342 -42338 -276277 -110611 -303065 -82022 125648 -30378 -42338
9386 -42338 -307274 289527 -158271 58542 -220484 -106964 266605 33070 11109 -153460
$$ packed form
9466a71226A28991b11606A20220J37932G9501a19514A54393b01106A1246a06179
9455f1825J0272G4457a69604Q0942H9405J15568a61839C57368A00464g4279n1551
9444a25830E9170j3927b43369M9185P0316K6074F8652b44242g3669a9829k40291
9433b60120h7535D5335J90969F7097J45623e0984k9165o7821B15355B626a87959
9421A95095r52a89213e3850j96026A22474a72343J1029O3058k04192H7693B5025
9409c74156h6302r7275o5275h5095e631A25338a81187B26750a32510m69267g0828
9397C598a04225a1419l25923d2338k33939a10611j92454h2022A25648c0378j1960
9386d2338k64936B89527a58271E8542b20484a06964B66605C3070A1109a53460
$$ plain form
9375 -167367 190765 -305699 52725 -123612 -225611 29276 71632 44300 -114438 185987
9364 303437 23796 162178 -27345 93093 -218636 -461666 -224407 -213469 83856 -51532 241796
9352 -34258 -61517 86957 -42297 146876 193701 -263610 -265393 -123085 -182347 64522 -217634
9340 5641 -577371 -182769 208733 -73766 14104 -99913 1848 207748 -6676 -70509 34603 -456425
9327 -246473 22930 -50473 55994 -40901 208833 -220344 141165 -163137 216993 -121713
9316 -164077 -175541 60297 1082 -132899 -28716 98976 -252748 -75724 -27106 -19820 -335079
9305 -335079 245869 -34880 -32599 62026 -389954 76033 179400 96478 103632 -34917 -114314
9294 -114314 -45659 -188364 186873 116448 157088 -109866 195073 6823 -219658 -221129 -4848
$$ packed form
9375a67367A90765c05699E2725a23612j01999B9276M2356k7332a14438A85987
9364C03437B3796J38382b7345I3093b18636k43030b24407J0938H3856e1532B41796
9352c4258k7259H6957d2297A46876M6825b63610j783a23085n9262F4522b17634
9340E641e77371a82769B08733g3766A4104i9913A848K05900f676o3833C4603d56425
9327b46473B2930e0473E5994d0901B08833b20344A41165a63137B16993a21713
9316a64077j1464F0297A082a32899b8716I8976b52748g5724b7106P286l15259
9305c35079B45869c4880K281F2026c89954G6033J03367q2922P154c4917p9397
9294a14314d5659j42705A86873p0425M0640a09866A95073F823b19658j471d848
$$ plain form
9282 -67838 188693 -63739 -188308 -68323 65798 -112466 -124420 -150974 -192329 53956 91982
9271 91982 -171474 -128643 -164780 71097 -42996 124727 119556 -333172 -268385 -7625 156327
9259 -23579 -100101 39107 -39583 -273706 35658 42547 -50552 -191355 159914 -228205 -159133
9248 -159133 45436 -83332 166130 195476 -289774 -139550 -43221 -56333 4162 -168244 -31208
9236 -531546 41962 -186250 -49427 5360 -60859 -35235 94559 -205727 -200821 -202468 -27198 10535
9223 398189 -419737 -159526 -72142 -264731 -96841 61295 51097 -67008 8993 -54162 -37301
9212 -37301 -185184 95430 -307999 -69363 -335175 132587 -48730 156817 144554 118015 11625
9200 -40073 -63176 -114236 -47563 197153 -126167 319608 -192702 -161571 -293322 -73334 42002
$$ packed form
9282f7838A88693f3739j24569f8323F5798a12466j1954k6554m1355E3956L8026
9271I1982a71474M2831l6137G1097d2996A24727n171c33172O4787g625A56327
9259b3579p6522C9107c9583k34123C5658O889e0552j40803A59914b28205O9072
9248a59133D5436h3332A66130K9346b89774a39550d3221j3112D162a68244c1208
9236e31546D1962a86250d9427E360f0859K5624I4559b05727M906j647b7198A0535
9223C98189d19737a59526g2142j92589i6841F1295j0198f7008H993e4162J6861
9212c7301j47883I5430c07999f9363k65812A32587d8730A56817j2263k6539A1625
9200d0073k3103n1060d7563A97153a26167C19608a92702L1131j31751g3334D2002
$$ plain form
9188 109597 26876 80242 -100176 -19107 -265205 -277515 -93453 -47238 115861 152069 -214323
9176 -235280 238624 -69164 -122725 27164 29682 286604 -373089 -165242 -148951 -122725 618
9164 -134879 -262157 -184272 -164180 -163798 -241152 -267259 -31943 -46465 -151816 40087 -119858
9152 223841 19823 -121238 -175463 90727 -6820 -129290 -312928 -66831 -194106 -342963 150641
9140 387997 4110 -97869 -3701 205181 13360 -93039 -306908 178501 78281 -120082 94000
9128 -69629 -4514 -39565 -142165 209057 202402 196714 60311 104857 -296687 -117174 -86298 -228892
9116 -228892 3978 -182932 -188585 62999 -81043 189799 -157110 -371678 23825 -134296 -156917
9105 -156917 -317908 -182403 -2276 36476 -112247 161983 -403201 -1719 -12583 -143955 -110429
$$ packed form
9188A09597B6876N3366a00176a9107k46098j2310i3453M6215A15861L6208b14323
9176b35280B38624f9164n3561B7164K518K56922c73089a65242J6291K6226F18
9164a34879j27278P7885K0092L82p7354k6107c1943j4522j05351D0087a19858
9152B23841A9823a21238n4225I0727f820j22470j83638f6831j27275j48857A50641
9140C87997D110i7869c701B05181A3360i3039k13869A78501G8281a20082I4000
9128f9629d514l5051j02600B09057o655n688F0311M4546b96687a17174L0876j42594
9116b28892C978a82932n653F2999h1043A89799a57110k14568B3825a34296k2621
9105a56917j60991J35505b276C6476a12247A61983d03201a719j0864j31372L3526
$$ plain form
9094 -110429 -178212 -7161 126541 69389 74778 105087 -126028 -92273 175694 -192730 -299774
9083 -299774 123209 -118373 408091 24427 -39486 -125776 -5262 122306 94125 -364326 52866
9071 296927 -213205 -281146 -48886 62425 -22965 29704 92209 -191061 314254 -214595 165365
9059 33014 64592 -138338 327301 -218729 84980 200700 -26564 -98676 -32963 123995 -67769
9047 -231280 21513 -164975 -82103 -210703 53425 124261 180184 -298904 -130408 302372 -123156
9035 80541 54179 -21062 -39855 -77964 125686 220190 -476648 5330 -118624 -39170 -79730
9024 -79730 -233138 -191502 -313843 -201214 12391 -31774 -225824 -235588 -24881 -99120 -107584
9013 -107584 -144207 64910 -141319 -197992 135747 -353363 -259351 -108506 71938 79279 237084
$$ packed form
9094a10429o7783g161A26541n7152N389L0309a26028L3755A75694a92730j07044
9083b99774A23209a18373D08091B4427c9486q6290e262A22306k8181c64326E2866
9071B96927b13205o7941d8886F2425b2965B9704O2505a91061C14254b14595A65365
9059C3014L1578a38338C27301b18729H4980J15720b6564p2112c2963A23995f7769
9047b31280B1513a64975h2103j28600E3425P0836N5923b98904a30408C02372a23156
9035H0541k6362b1062j8793l8109A25686R4504d76648E330a18624c9170m0560
9024g9730j53408M1636j22341J12629A2391c1774j94050r764b4881p4239q464
9013a07584l6623F4910a41319n6673A35747c53363R4012a08506G1938P341J57805
$$ plain form
9002 237084 -124324 19939 -285256 165572 -327627 -234028 192387 -119057 -21878 113912
8991 303315 -154554 20865 -186531 -162016 -40890 -286653 -269774 -218774 -427516 -163213 -236351
8980 -236351 105204 -268150 -159787 -103733 -23189 34819 -188220 -218229 34262 9337 78163
8969 78163 -439579 -100611 -126800 218470 112289 -24898 -114137 -114184 -353080 -103116 -148506
8958 -148506 40497 -18555 -130768 -224975 301062 65204 -157795 36893 -232945 -17956 194521
8946 -92373 -170581 -376210 -176857 137163 -59318 -28973 -178852 12841 374353 -128184 -221813
8935 -221813 432601 -55199 43965 328069 76888 -362989 -187759 120919 -59345 175108
8924 261514 769324 2622672 7990914 3957216 899592 339423 -134103 192274 257470
$$ packed form
9002B37084a24324A9939b85256A65572c27627R3599A92387a19057b1878A13912
8991C03315a54554B0865a86531K4515d0890k45763J6879N1000k08742a63213p3138
8980b36351A05204b68150J08363N6054b3189C4819a88220l0009C4262I337O8826
8969G8163d39579a00611k6189B18470j06181b4898q9239m7k38896a03116m5390
8958a48506D0497a8555j12213r4207C01062F5204a57795C6893b32945a7956A94521
8946i2373p8208k05629a76857A37163e9318b8973j49879A2841L61512a28184r3629
8935b21813D32601e5199D3965K84104G6888c62989J75230A20919e9345A75108
8924B61514N07810J853348N368242C957216H99592C39423a34103A92274O5196
$$ plain form
8915 257470 212485 49124 50555 -16334 103157 -84423 107118 413020 10318 -39687 -94028
8904 -94028 -449102 88995 149408 -148702 -261271 120299 -139596 238962 -85095 30937 -84483
8892 -259030 -276508 52376 29005 525670 60029 -227274 -107186 117594 -22345 -162165 -31941
8880 230217 194477 33109 -192229 -27346 -124759 -112716 171978 -16226 349124 -178864 47552
$$ packed form
8915B57470m4985D9124J431a6334A03157h4423A07118L05902A0318c9687n4341
8904i4028l55074H8995O0413a48702j12569A20299a39596B38962h5095C0937h4483
8892b59030j7478E2376k3371M96665F0029b27274a07186A17594b2345j39820c1941
8880B30217l5740C3109a92229b7346r7413J2043A71978a6226C49124a78864D7552
$$ [...]
##END NTUPLES=NMR SPECTRUM
##END=
