
##TITLE=AC1297_GUAAH11109_6534985_0RUWSTfItb
##JCAMPDX= 6.0         $$ Bruker NMR JCAMP-DX V2.0
##DATA TYPE= NMR SPECTRUM
##DATA CLASS= NTUPLES
##ORIGIN= BRUKER
##OWNER= Administrator
$$ 1.72 TOPSPIN		Version 2.1
$$ 2012-07-16 20:26:49.453 -0500  Administrator@TOPSPIN
$$ Compression mode = diff/dup
##.OBSERVE FREQUENCY= 400.02188249412
##.OBSERVE NUCLEUS= ^1H
##.ACQUISITION MODE= SIMULTANEOUS (DQD)
##.ACQUISITION SCHEME= undefined
##.AVERAGES= 64
##.DIGITISER RES= 22
##SPECTROMETER/DATA SYSTEM= spect
##.PULSE SEQUENCE= noesygpps1d.comp
##.SOLVENT NAME= COFFEE_meoh
##.SHIFT REFERENCE= INTERNAL, COFFEE_meoh, 1, 14.96071
##AUDIT TRAIL= $$ (NUMBER, WHEN, WHO, WHERE, PROCESS, VERSION, WHAT)
$$ ##TITLE= Audit trail, TOPSPIN		Version 2.1
$$ ##JCAMPDX= 5.01
$$ ##ORIGIN= Bruker BioSpin GmbH
$$ ##OWNER= Administrator
$$ $$ C:\Bruker\TOPSPIN/data/COFFEE/nmr/AC1297_GUAAH11109_6534985_0RUWSTfItb/12/pdata/1/auditp.txt
$$ ##AUDIT TRAIL=  $$ (NUMBER, WHEN, WHO, WHERE, PROCESS, VERSION, WHAT)
(   1,<2012-07-16 20:26:44.125 -0500>,<Administrator>,<TOPSPIN>,<go>,<TOPSPIN 2.1>,
      <created by zg
	started at 2012-07-16 20:15:13.875 -0500,
	POWCHK enabled, PULCHK disabled,
       configuration hash MD5:
       6B 1B 68 BB D9 2E 58 E2 7F 35 AD 54 07 DF 0E 41
       data hash MD5: 64K
       08 6B 5E DB 64 8E F1 5D 1C AB 94 6D 05 44 35 FE>)
(   2,<2012-07-16 20:26:47.140 -0500>,<Administrator>,<TOPSPIN>,<proc1d>,<TOPSPIN 2.1>,
      <Start of raw data processing
       efp LB = 0.3 FT_mod = 6 PKNL = 1 PHC0 = 0 PHC1 = 0 SI = 128K 
       data hash MD5: 128K
       84 C1 CF 79 33 74 83 5A 98 C3 B5 74 47 50 87 89>)
(   3,<2012-07-16 20:26:48.562 -0500>,<Administrator>,<TOPSPIN>,<proc1d>,<TOPSPIN 2.1>,
      <pk PHC0 = -1.274414 PHC1 = 0 
       data hash MD5: 128K
       3F D5 B0 D9 4B 56 13 0D 55 EE B1 D5 EF 18 4F 89>)
(   4,<2012-07-16 20:26:49.125 -0500>,<Administrator>,<TOPSPIN>,<proc1d>,<TOPSPIN 2.1>,
      <abs ABSG = 1 
       data hash MD5: 128K
       45 21 31 79 DC 67 1E E3 BE 26 C1 A5 FC EE 96 AE>)
(   5,<2012-07-16 20:26:49.187 -0500>,<Administrator>,<TOPSPIN>,<proc1d>,<TOPSPIN 2.1>,
      <abs ABSG = 2 
       data hash MD5: 128K
       F1 30 25 DC BD E5 B5 18 6A 64 3E EE 06 60 DE 9A>)
(   6,<2012-07-16 20:26:49.250 -0500>,<Administrator>,<TOPSPIN>,<proc1d>,<TOPSPIN 2.1>,
      <abs ABSG = 3 
       data hash MD5: 128K
       63 17 87 2B DC DD 6C EB 97 B2 C2 3E 75 5D 44 86>)
(   7,<2012-07-16 20:26:49.328 -0500>,<Administrator>,<TOPSPIN>,<proc1d>,<TOPSPIN 2.1>,
      <abs ABSG = 4 
       data hash MD5: 128K
       C4 D6 08 44 21 0C FC 98 0B 22 41 8C 05 DB 7B 4F>)
(   8,<2012-07-16 20:26:49.375 -0500>,<Administrator>,<TOPSPIN>,<proc1d>,<TOPSPIN 2.1>,
      <abs ABSG = 5 
       data hash MD5: 128K
       7F B6 8A 7A A9 F4 DC DD 7B 7E A4 D8 0A 57 58 0C>)
$$ ##END=
$$ 
$$ $$ hash MD5
$$ $$ 4E BD B5 75 BB 54 26 85 6E A7 98 26 CA B7 CC 26
##$RELAX= 
##$RELAX= 
##$RELAX= 
##$RELAX= 
##$RELAX= 
##$RELAX= 
##$RELAX= 
##$RELAX= 
$$ Bruker specific parameters
$$ [...]
##$TP07= 0
##$TPNAME0= <>
##$TPNAME1= <>
##$TPNAME2= <>
##$TPNAME3= <>
##$TPNAME4= <>
##$TPNAME5= <>
##$TPNAME6= <>
##$TPNAME7= <>
##$TPOAL= (0..7)
0.5 0.5 0.5 0.5 0.5 0.5 0.5 0.5
##$TPOFFS= (0..7)
0 0 0 0 0 0 0 0
##$TUNHIN= 0
##$TUNHOUT= 0
##$TUNXOUT= 0
##$USERA1= <user>
##$USERA2= <user>
##$USERA3= <user>
##$USERA4= <user>
##$USERA5= <user>
##$V9= 5
##$VALIST= <valist>
##$VCLIST= <CCCCCCCCCCCCCCC>
##$VD= 0
##$VDLIST= <DDDDDDDDDDDDDDD>
##$VPLIST= <PPPPPPPPPPPPPPP>
##$VTLIST= <TTTTTTTTTTTTTTT>
##$WBST= 2048
##$WBSW= 25
##$XGAIN= (0..3)
0 0 0 0
##$XL= 0
##$YL= 0
##$YMAX_a= 11528710
##$YMIN_a= -9161380
##$ZGOPTNS= <>
##$ZL1= 120
##$ZL2= 120
##$ZL3= 120
##$ZL4= 120
##$ABSF1= 14.96071
##$ABSF2= -5.597472
##$ABSG= 5
##$ABSL= 3
##$ALPHA= 0
##$AQORDER= 0
##$ASSFAC= 0
##$ASSFACI= 0
##$ASSFACX= 0
##$ASSWID= 0
##$AUNMP= <proc_prof1d_extract.lims>
##$AXLEFT= 0
##$AXNAME= <>
##$AXNUC= <1H>
##$AXRIGHT= 0
##$AXTYPE= 0
##$AXUNIT= <>
##$AZFE= 0.1
##$AZFW= 0.1
##$BCFW= 0
##$BC_mod= 0
##$BYTORDP= 0
##$COROFFS= 0
##$CY= 15
##$DATMOD= 1
##$DC= 0
##$DFILT= <>
##$DTYPP= 0
##$F1P= 0
##$F2P= 0
##$FCOR= 0.5
##$FTSIZE= 131072
##$FT_mod= 6
##$GAMMA= 0
##$GB= 0
##$INTBC= 1
##$INTSCL= 1
##$ISEN= 128
##$LB= 0.3
##$LEV0= 0
##$LPBIN= 0
##$MAXI= 10000
##$MC2= 0
##$MEAN= 0
##$ME_mod= 0
##$MI= 0
##$NCOEF= 0
##$NC_proc= -2
##$NLEV= 6
##$NOISF1= 0
##$NOISF2= 0
##$NSP= 0
##$NTH_PI= 0
##$NZP= 0
##$OFFSET= 14.96071
##$PC= 1
##$PHC0= -1.274414
##$PHC1= 0
##$PH_mod= 1
##$PKNL= yes
##$PPARMOD= 0
##$PPDIAG= 0
##$PPIPTYP= 0
##$PPMPNUM= 2147483647
##$PPRESOL= 1
##$PSCAL= 4
##$PSIGN= 0
##$PYNMP= <proc.py>
##$REVERSE= no
##$SF= 400.020009753885
##$SI= 131072
##$SIGF1= 0
##$SIGF2= 0
##$SINO= 400
##$SIOLD= 131072
##$SPECTYP= <>
##$SREGLST= <1H.CDCl3>
##$SSB= 0
##$STSI= 131072
##$STSR= 0
##$SW_p= 8223.68421052631
##$SYMM= 0
##$S_DEV= 0
##$TDeff= 65536
##$TDoff= 0
##$TI= <>
##$TILT= no
##$TM1= 0
##$TM2= 0
##$TOPLEV= 0
##$USERP1= <user>
##$USERP2= <user>
##$USERP3= <user>
##$USERP4= <user>
##$USERP5= <user>
##$WDW= 1
##$XDIM= 131072
##$YMAX_p= 428495535
##$YMIN_p= -13219
##$CURPLOT= <Network HP LaserJet P1505>
##$CURPRIN= <$Network HP LaserJet P1505>
##$DFORMAT= <normdp>
##$LAYOUT= <+/1D_H.xwp>
##$LFORMAT= <normlp>
##$PFORMAT= <normpl>
##$SURQMSG= 1
$$ End of Bruker specific parameters
$$ ---------------------------------
##NTUPLES= NMR SPECTRUM
##VAR_NAME=  FREQUENCY,     SPECTRUM/REAL,   SPECTRUM/IMAG
##SYMBOL=    X,             R,               I
##VAR_TYPE=  INDEPENDENT,   DEPENDENT,       DEPENDENT
##VAR_FORM=  AFFN,          ASDF,            ASDF
##VAR_DIM=   131072,        131072,          131072
##UNITS=     HZ,            ARBITRARY UNITS, ARBITRARY UNITS
##FACTOR=    0.0627417313425164, 1,          1
##FIRST=     8223.62146879497, 2144,         -56401
##LAST=      0,             3354,            -55829
##MIN=       0,             -13219,          0
##MAX=       8223.62146879497, 428495535,    0
$$ Real data points
##PAGE= N=1
##DATA TABLE= (X++(R..R)), XYDATA
$$ [...]
$$ plain form
63957 662829 691417 723039 757545 795776 838644 886484 939828 1000336 1070422 1152267 1247551
63946 1247551 1357841 1484614 1628847 1790822 1970277 2166472 2378173 2603844 2841815
63937 2841815 3089898 3344726 3601689 3855499 4100509 4330441 4538460 4718371 4866041
63928 4866041 4979447 5057302 5097978 5099883 5062464 4986373 4872814 4723370 4540780 4329801
63918 4329801 4097101 3850203 3596231 3341099 3089445 2845100 2611459 2391279 2186367
63909 2186367 1997884 1826959 1674551 1540631 1423947 1322833 1235837 1161313 1097043 1040937
63899 1040937 991885 949330 912233 879231 849695 823790 801249 780856 761554 743358 726568
63888 726568 710593 694358 677681 661503 646736 633523 621783 611842 604155 598829 595798 595138 596768
$$ packed form
63957F62829K8588L1622L4506L8231M2868M7840N3344O0508P0086Q1845R5284
63946A247551J10290J26773J44233J61975J79455J96195K11701K25671K37971
63937B841815K48083K54828K56963K53810K45010K29932K08019J79911J47670
63928D866041J13406P7855M0676J905l7419p6091j13559j49444j82590k10979
63918D329801k32700k46898k53972k55132k51654k44345k33641k20180k04912
63909B186367j88483j70925j52408j33920j16684j01114q6996p4524o4270n6106
63899A040937m9052m2555l7097l3002k9536k5905k2541k0393j9302j8196j6790
63888G26568j5975j6235j6677j6178j4767j3213j1740r941p687n326l031o60J630
$$ plain form
63875 596768 600110 604658 610875 619893 632078 646365 661350 676748 693313 711530 730926 750626
63863 750626 770067 788929 806774 823101 837598 850089 860329 868043 873076 875340 874731 871287 865327
63850 865327 857207 846908 834075 818540 800736 781543 761731 741476 720411 698193 675019 651504
63838 651504 628140 605022 582094 559347 536804 514604 493218 473155 454322 436078 418168
63827 418168 401163 385622 371314 357823 345496 334972 325952 317314 308563 300416 293629 287924 282462
63814 282462 276835 271116 265311 259366 253586 248636 245098 243196 242688 242766 242319 240822 238966 237997 238334 239125
63798 239125 239328 238915 238692 239021 239120 237837 234938 231346 228124 225526 223137 220565 217707 214548 211137 207763
63782 207763 204809 202447 200714 199831 200049 201122 202254 202746 202461 201656 200619 199555 198564 197639 196903 196777
$$ packed form
63875E96768L342M548O217R018J2185J4287J4985J5398J6565J8217J9396J9700
63863G50626J9441J8862J7845J6327J4497J2491J0240P714N033K264o09l444n960
63850H65327q120j0299j2833j5535j7804j9193j9812k0255k1065k2218k3174k3515
63838F51504k3364k3118k2928k2747k2543k2200k1386k0063j8833j8244j7910
63827D18168j7005j5541j4308j3491j2327j0524r020q638q751q147o787n705n462
63814B82462n627n719n805n945n780m950l538j902n08P8m47j497j856r69L37P91
63798B39125K03m13k23L29R9j283k899l592l222k598k389k572k858l159l411l374
63782B07763k954k362j733q83K18J073J132M92k85q05j037j064r91r25p36j26
$$ plain form
63766 196777 197488 198470 198777 198307 198054 198871 200448 201912 202944 203727 204145 203783 202712 201697 201445 202001 202974
63749 202974 203989 204811 205337 205672 206085 206764 207677 208714 209864 211225 212943 215112 217651 220317 222938 225569
63733 225569 228347 231249 234168 237130 240201 243171 245558 247106 248219 249756 252302 255694 259338 262997
63719 262997 267099 272065 277530 282529 286406 289189 291062 291989 292057 291786 291624 291332 290229 287978 284854 281337
63703 281337 277821 274644 272051 270083 268666 267799 267422 267211 266822 266359 266278 266720 267270 267628 268247 269939 272833
63686 272833 276060 278687 280759 283125 286235 289507 292097 293959 295729 297660 299213 299797 299517 299009 298827
63671 298827 299186 300028 301156 302533 304505 307410 310835 313715 315445 316463 317425 318222 318257 317270 315314 312221
63655 312221 307774 302368 296898 291932 287403 283030 278609 273999 269378 265503 263191 262439 262494 262781 263280
$$ packed form
63766A96777P11R82L07m70k53Q17J577J464J032P83M18l62j071j015k52N56R73
63749B02974J015Q22N26L35M13O79R13J037J150J361J718K169K539K666K621K631
63733B25569K778K902K919K962L071K970K387J548J113J537K546L392L644L659
63719B62997M102M966N465M999L877K783J873R27O8k71j62k92j103k251l124l517
63703B81337l516l177k593j968j417q67l77k11l89m63q1M42N50L58O19J692K894
63686B72833L227K627K072K366L110L272K590J862J770J931J553N84k80n08j82
63671B98827L59Q42J128J377J972K905L425K880J730J018R62P97L5r87j956l093
63655C12221m447n406n470m966m529m373m421m610m621l875k312p52N5K87M99
$$ plain form
63640 263280 264008 264811 265843 267623 270223 272909 274953 276509 278385 281254 285353 290542 296322 302095 307785
63625 307785 313937 320885 328130 334998 341631 348814 356942 365708 374843 384624 395521 407738 421362
63612 421362 436622 453767 472878 494054 517638 543977 572993 604202 637112 671383 706517
63601 706517 741585 775198 805514 830275 847395 856077 857393 853524 846478 837652 828212 819153 810853
63588 810853 803078 795480 787488 777603 763722 744868 722094 697134 670701 642883 614640 587711
63576 587711 563128 540851 520983 504207 490644 479307 469299 460928 454934 451240 449213 448778 450444
63563 450444 454308 459687 465868 472780 480830 490317 501059 512399 523622 534447 545119 556048 567673
63550 567673 580762 596390 615301 637571 663220 692903 727600 767735 812710 860845 909213
$$ packed form
63640B63280P28Q03J032J780K600K686K044J556J876K869M099N189N780N773N690
63625C07785O152O948P245O868O633P183Q128Q766R135R781J0897J2217J3624
63612D21362J5260J7145J9111K1176K3584K6339K9016L1209L2910L4271L5134
63601G06517L5068L3613L0316K4761J7120Q682J316l869p046q826r440r059q300
63588H10853p775p598p992r885j3881j8854k2774k4960k6433k7818k8243k6929
63576E87711k4583k2277j9868j6776j3563j1337j0008q371n994l694k027m35J666
63563D50444L864N379O181O912Q050R487J0742J1340J1223J0825J0672J0929J1625
63550E67673J3089J5628J8911K2270K5649K9683L4697M0135M4975M8135M8368
$$ plain form
63539 909213 953739 990198 1015525 1028438 1029390 1020535 1005474 988163 971515 956980 945159 936219
63527 936219 929656 924187 918201 910110 898158 880447 855747 824460 788557 750438 711776 673379
63515 673379 635932 600504 568114 538997 512673 488809 467581 449081 432860 418437 405856
63504 405856 395257 386186 377932 370373 363847 358261 352982 347752 343048 339309 336397 334147 332890 332881 333588
63489 333588 334109 334157 334129 334310 334534 334703 335176 336406 338449 341027 343879 346849 349783 352593 355433 358635
63473 358635 362354 366319 369964 372720 374145 373930 372019 368799 364959 360971 356786 352215 347516 343326
63459 343326 339963 337055 334080 331154 329029 328294 328731 329541 330101 330399 330836 331754 333227 335173 337562 340523
63443 340523 344371 349527 356299 364688 374413 385192 396982 410021 424706 441471 460760 483113
$$ packed form
63539I09213M4526L6459K5327J2913R52q855j5061j7311j6648j4535j1821q940
63527I36219o563n469n986q091j1952j7711k4700l1287l5903l8119l8662l8397
63515F73379l7447l5428l2390k9117k6324k3864k1228j8500j6221j4423j2581
63504D05856j0599r071q254p559o526n586n279n230m704l739k912k250j257rP07
63489C33588N21M8k8J81K24J69M73J230K043K578K852K970K934K810K840L202
63473C58635L719L965L645K756J425k15j911l220l840l988m185m571m699m190
63459C43326l363k908k975k926k125p35M37Q10N60K98M37R18J473J946K389K961
63443C40523L848N156O772Q389R725J0779J1790J3039J4685J6765J9289K2353
$$ plain form
63431 483113 509193 539322 572516 605944 635801 659169 675242 684954 689923 691986 693304 696159
63419 696159 702294 712603 727487 747307 772386 802754 838068 877639 920329 964317 1007081 1045750
63407 1045750 1077700 1101035 1114811 1119108 1115065 1104770 1090774 1075437 1060463 1046725 1034144 1021676
63395 1021676 1007702 990736 969893 944836 915582 882501 846425 808621 770621 733940 699653
63384 699653 668139 639314 613068 589341 567984 548980 532790 519984 510372 503053 497483 494007
63372 494007 493015 494175 496988 501581 508253 516608 525872 535883 547068 559573 573229 588355 605850
63359 605850 626327 649794 676248 705770 737856 771488 806403 843583 883827 926171 968251
63348 968251 1007723 1042695 1071172 1091097 1101379 1102565 1096465 1085314 1071201 1055786 1040248 1025378
$$ packed form
63431D83113K6080L0129L3194L3428K9857K3368J6073R712M969K063J318K855
63419F96159O135J0309J4884J9820K5079L0368L5314L9571M2690M3988M2764L8669
63407A045750L1950K3335J3776M297m043j0295j3996j5337j4974j3738j2581j2468
63395A021676j3974j6966k0843k5057k9254l3081l6076l7804l8000l6681l4287
63384F99653l1514k8825k6246k3727k1357j9004j6190j2806r612p319n570l476
63372D94007r92J160K813M593O672Q355R264J0011J1185J2505J3656J5126J7495
63359F05850K0477K3467K6454K9522L2086L3632L4915L7180M0244M2344M2080
63348I68251L9472L4972K8477J9925J0282J186o100j1151j4113j5415j5538j4870
$$ plain form
63336 1025378 1011558 998439 984803 969031 949770 926156 897793 864986 829000 791723 754903
63325 754903 719744 687066 657511 631563 609576 591793 578248 568706 562910 560620 560879 561171 557864
63312 557864 548137 531668 510597 488009 466454 447325 430966 417038 404982 394414 385240 377491
63300 377491 371072 365671 360907 356591 352891 350104 348221 346757 345138 343196 341102 338800 335800 331739
63286 331739 326996 322463 318733 315736 313131 310710 308384 306136 304214 303062 302747 302677 302228 301482 301007 301011
63270 301011 301137 301109 301170 301742 302874 304166 305107 305495 305719 306590 308663 311750 315269 318917 322660 326237 329322
63253 329322 332248 335975 341006 346705 351999 356461 360500 364854 370213 376946 384829 393263 402102 412071
63239 412071 424053 438209 454059 471158 489308 508405 528577 550288 573811 598711 624215
$$ packed form
63336A025378j3820j3119j3636j5772j9261k3614k8363l2807l5986l7277l6820
63325G54903l5159l2678k9555k5948k1987j7783j3545r542n796k290K59K92l307
63312E57864r727j6469k1071k2588k1555j9129j6359j3928j2056j0568r174p749
63300C77491o419n401m764m316l700k787j883j464j619j942k094k302l000m061
63286C31739m743m533l730k997k605k421k326k248j922j152l15p0m49p46m75M
63270C01011J26k8O1N72J132J292R41L88K24Q71K073L087L519L648L743L577L085
63253C29322K926L727N031N699N294M462M039M354N359O733P883Q434Q839R969
63239D12071J1982J4156J5850J7099J8150J9097K0172K1711K3523K4900K5504
$$ plain form
63228 624215 649911 675610 700719 724518 747117 769525 792524 815953 839313 862594 886208
63217 886208 910499 935674 961837 988573 1014615 1038258 1058198 1073847 1084942 1091003 1091137 1084324
63205 1084324 1070102 1049093 1022695 992188 958376 922209 885339 849604 816071 785017 756776
63194 756776 732149 711843 695893 683896 675591 670953 669876 672019 676937 684149 693184 703856 716523
63181 716523 731688 749137 767706 786199 804467 823266 843105 863574 883869 903595 922802
63170 922802 941491 959378 976045 991050 1003883 1014062 1021266 1025171 1025084 1019979 1009041 992196 970034
63157 970034 943366 912988 879866 845287 810448 775784 740975 705970 671909 640667 613367
63146 613367 589644 568441 549165 531857 516674 503667 492842 483994 476548 469968 464272 459761
$$ packed form
63228F24215K5696K5699K5109K3799K2599K2408K2999K3429K3360K3281K3614
63217H86208K4291K5175K6163K6736K6042K3643J9940J5649J1095O061J34o813
63205A084324j4222k1009k6398l0507l3812l6167l6870l5735l3533l1054k8241
63194G56776k4627k0306j5950j1997q305m638j077K143M918P212R035J0672J2667
63181G16523J5165J7449J8569J8493J8268J8799J9839K0469K0295J9726J9207
63170I22802J8689J7887J6667J5005J2833J0179P204L905q7n105j0938j6845k2162
63157I70034k6668l0378l3122l4579l4839l4664l4809l5005l4061l1242k7300
63146F13367k3723k1203j9276j7308j5183j3007j0825q848p446o580n696m511
$$ plain form
63134 459761 456288 453214 450130 447222 444832 443107 442233 442565 444179 446520 448832 450860 452961 455670 459338
63119 459338 464051 469601 475550 481409 486803 491473 495387 498923 502684 506851 510827 513792 515616 517035
63105 517035 518918 521541 524543 527408 529898 532111 534221 536146 537528 538081 538005 537931 538468 539755 541441 543022
63089 543022 544170 544812 544998 544812 544447 544249 544482 545037 545506 545722 546178 547783 551091 555859 561381 567239 573548
63072 573548 580492 587868 595343 603075 611720 621724 632889 644843 657748 672322 689244 708716
63060 708716 730454 753887 778478 804184 831675 861934 895639 932961 973804 1017997 1065333
63049 1065333 1115698 1169120 1225447 1284010 1343820 1404073 1464304 1524216 1583687 1642819 1701628
63038 1701628 1759764 1816967 1873710 1930863 1988670 2046563 2103996 2160652 2215442 2265863 2308933
$$ packed form
63134D59761l473l074l084k908k390j725q74L32J614K341K312K028K101K709L668
63119D59338M713N550N949N859N394M670L914L536L761M167L976K965J824J419
63105E17035J883K623L002K865K490K213K110J925J382N53p6p4N37J287J686J581
63089E43022J148O42J86j86l65j98K33N55M69K16M56J605L308M768N522N858O309
63072E73548O944P376P475P732Q645J0004J1165J1954J2905J4574J6922J9472
63060G08716K1738K3433K4591K5706K7491L0259L3705L7322M0843M4193M7336
63049A065333N0365N3422N6327N8563N9810O0253O0231N9912N9471N9132N8809
63038A701628N8136N7203N6743N7153N7807N7893N7433N6656N4790N0421M3070
$$ plain form
63027 2308933 2342537 2365495 2376758 2375081 2359424 2329314 2285073 2228147 2161076 2086692 2007327
63016 2007327 1925050 1842357 1762040 1686335 1616500 1553251 1497206 1448865 1408535 1376465 1352879
63005 1352879 1337692 1330272 1329508 1334243 1343938 1359064 1380441 1407854 1439497 1473164 1507753 1543204
62993 1543204 1579247 1614934 1649490 1683011 1716134 1749411 1783091 1816944 1849882 1880011 1905395
62982 1905395 1924697 1937021 1941381 1936683 1922136 1897597 1863525 1820624 1769477 1710668 1645450 1576099
62970 1576099 1505141 1434255 1364266 1296150 1231436 1171479 1116837 1067571 1023617 984513 949293
62959 949293 917182 888123 862132 838460 816002 794400 774133 755430 737676 720160 703035
62948 703035 687157 672949 659657 645897 630966 615522 600809 587358 574777 562722 551430
$$ packed form
63027B308933L3604K2958J1263j677j5657l0110m4241n6926o7071p4384p9365
63016B007327q2277q2693q0317p5705o9835o3249n6045m8341m0330l2070k3586
63005A352879j5187p420p64M735R695J5126K1377K7413L1643L3667L4589L5451
62993A543204L6043L5687L4556L3521L3123L3277L3680L3853L2938L0129K5384
62982A905395J9302J2324M360m698j4547k4539l4072m2901n1147n8809o5218o9351
62970A576099p0958p0886o9989o8116o4714n9957n4642m9266m3954l9104l5220
62959I49293l2111k9059k5991k3672k2458k1602k0267j8703j7754j7516j7125
62948G03035j5878j4208j3292j3760j4931j5444j4713j3451j2581j2055j1292
$$ plain form
62937 551430 541065 531200 521589 512967 506290 501320 496798 492040 487535 483777 480369 476843 473707 471880
62923 471880 471330 470975 469957 468438 467039 465927 464773 463371 461958 460934 460390 460027 459459 458448 456748
62908 456748 453964 449965 445458 441695 439231 437194 434175 429777 424974 420961 418020 415598 413216 411075
62894 411075 409917 410383 412394 415015 416999 417576 416789 415247 413679 412670 412492 413023 413921 414907 415849 416650
62878 416650 417296 417962 418809 419606 419872 419506 418997 418853 419095 419548 420264 421280 422162 422252 421346 419821 418178 416752
62860 416752 415791 415375 415310 415477 416280 418245 421123 423895 425865 427242 428469 429528 430341 431357 433080 435225
62844 435225 436921 437745 438108 438676 439730 441073 442185 442444 441574 439945 438213 436706 435424 434464 434053 434124
62828 434124 434303 434385 434449 434523 434560 434851 435953 437929 440094 441851 443510 445897 449357 453491 457758 461973 466253
$$ packed form
62937E51430j0365r865r611q622o677m970m522m758m505l758l408l526l136j827
62923D71880n50l55j018j519j399j112j154j402j413j024n44l63n68j011j700
62908D56748k784l999m507l763k464k037l019m398m803m013k941k422k382k141
62894D11075j158M66K011K621J984N77p87j542j568j009j78N31Q98R86R42Q01
62878D16650O46O66Q47P97K66l66n09j44K42M53P16J016Q82R0r06j525j643j426
62860D16752r61m16o5J67Q03J965K878K772J970J377J227J059Q13J016J723K145
62844D35225J696Q24L63N68J054J343J112K59q70j629j732j507j282r60m11P1
62828D34124J79Q2O4P4L7K91J102J976K165J757J659K387L460M134M267M215M280
$$ plain form
62811 466253 470791 475776 481318 487342 493542 499474 504759 509408 514027 519570 526676 535265 544796 554838
62797 554838 565390 576819 589533 603590 618602 634194 650535 668189 687503 708604 732062
62786 732062 759045 790415 826097 865796 910122 960448 1017711 1081773 1152001 1228117 1310382
62775 1310382 1399128 1494079 1593865 1696184 1798575 1898884 1994817 2083252 2160554 2223688 2270794
62764 2270794 2300733 2312553 2305707 2280560 2238501 2181652 2112509 2033628 1947360 1855788 1760877
62753 1760877 1664596 1568888 1475504 1385774 1300467 1220021 1144963 1075869 1012753 954845 901403
62742 901403 852554 808850 770149 735540 704408 676944 653315 632872 614538 597697 582348
62731 582348 568671 556840 547072 539417 533499 528700 524654 521408 519133 517797 517097 516700 516710 517903 521224
$$ packed form
62811D66253M538M985N542O024O200N932N285M649M619N543P106Q589R531J0042
62797E54838J0552J1429J2714J4057J5012J5592J6341J7654J9314K1101K3458
62786G32062K6983L1370L5682L9699M4326N0326N7263O4062P0228P6116Q2265
62775A310382Q8746R4951R9786J02319J02391J00309R5933Q8435P7302O3134M7106
62764B270794K9939J1820o846k5147m2059n6849o9143p8881q6268r1572r4911
62753A760877r6281r5708r3384q9730q5307q0446p5058o9094o3116n7908n3442
62742I01403m8849m3704l8701l4609l1132k7464k3629k0443j8334j6841j5349
62731E82348j3677j1831r768p655n918m799m046l246k275j336p00l97J0J193L321
$$ plain form
62716 521224 526817 533769 541082 548722 557479 567934 580045 593741 609532 628204 650159 675313
62704 675313 703609 735351 770949 810610 854500 903071 956817 1015663 1078941 1146174 1217488
62693 1217488 1292915 1371564 1451890 1532476 1611881 1687876 1757598 1818626 1869229 1907421 1930758
62682 1930758 1937744 1928854 1905475 1868322 1817684 1754966 1683012 1604821 1522661 1438507 1354499 1272532
62670 1272532 1193798 1119086 1049149 984521 925276 871290 822497 778621 738932 702635 669443
62659 669443 639563 613198 590214 570147 552318 536055 521047 507471 495634 485495 476649 468629
62647 468629 461065 453630 446121 438678 431750 425724 420587 416039 411884 408218 405216 402832 400878 399389
62633 399389 398729 399180 400496 402072 403470 404626 405550 406163 406532 406957 407561 407954 407632 406650 405593 404883 404498
$$ packed form
62716E21224N593O952P313P640Q757J0455J2111J3696J5791J8672K1955K5154
62704F75313K8296L1742L5598L9661M3890M8571N3746N8846O3278O7233P1314
62693A217488P5427P8649Q0326Q0586P9405P5995O9722O1028N0603L8192K3337
62682A930758O986q890k3379l7153n0638o2718p1954p8191q2160q4154q4008q1967
62670A272532p8734p4712o9937o4628n9245n3986m8793m3876l9689l6297l3192
62659F69443k9880k6365k2984k0067j7829j6263j5008j3576j1837j0139q846q020
62647D68629p564p435p509p443o928o026n137m548m155l666l002k384j954j489
62633C99389o60M51J316J576J398J156R24O13L69M25O04L93l22r82j057p10l85
$$ plain form
62616 404498 404542 405675 408561 412991 418024 423091 428559 435036 442501 450441 458631 467341 476929 487637
62602 487637 499812 513851 529816 547500 567029 589058 614158 642387 673746 708722 747908
62591 747908 791172 837549 885868 935173 984584 1032985 1078877 1120358 1155408 1182451 1200610
62580 1200610 1209409 1208529 1198125 1179064 1152421 1119022 1079908 1036918 992086 946539 900656 855219
62568 855219 811537 770306 731258 694416 660857 631548 605952 582595 560729 540742 523161
62557 523161 508051 495358 485049 476649 469226 462186 455736 450278 445617 441059 436133 430981 426167
62544 426167 422356 420016 419158 419273 419731 420342 421460 423452 426141 428896 431212 433038 434522 435696 436563
62529 436563 437372 438568 440511 443443 447611 453203 460264 468954 479768 493092 508580 525511 543894
$$ packed form
62616D04498M4J133K886M430N033N067N468O477P465P940Q190Q710R588J0708
62602D87637J2175J4039J5965J7684J9529K2029K5100K8229L1359L4976L9186
62591G47908M3264M6377M8319M9305M9411M8401M5892M1481L5050K7043J8159
62580A200610Q799q80j0404j9061k6643l3399l9114m2990m4832m5547m5883m5437
62568H55219m3682m1231l9048l6842l3559k9309k5596k3357k1866j9987j7581
62557E23161j5110j2693j0309q400p423p040o450n458m661m558m926n152m814
62544D26167l811k340q58J15M58O11J118J992K689K755K316J826J484J174Q67
62529D36563Q09J196J943K932M168N592P061Q690J0814J3324J5488J6931J8383
$$ plain form
62516 543894 564728 588984 616870 648420 684132 724310 768130 814093 861316 909625 958416
62505 958416 1006080 1050726 1090879 1125309 1152827 1172748 1185158 1190307 1187976 1177905 1160749 1138229
62493 1138229 1112376 1084848 1056919 1029772 1004592 982432 964076 950030 940717 936721 938714 947060
62481 947060 961588 981824 1007308 1037523 1071676 1108923 1148876 1191555 1236456 1281639 1323980
62470 1323980 1360438 1389095 1409133 1420271 1422471 1415868 1400417 1375560 1340731 1296519 1245108 1189327
62458 1189327 1131415 1072762 1014387 957167 901767 848822 799215 753855 713221 677430 646667
62447 646667 621060 600127 582860 568543 557136 548635 542444 537684 533916 531294 530197 530892 533362
62434 533362 537181 541609 545990 549972 553319 555711 556819 556327 553815 548985 542220 534512 526458 517703
$$ packed form
62516E43894K0834K4256K7886L1550L5712M0178M3820M5963M7223M8309M8791
62505I58416M7664M4646M0153L4430K7518J9921J2410N149k331j0071j7156k2520
62493A138229k5853k7528k7929k7147k5180k2160j8356j4046r313l996J993Q346
62481I47060J4528K0236K5484L0215L4153L7247L9953M2679M4901M5183M2341
62470A323980L6458K8657K0038J1138K200o603j5451k4857l4829m4212n1411n5781
62458A189327n7912n8653n8375n7220n5400n2945m9607m5360m0634l5791l0763
62447F46667k5607k0933j7267j4317j1407q501o191m760l768k622j097O95K470
62434E33362L819M428M381L982L347K392J108m92k512m830o765p708q054q755
$$ plain form
62420 517703 507742 496965 486360 476455 467212 458821 451757 445850 440057 433622 426978 421037 416007 411435
62406 411435 407162 403565 400785 398265 395312 391917 388783 386593 385335 384375 383195 382029 381665 382603 384560
62391 384560 386917 389404 392093 394933 397701 400387 403190 406005 408269 409600 410421 411689 414088 417698
62377 417698 422349 428018 434826 442783 451621 460821 469873 478647 487563 497334 508507 521270 535599
62364 535599 551433 568741 587585 608214 631032 656529 685305 718122 755728 798495 846299
62353 846299 898706 955131 1014762 1076551 1139296 1201446 1260582 1313391 1356712 1388854 1409871
62342 1409871 1420648 1422010 1414654 1399438 1377295 1348932 1314814 1275401 1231284 1183305 1132890 1082180
62330 1082180 1033393 987927 946256 908696 875799 847768 823938 803332 785520 770394 757248
$$ packed form
62420E17703r961j0777j0605r905r243q391p064n907n793o435o644n941n030m572
62406D11435m273l597k780k520k953l395l134k190j258r60j180j166l64R38J957
62391C84560K357K487K689K840K768K686K803K815K264J331Q21J268K399L610
62377D17698M651N669O808P957Q838R200R052Q774Q916R771J1173J2763J4329
62364E35599J5834J7308J8844K0629K2818K5497K8776L2817L7606M2767M7804
62353H46299N2407N6425N9631O1789O2745O2150N9136N2809M3321L2142K1017
62342A409871J0777J362p356j5216k2143k8363l4118l9413m4117m7979n0415n0710
62330A082180m8787m5466m1671l7560l2897k8031k3830k0606j7812j5126j3146
$$ plain form
62319 757248 744714 731744 718079 703555 687597 669898 651127 632372 614093 596169 578713
62308 578713 562165 546681 532147 518853 507420 497851 489344 481363 474331 468795 464441 460498 456745
62295 456745 453499 450842 448496 446401 444901 444321 444724 446046 448049 450206 452026 453501 454978 456779 459315
62280 459315 463250 468841 475184 480883 485626 490391 495882 501568 506723 511746 517699 524942 532957 541356
62266 541356 550405 560551 572053 585189 600385 617995 638265 661608 688658 719922 755570 795634
62254 795634 840230 889600 944062 1003782 1068199 1135544 1203114 1268086 1327979 1380568 1423933
62243 1423933 1456955 1479544 1492192 1495401 1489615 1475449 1453685 1425053 1390094 1349128 1302403 1250573
62231 1250573 1195214 1138598 1082744 1028827 977656 930335 887881 850308 816568 785524 756688
$$ packed form
62319G57248j2534j2970j3665j4524j5958j7699j8771j8755j8279j7924j7456
62308E78713j6548j5484j4534j3294j1433r569q507p981p032n536m354l943l753
62295D56745l246k657k346k095j500n80M03J322K003K157J820J475J477J801K536
62280D59315L935N591O343N699M743M765N491N686N155N023N953P243Q015Q399
62266E41356R049J0146J1502J3136J5196J7610K0270K3343K7050L1264L5648M0064
62254G95634M4596M9370N4462N9720O4417O7345O7570O4972N9893N2589M3365
62243A423933L3022K2589J2648L209n786j4166k1764k8632l4959m0966m6725n1830
62231A250573n5359n6616n5854n3917n1171m7321m2454l7573l3740l1044k8836
$$ plain form
62220 756688 730059 705741 683885 664501 646972 630145 613321 596962 582027 568818 556923
62209 556923 546099 536582 528469 521324 514689 508620 503497 499549 496776 495036 493993 493232 492672 492736 493940
62194 493940 496448 500098 504561 509355 514115 519203 525676 534179 544141 554491 564974 576132 588144
62181 588144 600387 612280 623963 635827 647754 659160 669543 678791 687116 694849 702177 709112
62169 709112 716016 724148 735224 750299 769440 792645 820592 854074 893003 936303 982561 1030400
62157 1030400 1078332 1124583 1166969 1202879 1229822 1246559 1253763 1253270 1246759 1235254 1219446 1199772
62145 1199772 1176087 1147844 1114909 1078084 1038782 998552 958984 921676 887816 857837 831642
62134 831642 809193 790689 776169 765114 756669 750288 746041 744115 744106 745036 746164 747557 749729 752944
$$ packed form
62220G56688k6629k4318k1856j9384j7529j6827j6824j6359j4935j3209j1895
62209E56923j0824r517q113p145o635o069n123l948k773j740j043p61n60O4J204
62194D93940K508L650M463M794M760N088O473Q503R962J0350J0483J1158J2012
62181E88144J2243J1893J1683J1864J1927J1406J0383R248Q325P733P328O935
62169G09112O904Q132J1076J5075J9141K3205K7947L3482L8929M3300M6258M7839
62157A030400M7932M6251M2386L5910K6943J6737P204m93o511j1505j5808j9674
62145A199772k3685k8243l2935l6825l9302m0230l9568l7308l3860k9979k6195
62134H31642k2449j8504j4520j1055q445o381m247j926rR30J128J393K172L215
$$ plain form
62120 752944 757106 762213 768516 776120 784532 792680 799314 803500 804921 803918 801320 798248 795858 794813
62106 794813 794705 794035 790981 784346 774033 761032 747059 733788 721980 711476 702242 695181 691477
62093 691477 691204 693020 695300 697275 699055 701036 703599 707119 711823 717500 723538 729427 735281 741716
62079 741716 749172 757478 766364 776239 788036 802112 817806 834419 852201 871797 892933 914391
62067 914391 935316 955954 976905 998265 1019918 1042315 1066415 1092859 1121530 1151872 1183299
62056 1183299 1215005 1245440 1272234 1292979 1306316 1312344 1312025 1306395 1296247 1282008 1263415 1239513
62044 1239513 1209577 1174071 1134378 1091657 1046515 999817 953073 907620 863847 821735 781791
62033 781791 744916 711595 681807 655703 633702 615672 600513 586930 574438 563242 553373 544382
$$ packed form
62120G52944M162N107O303P604Q412Q148O634M186J421j003k598l072k390j045
62106G94813j08o70l054o635j0313j3001j3973j3271j1808j0504r234p061l704
62093F91477k73J816K280J975J780J981K563L520M704N677O038N889N854O435
62079G41716P456Q306Q886R875J1797J4076J5694J6613J7782J9596K1136K1458
62067I14391K0925K0638K0951K1360K1653K2397K4100K6444K8671L0342L1427
62056A183299L1706L0435K6794K0745J3337O028l19n630j0148j4239j8593k3902
62044A239513k9936l5506l9693m2721m5142m6698m6744m5453m3773m2112l9944
62033G81791l6875l3321k9788k6104k2001j8030j5159j3583j2492j1196r869q991
$$ plain form
62021 544382 535901 528046 520975 514386 507788 501099 494625 488556 482902 477813 473388 469052 463800 457408
62007 457408 450957 445675 441669 438293 435362 433406 432941 434112 436819 440513 444061 446657 448876 451945
61993 451945 455875 459185 460793 461292 461860 462633 462830 461880 459687 456138 451134 445011 438360 431481 424406
61978 424406 417321 410620 404673 399837 396392 394080 391966 389215 385826 382324 379083 376398 374745 374215
61964 374215 373899 372688 370684 369082 368568 368543 368120 367226 366371 365845 365523 365124 364420 363534 363250 364636 367970
61947 367970 372296 376333 379685 382940 386819 391572 397093 403360 410700 419660 430514 442876 455915
61934 455915 468981 481945 494998 508378 522256 536500 550474 563374 574892 585267 594555 602220
61922 602220 607635 610666 611526 610398 607512 603353 598386 592696 586171 578950 571496 564460 558744 555511
$$ packed form
62021E44382q481p855p071o589o598o689o474o069n654n089m425m336n252o392
62007D57408o451n282m006l376k931j956m65J171K707L694L548K596K219L069
61993D51945L930L310J608M99N68P73J97r50k193l549n004o123o651o879p075
61978D24406p085o701n947m836l445k312k114k751l389l502l241k685j653n30
61964C74215l16j211k004j602n14k5m23q94q55n26l22l99p04q86k84J386L334
61947C67970M326M037L352L255L879M753N521O267P340Q960J0854J2362J3039
61934D55915J3066J2964J3053J3380J3878J4244J3974J2900J1518J0375R288P665
61922F02220N415L031Q60j128k886m159m967n690o525p221p454p036n716l233
$$ plain form
61908 555511 555694 559436 566177 575171 585772 597440 609848 622908 636321 649112 659928 667808 672453
61895 672453 673888 672313 668301 662701 656072 648447 639771 630307 620517 610850 601820 593966 587369 581401
61881 581401 575259 568700 561976 555135 547743 539444 530507 521605 513094 504696 495969 487005 478538 471284
61867 471284 465332 460318 456158 453272 451936 451694 451727 451806 452573 454820 458714 463882 470094 477601 486810 497789
61851 497789 510290 524250 540108 558424 579142 601381 624128 647062 670491 694437 717986
61840 717986 739689 758462 773905 785767 793420 796139 793897 787711 779015 768768 757339 745241
61828 745241 733659 724006 717099 713049 711918 714098 719863 728801 739958 752386 765295 777741 788441
61815 788441 796035 799449 798090 791893 781264 766844 749252 729063 706967 683767 660183 636813
$$ packed form
61908E55511J83L742O741Q994J0601J1668J2408J3060J3413J2791J0816P880M645
61895F72453J435j575m012n600o629p625q676r464r790r667r030p854o597n968
61881E81401o142o559o724o841p392q299q937q902q511q398q727q964q467p254
61867D71284n952n014m160k886j336k42L3P9P67K247L894N168O212P507R209J0979
61851D97789J2501J3960J5858J8316K0718K2239K2747K2934K3429K3946K3549
61840G17986K1703J8773J5443J1862P653K719k242o186q696j0247j1429j2098
61828G45241j1582r653o907m050j131K180N765Q938J1157J2428J2909J2446J0700
61815G88441P594L414j359o197j0629j4420j7592k0189k2096k3200k3584k3370
$$ plain form
61803 636813 614343 593675 575645 560493 547567 535657 523793 511917 500702 490684 481755 473628
61791 473628 466489 460677 455799 450752 444928 439007 434207 430935 428504 426010 423158 420256 417710 415572
61777 415572 413510 411308 409435 408765 409441 410341 410190 409011 407919 407523 407303 406739 406190 406095 405962 405050 403788
61760 403788 403543 404866 406761 408047 408800 409964 411999 414562 417323 420415 423900 427287 429859 431291 431725
61745 431725 431366 430196 428124 425341 422431 419980 417967 415689 412528 408795 405583 403754 403255 403421 403638
61730 403638 403596 403199 402552 401981 401833 402212 402943 403702 404212 404483 404973 406247 408376 410918 413645 416934 421080
61713 421080 425524 429265 431924 433941 435722 437099 437676 437220 435551 432499 428328 423891 420051 417024 414453
61698 414453 411922 409253 406502 403893 401605 399438 396885 393697 390224 386989 384043 380962 377461 373827
$$ packed form
61803F36813k2470k0668j8030j5152j2926j1910j1864j1876j1215j0018q929q127
61791D73628p139n812m878n047n824n921m800l272k431k494k852k902k546k138
61777D15572k062k202j873o70O76R00j51j179j092l96k20n64n49r5j33r12j262
61760D03788k45J323J895J286P53J164K035K563K761L092L485L387K572J432M34
61745D31725l59j170k072k783k910k451k013k278l161l733l212j829m99J66K17
61730D03638m2l97o47n71j48L79P31P59N10K71M90J274K129K542K727L289M146
61713D21080M444L741K659K017J781J377N77m56j669l052m171m437l840l027k571
61698D14453k531k669k751k609k288k167k553l188l473l235k946l081l501l634
$$ plain form
61684 373827 370741 368634 367138 365245 362249 358563 355353 353317 352110 350981 349575 347966 346348 345004
61670 345004 344185 343701 342946 341662 340374 339695 339558 339527 339471 339377 338883 337673 336184 335228 335090 335661 337224 340130
61652 340130 343712 346582 348364 350168 352853 355693 357563 358708 360387 363119 366231 368990 371326 373384
61638 373384 375158 376762 378446 380087 381102 381162 380535 379492 377781 375120 371973 369374 367936 367359 366923
61623 366923 366268 365472 364493 362809 359931 356265 353140 351654 351605 351837 351535 350750 349672 348025 345555 342679
61607 342679 340056 337655 334821 331282 327571 324231 321101 317766 314388 311521 309168 306537 302957 298707
61593 298707 294689 291450 288883 286762 285159 284141 283337 282134 280294 278087 275766 273185 270169 267100
61579 267100 264767 263558 263026 262411 261427 260430 259938 260141 260793 261405 261574 261214 260497 259630 258853 258574 259132 260250
$$ packed form
61684C73827l086k107j496j893k996l686l210k036j207j129j406j609j618j344
61670C45004q19m84p55j284j288o79j37l1n6r4m94j210j489r56j38N71J563K906
61652C40130L582K870J782J804K685K840J870J145J679K732L112K759K336K058
61638C73384J774J604J684J641J015O0o27j043j711k661l147k599j438n77m36
61623C66923o55p96r79j684k878l666l125j486m9K32l02p85j078j647k470k876
61607C42679k623k401k834l539l711l340l130l335l378k867k353k631l580m250
61593B98707m018l239k567k121j603j018q04j203j840k207k321k581l016l069
61579B67100k333j209n32o15r84r97m92K03O52O12J69l60p17q67p77k79N58J118
$$ plain form
61561 260250 261109 261307 261430 262290 263851 265411 266630 267699 268626 269157 269560 270677 272784 275011 276351 276724
61545 276724 276572 275991 274996 274233 274568 275992 277588 278652 279286 279856 280437 280971 281517 282120 282679 283056 283137 282832
61527 282832 282322 282208 283037 284610 286120 286978 287202 287016 286561 286046 285760 285672 285333 284324 282624 280517 278457
61510 278457 276975 276367 276374 276511 276663 276963 277197 276997 276654 276948 277856 278261 277465 276271 275813 275896 275506 274687 274795
61491 274795 276681 279494 281732 282878 283506 284213 285011 285650 286058 286311 286400 286204 285671 284971 284439 284385 285029 286555
61473 286555 289053 292281 295629 298461 300443 301439 301378 300483 299509 299257 299737 300177 300048 299783 300131 301073 301823
61456 301823 301881 301527 301159 300643 299772 298999 299071 299989 300954 301433 301715 302160 302516 302505 302571 303402 304896 306335 307486
61437 307486 308835 310678 312642 314356 315995 317816 319642 321209 322688 324414 326323 328003 329198 329977
$$ packed form
61561B60250Q59J98J23Q60J561J560J219J069R27N31M03J117K107K227J340L73
61545B76724j52n81r95p63L35J424J596J064O34N70N81N34N46O03N59L77Q1l05
61527B82832n10j14Q29J573J510Q58K24j86m55n15k86q8l39j009j700k107k060
61510B78457j482o08PJ37J52L00K34k00l43K94R08M05p96j194m58Q3l90q19J08
61491B74795J886K813K238J146O28P07P98O39M08K53Q9j96n33p00n32n4O44J526
61473B86555K498L228L348K832J982R96o1q95r74k52M80M40j29k65L48R42P50
61456C01823N8l54l68n16q71p73P2R18R65M79K82M45L56j1O6Q31J494J439J151
61437C07486J349J843J964J714J639J821J826J567J479J726J909J680J195P79
$$ plain form
61423 329977 330504 330884 331161 331299 331221 331035 331134 331911 333374 335055 336235 336410 335808 335359 335780 336660 336862 335897
61405 335897 334406 333158 332147 330978 329611 328231 326809 325308 324068 323400 322969 322084 320584 318996 317869
61390 317869 317248 316831 316354 315873 315821 316625 318108 319517 320391 321069 322020 323086 323906 324737 326159 328134 330091
61373 330091 331894 333971 336385 338509 339957 341180 342732 344398 345545 346092 346593 347474 348577 349533 350334
61358 350334 351399 353118 355449 358052 360782 363853 367452 371482 375965 381431 388459 396860 405711 414149
61344 414149 421677 427766 431828 433998 435456 437460 440178 442817 444826 446591 448897 452031 455585 458993
61330 458993 462008 464618 466729 468153 468874 469070 468799 467906 466353 464384 462203 459724 456944 454330 452517
61315 452517 451774 452051 453379 455801 459045 462687 466687 471362 476892 483234 490565 499378 510025 522434
$$ packed form
61423C29977N27L80K77J38p8j86R9P77J463J681J180J75o02m49M21Q80K02r65
61405C35897j491j248j011j169j367j380j422j501j240o68m31q85j500j588j127
61390C17869o21m17m77m81n2Q04J483J409Q74O78R51J066Q20Q31J422J975J957
61373C30091J803K077K414K124J448J223J552J666J147N47N01Q81J103R56Q01
61358C50334J065J719K331K603K730L071L599M030M483N466P028Q401Q851Q438
61344D14149P528O089M062K170J458K004K718K639K009J765K306L134L554L408
61330D58993L015K610K111J424P21J96k71q93j553j969k181k479k780k614j813
61315D52517p43K77J328K422L244L642M000M675N530O342P331Q813J0647J2409
$$ plain form
61301 522434 536207 550549 564067 575163 582916 587389 589086 588509 586243 582914 578794 573782 567939
61288 567939 561584 554647 546508 536914 526687 517039 508437 500582 493263 486687 481039 476262 472361 469614
61274 469614 468290 468355 469502 471367 473700 476408 479488 482881 486460 490148 493933 497732 501410 505023 508927
61259 508927 513569 519305 526305 534264 542106 548413 552488 554839 556390 557511 558087 558265 558621 559622 561261
61244 561261 563217 565077 566434 567071 567125 566882 566369 565401 563994 562502 561227 560056 558542 556262 553158 549716
61228 549716 546798 545115 544844 545891 548377 552486 557839 563477 568760 573921 579379 584781 589313 592964
61214 592964 596845 601940 607980 614024 619839 626002 632541 638159 641296 641753 640944 640646 641713 643854 646249
61199 646249 648361 650434 653367 658006 664535 672555 681663 691737 702730 714389 726198 737437 747289
$$ packed form
61301E22434J3773J4342J3518J1096P753M473J697n77k266l329m120n012n843
61288E67939o355o937q139r594j0227r648q602p855p319o576n648m777l901k747
61274D69614j324O5J147J865K333K708L080L393L579L688L785L799L678L613L904
61259E08927M642N736P000P959P842O307M075K351J551J121N76J78L56J001J639
61244E61261J956J860J357O37N4k43n13r68j407j492j275j171j514k280l104l442
61228E49716k918j683k71J047K486M109N353N638N283N161N458N402M532L651
61214E92964L881N095O040O044N815O163O539N618L137M57q09k98J067K141K395
61199F46249K112K073K933M639O529Q020R108J0074J0993J1659J1809J1239R852
$$ plain form
61186 747289 755034 760261 762937 763420 762451 760870 759131 757155 754727 751833 748470 744493 739938 735233 730721
61171 730721 726267 721731 717468 713734 709849 704807 698701 692700 687449 682255 676222 669429 662462 655369
61157 655369 647806 639889 632259 625327 618888 612507 606096 600211 595840 593595 592952 592584 591560 589798 587207
61142 587207 583109 576979 569263 560822 552002 542964 534573 528019 523515 520108 516937 514112 512260 511796
61128 511796 512755 514738 516823 518188 519263 521813 527336 535632 545338 555633 566861 579572 593624
61115 593624 608495 624140 641116 659922 680428 701948 723740 745395 766917 788472 810009
61104 810009 831126 851382 870690 889123 906303 921307 933394 942512 948790 951849 951163 946981 940313
61091 940313 931936 921946 910331 897387 883328 868037 851610 834745 818210 802194 786485 770962
$$ packed form
61186G47289P745N227K676M83r69j581j739j976k428k894l363l977m555m705m512
61171G30721m454m536m263l734l885n042o106o001n251n194o033o793o967p093
61157F55369p563p917p630o932o439o381o411n885m371k245o43l68j024j762k591
61142E87207m098o130p716q441q820r038q391o554m504l407l171k825j852m64
61128E11796R59J983K085J365J075K550N523Q296R706J0295J1228J2711J4052
61115E93624J4871J5645J6976J8806K0506K1520K1792K1655K1522K1555K1537
61104H10009K1117K0256J9308J8433J7180J5004J2087R118O278L059o86m182o668
61091I40313q377r990j1615j2944j4059j5291j6427j6865j6535j6016j5709j5523
$$ plain form
61079 770962 755594 740257 724988 710173 696189 683140 671285 661309 653636 647718 642595 638010
61067 638010 634413 631977 630223 628745 627799 628033 629926 633557 638579 644387 650565 657207 664597 672748 681546
61052 681546 691206 702044 713849 726038 738535 751994 766994 783475 801257 820686 842326 866188
61040 866188 891636 918079 945577 974769 1006343 1040572 1077337 1116532 1158328 1202932 1250223
61029 1250223 1299822 1351441 1404900 1459786 1515375 1571086 1626998 1684070 1744121 1809600 1882923
61018 1882923 1965548 2057535 2158095 2266651 2383509 2509920 2648290 2803061 2981525 3193404
61008 3193404 3449502 3761251 4141841 4607320 5176611 5872024 6721818 7762944 9040537
60999 9040537 10601672 12478032 14649012 16991008 19251492 21099587 22258229 22643468
$$ packed form
61079G70962j5368j5337j5269j4815j3984j3049j1855r976p673n918n123m585
61067F38010l597k436j754j478r46K34J893L631N022N808O178O642P390Q151Q798
61052F81546R660J0838J1805J2189J2497J3459J5000J6481J7782J9429K1640K3862
61040H66188K5448K6443K7498K9192L1574L4229L6765L9195M1796M4604M7291
61029A250223M9599N1619N3459N4886N5589N5711N5912N7072O0051O5479P3323
61018A882923Q2625R1987J00560J08556J16858J26411J38370J54771J78464K11879
61008C193404K56098L11749L80590M65479N69291O95413Q49794J041126J277593
60999I040537J561135J876360K170980K341996K260484J848095J158642L85239
$$ plain form
60991 22643468 22409630 21868654 21351700 21104921 21245052 21738388 22385670 22853385 22789558
60982 22789558 21981884 20452819 18424446 16191037 13998773 11997350 10253037 8778676
60974 8778676 7555653 6549502 5723260 5045026 4488318 4030466 3652759 3340288 3079999
60965 3079999 2859608 2669011 2501461 2352382 2217821 2094783 1981920 1878708 1784311 1698005
60955 1698005 1620074 1551261 1491405 1439104 1392362 1349019 1306943 1264633 1221702 1178593 1136109
60944 1136109 1095425 1057937 1024368 994178 966226 939818 914816 891147 868689 847342 826782
60933 826782 806403 785900 765639 746102 727322 709268 692310 676696 661908 647208 632696
60922 632696 619254 607516 597325 588061 579048 569784 560312 551352 543687 537393 531886 526615 521422
$$ packed form
60991B2643468k33838n40976n16954k46779J40131M93336O47282M67715o3827
60982B2789558q07674j529065k028373k233409k192264k001423j744313j474361
60974H778676j223023j006151q26242o78234n56708m57852l77707l12471k60289
60965C079999k20391j90597j67550j49079j34561j23038j12863j03212r4397q6306
60955A698005p7931o8813n9856n2301m6742m3343m2076m2310m2931m3109m2484
60944A136109m0684l7488l3569l0190k7952k6408k5002k3669k2458k1347k0560
60933H26782k0379k0503k0261j9537j8780j8054j6958j5614j4788j4700j4512
60922F32696j3442j1738j0191r264r013r264r472q960p665o294n507n271n193
$$ plain form
60909 521422 516457 512017 508349 505350 502681 500321 498650 497823 497564 497846 499119 501378 503708 505471 507291
60894 507291 509937 512773 514435 514797 515051 515854 516530 516294 515126 513130 509992 505633 500634 495482 489998
60879 489998 483933 477522 471020 464268 457287 450788 445490 441245 437390 433668 430265 427130 423852 420297
60865 420297 416960 414561 413413 413197 413345 413644 414381 415673 416821 416797 415422 413641 412512 412386 413159 414701
60849 414701 416643 418289 419205 419637 419930 419902 419249 418201 417224 416282 415000 413443 412098 411024 409571 407101
60833 407101 403629 399584 395280 390829 386350 382099 378509 376166 375499 376297 377688 378751 379174 379275 379457
60818 379457 379745 379840 379560 379085 378706 378390 377753 376541 374955 373419 372091 370723 368928 366542 363813 361288
60802 361288 359366 357877 356201 353934 351310 348902 347018 345486 343875 341847 339442 337115 335313 333971
$$ packed form
60909E21422m965m440l668k999k669k360j671q27k59K82J273K259K330J763J820
60894E07291K646K836J662L62K54Q03O76k36j168j996l138m359m999n152n484
60879D89998o065o411o502o752o981o499n298m245l855l722l403l135l278l555
60865D20297l337k399j148k16J48K99P37J292J148k4j375j781j129j26P73J542
60849D14701J942J646R16M32K93k8o53j048r77r42j282j557j345j074j453k470
60833D07101l472m045m304m451m479m251l590k343o67P98J391J063M23J01J82
60818C79457K88R5k80m75l79l16o37j212j586j536j328j368j795k386k729k525
60802C61288j922j489j676k267k624k408j884j532j611k028k405k327j802j342
$$ plain form
60788 333971 332594 330974 329454 328332 327327 325968 324189 322188 320024 317873 316368 315953 316021 315508 314442
60773 314442 314075 315100 316548 317152 317255 318521 321881 326484 330725 333735 335796 337789 340433 343733 346922
60758 346922 349143 350234 350692 350923 350918 350662 350422 350441 350725 351294 352275 353488 354402 354840 355380 356606 358233 359485
60740 359485 360074 360161 359441 357060 352659 346946 340956 335197 329858 325313 321844 319041 316037 312401 308517
60725 308517 305055 302345 300283 298606 297171 296041 295293 294718 293882 292635 291445 290980 291365 292047 292340 291971
60709 291971 291185 290560 290654 291554 292699 293385 293495 293563 294092 295049 296111 297155 298353 299903 301862 304096 306270
60692 306270 308008 309248 310312 311455 312479 313085 313570 314718 316816 319182 321061 322817 325692 330288 335714
60677 335714 340432 343578 345213 345796 345978 346720 348767 351783 354496 355964 356303 355935 354628 351826 347665
$$ packed form
60788C33971j377j620j520j122j005j359j779k001k164k151j505m15O8n13j066
60773C14442l67J025J448O04J03J266L360M603M241L010K061J993K644L300L189
60758C46922K221J091M58K31nk56k40J9K84N69R81J213R14M38N40J226J627J252
60740C59485N89Q7p20k381m401n713n990n759n339m545l469k803l004l636l884
60725C08517l462k710k062j677j435j130p48n75q36j247j190m65L85O82K93l69
60709B91971p86o25R4R00J145O86J10O8N29R57J062J044J198J550J959K234K174
60692C06270J738J240J064J143J024O06M85J148K098K366J879J756K875M596N426
60677C35714M718L146J635N83J82P42K047L016K713J468L39l68j307k802m161
$$ plain form
60662 347665 343119 339128 335910 333140 330506 328064 326277 325670 326218 327133 327521 327221 326789 326760 327302 328562
60646 328562 330861 334262 338182 341717 344283 345829 346575 346722 346380 345583 344272 342284 339441 335808 331928
60631 331928 328627 326398 325006 323849 322614 321374 320172 318897 317624 316749 316559 316879 317347 317906 318775 319981
60615 319981 321149 321818 321860 321532 321212 321207 321752 322936 324468 325650 325888 325338 324803 324880 325374 325710 325678 325578 325811
60596 325811 326589 327910 329486 330801 331591 332336 334010 337159 341256 345031 347405 348273 348429 348632 348685 347758
60580 347758 345687 343547 342578 342972 344206 346171 349191 353023 356731 359835 362991 367295 373377 381331 390955
60565 390955 401711 412902 424242 435857 447414 457639 465113 469249 470231 468389 464103 458055 451118
60552 451118 444015 437301 431419 426564 422812 420638 420872 423719 428164 432896 437576 442747 448855 456009
$$ packed form
60662C47665m546l991l218k770k634k442j787o07N48R15L88l00m32k9N42J260
60646C28562K299L401L920L535K566J546P46J47l42p97j311j988k843l633l880
60631C31928l301k229j392j157j235j240j202j275j273q75j90L20M68N59Q69J206
60615C19981J168O69M2l28l20nN45J184J532J182K38n50n35P7M94L36l2j00K33
60596C25811P78J321J576J315P90P45J674L149M097L775K374Q68J56K03N3r27
60580C47758k071k140r69L94J234J965L020L832L708L104L156M304O082P954R624
60565C90955J0756J1191J1340J1615J1557J0225P474M136R82j842m286o048o937
60552D51118p103o714n882m855l752k174K34K847M445M732M680N171O108P154
$$ plain form
60538 456009 464522 474935 487413 501689 517608 535012 552928 569489 583083 593212 599966 603122
60526 603122 602260 597635 590478 582278 573892 565396 556686 548070 540105 532902 525983 519074 512770 508007
60512 508007 505093 503680 503524 504663 506853 509455 512129 515247 519502 525525 533981 545447 559969 577253
60498 577253 597625 622222 651733 685390 721781 760272 800862 842797 884141 922835 957632
60487 957632 987856 1012798 1031671 1043828 1048719 1045846 1034939 1016032 989307 955186 914775 870031
60475 870031 823230 776377 731080 688660 649961 615147 583957 556206 531920 511040 493221
60464 493221 477977 464898 453692 444071 435633 427898 420586 413892 408292 403865 399932 395607 390718
60451 390718 385912 381864 378676 376174 374420 373485 372872 371627 369251 366257 363637 361972 361164 360834 360627
$$ packed form
60538D56009Q513J0413J2478J4276J5919J7404J7916J6561J3594J0129O754L156
60526F03122q62m625p157q200q386q496q710q616p965p203o919o909o304m763
60512E08007k914j413j56J139K190K602K674L118M255O023Q456J1466J4522J7284
60498E77253K0372K4597K9511L3657L6391L8491M0590M1935M1344L8694L4797
60487I57632L0224K4942J8873J2157M891k873j0907j8907k6725l4121m0411m4744
60475H70031m6801m6853m5297m2420l8699l4814l1190k7751k4286k0880j7819
60464D93221j5244j3079j1206r621q438p735p312o694n600m427l933m325m889
60451C90718m806m048l188k502j754r35o13j245k376k994k620j665q08l30k07
$$ plain form
60436 360627 360250 359528 358576 357705 357113 356767 356584 356549 356597 356578 356376 355900 354960 353427 351607 350136 349310 348804 348256
60417 348256 347821 347855 348393 349326 350773 352731 354602 355817 356859 358854 361966 364962 366718 367428 367888 368280
60401 368280 368423 368689 369715 371367 372815 373748 374813 376709 379339 382089 384469 386307 387681 388898 390302
60386 390302 392036 394161 396907 400439 404342 407816 410474 412613 414606 416455 418018 419301 420400 421577
60372 421577 423447 426546 430479 433992 436212 437385 438187 438848 439350 439930 440811 441731 442301 442622 443156 444228
60356 444228 445998 448590 451817 455152 458536 462937 469454 478074 487834 497926 507870 516810 523591 527762
60342 527762 529834 530260 528758 524917 519031 512027 504827 497923 491356 484995 479043 474185 470886 468644
60328 468644 466388 463560 460329 456892 453276 449824 447081 444926 442572 439735 437128 435393 434220 433099
$$ packed form
60436C60627l77p22r52q71n92l46j83l5M8j9k02m76r40j533j820j471q26n06n48
60417C48256m35L4N38R33J447J958J871J215J042J995L112K996J756P10M60L92
60401C68280J43K66J026J652J448R33J065J896K630K750K380J838J374J217J404
60386C90302J734K125K746L532L903L474K658K139J993J849J563J283J099J177
60372D21577J870L099L933L513K220J173Q02O61N02N80Q81R20N70L21N34J072
60356D44228J770K592L227L335L384M401O517Q620R760J0092R944Q940O781M171
60342E27762K072M26j502l841n886p004p200o904o567o361n952m858l299k242
60328D68644k256k828l231l437l616l452k743k155k354k837k607j735j173j121
$$ plain form
60314 433099 432365 432801 434578 437399 441462 447509 455870 466070 477583 490604 505848 523811 544258
60301 544258 566133 587684 606706 620962 628792 629707 624404 614019 599354 580959 559799 537426
60289 537426 515526 495645 479162 466819 458040 451327 445708 441347 438596 437045 435961 435112 434573 434111
60275 434111 433321 432123 430655 428872 426670 424156 421460 418611 415880 413769 412185 410216 407390 404621
60261 404621 403026 402173 400524 397468 393914 390889 388602 387050 386512 386919 387547 387836 388025 388544 389308 390073
60245 390073 390965 392184 393552 394823 396189 398007 400193 402226 403615 404146 403883 403231 402822 403067 403897 404982
60229 404982 406022 406787 407296 408111 409988 412867 415631 417254 417956 418785 420320 422279 424249 426194 428168
60214 428168 430039 431723 433490 435821 439088 443411 448668 454525 460580 466622 472806 479549 487135 495319
$$ packed form
60314D33099p34M36J777K821M063O047Q361J0200J1513J3021J5244J7963K0447
60301E44258K1875K1551J9022J4256P830R15n303j0385j4665j8395k1160k2373
60289E37426k1900j9881j6483j2343q779o713n619m361k751j551j084q49n39m62
60275D34111p90j198j468j783k202k514k696k849k731k111j584j969k826k769
60261D04621j595q53j649l056l554l025k287j552n38M07O28K89J89N19P64P65
60245C90073Q92J219J368J271J366J818K186K033J389N31k63o52m09K45Q30J085
60229D04982J040P65N09Q15J877K879K764J623P02Q29J535J959J970J945J974
60214D28168J871J684J767K331L267M323N257N857O055O042O184O743P586Q184
$$ plain form
60200 495319 503362 510667 517366 524085 531082 537897 543927 549066 553576 557614 561147 564103 566328 567570
60186 567570 567864 567821 568104 568547 568089 565723 561428 556178 551109 546645 542306 537419 532051 527053 523047 519658
60170 519658 516058 512013 507975 504308 500997 498079 495742 493715 491161 487602 483622 480242 477891 476370
60156 476370 475507 475269 475381 475458 475610 476395 477953 479662 480875 481635 482277 482726 482692 482425 482710 483992 485905 487786
60138 487786 489409 491052 493102 495805 499274 503477 508180 513008 517626 521877 525843 529753 533744 537655
60124 537655 541094 543709 545349 546080 546240 546485 547453 549246 551379 553385 555315 557467 559825 562049 564016
60109 564016 566055 568556 571472 574292 576412 577426 577175 575749 573541 571169 569084 567191 564981 562132
60095 562132 558800 555255 551462 547314 543126 539548 537001 535515 535034 535428 536189 536609 536461 536023 535271 533646
$$ packed form
60200D95319Q043P305O699O719O997O815O030N139M510M038L533K956K225J242
60186E67570K94m3K83M43m58k366m295n250n069m464m339m887n368m998m006l389
60170E19658l600m045m038l667l311k918k337k027k554l559l980l380k351j521
60156D76370q63k38J12P7J52P85J558J709J213P60O42M49l4k67K85J282J913J881
60138D87786J623J643K050K703L469M203M703M828M618M251L966L910L991L911
60124E37655L439K615J640P31J60K45R68J793K133K006J930K152K358K224J967
60109E64016K039K501K916K820K120J014k51j426k208k372k085j893k210k849
60095E62132l332l545l793m148m188l578k547j486m81L94P61M20j48m38p52j625
$$ plain form
60079 533646 531048 528554 527399 527468 527465 526581 525368 524823 525055 525086 523660 520092 514567 507858 500711 493466 486262
60062 486262 479370 473088 467491 462598 458639 455727 453331 450521 446870 442800 439004 435904 433724 432627
60048 432627 432501 432889 433408 434151 435560 438011 441518 445587 449361 452310 454907 458277 462919 468104 472762
60033 472762 476680 480470 484553 488586 491874 494005 495014 495127 494459 492936 490461 487184 483511 479792 476082
60018 476082 472220 468000 463196 457630 451381 444836 438376 432105 425980 420104 414690 409801 405367 401482
60004 401482 398439 396282 394442 392119 389153 386355 384695 384237 384161 383886 383765 384417 385722 386969 387861 388844
59988 388844 390388 392396 394482 396470 398406 400370 402494 404961 407793 410797 413838 416905 419704 421504
59974 421504 421791 420980 420072 419566 418999 417695 415732 413884 412667 411740 410393 408463 406484 404985 403997 403362
$$ packed form
60079E33646k598k494j155O9lq84j213n45K32L1j426l568n525o709p147p245p204
60062D86262o892o282n597m893l959k912k396k810l651m070l796l100k180j097
60048D32627j26L88N19P43J409K451L507M069L774K949K597L370M642N185M658
60033D72762L918L790M083M033L288K131J009J13o68j523k475l277l673l719l710
60018D76082l862m220m804n566o249o545o460o271o125n876n414m889m434l885
60004D01482l043k157j840k323k966k798j660m58p6k75j21O52J305J247Q92R83
59988C88844J544K008K086J988J936J964K124K467K832L004L041L067K799J800
59974D21504K87q11r08n06n67j304j963j848j217r27j347j930j979j499r88o35
$$ plain form
59958 403362 403209 403798 405091 406729 408348 409675 410497 410852 411116 411534 411794 411455 410649 409860 409136 408114 406865
59941 406865 406038 405922 405982 405681 405225 405076 405189 405248 405309 405658 406181 406446 406310 406030 405827 405802 406301 407913 410935
59922 410935 415079 419797 424718 429702 434708 439762 444953 450281 455474 459959 463132 464856 465763 466906
59908 466906 468954 471729 474578 477076 479335 481716 484344 486908 488952 490458 491942 493736 495321 495801
59894 495801 495054 493966 493398 493384 493621 494220 495538 497542 499848 502223 504645 506985 509080 511108 513506 516440
59878 516440 519667 522997 526605 530770 535477 540381 545075 549239 552536 554380 554048 551323 547105 543007
59864 543007 540076 538019 535843 533096 530258 528109 527067 527106 528008 529587 531799 534712 538378 542826 548250
59849 548250 555094 563760 574156 585432 596010 603965 607754 606983 602613 596526 590866 587300 586261 586661
$$ packed form
59958D03362j53N89J293J638J619J327Q22L55K64M18K60l39q06p89p24j022j249
59941D06865q27j16O0l01m56j49J13N9O1L49N23K65j36k80k03k5M99J612L022
59922D10935M144M718M921M984N006N054N191N328N193M485L173J724R07J143
59908D66906K048K775K849K498K259K381K628K564K044J506J484J794J585M80
59894D95801p47j088n68j4K37N99J318K004K306K375K422K340K095K028K398K934
59878E16440L227L330L608M165M707M904M694M164L297J844l32k725m218m098
59864E43007k931k057k176k747k838k149j042L9R02J579K212K913L666M448N424
59849E48250O844Q666J0396J1276J0578P955L789p71m370o087n660l566j039M00
$$ plain form
59835 586661 586681 585036 581322 575404 567165 557031 546087 535266 524969 515816 509084 505626 504644 504279
59821 504279 503348 502000 500846 500084 499458 498537 496903 494406 491303 487951 484493 481092 478160 475942 474097
59806 474097 472189 470418 469254 468486 467361 465729 464402 464137 464740 465434 465736 465659 465357 464858 464097 463101 462197
59789 462197 461874 462230 462713 462705 462205 461558 460716 459327 457500 455818 454512 453214 451685 450161 448736 447060
59773 447060 445109 443721 443796 445279 447393 449579 451600 453011 453330 452904 453026 454834 458335 462701 467181
59758 467181 471452 475337 478764 482069 485887 490465 495338 500036 504901 510806 518107 526307 534787 543341
59744 543341 551812 559700 566505 572187 576915 580682 583520 585818 587954 589799 591020 591716 592271 592660 592338
59729 592338 590802 587943 583997 579541 575422 572173 569518 566808 563918 561311 559327 557909 556937 556295 555566
$$ packed form
59835E86661K0j645l714n918q239j0134j0944j0821j0297r153o732l458r82l65
59821E04279r31j348j154p62o26r21j634k497l103l352l458l401k932k218j845
59806D74097j908j771j164p68j125j632j327k65O03O94L02p7l02m99p61r96r04
59789D62197l23L56M83qn00o47q42j389j827j682j306j298j529j524j425j676
59773D47060j951j388P5J483K114K186K021J411L19m26J22J808L501M366M480
59758D67181M271L885L427L305L818M578M873M698M865N905P301Q200Q480Q554
59744E43341Q471P888O805N682M728L767K838K298K136J845J221O96N55L89l22
59729E92338j536k859l946m456m119l249k655k710k890k607j984j418r72o42p29
$$ plain form
59714 555566 554264 552459 550696 549172 547501 545489 543642 542600 542370 542346 541927 541027 540182 540100 540833 541529 541403
59697 541403 540852 541169 543199 546793 551390 556392 560917 564061 565750 566724 567427 567508 566678 565393 564274 563436
59681 563436 562780 562383 562129 561508 560313 559062 558122 556825 554064 549568 544095 538597 533548 528873 524113
59666 524113 518918 513704 509464 506583 504309 501835 499418 497818 497096 496833 497207 498898 501862 505032 507454
59651 507454 509146 510705 512645 515291 518750 522649 526244 529064 531145 532480 532611 531097 528167 524519
59637 524519 520558 516084 510824 505088 499719 495385 492034 489197 486667 484636 483184 482039 480949 479933
59623 479933 478902 477438 475292 472837 470563 468291 465284 461128 456165 451122 446616 442958 440080 437638
59609 437638 435401 433493 432100 431092 430268 429873 430485 432315 434861 437272 438934 439781 440339 441406 443427
$$ packed form
59714E55566j302j805j763j524j671k012j847j042k30k4m19r00q45q2P33O96j26
59697E41403n51L17K030L594M597N002M525L144J689R74P03Q1q30j285j119q38
59681E63436o56l97k54o21j195j251r40j297k761m496n473n498n049m675m760
59666E24113n195n214m240k881k274k474k417j600p22k63L74J691K964L170K422
59651E07454J692J559J940K646L459L899L595K820K081J335J31j514k930l648
59637E24519l961m474n260n736n369m334l351k837k530k031j452j145j090j016
59623D79933j031j464k146k455k274k272l007m156m963n043m506l658k878k442
59609D37638k237j908j393j008q24l95O12J830K546K411J662Q47N58J067K021
$$ plain form
59594 443427 446054 448451 449976 450511 450330 449873 449525 449378 449274 449181 449283 449452 448987 447327 444891 442772 441618
59577 441618 441176 440786 439887 438115 435401 432116 428788 425635 422682 420226 418640 417700 416633 415102 413697
59562 413697 413186 413564 414119 414187 413594 412629 411834 411677 412165 412924 413777 415049 417052 419467 421591 423171 424664
59545 424664 426638 429165 431972 435004 438638 443433 449856 458231 468769 481587 496935 515341 536862
59532 536862 559513 578696 589262 588902 579541 565459 550467 536828 525770 517836 512743 509691 508069
59519 508069 507623 508062 508989 510261 511948 513859 515486 516429 516445 515093 511859 506896 501219 495812 490763 485460
59503 485460 479376 472516 465326 458442 452336 446964 441841 436659 431762 427844 425249 423675 422541 421570
59489 421570 421029 421441 422982 425174 427213 428616 429524 430456 431863 433810 435955 437920 439834 442333 445819
$$ packed form
59594D43427K627K397J525N35j81m57l48j47j04r3J02J69m65j660k436k119j154
59577D41618m42l90q99j772k714l285l328l153k953k456j586r40j067j531j405
59562D13697n11L78N55O8n93r65p95j57M88P59Q53J272K003K415K124J580J493
59545D24664J974K527K807L032L634M795O423Q375J0538J2818J5348J8406K1521
59532E36862K2651J9183J0566l60r361j4082j4992j3639j1058p934n093l052j622
59519E08069m46M39R27J272J687J911J627R43J6j352l234m963n677n407n049n303
59503D85460o084o860p190o884o106n372n123n182m897l918k595j574j134r71
59489D21570n41M12J541K192K039J403R08R32J407J947K145J965J914K499L486
$$ plain form
59474 445819 449851 453624 456916 460184 463738 467237 470126 472263 473960 475621 477468 479394 481013 482023
59460 482023 482541 482874 483082 483125 483425 484775 487485 491031 494807 498877 503710 509446 515774 522364 529093 535903
59444 535903 542715 549403 555619 560608 563394 563275 560286 555312 549662 544195 538766 532759 526222 520197
59430 520197 515745 512919 510878 508809 506468 504070 502035 500840 500913 502570 506043 511429 518566 527197 537429
59415 537429 549846 564993 582938 603527 626899 653514 683551 715994 747672 773145 786596
59404 786596 785256 771490 751284 730567 712933 700129 693438 694001 702055 716009 731901 743863
59392 743863 746262 736605 716674 690769 662996 636165 612230 592511 577306 566055 558211 553501
59380 553501 551219 549980 548762 547828 548064 549645 551906 554364 557144 560304 563428 566298 569465 573584 578381
$$ packed form
59474D45819M032L773L292L268L554L499K889K137J697J661J847J926J619J010
59460D82023N18L33K08M3L00J350K710L546L776M070M833N736O328O590O729O810
59444E35903O812O688O216M989K786j19k989m974n650n467n429o007o537o025
59430E20197m452k826k041k069k341k398k035j195P3J657L473N386P137Q631J0232
59415E37429J2417J5147J7945K0589K3372K6615L0037L2443L1678K5473J3451
59404G86596j340j3766k0206k0717j7634j2804o691N63Q054J3954J5892J1962
59392G43863K399r657j9931k5905k7773k6831k3935j9719j5205j1251p844m710
59380E53501k282j239j218r34K36J581K261K458K780L160L124K870L167M119M797
$$ plain form
59365 578381 582775 586025 588365 590445 592580 594676 596642 598587 600742 603375 606661 610458 614367 618235
59351 618235 622570 628073 634722 641644 648187 654796 662434 671321 680836 690656 701318 713260 725845
59338 725845 737876 748746 758482 766884 773409 777990 781282 783819 785382 785356 783250 778741 771825 763293
59324 763293 754462 745954 737181 727512 717445 707968 699195 690480 681779 673983 667748 662704 658098 653679
59310 653679 649620 646027 642910 640370 638491 637234 636733 637554 640473 646084 654721 666407 680301 694036
59296 694036 703981 706802 701237 688582 671518 652502 633124 614467 597424 582583 570207 560504
59284 560504 553518 548621 544642 540896 537732 535750 534890 534709 535098 536120 537522 539189 541802 546219 552263
59269 552263 559022 566381 575328 586403 598617 610422 621197 631328 641197 650541 658518 664098 666642
$$ packed form
59365E78381M394L250K340K080K135K096J966J945K155K633L286L797L909L868
59351F18235M335N503O649O922O543O609P638Q887R515R820J0662J1942J2585
59338G25845J2031J0870R736Q402O525M581L292K537J563k6k106m509o916q532
59324G63293q831q508q773r669j0067r477q773q715q701p796o235n044m606m419
59310F53679m059l593l117k540j879j257n01Q21K919N611Q637J1686J3894J3735
59296F94036R945K821n565j2655j7064j9016j9378j8657j7043j4841j2376r703
59284E60504o986m897l979l746l164j982q60j81L89J022J402J667K613M417O044
59269E52263O759P359Q947J1075J2214J1805J0775J0131R869R344P977N580K544
$$ plain form
59256 666642 666408 664247 660636 655345 648155 639485 630069 620506 611412 603556 597344 592526 588861 586725
59242 586725 586584 588043 589990 591585 592725 593638 594550 595811 597925 601196 605400 609933 614243 618143 621778
59227 621778 625257 628395 630907 632757 634050 634609 634034 632265 629695 626594 622770 617979 612313 606047 599508
59212 599508 593328 588326 584685 581595 578148 574310 570607 567160 563662 560109 556977 554595 552833 551453
59198 551453 550354 549380 548237 546787 545277 544154 543703 543805 543963 543740 543333 543476 544540 545975 547032 547854
59182 547854 549431 552536 557070 562370 567743 572661 576938 580920 585225 590156 595480 600783 605743 610047
59168 610047 613452 616113 618635 621584 625086 628998 633255 637841 642587 647248 651701 655852 659325 661430
59154 661430 661624 659937 656830 652610 647166 640340 632431 624099 615831 607714 599675 591677 583664 575591
$$ packed form
59256F66642k34k161l611n291p190q670r416r563r094p856o212m818l665k136
59242E86725j41J459J947J595J140R13R12J261K114L271M204M533M310L900L635
59227F21778L479L138K512J850J293N59n75j769k570l101l824m791n666o266o539
59212E99508o180n002l641l090l447l838l703l447l498l553l132k382j762j380
59198E51453j099r74j143j450j510j123m51J02J58k23m07J43J064J435J057Q22
59182E47854J577L105M534N300N373M918M277L982M305M931N324N303M960M304
59168F10047L405K661K522K949L502L912M257M586M746M661M453M151L473K105
59154F61430J94j687l107m220n444o826p909q332q268q117q039p998q013q073
$$ plain form
59140 575591 567611 560017 552907 546161 539795 533988 528654 523371 518018 513166 509445 506742 504398 502063
59126 502063 500065 499016 499337 501074 503910 507372 511179 515323 519845 524794 530473 537258 544885 552399
59112 552399 559245 566008 573635 582258 591379 600779 610425 619664 627408 633251 637759 641530 644661 647267
59098 647267 649792 652435 654765 656264 656847 656627 655667 654246 652923 651960 651059 649906 648547 646981 644911
59083 644911 642360 640017 638360 636761 634117 630156 625445 620241 614022 606378 597782 589246 581522 574816
59069 574816 569031 564013 559684 556009 552811 549691 546289 542570 538647 534448 529863 525206 521149 518054
59055 518054 515573 513067 510289 507589 505627 504853 505068 505422 505022 503651 501798 500069 498801 498227 498564 499726
59039 499726 501163 502259 502714 502487 501648 500531 499768 499820 500564 501608 502906 504772 507408 510690 514381 518332
$$ packed form
59140E75591p980p594p110o746o366n807n334n283n353m852l721k703k344k335
59126E02063j998j049L21J737K836L462L807M144M522M949N679O785P627P514
59112E52399O846O763P627Q623R121R400R646R239P744N843M508L771L131K606
59098F47267K525K643K330J499N83k20r60j421j323r63r01j153j359j566k070
59083F44911k551k343j657j599k644l961m711n204o219p644q596q536p724o706
59069E74816n785n018m329l675l198l120l402l719l923m199m585m657m057l095
59055E18054k481k506k778k700j962p74K15L54m00j371j853j729j268n74L37J162
59039D99726J437J096M55k27q39j117p63N2P44J044J298J866K636L282L691L951
$$ plain form
59023 518332 522556 527401 533548 541569 551503 563108 576255 590605 605059 618245 629695 639948
59011 639948 649252 656765 661408 662992 662073 659168 654742 649676 645005 641122 637674 634309 631285 629400
58997 629400 629592 632424 637570 643801 649676 654270 657193 658427 658498 658385 658597 658543 657335 654972 652111 648901
58981 648901 645005 640788 637522 636010 635699 635592 635522 636145 638145 641878 647399 654390 662292 670805 680071
58966 680071 690194 700916 711953 723210 734389 744798 753906 761796 768796 774979 780253 784551 787560
58953 787560 788667 787550 784525 779886 773242 764035 752534 739864 727105 714642 702254 689521 676338
58940 676338 663333 651667 642132 634571 628322 622961 618343 614248 610409 606768 603436 600537 598267 596833
58926 596833 596130 595763 595635 596115 597324 598622 599247 599102 598532 597644 596323 594699 593138 591958 591430 591743 592575
$$ packed form
59023E18332M224M845O147Q021R934J1605J3147J4350J4454J3186J1450J0253
59011F39948R304P513M643J584r19k905m426n066m671l883l448l365l024j885
58997F29400J92K832N146O231N875M594K923J234P1j13K12n4j208k363k861l210
58981F48901l896m217l266j512l11j07p0O23K000L733N521O991P902Q513R266
58966F80071J0123J0722J1037J1257J1179J0409R108P890P000O183N274M298L009
58953G87560J107j117l025m639o644r207j1501j2670j2759j2463j2388j2733j3183
58940F76338j3005j1666r535p561o249n361m618m095l839l641l332k899k270j434
58926E96833p03l67j28M80J209J298O25j45n70q88j321j624j561j180n28L13Q32
$$ plain form
58909 592575 593157 593224 593512 594794 596898 599332 602417 606975 613178 620628 629402 640017 652284 665049
58895 665049 677282 688746 699489 709459 718848 728167 737652 747163 756953 768006 781231 796579 813163
58882 813163 829904 845919 860654 873848 885209 894184 900408 904280 906587 907453 906137 901961 894959
58869 894959 885581 874328 861956 849591 838252 828386 819896 812340 805131 797945 791025 784733 778836
58856 778836 772658 765877 758662 750987 742460 733002 723210 713789 705025 696916 689386 682224 675245 668635
58842 668635 662701 657301 652025 646914 642244 637476 631291 623064 613627 604177 595119 586506 578922 573130
58828 573130 569153 566368 564278 562689 561405 560309 559592 559441 559673 560064 560830 562375 564767 567900 571968
58813 571968 577163 583004 588440 592770 596099 598912 601557 604231 607092 610127 612974 614993 615583 614524
$$ packed form
58909E92575N82O7K88J282K104K434L085M558O203P450Q774J0615J2267J2765
58895F65049J2233J1464J0743R970R389R319R485R511R790J1053J3225J5348J6584
58882H13163J6741J6015J4735J3194J1361Q975O224L872K307Q66j316m176p002
58869H94959r378j1253j2372j2365j1339r866q490p556p209p186o920o292n897
58856G78836o178o781p215p675q527r458r792r421q764q109p530p162o979o610
58842F68635n934n400n276n111m670m768o185q227r437r450r058q613p584n792
58828E73130l977k785k090j589j284j096p17j51K32L91P66J545K392L133M068
58813E71968N195N841N436M330L329K813K645K674K861L035K847K019N90j059
$$ plain form
58799 614524 612056 608588 604315 599265 593652 587931 582406 577010 571584 566129 560750 555594 550975 547248
58785 547248 544412 542118 540230 539083 539009 539904 541572 544196 548117 553215 558795 564039 568437 571841 574267
58770 574267 575614 575536 573645 569776 563914 556089 546821 537606 530279 525458 521942 518032 513274 508654 505343
58755 505343 503611 502836 502252 501603 501257 501735 503221 505603 508801 512706 516844 520509 523412 525881 528301
58740 528301 530729 533144 535732 538720 542203 546284 551056 556324 561685 567010 572514 578229 583775 588808
58726 588808 593255 596946 599546 601141 602442 604037 605741 607021 607729 608135 608595 609506 611263 613965 617405
58711 617405 621521 626452 631972 637387 642277 646764 650671 653115 653531 652490 650731 647831 642702 635085
58697 635085 625688 615041 603214 590655 578272 566368 554348 541949 530117 520076 511997 505212
$$ packed form
58799F14524k468l468m273n050n613n721n525n396n426n455n379n156m619l727
58785E47248k836k294j888j147p4Q95J668K624L921N098N580N244M398L404K426
58770E74267J347p8j891l869n862p825r268r215p327m821l516l910m758m620l311
58755E05343j732p75n84o49l46M78J486K382L198L905M138L665K903K469K420
58740E28301K428K415K588K988L483M081M772N268N361N325N504N715N546N033
58726E88808M447L691K600J595J301J595J704J280P08M06M60R11J757K702L440
58711F17405M116M931N520N415M890M487L907K444M16j041j759k900n129p617
58697F35085r397j0647j1827j2559j2383j1904j2020j2399j1832j0041q079o785
$$ plain form
58685 505212 499489 495339 492960 491444 489449 486464 483046 479835 476763 473445 470021 467130 465108 463673
58671 463673 462497 461685 461470 461844 462849 464963 468779 474262 480613 486963 493104 499487 506450 513480 519364
58656 519364 523143 524707 524331 522047 517952 512839 507852 503523 499690 496230 493192 490257 486980 483735
58642 483735 481497 480347 479069 476798 474227 472501 471602 470715 469741 469464 470344 471888 473303 474296 475260 476902
58626 476902 479542 482518 484578 485085 484518 483647 482826 482415 483071 484920 487008 488437 489640 491712 494855 498329
58610 498329 501718 505278 509087 512768 516191 519751 523717 527789 531388 533959 535117 535040 534713 535163 536367
58595 536367 537365 537491 536961 536242 535454 534613 533978 533824 534135 534765 535776 537560 540664 545468 551879 559366 567418
58578 567418 575872 584727 593862 603028 611888 619955 626897 633056 639288 646058 653109 660215 667685 675863
$$ packed form
58685E05212n723m150k379j516j995k985l418l211l072l318l424k891k022j435
58671D63673j176q12k15L74J005K114L816N483O351O350O141O383O963P030N884
58656E19364L779J564l76k284m095n113m987m329l833l460l038k935l277l245
58642D83735k238j150j278k271k571j726q99q87r74k77Q80J544J415R93R64J642
58626D76902K640K976K060N07n67q71q21m11O56J849K088J429J203K072L143L474
58610D98329L389L560L809L681L423L560L966M072L599K571J158p7l27M50J204
58595E36367R98J26n30p19p88q41o35j54L11O30J011J784L104M804O411P487Q052
58578E67418Q454Q855R135R166Q860Q067O942O159O232O770P051P106P470Q178
$$ plain form
58564 675863 684794 694876 707188 722463 740194 759399 779764 801366 823765 846169 868117 889154
58552 889154 908080 923375 934210 940478 942262 940163 935767 930721 925408 919383 912940 907188 902560
58539 902560 898189 892870 885745 876012 863002 846978 829162 810681 791989 773443 755713 739428
58527 739428 724935 712575 702641 694935 688819 683744 679323 675142 671160 668133 666745 666342 665365 663081
58513 663081 660062 656936 653662 650276 647371 645411 644296 643886 644233 644944 645110 644286 642956 641633 640186
58498 640186 638520 637289 637327 638715 640774 642710 644015 644621 645009 645838 647360 649513 652548 656907 662355
58483 662355 667883 672791 677375 682315 688047 695031 703937 715030 727830 741823 757091 773734 790942
58470 790942 807091 820617 830565 836611 838965 838147 834607 828650 820781 811911 803075 795131 788768 784543
$$ packed form
58564F75863Q931J0082J2312J5275J7731J9205K0365K1602K2399K2404K1948K1037
58552H89154J8926J5295J0835O268J784k099m396n046n313o025o443n752m628
58539I02560m371n319p125r733j3010j6024j7816j8481j8692j8546j7730j6285
58527G39428j4493j2360r934p706o116n075m421m181l982l027j388m03r77k284
58513F63081l019l126l274l386k905j960j115m10L47P11J66q24j330j323j447
58498F40186j666j231L8J388K059J936J305O06L88Q29J522K153L035M359N448
58483F62355N528M908M584M940N732O984Q906J1093J2800J3993J5268J6643J7208
58470G90942J6149J3526R948O046K354q18l540n957p869q870q836p944o363m225
$$ plain form
58456 784543 782747 783316 785940 790251 796129 803922 814038 826031 838469 850007 860202 868802 874835
58443 874835 877167 875662 871063 864065 855333 846035 837276 829135 821228 814105 808989 806179 804934 805087
58429 805087 807459 812233 818080 823561 828597 834012 840427 848124 857242 867410 877656 887190 895885 903652
58415 903652 909819 913496 914186 911917 907249 901205 894577 887276 879025 870644 863721 858837 855057 851387
58401 851387 847772 844374 841010 837942 836280 836829 839101 842048 845157 848423 851909 855949 861143 867500
58387 867500 874051 879793 884599 888890 892943 896904 900965 905105 909162 913404 918477 924519 930970 937528
58373 937528 944594 952423 960529 968344 975850 983192 990382 997757 1006088 1015816 1026686 1038430 1051132
58360 1051132 1064652 1078376 1091892 1105339 1118905 1132699 1147176 1162711 1178472 1192673 1204338
$$ packed form
58456G84543j796N69K624M311N878P793J0116J1993J2438J1538J0195Q600O033
58443H74835K332j505m599o998q732r298q759q141p907p123n116k810j245J53
58429H05087K372M774N847N481N036N415O415P697R118J0168J0246R534Q695P767
58415I03652O167L677O90k269m668o044o628p301q251q381o923m884l780l670
58401H51387l615l398l364l068j662N49K272K947L109L266L486M040N194O357
58387H67500O551N742M806M291M053L961M061M140M057M242N073O042O451O558
58373I37528P066P829Q106P815P506P342P190P375Q331R728J0870J1744J2702
58360A051132J3520J3724J3516J3447J3566J3794J4477J5535J5761J4201J1665
$$ plain form
58349 1204338 1213913 1221912 1228084 1232441 1236013 1239909 1244519 1250148 1257385 1266163 1275496 1284924 1295321 1307520
58335 1307520 1321048 1335107 1349936 1366229 1383826 1401964 1420374 1439413 1459443 1480586 1502567
58324 1502567 1524392 1544787 1563375 1580726 1596972 1611301 1623303 1633795 1643720 1653152 1662076 1671207
58312 1671207 1681256 1692158 1703728 1716354 1730398 1745665 1762072 1780111 1800099 1821694 1844512
58301 1844512 1868289 1892173 1915086 1937390 1960996 1987115 2015001 2043444 2072221 2101399 2130635
58290 2130635 2160122 2190954 2223584 2257103 2290950 2326101 2363519 2402699 2442843 2484230 2527278
58279 2527278 2571401 2616104 2662194 2710671 2761328 2813489 2867169 2922469 2978830 3035956 3094528
58268 3094528 3155094 3217239 3280665 3346014 3413928 3484595 3558861 3638096 3722025 3808403 3895913
$$ packed form
58349A204338R575P999O172M357L572L896M610N629P237Q778R333R428J0397J2199
58335A307520J3528J4059J4829J6293J7597J8138J8410J9039K0030K1143K1981
58324A502567K1825K0395J8588J7351J6246J4329J2002J0492R925R432Q924R131
58312A671207J0049J0902J1570J2626J4044J5267J6407J8039J9988K1595K2818
58301A844512K3777K3884K2913K2304K3606K6119K7886K8443K8777K9178K9236
58290B130635K9487L0832L2630L3519L3847L5151L7418L9180M0144M1387M3048
58279B527278M4123M4703M6090M8477N0657N2161N3680N5300N6361N7126N8572
58268C094528O0566O2145O3426O5349O7914P0667P4266P9235Q3929Q6378Q7510
$$ plain form
58257 3895913 3985723 4079043 4175089 4272798 4372694 4475459 4580468 4687398 4797673 4912735
58247 4912735 5032475 5156861 5287253 5424545 5567925 5717159 5874171 6040613 6215954
58238 6215954 6399805 6593912 6799799 7016780 7244548 7485396 7741414 8011822 8295832
58229 8295832 8596008 8916032 9257267 9620303 10007719 10422403 10865309 11337929 11844783
58220 11844783 12390567 12977247 13607235 14287034 15024451 15824886 16694045 17641797 18679743
58211 18679743 19817998 21068626 22449687 23982053 25685776 27584626 29711463 32104819
58203 32104819 34804861 37860649 41341728 45341408 49977290 55400633 61808089 69443502
58195 69443502 78595647 89603651 102864452 118833615 138026813 161019343 188399077
$$ packed form
58257C895913Q9810R3320R6046R7709R9896J02765J05009J06930J10275J15062
58247D912735J19740J24386J30392J37292J43380J49234J57012J66442J75341
58238F215954J83851J94107K05887K16981K27768K40848K56018K70408K84010
58229H295832L00176L20024L41235L63036L87416M14684M42906M72620N06854
58220A1844783N45784N86680O29988O79799P37417Q00435Q69159R47752J037946
58211A8679743J138255J250628J381061J532366J703723J898850K126837K393356
58203C2104819K700042L055788L481079L999680M635882N423343O407456P635413
58195F9443502R152145J1008004J3260801J5969163J9193198K2992530K7379734
$$ plain form
58188 188399077 220604481 257594124 298344354 340314440 379259241 409853348 427190597
58181 427190597 428495535 414039127 386759972 351004420 311224607 271149427 233429771
58174 233429771 199589482 170198008 145189447 124177105 106648504 92060428 79903249
58167 79903249 69743358 61223449 54042495 47951555 42758016 38313150 34491917 31188430
58159 31188430 28320353 25822233 23633947 21701927 19986676 18459188 17091400 15856879
58151 15856879 14737901 13723836 12803552 11965286 11201916 10509635 9881910 9309905 8787869
58142 8787869 8313046 7880798 7484127 7117263 6775743 6453914 6146561 5852725 5574539
58133 5574539 5312722 5066091 4834506 4618909 4418801 4232331 4058404 3896402 3744684
$$ packed form
58188A88399077L2205404L6989643M0750230M1970086L8944801L0594107J7337249
58181D27190597J304938j4456408k7279155l5755552l9779813m0075180l7719656
58174B33429771l3840289k9391474k5008561k1012342j7528601j4588076j2157179
58167G9903249j0159891q519909p180954o090940n193539m444866l821233l303487
58159C1188430k868077k498120k188286j932020j715251j527488j367788j234521
58151A5856879j118978j014065r20284q38266p63370o92281o27725n72005n22036
58142H787869m74823m32248l96671l66864l41520l21829l07353k93836k78186
58133E574539k61817k46631k31585k15597k00108j86470j73927j62002j51718
$$ plain form
58124 3744684 3601661 3467436 3342249 3224438 3112096 3005521 2905803 2812281 2723595 2639831
58114 2639831 2561166 2485726 2411403 2338739 2269571 2203948 2140845 2080871 2025467 1974008 1924193
58103 1924193 1874907 1826674 1779883 1734590 1691400 1650589 1611035 1571837 1534112 1499302 1466726
58092 1466726 1434901 1404233 1376088 1350089 1324827 1300526 1278470 1258221 1237881 1216931 1196414
58081 1196414 1176449 1155905 1134709 1114337 1095661 1078061 1060871 1044105 1027581 1010848 994069
58070 994069 977685 961284 944169 926819 910321 894626 878878 863296 849141 836852 825700
58059 825700 815224 805598 796640 787790 779002 770366 761106 750372 738806 727833 717555 706937 695986
58046 695986 686124 678240 671836 666271 661417 656820 651606 645596 639466 633544 627453 621077 614826 608830
$$ packed form
58124C744684j43023j34225j25187j17811j12342j06575r9718r3522q8686q3764
58114B639831p8665p5440p4323p2664o9168o5623o3103n9974n5404n1459m9815
58103A924193m9286m8233m6791m5293m3190m0811l9554l9198l7725l4810l2576
58092A466726l1825l0668k8145k5999k5262k4301k2056k0249k0340k0950k0517
58081A196414j9965k0544k1196k0372j8676j7600j7190j6766j6524j6733j6779
58070I94069j6384j6401j7115j7350j6498j5695j5748j5582j4155j2289j1152
58059H25700j0476r626q958q850q788q636r260j0734j1566j0973j0278j0618j0951
58046F95986r862p884o404n565m854m597n214o010o130n922o091o376o251n996
$$ plain form
58032 608830 602797 596727 590840 584817 578071 570613 562752 554233 544813 535347 526976 519419 511481 503161
58018 503161 495718 489533 483517 476999 470797 465795 461690 457762 453901 450223 446512 442615 438788 435275
58004 435275 432082 429327 427158 425226 422969 420548 418803 418126 418042 418014 418013 418276 419139 421116 424475 428733 433109
57987 433109 437254 440939 443420 444033 443170 441751 439964 437463 434440 431355 427890 423444 418504 414241 410860
57972 410860 407742 405092 403833 403701 403170 401724 400613 400708 401149 400993 400801 401444 402390 402420 401445 400506 400340 400696
57954 400696 400734 399526 396605 392552 388700 385889 383908 382343 381247 380690 380437 380596 381807 384239 387132
57939 387132 389960 393392 398346 404653 411407 418258 425625 433856 442759 451706 459682 465576 469036 470828
57925 470828 471855 472006 470450 466831 461645 455542 448773 441325 433299 425108 417472 411105 406225 402470
$$ packed form
58032F08830o033o070n887o023o746p458p861q519r420r466q371p557p938q320
58018E03161p443o185o016o518o202n002m105l928l861l678l711l897l827l513
58004D35275l193k755k169j932k257k421j745o77q4k8jK63Q63J977L359M258M376
57987D33109M145L685K481O13q63j419j787k501l023l085l465m446m940m263l381
57972D10860l118k650j259j32n31j446j111R5M41j56j92O43R46L0r75r39j66L56
57954D00696L8j208k921m053l852k811j981j565j096n57k53J59J211K432K893
57939C87132K828L432M954O307O754O851P367Q231Q903Q947P976N894L460J792
57925D70828J027J51j556l619n186o103o769p448q026q191p636o367m880l755
$$ plain form
57911 402470 399434 397091 395575 394735 394145 393481 392766 392391 392916 394626 397130 399520 401032 401515 401360 401179
57895 401179 401455 402295 403490 404884 406445 407881 408627 408572 408387 408601 408784 408311 407562 407430 407842 407743 406583 404842
57877 404842 402956 400663 397751 394597 391550 388476 385360 382713 380915 379697 378702 378094 378207 378972 380019
57862 380019 381007 381701 382218 383312 385843 389734 394099 398581 403823 410244 417131 423550 429493 435496 441619
57847 441619 447444 452645 456895 459537 460090 458990 457321 455864 454587 452798 449540 444302 437743 431406
57833 431406 426302 422131 418197 414525 411523 409052 406616 404236 402479 401750 402148 403792 406586 409762 412346
57818 412346 414170 415883 418002 420520 423340 426286 428416 428126 424527 418458 411702 405390 399425 393225
57804 393225 386596 379950 374008 369370 366187 364232 363317 363552 364965 367016 368825 370009 371018 372478 374479
$$ packed form
57911D02470l036k343j516q40n90o64p15l75N25J710K504K390J512M83j55j81
57895D01179K76Q40J195J394J561J436P46n5j85K14J83m73p49j32M12r9j160j741
57877D04842j886k293k912l154l047l074l116k647j798j218r95o08J13P65J047
57862C80019R88O94N17J094K531L891M365M482N242O421O887O419N943O003O123
57847D41619N825N201M250K642N53j100j669j457j277j789l258n238o559o337
57833D31406n104m171l934l672l002k471k436k380j757p29L98J644K794L176K584
57818D12346J824J713K119K518K820K946K130k90l599o069o756o312n965o200
57804C93225o629o646n942m638l183j955r15K35J413K051J809J184J009J460K001
$$ plain form
57789 374479 376746 379234 382110 385325 388708 392525 397329 403078 408928 414216 419198 424451 430028 435759
57775 435759 441884 448718 455867 462541 468538 474274 479837 484642 488114 490123 490683 489803 487800 485260 482458
57760 482458 479194 475275 470723 465416 459117 452152 445630 440671 437662 436355 436266 436814 437497 438223 439260
57745 439260 440748 442632 445129 448758 453548 458566 462550 464856 465670 465598 465265 465111 465328 466067 467644 470306
57729 470306 473846 477819 482098 486841 491885 496639 500653 503907 506459 508324 509819 511525 513649 515733
57715 515733 517159 517612 517024 515533 513681 512175 511238 510416 509116 507021 504055 500472 496975 494248 492313
57700 492313 490829 489912 489918 490476 490723 490777 491966 495111 499327 503054 505565 506870 506930 505813 504149 502684 501579
57683 501579 500741 500483 501224 502814 504817 507358 511206 517127 525507 536476 550083 566552 586635 611518
$$ packed form
57789C74479K267K488K876L215L383L817M804N749N850N288M982N253N577N731
57775D35759O125O834P149O674N997N736N563M805L472K009N60q80k003k540k802
57760D82458l264l919m552n307o299o965o522m959l009j307q9N48O83P26J037
57745D39260J488J884K497L629M790N018L984K306Q14p2l33j54K17P39J577K662
57729D70306L540L973M279M743N044M754M014L254K552J865J495J706K124K084
57715E15733J426M53n88j491j852j506r37q22j300k095k966l583l497k727j935
57700D92313j484r17ON58K47N4J189L145M216L727K511J305O0j117j664j465j105
57683E01579q38k58P41J590K003K541L848N921Q380J0969J3607J6469K0083K4883
$$ plain form
57669 611518 642179 679151 723071 774835 834379 898935 962167 1014866 1047386 1053465 1033308 993181
57657 993181 941719 886468 832937 784834 743800 709571 681373 658975 641999 629075 618613
57646 618613 609942 603009 597546 593381 590903 590267 590627 591153 592320 595053 598934 602532 605352 608269 611984
57631 611984 616172 620270 624048 627192 629317 630712 632292 634499 636907 639050 640875 642243 642817 642730 642640
57616 642640 642822 642947 643007 643689 645400 647600 649652 651772 654549 657917 661079 663300 664457 665027 665732 667029
57600 667029 668776 670562 672310 674221 676164 677689 678657 679402 680161 680946 682017 683788 685969 687519 687889
57585 687889 687816 688415 689967 692124 694786 698126 701934 705651 709067 712494 716172 719921 723532 727185 731295
57570 731295 735980 740808 745041 748177 750315 752092 754263 757301 761173 765379 769290 772686 775954 779708
$$ packed form
57669F11518L0661L6972M3920N1764N9544O4556O3232N2699L2520O079k0157m0127
57657I93181n1462n5251n3531m8103m1034l4229k8198k2398j6976j2924j0462
57646F18613q671o933n463m165k478o36L60N26J167K733L881L598K820K917L715
57631F11984M188M098L778L144K125J395J580K207K408K143J825J368N74q7r0
57616F42640J82J25O0O82J711K200K052K120K777L368L162K221J157N70P05J297
57600F67029J747J786J748J911J943J525R68P45P59P85J071J771K181J550L70
57585F87889p3N99J552K157K662L340L808L717L416L427L678L749L611L653M110
57570G31295M685M828M233L136K138J777K171L038L872M206L911L396L268L754
$$ plain form
57556 779708 784280 789674 795802 802547 809718 817184 824964 832982 840916 848448 855419 861487 866082 869172
57542 869172 871815 875253 879611 884069 888208 892467 897269 902485 907988 914000 920507 926884 932543 937574
57528 937574 942375 947086 951766 956789 962601 969185 976095 982965 989817 997024 1005054 1014011 1023298 1032005
57514 1032005 1039742 1046926 1054155 1061630 1069282 1077015 1084600 1091703 1098386 1105313 1113194 1122127 1131632 1141036
57500 1141036 1149662 1157079 1163532 1169883 1176713 1183690 1190217 1196489 1203420 1211514 1220225 1228567 1236058 1242979
57486 1242979 1250009 1257751 1266393 1275555 1284550 1293088 1301706 1311249 1321771 1332212 1341480 1349717 1358104
57473 1358104 1367394 1377211 1386918 1396597 1406598 1416581 1425729 1433924 1442107 1451323 1461807 1473016 1484179
57460 1484179 1494771 1504907 1515393 1527064 1539906 1553111 1565995 1578530 1590940 1603187 1615081
$$ packed form
57556G79708M572N394O128O745P171P466P780Q018P934P532O971O068M595L090
57542H69172K643L438M358M458M139M259M802N216N503O012O507O377N659N031
57528I37574M801M711M680N023N812O584O910O870O852P207Q030Q957R287Q707
57514A032005P737P184P229P475P652P733P585P103O683O927P881Q933R505R404
57500A141036Q626P417O453O351O830O977O527O272O931Q094Q711Q342P491O921
57486A242979P030P742Q642R162Q995Q538Q618R543J0522J0441R268Q237Q387
57473A358104R290R817R707R679J0001R983R148Q195Q183R216J0484J1209J1163
57460A484179J0592J0136J0486J1671J2842J3205J2884J2535J2410J2247J1894
$$ plain form
57449 1615081 1626615 1638015 1649583 1661456 1673388 1684962 1696307 1708367 1721910 1736384 1750421
57438 1750421 1763493 1776460 1790332 1805150 1820307 1835366 1850204 1864876 1879681 1894960 1910532
57427 1910532 1925793 1940634 1955775 1971817 1988413 2004743 2020343 2035091 2048952 2062339 2076308
57416 2076308 2091632 2107897 2124124 2140185 2156946 2175027 2194006 2213038 2231817 2250690 2270036
57405 2270036 2289710 2309069 2327457 2344681 2361003 2376808 2392556 2408932 2426569 2445386 2464636
57394 2464636 2483790 2503004 2522477 2541837 2560654 2579172 2598032 2617494 2637503 2658323 2680511
57383 2680511 2704196 2728755 2753315 2777310 2800672 2823747 2847011 2870557 2893916 2916606 2938712
57372 2938712 2960680 2982685 3004515 3025933 3046813 3067012 3086530 3105794 3125494 3146046 3167377
$$ packed form
57449A615081J1534J1400J1568J1873J1932J1574J1345J2060J3543J4474J4037
57438A750421J3072J2967J3872J4818J5157J5059J4838J4672J4805J5279J5572
57427A910532J5261J4841J5141J6042J6596J6330J5600J4748J3861J3387J3969
57416B076308J5324J6265J6227J6061J6761J8081J8979J9032J8779J8873J9346
57405B270036J9674J9359J8388J7224J6322J5805J5748J6376J7637J8817J9250
57394B464636J9154J9214J9473J9360J8817J8518J8860J9462K0009K0820K2188
57383B680511K3685K4559K4560K3995K3362K3075K3264K3546K3359K2690K2106
57372B938712K1968K2005K1830K1418K0880K0199J9518J9264J9700K0552K1331
$$ plain form
57361 3167377 3189156 3211102 3233182 3255721 3279154 3303491 3328208 3352878 3377626 3402718 3428019
57350 3428019 3453311 3478840 3504975 3531513 3557867 3583884 3609914 3636138 3662387 3688648 3715142
57339 3715142 3741803 3768279 3794607 3821313 3848525 3875572 3901906 3928016 3954854 3982540 4010157
57328 4010157 4036898 4063028 4089583 4117258 4145704 4173915 4201290 4228286 4255938 4284776 4314356
57317 4314356 4343779 4372484 4400479 4428115 4455833 4483961 4512504 4541147 4569656 4598246 4627401
57306 4627401 4657256 4687286 4716729 4745366 4773743 4802526 4831759 4860958 4889863 4918732 4947805
57295 4947805 4976868 5005708 5034684 5064387 5094780 5125133 5154893 5184299 5214001 5244340 5275109
57284 5275109 5305806 5335984 5365506 5394580 5423470 5452160 5480408 5508136 5535527 5562658 5589351
$$ packed form
57361C167377K1779K1946K2080K2539K3433K4337K4717K4670K4748K5092K5301
57350C428019K5292K5529K6135K6538K6354K6017K6030K6224K6249K6261K6494
57339C715142K6661K6476K6328K6706K7212K7047K6334K6110K6838K7686K7617
57328D010157K6741K6130K6555K7675K8446K8211K7375K6996K7652K8838K9580
57317D314356K9423K8705K7995K7636K7718K8128K8543K8643K8509K8590K9155
57306D627401K9855L0030K9443K8637K8377K8783K9233K9199K8905K8869K9073
57295D947805K9063K8840K8976K9703L0393L0353K9760K9406K9702L0339L0769
57284E275109L0697L0178K9522K9074K8890K8690K8248K7728K7391K7131K6693
$$ plain form
57273 5589351 5615569 5641771 5668551 5695921 5723186 5749629 5775179 5800326 5825500 5850739 5875982
57262 5875982 5901413 5927227 5953116 5978282 6002101 6024604 6046287 6067668 6089117 6110806 6132577
57251 6132577 6154049 6175103 6196080 6217241 6238208 6258370 6277714 6296843 6316154 6335507 6354850
57240 6354850 6374674 6395490 6417129 6438994 6460896 6483285 6506594 6530713 6555258 6580088 6605299
57229 6605299 6630753 6655963 6680518 6704463 6728068 6751385 6774247 6796563 6818312 6839222 6858755
57218 6858755 6876586 6892884 6907966 6921859 6934365 6945399 6955084 6963624 6971220 6978061 6984259 6989850
57206 6989850 6994822 6998939 7001516 7001656 6998982 6994008 6987716 6980991 6974477 6968528 6962984 6957318 6951375 6945730
57192 6945730 6940999 6937090 6933587 6930549 6928367 6926965 6925718 6924101 6921849 6918623 6914201 6909081 6904139 6899329
$$ packed form
57273E589351K6218K6202K6780K7370K7265K6443K5550K5147K5174K5239K5243
57262E875982K5431K5814K5889K5166K3819K2503K1683K1381K1449K1689K1771
57251F132577K1472K1054K0977K1161K0967K0162J9344J9129J9311J9353J9343
57240F354850J9824K0816K1639K1865K1902K2389K3309K4119K4545K4830K5211
57229F605299K5454K5210K4555K3945K3605K3317K2862K2316K1749K0910J9533
57218F858755J7831J6298J5082J3893J2506J1034R685Q540P596O841O198N591
57206F989850M972M117K577J40k674m974o292o725o514n949n544n666n943n645
57192F945730m731l909l503l038k182j402j247j617k252l226m422n120m942m810
$$ plain form
57178 6899329 6893312 6884740 6873490 6860305 6845759 6830149 6814018 6798022 6782213 6765963 6748707 6730407
57166 6730407 6711228 6691110 6669870 6647478 6623934 6598984 6572192 6543301 6512387 6479647 6445261
57155 6445261 6409510 6372762 6335058 6295864 6254690 6212058 6169484 6128282 6088703 6050474 6013781
57144 6013781 5979259 5947170 5917059 5888122 5859417 5829759 5798004 5763700 5727122 5688545 5647741
57133 5647741 5604267 5557835 5508267 5455530 5400294 5344273 5289669 5238191 5190654 5147235 5107786
57122 5107786 5071893 5038784 5007280 4975943 4943477 4909135 4872789 4834878 4796736 4760920 4730574
57111 4730574 4707897 4693242 4685898 4685516 4692593 4708044 4733157 4770346 4823655 4898304 4999898 5134417
57099 5134417 5308964 5532428 5815497 6170390 6610760 7151612 7808636 8596747 9528124
$$ packed form
57178F899329o017q572j1250j3185j4546j5610j6131j5996j5809j6250j7256j8300
57166F730407j9179k0118k1240k2392k3544k4950k6792k8891l0914l2740l4386
57155F445261l5751l6748l7704l9194m1174m2632m2574m1202l9579l8229l6693
57144F013781l4522l2089l0111k8937k8705k9658l1755l4304l6578l8577m0804
57133E647741m3474m6432m9568n2737n5236n6021n4604n1478m7537m3419l9449
57122E107786l5893l3109l1504l1337l2466l4342l6346l7911l8142l5816l0346
57111D730574k2677j4655p344l82P077J5451K5113L7189N3309P4649J01594J34519
57099E134417J74547K23464K83069L54893M40370N40852O57024P88111R31377
$$ plain form
57090 9528124 10610279 11844617 13225834 14742075 16375054 18099636 19883538 21687780
57082 21687780 23466895 25167859 26730072 28090655 29194710 30002952 30490117 30637628
57074 30637628 30430871 29865607 28957012 27742380 26276050 24621648 22845594 21011998
57066 21011998 19178346 17392616 15692190 14103794 12643907 11319866 10131682 9074035
57058 9074035 8138082 7313169 6588220 5952346 5394965 4906076 4476664 4098672 3764611
57049 3764611 3467637 3202276 2964827 2752777 2563698 2394689 2242712 2105320 1981039
57040 1981039 1869062 1768516 1678095 1596496 1523129 1458180 1401864 1353858 1313739 1281908 1259794
57029 1259794 1249116 1251366 1268011 1299850 1343946 1390132 1421970 1424009 1390246 1326378 1244462 1155892
$$ packed form
57090I528124J082155J234338J381217J516241J632979J724582J783902J804242
57082B1687780J779115J700964J562213J360583J104055Q08242M87165J47511
57074C0637628k06757n65264r08595j214632j466330j654402j776054j833596
57066B1011998j833652j785730j700426j588396j459887j324041j188184j057647
57058I074035r35953q24913p24949o35874n57381m88889m29412l77992l34061
57049C764611k96974k65361k37449k12050j89079j69009j51977j37392j24281
57040A981039j11977j00546r0421q1599p3367o4949n6316m8006m0119l1831k2114
57029A259794j0678K250J6645L1839M4096M6186L1838K039l3763o3868q1916q8570
$$ plain form
57017 1155892 1068417 987012 914860 853106 800872 756405 718177 685053 656130 630825 608894
57006 608894 590096 573946 559877 547399 536019 525276 515041 505536 496807 488260 478992 468641
56994 468641 457789 447465 438295 430199 422864 416424 411516 408734 408202 409793 413535 419485 427184 435347
56980 435347 442074 445321 443436 435901 423831 409520 395088 381463 368676 356855 346518 337999
56968 337999 331097 325603 321812 320147 320470 322309 325780 331674 340395 351250 363279 376407 391122
56955 391122 406924 421513 431677 434863 430163 418481 402079 383587 364959 347223 331007 316978
56943 316978 305689 297395 292147 289810 289824 291369 294140 298762 306210 317053 331478 349708 371774
56930 371774 396742 422360 445431 462457 470401 467673 454882 434505 409634 382928 356468 331983
$$ packed form
57017A155892q7475q1405p2152o1754n2234m4467l8228l3124k8923k5305k1931
57006F08894j8798j6150j4069j2478j1380j0743j0235r505q729q547r268j0351
56994D68641j0852j0324r170q096p335o440m908k782n32J591L742N950P699Q163
56980D35347O727L247j885p535j2070j4311j4432j3625j2787j1821j0337q519
56968C37999o902n494l791j665L23J839L471N894Q721J0855J2029J3128J4715
56955C91122J5802J4589J0164L186m700j1682j6402j8492j8628j7736j6216j4029
56943C16978j1289q294n248k337J4J545K771M622P448J0843J4425J8230K2066
56930C71774K4968K5618K3071J7026P944k728j2791k0377k4871k6706k6460k4485
$$ plain form
56918 331983 310671 292748 277464 263816 251332 240202 230769 223057 216752 211340 206077 200171 193402
56905 193402 186519 180580 175881 171821 167864 164202 161356 159508 158491 158109 158303 159383 162306 168316 177853
56890 177853 190036 203640 218455 235389 255370 278377 303291 328108 350288 367343 377582
56879 377582 380637 377620 370693 362083 353195 344770 337701 333015 330897 330536 331534 334928 342138 353417
56865 353417 368170 386465 409331 437689 471902 512238 558451 608157 656176 696023 722145
56854 722145 731211 722620 698729 664295 624915 585486 549517 519009 494551 475988 463452 457626
56842 457626 458984 467249 481891 502808 530369 565300 608877 662712 727636 802482 883546 964319
56830 964319 1035429 1086106 1107699 1097205 1058019 997782 925517 849637 776836 711504 655743
$$ packed form
56918C31983k1312j7923j5284j3648j2484j1130r433p712o305n412n263n906o769
56905A93402o883n939m699m060l957l662k846j848j017l82J94J080K923O010R537
56890A77853J2183J3604J4815J6934J9981K3007K4914K4817K2180J7055J0239
56879C77582L055l017o927q610q888q425p069m686k118l61R98L394P210J1279
56865C53417J4753J8295K2866K8358L4213M0336M6213M9706M8019L9847K6122
56854G22145R066q591k3891l4434l9380l9429l5969l0508k4458j8563j2536n826
56842D57626J358Q265J4642K0917K7561L4931M3577N3835O4924P4846Q1064Q0773
56830I64319P1110N0677K1593j0494l9186o0237p2265p5880p2801o5332n5761
$$ plain form
56819 655743 609919 573371 545183 524905 512722 508832 512802 523795 541429 566206 599114 640782
56807 640782 690648 746270 803007 854196 891960 909016 901431 870750 823223 766334 705837 645700
56795 645700 589498 540284 499187 465320 437512 415568 399633 389200 383421 381988 385163 393173
56783 393173 406046 423860 446669 473954 503974 533262 556706 569017 567128 551535 525265 491869
56771 491869 454595 416643 380869 348814 320582 295904 274775 256871 241155 226716 213688
56760 213688 202783 194208 187532 182330 178235 174538 170521 166340 162905 160596 158594 155765 151847 147517
56746 147517 143777 141518 141147 142097 143019 142954 142137 141324 140751 140305 140289 141148 142514 143352 143246 142878 143002 143587
56728 143587 144293 145183 146401 147516 147758 146926 145668 144901 145099 146084 147310 148344 149127 149730 150006 149741 149190
$$ packed form
56819F55743m5824l6548k8188k0278j2183l890L970J0993J7634K4777L2908M1668
56807F40782M9866N5622N6737N1189L7764J7056p585l0681m7527n6889o0497o0137
56795F45700n6202m9214m1097l3867k7808k1944j5935j0433n779j433L175Q010
56783C93173J2873J7814K2809K7285L0020K9288K3444J2311j889j5593k6270l3396
56771D91869l7274l7952l5774l2055k8232k4678k1129j7904j5716j4439j3028
56760B13688j0905q575o676n202m095l697m017m181l435k309k002k829l918m330
56746A47517l740k259l71R50R22o5q17q13n73m46j6Q59J366Q38j06l68J24N85
56728A43587P06Q90J218J115K42q32j258p67J98R85J226J034P83O03K76k65n51
$$ plain form
56711 149190 149046 149739 150975 152139 152876 153168 153127 152950 152823 152741 152613 152609 153066 153943 154816 155601 156771 158468 159897
56692 159897 160159 159380 158423 157624 156512 154726 152657 151061 150453 151015 152661 154966 157302 159281 160937 162406
56676 162406 163581 164162 163994 163384 163078 163706 165063 166191 166436 166195 166306 166958 167680 168190 168638 169086 169466 170108
56658 170108 171580 173692 175359 175900 175953 176551 177764 178909 179759 180738 181939 182809 183035 183084 183416 183640 183052
56641 183052 181806 180937 181089 181652 181449 180011 177908 175956 174452 173266 172303 171580 170921 169918 168382 166695
56625 166695 165488 164948 164618 164002 163241 162962 163491 164407 165007 164980 164463 163673 162789 162088 161801 161809 161842 162015 162796 164247
56605 164247 165683 166390 166428 166401 166651 166988 167076 166711 165808 164492 163233 162616 162830 163492 163938 163616 162435 160991
56587 160991 160316 161031 162720 164423 165674 166677 167550 167909 167416 166378 165451 165031 165202 166059 167666 169668
$$ packed form
56711A49190j44O93J236J164P37K92m1j77j27q2j28mM57Q77Q73P85J170J697J429
56692A59897K62p79r57p99j112j786k069j596o08N62J646K305K336J979J656J469
56676A62406J175N81j68o10l06O28J357J128K45k41J11O52P22N10M48M48L80O42
56658A70108J472K112J667N41N3N98J213J145Q50R79J201Q70K26M9L32K24n88
56641A83052j246q69J52N63k03j438k103j952j504j186r63p23o59j003j536j687
56625A66695j207n40l30o16p61k79N29R16O00k7n17p90q84p01k87QL3J73P81J451
56605A64247J436P07L8k7K50L37Q8l65r03j316j259o17K14O62M46l22j181j444
56587A60991o75P15J689J703J251J003Q73L59m93j038r27m20J71Q57J607K002
$$ plain form
56571 169668 171295 171970 171853 171693 172175 173551 175823 179071 183404 188777 195131 202740 212081 223279 235908
56556 235908 249298 262484 273700 280674 282209 279313 274209 268414 262315 256279 251086 247020 243386
56543 243386 239448 235272 231252 227369 223497 220059 217720 216525 215833 215039 214004 212858 211788 210972 210432
56528 210432 209931 209270 208570 208019 207462 206607 205550 204701 204198 203762 203237 202856 202796 202759 202261 201203 199932 198840
56510 198840 198101 197764 197879 198453 199304 199999 200013 199112 197654 196419 195971 196168 196423 196414 196420 196867 197677 198290 198324 198004
56490 198004 197857 198074 198339 198206 197489 196331 195049 193976 193252 192746 192263 191886 191922 192435 192995 193096 192759 192487
56472 192487 192633 193054 193523 194234 195547 197320 198879 199844 200618 201742 203030 203762 203675 203243 202982 202964 203131 203528
56454 203528 203988 204102 203829 203655 203750 203564 202813 202321 203077 204801 206451 207895 209943 212605 214517 214651 213673
$$ packed form
56571A69668J627O75j17j60M82J376K272L248M333N373O354P609R341J1198J2629
56556B35908J3390J3186J1216O974J535k896n104n795o099o036n193m066l634
56543B43386l938m176m020l883l872l438k339j195o92p94j035j146j070q16n40
56528B10432n01o61p00n51n57q55j057q49n03m36n25l81o0l7m98j058j271j092
56510A98840p39l37J15N74Q51O95J4r01j458j235m48J97K55rOM47Q10O13L4l20
56490A98004j47K17K65j33p17j158j282j073p24n06m83l77L6N13N60J01l37k72
56472A92487J46M21M69P11J313J773J559R65P74J124J288P32q7m32k61j8J67L97
56454B03528M60J14k73j74R5j86p51m92P56J724J650J444K048K662J912J34r78
$$ plain form
56437 213673 212922 212757 212715 212689 212955 213229 212695 211178 209626 209143 209868 211053 211980 212545 213062 213701 214225 214320 214102
56418 214102 214120 214812 216150 217857 219734 221635 223359 224759 225839 226614 227018 227068 226962 226846 226654 226291 225928
56401 225928 225940 226654 228059 229597 230354 229827 228565 227736 227968 228905 229870 230492 230654 230384 230092 230391 231339 232224
56383 232224 232432 232202 232287 233284 235484 238810 242475 245220 246497 247096 248128 249741 251268 252226 252573 252387
56367 252387 251882 251485 251296 250789 249671 248676 248811 250058 251561 252805 253785 254277 254047 253794 254870 257682 261123
56350 261123 263864 265571 266653 267498 268319 269195 269955 270472 271216 272937 275579 278175 280033 281472 283063 284860
56334 284860 286771 289128 292283 296034 299898 303690 307414 310919 314128 317405 321302 325997 331134 335912
56320 335912 339267 340404 339581 338097 337212 337209 337588 337792 337546 336944 336517 336830 337763 338657 339446 341057 344188 348223
$$ packed form
56437B13673p51j65m2k6K66K74n34j517j552m83P25J185R27N65N17O39N24R5k18
56418B14102J8O92J338J707J877J901J724J400J080P75M04N0j06j16j92l63l63
56401B25928J2P14J405J538P57n27j262q29K32R37R65O22J62k70k92K99R48Q85
56383B32224K08k30Q5R97K200L326L665K745J277N99J032J613J527R58L47j86
56367B52387n05l97j89n07j118r95J35J247J503J244R80M92k30k53J076K812L441
56350B61123K741J707J082Q45Q21Q76P60N17P44J721K642K596J858J439J591J797
56334B84860J911K357L155L751L864L792L724L505L209L277L897M695N137M778
56320C35912L355J137q23j484q85lL79K04k46o02m27L13R33Q94P89J611L131M035
$$ plain form
56302 348223 352000 355276 358754 362956 367824 373250 379164 385066 390192 394400 398354 402662 407272 411879
56288 411879 416405 420834 425018 429073 433674 439546 446766 454828 463291 472007 480827 489458 497771 506027
56274 506027 514581 523515 532772 542590 553494 565803 579381 594033 609939 627462 646695 667464
56262 667464 689707 713596 739358 767269 797812 831546 868850 910120 956242 1008463 1067646
56251 1067646 1133910 1207161 1287786 1376729 1475065 1583504 1702014 1829795 1965666 2108339
56241 2108339 2256060 2406192 2555658 2701714 2841729 2972150 3088330 3185672 3260591 3310499
56231 3310499 3333812 3330570 3302456 3251606 3179702 3088695 2981890 2863613 2737917 2608009 2476498
56220 2476498 2345413 2216033 2089353 1966850 1850350 1741142 1639652 1545988 1460277 1382269
$$ packed form
56302C48223L777L276L478M202M868N426N914N902N126M208L954M308M610M607
56288D11879M526M429M184M055M601N872P220Q062Q463Q716Q820Q631Q313Q256
56274E06027Q554Q934R257R818J0904J2309J3578J4652J5906J7523J9233K0769
56262F67464K2243K3889K5762K7911L0543L3734L7304M1270M6122N2221N9183
56251A067646O6264P3251Q0625Q8943R8336J08439J18510J27781J35871J42673
56241B108339J47721J50132J49466J46056J40015J30421J16180R7342P4919M9908
56231C310499K3313l242k8114n0850p1904r1007j06805j18277j25696j29908j31511
56220B476498j31085j29380j26680j22503j16500j09208j01490r3664q5711p8008
$$ plain form
56210 1382269 1311015 1245306 1184325 1127771 1075506 1027333 983157 943219 907827 876632 848410
56199 848410 821973 797302 775305 756419 740024 725403 712590 701761 692390 683716 675728 668962
56187 668962 663479 658805 654815 651922 650203 648979 647549 645909 644477 643481 642898 642720 642975 643627 644674
56172 644674 646215 648260 650583 652950 655432 658376 662101 666744 672326 678718 685489 692016 698097 704361
56158 704361 711693 720134 728845 737461 747018 758920 773274 789035 805763 824337 845721 869939
56146 869939 896875 927486 963605 1006927 1058784 1120518 1193237 1277022 1370561 1471326 1575642
56135 1575642 1678778 1775648 1861899 1934824 1994118 2042407 2084607 2125642 2167875 2210332 2249925
56124 2249925 2283227 2307673 2322127 2326996 2323882 2314904 2301691 2284163 2259840 2224655 2175062 2109752
$$ packed form
56210A382269p1254o5709o0981n6554n2265m8173m4176l9938l5392l1195k8222
56199H48410k6437k4671k1997j8886j6395j4621j2813j0829r371q674p988o766
56187F68962n483m674l990k893j719j224j430j640j432r96n83j78K55O52J047
56172F44674J541K045K323K367K482K944L725M643N582O392O771O527O081O264
56158G04361P332Q441Q711Q616R557J1902J4354J5761J6728J8574K1384K4218
56146H69939K6936L0611L6119M3322N1857O1734P2719Q3785R3539J00765J04316
56135A575642J03136R6870Q6251P2925N9294M8289M2200M1035M2233M2457L9593
56124B249925L3302K4446J4454M869l114q978j3213j7528k4323l5185m9593o5310
$$ plain form
56112 2109752 2029972 1939007 1841595 1743066 1648237 1560805 1483411 1417494 1362819 1317814 1280860
56101 1280860 1250945 1227091 1208068 1193196 1182642 1176282 1172955 1171480 1171717 1173809 1177019 1180310 1183648
56088 1183648 1187789 1193029 1199112 1206096 1214387 1223928 1234186 1244902 1256203 1268070 1280371 1293291
56076 1293291 1307073 1321504 1336271 1351602 1367880 1384853 1401968 1419281 1437316 1456180 1475579
56065 1475579 1495504 1516116 1537090 1557926 1578801 1600337 1622650 1645458 1669020 1694129 1721130
56054 1721130 1749689 1779452 1810179 1841324 1872309 1903253 1934707 1966666 1998551 2030145 2061916
56043 2061916 2094469 2128316 2163967 2201525 2240374 2280002 2320895 2363893 2408912 2455187 2502488
56032 2502488 2551180 2601321 2652673 2705448 2760074 2816437 2874288 2934163 2996843 3062054 3128776
$$ packed form
56112B109752p9780r0965r7412r8529r4829q7432p7394o5917n4675m5005l6954
56101A280860k9915k3854j9023j4872j0554o360l327j475K37K092L210L291L338
56088A183648M141N240O083O984Q291R541J0258J0716J1301J1867J2301J2920
56076A293291J3782J4431J4767J5331J6278J6973J7115J7313J8035J8864J9399
56065A475579J9925K0612K0974K0836K0875K1536K2313K2808K3562K5109K7001
56054A721130K8559K9763L0727L1145L0985L0944L1454L1959L1885L1594L1771
56043B061916L2553L3847L5651L7558L8849L9628M0893M2998M5019M6275M7301
56032B502488M8692N0141N1352N2775N4626N6363N7851N9875O2680O5211O6722
$$ plain form
56021 3128776 3196692 3266326 3337979 3411628 3487674 3566639 3648279 3732165 3818984 3910161 4006432
56010 4006432 4107920 4215197 4328793 4447906 4571127 4698436 4831196 4970354 5115984
56001 5115984 5268342 5427828 5594233 5767617 5949711 6142760 6347293 6562748 6789836
55992 6789836 7030205 7284164 7551186 7832692 8131900 8450740 8789326 9148874 9532757
55983 9532757 9944240 10385417 10858779 11367586 11914389 12501666 13134413 13819777 14563842
55974 14563842 15371490 16249913 17209620 18261669 19417027 20689636 22097536 23660797
55966 23660797 25402029 27350476 29543529 32024943 34846797 38076385 41800857 46128593
55958 46128593 51195365 57176274 64293472 72815622 83057319 95383651 110215410 128031767
$$ packed form
56021C128776O7916O9634P1653P3649P6046P8965Q1640Q3886Q6819R1177R6271
56010D006432J01488J07277J13596J19113J23221J27309J32760J39158J45630
56001E115984J52358J59486J66405J73384J82094J93049K04533K15455K27088
55992F789836K40369K53959K67022K81506K99208L18840L38586L59548L83883
55983I532757M11483M41177M73362N08807N46803N87277O32747O85364P44065
55974A4563842Q07648Q78423R59707J052049J155358J272609J407900J563261
55966B3660797J741232J948447K193053K481414K821854L229588L724472M327736
55958D6128593N066772N980909P117198Q522150J0241697J2326332J4831759J7816357
$$ plain form
55950 128031767 149366914 174774183 204697070 239173553 277345173 316895609 353788084
55943 353788084 382784437 398900386 399232287 384093024 356729343 321875421 284125640
55936 284125640 246959228 212544915 181965977 155532806 133072481 114173939 98353134
55929 98353134 85130679 74065290 64776561 56951317 50330579 44697788 39878473 35736935
55921 35736935 32163009 29062815 26360231 23996631 21922733 20093591 18472288 17031854
55913 17031854 15749655 14603309 13573653 12646926 11811281 11054416 10366290 9740386 9170216
55904 9170216 8647651 8166222 7722785 7314204 6935419 6582351 6253688 5948059 5662215
55895 5662215 5393738 5142904 4910022 4693233 4490563 4301860 4126942 3963993 3811635
$$ packed form
55950A28031767K1335147K5407269K9922887L4476483L8171620L9550436L6892475
55943C53788084K8996353J6115949L31901j5139263k7363681l4853922l7749781
55936B84125640l7166412l4414313l0578938k6433171k2460325j8898542j5820805
55929I8353134j3222455j1065389r288729p825244o620738n632791m819315m141538
55921C5736935l573926l100194k702584k363600k073898j829142j621303j440434
55913A7031854j282199j146346j029656r26727q35645p56865o88126o25904n70170
55904I170216n22565m81429m43437m08581l78785l53068l28663l05629k85844
55895E662215k68477k50834k32882k16789k02670j88703j74918j62949j52358
$$ plain form
55886 3811635 3670792 3542682 3426305 3319243 3219287 3123850 3029364 2933159 2835284 2737541
55876 2737541 2641709 2549401 2462100 2380045 2301966 2226695 2154071 2083806 2015007 1947656 1883175
55865 1883175 1822598 1765433 1711177 1660588 1614373 1571730 1531274 1492476 1455235 1419024 1383475
55854 1383475 1349137 1316852 1286969 1259589 1234709 1211574 1188746 1165301 1141167 1116105 1089631
55843 1089631 1062363 1036127 1012010 989423 967687 947269 928650 911204 894170 877808 862661
55832 862661 848549 835070 822194 809685 796919 784128 772773 763698 755712 746985 737037 726457
55820 726457 715440 703683 691146 677922 663867 649206 635023 622303 610907 600210 590253 581498
55808 581498 573905 567072 560883 555366 550288 545589 541856 539753 539244 539801 540964 542294 543328 544068 545025
$$ packed form
55886C811635j40843j28110j16377j07062r9956r5437r4486r6205r7875r7743
55876B737541r5832r2308q7301q2055p8079p5271p2624p0265o8799o7351o4481
55865A883175o0577n7165n4256n0589m6215m2643m0456l8798l7241l6211l5549
55854A383475l4338l2285k9883k7380k4880k3135k2828k3445k4134k5062k6474
55843A089631k7268k6236k4117k2587k1736k0418j8619j7446j7034j6362j5147
55832H62661j4112j3479j2876j2509j2766j2791j1355r075p986q727r948j0580
55820G26457j1017j1757j2537j3224j4055j4661j4183j2720j1396j0697r957q755
55808E81498p593o833o189n517n078m699l733k103n09N57J163J330J034P40R57
$$ plain form
55793 545025 546322 547291 547421 547075 546730 546163 545007 543559 542368 541542 540991 540731 540199 537732 531532 520986
55777 520986 506722 489954 472312 455655 441243 429255 419523 412302 407894 406072 406286 407825 409258
55764 409258 408556 404641 398357 391277 384150 377165 370967 366229 362558 358858 354729 350689 347099 343612
55750 343612 339708 335276 330656 326464 323168 320496 317593 314082 310514 307345 304036 299845 295064 290776
55736 290776 287647 285547 283988 282344 279985 276917 274021 272127 271085 270214 269152 267627 264928 260541
55722 260541 255073 249698 244846 240156 235491 231205 227496 224339 222016 220981 221109 221776 222759 224504 227372
55707 227372 231105 235137 239057 242661 245793 248188 249347 248761 246485 243113 238983 233823 227537 220904
55693 220904 214981 210179 206357 203359 200927 198564 196135 194274 193540 193574 193745 194166 195289 196913 198523
$$ packed form
55793E45025J297R69J30l46l45n67j156j448j191q26n51k60n32k467o200j0546
55777E20986j4264j6768j7642j6657j4412j1988r732p221m408j822K14J539J433
55764D09258p02l915o284p080p127o985o198m738l671l700m129m040l590l487
55750C43612l904m432m620m192l296k672k903l511l568l169l309m191m781m288
55736B90776l129k100j559j644k359l068k896j894j042q71j062j525k699m387
55722B60541n468n375m852m690m665m286l709l157k323j035J28O67R83J745K868
55707B27372L733M032L920L604L132K395J159n86k276l372m130n160o286o633
55693B20904n923m802l822k998k432k363k429j861p34L4J71M21J123J624J610
$$ plain form
55678 198523 200359 203174 207020 211141 214913 217978 219582 218944 216532 214037 212695 212263 211844 211012 209839
55663 209839 208471 207184 206446 206549 207311 208265 208973 209225 209251 209643 210670 211787 212226 211901 211325 210813 210276 209619
55645 209619 208704 207083 204458 201392 198914 197379 196288 195135 193775 191979 189349 185870 181946 177783
55631 177783 173271 168514 163895 159582 155519 151938 149195 147061 144876 142623 141197 141339 142762 144538
55617 144538 145871 146487 146793 147657 149329 150540 149508 146082 142130 139453 138060 136938 135705 134738 134184
55602 134184 133696 132963 131915 130413 128247 125496 122624 120149 118246 116671 115064 113460 112406 112336 113010
55587 113010 113911 115049 116840 119175 121215 122204 122082 121235 120177 119605 120177 121999 124677 127950 131801 135979
55571 135979 140158 144723 150609 157956 165562 172054 176952 180172 181255 179850 176517 172317 167841 163230
$$ packed form
55678A98523J836K815L846M121L772L065J604o38k412k495j342m32m19q32j173
55663B09839j368j287p38J03P62R54P08K52K6L92J027J117M39l25n76n12n37o57
55645B09619r15j621k625l066k478j535j091j153j360j796k630l479l924m163
55631A77783m512m757m619m313m063l581k743k134k185k253j426J42J423J776
55617A44538J333O16L06Q64J672J211j032l426l952k677j393j122j233r67n54
55602A34184m88p33j048j502k166k751k872k475j903j575j607j604j054p0O74
55587A13010R01J138J791K335K040R89j22q47j058n72N72J822K678L273L851M178
55571A35979M179M565N886P347P606O492M898L220J083j405l333m200m476m611
$$ plain form
55557 163230 158782 154772 150864 146465 141697 137354 133859 130865 128073 125863 124679 124143 123300 121793 120420
55542 120420 120265 121371 122560 122691 121891 121299 121739 122991 124351 125487 126526 127555 128326 128492 128067 127636
55526 127636 127992 129385 131198 132491 132728 131883 130139 127850 125565 123545 121373 118502 115101 111828 108863
55511 108863 105856 102838 100455 99063 98274 97633 97184 96994 96675 95792 94352 92564 90539 88471 86697 85227
55495 85227 83700 82105 81028 80764 80685 80011 78831 77782 77088 76510 76001 75843 76189 76955 78097 79571 81075
55478 81075 82214 82858 83112 83055 82796 82612 82732 83067 83383 83574 83545 83065 82094 81040 80296 79683 78691 77253 75934
55459 75934 75346 75558 76093 76379 76252 76053 76102 76131 75507 74099 72560 71683 71870 73239 75595 78073 79447 79340
55441 79340 78636 78205 77759 76541 74677 73048 72089 71522 71168 71210 71622 72024 72320 72937 74228 76010 77824
$$ packed form
55557A63230m448m010l908m399m768m343l495k994k792k210j184n36q43j507j373
55542A20420j55J106J189J31q00n92M40J252J360J136J039J029P71J66m25m31
55526A27636L56J393J813J293K37q45j744k289k285k020k172k871l401l273k965
55511A08863l007l018k383j392p89o41m49j90l19q83j440j788k025k068j774j470
55495H5227j527j595j077k64p9o74j180j049o94n78n09j58L46P66J142J474J504
55478H1075J139O44K54n7k59j84J20L35L16J91k9m80r71j054p44o13r92j438j319
55459G5934n88K12N35K86j27j99M9K9o24j408j539q77J87J369K356K478J374j07
55441G9340p04m31m46j218j864j629r59n67l54M2M12M02K96O17J291J782J814
$$ plain form
55424 77824 79384 80622 81482 81787 81239 79757 77934 76816 76863 77442 77739 77826 78220 78743 78654 77846 77059 76699
55406 76699 76206 74979 73335 72133 71803 72144 72842 73741 74685 75393 75567 75157 74514 74117 73990 73551 72373 70891
55388 70891 69990 70006 70633 71744 73612 76114 78362 79579 80018 80544 81511 82422 82680 82295 81810 81704 81984 82295
55370 82295 82330 82034 81429 80434 79032 77478 76136 75209 74754 74787 75078 75016 74116 72629 71277 70348 69463 68326
55352 68326 67271 66849 67116 67579 67729 67478 67142 67085 67291 67398 67229 67169 67702 68689 69482 69753 69863 70335 71318
55333 71318 72677 74220 75698 76862 77724 78525 79302 79739 79589 78996 78282 77667 77355 77613 78470 79528 80309
55316 80309 80693 80855 80893 80762 80496 80314 80417 80704 80695 79861 78201 76421 75355 75201 75541 75985 76474 76972 77283
55297 77283 77317 77202 77000 76625 76165 75961 76119 76238 75885 75102 74248 73565 73134 72999 73076 73120 73010 72892 72897 72942 72995
$$ packed form
55424G7824J560J238Q60L05n48j482j823j118M7N79K97Q7L94N23q9q08p87l60
55406G6699m93j227j644j202l30L41O98Q99R44P08J74m10o43l97j27m39j178j482
55388G0891r01J6O27J111J868K502K248J217M39N26R67R11K58l85m85j06K80L11
55370H2295L5k96o05r95j402j554j342r27m55L3K91o2r00j487j352r29q85j137
55352F8326j055m22K67M63J50k51l36n7K06J07j69o0N33R87P93K71J10M72R83
55333G1318J359J543J478J164Q62Q01P77M37j50n93p14o15l12K58Q57J058P81
55316H0309L84J62L8j31k66j82J03K87rq34j660j780j066j54L40M44M89M98L11
55297G7283L4j15k02l75m60k04J58J19l53p83q54o83m31j35P7M4j10j18NM5N3
$$ plain form
55276 72995 73226 73634 73859 73666 73298 73014 72579 71718 70773 70373 70627 71243 72253 73871 75650 76630 76559 76287
55258 76287 76520 76861 76630 76061 75918 76189 76028 75041 73887 73337 73292 73188 73034 73530 75154 77480 79503 80464
55240 80464 80335 79685 79208 79260 79691 79977 79555 78121 75878 73579 72157 72014 72626 73082 73099 73315 74394 76115
55222 76115 77650 78601 79323 80198 81026 81312 80805 79508 77553 75491 74354 74734 75790 75845 74258 72229 71400
55205 71400 72079 73291 74211 74899 75670 76413 76810 76788 76504 76107 75818 76004 76909 78370 79888 80932 81126 80439
55187 80439 79369 78694 78758 79173 79432 79561 79797 79881 79267 78044 77082 77000 77446 77754 77942 78597 79870 81106 81626
55168 81626 81551 81595 82133 82778 83007 82953 83265 84156 84963 84955 84315 83957 84413 85303 85946 86135 86160 86345 86730 87076 87055
55147 87055 86588 85998 85679 85604 85420 85025 84708 84638 84630 84556 84647 85133 85888 86660 87347 87809 87768 87245 86811 86951 87385
$$ packed form
55276G2995K31M08K25j93l68k84m35q61r45m00K54O16J010J618J779R80p1k72
55258G6287K33L41k31n69j43K71j61r87j154n50m5j04j54M96J624K326K023R61
55240H0464j29o50m77N2M31K86m22j434k243k299j422j43O12M56J7K16J079J721
55222G6115J535R51P22Q75Q28K86n07j297j955k062j137L80J056N5j587k029q29
55205G1400O79J212R20O88P71P43L97k2k84l97k89J86R05J461J518J044J94o87
55187H0439j070o75O4M15K59J29K36Q4o14j223r62q2M46L08J88O55J273J236N20
55168H1626p5M4N38O45K29n4L12Q91Q07qo40l58M56Q90O43J89K5J85L85L46k1
55147H7055m67n90l19p5j84l95l17p0qp4R1M86P55P72O87M62m1n23m34J40M34
$$ plain form
55126 87385 87419 86854 86160 85852 86045 86527 86886 86591 85383 83664 82204 81431 81197 81224 81475 82065 83058 84407
55108 84407 85915 87209 87911 87932 87516 87076 86992 87373 87887 88059 87894 87972 88679 89604 90057 89935 89704 89663 89726 89829
55088 89829 90096 90529 90938 91202 91368 91562 92013 92987 94317 95236 95135 94370 93829 93824 93973 94040 94200 94404 94253 93708
55068 93708 93352 93570 93958 93814 92862 91302 89587 88320 87909 88058 88054 87707 87575 88036 88710 89122 89368 89699 89924
55049 89924 89745 89325 89026 88882 88731 88565 88328 87695 86547 85402 84835 84677 84338 83790 83665 84351 85417 86077
55031 86077 86041 85859 86543 88612 91372 93402 93989 93771 93736 94048 94300 94410 94575 94612 94128 93305 92788 92718 92502
55012 92502 91697 90550 89520 88793 88459 88679 89375 90125 90616 90962 91380 91846 92236 92562 92914 93366 94073 95196
54994 95196 96594 97775 98285 98040 97364 96917 97445 99124 101080 102047 101704 100974 100790 101021 100939 100348 99722 99423
$$ packed form
55126H7385L4n65o94l08J93M82L59k95j208j719j460p73k34K7K51N90R93J349
55108H4407J508J294P02K1m16m40q4L81N14J72j65P8P07R25M53j22k31m1O3J03
55088H9829K67M33M09K64J66J94M51R74J330R19j01p65n41nJ49O7J60K04j51n45
55068I3708l56K18L88j44r52j560j715j267m11J49ml47j32M61O74M12K46L31K25
55049H9924j79m20k99j44j51j66k37o33j148j145n67j58l39n48j25O86J066O60
55031H6077l6j82O84K069K760K030N87k18l5L12K52J10J65L7m84q23n17p0k16
55012I2502q05j147j030p27l34K20O96P50M91L46M18M66L90L26L52M52P07J123
54994I5196J398J181N10k45o76m47N28J679J956R67l43p30j84K31q2n91o26k99
$$ plain form
54976 99423 99285 99042 98827 99110 100189 101714 102733 102457 101136 99919 99598 99726 99277 98012 96737 96300 96719
54959 96719 97366 97607 97158 96217 95464 95677 97028 98868 100396 101463 102472 103651 104753 105493 105883 105941 105373
54942 105373 103940 102092 100868 101010 102326 103967 105127 105381 104686 103362 101968 100865 99911 98836 97907
54927 97907 97860 99023 100787 102215 103077 104120 106300 109854 114063 117814 120455 122260 124110 126740 130369
54912 130369 134976 140576 146948 153276 158454 161883 163710 164202 163149 160114 155127 148908 142428 136398
54898 136398 131116 126565 122618 119274 116728 115076 114008 113021 111998 111312 111201 111280 110915 109932 108697 107619
54882 107619 106908 106783 107535 109209 111431 113702 115747 117564 119330 121391 124162 127883 132541 138057 144308
54867 144308 150856 156872 161556 164542 165825 165549 164080 162007 159634 156496 151862 145796 139433 133960
$$ packed form
54976I9423j38k43k15K83J079J525J019k76j321j217l21J28m49j265j275m37M19
54959I6719O47K41m49r41p53K13J351J840J528J067J009J179J102P40L90N8n68
54942A05373j433j848j224J42J316J641J160K54o95j324j394j103r54j075r29
54927I7907m7J163J764J428Q62J043K180L554M209L751K641J805J850K630L629
54912A30369M607N600O372O328N178L429J827M92j053l035m987o219o480o030
54898A36398n282m551l947l344k546j652j068r87j023o86j11P9l65r83j235j078
54882A07619p11j25P52J674K222K271K045J817J766K061K771L721M658N516O251
54867A44308O548O016M684K986J283k76j469k073k373l138m634o066o363n473
$$ plain form
54853 133960 129581 125718 122003 118697 116082 113855 111449 108844 106746 105829 105935 106184 105805 104688 103173
54838 103173 101508 99649 97537 95434 93861 93077 92698 92049 91033 90319 90394 90748 90530 89878 89881 91050 92475
54821 92475 92912 92209 91200 90606 90649 91432 92952 94686 95819 96123 96205 96733 97739 98832 99724 100329 100596 100541
54803 100541 100282 99936 99554 99261 99251 99535 99875 100129 100488 101194 102091 102651 102470 101672 100839 100559 100989 101826 102657
54784 102657 103258 103530 103373 102881 102545 102875 103731 104302 103950 102904 102017 101989 102935 104540 106362 108067 109589
54767 109589 111193 113320 116275 119948 123839 127428 130710 134300 138889 144628 151124 157865 164299 169534
54753 169534 172482 172601 170404 166936 162903 158358 153123 147238 141062 135169 130174 126489 124153 122838
54739 122838 122027 121264 120349 119314 118147 116669 114856 113203 112388 112486 112836 112825 112476 112089 111720 111448 111837 113538
$$ packed form
54853A33960m379l863l715l306k615k227k406k605k098r17J06K49l79j117j515
54838A03173j665j859k112k103j573p84l79o49j016p14P5L54k18o52LJ169J425
54821I2475M37p03j009n94M3P83J520J734J133L04Q2N28J006J093Q92O05K67n5
54803A00541k59l46l82k93j0K84L40K54L59P06Q97N60j81p98q33k80M30Q37Q31
54784A02657O01K72j57m92l36L30Q56N71l52j046q87k8R46J605J822J705J522
54767A09589J604K127K955L673L891L589L282L590M589N739O496O741O434N235
54753A69534K948J19k197l468m033m545n235n885o176n893m995l685k336j315
54739A22838q11p63r15j035j167j478j813j653q15R8L50j1l49l87l69k72L89J701
$$ plain form
54721 113538 116444 119696 122633 125417 128609 132581 137465 143310 149861 156320 161651 165203 166944 167128
54707 167128 165872 163107 158902 153751 148434 143443 138620 133538 128231 123322 119429 116721 115092 114368
54693 114368 114113 113584 112366 110942 110177 110200 110142 109107 107129 105007 103503 102885 103066 103803 104701 105207 104827
54676 104827 103491 101741 100426 100042 100413 101110 102004 103139 104165 104362 103428 101899 100588 99838 99507 99372
54660 99372 99306 99266 99414 100019 100964 101605 101525 101209 101499 102507 103563 104229 104733 105285 105534 105087 104227 103736 104087
54641 104087 105010 105753 105664 104663 103205 101715 100128 98235 96369 95312 95491 96696 98623 101126 103704
54626 103704 105408 105747 105351 105135 105126 104653 103561 102598 102528 103293 104241 104866 105138 105251 105238 104888 104125 103362 103237
54607 103237 103896 104812 105418 105628 105588 105353 105146 105521 106762 108318 109315 109422 108834 107675 106050 104517 103809
$$ packed form
54721A13538K906L252K937K784L192L972M884N845O551O459N331L552J741J84
54707A67128j256k765m205n151n317m991m823n082n307m909l893k708j629p24
54693A14368k55n29j218j424p65K3n8j035j978k122j504o18J81P37Q98N06l80
54676A04827j336j750j315l84L71O97Q94J135J026J97r34j529j311p50l31j35
54660I9372o6m0J48O05R45O41q0l16K90J008J056O66N04N52K49m47q60m91L51
54641A04087R23P43q9j001j458j490j587j893j866j057J79J205J927K503K578
54626A03704J704L39l96k16rm73j092r63p0P65R48O25K72J13j3l50p63p63j25
54607A03237O59R16O06K10m0k35k07L75J241J556R97J07n88j159j625j533p08
$$ plain form
54590 103809 103960 104263 104185 103835 103434 102930 102361 102178 102780 103958 105088 105741 105965 106090 106359 106647 106620 106270 106127
54571 106127 106617 107404 107849 108017 108619 109892 111165 111755 111710 111382 110852 110224 109980 110444 111146 111276 110668 109912
54553 109912 109577 109771 110398 111394 112582 113632 114345 114805 115188 115557 115919 116338 116862 117383 117688 117709 117761 118433 120091
54534 120091 122434 124625 125902 126044 125323 124171 122946 121872 121083 120657 120571 120585 120320 119582 118570 117665 117077
54517 117077 116772 116540 116053 115144 114216 114008 114588 114928 113991 112066 110453 110021 110683 112111 114079 116003 117009
54500 117009 116865 116225 115646 114935 113866 112899 112663 113156 113927 114696 115388 115873 116075 116069 115812 115217 114707 115079 116346
54481 116346 117388 117374 116931 117074 117511 117076 115600 114247 113856 113994 113969 113982 114759 116571 119026 121523 123579
54464 123579 125054 126271 127674 129193 130215 130362 130021 129898 130282 130922 131391 131410 130991 130473 130279 130466 130611
$$ packed form
54590A03809J51L03p8l50m01n04n69j83O02J178J130O53K24J25K69K88k7l50j43
54571A06127M90P87M45J68O02J273J273N90m5l28n30o28k44M64P02J30o08p56
54553A09912l35J94O27R96J188J050P13M60L83L69L62M19N24N21L05K1N2O72J658
54534A20091K343K191J277J42p21j152j225j074p89m26q6J4k65p38j012r05n88
54517A17077l05k32m87r09r28k08N80L40r37j925j613m32O62J428J968J924J006
54500A17009j44o40n79p11j069r67k36M93P71P69O92M85K02ok57n95n10L72J267
54481A16346J042j4m43J43M37m35j476j353l91J38k5J3P77J812K455K497K056
54464A23579J475J217J403J519J022J47l41j23L84O40M69J9m19n18j94J87J45
$$ plain form
54447 130611 130256 129348 128166 126989 126027 125598 126051 127256 128322 128199 126776 125130 124355 124362 124291 123865 123590 123607
54429 123607 123270 122340 121698 122126 123017 123274 123050 123551 125220 127150 128408 128997 129263 129282 129259 129794 131165 132758
54411 132758 133740 133954 133765 133311 132425 131129 129822 128913 128426 127973 127131 125976 125216 125542 126902 128680 130538
54394 130538 132680 135293 138176 140992 143422 145006 145375 144895 144576 145017 145807 146255 146304 146349 146512 146514 146108 145340
54376 145340 144476 143846 143573 143375 142929 142470 142542 143058 143246 142917 143047 144446 146436 147725 148296 149432 151885
54359 151885 154973 157767 160354 163338 166656 169532 171426 172441 172808 172446 171192 169179 166706 163887 160694
54344 160694 157336 154271 151683 149225 146562 143971 142018 140709 139480 138061 136825 136007 135156 133815 132404
54329 132404 131845 132364 133158 133276 132494 131365 130724 131109 132332 133613 134366 134849 135701 136865 137401 136520 134508
$$ packed form
54447A30611l55r08j182j177r62m29M53J205J066j23j423j646p75Pp1m26k75J7
54429A23607l37r30o42M28Q91K57k24N01J669J930J258N89K66J9k3N35J371J593
54411A32758R82K14j89m54q86j296j307r09m87m53q42j155p60L26J360J778J858
54394A30538K142K613K883K816K430J584L69m80l19M41P90M48M9M5J63Km06p68
54376A45340q64o30k73j98m46m59P2N16J88l29J30J399J990J289N71J136K453
54359A51885L088K794K587K984L318K876J894J015L67l62j254k013k473k819l193
54344A60694l358l065k588k458k663k591j953j309j229j419j236q18q51j341j411
54329A32404n59N19P94J18p82j129o41L85J223J281P53M83Q52J164N36q81k012
$$ plain form
54312 134508 132426 131143 130856 131274 131940 132424 132577 132715 133391 134764 136282 137150 137081 136405 135450 134150 132454
54295 132454 130793 129683 129011 128208 127210 126707 127206 128287 129136 129491 129678 129984 130398 130905 131577 132390 133203 133898
54277 133898 134344 134404 134195 134177 134637 135241 135461 135320 135292 135486 135416 134641 133285 131824 130742 130452 131121 132326 133244
54258 133244 133471 133494 134060 135233 136287 136481 135779 134878 134657 135572 137438 139658 141602 142811 143094 142637 141888
54241 141888 141107 140084 138572 136923 135922 135995 136836 137827 138453 138281 137089 135348 134192 134446 135829 137409
54225 137409 138676 139717 140488 140474 139314 137377 135435 133942 132908 132344 132454 133273 134427 135450 136179 136637
54209 136637 136696 136221 135497 135044 134848 134196 132647 130858 129935 130075 130324 129756 128474 127372 127254 128349 130317
54192 130317 132479 134267 135641 136963 138364 139473 139886 139679 139236 138759 138151 137316 136396 135750 135720 136254 136795
$$ packed form
54312A34508k082j283k87M18O66M84J53J38O76J373J518Q68o9o76r55j300j696
54295A32454j661j110o72q03r98n03M99J081Q49L55J87L06M14N07O72Q13Q13O95
54277A33898M46O0k09j8M60O04K20j41k8J94p0p75j356j461j082k90O69J205R18
54258A33244K27K3N66J173J054J94p02r01k21R15J866K220J944J209K83m57p49
54241A41888p81j023j512j649j001P3Q41R91O26j72j192j741j156K54J383J580
54225A37409J267J041P71j4j160j937j942j493j034n64J10Q19J154J023P29M58
54209A36637N9m75p24m53j96o52j549j789r23J40K49n68j282j102j18J095J968
54192A30317K162J788J374J322J401J109M13k07m43m77o08q35r20o46l0N34N41
$$ plain form
54175 136795 136814 136463 136369 136666 136730 136188 135677 136051 137110 137799 137580 137003 136812 137097 137519 137922 138305 138555 138546 138359
54155 138359 138106 137669 136887 135913 135122 134671 134391 134153 134106 134454 135109 135657 135700 135179 134416 133897 134005 134866 136261
54136 136261 137684 138689 139339 140147 141357 142408 142458 141469 140386 140105 140582 141136 141285 140988 140369 139694 139462
54119 139462 139997 140968 141750 142279 143020 143964 144295 143430 141952 140938 140743 141069 141956 143786 146232 148068 148536
54102 148536 148270 148329 148765 148903 148692 148896 149844 150861 151302 151546 152419 153996 155602 156774 157660 158388 158684 158344
54084 158344 157827 158031 159573 162431 166178 170435 175144 180494 186487 192531 197566 200680 201525 200157 196789
54069 196789 191958 186689 182098 178762 176634 175404 174596 173458 171389 168780 166965 166923 168209 169484 169864
54054 169864 169386 168497 167699 167592 168522 170012 171127 171720 172823 175461 179502 184054 188515 192704 196362 199313
$$ packed form
54175A36795J9l51r4K97O4n42n11L74J059O89k19n77j91K85M22M03L83K50rj87
54155A38359k53m37p82r74p91m51k80k38m7L48O55N48M3n21p63n19J08Q61J395
54136A36261J423J005O50Q08J210J051N0r89j083k81M77N54J49k97o19o75k32
54119A39462N35R71P82N29P41R44L31q65j478j014j95L26Q87J830K446J836M68
54102A48536k66N9M36J38k11K04R48J017M41K44Q73J577J606J172Q86P28K96l40
54084A58344n17K04J542K858L747M257M709N350N993O044N035L114Q45j368l368
54069A96789m831n269m591l336k128j230q08j138k069k609j815m2J286J275L80
54054A69864m78q89p98j07R30J490J115N93J103K638M041M552M461M189L658K951
$$ plain form
54038 199313 202000 205145 208822 212529 216271 220863 226772 233296 239394 244931 250532 256457 262293 267695
54024 267695 272806 277686 281812 284575 286210 287839 290453 293903 297024 298745 298914 297952 295939 292418 287137
54009 287137 280610 273731 267013 260413 253713 246844 240022 233781 228765 225225 222728 220549 218224 215623
53995 215623 212715 209595 206573 203851 201183 198247 195336 193234 192302 191996 191475 190394 188991 187713 186910
53980 186910 186645 186551 186111 185273 184598 184607 185138 185586 185583 185210 184727 184431 184669 185601 186848 187618 187395 186409 185384 184820
53960 184820 184631 184505 184551 185433 187684 190995 194416 197240 199441 201247 202710 203914 205321 207565 211029
53945 211029 215805 221860 229021 237046 246042 256594 269137 283255 297888 311912 324095 332823 336743
53932 336743 335974 332160 327134 321839 316608 311824 307820 304528 301756 299751 299113 300186 302723 306074 309593
$$ packed form
54038A99313K687L145L677L707L742M592N909O524O098N537N601N925N836N402
54024B67695N111M880M126K763J635J629K614L450L121J721J69r62k013l521n281
54009B87137o527o879o718o600o700o869o822o241n016l540k497k179k325k601
53995B15623k908l120l022k722k668k936k911k102r32l06n21j081j403j278q03
53980A86910k65r4m40q38o75RN31M48ll73m83k96K38R32J247P70k23r86j025n64
53960A84820j89j26M6Q82K251L311L421K824K201J806J463J204J407K244L464
53945B11029M776O055P161Q025Q996J0552J2543J4118J4633J4024J2183Q728L920
53932C36743p69l814n026n295n231m784m004l292k772k005o38J073K537L351L519
$$ plain form
53917 309593 312998 316497 320541 325398 331079 337576 344780 352116 358732 364268 369016 373043 375648 376163
53903 376163 374960 373048 370949 368567 365980 363619 361570 359350 356595 353506 350380 347104 343296 338622
53889 338622 332776 325604 317490 309274 301485 293883 286007 277915 270126 263112 257169 252487 248933 245943
53875 245943 243017 240181 237603 234921 231499 227413 223614 220884 218969 217031 214681 212226 210060 208160
53861 208160 206234 204089 201757 199441 197442 196038 195209 194497 193328 191569 189723 188462 188052 188263 188737
53846 188737 189223 189529 189528 189289 188989 188606 187945 187058 186336 185920 185282 183852 181946 180589 180359 180793 181154 181407
53828 181407 182106 183545 185374 187004 188059 188436 188259 187981 188286 189611 191740 194048 196152 198171 200272
53813 200272 202154 203254 203523 203771 205026 207576 210783 213825 216513 219423 223403 228953 235810 242958 249191
$$ packed form
53917C09593L405L499M044M857N681O497P204P336O616N536M748M027K605N15
53903C76163j203j912k099k382k587k361k049k220k755l089l126l276l808m674
53889C38622n846p172q114q216p789p602p876q092p789p014n943m682l554k990
53875B45943k926k836k578k682l422m086l799k730j915j938k350k455k166j900
53861B08160j926k145k332k316j999j404q29p12j169j759j846j261m10K11M74
53846A88737M86L06jk39l00l83o61q87p22m16o38j430j906j357k30M34L61K53
53828A81407O99J439J829J630J055L77j77k78L05J325K129K308K104K019K101
53813B00272J882J100K69K48J255K550L207L042K688K910L980N550O857P148O233
$$ plain form
53798 249191 253917 257431 260355 262995 265399 267823 270682 273992 277241 279998 282365 284620 286688 288286
53784 288286 289429 290377 291093 291101 289938 287489 283824 279074 273643 268251 263442 259094 254649 249789 244788
53769 244788 240178 236180 232456 228408 223818 219205 215428 212863 211095 209418 207418 205028 202364 199758
53755 199758 197748 196644 196253 196279 196787 197853 198845 198702 197154 195204 194093 194066 194525 195082 195946 197221 198389
53738 198389 198806 198476 197969 197634 197249 196576 195923 195839 196380 197076 197636 198286 199200 200002 200216 200021 200208 201456 203902
53719 203902 207263 210955 214109 215994 216632 216790 217260 218329 219892 221716 223478 224919 226151 227646 229787
53704 229787 232619 236011 239664 242901 244999 246025 246948 248615 250982 253721 257065 261368 266092 270013
53690 270013 272515 274083 275358 276342 276779 276800 276751 276640 276202 275323 274059 272342 270096 267630 265510 263939
$$ packed form
53798B49191M726L514K924K640K404K424K859L310L249K757K367K255K068J598
53784B88286J143R48P16Qj163k449l665m750n431n392m809m348m445m860n001
53769B44788m610l998l724m048m590m613l777k565j768j677k000k390k664k606
53755A99758k010j104l91K6N08J066R92j43j548j950j111k7M59N57Q64J275J168
53738A98389M17l30n07l35l85o73o53q4N41O96N60O50R14Q02K14j95J87J248K446
53719B03902L361L692L154J885O38J58M70J069J563J824J762J441J232J495K141
53704B29787K832L392L653L237K098J026R23J667K367K739L344M303M724L921
53690B70013K502J568J275R84M37K1m9j11m38q79j264j717k246k466k120j571
$$ plain form
53674 263939 262562 261118 259992 259772 260382 261017 260985 260336 259559 259002 258769 258902 259289 259497 259058 257956 256599
53657 256599 255372 254467 254088 254413 255272 256205 256990 257828 258842 259708 260033 259909 259904 260660 262567 265518 268749 271219
53639 271219 272459 272939 273408 274117 274917 275885 277424 279845 283098 286794 290227 292601 293691 294291 295600 298162
53623 298162 301644 305527 309606 313795 317954 322139 326759 332165 338209 344303 349814 354332 357779 360414
53609 360414 362666 364749 366477 367540 368037 368662 370237 372909 375826 377773 378220 377619 376700 375795 374965 374476
53593 374476 374733 375779 377131 378147 378462 378191 377785 377538 377156 376056 374189 372205 370551 368883 366795 364708
53577 364708 363377 362714 361772 359920 357455 355060 353217 352204 352062 352369 352511 352394 352490 353063 353769 354169 354215
53560 354215 354074 353931 354108 354941 356306 357722 359112 360944 363330 365596 367170 368468 370320 372910 375837
$$ packed form
53674B63939j377j444j126k20O10O35l2o49p77n57k33J33L87K08m39j102j357
53657B56599j227r05l79L25Q59R33P85Q38J014Q66L25j24nP56J907K951L231K470
53639B71219J240M80M69P09Q00R68J539K421L253L696L433K374J090O00J309K562
53623B98162L482L883M079M189M159M185M620N406O044O094N511M518L447K635
53609C60414K252K083J728J063M97O25J575K672K917J947M47o01r19r05q30m89
53593C74476K57J046J352J016L15k71m06k47l82j100j867j984j654j668k088k087
53577C64708j331o63r42j852k465k395j843j013j42L07J42j17R6N73P06M00M6
53560C54215j41j43J77Q33J365J416J390J832K386K266J574J298J852K590K927
$$ plain form
53545 375837 378894 382124 385267 387897 390211 393120 397279 402355 407420 411862 415805 419918 424956 431369
53531 431369 439142 447970 457564 467756 478452 489615 501284 513515 526309 539588 553161 566766
53519 566766 580397 594634 610349 627901 646807 666365 686376 707048 728520 750814 774036
53508 774036 798215 822997 847894 872823 898045 923511 948637 972872 996254 1019118 1041425
53497 1041425 1062647 1082409 1101092 1119609 1138598 1157942 1177137 1195943 1214451 1232628 1250165
53486 1250165 1266893 1283057 1299069 1315215 1331733 1348826 1366292 1383332 1399045 1413066 1425434
53475 1425434 1435943 1443947 1448937 1451087 1451079 1449384 1445781 1439593 1430410 1418538 1404744 1389758 1374259
53462 1374259 1359050 1344767 1331201 1317359 1302413 1286332 1269400 1251501 1232251 1211689 1190424
$$ packed form
53545C75837L057L230L143K630K314K909M159N076N065M442L943M113N038O413
53531D31369P773Q828R594J0192J0696J1163J1669J2231J2794J3279J3573J3605
53519E66766J3631J4237J5715J7552J8906J9558K0011K0672K1472K2294K3222
53508G74036K4179K4782K4897K4929K5222K5466K5126K4235K3382K2864K2307
53497A041425K1222J9762J8683J8517J8989J9344J9195J8806J8508J8177J7537
53486A250165J6728J6164J6012J6146J6518J7093J7466J7040J5713J4021J2368
53475A425434J0509Q004M990K150qj695l603o188r183j1872j3794j4986j5499
53462A374259j5209j4283j3566j3842j4946j6081j6932j7899j9250k0562k1265
$$ plain form
53451 1190424 1169142 1148175 1127537 1107210 1087410 1068635 1051331 1035510 1020907 1007610 996254
53440 996254 987447 981204 977008 974157 971929 969861 968101 967251 967683 969329 972169 976309 981341 986383 991325
53425 991325 997413 1005911 1016671 1028774 1042112 1057331 1074485 1092813 1111848 1131830 1152902 1174871
53413 1174871 1197946 1222828 1249741 1278146 1307773 1339138 1372602 1407703 1444085 1482391 1523503
53402 1523503 1567290 1612886 1659922 1708763 1759578 1811843 1864831 1918154 1971745 2025650 2080002
53391 2080002 2134973 2190630 2246768 2302698 2357197 2409028 2457806 2504128 2548629 2591159 2631088
53380 2631088 2668009 2701643 2731363 2756402 2776505 2791913 2802734 2808823 2810289 2807545 2800522 2788194
53368 2788194 2769183 2742704 2708791 2667960 2621117 2569746 2515790 2460961 2406105 2351237 2296147
$$ packed form
53451A190424k1282k0967k0638k0327j9800j8775j7304j5821j4603j3297j1356
53440I96254q807o243m196k851k228k068j760q50M32J646K840M140N032N042M942
53425I91325O088Q498J0760J2103J3338J5219J7154J8328J9035J9982K1072K1969
53413A174871K3075K4882K6913K8405K9627L1365L3464L5101L6382L8306M1112
53402A523503M3787M5596M7036M8841N0815N2265N2988N3323N3591N3905N4352
53391B080002N4971N5657N6138N5930N4499N1831M8778M6322M4501M2530L9929
53380B631088L6921L3634K9720K5039K0103J5408J0821O089J466k744p023j2328
53368B788194j9011k6479l3913m0831m6843n1371n3956n4829n4856n4868n5090
$$ plain form
53357 2296147 2240946 2186148 2132469 2080738 2031869 1986547 1944657 1905124 1866453 1827533 1787957
53346 1787957 1747749 1707056 1666227 1626061 1587710 1552035 1519007 1487924 1458357 1430707 1405594
53335 1405594 1382993 1362389 1343703 1327454 1313853 1302264 1291857 1282219 1272807 1262252 1249082 1233244
53323 1233244 1216321 1200071 1185158 1171446 1158935 1147935 1138540 1130403 1123049 1116281 1110353 1105964
53311 1105964 1103918 1104434 1106792 1109904 1113341 1117658 1123646 1131510 1140857 1151250 1162591 1175141 1189403
53298 1189403 1205846 1224550 1245181 1267461 1291481 1317257 1344159 1371304 1398468 1426033 1453855
53287 1453855 1480756 1505505 1527881 1548309 1566842 1583073 1596809 1608224 1617308 1623659 1626812 1626397
53275 1626397 1622096 1614028 1603133 1590623 1576854 1561179 1542957 1522192 1499102 1473708 1446241 1417507
$$ packed form
53357B296147n5201n4798n3679n1731m8869m5322m1890l9533l8671l8920l9576
53346A787957m0208m0693m0829m0166l8351l5675l3028l1083k9567k7650k5113
53335A405594k2601k0604j8686j6249j3601j1589j0407r638r412j0555j3170j5838
53323A233244j6923j6250j4913j3712j2511j1000r395q137p354o768n928m389
53311A105964k046N16K358L112L437M317N988P864R347J0393J1341J2550J4262
53298A189403J6443J8704K0631K2280K4020K5776K6902K7145K7164K7565K7822
53287A453855K6901K4749K2376K0428J8533J6231J3736J1415R084O351L153m15
53275A626397m301q068j0895j2510j3769j5675j8222k0765k3090k5394k7467k8734
$$ plain form
53263 1417507 1388462 1359665 1331288 1303254 1275124 1246341 1216911 1187546 1158890 1131026 1103976
53252 1103976 1078044 1053162 1028420 1002990 977201 952018 927680 903575 879343 855367 832115
53241 832115 809646 787888 766904 746741 727485 709590 693735 680207 668735 658936 650528 643114
53229 643114 636274 629916 624081 618279 611548 603320 593734 582954 570807 557367 543366 529508 515775
53216 515775 501841 487788 473972 460520 447473 435209 424159 414241 405062 396634 389395 383502
53204 383502 378481 373636 368444 362555 355791 348240 340154 331783 323522 316008 309578 303690 297449 290879
53190 290879 285133 281154 278552 276195 273528 270837 268450 266298 264273 262500 261035 259635 258040 256294
53176 256294 254522 252579 250218 247577 245238 243657 242744 242165 241966 242496 243575 244012 242513 239202 235861
$$ packed form
53263A417507k9045k8797k8377k8034k8130k8783k9430k9365k8656k7864k7050
53252A103976k5932k4882k4742k5430k5789k5183k4338k4105k4232k3976k3252
53241H32115k2469k1758k0984k0163j9256j7895j5855j3528j1472r799q408p414
53229F43114o840o358n835n802o731q228r586j0780j2147j3440j4001j3858j3733
53216E15775j3934j4053j3816j3452j3047j2264j1050r918r179q428p239n893
53204C83502n021m845n192n889o764p551q086q371q261p514o430n888o241o570
53190B90879n746l979k602k357k667k691k387k152k025j773j465j400j595j746
53176B56294j772j943k361k641k339j581r13n79j99N30J079M37j499l311l341
$$ plain form
53161 235861 234284 234437 234586 233267 230782 228610 227670 227575 227476 227148 226985 227169 227252 226569 224880 222520 220182
53144 220182 218674 218638 220100 222280 224091 225028 225461 225993 226770 227557 228251 228928 229490 229692 229667 230022 231093 232327
53126 232327 232794 232243 231319 230684 230296 229778 229254 229438 230818 232982 234928 235990 236361 236662 237203 237787 238159
53109 238159 238330 238353 238025 237111 235720 234184 232568 230624 228267 225842 223781 222252 221262 220762 220409 219543
53093 219543 217824 215825 214566 214442 214954 215515 216081 216840 217657 218167 218283 218305 218621 219391 220420 221208 221265 220514
53075 220514 219220 217510 215326 213026 211478 211038 210839 209805 208150 207085 207080 207376 207368 207463 207965 208086 207013
53058 207013 205398 204666 205070 205469 205111 204684 205289 207096 209419 211592 213364 214820 216217 217668 218793 219011
53042 219011 218225 216872 215256 213365 211420 209948 209076 208379 207774 207909 209180 210982 212462 213472 214155 214197
$$ packed form
53161B35861j577J53J49j319k485k172r40r5r9l28j63J84Q3o83j689k360k338
53144B20182j508l6J462K180J811R37M33N32P77P87O94O77N62K02k5L55J071J234
53126B32327M67n51r24o35l88n18n24J84J380K164J946J062L71L01N41N84L72
53109B38159J71K3l28r14j391j536j616j944k357k425k061j529r90n00l53q66
53093B19543j719j999j259j24N12N61N66P59Q17N10J16K2L16P70J029P88N7p51
53075B20514j294j710k184k300j548m40j99j034j655j065nK96qR5N02J21j073
53058B07013j615p32M04L99l58m27O05J807K323K173J772J456J397J451J125K18
53042B19011p86j353j616j891j945j472q72o97o05J35J271J802J480J010O83M2
$$ plain form
53026 214197 213297 212027 211345 211482 212036 212929 214334 215849 216694 216820 216960 217480 217991 218213 218399 218646 218616 218243
53008 218243 217953 217854 217514 216927 216879 217760 218730 218809 218242 217972 218250 218550 218632 218802 219189 219526 219740 220216 221276 222732
52988 222732 224052 224781 224892 224911 225532 226834 228130 228860 229318 230067 230984 231546 231883 232780 234572 236705 238575
52971 238575 240265 242149 244172 245913 247080 247687 247918 248032 248286 248788 249485 250303 251148 251776 251880 251404 250588
52954 250588 249633 248525 247247 245935 244644 243141 241166 238820 236510 234530 232861 231386 230104 229013
52940 229013 227952 226843 226048 226116 226950 227594 227241 226259 225712 225975 226451 226727 227204 228200 229042 228770 227472 226252
52922 226252 225961 226396 226762 226498 225647 224678 223965 223305 222180 220670 219707 219991 220987 221552 221312 220805 220434 220067
52904 220067 219694 219726 220330 221038 221317 221184 221036 221138 221403 221413 220646 219075 217572 217206 218059 219187 219860 220263
$$ packed form
53026B14197r00j270o82J37N54Q93J405J515Q45J26J40N20N11K22J86K47l0l73
53008B18243k90r9l40n87m8Q81R70P9n67k70K78L00Q2J70L87L37K14M76J060J456
52988B22732J320P29J11J9O21J302J296P30M58P49R17N62L37Q97J792K133J870
52971B38575J690J884K023J741J167O07K31J14K54N02O97Q18Q45O28J04m76q16
52954B50588r55j108j278j312j291j503j975k346k310j980j669j475j282j091
52940B29013j061j109p95O8Q34O44l53r82n47K63M76K76M77R96Q42k72j298j220
52922B26252k91M35L66k64q51r69p13o60j125j510r63K84R96N65k40n07l71l67
52904B20067l73L2O04P08K79j33j48J02K65J0p67j571j503l66Q53J128O73M03
$$ plain form
52886 220263 220796 221347 221721 222222 223214 224453 225389 225898 226264 226617 226953 227585 228995 231125 233302 234947 236059
52869 236059 236840 237231 237097 236653 236340 236238 235867 234730 232937 231152 229989 229655 230129 231314 232826 234004
52853 234004 234492 234646 234962 235261 234848 233434 231419 229188 226641 223661 220561 217835 215645 213826 212152
52838 212152 210469 208761 207192 205897 204693 203355 202185 201836 202407 203202 203722 204406 205948 208204 210323
52823 210323 211740 212525 212812 212434 211254 209549 207931 206988 206947 207517 208102 208333 208333 208398 208563 208667 208640 208482 208110
52804 208110 207536 207111 207304 208187 209288 209963 209823 208959 207885 207197 207113 207385 207658 207724 207415 206582 205438 204586
52786 204586 204441 204802 205277 205836 206581 207211 207221 206577 205766 205161 204671 204069 203322 202548 201881 201435 201169 200807 200055
52767 200055 198917 197657 196468 195385 194438 193704 193246 193081 193087 192919 192332 191768 192197 194010 196427 198483 200246
$$ packed form
52886B20263N33N51L74N01R92J239R36N09L66L53L36O32J410K130K177J645J112
52869B36059P81L91j34m44l13j02l71j137j793j785j163l34M74J185J512J178
52853B34004M88J54L16K99m13j414k015k231k547k980l100k726k190j819j674
52838B12152j683j708j569j295j204j338j170l49N71P95N20O84J542K256K119
52823B10323J417P85K87l78j180j705j618r43m1N70N85K31%O5J65J04k7j58l72
52804B08110n74m25J93Q83J101O75j40q64j074o88q4K72K73O6l09q33j144q52
52786B04586j45L61M75N59P45O30J0o44q11o05m90o02p47p74o67m46k66l62p52
52767B00055j138j260j189j083r47p34m58j65Oj68n87n64M29J813K417K056J763
$$ plain form
52750 200246 202439 205118 207533 209281 210742 212170 213160 213432 213565 214404 216073 218010 219683 220933 221846
52735 221846 222709 223920 225566 227191 228194 228395 228056 227569 227374 227973 229612 231925 234090 235372 235459 234422
52719 234422 232634 230681 229137 228258 227837 227365 226472 225366 224753 225019 225589 225439 224323 223068 222495 222466 222300
52702 222300 221753 221215 221170 221855 223250 224984 226382 227042 227318 227835 228566 228808 228147 227035 226209 225828 225447 224728
52684 224728 223945 223725 224314 225180 225531 225264 225106 225598 226185 225741 223915 221477 219316 217590 216049 214787 214219
52667 214219 214491 215269 216175 217160 218373 219764 220982 221746 222246 222994 224221 225688 227284 229480 232714 236458
52651 236458 239561 241645 243595 246332 249526 251931 252591 251348 248520 244695 240711 237237 234310 231639
52637 231639 229330 227885 227495 227807 228441 229293 230216 230876 231176 231497 232281 233689 235833 238912 242736 246356
$$ packed form
52750B00246K193K679K415J748J461J428R90K72J33Q39J669J937J673J250R13
52735B21846Q63J211J646J625J003K01l39m87j95N99J639K313K165J282Q7j037
52719B34422j788j953j544q79m21m72q93j106o13K66N70j50j116j255n73k9j66
52702B22300n47n38m5O85J395J734J398O60K76N17P31K42o61j112q26l81l81p19
52684B24728p83k20N89Q66L51k67j58M92N87m44j826k438k161j726j541j262n68
52667B14219K72P78R06R85J213J391J218P64N00P48J227J467J596K196L234L744
52651B36458L103K084J950K737L194K405O60j243k828l825l984l474k927k671
52637B31639k309j445l90L12O34Q52R23O60L00L21P84J408K144L079L824L620
$$ plain form
52621 246356 248617 249029 247900 245811 243225 240501 237913 235629 233788 232502 231668 230994 230368 230004 230003 230024 229714
52604 229714 229217 228861 228593 228214 228003 228476 229526 230397 230695 230850 231338 231945 232188 232013 231683 231292 230902 230898 231656
52585 231656 232878 233744 233824 233512 233452 233816 234334 234798 235318 236133 237281 238428 238985 238553 237385 236324 236056 236416
52567 236416 236553 235860 234550 233244 232182 231194 230339 230088 230662 231556 232039 231911 231445 230799 229918 228943 228272 228136
52549 228136 228406 228819 229152 229254 229256 229697 230957 232498 233194 232600 231507 231024 231508 232599 233859 235005 235839
52532 235839 236381 236896 237515 237970 237947 237460 236654 235602 234545 234009 234231 234733 234871 234650 234559 234768 235001 235088 235185
52513 235185 235372 235486 235484 235714 236697 238749 241783 245354 248997 252665 256645 260881 264632 267072 267925 267233
52497 267233 264931 261263 257278 254102 251722 249163 245960 242781 240415 238845 237689 237019 237176 238061 239075
$$ packed form
52621B46356K261M12j129k089k586k724k588k284j841j286q34o74o26l64jK1l10
52604B29714m97l56k68l79k11M73J050Q71K98J55M88O07K43j75l30l91l90mP58
52585B31656J222Q66Q0l12o0L64N18M64N20Q15J148J147N57m32j168j061k68L60
52567B36416J37o93j310j306j062r88q55k51N74Q94M83j28m66o46q81r75o71j36
52549B28136K70M13L33J02KM41J260J541O96n94j093m83M84J091J260J146Q34
52532B35839N42N15O19M55k3m87q06j052j057n36K22N02J38k21r1K09K33Q7R7
52513B35185J87J14kK30R83K052L034L571L643L668L980M236L751K440Q53o92
52497B67233k302l668l985l176k380k559l203l179k366j570j156o70J57Q85J014
$$ plain form
52482 239075 239665 239652 239123 238308 237551 237219 237546 238416 239233 239205 238143 236986 237113 238945 241517 243580 244856
52465 244856 246046 247858 250301 252779 254676 255863 256749 257864 259421 261287 263160 264582 265014 264306 262999
52450 262999 261753 260543 258837 256462 253735 250798 247492 244089 241425 239967 239310 238970 239119 239995 241083
52435 241083 241493 240869 239403 237289 234844 232950 232574 233764 235661 237527 239262 240876 242073 242647 242840
52420 242840 242938 242845 242400 241904 241950 242779 244093 245569 247260 249368 251778 254209 256883 260730 266612 274477
52404 274477 283542 293226 303362 313432 322073 327740 329609 327698 322551 315261 307389 300155 293691 287599
52390 287599 282249 278838 277926 278397 278359 276944 274864 273357 272953 273290 273754 274067 274383 275112 276660 279152 282307
52373 282307 285722 289360 293570 298551 304019 309589 315200 320770 325685 329267 331768 334225 337100 339605
$$ packed form
52482B39075N90j3n29q15p57l32L27Q70Q17k8j062j157J27J832K572K063J276
52465B44856J190J812K443K478J897J187Q86J115J557J866J873J422M32p08j307
52450B62999j246j210j706k375k727k937l306l403k664j458o57l40J49Q76J088
52435B41083M10o24j466k114k445j894l76J190J897J866J735J614J197N74J93
52420B42840R8r3m45m96M6Q29J314J476J691K108K410K431K674L847N882P865
52404B74477R065R684J0136J0070Q641N667J869j911n147p290p872p234o464o092
52390B87599n350l411r12M71l8j415k080j507m04L37M64L13L16P29J548K492L155
52373B82307L415L638M210M981N468N570N611N570M915L582K501K457K875K505
$$ plain form
52359 339605 340765 340638 339980 339072 337537 335203 332651 330826 330387 331383 333273 335335 337344 339788 343179
52344 343179 347355 351732 356046 360466 365142 370144 375755 382294 389609 397173 404773 412756 421599 431594
52330 431594 442969 455845 469974 484911 500531 517038 534459 552684 572074 593428 616982
52319 616982 641875 666921 691516 715480 738489 760192 780664 800224 818882 836431 852939
52308 852939 868744 883978 898468 912107 924949 936863 947459 956491 964086 970450 975525 979117
52296 979117 981224 982098 982009 981034 979027 975780 971193 965260 957949 949272 939609 929768 920517 912106 904477
52281 904477 897846 892755 889529 888014 888017 889759 893664 899924 908519 919408 932365 946729 961743 977199
52267 977199 993338 1010029 1026527 1042277 1057471 1072335 1086247 1098347 1108939 1119462 1130750
$$ packed form
52359C39605J160j27o58r08j535k334k552j825m39R96J890K062K009K444L391
52344C43179M176M377M314M420M676N002N611O539P315P564P600P983Q843R995
52330D31594J1375J2876J4129J4937J5620J6507J7421J8225J9390K1354K3554
52319F16982K4893K5046K4595K3964K3009K1703K0472J9560J8658J7549J6508
52308H52939J5805J5234J4490J3639J2842J1914J0596R032P595O364N075L592
52296I79117K107Q74q9r75k007l247m587n933p311q677r663r841r251q411p629
52281I04477o631n091l226j515LJ742L905O260Q595J0889J2957J4364J5014J5456
52267I77199J6139J6691J6498J5750J5194J4864J3912J2100J0592J0523J1288
$$ plain form
52256 1130750 1141924 1151453 1158867 1164927 1170435 1175484 1179726 1182785 1184317 1184129 1182313 1178975 1173839 1166454
52242 1166454 1156765 1145116 1131753 1116809 1100839 1084790 1069225 1054029 1039133 1025005 1012123
52231 1012123 1000445 989901 980946 973952 968262 962619 956593 951018 946879 944305 942887 942398 942745 943522
52217 943522 944169 944604 945371 947044 949723 953217 957531 962901 969340 976365 983335 989956 996238 1001952 1006519
52202 1006519 1009680 1012067 1014686 1017842 1020898 1023198 1024902 1026709 1028999 1031535 1033930 1036099 1038146 1040012
52188 1040012 1041459 1042462 1043516 1045404 1048469 1052131 1055208 1056756 1056493 1054487 1050805 1045640 1039475 1032674
52174 1032674 1025057 1016310 1006865 997876 990140 983415 977121 971342 966676 963335 960999 959565 959444 960880
52160 960880 963416 966393 969686 973616 978351 983714 989397 994935 999571 1002577 1003886 1004169 1004199 1004296 1004382 1004294
$$ packed form
52256A130750J1174R529P414O060N508N049M242L059J532j88j816l338n136p385
52242A166454r689j1649j3363j4944j5970j6049j5565j5196j4896j4128j2882
52231A012123j1678j0544q955o994n690n643o026n575m139k574j418m89L47P77
52217I43522O47M35P67J673K679L494M314N370O439P025O970O621O282N714M567
52202A006519L161K387K619L156L056K300J704J807K290K536K395K169K047J866
52188A040012J447J003J054J888L065L662L077J548k63k006l682n165o165o801
52174A032674p617q747r445q989p736o725o294n779m666l341k336j434j21J436
52160I60880K536K977L293L930M735N363N683N538M636L006J309K83L0R7Q6q8
$$ plain form
52144 1004294 1003970 1003546 1003460 1004329 1006586 1010222 1014786 1019526 1023664 1026887 1029722 1033232 1038273 1045114 1053705
52129 1053705 1063956 1075772 1089232 1104858 1123336 1144703 1168219 1193369 1220529 1250146 1281593
52118 1281593 1313575 1345575 1378114 1411382 1444288 1475276 1503591 1529299 1552422 1572608 1589507
52107 1589507 1602911 1612543 1618158 1620010 1618872 1615392 1609673 1601668 1591835 1581166 1570615 1560578 1550856
$$ packed form
52144A004294l24m24q6Q69K257L636M564M740M138L223K835L510N041O841Q591
52129A053705J0251J1816J3460J5626J8478K1367K3516K5150K7160K9617L1447
52118A281593L1982L2000L2539L3268L2906L0988K8315K5708K3123K0186J6899
52107A589507J3404R632N615J852j138l480n719q005r833j0669j0551j0037r722
$$ [...]
##END NTUPLES=NMR SPECTRUM
##END=
