
##TITLE=AC1297_GUAAH11109_6613995_9oJLyBijUr
##JCAMPDX= 6.0         $$ Bruker NMR JCAMP-DX V2.0
##DATA TYPE= NMR SPECTRUM
##DATA CLASS= NTUPLES
##ORIGIN= BRUKER
##OWNER= Administrator
$$ 1.72 TOPSPIN		Version 2.1
$$ 2012-08-02 15:23:12.015 -0500  Administrator@TOPSPIN
$$ Compression mode = diff/dup
##.OBSERVE FREQUENCY= 400.02188249412
##.OBSERVE NUCLEUS= ^1H
##.ACQUISITION MODE= SIMULTANEOUS (DQD)
##.ACQUISITION SCHEME= undefined
##.AVERAGES= 8
##.DIGITISER RES= 22
##SPECTROMETER/DATA SYSTEM= spect
##.PULSE SEQUENCE= zg30
##.SOLVENT NAME= COFFEE_meoh
##.SHIFT REFERENCE= INTERNAL, COFFEE_meoh, 1, 14.98509
##AUDIT TRAIL= $$ (NUMBER, WHEN, WHO, WHERE, PROCESS, VERSION, WHAT)
$$ ##TITLE= Audit trail, TOPSPIN		Version 2.1
$$ ##JCAMPDX= 5.01
$$ ##ORIGIN= Bruker BioSpin GmbH
$$ ##OWNER= Administrator
$$ $$ C:\Bruker\TOPSPIN/data/COFFEE/nmr/AC1297_GUAAH11109_6613995_9oJLyBijUr/10/pdata/1/auditp.txt
$$ ##AUDIT TRAIL=  $$ (NUMBER, WHEN, WHO, WHERE, PROCESS, VERSION, WHAT)
(   1,<2012-08-02 15:23:02.562 -0500>,<Administrator>,<TOPSPIN>,<go>,<TOPSPIN 2.1>,
      <created by zg
	started at 2012-08-02 15:21:55.937 -0500,
	POWCHK enabled, PULCHK disabled,
       configuration hash MD5:
       6B 1B 68 BB D9 2E 58 E2 7F 35 AD 54 07 DF 0E 41
       data hash MD5: 64K
       1F BE 7D 53 EA F1 3E 71 F6 90 F3 0A EC 02 EE 5F>)
(   2,<2012-08-02 15:23:05.531 -0500>,<Administrator>,<TOPSPIN>,<proc1d>,<TOPSPIN 2.1>,
      <Start of raw data processing
       efp LB = 0 FT_mod = 6 PKNL = 1 PHC0 = 0 PHC1 = 0 SI = 32K 
       data hash MD5: 32K
       56 2F 76 8F 14 DC E6 C7 4F 7D D3 88 05 D1 A7 DC>)
(   3,<2012-08-02 15:23:06.203 -0500>,<Administrator>,<TOPSPIN>,<proc1d>,<TOPSPIN 2.1>,
      <pk PHC0 = 180.9558 PHC1 = 0 
       data hash MD5: 32K
       87 2C FE 72 EA 6B 19 3A 03 B2 71 40 01 F3 39 0F>)
(   4,<2012-08-02 15:23:06.687 -0500>,<Administrator>,<TOPSPIN>,<proc1d>,<TOPSPIN 2.1>,
      <abs ABSG = 1 
       data hash MD5: 32K
       75 09 47 AF 3C 8A BF E4 8A 60 6B C9 9D 09 65 B8>)
(   5,<2012-08-02 15:23:07.109 -0500>,<Administrator>,<TOPSPIN>,<proc1d>,<TOPSPIN 2.1>,
      <abs ABSG = 2 
       data hash MD5: 32K
       B8 E2 D3 B4 74 3E 7F 7B 02 3B 6C 8B 33 64 42 CE>)
(   6,<2012-08-02 15:23:07.531 -0500>,<Administrator>,<TOPSPIN>,<proc1d>,<TOPSPIN 2.1>,
      <abs ABSG = 3 
       data hash MD5: 32K
       08 69 08 2A 99 61 42 38 0C 8E 5C 88 F7 89 BE BB>)
(   7,<2012-08-02 15:23:07.875 -0500>,<Administrator>,<TOPSPIN>,<proc1d>,<TOPSPIN 2.1>,
      <abs ABSG = 4 
       data hash MD5: 32K
       72 F0 FB 16 AC 4D 50 D0 3A D6 4E 1D 18 7D BB 1D>)
(   8,<2012-08-02 15:23:08.234 -0500>,<Administrator>,<TOPSPIN>,<proc1d>,<TOPSPIN 2.1>,
      <abs ABSG = 5 
       data hash MD5: 32K
       0E E6 E6 3E 64 34 4F EF BE CA 65 77 7E 8C 7E 00>)
$$ ##END=
$$ 
$$ $$ hash MD5
$$ $$ 68 47 0A 8D 29 3E 97 CB 87 25 0E 2C 47 D8 1D 57
##$RELAX= 
##$RELAX= 
##$RELAX= 
##$RELAX= 
##$RELAX= 
##$RELAX= 
##$RELAX= 
$$ Bruker specific parameters
$$ --------------------------
$$ [...]
##$TP= (0..7)
150 150 150 150 150 150 150 150
##$TP07= 0
##$TPNAME0= <>
##$TPNAME1= <>
##$TPNAME2= <>
##$TPNAME3= <>
##$TPNAME4= <>
##$TPNAME5= <>
##$TPNAME6= <>
##$TPNAME7= <>
##$TPOAL= (0..7)
0.5 0.5 0.5 0.5 0.5 0.5 0.5 0.5
##$TPOFFS= (0..7)
0 0 0 0 0 0 0 0
##$TUNHIN= 0
##$TUNHOUT= 0
##$TUNXOUT= 0
##$USERA1= <user>
##$USERA2= <user>
##$USERA3= <user>
##$USERA4= <user>
##$USERA5= <user>
##$V9= 5
##$VALIST= <valist>
##$VCLIST= <CCCCCCCCCCCCCCC>
##$VD= 0
##$VDLIST= <DDDDDDDDDDDDDDD>
##$VPLIST= <PPPPPPPPPPPPPPP>
##$VTLIST= <TTTTTTTTTTTTTTT>
##$WBST= 1024
##$WBSW= 4
##$XGAIN= (0..3)
0 0 0 0
##$XL= 0
##$YL= 0
##$YMAX_a= 479124
##$YMIN_a= -627777
##$ZGOPTNS= <>
##$ZL1= 120
##$ZL2= 120
##$ZL3= 120
##$ZL4= 120
##$ABSF1= 14.98509
##$ABSF2= -5.573092
##$ABSG= 5
##$ABSL= 3
##$ALPHA= 0
##$AQORDER= 0
##$ASSFAC= 0
##$ASSFACI= 0
##$ASSFACX= 0
##$ASSWID= 0
##$AUNMP= <proc_prof1d_extract_pilot.lims>
##$AXLEFT= 0
##$AXNAME= <>
##$AXNUC= <1H>
##$AXRIGHT= 0
##$AXTYPE= 0
##$AXUNIT= <>
##$AZFE= 0.1
##$AZFW= 0.1
##$BCFW= 0
##$BC_mod= 0
##$BYTORDP= 0
##$COROFFS= 0
##$CY= 15
##$DATMOD= 1
##$DC= 0
##$DFILT= <>
##$DTYPP= 0
##$F1P= 0
##$F2P= 0
##$FCOR= 0.5
##$FTSIZE= 32768
##$FT_mod= 6
##$GAMMA= 0
##$GB= 0
##$INTBC= 1
##$INTSCL= 1
##$ISEN= 128
##$LB= 0
##$LEV0= 0
##$LPBIN= 0
##$MAXI= 10000
##$MC2= 0
##$MEAN= 0
##$ME_mod= 0
##$MI= 0
##$NCOEF= 0
##$NC_proc= -8
##$NLEV= 6
##$NOISF1= 0
##$NOISF2= 0
##$NSP= 0
##$NTH_PI= 0
##$NZP= 0
##$OFFSET= 14.98509
##$PC= 1
##$PHC0= 180.9558
##$PHC1= 0
##$PH_mod= 1
##$PKNL= yes
##$PPARMOD= 0
##$PPDIAG= 0
##$PPIPTYP= 0
##$PPMPNUM= 2147483647
##$PPRESOL= 1
##$PSCAL= 4
##$PSIGN= 0
##$PYNMP= <proc.py>
##$REVERSE= no
##$SF= 400.02
##$SI= 32768
##$SIGF1= 0
##$SIGF2= 0
##$SINO= 400
##$SIOLD= 32768
##$SPECTYP= <>
##$SREGLST= <1H.CDCl3>
##$SSB= 0
##$STSI= 32768
##$STSR= 0
##$SW_p= 8223.68421052631
##$SYMM= 0
##$S_DEV= 0
##$TDeff= 65536
##$TDoff= 0
##$TI= <>
##$TILT= no
##$TM1= 0
##$TM2= 0
##$TOPLEV= 0
##$USERP1= <user>
##$USERP2= <user>
##$USERP3= <user>
##$USERP4= <user>
##$USERP5= <user>
##$WDW= 1
##$XDIM= 32768
##$YMAX_p= 456557351
##$YMIN_p= -792343
##$CURPLOT= <Network HP LaserJet P1505>
##$CURPRIN= <$Network HP LaserJet P1505>
##$DFORMAT= <normdp>
##$LAYOUT= <+/1D_H.xwp>
##$LFORMAT= <normlp>
##$PFORMAT= <normpl>
##$SURQMSG= 1
$$ End of Bruker specific parameters
$$ ---------------------------------
##NTUPLES= NMR SPECTRUM
##VAR_NAME=  FREQUENCY,     SPECTRUM/REAL,   SPECTRUM/IMAG
##SYMBOL=    X,             R,               I
##VAR_TYPE=  INDEPENDENT,   DEPENDENT,       DEPENDENT
##VAR_FORM=  AFFN,          ASDF,            ASDF
##VAR_DIM=   32768,         32768,           32768
##UNITS=     HZ,            ARBITRARY UNITS, ARBITRARY UNITS
##FACTOR=    0.250966925370066, 1,           1
##FIRST=     8223.43324360094, 21597,        14087
##LAST=      0,             -16674,          20058
##MIN=       0,             -792343,         0
##MAX=       8223.43324360094, 456557351,    0
$$ Real data points
##PAGE= N=1
##DATA TABLE= (X++(R..R)), XYDATA
$$ [...]
19487F1844b78158K3247R6771N6338j97702a35061N6639l5330K7598L8016G4597
$$ 61844 -278158 -254911 -158140 -101802 -299504 -135061 -78422 -113752 -86154 -48138 74597
19475I8973a65632j98329k1813f2418k76345a48517D89270d24421c7732k3588
$$ 98973 -165632 -363961 -385774 -62418 -338763 -148517 489270 -424421 -37732 -61320
19465f1320l61856Q7563a36148D3720A7596J36677K1106a88144a2433j32770j94923
$$ -61320 -423176 -335613 -136148 43720 17596 154273 175379 -188144 -12433 -145203 -340126
19454c40126o892P801A45472E1465J23626a13838n0186j21795A4567J11679a26097
$$ -340126 -347018 -339217 145472 51465 175091 -113838 -164024 -285819 14567 126246 -126097
19442a40929B2707a84252n7107J19580a9230j32656A3458o703a17511D9466a21049
$$ -140929 22707 -184252 -241359 -121779 -19230 -151886 13458 6755 -117511 49466 -121049
19430I6756l792a93778e4675k69806h1280E0437e8771o2747B6510c43293F4649
$$ 96756 92964 -193778 -54675 -324481 -81280 50437 -58771 -121518 26510 -343293 64649
19418H0218d73155J95421j57797a55549j17176H1291f7202j19381E8905d30308
$$ 80218 -473155 -277734 -435531 -155549 -272725 81291 -67202 -186583 58905 -430308
19407d85899f809m5639j50883A96814a21780C3406a3259B45015F1139B9526A2166
$$ -485899 -6809 -52448 -203331 196814 -121780 33406 -13259 245015 61139 29526 12166
19395C7301a44959k8849k98738a02566J6461A83976b31235r492a01393j82741
$$ 37301 -144959 -173808 -472546 -102566 -86105 183976 -231235 -240727 -101393 -284134
19385b84134f0764C26900c8155D2374e86985b11113O0585j37719e888A25305K28197
$$ -284134 -60764 326900 -38155 42374 -586985 -211113 -150528 -288247 -5888 125305 353502
19374C53502c70572F917c47121A94036k0020l7448n1055J0416d4457n044A04595
$$ 353502 -370572 6917 -347121 194036 174016 136568 85513 95929 -44457 -49501 104595
19362F1711d7667j49752a2716G3305g09250b53482h6269I4971c40312G6819J08980
$$ 61711 -47667 -197419 -12716 73305 -709250 -253482 -86269 94971 -340312 76819 185799
19351A85799F8479b4578r0420j29657o144L6606A62136b78094a11756A10133J28548
$$ 185799 68479 -24578 -114998 -244655 -250799 -214193 162136 -278094 -111756 110133 238681
19340B38681c0292E3836J09107b20719C05325a85839N1737b8399j39172M4606
$$ 238681 -30292 53836 162943 -220719 305325 -185839 -134102 -28399 -167571 -122965
19330a22965B67110c35318A61194c26832E1240q243i7804F0662a4152m1316b429
$$ -122965 267110 -335318 161194 -326832 51240 42997 -97804 60662 -14152 -55468 -2429
19318b11821Q743O9554d2680B4896d39265A00248c0312k41735k7088F2700A7094
$$ -211821 -203078 -133524 -42680 24896 -439265 100248 -30312 -272047 -299135 62700 17094
19306b91323a19379A00823Q0168I855a6186k78270h7472q982K7848r806j8705
$$ -291323 -119379 100823 180991 9855 -16186 -294456 -87472 -96454 -68606 -78412 -97117
19295i7117A71570a89030g2793j73296p0368e5968r6518a3633r8925C12512c32724
$$ -97117 171570 -189030 -72793 -246089 -316457 -55968 -152486 -13633 -112558 312512 -332724
19283a39874k27309F254b73811f1602r0269B6177a05728k08301R9075M0521h1823
$$ -139874 -367183 6254 -273811 -61602 -151871 26177 -105728 -314029 -214954 -174433 -81823
19271D7471J58026K611n5779D6133J6665h0002A49223b7804D814N9869h3594M744
$$ 47471 205497 208108 152329 46133 62798 -80002 149223 -27804 4814 64683 -83594 -78850
19259g8850E2207d57955D1864d12524A59289a88046j42114j9259A85965e5834
$$ -78850 52207 -457955 41864 -412524 159289 -188046 -330160 -349419 185965 -55834
19248g2821j91135A05112c6088A8646c62286a72375j7365L2307A61411b80863
$$ -72821 -263956 105112 -36088 18646 -362286 -172375 -189740 -157433 161411 -280863
19237a76867A73161c612l09155A73082g3830G2215K737c988j16264d0724l10178
$$ -176867 173161 -3612 -312767 173082 -73830 72215 74952 -3988 -120252 -40724 -350902
19226c50902J46544j5785Q0030k21380a41251C4718a28450k48380J36580k0898
$$ -350902 -204358 -220143 -140113 -361493 -141251 34718 -128450 -376830 -240250 -261148
19216b61148l8505C1575c9678a6021D8121a08103B92175b58042C06857Q6082f697
$$ -261148 -299653 31575 -39678 -16021 48121 -108103 292175 -258042 306857 392939 -6697
19204a8346A48179j8930E161N7054L035b17946F1399b87245F7078L62248a12187
$$ -18346 148179 129249 5161 62215 65250 -217946 61399 -287245 67078 429326 -112187
19192a30851H3564a18396j90221C4583a647A4752b56069e9837G779b20399m8263
$$ -130851 83564 -118396 -308617 34583 -1647 14752 -256069 -59837 7779 -220399 -268662
19181b68662B8836c26B5167a66626p4563P3593A74238b55600Q4712L7882J1786
$$ -268662 28836 -326 25167 -166626 -241189 -167596 174238 -255600 -170888 -133006 -121220
19170a21220a3349H9996c60054A87988J31612F059c6318o6329r4198C097J5316
$$ -121220 -13349 89996 -360054 187988 319600 6059 -36318 -102647 -196845 3097 18413
19159A8413d33158F2266b48795P6303O0160E2421j7781F26d738B96974b05052
$$ 18413 -433158 62266 -248795 -172492 -112332 52421 34640 626 -4738 296974 -205052
19147B81816b50978j45000a38952L8137d5975m1093L3625k11615j22741b1254
$$ 281816 -250978 -395978 -138952 -100815 -45975 -87068 -53443 -265058 -387799 -21254
19136a41698G2002c2465E9788R8493a30949N5235H7422c33C155b25637g0625B14046
$$ -141698 72002 -32465 59788 158281 -130949 -75714 87422 -333 3155 -225637 -70625 214046
19123d7055j47021b5837B09083b76062J17499j7843f2664l0670G3439a58031A49280
$$ -47055 -194076 -25837 209083 -276062 -158563 -176406 -62664 -93334 73439 -158031 149280
19111C8581c3868H4691a71322H1816c6901k03238A00849a90896A34697f9191j92777
$$ 38581 -33868 84691 -171322 81816 -36901 -240139 100849 -190896 134697 -69191 -261968
19100b61968C3060b15644f7620K4581o1947k58018d6211j67286B17886b27163
$$ -261968 33060 -215644 -67620 -43039 -104986 -363004 -46211 -213497 217886 -227163
19089A28339F975g1095p7578D1131b10457b570D9565d05671A51955N831a41791
$$ 128339 6975 -71095 -148673 41131 -210457 -2570 49565 -405671 151955 157786 -141791
19077h5142m07449a09567K299I4608a1254l3675j46525Q4582M373A79c108A49773
$$ -85142 -492591 -109567 -107268 94608 -11254 -44929 -191454 -106872 -102499 179 -3108 149773
19064F3938M9023a80786a2231k97284f6804k4701L6487j18706F1960a4060n5842
$$ 63938 112961 -180786 -12231 -309515 -66804 -91505 -55018 -173724 61960 -14060 -69902
19053f9902n5099A83770i1111m7579C7705b96370i1493B31482a53038a6683A82147
$$ -69902 -125001 183770 -91111 -138690 37705 -296370 -91493 231482 -153038 -16683 182147
19041H0702j9100a92101F9212e5871k9041G1886a33632o7197e1644k0413j37497
$$ 80702 61602 -192101 69212 -55871 -84912 71886 -133632 -200829 -51644 -72057 -209554
19030b09554A60549o7569C0280d6060A7911J16512D689J58009k9765b40942g4803
$$ -209554 160549 92980 30280 -46060 17911 134423 4689 162698 132933 -240942 -74803
19018b69799j34620J32822G0019b41157B5871J35682c90465a81940d4798k5856
$$ -269799 -404419 -271597 70019 -241157 25871 161553 -390465 -181940 -44798 -70654
19008g0654J8573A08033M9124o8488J66902a38466l07179g1225j41101A56837
$$ -70654 -52081 108033 157157 88669 255571 -138466 -445645 -71225 -212326 156837
18997c25393C892J61768b37536C4545J73379b00635G7709b72005C1407I018c0040
$$ -325393 3892 165660 -237536 34545 207924 -200635 77709 -272005 31407 9018 -30040
18985A98067C271a57804l4900e6491B60245j04826b33618M5222h7456j94917J14721
$$ 198067 3271 -157804 -192704 -56491 260245 155419 -233618 -188396 -87456 -282373 -167652
18974a67652B02352b9794G0337M26362Q7516k90124J0822Q9136A03818M43b6992
$$ -167652 202352 -29794 70337 496699 584215 294091 304913 394049 103818 104261 -26992
18962a33899e6432k00278A11587e0679A00400c4396l9076C4779a87306L1789k07615
$$ -133899 -56432 -256710 111587 -50679 100400 -34396 -73472 34779 -187306 -155517 -363132
18951c63132R7956b9554o9894I8484J24765a31460B27951g5662p5359o9705p8651
$$ -363132 -265176 -29554 -99448 98484 223249 -131460 227951 -75662 -151021 -220726 -299377
18940b99377e3165B526a49584A12340d64448a08119M5488K3159D05651g4206A23089
$$ -299377 -53165 2526 -149584 112340 -464448 -108119 -62631 -39472 405651 -74206 123089
18928a34142n8861A8059a08990N4065o94n9046d7005B3269P36a33340j7449d1941
$$ -134142 -193003 18059 -108990 -54925 -55619 -114665 -47005 23269 24005 -133340 -150789 -41941
18915g0208n9065B76163b81770g6413B60175F6812J6539K59764Q9117q414A39040
$$ -70208 -129273 276163 -281770 -76413 260175 66812 83351 343115 432232 423818 139040
18903b31270a14480d9819o5301B30626E6822f1574p394b8334A07216C8550a67111
$$ -231270 -114480 -49819 -115120 230626 56822 -61574 -68968 -28334 107216 38550 -167111
18891G2511h7940E2843b23193K9714g4303D7800E221c3683l2171j15498B27461
$$ 72511 -87940 52843 -223193 -193479 -74303 47800 5221 -33683 -65854 -181352 227461
18879b4889l38679d719A91227F5451a95635e1315A187J05323b74847A10869b35286
$$ -24889 -363568 -4719 191227 65451 -195635 -51315 1187 106510 -274847 110869 -235286
18867D1263a26674j1693q2131j3916E0290a10860A23019J14228b452j94548A02912
$$ 41263 -126674 -138367 -220498 -234414 50290 -110860 123019 237247 -2452 -197000 102912
18855a28278D5000K00148q0837J50264d3482l78129a01105C4050a191B7659c47302
$$ -128278 45000 245148 164311 314575 -43482 -421611 -101105 34050 -1191 27659 -347302
18843a52541E802c54108I2293g1651j63812E6516b0058m5278c1307k99908H8258
$$ -152541 5802 -354108 92293 -71651 -235463 56516 -20058 -65336 -31307 -331215 88258
18831a80597M9147d6148j1744q0486N3843c3996A08485a74742d1015j11477f0310
$$ -180597 -131450 -46148 -57892 -138378 -84535 -33996 108485 -174742 -41015 -152492 -60310
18819b76030B17984a18607I148M0012d9807R4q9739A59432a19361A55980J93698
$$ -276030 217984 -118607 9148 49160 -49807 -49713 -139452 159432 -119361 155980 349678
18808C49678J40498A80408J25970O02b461k44550P0902Q2541E50354h9628o5132
$$ 349678 490176 180408 306378 306980 -2461 -247011 -176109 -93568 550354 -89628 -154760
18797a54760l878c8406k19015e097B04119d04879C35664p3043E2108R2631B2096
$$ -154760 -158638 -38406 -257421 -5097 204119 -404879 335664 262621 52108 144739 22096
18785B3010a98059b3830k55465B3446b21572A68020d32062J48271J13999a6558
$$ 23010 -198059 -23830 -279295 23446 -221572 168020 -432062 -283791 -169792 -16558
18774a49189B24663e5082q2819K9073d1331k5723A23296b09883c0914l26416e0048
$$ -149189 224663 -55082 -137901 -108828 -41331 -67054 123296 -209883 -30914 -357330 -50048
18762a42916m62863b74854E2005M3542K22609A31913c23576E0799h405C734b06237
$$ -142916 -605779 -274854 52005 95547 318156 131913 -323576 50799 -8405 3734 -206237
18750C17219a42469A95637a89020d7378J6765j65343f2551B82273d0122j32411
$$ 317219 -142469 195637 -189020 -47378 -30613 -195956 -62551 282273 -40122 -172533
18740a72533j20779A14818g2570j64397A00089N3266R5176C7895b96783A75826
$$ -172533 -293312 114818 -72570 -236967 100089 153355 248531 37895 -296783 175826
18729h2635j83298l5947E2489a90732A40575J59399b23174i9866n1724A03301
$$ -82635 -265933 -301880 52489 -190732 140575 299974 -223174 -99866 -151590 103301
18718B08969a97254A77376b73190p4943f4431B04990o2621a03274G2844a7548
$$ 208969 -197254 177376 -273190 -348133 -64431 204990 142369 -103274 72844 -17548
18707E6722a50978P2799j34448R0064M1942k04680a13874I7051h9441G2799a76559
$$ 56722 -150978 -78179 -212627 -122563 -80621 -285301 -113874 97051 -89441 72799 -176559
18695b39939H0214c01059D6199k379b24320B40593a21351A82172b17334i396j17960
$$ -239939 80214 -301059 46199 43820 -224320 240593 -121351 182172 -217334 -9396 -127356
18684a27356N9439n7541b5304B40436k1203e4941K3866l4539l72941a06017C929
$$ -127356 -67917 -125458 -25304 240436 219233 -54941 -31075 -65614 -438555 -106017 3929
18672d5932D0641c2031l07379a44277k19648i4596k35727a31765k30193A09772
$$ -45932 40641 -32031 -339410 -144277 -363925 -94596 -330323 -131765 -361958 109772
18661g9943A2591J19678a0731E0877B3268f371k42831J2778B98628b74058A5101
$$ -79943 12591 132269 -10731 50877 23268 -6371 -249202 -236424 298628 -274058 15101
18649a37245B96057l1516b37822r498B70228j24268h4571j81094a30634C6050
$$ -137245 296057 264541 -237822 -247320 270228 145960 -84571 -265665 -130634 36050
18638b35422a00599K9881B54762a99407M6107B76336b89774a27787k811I6756
$$ -235422 -100599 -70718 254762 -199407 -153300 276336 -289774 -127787 -130598 96756
18627c42055F2255d4564B7900J15788Q9051b85696B79011d49979G0204e5950c195
$$ -342055 62255 -44564 27900 143688 232739 -285696 279011 -449979 70204 -55950 -3195
18615f8620k13226f5892m08690g1653k1875j75750H6276c935l4780m35148a7835
$$ -68620 -281846 -65892 -474582 -71653 -93528 -269278 86276 -3935 -38715 -473863 -17835
18603E6540J57812a13579N6124F2172a95074m4395b6861A84976a97076f3025j31640
$$ 56540 214352 -113579 -57455 62172 -195074 -239469 -26861 184976 -197076 -63025 -194665
18592a94665c8191G0737K24902g6421c3226q5281I4406a3684B41792I8791J09398
$$ -194665 -38191 70737 295639 -76421 -33226 -118507 94406 -13684 241792 98791 208189
18581B08189d17926K5530h0651j4107k5814D29224j39782A16674k1528a48597
$$ 208189 -417926 -392396 -80651 -94758 -120572 429224 289442 116674 95146 -148597
18570e05865d987I9657e5660k94204J59060f5687c2076j78721A23355c51156c9130
$$ -505865 -4987 99657 -55660 -349864 -190804 -65687 -32076 -210797 123355 -351156 -39130
18558C41316C8421a9192l57506a22970F686e87163A7026c78912d1681l0199B4172
$$ 341316 38421 -19192 -376698 -122970 6686 -587163 17026 -378912 -41681 -71880 24172
18546a68096l3456a9126k26294h9638F628J30670b89847Q3342B12748d1728A26209
$$ -168096 -201552 -19126 -245420 -89638 6628 137298 -289847 -206505 212748 -41728 126209
18534b52741C29479b87219j54372a43781A25422a36414a1687j01878l85K1534
$$ -252741 329479 -287219 -441591 -143781 125422 -136414 -11687 -113565 -113950 -92416
18524i2416j77700G3317c52514e2573j12720A39296b68974N012B03090a83385
$$ -92416 -270116 73317 -352514 -52573 -165293 139296 -268974 -263962 203090 -183385
18513a63517B97780C1628L56041a45093l3291b3854A14317b37387j57587A55241
$$ -163517 297780 31628 387669 -145093 -178384 -23854 114317 -237387 -394974 155241
18502A22996K196m5375l188K8109h3727n6002p9585B09499m6060I541L36317a60872
$$ 122996 125192 79817 76629 104738 -83727 -139729 -219314 209499 163439 9541 345858 -160872
18489f1636G6752A2375a43966B5110R1636J73914a29963L4956o1192I8400f8914
$$ -61636 76752 12375 -143966 25110 116746 290660 -129963 -95007 -156199 98400 -68914
18477e2494r1629A63706m9485A3367b6270m12893a38843k91904b3979k46925N4656
$$ -52494 -144123 163706 114221 13367 -26270 -439163 -138843 -430747 -23979 -270904 -216248
18466b16248P2028J6474I6713b49673l1707r592c9549J8268A22309h0425H6359
$$ -216248 -144220 -127746 96713 -249673 -281380 -290972 -39549 -21281 122309 -80425 86359
18454E1400P8765a28561a1278m60099J96352l7942N0695A52778e0111o7593I2088
$$ 51400 130165 -128561 -11278 -471377 -275025 -312967 -262272 152778 -50111 -117704 92088
18442b32768a6064l9824j54112B25460c26309J37641e0322l68909J89507E2948
$$ -232768 -16064 -55888 -210000 225460 -326309 -188668 -50322 -419231 -229724 52948
18431a99619G5405c9262k08776a09574k23678C2193c1629j59203h103H9497C56
$$ -199619 75405 -39262 -248038 -109574 -333252 32193 -31629 -190832 -8103 89497 356
18419A17271g7736j26830A27018e5835A75123D4824M0388a22165I8802b81664
$$ 117271 -77736 -204566 127018 -55835 175123 44824 85212 -122165 98802 -281664
18408B49793C7814J06202j3325n105a29616B17787q4441b57408e6790j8817I8112
$$ 249793 37814 144016 130691 125586 -129616 217787 133346 -257408 -56790 -75607 98112
18396I6014b04782d0218D443K65290a46916F1105a17695B60633D3518a7498j57291
$$ 96014 -204782 -40218 4443 269733 -146916 61105 -117695 260633 43518 -17498 -174789
18385a74789A72899p0164m2469a63427C63300C3510P1847m0938b3833k6585A74050
$$ -174789 172899 102735 60266 -163427 363300 33510 105357 64419 -23833 -50418 174050
18373b1193q3793d5725A25087b767l12547m4175B9964a10065A11171c45328A51205
$$ -21193 -104986 -45725 125087 -2767 -315314 -359489 29964 -110065 111171 -345328 151205
18361i4031N846k4033C26415a84384A30830a68519B6344a67241A62133b7432j29239
$$ -94031 -88185 -112218 326415 -184384 130830 -168519 26344 -167241 162133 -27432 -156671
18350a56671C4700L1148e00267a72599l6447f0231C734b29855i4285L5269n0931
$$ -156671 34700 65848 -500267 -172599 -209046 -60231 3734 -229855 -94285 -59016 -109947
18339a09947n5605N4339B6903K13818P360a48083r1758Q2301C04436F1397R9767
$$ -109947 -165552 -111213 26903 240721 248081 -148083 -239841 -157540 304436 61397 161164
18328A61164A0098c73491J19822D90871D6190H032c60874F6940J78131a01699
$$ 161164 10098 -373491 -253669 490871 46190 8032 -360874 66940 245071 -101699
18317G942J12466f9861a0570m812l039j05419C5248c1200A05977K6664g685l4094
$$ 7942 120408 -69861 -10570 -15382 -18421 -123840 35248 -31200 105977 132641 -7685 -41779
18305d1779I8959d38493A68561A0433J08350D4194e2514H1965a93569B08996e8893
$$ -41779 98959 -438493 168561 10433 118783 44194 -52514 81965 -193569 208996 -58893
18293C31081j37798f5571C36374E0831b83573A25091a22621K3375B42569a84791
$$ 331081 193283 -65571 336374 50831 -283573 125091 -122621 -99246 242569 -184791
18282a6043G671L69522a79065A01011J8719a3754A52243a43529E4953b7596o1963
$$ -16043 7671 377193 -179065 101011 119730 -13754 152243 -143529 54953 -27596 -89559
18271h9559r5284F0904G555P7209Q5392d3628e359l3597j30081J7078f8878k48284
$$ -89559 -184843 60904 7555 84764 170156 -43628 -5359 -38956 -169037 -151959 -68878 -317162
18259c17162g7316A17814d1092o0991j16535L0929P0674D0515K56864c0349C16874
$$ -317162 -77316 117814 -41092 -102083 -218618 -187689 -117015 40515 297379 -30349 316874
18247D6563I555b58661b5389g947A86770H712a98660i0010e157j99471j46032
$$ 46563 9555 -258661 -25389 -7947 186770 8712 -198660 -90010 -5157 -204628 -350660
18236c50660a47810H8697k4422j1314b69885H4084E430d140B80953b83352N5696
$$ -350660 -147810 88697 64275 52961 -269885 84084 5430 -4140 280953 -283352 -227656
18225b27656c9399E965L4474c99098a10294J8446A39427a00411j92248B79949
$$ -227656 -39399 5965 40439 -399098 -110294 -91848 139427 -100411 -292659 279949
18214C6282a63670j6432L2589O7746B85438C4601j2326b81621H7356a40131H0243
$$ 36282 -163670 -180102 -147513 -79767 285438 34601 22275 -281621 87356 -140131 80243
18202C27259a94171A65079b826k80981b3372k2726A4462P5529L979a49949B53325
$$ 327259 -194171 165079 -2826 -283807 -23372 -46098 14462 89991 93970 -149949 253325
18190F1547f0065F5052e7025B59450B3216a5418l10190E9544a0441k50373D1453
$$ 61547 -60065 65052 -57025 259450 23216 -15418 -325608 59544 -10441 -260814 41453
18178a98321l337K6079f9525b1471E8850e8429B0055b47253a03980j34076b2590
$$ -198321 -201658 -175579 -69525 -21471 58850 -58429 20055 -247253 -103980 -238056 -22590
18166a89618m852E6723L9418M3709b15328A19485g7924A85958k7439D2034A9918
$$ -189618 -194470 56723 96141 139850 -215328 119485 -77924 185958 158519 42034 19918
18154h6740A01993D7495J68785o0103f9757k80729d8265k87608A99712m0373c5302
$$ -86740 101993 47495 216280 156177 -69757 -350486 -48265 -335873 199712 159339 -35302
18142D2892e2479k27319a26034B4928a45192M5598C02167D9622c049E6978c05596
$$ 42892 -52479 -279798 -126034 24928 -145192 -99594 302167 49622 -3049 56978 -305596
18130B25550b79728a4480A0974h6537G6060f2675n8364k5624k76607I3512C3840
$$ 225550 -279728 -14480 10974 -86537 76060 -62675 -121039 -146663 -423270 93512 33840
18118a93530A47330a0336k83931k9619e2494A16459n1448L4447K23816b3495m4159
$$ -193530 147330 -10336 -294267 -323886 -52494 116459 65011 99458 323274 -23495 -67654
18107f7654A01035L4096d224p3518A48114a22054B37696E7053b98926J7431Q2397
$$ -67654 101035 135131 -4224 -77742 148114 -122054 237696 57053 -298926 -281495 -199098
18096a99098j1672A15396K73527I5574b29563A10410N0605d0739A6919Q8509g1772
$$ -199098 -210770 115396 388923 95574 -229563 110410 161015 -40739 16919 105428 -71772
18084A6458h7330j40285O749G3257c9220j55974C3950O2912J26366a51179H5948
$$ 16458 -87330 -227615 -220866 73257 -39220 -195194 33950 96862 223228 -151179 85948
18072i8969j4773c9552j01946c2980A35255h7431j91838C32886b4207n430n7462
$$ -98969 -113742 -39552 -141498 -32980 135255 -87431 -279269 332886 -24207 -29637 -87099
18061h7099K8894A98752d70910A7550d51607a82834Q3921A45494B5910b6054B95304
$$ -87099 -58205 198752 -470910 17550 -451607 -182834 -98913 145494 25910 -26054 295304
18049e9077C3684j329Q3679J50950f8878j60019J10354j17745I0001a73865F5202
$$ -59077 33684 32355 116034 266984 -68878 -228897 -118543 -236288 90001 -173865 65202
18037i7833j43731O2518A61098R4182d0421l7416n7703C0978K9793P6834m0337
$$ -97833 -241564 -179046 161098 255280 -40421 -77837 -135540 30978 60771 137605 97268
18026I7268m154a09718p3171P7395A71190a93597K7049f4194k6581m441A65368
$$ 97268 93114 -109718 -182889 -105494 171190 -193597 -166548 -64194 -90775 -95216 165368
18014I0671J95837N732A14667a47698N7598E1740K71609h3800B73723g655B54212
$$ 90671 286508 292240 114667 -147698 -90100 51740 323349 -83800 273723 -7655 254212
18002a42382C16714A40565e5067D3233D920L29390j32535a69196j42296B86995
$$ -142382 316714 140565 -55067 43233 4920 334310 201775 -169196 -311492 286995
17991D81907B794a52423E6151a93565A42826b31862C14216j12058e1652j27566
$$ 481907 2794 -152423 56151 -193565 142826 -231862 314216 202158 -51652 -179218
17981a79218f829B00139A5372g8550F1112J5876i3338A20950b8040A7159a42493
$$ -179218 -6829 200139 15372 -78550 61112 76988 -93338 120950 -28040 17159 -142493
17969A7778n571g7608B2240K1168j1969e1620b2252r6380b428B159Q6673R230
$$ 17778 12207 -77608 22240 43408 31439 -51620 -22252 -118632 -2428 2159 88832 98062
17957I8062N598J47921C2007J1089a12431C43402B3440b21546C4547a2305B00636
$$ 98062 103660 251581 32007 43096 -112431 343402 23440 -221546 34547 -12305 200636
17945h8605b1484A80908M8729k3815a49962N4314d3270j54477R6564B72584f5026
$$ -88605 -21484 180908 229637 205822 -149962 -95648 -43270 -197747 -101183 272584 -65026
17933B10020O7984J34890d985n5586j47295E0448K3648e6282k74020a212B12994
$$ 210020 278004 412894 -4985 -60571 -207866 50448 74096 -56282 -330302 -1212 212994
17921a71447M2111q8046A03024g4173A36780D9564b79888J07138J2173l3293B99406
$$ -171447 -129336 -217382 103024 -74173 136780 49564 -279888 -172750 -160577 -193870 299406
17909C11826a43009A9762i0341G2939a62436B35855c46411O6829H8149E529L20868
$$ 311826 -143009 19762 -90341 72939 -162436 235855 -346411 -279582 88149 5529 326397
17898C26397I1225O4607b77980a09726J4917P306j00452F8687K70282d73715c997
$$ 326397 91225 155832 -277980 -109726 -94809 -87503 -187955 68687 338969 -473715 -3997
17886c7088F5670J8308i5371L0277A45103J4662D3011e162E905j397L88989j80653
$$ -37088 65670 83978 -95371 -65094 145103 159765 43011 -5162 5905 4508 393497 212844
17874B12844E6658k7523J12647c14839C3155b29H2400d89635g7537D32511a65581
$$ 212844 56658 29135 141782 -314839 33155 -229 82400 -489635 -77537 432511 -165581
17862C6140P0048k5929f7370L2613g248A34594L31880B17516f3590j13468d0074
$$ 36140 106188 80259 -67370 -34757 -7248 134594 466474 217516 -63590 -177058 -40074
17850B18809O5053o5183c7100A2291b0375G6532F314a12935C38919c50234H940
$$ 218809 283862 218679 -37100 12291 -20375 76532 6314 -112935 338919 -350234 8940
17838A00274O1172J60789j18236b02689D93490g4500F7996d19571a06440j51700
$$ 100274 161446 322235 203999 -202689 493490 -74500 67996 -419571 -106440 -258140
17828b58140a3948A68258h8556K281A38890l5291L3583m9849a45744C6448J7151
$$ -258140 -13948 168258 -88556 -86275 138890 103599 137182 87333 -145744 36448 53599
17817E3599K25165b01493F7669J09286c52746B20310p3875a4106A02140d9898
$$ 53599 278764 -201493 67669 176955 -352746 220310 146435 -14106 102140 -49898
17806A20630a09280B00888F6752k2471H234k704Q7566g7255j3618J8970j48189
$$ 120630 -109280 200888 66752 44281 8234 5530 93096 -77255 -90873 -71903 -220092
17795b20092A66613F8960a39353a3458G8602K32056o6572k6812J43393G4820a20253
$$ -220092 166613 68960 -139353 -13458 78602 310658 244086 217274 360667 74820 -120253
17783b5700G1090l2766J08446i5336A37490a93999c0632q4462n938m8649n1332
$$ -25700 71090 38324 146770 -95336 137490 -193999 -30632 -115094 -121032 -169681 -221013
17772b21013h2461B15935b7274m88530A01138P2071o6832a42574C52830A59804
$$ -221013 -82461 215935 -27274 -515804 101138 173209 106377 -142574 352830 159804
17761A43227J82007c45812C8731F113a34649f0986C37849j12815d2684j08651
$$ 143227 325234 -345812 38731 6113 -134649 -60986 337849 225034 -42684 -151335
17751a51335o5003e5851A96504m0151a03008C55274b8082C29696j07551I4108
$$ -151335 -216338 -55851 196504 156353 -103008 355274 -28082 329696 222145 94108
17740D7911b53499A24300i09A60804a23913a881F3241L36098b11842B31142e7111
$$ 47911 -253499 124300 -909 160804 -123913 -1881 63241 399339 -211842 231142 -57111
17728b55457A98325h4342j49440M4208d3658m078k54023a5981A30694B1321E351
$$ -255457 198325 -84342 -233782 -189574 -43658 -47736 -301759 -15981 130694 21321 5351
17716a23438B19531c6269A22676b12898B36025H9031a8714j486F2569K32299m3710
$$ -123438 219531 -36269 122676 -212898 236025 89031 -18714 -20200 62569 294868 251158
17705B51158i4777B39575A2533e135j92049B84746j23278K04911a30493K1442
$$ 251158 -94777 239575 12533 -5135 -197184 284746 161468 366379 -130493 -109051
17695a09051j7099N8725I6072D727R3002J134a19229A3646d2580a1609A89507
$$ -109051 -126150 -67425 96072 4727 97729 98863 -119229 13646 -42580 -11609 189507
17683a67464C87123b2622r3932a2555E5129K23156A4618i2385C00122M5070m4071
$$ -167464 387123 -22622 -116554 -12555 55129 278285 14618 -92385 300122 345192 301121
17672C01121I1241l6428a00765j42660D3310g3291I9180L7841a19153A16746P3189
$$ 301121 91241 54813 -100765 -243425 43310 -73291 99180 137021 -119153 116746 189935
17661A89935L46118A76904a69741B73431H9600g5636m541j59738q1435B61249
$$ 189935 536053 176904 -169741 273431 89600 -75636 -80177 -239915 -321350 261249
17650f6747b237A46664e618A7021g6618A61719a31461M4621F9938R3135l9125
$$ -66747 -2237 146664 -5618 17021 -76618 161719 -131461 -86840 69938 163073 123948
17639A23948B8174a87964B21284C561b1120A02119K62975r1869J51473j14411
$$ 123948 28174 -187964 221284 3561 -21120 102119 365094 273225 424698 310287
17629C10287e6677B14003K59169j40413n7397c0928A02561k0849c0708D570K76904
$$ 310287 -56677 214003 473172 332759 275362 -30928 102561 81712 -30708 4570 281474
17618B81474c43290e6700A79605b19036B70254D5319H806P7485N692J06976a53326
$$ 281474 -343290 -56700 179605 -219036 270254 45319 8806 86291 91983 198959 -153326
17606E2060J84654k35I0561O4588L84697b9425B8504N3930k8174g7395A91104
$$ 52060 236714 236479 90561 155149 539846 -29425 28504 82434 54260 -77395 191104
17594a28058H7091m3152L1363e5487A89481R3172I2214M1440h1195B61070K33290
$$ -128058 87091 43939 75302 -55487 189481 282653 92214 133654 -81195 261070 494360
17583D94360k36721a83342B22923q6416n7862a08248B82476f1642B94604J746
$$ 494360 257639 -183342 222923 136507 78645 -108248 282476 -61642 294604 296350
17573B96350I2392M5439J66728f4081A50825J0047h3595B92214C1736f4362B09296
$$ 296350 92392 137831 304559 -64081 150825 160872 -83595 292214 31736 -64362 209296
17561a9393A99814p3836K4114O2470o8312Q3332A0921L1221P8829K36881j73996
$$ -19393 199814 125978 150092 212562 144250 227582 10921 42142 120971 357852 183856
17550A83856o0541P1883q0147N1282J86686A11597O2637K17235q2147A46662L76775
$$ 183856 123315 195198 115051 166333 353019 111597 174234 391469 309322 146662 523437
17539E23437G0477J53637J40837A58165o1164l2878J12848J00188J50214j6923
$$ 523437 70477 224114 364951 158165 97001 64123 176971 277159 427373 410450
17529D10450m6004J3937j0764L34939K52825r6265J89180j15958J0254m07978
$$ 410450 364446 378383 367619 702558 955383 859118 1048298 932340 942594 534616
17519E34616L539J34344l24592I0897O1249K15790J81595P9044N5542M00265m1546
$$ 534616 538155 672499 347907 90897 152146 367936 549531 628575 684117 1084382 1042836
17508A042836j19943J24140L99996F43844A21709M9942L62392B38372k2889J13363
$$ 1042836 922893 1047033 1447029 643844 121709 171651 534043 238372 215483 328846
17498C28846j22474J54322H9497K63760k5372B2922K93260J21973j44922C5044
$$ 328846 206372 360694 89497 353257 327885 22922 316182 438155 293233 35044
17487C15400r9656d3384C25866j24476o0358K03487j13490O9263l8795J33523
$$ 315400 215744 -43384 325866 201390 141032 344519 231029 300292 261497 395020
17477C95020j13594m5644J64191A98659K33944j86479K7163L828j00660b561A42874
$$ 395020 281426 235782 399973 198659 432603 246124 273287 277115 176455 -2561 142874
17465G5443L75172H7810D0679M14512j48848G1185N91385A65191K32084H0900
$$ 75443 450615 87810 40679 455191 306343 71185 662570 165191 397275 80900
17454E5981R1652M58911A64154L43166j31117M4653k3501K62854k84320P4939
$$ 55981 147633 606544 164154 507320 376203 420856 397355 660209 375889 450828
17444D50828M9588k28866J92579j33719A62613L25568K41156k31006N6865B48804
$$ 450828 500416 271550 464129 330410 162613 488181 729337 498331 555196 248804
17433A97537a0624F20279k79518N8975K92896j55468m4107J00893B19555j3395
$$ 197537 -10624 620279 340761 399736 692632 537164 493057 593950 219555 206160
17423B06160J21999B3665M91129k14758O0433j49100N0449N2678Q9563j94209
$$ 206160 328159 23665 514794 300036 360469 211369 261818 314496 404059 209850
17413B09850K63090k13333O7389Q6642J0100A90620b14256A80024N4368o7325
$$ 209850 472940 259607 326996 413638 423738 190620 -214256 180024 234392 167067
17403A67067L273K0653H3418J23813A2661J14710J22310P9583a9538A60348q78
$$ 167067 170340 190993 83418 207231 12661 127371 249681 329264 -19538 160348 159470
17392A59470N5755r9183K08295j22828p2193L44535B00360R4457k0786K93219
$$ 159470 215225 116042 324337 201509 129316 473851 200360 294817 274031 567250
17382E67250k16110J02251N6966k07304A39869L11697k19325J64170j95752n3824
$$ 567250 351140 453391 510357 303053 139869 451566 232241 396411 200659 146835
17372A46835K40994A39807J56433a70578C56622A52166K78699A63029K79141j97100
$$ 146835 387829 139807 296240 -170578 356622 152166 430865 163029 442170 245070
17362B45070K57252j89523J12293C2577A4275M80835k37445a00569I2143L6936
$$ 245070 502322 312799 425092 32577 14275 495110 257665 -100569 92143 129079
17352A29079K14475R6902j25229K7910A20341L48949j17590I0015O6116K46751
$$ 129079 343554 440456 315227 343137 120341 469290 351700 90015 156131 402882
17342D02882A89603J72648A80064n9792J23216k3026p5019P3372c6719A39747
$$ 402882 189603 362251 180064 120272 243488 220462 145443 218815 -36719 139747
17331E31633q2711q5249n4502j19989J8111K487j0678O3321K60134k44259p2564
$$ 531633 448922 363673 309171 189182 207293 209780 199102 262423 522557 278298 205734
17320B05734J46289j15201K07656A80837p0637J04883M569J78745r6129F376L89922
$$ 205734 352023 236822 444478 180837 110200 215083 219652 398397 302268 6376 396298
17309C96298r1575A15680b4442C28975L45541B37795M2209o78m1494J73114A34371
$$ 396298 304723 115680 -24442 328975 674516 237795 280004 279326 237832 410946 134371
17297D08424j87285J78341j82117J55976K4081A24334J71739o3484A01919J3671
$$ 408424 221139 399480 217363 373339 397420 124334 296073 232589 101919 115590
17287A15590L49069j35929m1028L18640B3807K39584m1583J53068L7943M4636
$$ 115590 464659 328730 287702 606342 23807 263391 221808 374876 412819 457455
17277D57455k09982L19889j78030C2976L70970A25036b0823F91758B75889o1664
$$ 457455 247473 567362 389332 32976 403946 125036 -20823 691758 275889 214225
17267B14225J3775J27857j3254r0493J58761b7833E83021G3319R9230L1573M12180
$$ 214225 228000 355857 342603 252110 410871 -27833 583021 73319 172549 204122 616302
17256F16302A20342O07906o998B69885R3718n9915j36023J86183J31204r2750
$$ 616302 120342 728248 721250 269885 363603 303688 167665 353848 485052 392302
17246C92302a3600C84114A67243K80736j89918O8445G3108N54023B80254K770
$$ 392302 -13600 384114 167243 447979 258061 326506 73108 627131 280254 283024
17236B83024J81850L6516A83976L65316k57375l3163K65570k26177M4383L5355
$$ 283024 464874 501390 183976 549292 291917 258754 524324 298147 342530 377885
17226C77885L36734l34426A85476R2652Q1035J34109q4260M3024j8217j25200
$$ 377885 714619 380193 185476 278128 359163 493272 409012 452036 433819 308619
17216C08619a7785C85799J41877l4041O5029B65215L0381K14686J20463B62474
$$ 308619 -17785 385799 527676 493635 558664 265215 295596 510282 630745 262474
17205B79530J00981q4139K33183o187j63403J91931M8090A88890L09015B18606
$$ 279530 380511 296372 529555 523368 359965 551896 599986 188890 497905 218606
17194E92148k03321O1590j28080J14308j20814J63435K86267B05653J08182G7671
$$ 592148 388827 450417 322337 436645 315831 479266 765533 205653 313835 77671
17183D35958K23242l20468j31893L11006k36730K17330j73542M92533C16857M08615
$$ 435958 659200 338732 206839 517845 281115 498445 324903 817436 316857 725472
17173G25472l05714K46878k40531P7575L65150l03876B35950R6384l9241O2896
$$ 725472 419758 666636 426105 503680 868830 564954 235950 332334 293093 355989
17163C55989O1924L1319j48598K24830j30788j00298j11254L00062j34066o6421
$$ 355989 417913 449232 300634 525464 394676 294378 183124 483186 349120 282699
17153B82699N7353M92672k55195N7511A60323N48822k85613L3309B23440M75747
$$ 282699 340052 832724 577529 635040 160323 709145 423532 456841 223440 699187
17143F99187j34328j56304m7884O6037j62958L19773q2753o7898K36067j67590
$$ 699187 564859 408555 360671 426708 263750 583523 500770 432872 668939 501349
17133E01349K42919k73431J6924J57254J44855A08241M27106Q5267j30276J47107
$$ 501349 744268 470837 487761 645015 789870 108241 535347 620614 490338 637445
17123F37445N9781o0055j02316j65611J51257n0017J31229K34672B99511R1268
$$ 637445 697226 637171 534855 369244 520501 470484 601713 836385 299511 390779
17113C90779J89775j44399L64577j20753j83938O5317M96797l28524k29531K51663
$$ 390779 580554 436155 800732 679979 496041 561358 1058155 729631 500100 751763
17103G51763k76706O5508A90384M84503Q2278l35369M28760j49304K65470D20360
$$ 751763 475057 540565 190384 674887 757165 421796 850556 701252 966722 420360
17092G02360j47159j43766J60314J19321Q4776J9679l49489J59526L20741k94946
$$ 702360 555201 411435 571749 691070 775846 795525 446036 605562 926303 631357
17082F31357j9696J55402j08916L14261j71608K61483k74199l23247K92684n6568
$$ 631357 611661 767063 658147 972408 800800 1062283 788084 464837 757521 700953
17072G00953j3512M24883k75930j8109n8794J9493j3198l20875K99294Q1943m9179
$$ 700953 687441 1112324 836394 818285 759491 778984 765786 444911 744205 826148 776969
17061G76969J44920k88L7095j57071J35798k66862K07022K60153n53764K81097
$$ 776969 921889 921601 958696 801625 937423 670561 877583 1137736 583972 865069
17051H65069j66499K74857j33103L5682n1680k8622O7170J19559q1781o6577K17704
$$ 865069 698570 973427 840324 876006 824326 795704 862874 982433 900652 834075 1051779
17040A051779E06357N78044m36062J62370Q2198J65744J8864j70289j54154J11847
$$ 1051779 506357 1084401 648339 810709 892907 1058651 1077515 907226 753072 864919
17030H64919K84701L59074m67246j34743K96677K67892o19792L24264k76750l1082
$$ 864919 1149620 1508694 1041448 906705 1203382 1471274 851482 1175746 898996 867914
17020H67914L02867R9546k49888J11282J80447o46290P42865m13808K26739j04943
$$ 867914 1170781 1270327 1020439 1131721 1312168 665878 1408743 994935 1221674 1116731
17010A116731k73331O46752l3745m74647j10957M1448K23495L53757l67096R6307
$$ 1116731 843400 1490152 1456407 981760 870803 912251 1135746 1489503 1122407 1218714
17000A218714j49071k0477L04923j85234N168K06088j93690j15710R2329K75358
$$ 1218714 1069643 1049166 1354089 1168855 1174023 1380111 1186421 1070711 1163040 1438398
16990A438398k4766k03137R94k06544J42380N325M7064J61374j28007L40678m24966
$$ 1438398 1413632 1210495 1211489 1004945 1147325 1152650 1199714 1361088 1233081 1573759 1148793
16979A148793k64829N12681m08703L83251k11854L30447l38205K92472K19418
$$ 1148793 883964 1396645 987942 1371193 1159339 1489786 1151581 1444053 1663471
16970A663471k86733O4928j07416M13978m22708L86439o7979K49374n68012L30882
$$ 1663471 1376738 1441666 1334250 1748228 1325520 1711959 1643980 1893354 1325342 1656224
16960A656224o7716O02851o16447J68106J02575j46886J45755M0979o8747K8465
$$ 1656224 1588508 2191359 1574912 1743018 1845593 1698707 1844462 1885441 1816694 1845159
16950A845159j37585L45694j98138K51683m28340J00099L09136j28733m2684k5371
$$ 1845159 1707574 2053268 1855130 2106813 1678473 1778572 2087708 1958975 1916291 1890920
16940A890920o0755J59665n4953j9885K19184k8279j85684J75457M1418m45161
$$ 1890920 1830165 1989830 1934877 1914992 2134176 2105897 1920213 2095670 2137088 1691927
16930A691927K40003L22807k50216J41924P7228k10017K88635J91741j86763J90875
$$ 1691927 1931930 2254737 2004521 2146445 2223673 2013656 2302291 2494032 2307269 2498144
16920B498144j37367O3432j29095j40734J03899K58265J16598l20056L14912J10743
$$ 2498144 2360777 2424209 2295114 2154380 2258279 2516544 2633142 2313086 2627998 2738741
16910B738741k56881J8138K29136n2191J11690k11472Q6349m8574J31143J59429
$$ 2738741 2481860 2499998 2729134 2676943 2788633 2577161 2663510 2614936 2746079 2905508
16900B905508J35550k34010O5749o9244L16746r4906k20097L24268K13706l80526
$$ 2905508 3041058 2807048 2872797 2803553 3120299 3025393 2805296 3129564 3343270 2962744
16890B962744K69187l1234P1104j16023j27513K73216M49623k53728m3777J63193
$$ 2962744 3231931 3200697 3271801 3155778 3028265 3301481 3751104 3497376 3453599 3616792
16880C616792J24490l46092L58997n3151M1869n3841K72852K8697j96592j36238
$$ 3616792 3741282 3395190 3754187 3701036 3742905 3689064 3961916 3990613 3794021 3657783
16870C657783J21389L58574n7114J17967j6098r6697L12951R9735n33966O11877
$$ 3657783 3779172 4137746 4080632 4198599 4182501 4085804 4398755 4498490 3964524 4576401
16860D576401m3215K44644j74867J54089O4330P3559L60329k1590N5864k74087
$$ 4576401 4533186 4777830 4602963 4757052 4821382 4894941 5255270 5233680 5289544 5015457
16850E015457K28185j81282N23163n3851K50024l08298L24841m2290N4683L40691
$$ 5015457 5243642 5062360 5585523 5531672 5781696 5473398 5798239 5755949 5810632 6151323
16840F151323J29978p8680K88822j68816M49476j10312J27592J63252K6217J03872
$$ 6151323 6281301 6202621 6491443 6322627 6772103 6661791 6789383 6952635 6978852 7082724
16830G082724j56926M23801R0880j37208M21139q7163P02784k44909L72003r2743
$$ 7082724 6925798 7349599 7440479 7303271 7724410 7637247 8340031 8095122 8467125 8374382
16820H374382O55576m92282L46898M71022L50089k0773N1568J54338R1716K00019
$$ 8374382 9029958 8537676 8884574 9355596 9705685 9684912 9736480 9890818 9982534 10182553
16810A0182553N7701M35340M6890M05793N21610k21006L40649J97882N47337j36334
$$ 10182553 10240254 10675594 10722484 11128277 11649887 11428881 11769530 11967412 12514749 12378415
16800A2378415K68743L69029K65671M85666J26362K13824N67542N39041J35988
$$ 12378415 12647158 13016187 13281858 13767524 13893886 14107710 14675252 15214293 15350281
16791A5350281L93907M88147K24281N40587J83412P69899N90786M14043J79829
$$ 15350281 15744188 16232335 16456616 16997203 17180615 17950514 18541300 18955343 19135172
16782A9135172O44859M40090J055817K14303N71284O33156O79772O72656P28353
$$ 19135172 19780031 20220121 21275938 21490241 22061525 22694681 23374453 24047109 24775462
16773B4775462P67865Q19925P81782P01231P93541Q03300R83292P83891J236435
$$ 24775462 25543327 26363252 27145034 27846265 28639806 29443106 30426398 31210289 32446724
16764C2446724J389699Q92575J262373Q85187J321855J411240J182033J252783
$$ 32446724 33836423 34728998 35991371 36876558 38198413 39609653 40791686 42044469
16756D2044469J660279J544635J237926J722687J590868J576830K088896K145741
$$ 42044469 43704748 45249383 46487309 48209996 49800864 51377694 53466590 55612331
16748E5612331J701709K282139K258218K199333K151044K578423K248487K578210
$$ 55612331 57314040 59596179 61854397 64053730 66204774 68783197 71031684 73609894
16740G3609894K509058K309341K902288K658856K656488K906600K597500K481588
$$ 73609894 76118952 78428293 81330581 83989437 86645925 89552525 92150025 94631613
16732I4631613L110878K266896K472907K324022K244559K375477J571959J634620
$$ 94631613 97742491 100009387 102482294 104806316 107050875 109426352 110998311 112632931
16724A12632931J432198J127371R00987O66641N05482j69853k10223r04281m26852
$$ 112632931 114065129 115192500 116093487 116760128 117265610 117095757 116885534 115981253 115554401
16715A15554401j185862j091336j598322k245828k149646j936746k189490k706131
$$ 115554401 114368539 113277203 111678881 109433053 107283407 105346661 103157171 100451040
16707A00451040k781949k232560l072889k686693k606556k718859k691473k858146
$$ 100451040 97669091 95436531 92363642 89676949 87070393 84351534 81660061 78801915
16699G8801915k553190k631347k962691k278424k191225k298836k415045k151601
$$ 78801915 76248725 73617378 70654687 68376263 66185038 63886202 61471157 59319556
16691E9319556k564012j628816k223030j724975j989676j522290j809489j506976
$$ 59319556 56755544 55126728 52903698 51178723 49189047 47666757 45857268 44350292
16683D4350292j728567j562816j533093j187415j120494j112433j697740p62239
$$ 44350292 42621725 41058909 39525816 38338401 37217907 36105474 34407734 33645495
16675C3645495j235508o55095j565073o20093j131248q99904m31121o80453j102242
$$ 33645495 32409987 31754892 30189819 29569726 28438478 27538574 27107453 26427000 25324758
16666B5324758j067096n43235q09023l89263p14934m84559r49260l38946l89218
$$ 25324758 24257662 23714427 22905404 22516141 21801207 21316648 20367388 20028442 19639224
16657A9639224j031681j61335n04342m61697m09111o16467l50762m38723j88350
$$ 19639224 18607543 18446208 17941866 17480169 17071058 16454591 16103829 15665106 15476756
16648A5476756m06895m11680n41620q4048n29094m09565j70314k31768l15378
$$ 15476756 15069861 14658181 14116561 14032513 13503419 13093854 12923540 12691772 12376394
16639A2376394l33176m4668k51650l21322m24130j22092j99090j10983j27333
$$ 12376394 12043218 11998550 11746900 11425578 11001448 10879356 10680266 10569283 10441950
16630A0441950m89115r3131r396o49840q2728p307m77050L8360k51813m17628
$$ 10441950 9952835 9859704 9850308 9200468 9117740 9110433 8633383 8671743 8419930 8002302
16620H002302m9812O8645q4443l04742k51614k28470J83917k09284q6004j55169
$$ 8002302 7952490 8021135 7936692 7631950 7380336 7151866 7335783 7126499 7040495 6885326
16610F885326k14816J47845J57154p81029j57979M30877n43092J69708k2959k29529
$$ 6885326 6670510 6818355 6975509 6194480 6036501 6467378 5924286 6093994 6071035 5841506
16600E841506J04791Q2285q04662L61463q9629k650m42098O8863k57622K87212
$$ 5841506 5946297 6028582 5223920 5585383 5495754 5493104 5051006 5119869 4862247 5149459
16590E149459p9209m23771P0538j42030J71590j44406k10435j67567L29724J87124
$$ 5149459 5070250 4646479 4717017 4574987 4746577 4602171 4391736 4224169 4553893 4741017
16580D741017l90903M544p1217j35000o031l91283q6454N34980l05070L0503l92134
$$ 4741017 4350114 4354658 4283441 4148441 4142410 3751127 3664673 4199653 3894583 3925086 3532952
16569C532952M31376m57805M7266K6691J20500n0580o24886J40989Q384N6174
$$ 3532952 3964328 3506523 3553789 3580480 3700980 3650400 3025514 3166503 3174887 3231061
16559C231061l37681M8400O3215r02m3922k83630M48061o4965k26891N3201J9083
$$ 3231061 2893380 2941780 3004995 3004093 2960171 2676541 3124602 3059637 2832746 2885947 2905030
16548B905030J58463m82399M09592m37392j46833K70948J65667p7477j47961J36556
$$ 2905030 3063493 2581094 2990686 2553294 2406461 2677409 2843076 2765599 2617638 2754194
16538B754194m31343L18082k43110J74778k64485J52911k49385O9962N6692j84340
$$ 2754194 2322851 2640933 2397823 2572601 2308116 2461027 2211642 2281604 2338296 2153956
16528B153956K30900k77970k3995J90112n9676l22060K44883k62798K34724r8630
$$ 2153956 2384856 2106886 2082891 2273003 2213327 1891267 2136150 1873352 2108076 2009446
16518B009446N0932j11366j91892L01522l35436L54749j27017j2093K88199n61915
$$ 2009446 2060378 1949012 1757120 2058642 1723206 2077955 1950938 1938845 2227044 1665129
16508A665129J21354j45602o1576l9247K96931k66838R1027j77904j0109M49260
$$ 1665129 1786483 1640881 1579305 1540058 1836989 1570151 1661178 1483274 1473165 1922425
16498A922425k11035q5616m11541N43067l36250J02711K72843l56092J81037o7657
$$ 1922425 1711390 1625774 1214233 1757300 1421050 1523761 1796604 1440512 1621549 1553892
16488A553892p4931J61392l09450L34628k32335K20333j33870k04611n9650K85543
$$ 1553892 1478961 1640353 1330903 1665531 1433196 1653529 1519659 1315048 1255398 1540941
16478A540941r8420J57467p15759O37827k50322O1697N7764K39176l26590P9955
$$ 1540941 1442521 1599988 884229 1522056 1271734 1333431 1391195 1630371 1303781 1383736
16468A383736l4967j04615N32817n70907K97359j39313O969k64113O4578Q866
$$ 1383736 1348769 1244154 1776971 1206064 1503423 1364110 1371079 1106966 1171544 1180410
16458A180410n5582K22370j52846r135J7997J19753m50719J17328n1088K13960
$$ 1180410 1124828 1347198 1194352 1185217 1203214 1322967 872248 989576 938488 1152448
16448A152448k33643R6102q0410N08436l71056k30737M03222P3541l24328J27459
$$ 1152448 918805 1014907 934497 1442933 1071877 841140 1244362 1317903 993575 1121034
16438A121034j35219r6664M09748j02340k36475K67304j01416k78343J03693j82953
$$ 1121034 985815 889151 1298899 1196559 960084 1227388 1125972 847629 951322 768369
16428G68369J38881J98398j96382J14289j41578j79933K36746j04401K1471o4455
$$ 768369 907250 1105648 909266 1023555 881977 702044 938790 834389 855860 791405
16418G91405j82022K50481J91859j29578k98098n1163J70796j43915L55873J14362
$$ 791405 609383 859864 1051723 922145 624047 572884 743680 599765 955638 1070000
16408A070000n2932j62758N9283J59535j08023j63106M1995q6301J25029Q6179
$$ 1070000 1017068 854310 913593 1073128 965105 801999 843994 757693 882722 968901
16398I68901k02948o7438N5540K96766k74272K6179p9266j26146J12639j47222
$$ 968901 765953 698515 754055 1050821 776549 802728 723462 597316 709955 562733
16388E62733L2527J83363k54627K74942k33903k22068L99376J08135C19179K21797
$$ 562733 595260 778623 523996 798938 565035 342967 742343 850478 319179 540976
16378E40976k7688K10169q6674M3987K9924C42092N12427B66403L91038j06645
$$ 540976 513288 723457 636783 680770 710694 342092 854519 266403 657441 550796
16368E50796J9820k097J93003j82011o2085K28004C48317N08701m0837k75453
$$ 550796 570616 568519 761522 579511 517426 745430 348317 857018 816181 540728
16358E40728o960L9090j90116K72031k63172M75777l43627l558J34468j29634
$$ 540728 533768 572858 382742 654773 391601 867378 523751 520193 654661 525027
16348E25027R4346K8168L1777l31226M54500k52988J7343j43400L16548J52849
$$ 525027 619373 647541 679318 348092 802592 549604 566947 423547 740095 892944
16338H92944k59830k72288Q5542K79996C42834L18444l17544M70850C72006k24
$$ 892944 633114 360826 446368 726364 342834 661278 343734 814584 372006 371782
16328C71782L30359B86396j3371K05835J83297n0246k22873K43482B17950M3787
$$ 371782 702141 286396 273025 478860 662157 611911 389038 632520 217950 261737
16318B61737J46524o394P9411O8035R9172j66971j23095L6626K2046O6837q918
$$ 261737 408261 401867 481278 549313 648485 481514 358419 395045 417091 483928 475010
16307D75010A67555J71683A29865K77469K4585L7700A07203R5033R9104K64565
$$ 475010 167555 339238 129865 407334 431919 469619 107203 202236 301340 565905
16297E65905k46136J78666a7769B82773J17587J15284M626j84110A03417K35063
$$ 565905 319769 498435 -17769 282773 400360 515644 520270 336160 103417 338480
16287C38480C4692L19369j17085J88595J31197k54135B4251J64676J16999N618
$$ 338480 34692 354061 236976 425571 556768 302633 24251 188927 305926 311544
16277C11544J92342p0960o7478j1033m6399k0460K1990n7756J61145m3629q1808
$$ 311544 503886 432926 365448 354415 308016 287556 309546 251790 412935 369306 287498
16266B87498P4219J2851I3557J77435J70040A30717K88219q0775Q9370B4459N54917
$$ 287498 361717 374568 93557 270992 441032 130717 418936 338161 427531 24459 579376
16255E79376n8130E9221J22819p5502K39694D7814L64822q3401k4702j2610A29181
$$ 579376 521246 59221 182040 106538 346232 47814 412636 329235 304533 291923 129181
16243C12041K8168M1490j44402K52622A47708J79560K53045a21106A47560n2563
$$ 312041 340209 381699 237297 489919 147708 327268 580313 -121106 147560 94997
16233I4997Q8301J79610L0497j365j32860p2043N6283J89389P2750j09299j4468
$$ 94997 183298 362908 393405 392040 259180 187137 243420 432809 505559 396260 381792
16222C81792j26864A02255j4705k6464g2636r112D24499j23363M4241F2628L06524
$$ 381792 254928 102255 87550 61086 -72636 -81748 424499 301136 345377 62628 369152
16211C69152A67680I226K88273O0199R1061q1296j54203B4548J89139R2304P2269
$$ 369152 167680 9226 297499 357698 448759 367463 213260 24548 213687 305991 378260
16200C78260G5574K93837C343a815C61220Q6523A98421D2099K57645p5978C2961
$$ 378260 75574 369411 3343 -1815 361220 447743 198421 42099 299744 223766 32961
16188e9424B71477m0262q6029K33947j53933k8634D1966L05614L4026D9633J41476
$$ -59424 271477 231215 145186 379133 225200 196566 41966 347580 381606 49633 191109
16177A91109L63025c8706A92058Q9149E9476K30075b2111I8811J14550c9038A68508
$$ 191109 554134 -38706 192058 281207 59476 289551 -22111 98811 213361 -39038 168508
16165A47936f5459I8938l5215J68240b74496A95407g5137B49492J51743b23986
$$ 147936 -65459 98938 63723 231963 -274496 195407 -75137 249492 401235 -223986
16154B96262A24624L21306H0143b14980G0087I614a5335C99832A26090a9110C10956
$$ 296262 124624 445930 80143 -214980 70087 9614 -15335 399832 126090 -19110 310956
16142C04512l0960C883a61459D31309D0678K90381J5071a26391N9462B88755I3382
$$ 304512 273552 3883 -161459 431309 40678 331059 346130 -126391 -66929 288755 93382
16130I4907d717l4328A66618M7160j1690a20147m2797B42359A1178M3901K11546
$$ 94907 -4717 -39045 166618 213778 202088 -120147 -162944 242359 11178 55079 266625
16119B66625R8513a59035A14160e7379B7805L2452J48182l3671l5189L85807E8785
$$ 266625 365138 -159035 114160 -57379 27805 60257 208439 174768 139579 525386 58785
16107D2079J81494o2138a67420A75591K0123m7845R9074P8574f4287j0099E7518
$$ 42079 223573 161435 -167420 175591 195714 147869 246943 325517 -64287 -74386 57518
16095G5292d8195B16839k0980b96817A72888K22890h131q4408C8509N9117J25840
$$ 75292 -48195 216839 195859 -296817 172888 395778 -8131 -92539 38509 97626 223466
16084B23466B0h046A0496O0353M4206K13698F3310N2570i4738b9129j24134b6624
$$ 223466 20 -8046 10496 70849 115055 328753 63310 115880 -94738 -29129 -153263 -26624
16071B57208A11067K95457A24854d9992e015C44430A70045a60961f1972o0900
$$ 257208 111067 406524 124854 -49992 -5015 344430 170045 -160961 -61972 -122872
16061a22872A06291A351J45993b8299A69674a90268M7240q690G0998b8104q1301
$$ -122872 106291 1351 147344 -28299 169674 -190268 -143028 -151718 70998 -28104 -109405
16050a09405A3020N94988A93827p5655L26708b0414C52146a71900F0134d4414
$$ -109405 13020 608008 193827 118172 444880 -20414 352146 -171900 60134 -44414
16039B7720N0985i779A60106J26546b8055m4573B2555N1700j9230j4492e1423
$$ 27720 78705 -9779 160106 286652 -28055 -72628 22555 74255 55025 40533 -51423
16027B60813n4164H364J08096h9322h818o6739C11259i79j90349N716H2904J98615
$$ 260813 206649 8364 116460 -89322 -8818 -75557 311259 -979 -191328 -185612 82904 281519
16015B81519i2662A14317a59231j7494b6256A24821b03395F8489J40418o0619
$$ 281519 -92662 114317 -159231 -176725 -26256 124821 -203395 68489 208907 148288
16005A48288M4537A3095c22825g2498m6238C3604h1653Q740B06076c5392f846
$$ 148288 192825 13095 -322825 -72498 -118736 33604 -81653 -72913 206076 -35392 -6846
15993A66855h9665B59890j23659m2832L66416A98790M45552L80505J38227p1326
$$ 166855 -89665 259890 136231 93399 459815 198790 644342 1024847 1163074 1091748
15983A091748L58690k12389k83973C17183m1623O1177a84089C16493a11796n12
$$ 1091748 1450438 1238049 954076 317183 275560 336737 -184089 316493 -111796 -112308
15973a12308A60518b12991B43637I3155a11920C7679d0629C0529i1822C0756i943
$$ -112308 160518 -212991 243637 93155 -111920 37679 -40629 30529 -91822 30756 -9943
15961a91264A15903a60368A12000a11796A99152A8252a6525D76732D1112a7008
$$ -191264 115903 -160368 112000 -111796 199152 18252 -16525 476732 41112 -17008
15950B35654a41522j0202L8992j3181n523k68639J03318J35647j13785i6406n2128
$$ 235654 -141522 -151724 -112732 -125913 -131436 -400075 -296757 -161110 -274895 -96406 -148534
15939a48534M1971C4992a30883E7108J29893G4054g7508A53827a68070O4255q0494
$$ -148534 -106563 34992 -130883 57108 187001 74054 -77508 153827 -168070 -103815 -184309
15928a84309H3715a91850d686k66024A49943O0936i8022j67125C8509e8879k1039
$$ -184309 83715 -191850 -4686 -270710 149943 210879 -98022 -265147 38509 -58879 -79918
15917g9918A12348P9053J1975J16994a03528j71850a21445A77507n1299l4918
$$ -79918 112348 191401 203376 320370 -103528 -275378 -121445 177507 126208 91290
15907I1290L1574d3316m4550c4249k84659b5918A34357D6207J91582N4956f6652
$$ 91290 122864 -43316 -87866 -34249 -318908 -25918 134357 46207 237789 292745 -66652
15895b08845M2803A59047d998A60172h634A59337h7623N117e740p1456K2002j34577
$$ -208845 -166042 159047 -4998 160172 -8634 159337 -87623 -82506 -5740 -77196 -55194 -189771
15883a89771L515E0631N8537J88071G6419c33672i1441A54306c0201C14103A29688
$$ -189771 -186256 50631 109168 297239 76419 -333672 -91441 154306 -30201 314103 129688
15871d7258B95964a55990E8768M1962c4515j92102A22649c5226E9702a6761G7425
$$ -47258 295964 -155990 58768 100730 -34515 -226617 122649 -35226 59702 -16761 77425
15859I6729c11693a22803B48059a00911e144k22316b8310o6504A64012c3468k65469
$$ 96729 -311693 -122803 248059 -100911 -5144 -227460 -28310 -94814 164012 -33468 -298937
15848b98937R3400H804R1606C6293n067b04721D475K19194d7695j00237j5011
$$ -298937 -205537 8804 100410 36293 31226 -204721 4475 223669 -47695 -147932 -162943
15837a62943I8616e2277k400b0153C21346c1948o4319M4130p2428B9114g0640
$$ -162943 98616 -52277 -54677 -20153 321346 -31948 -96267 -52137 -124565 29114 -70640
15825D6865P6816b86984O4969g2086k89408e3298A32905l4412a78962C62936a63215
$$ 46865 123681 -286984 -222015 -72086 -361494 -53298 132905 98493 -178962 362936 -163215
15813A81969k8539b36361a01274j90716a9300D0417J0930b12400i5856j5780J8323
$$ 181969 153430 -236361 -101274 -291990 -19300 40417 51347 -212400 -95856 -111636 -93313
15802i3313k81779a28146N9226j08316J4827C2705b7789A09018P2249i8902c133
$$ -93313 -375092 -128146 -68920 -177236 -162409 32705 -27789 109018 181267 -98902 -3133
15790b773H558J0693a31073l8887N5290A78043m4985K41181c26916D36401a58595
$$ -2773 8558 19251 -131073 -169960 -114670 178043 133058 374239 -326916 436401 -158595
15778B15085a98582P7104f612A21501b36467O3679O0257A30287h4287p7310B42854
$$ 215085 -198582 -121478 -6612 121501 -236467 -172788 -112531 130287 -84287 -161597 242854
15766c20407c6353A21618O6264J91436a65493C0459g5636a7109B41532a22394
$$ -320407 -36353 121618 187882 379318 -165493 30459 -75636 -17109 241532 -122394
15755A62964d2127i066A36783c46648N9166J41864A84545h4261B46082G4519c9005
$$ 162964 -42127 -9066 136783 -346648 -287482 -145618 184545 -84261 246082 74519 -39005
15743A98711K2625A09715a77797A77585b75153L7729B94542j21326o4508l2514
$$ 198711 221336 109715 -177797 177585 -275153 -237424 294542 173216 108708 76194
15733G6194c31770b3816q1829a1144j02388M2281i569k27912D2956N9924b9322
$$ 76194 -331770 -23816 -105645 -11144 -113532 -71251 -9569 -237481 42956 102880 -29322
15721A74492a24391A56484g2516m4976l3360E4423J9J15962a8007A64772g9826
$$ 174492 -124391 156484 -72516 -117492 -150852 54423 54442 170404 -18007 164772 -79826
15709B04751G9125a30127E380O9506b623k01682g6792m13625a05234B01337e6971
$$ 204751 79125 -130127 5380 74886 -2623 -204305 -76792 -490417 -105234 201337 -56971
15697a50342k7060N3560A77695n4212a49309A52620c11424B20106c7754A59057
$$ -150342 -177402 -123842 177695 123483 -149309 152620 -311424 220106 -37754 159057
15686a63889A84692h954j87855e2398I3921a12954c755m8937l24863a128k55805
$$ -163889 184692 -8954 -196809 -52398 93921 -112954 -3755 -52692 -377555 -1128 -256933
15675b56933J17711M2874A26789d6441A79868J45061E9078a87088e9108j96987
$$ -256933 -139222 -96348 126789 -46441 179868 324929 59078 -187088 -59108 -256095
15665b56095C07445c49544A75774b46044Q6494E1360f8094A3709c38399f302j64127
$$ -256095 307445 -349544 175774 -246044 -159550 51360 -68094 13709 -338399 -6302 -170429
15654a70429a9485A72571c21620f8961k0256D4101K00621g9627A4602J82876r8615
$$ -170429 -19485 172571 -321620 -68961 -89217 44101 244722 -79627 14602 197478 98863
15643I8863b02630B25408n9936c48242d743k5128r2248j10754e4137j19446e454
$$ 98863 -202630 225408 165472 -348242 -4743 -29871 -122119 -232873 -54137 -173583 -5454
15631c04613A58550e7473E1165j6594M4482i2196A5937a73091I0188a31914C0617
$$ -304613 158550 -57473 51165 34571 79053 -92196 15937 -173091 90188 -131914 30617
15619A61923a55734A337J13002B5338i3114I0130j6640d4448r8629a5459j28739
$$ 161923 -155734 1337 114339 25338 -93114 90130 73490 -44448 -143077 -15459 -144198
15608a44198k74598A80044m9320h2329k76571A97168E8913C016a07883l91611
$$ -144198 -418796 180044 130724 -82329 -358900 197168 58913 3016 -107883 -499494
15598d99494B96648e749B290a54561N0351I1198l743a97j75419L4088C9167P6379
$$ -499494 296648 -5749 2290 -154561 -104210 91198 87455 -197 -175616 -141528 39167 115546
15586A15546M2394p695c9782p444B00836a44139j5700f7551j70330j993R1241
$$ 115546 157940 150245 -39782 -47226 200836 -144139 -159839 -67551 -237881 -239874 -148633
15575a48633m8392A24940f7106j06237A2337M2930a31635H4081K1227K4350J82646
$$ -148633 -197025 124940 -67106 -173343 12337 55267 -131635 84081 105308 129658 312304
15564C12304A2599J78829b65699E8703J25285h2358r3840H6342a19807D4524i8490
$$ 312304 12599 191428 -265699 58703 183988 -82358 -176198 86342 -119807 44524 -98490
15552g6885b4327A21921D0935M57989f4061I5773M6419a84934D0390J21918J66998
$$ -76885 -24327 121921 40935 498924 -64061 95773 142192 -184934 40390 162308 329306
15541C29306r6441c12669A61978b54242O3031f0748m9376l8135A34489g5369j74319
$$ 329306 232865 -312669 161978 -254242 -191211 -60748 -110124 -148259 134489 -75369 -249688
15530b49688A14317Q6447a14703B79148j19867a19902a5857H6162b0820n0365
$$ -249688 114317 200764 -114703 279148 159281 -119902 -15857 86162 -20820 -71185
15520g1185j19407F2324c50538h062l6962C84357H7779L38257j56493j26499K98004
$$ -71185 -190592 62324 -350538 -8062 -45024 384357 87779 426036 269543 143044 441048
15509D41048F7009b09116A06591f5892B61219o6034H9177M13407A43153J6519
$$ 441048 67009 -209116 106591 -65892 261219 195185 89177 502584 143153 159672
15499A59672R5860J47920A89204B9598N8667a09219C16140h6603I2077c5357i995
$$ 159672 255532 403452 189204 29598 88265 -109219 316140 -86603 92077 -35357 -9995
15487a28281r559O6856A27658L88439I70i7090B97414A26943b0906I0895P720
$$ -128281 -137840 -70984 127658 516097 970 -97090 297414 126943 -20906 90895 98615
15476I8615P0405J73038L49331n5863Q1038B78359L8528j9859a24769A12766m7014
$$ 98615 169020 342058 691389 635526 716564 278359 316887 297028 -124769 112766 65752
15465F5752Q2745M4898J03199b76190D45510a10293A59105m7331O7593A3297K942
$$ 65752 148497 193395 296594 -276190 445510 -110293 159105 111774 179367 13297 16239
15454A6239J53065J39168a54608E9682j2631J35998E6344J14015J49125A49824
$$ 16239 169304 308472 -154608 59682 47051 183049 56344 170359 319484 149824
15443C63691j35098M59155R1641Q65281o14964j95109l39508B34484I2131M17653
$$ 363691 228593 687748 779389 1644670 1029706 834597 495089 234484 92131 509784
15433E09784o3340h908D8657e7238A39934b0172A37879n2326J83423M269d1660
$$ 509784 446444 -8908 48657 -57238 139934 -20172 137879 85553 268976 273245 -41660
15421a78297g050l62624I0948h312k17541A3690O162K63382j15793h168A4823
$$ -178297 -7050 -369674 90948 -8312 -225853 13690 19852 283234 167441 -8168 14823
15409a71044j16957J30198l7146G867O9486b47151L9303K6459B08879B4295M3587
$$ -171044 -288001 -157803 -194949 7867 77353 -247151 -207848 -181389 208879 24295 67882
15398F7882h4146A04430C9176N4093M6495k4922i017H5820B2316b6293A81287
$$ 67882 -84146 104430 39176 93269 139764 114842 -9017 85820 22316 -26293 181287
15386e2401B65049I2272K76985G374J49026a804I3269a2506l5096K2699B27740
$$ -52401 265049 92272 369257 7374 156400 -1804 93269 -12506 -47602 -24903 227740
15374B04516F6146J51053M9253J73227j02090M9855E7754a53289A1263J86098
$$ 204516 66146 217199 266452 439679 337589 387444 57754 -153289 11263 197361
15364A97361p1897d2578C80942G615J11406i0928A41922K88887A61329K5767o9008
$$ 197361 125464 -42578 380942 7615 119021 -90928 141922 430809 161329 187096 118088
15353A18088J20444Q6606F001J06544K26404a32894A94275E9548J36107J46499
$$ 118088 238532 325138 6001 112545 338949 -132894 194275 59548 195655 342154
15343C42154j32921G0335K14852K0799G4285O22421b02735A53506b49956b7265
$$ 342154 209233 70335 285187 305986 74285 696706 -202735 153506 -249956 -27265
15332A50868b77138C89715j85204D4915K1696c16648b4432B08115M2110A05767
$$ 150868 -277138 389715 204511 44915 66611 -316648 -24432 208115 250225 105767
15321a23052A17163d1219o8991A99980b04453A63495Q1801n3447O5269M4253e7611
$$ -123052 117163 -41219 -110210 199980 -204453 163495 245296 191849 257118 301371 -57611
15309A56008K09493j49805b74869A16703J94242a98392B49968I3552d61203B3107
$$ 156008 365501 215696 -274869 116703 310945 -198392 249968 93552 -461203 23107
15298a93679c766I0314k2707M6016A3021K41666a9740b94p6686E7382J64251l3871
$$ -193679 -3766 90314 67607 113623 13021 254687 -19740 -294 -76980 57382 221633 187762
15286A87762R2538A05896e5069E7826B8295J4904J57435p2044E3243f0523C21316
$$ 187762 280300 105896 -55069 57826 28295 43199 200634 128590 53243 -60523 321316
15274e1426I6219P442P8589G5226J08461a41475E0Q0376K21764F1629N9406l6231
$$ -51426 96219 103661 182250 75226 183687 -141475 50 80426 302190 61629 121035 84804
15262H4804J16609m907F1169f2028A37200K45475d1716E4165i5514b5115A06546
$$ 84804 201413 196506 61169 -62028 137200 382675 -41716 54165 -95514 -25115 106546
15250i6396A7052O6209i0108B53803N8417j47254K44809j78540L45841J242126
$$ -96396 17052 83261 -90108 253803 312220 164966 409775 231235 577076 1819202
15240A819202J1993m62643R77243r99333E79469E2878K26628L0128G1941K47233
$$ 1819202 1831195 1368552 2345795 1346462 579469 52878 279506 309634 71941 319174
15230C19174E6220A8350d780k83921a16742A08328J0910E7786b83600A17685a3436
$$ 319174 56220 18350 -4780 -288701 -116742 108328 119238 57786 -283600 117685 -13436
15218a24163E8073B0440O3412J44549a07280A98783J71416H9618P2081O063G7699
$$ -124163 58073 20440 83852 228401 -107280 198783 370199 89618 161699 167762 77699
15206A90923b1138C69758A62064k6989h5584E26M63699A00963g574A76708M5641
$$ 190923 -21138 369758 162064 135075 -85584 526 464225 100963 -7574 176708 222349
15195B22349r6006D4217c1748o9394I7205M9019Q693M0261a62900A75946E4114
$$ 222349 126343 44217 -31748 -101142 97205 146224 154917 195178 -162900 175946 54114
15183A85719K4693j6414E8133a70049A73746d4242A35158J87349a70765N9680
$$ 185719 210412 193998 58133 -170049 173746 -44242 135158 322507 -170765 -111085
15173a11085B0900a51898A40410C0809J51551J44245B4532c880j83184G0711J00987
$$ -111085 20900 -151898 140410 30809 182360 326605 24532 -3880 -187064 70711 171698
15162A71698l3533a42975n8992A22737a52111m3634H6230a59201g0680e360A20458
$$ 171698 138165 -142975 -201967 122737 -152111 -195745 86230 -159201 -70680 -5360 120458
15150B59267h7593K1117m916B99421a98866A26265e1208H2978J7208O4386L5082
$$ 259267 -87593 -66476 -71392 299421 -198866 126265 -51208 82978 100186 164572 199654
15139A99654P4267A18732a65273A00455i915E5945g9347i754F8507a01202A93930
$$ 199654 273921 118732 -165273 100455 -9915 55945 -79347 -9754 68507 -101202 193930
15127a82302F5758a28818A84714p7358E1955J23825J538L21462j57462J13028
$$ -182302 65758 -128818 184714 107356 51955 175780 177318 498780 341318 454346
15117D54346n6739c27976A11004J01178F7009J27231a51243C00270D717K52295
$$ 454346 397607 -327976 111004 212182 67009 194240 -151243 300270 4717 257012
15107B57012l9753B2496K90204a82831A24207P780j6656K36621B9568d8988A26895
$$ 257012 217259 22496 312700 -182831 124207 131987 115331 351952 29568 -48988 126895
15095F3943O0587m8735B0236R0915b19113B92092Q3484D946i5180C2827j2694
$$ 63943 124530 75795 20236 111151 -219113 292092 375576 4946 -95180 32827 20133
15084B0133J10450d9093B81915p880A35845K28310n5961m0036D2492c721D4733
$$ 20133 130583 -49093 281915 274035 135845 364155 308194 268158 42492 -3721 44733
15072D17121c7909G5726i905A9797L38659A29558G291a91158B53660C8428L23488
$$ 417121 -37909 75726 -9905 19797 358456 129558 7291 -191158 253660 38428 361916
15061C61916j41723j03844J55021P9823M7205l3859A49226J00702o5065J99966
$$ 361916 220193 116349 271370 351193 398398 364539 149226 249928 184863 384829
15051C84829j31464J89137L73871A87528O21368B56912j5205K70796A19553L54336
$$ 384829 253365 442502 816373 187528 808896 256912 241707 512503 119553 473889
15041D73889k26177q089J69441A83203K44689B0449K45994N0567K92790I5857
$$ 473889 247712 239623 409064 183203 427892 20449 266443 317010 609800 95857
15030G46792K1550j65884K93148o5224k21597k11471A77895i311E48880K02152
$$ 746792 768342 602458 895606 830382 608785 397314 177895 -9311 548880 751032
15020G51032n4554k43322O8201j83110K01913k50258J2743O4926p253N3550j25310
$$ 751032 696478 453156 521357 338247 540160 289902 302645 367571 360318 413868 288558
15009B88558M75929C00873J85931J63783A71735l5326K49411k3720j62218L46641
$$ 288558 764487 300873 486804 650587 171735 136409 385820 362100 199882 546523
14999E46523j83665L18246n8231k34535j60413K09667E9782K32984a8583F05931
$$ 546523 362858 681104 622873 388338 227925 437592 59782 292766 -18583 605931
14988E77845B34748n1238K05939M48027C78047K07603j42496M57565m3534Q7779
$$ 577845 234748 183510 389449 837476 378047 585650 443154 900719 857185 944964
14978I44964k40114B28066O68328C49851j7871L64429L50670l77432j06935J92569
$$ 944964 704850 228066 896394 349851 331980 696409 1047079 669647 562712 755281
14968G55281j59310k97023l9721P6119k4692N1621J69501B57361L7700J45615
$$ 755281 595971 298948 259227 335346 310654 362275 531776 257361 295061 440676
14958D40676L7409d399B47904J47028A88544O6105K73038D0435N19707k63312
$$ 440676 478085 -4399 247904 394932 188544 254649 527687 40435 560142 296830
14948B96830O51K78378A51099J59104M40774r6780k5410j32325L5743k60501J59477
$$ 296830 297481 575859 151099 310203 750977 654197 628787 496462 532205 271704 431181
14937D31181m2438j52504N91131C83950J20132K98646j03024K0680O52552N2195
$$ 431181 388743 236239 827370 383950 504082 802728 699704 720384 1372936 1425131
14927A425131k56558K26865L7468M33437l8694j71318k1653j39522r3820M12989
$$ 1425131 1168573 1395438 1432906 1866343 1827649 1656331 1634678 1495156 1401336 1814325
14917A814325M39313L86259m58484l10404n91257M60088q26919M51963E00798
$$ 1814325 2253638 2639897 2181413 1871009 1279752 1739840 912921 1364884 500798
14907C90339J3869j13560M32487j36483o1429l2796A42608K58678j78030m7922
$$ 390339 404208 290648 723135 586652 525223 492427 142608 401286 223256 175334
14897A75334K52379L4356j474j91347K88374B72316O3502J65534J2701J19706
$$ 175334 427713 462069 460595 269248 557622 272316 335818 501352 514053 633759
14887F33759k09787K98518J08432j77963J9242P7439k57461K77666J75583o2275
$$ 633759 423972 722490 830922 652959 672201 749640 492179 769845 945428 883153
14877H83153k89082Q3096L3897l53167J55724J8365J809l3636r1749J47596B50083
$$ 883153 594071 677167 711064 357897 513621 531986 533795 500159 408410 556006 250083
14865F77696K36910j42836j61762K62100l86129K47287j11532A10216K77517r7402
$$ 677696 914606 771770 610008 872108 485979 733266 621734 110216 387733 290331
14855B90331J79834j77824l3854J22820J13310N8042r2851M01782l93683K08348
$$ 290331 470165 292341 258487 381307 494617 552659 459808 861590 467907 676255
14845F76255j04631N76914o5287p0831k19808J90236j47612q8839L71766j86291
$$ 676255 571624 1148538 1083251 1012420 792612 982848 835236 746397 1118163 931872
14835I31872l10243L26438C09755L42796J70608P0993l27438k07680j21450O21126
$$ 931872 621629 948067 309755 652551 823159 894152 566714 359034 237584 858710
14825H58710l68050J38737R17j80323L53930C57107P9582n5230M01552j95903
$$ 858710 490660 629397 630314 449991 803921 357107 436689 381459 783011 587108
14815E87108K30303P309O1379j63535j93232L70324l17001B79062M84275P6891
$$ 587108 817411 824720 886099 722564 529332 899656 582655 279062 763337 840228
14805H40228K24623j91345m3997K7506j8075r3511m9056r6841j76216k6216L7286
$$ 840228 1064851 873506 829509 857015 838940 745429 696373 599532 423316 397100 434386
14794D34386m1004M927J97486B78175K52891j68086J1427o1309O14013m33008
$$ 434386 393382 398309 595795 278175 531066 362980 374407 313098 927111 494103
14784D94103p7855K79320J13716J17504l91148L84888j24602q9544J49640K53786
$$ 494103 416248 695568 809284 926788 535640 920528 795926 706382 856022 1109808
14774A109808m20961J6637O7088j01788L26646k86533m2572p0885K8771j19931
$$ 1109808 688847 705484 772572 670784 997430 710897 668325 597440 626211 506280
14764E06280j44173J26731M27304k93916k04754K14293j47561l2982K09283m7717
$$ 506280 362107 488838 916142 622226 417472 631765 484204 451222 660505 612788
14754F12788l3769l140R1767K36345Q6009l02946l32042K41658L3043j67318K27468
$$ 612788 579019 575879 667646 903991 990000 687054 355012 596670 629713 462395 689863
14743F89863k67365K19253l2627O6544Q13M93926B93460O48781j08862M6037j81313
$$ 689863 422498 641751 609124 675668 676481 1170407 293460 942241 833379 879416 698103
14732F98103M91119j7774J95483P5177M1008M84650k39263l0805l45562J20842
$$ 698103 1189222 1171448 1366931 1442108 1483116 1967766 1728503 1697698 1352136 1472978
14722A472978k97492l42679K58620k35475J18341o8692k67926L29123O1551k66999
$$ 1472978 1175486 832807 1091427 855952 974293 905601 637675 966798 1028349 761350
14712G61350R4385k03569L36923J56300n7146p0037J92583j97321K84351R2769
$$ 761350 855735 652166 989089 1145389 1088243 1018206 1210789 1013468 1297819 1390588
14702A390588K20572K85455L5176R0491m03058o27837J74795O7294k3136j50946
$$ 1390588 1611160 1896615 1931791 2022282 1619224 991387 1166182 1233476 1210340 1059394
14692A059394O348k43792j62079R1301l5681J36489K30674o2972k70732J37415
$$ 1059394 1065742 821950 659871 751172 715491 851980 1082654 1019682 748950 886365
14682H86365j50931q5163O0034j08629M16317n0067K82619l37385L27612l20799
$$ 886365 735434 650271 710305 601676 1017993 967926 1250545 913160 1240772 919973
14672I19973J00611m9317J00430m24706K29572M7837n6948j7227p6126K85511
$$ 919973 1020584 971267 1071697 646991 876563 924400 867452 850225 774099 1059610
14662A059610q4348K65908k43768k94209K03009J35834N1166J3372J3352M77428
$$ 1059610 975262 1241170 997402 703193 906202 1042036 1093202 1106574 1119926 1597354
14652A597354l43545J73272j44949q1185k24427J43803j00274J47059r6594l66558
$$ 1597354 1253809 1427081 1282132 1200947 976520 1120323 1020049 1167108 1070514 703956
14642G03956K37098K16001O5656j02753j15323K25697k08989M09457k72005Q6997
$$ 703956 941054 1157055 1222711 1119958 1004635 1230332 1021343 1430800 1158795 1245792
14632A245792n54418O54698j29371j82998L93349r363j51966L5879P0367k10458
$$ 1245792 691374 1346072 1216701 1033703 1427052 1417689 1265723 1301602 1371969 1161511
14622A161511p9170K46483K29601N8193j57280l075n0870K42580N8647n67248
$$ 1161511 1082341 1328824 1558425 1616618 1459338 1456263 1405393 1647973 1706620 1139372
14612A139372J86385J77544k19191Q8843k7852j65762K81174p810K49148n63087
$$ 1139372 1325757 1503301 1284110 1372953 1345101 1179339 1460513 1452703 1701851 1138764
14602A138764K92051N6975K91931n12715J53878P5859M7708L060J59828n6705
$$ 1138764 1430815 1487790 1779721 1267006 1420884 1496743 1544451 1547511 1707339 1650634
14592A650634M6816j02866l0015J53116P4008m00984L56921P2008j85412J81115
$$ 1650634 1697450 1594584 1564569 1717685 1791693 1390709 1747630 1819638 1634226 1815341
14582A815341l79859O09783r8369J6721j29376J87785j16967n4165L38922l13269
$$ 1815341 1435482 2045265 1946896 1963617 1834241 2022026 1905059 1850894 2189816 1876547
14572A876547J32823K52122O7354j37877j37495P1740k7472K84641j89498L02706
$$ 1876547 2009370 2261492 2328846 2190969 2053474 2125214 2097742 2382383 2192885 2495591
14562B495591k36253R3507j81067K94574o6346L48805M18426j3610k28436J08572
$$ 2495591 2259338 2352845 2171778 2466352 2400006 2748811 3167237 3153627 2925191 3033763
14552C033763P05656N87685P29052J561888L104664P215531J9662508Q026548
$$ 3033763 3739419 4327104 5056156 6618044 9722708 16938239 36600747 44627295
14544D4627295B1682925I780137m632836j128317j056910l55586L60988M65522
$$ 44627295 21682925 9780137 5147301 4018984 2962074 2606488 2967476 3432998
14536C432998K289999k282954j003693k84155k66288K36059r56l6284j78132j48607
$$ 3432998 5722997 3440043 2436350 2152195 1885907 2121966 2121010 2084726 1906594 1757987
14526A757987J65255L36081j0077R257l48240M34643p9248K8813l4834K42719
$$ 1757987 1923242 2259323 2249246 2258503 1910263 2344906 2265658 2294471 2259637 2502356
14516B502356n3231O4870J53179p2795J97719l7454k74439j119j10229N85223
$$ 2502356 2449125 2513995 2667174 2594379 2792098 2754644 2480205 2479086 2368857 2954080
14506B954080k96791M30446l07217k65829L97844J36286k31110J39305k72292
$$ 2954080 2657289 3087735 2780518 2514689 2912533 3048819 2817709 2957014 2684722
14497B684722O81267k12605J45867j49530J1478L76876l67470P51846q04178J47180
$$ 2684722 3365989 3153384 3299251 3149721 3161199 3538075 3170605 3922451 3118273 3265453
14487C265453P4155P024K15904Q2022q085k30982K49132j41146K14381K79249
$$ 3265453 3339608 3346632 3562536 3644558 3636473 3405491 3654623 3513477 3727858 4007107
14477D007107j92528r7861j22491K58060M7753J82582J73180J0701j57527L53252
$$ 4007107 3814579 3716718 3594227 3852287 3900040 4082622 4255802 4266503 4108976 4462228
14467D462228k10477q7254L66298j78276M3040O6799K06996j03662P8968O9042
$$ 4462228 4251751 4164497 4530795 4352519 4395559 4462358 4669354 4565692 4644660 4713702
14457D713702n1463J70132j90888O21576k81483p1642J95440J5598L13008j52956
$$ 4713702 4662239 4832371 4641483 5263059 4981576 4909934 5105374 5120972 5433980 5281024
14447E281024K25161o7435J5872J22258K42296l02452j40433K70247M24297j79095
$$ 5281024 5506185 5438750 5454622 5576880 5819176 5516724 5376291 5646538 6070835 5891740
14437E891740M04136j89779j06369L11899N3005O9677K51002K71396n16182O20965
$$ 5891740 6295876 6106097 5999728 6311627 6364632 6434309 6685311 6956707 6440525 7061490
14427G061490j13718j27552L69511k7170O61369l34420N17917j6288M86180l69044
$$ 7061490 6947772 6820220 7189731 7162561 7823930 7489510 8007427 7991139 8477319 8108275
14417H108275N09699k50770p272L9922n8134J29968L34358J78240R9556J17501
$$ 8108275 8617974 8367204 8359932 8399854 8341720 8471688 8806046 8984286 9083842 9201343
14407I201343J31236M89020k19586L65971k23370K89956R0985m8222M11856R13
$$ 9201343 9332579 9821599 9602013 9967984 9744614 10034570 10125555 10077333 10489189 10490102
14397A0490102K57638L17823m49169O23622Q4045L12849Q0095L35156R1316L89318
$$ 10490102 10747740 11065563 10616394 11240016 11324061 11636910 11717005 12052161 12143477 12532795
14387A2532795J20097L70979q085N08547Q1612P35120J24730j01564O78277j45184
$$ 12532795 12652892 13023871 13015786 13524333 13605945 14341065 14465795 14364231 15042508 14897324
14377A4897324M09644k7432M25182L31088J56909L44877N09528K33462K71838
$$ 14897324 15306968 15279536 15704718 16035806 16192715 16537592 17047120 17280582 17552420
14368A7552420Q61283M41424k3910O02092O21563j7959M89864P1537P36276K36370
$$ 17552420 18413703 18855127 18831217 19433309 20054872 20036913 20526777 20598314 21334590 21570960
14358B1570960O23913M92889K48475J055782N23321J05422R49333M96944P22971
$$ 21570960 22194873 22687762 22936237 23992019 24515340 24620762 25570095 26067039 26790010
14349B6790010N27756Q74129M61232Q20948Q13477M37487J024762J146078M74086
$$ 26790010 27317766 28191895 28653127 29474075 30287552 30725039 31749801 32895879 33369965
14340C3369965P24380J393387O07849J054092J310910Q47465J369108J185284
$$ 33369965 34094345 35487732 36095581 37149673 38460583 39308048 40677156 41862440
14332D1862440J103393J412309J083314J197603K110689J502121J521285J632888
$$ 41862440 42965833 44378142 45461456 46659059 48769748 50271869 51793154 53426042
14324E3426042K078907J643791K042145K024347K582508J788463K651261J888828
$$ 53426042 55504949 57148740 59190885 61215232 63797740 65586203 68237464 70126292
14316G0126292K593587K896193K770424L104495L102964L520028L545289M016860
$$ 70126292 72719879 75616072 78386496 81490991 84593955 88113983 91659272 95676132
14308I5676132L441364M379172M482953M607303N117689N166735N516042O220900
$$ 95676132 99117496 103496668 107979621 112586924 117704613 122871348 128387390 134608290
14300A34608290N979296O797230O701780P752919Q008148Q491823Q855876R529864
$$ 134608290 140587586 147384816 154086596 161839515 169847663 178339486 187195362 196725226
14292A96725226R988500J0707500J1108473J1422388J2325937J2605595J3636583
$$ 196725226 206713726 217421226 228529699 239952087 252278024 264883619 278520202
14285B78520202J3658875J4467328J4701256J4922035J5497073J5425833J4693989
$$ 278520202 292179077 306646405 321347661 336269696 351766769 367192602 381886591
14278C81886591J4966401J4403517J2751231J2228862R069648N347868L241873
$$ 381886591 396852992 411256509 424007740 436236602 445306250 450654118 453895991
14271D53895991J986563O74797k908047l444717l343853p261076p885976q921710
$$ 453895991 455882554 456557351 453649304 450204587 446860734 439599658 431713682 422791972
14263D22791972r358938j1302099j3448884j4046651j4939031j5853990j5616554
$$ 422791972 413433034 402130935 388682051 374635400 359696369 343842379 328225825
14256C28225825j5387881j5284787j4705869j4215315j3498228j3136362j2590026
$$ 328225825 312837944 297553157 282847288 268631973 255133745 241997383 229407357
14249B29407357j1663835j1316157q658610r735971r303395q713565q095460p655085
$$ 229407357 217743522 206427365 197768755 188032784 178729389 170015824 161920364 154265279
14241A54265279p173516p134351o762537n510892n332995n251701n645120m993982
$$ 154265279 147091763 139957412 133194875 127683983 122350988 117099287 111454167 106460185
14233A06460185m381046l756481l809253l609186l688616l617155l367359k891789
$$ 106460185 102079139 98322658 94513405 90904219 87215603 83598448 80231089 77339300
14225G7339300l051142k645073k707803k556532k200727j871032k314296k302165
$$ 77339300 74288158 71643085 68935282 66378750 64178023 62306991 59992695 57690530
14217E7690530j598977j877826j940623j289387j283012j723153j693252j446602
$$ 57690530 56091553 54213727 52273104 50983717 49700705 47977552 46284300 44837698
14209D4837698j546115j066720m47704q65692j646718j243974j448882p61234
$$ 44837698 43291583 42224863 41777159 40911467 39264749 38020775 36571893 35810659
14201C5810659p10620p40037r24611j095470p57945r67515r86903J76783p17996
$$ 35810659 35100039 34360002 33435391 32339921 31581976 30614461 29627558 29804341 29086345
14192B9086345j286330o13134m75752q23347q09477m90342l34301j005899M8211
$$ 29086345 27800015 27186881 26711129 25887782 25078305 24587963 24253662 23247763 23295974
14183B3295974n70507o72020o03394n7121o21423l14352p76411r6553n37893n35016
$$ 23295974 22725467 22053447 21450053 21392932 20771509 20457157 19680746 19584193 19046300 18511284
14173A8511284k08573l77746n81635k06237J69587q35057n85598r832o38075L14572
$$ 18511284 18302711 17924965 17343330 17137093 17306680 16471623 15886025 15876193 15238118 15552690
14163A5552690j45067m01302n89903J31048l60648l60850j10484n1421j24286
$$ 15552690 15407623 15006321 14416418 14547466 14186818 13825968 13715484 13664063 13539777
14154A3539777o41203j40311r3478n22203Q9328j98949j50466m43646j51395j65465
$$ 13539777 12898574 12758263 12664785 12142582 12231910 12032961 11882495 11438849 11287454 11121989
14144A1121989j71105k30258O0731m59039k6839k30284J01305l36033r539O2870
$$ 11121989 10950884 10720626 10781357 10322318 10295479 10065195 10166500 9830467 9820928 9883798
14134I883798q9442k95969k44583R927m80106J2741L52134l50671m24729K28864
$$ 9883798 9794356 9498387 9253804 9263731 8783625 8796366 9148500 8797829 8373100 8601964
14124H601964l81862m94145M22383k14380M7491l07231L01212k89830l68789J63262
$$ 8601964 8220102 7725957 8148340 7933960 7981451 7674220 7975432 7685602 7316813 7480075
14114G480075J15657m79444J09768l81345k91890L73940k14803l18574L0154K63956
$$ 7480075 7595732 7116288 7226056 6844711 6552821 6926761 6711958 6393384 6423538 6687494
14104F687494l26419l05994Q3373J00409l26552O1873J01071m28713j61839J83251
$$ 6687494 6361075 6055081 6138454 6238863 5912311 5974184 6075255 5646542 5484703 5667954
14094E667954K34266l1989l91562J00805l04797J38349k16262l3227k74478J83826
$$ 5667954 5902220 5870231 5478669 5579474 5274677 5413026 5196764 5163537 4889059 5072885
14084E072885R2686j63272m51926N32309j80199p3585n3653l6498L9492m26543
$$ 5072885 5165571 5002299 4550373 5082682 4902483 4828898 4775245 4738747 4778239 4351696
14074D351696j018J87663K16137m24579R4452j21999K00125l40272O1275k40103
$$ 4351696 4350678 4538341 4754478 4329899 4424351 4302352 4502477 4162205 4223480 3983377
14064C983377L8639M58859m13849M41265k32272j83520Q2537k3151J07757o99150
$$ 3983377 4022016 4480875 4067026 4508291 4276019 4092499 4175036 4151885 4259642 3560492
14054C560492M29829O591K9203l12326K8041j20551j00023L42244j80398m70920
$$ 3560492 3990321 3996912 4026115 3713789 3741830 3621279 3521256 3863500 3683102 3212182
14044C212182Q0458K01059j50365o8790n3824K51229k53144n6307j72985K02065
$$ 3212182 3292640 3493699 3343334 3274544 3220720 3471949 3218805 3162498 2989513 3191578
14034C191578k2189l910J30186k22356O5960j42932n2404K13187J70606j92734
$$ 3191578 3169389 3165479 3295665 3073309 3139269 2996337 2943933 3157120 3327726 3134992
14024C134992k83971K07008j85555K867n3080k14561l9720J25021J3175j12208
$$ 3134992 2851021 3058029 2872474 2875341 2822261 2607700 2567980 2693001 2706176 2593968
14014B593968K52677l53685J10412L0801l47576L3645K12162k49549M96426j71314
$$ 2593968 2846645 2492960 2603372 2634173 2286597 2320242 2532404 2282855 2779281 2607967
14004B607967k35374k88930K40463K71437k96486k83303j94806L22521R9817k26948
$$ 2607967 2372593 2083663 2324126 2595563 2299077 2015774 1820968 2143489 2243306 2016358
13994B016358l5005J07619p1909J59677L61302O50080J846721N260888J6846911
$$ 2016358 1981353 2088972 2017063 2176740 2538042 3188122 5034843 10295731 27142642
13985B7142642K0386328j9200332j2292103o782924k442517j426045q50875q33666
$$ 27142642 47528970 28328638 16036535 9253611 6811094 5385049 4534174 3700508
13977C700508m11891J37380n18077N70j08736j55122Q707K6046j00749j22955
$$ 3700508 3288617 3425997 2907920 2908490 2799754 2644632 2653339 2679385 2578636 2455681
13967B455681J65976n2350p1689j72926j84791M69731n80986K59550j00378N5484
$$ 2455681 2621657 2569307 2497618 2324692 2139901 2609632 2028646 2288196 2187818 2243302
13957B243302o8886l65722K60245M7445k27326L37974k2572k93246L09134l02010
$$ 2243302 2174416 1808694 2068939 2116384 1889058 2227032 2204460 1911214 2220348 1918338
13947A918338l72853M64693n9270m6682l48891J05194K07372O1221o7991j23853
$$ 1918338 1545485 2010178 1950908 1904226 1555335 1660529 1867901 1929122 1861131 1737278
13937A737278l9089J95789j71613J37991q6076l2325m12050J31291R7608K70174
$$ 1737278 1698189 1893978 1722365 1860356 1774280 1741955 1329905 1461196 1558804 1828978
13927A828978l26778J31918k55372M93201n76458K79601n7402J77454q2764j81494
$$ 1828978 1502200 1634118 1378746 1871947 1295489 1575090 1517688 1695142 1612378 1430884
13917A430884J6184K74296l20627J38292k06516K99634k45524l7974J53622k78836
$$ 1430884 1447068 1721364 1400737 1539029 1332513 1632147 1386623 1348649 1502271 1223435
13907A223435p4298J50174K2433m4250K3417j25370L71332j99393q8740k34594
$$ 1223435 1149137 1299311 1321744 1277494 1300911 1175541 1546873 1347480 1258740 1024146
13897A024146M40135k81405L13896J00602k24820q2273k318J86162j25047o9409
$$ 1024146 1464281 1182876 1496772 1597374 1372554 1290281 1287963 1474125 1349078 1279669
13887A279669j97102q8699N46524l02213m6718J68801m5244k32234K11844j45864
$$ 1279669 1082567 993868 1540392 1238179 1191461 1360262 1315018 1082784 1294628 1148764
13877A148764L89344o6491q7140m56346K73409J4701J54481m13383M02408j95887
$$ 1148764 1538108 1471617 1384477 928131 1201540 1216241 1370722 957339 1359747 1163860
13867A163860K28197l73290J24913j31010N31087l93954K76843F37756M67851
$$ 1163860 1392057 1018767 1143680 1012670 1543757 1149803 1426646 637756 1105607
13858A105607J35277j35979k61613J66518M21869l81342J13183j62535J27790
$$ 1105607 1240884 1104905 843292 1009810 1431679 1050337 1163520 1000985 1128775
13849A128775p4490l26714N29782m23253L72091m34333R2501L2853K09112N2048
$$ 1128775 1054285 727571 1257353 834100 1206191 771858 864359 897212 1106324 1158372
13839A158372l67447N7213j6622j2303k2373K45601k00165K01794Q1116j94792
$$ 1158372 790925 848138 831516 819213 796840 1042441 842276 1044070 1125186 930394
13829I30394l2809O1594j39050M30453l83742R7129j6829r9331L16973m69236
$$ 930394 897585 959179 820129 1250582 866840 963969 947140 847809 1164782 695546
13819F95546K10078K24485j92400J94440k76524k47045N82575l57545R1337q4664
$$ 695546 905624 1130109 937709 1132149 855625 608580 1191155 833610 924947 840283
13809H40283C66095N35202j06979q3681M9247J97957l0718k55347M61077m18529
$$ 840283 366095 901297 794318 710637 759884 957841 927123 671776 1132853 714324
13799G14324J27880o7290J04685K9067k05791P0464J54964q5974Q9969k49961
$$ 714324 842204 774914 879599 908666 702875 773339 928303 842329 932298 682337
13789F82337J47640J92697k11081Q0761K46062m12810L12796k71490k34373j15959
$$ 682337 829977 1022674 811593 892354 1138416 725606 1038402 766912 532539 416580
13779D16580K36236L57215p4850l80146j64015Q2991L25582l02449J75853K31261
$$ 416580 652816 1010031 935181 555035 391020 474011 799593 497144 672997 904258
13769I04258l21034L40890l56743j22765J01234k39147M51095m3282K71301l72062
$$ 904258 583224 924114 567371 444606 545840 306693 757788 714506 985807 613745
13759F13745P587J36489j0038k920l15563L63514k20913J77119j69665J53383
$$ 613745 621332 757821 747783 744863 429300 792814 571901 749020 579355 732738
13749G32738K11367m6548k19451r9792L71561j21971l10393j42181N15895m17810
$$ 732738 944105 897557 678106 578314 949875 827904 517511 375330 891225 473415
13739D73415L73575l36744N00725l38445Q2643j56931k232L12429C35473N77026
$$ 473415 846990 510246 1010971 672526 755169 598238 596006 908435 335473 912499
13729I12499r1955k46600O6335k16663P2877K3765J41823J56210A48024N36152
$$ 912499 820544 573944 640279 423616 496493 520258 662081 818291 148024 684176
13719F84176k71848j01762J83091n5076P8938J66733j90876j50967I9850L39962
$$ 684176 412328 310566 493657 438581 517519 684252 493376 342409 99850 439812
13709D39812L01812k70669J3943o9709K64429p2174B39722M52131M1287j84467
$$ 439812 741624 470955 484898 415189 679618 607444 239722 691853 733140 548673
13699E48673j6664K21968C35016K57740j75447l2459A73420N51385C55001L8301
$$ 548673 532009 753977 335016 592756 417309 384850 173420 724805 355001 393302
13689C93302p2240K05540R3959j7874j09790L1575R4010K2348B40163K90881l2364
$$ 393302 321062 526602 620561 602687 492897 524472 618482 640830 240163 531044 498680
13678D98680K7021K1650J75886l29043K38270j75982K70267B54290K49166J43915
$$ 498680 525701 547351 723237 394194 632464 456482 726749 254290 503456 647371
13668F47371C18447J79643J15332K19035l67676J86027k46127j67393L33491J89054
$$ 647371 318447 498090 613422 832457 464781 650808 404681 237288 570779 759833
13658G59833C02964A41045M79835L227j93592j19046r0434O20862B76388L63300
$$ 759833 302964 141045 620880 624107 430515 311469 221035 841897 276388 639688
13648F39688k81243J22111r7227j03087K55944A33278N18495j52911o5729Q2554
$$ 639688 358445 480556 383329 280242 536186 133278 651773 498862 433133 515687
13638E15687j27576K86491A31271L43934p4235K51735M9687B46531L84915K25612
$$ 515687 388111 674602 131271 475205 400970 652705 702392 246531 631446 857058
13628H57058A07742j6641L80690P8589j17417M7949B10635L35960k42270M7665
$$ 857058 107742 91101 471791 550380 432963 480912 210635 546595 304325 351990
13618C51990J72213j65272J17248j31280J78717A75079L22114q9274K2787K13009
$$ 351990 524203 358931 476179 344899 523616 175079 497193 407919 430706 643715
13608F43715k66624K76065k19070A17161M50701j93346L13004B27326G7504K16575
$$ 643715 377091 653156 434086 117161 567862 374516 687520 227326 77504 294079
13598B94079E5777L12077P6627E5002K80637p5491J91542j11580L9176I7761M65278
$$ 294079 55777 367854 444481 55002 335639 260148 451690 340110 379286 97761 563039
13587E63039k66407H5022L01488b5256B79121O1387P3500o5786A53422J50405
$$ 563039 296632 85022 386510 -25256 279121 340508 414008 348222 153422 303827
13577C03827n4977L32164j72166j99806N01632l31985j70139J2048L31814B63980
$$ 303827 248850 581014 408848 209042 710674 378689 208550 220598 552412 263980
13566I0698K19911l8436N9581j5419A21848N93760k36184j09526k5606A13313
$$ 90698 310609 272173 331754 316335 121848 715608 479424 369898 344292 113313
13555b7660B80960K33105k17326p7309F0488M60924j10945K0851J71154j28270
$$ -27660 280960 514065 296739 219430 60488 521412 410467 431318 602472 474202
13545D74202q2438A62282K26463j28408A7788L66976r9972K5222P8094j42066
$$ 474202 391764 162282 388745 260337 17788 384764 284792 310014 388108 246042
13535B46042r7985E6936K97214L79914G8131c7778C42112c1123C01037J61741
$$ 246042 148057 56936 354150 734064 78131 -37778 342112 -31123 301037 462778
13525D62778O6622A33360J42713j1402J48324B4132J62305J94222A30338L58512
$$ 462778 529400 133360 276073 264671 412995 24132 186437 380659 130338 488850
13515D88850k16915A18938K98714L11743A66639K79327A13868R1412A0506N45443
$$ 488850 271935 118938 417652 729395 166639 445966 113868 205280 10506 555949
13505E55949B41696M2940N0833j66529K35425E3718j3983J78998a34138A90195
$$ 555949 241696 284636 335469 168940 404365 53718 39735 218733 -134138 190195
13494A11195J00635M7q4877B9272J75273b0165C38364j24534J18547r570j32609
$$ 111195 211830 211877 127000 29272 204545 -20165 338364 213830 332377 322807 190198
13483A90198a28586B39030n7646c48923C78824a54934B42508J3635J47874A42844
$$ 190198 -128586 239030 181384 -348923 378824 -154934 242508 256143 404017 142844
13472G6339L67017I0309a24817B85911J93606B30182A10694K78015E4616L66589
$$ 76339 443356 90309 -124817 285911 479517 230182 110694 388709 54616 421205
13462D21205G1123K41902a65815A38458J99972m2140e3375a0514D67675a80178
$$ 421205 71123 313025 -165815 138458 338430 296290 -53375 -10514 467675 -180178
13451D11074A85795L76712m2344A90196M56008B25488K34797D3541J56403J69153
$$ 411074 185795 562507 520163 190196 646204 225488 460285 43541 199944 369097
13441C69097A64398o5852B8867N7563b9604B73683l2270L5969l4005P9009G7425
$$ 369097 164398 98546 28867 86430 -29604 273683 241413 277382 243377 322386 77425
13429D95850m6699A46623C3926P2255P3994o4134K7591O062o9794M23508A36664
$$ 495850 449151 146623 33926 106181 180175 116041 143632 149694 79900 503408 136664
13417C10888E6930L3025i0030H0904L86996k32398H1726J46285L66987g480B36399
$$ 310888 56930 89955 -90030 80904 467900 235502 81726 228011 594998 -7480 236399
13405B71269H8316c52051A00975K74339j48712G8735K04206m7018M3036j36118
$$ 271269 88316 -352051 100975 375314 226602 78735 282941 235923 278959 142841
13395A42841J49970b3799A36274J70882A14816J20185F7318j550K92607r8918
$$ 142841 292811 -23799 136274 307156 114816 235001 67318 65768 358375 259457
13385B59457k7644L8930K61247A97255m9246b27537B60367o5696I2418J42487
$$ 259457 231813 270743 531990 197255 148009 -227537 260367 194671 92418 234905
13375B34905j16859N54684B08320r8931N3388N8885l8287J63391J3870j65417
$$ 234905 118046 672730 208320 109389 162777 221662 183375 346766 360636 195219
13365A95219M585J05178J09736j23857Q5746K7603K2550j02111j00490a2225A78138
$$ 195219 199804 304982 414718 290861 376607 404210 426760 324649 224159 -12225 178138
13353A13081n5046J85075A09349J15504b8449B05491K7412I546M57946j99893
$$ 113081 58035 243110 109349 224853 -28449 205491 232903 9546 467492 267599
13343B67599J5703j03338K48508o5517p298j595A14537J95682e2971B38398K77939
$$ 267599 283302 179964 428472 362955 355657 354062 114537 310219 -52971 238398 516337
13332E16337j04885A12360O4962b30239B4376M15314C6363M20188A26691K23052
$$ 516337 411452 112360 177322 -230239 24376 439690 36363 456551 126691 349743
13322C49743K0942A01225K47151E850a59306D98598A50650K7869M61553k21160
$$ 349743 370685 101225 348376 5850 -159306 498598 150650 178519 640072 418912
13312D18912a90388A50797K80074A35512K40109p9320P2950a08398C66584i3808
$$ 418912 -190388 150797 430871 135512 375621 296301 369251 -108398 366584 -93808
13301C42685k6462j21890O2319j3162r8502a22779A99652h0457k9157B86665r0435
$$ 342685 316223 194333 256652 243490 144988 -122779 199652 -80457 -109614 286665 196230
13290A96230m1400n0610B6331e5006b5660A38152E9316N6811K63296a20257A06550
$$ 196230 154830 104220 26331 -55006 -25660 138152 59316 116127 379423 -120257 106550
13278A51844n5590a16198B10763J0705C2719K06881C3670J58246H8631b39826
$$ 151844 96254 -116198 210763 221468 32719 239600 33670 191916 88631 -239826
13267A79697K8635a93927D25794F1001J22051R107E7186L4671c68388B84517A22186
$$ 179697 208332 -193927 425794 61001 183052 192159 57186 91857 -368388 284517 122186
13255a05477b1869A77676p7653J36090c3257B4925i523A39501L8738k5469j507
$$ -105477 -21869 177676 100023 236113 -33257 24925 -9523 139501 178239 152770 151263
13244A51263B7254P5946P7972d9259l33482G5799K36888e8206o7488A62154J13290
$$ 151263 27254 103200 181172 -49259 -382741 75799 312687 -58206 -125694 162154 275444
13233B75444q6836K7182N8882D8951J53077L01370G7903d4905p77A69631f8711
$$ 275444 188608 215790 274672 48951 202028 503398 77903 -44905 -45682 169631 -68711
13221B34671j2673I8408K54549b6244B13746O4729K2766K5049J7236A41782m4279
$$ 234671 221998 98408 352957 -26244 213746 278475 301241 326290 343526 141782 97503
13210I7503J38660O3169g2473A55929J14256g0963K0257A14262a32050e645A8020
$$ 97503 236163 299332 -72473 155929 270185 -70963 -50706 114262 -132050 -5645 18020
13198E5304J54044r6468K55408A53321N2444M4796e0219J178D33688e828j4545
$$ 55304 209348 112880 368288 153321 205765 250561 -50219 -49041 433688 -5828 -20373
13187b0373C54688A01680b37688h2006C04785j28381a03402j04671B91914K56239
$$ -20373 354688 101680 -237688 -82006 304785 176404 -103402 -208073 291914 548153
13177E48153j52865b73861A50724f7882B1093i762A85035P0921G9420J28784d0242
$$ 548153 395288 -273861 150724 -67882 21093 -9762 185035 255956 79420 208204 -40242
13165B90455q1082p6225j0081k4027a37049E5131J82108h6707n2251a0706j3530
$$ 290455 209373 133148 123067 99040 -137049 55131 237239 -86707 -138958 -10706 -24236
13154b4236A40726o5361a76617b1966G4848P3921b12886F9147e9296B18611G7287
$$ -24236 140726 75365 -176617 -21966 74848 148769 -212886 69147 -59296 218611 77287
13142b0466D0030M3294J25243J26520a76673e0584A8649N5260a75697d6664K2647
$$ -20466 40030 83324 208567 335087 -176673 -50584 18649 73909 -175697 -46664 -24017
13131b4017l8483I1665K33138I9566K40879a71161A14405a83826B19492p5664
$$ -24017 -62500 91665 324803 99566 340445 -171161 114405 -183826 219492 143828
13121A43828l4482g3897a476q5052l02785b8715j35042B1362K03837J39193a29994
$$ 143828 109346 -73897 -1476 -86528 -389313 -28715 -163757 21362 225199 364392 -129994
13109A43643n6577b5582k0713B86384j00382A5415e3217B04513b9623A51386a15568
$$ 143643 87066 -25582 -46295 286384 186002 15415 -53217 204513 -29623 151386 -115568
13097C01305j43820a5809p4088A99516a43324O5156A78353h5926C97514n824g6504
$$ 301305 157485 -15809 -89897 199516 -143324 -78168 178353 -85926 397514 391690 -76504
13085A33997A6058K82935A20708M24355A18351J48409A2228d1048B75376j15798
$$ 133997 16058 298993 120708 545063 118351 266760 12228 -41048 275376 159578
13075A59578a98371B37012b01693B17320a63481J5094B09610c46175i4084B0293
$$ 159578 -198371 237012 -201693 217320 -163481 -148387 209610 -346175 -94084 20293
13064F7657a5686A27200P9301n9815f9876B84134q4997B5178J9631K05919m624
$$ 67657 -15686 127200 206501 146686 -69876 284134 199137 25178 44809 250728 246104
13053B46104H2701K51181b09207A44610J28687a16774a3358o6271C16042b334
$$ 246104 82701 333882 -209207 144610 273297 -116774 -13358 -79629 316042 -2334
13042b10716H1019K28811B6513g1610A22174b6217A0945R0887J35617G3429e086
$$ -210716 81019 309830 26513 -71610 122174 -26217 10945 101832 237449 73429 -5086
13030c82095E21463B05840R0968A8018J01216J94954o9380b881G0761a74161l5436
$$ -382095 521463 205840 296808 18018 119234 314188 244808 -2881 70761 -174161 -209597
13019b09597B24212a01772B44457a5975n0987C45622j32208K43036i187D0577
$$ -209597 224212 -101772 244457 -15975 -66962 345622 213414 456450 -9187 40577
13008f0824A12781a05115A86679q8484Q3140A0455J7170a7117n0232r0312A11445
$$ -60824 112781 -105115 186679 98195 181335 10455 27625 -17117 -67349 -157661 111445
12996B77000A04588i1497A83199i6343A61265k4244e8355B47641A00115a30781
$$ 277000 104588 -91497 183199 -96343 161265 137021 -58355 247641 100115 -130781
12985c78389C54474c05497B1720a42436A42468a07336K0976B42800b58791a19860
$$ -378389 354474 -305497 21720 -142436 142468 -107336 -86360 242800 -258791 -119860
12974G3839a67227k0899i384B3410M81562B1151e9497A64169f5089A38132F6883
$$ 73839 -167227 -188126 -9384 23410 504972 21151 -59497 164169 -65089 138132 66883
12962A435K93443D1275J13883J9580k8605J8256h4286j50r604j01626C08441B2929
$$ 1435 294878 41275 155158 174738 146133 164389 -84286 -84436 -94040 -195666 308441 22929
12949C88462i8136B18238b15137f0234A38176j5868a2001H9373J43200I2491c7463
$$ 388462 -98136 218238 -215137 -60234 138176 122308 -12001 89373 232573 92491 -37463
12937A01821J7591c70807L0911i2550A4992D255J9606i7717k31315J30255a0559
$$ 101821 119412 -370807 -339896 -92550 14992 4255 23861 -97717 -329032 -198777 -10559
12925A38526h8037l3981d7727b1578j55019A96310G2300O9083J1684g0705L5091
$$ 138526 -88037 -122018 -47727 -21578 -176597 196310 72300 141383 153067 -70705 -35614
12914c5614n3874j11658A18788N5894J0550a10015A3924N3294a48619A83963n952
$$ -35614 -89488 -201146 118788 174682 185232 -110015 13924 67218 -148619 183963 178011
12903A78011i4905m7699C4685e9752E1515J63169b8381B8984M31763c6086j76767
$$ 178011 -94905 -142604 34685 -59752 51515 214684 -28381 28984 460747 -36086 -212853
12892b12853g7622o441l8082E0784E317P6000J14834H2377d1252j03310B18240
$$ -212853 -77622 -84063 -122145 50784 5317 81317 196151 82377 -41252 -144562 218240
12880e5407a1188A14862d5780K2241l06497f9515A6657e0113F4094A0792K4068
$$ -55407 -11188 114862 -45780 -23539 -330036 -69515 16657 -50113 64094 10792 34860
12869C4860I216a1217B48676G1836i1612B12550a91986N7961b7037l1420F1936
$$ 34860 9216 -11217 248676 71836 -91612 212550 -191986 -134025 -27037 -58457 61936
12857A04824O2407a75799P0d5102r4276N9002A97001e5621C27390A3865J4323
$$ 104824 167231 -175799 -175729 -45102 -139378 -80376 197001 -55621 327390 13865 28188
12846B8188O9846c1732E7267A7381d5710F7719N049J0850c5769A5224b8501E5529
$$ 28188 98034 -31732 57267 17381 -45710 67719 72768 83618 -35769 15224 -28501 55529
12833B32555C5195b87123F2066i9713B26131q6208h1107m0910a3076C56327j38769
$$ 232555 35195 -287123 62066 -99713 226131 139923 -81107 -122017 -13076 356327 217558
12822B17558b07382a4325F822J74070g8020B04644a0935q3771E1924c24868A53055
$$ 217558 -207382 -14325 6822 180892 -78020 204644 -10935 -94706 51924 -324868 153055
12810a74253F6041b52559A12085j4146d23670I896a16051d2714C54323m0937a96679
$$ -174253 66041 -252559 112085 97939 -423670 9896 -116051 -42714 354323 313386 -196679
12798C74850j75493b2182B47148h5318I3901J34118g5799B59945H9562a54632
$$ 374850 199357 -22182 247148 -85318 93901 228019 -75799 259945 89562 -154632
12787A89215b15299A39548a14821L5636m2627k1381B21758L9857b9494J941l6024
$$ 189215 -215299 139548 -114821 -79185 -121812 -143193 221758 261615 -29494 -27553 -63577
12776f3577p8105G2444P1352l1578k3275a37530A40747c09073g7609C6969c6277
$$ -63577 -141682 72444 143796 112218 88943 -137530 140747 -309073 -77609 36969 -36277
12764d55870H2866A5071i7865A47977a56910B63463a21910a3618n3878L3363r0768
$$ -455870 82866 15071 -97865 147977 -156910 263463 -121910 -13618 -67496 -34133 -124901
12753a24901d7987l4770q998A45305J93907b61951C8380L8261P182a47491c4871
$$ -124901 -47987 -82757 -91755 145305 339212 -261951 38380 76641 83823 -147491 -34871
12741c15822C1773b8647B7528K35964c9860H240a02283d359B95605C5834J90071
$$ -315822 31773 -28647 27528 263492 -39860 8240 -102283 -4359 295605 35834 225905
12730B25905q5404a36188J554D82237C6813b13285R5880B29537N0131A17035i1955
$$ 225905 140501 -136188 -134634 482237 36813 -213285 -117405 229537 279668 117035 -91955
12718B07648D0820J93312a2110C3345J07703K58267a68270C56088a41288A60656
$$ 207648 40820 234132 -12110 33345 141048 399315 -168270 356088 -141288 160656
12707B80010j26764cA12562A7098i5305B45430a80365f0855C95123a04194A48791
$$ 280010 153246 -3 112562 17098 -95305 245430 -180365 -60855 395123 -104194 148791
12695e4071A69473b82557C2773p721c983j46875A38177J06314A18074c6549k6480
$$ -54071 169473 -282557 32773 25052 -3983 -150858 138177 244491 118074 -36549 -63029
12684f3029m1059n5470c3912A99065J22846A20682f6920A20359J66360j20611
$$ -63029 -104088 -159558 -33912 199065 321911 120682 -66920 120359 286719 166108
12674A66108j8280J71555m1278E1899e1372j13023P0997A58548a34102j44793
$$ 166108 147828 319383 278105 51899 -51372 -164395 -93398 158548 -134102 -278895
12664b78895I536L08040A36450N3335M2853K11374d4244D819L15736D9710c32075
$$ -278895 9536 317576 136450 189785 232638 444012 -44244 4819 320555 49710 -332075
12652h7025K9030C72192j57045F2781K0638L9600J5324J4775a09197h565A8037
$$ -87025 -57995 372192 215147 62781 83419 123019 138343 153118 -109197 -8565 18037
12640A02768Q9088a73094A29997M060O9783J5235r3082l5765Q0729o178e129A35882
$$ 102768 191856 -173094 129997 134057 203840 219075 125993 90228 170957 164779 -5129 135882
12627c402B93431r7537a06287A51101p4824L7278L31921C0174f7125B59811j02159
$$ -3402 293431 195894 -106287 151101 76277 113555 445476 30174 -67125 259811 157652
12616A57652a10941l1953B20754f0482F642a43202j20175A91817E3863B988a26853
$$ 157652 -110941 -142894 220754 -60482 6642 -143202 -263377 191817 53863 2988 -126853
12604B26945a68746g1630A96640a28702A29700O0586c5488B47356Q5606a53624
$$ 226945 -168746 -71630 196640 -128702 129700 190286 -35488 247356 332962 -153624
12593G5605J29478b12174f5119A04254a11749H8194b08863E3761f1375F0199c8190
$$ 75605 205083 -212174 -65119 104254 -111749 88194 -208863 53761 -61375 60199 -38190
12581h2310E2245J64016K23360G6187k8707J35154d9715F0120b00504A64633d2857
$$ -82310 52245 216261 439621 76187 47480 182634 -49715 60120 -200504 164633 -42857
12569g3963j38126H6992C3749K29668b28194C8206K13851E7295J6303k6845b76757
$$ -73963 -212089 86992 33749 263417 -228194 38206 252057 57295 73598 46753 -276757
12557d8632b0169A45774c24412C2873L5627b02926A23306J62056g8948J2873b3923
$$ -48632 -20169 145774 -324412 32873 68500 -202926 123306 285362 -78948 -66075 -23923
12545A8806c7159j44021b9200o6550K7936A41521d1420r605q6558L1088J1675
$$ 18806 -37159 -181180 -29200 -95750 -67814 141521 -41420 -51025 -137583 -106495 -94820
12534i4820B43327A4172J24096h7929k535D6088c09208J31500I2316d6000d712
$$ -94820 243327 14172 138268 -87929 -90464 46088 -309208 -177708 92316 -46000 -4712
12522d5902A66905b91227A36502B1651g4299b0623k92382J1279A41416p234a91363
$$ -45902 166905 -291227 136502 21651 -74299 -20623 -313005 -301726 141416 134182 -191363
12510F4033b85913a3317E9409J1461K2058g3261B8252d2625r8341a9131Q303j94305
$$ 64033 -285913 -13317 59409 70870 92928 -73261 28252 -42625 -140966 -19131 -10828 -205133
12498b05133J1717D32407A50392N139B6534Q1928M45516a43095A05520L9553j0568
$$ -205133 -193416 432407 150392 155531 26534 108462 553978 -143095 105520 145073 134505
12487A34505a17493A8486b05078d282B4625m607d3917j5673o8873n4877I7975
$$ 134505 -117493 18486 -205078 -4282 24625 20018 -43917 -59590 -128463 -183340 97975
12475a69782G230b42352B11036b7262l43433P119A70746p2881Q6635A8218e2093
$$ -169782 7230 -242352 211036 -27262 -370695 -363576 170746 97865 184500 18218 -52093
12463A71444a78799N2802l5662I8238h0578A01087J26381m1747D4269b9681A85031
$$ 171444 -178799 -125997 -161659 98238 -80578 101087 227468 185721 44269 -29681 185031
12451E3643A2438d70640A24962o254n5832j7875K36223e1833a579A74739f2272
$$ 53643 12438 -470640 124962 118708 62876 45001 281224 -51833 -1579 174739 -62272
12439a18937A43765e8648r3568A74682a3369B51209b60470G9995J73920I2867
$$ -118937 143765 -58648 -152216 174682 -13369 251209 -260470 79995 253915 92867
12428a85691h8051A66386E2761L37662a07932k0624B7363d581C06697b85386R0240
$$ -185691 -88051 166386 52761 390423 -107932 -128556 27363 -4581 306697 -285386 -195146
12417a95146a3366j3591C08129b67340C50i8257j86048g1215D9758b73435d9220
$$ -195146 -13366 -26957 308129 -267340 350 -98257 -284305 -71215 49758 -273435 -49220
12405h6530J7193A70903l2983n2118h65B0119J04184a54223K6337B27472f9553
$$ -86530 -69337 170903 137920 85802 -865 20119 124303 -154223 -127886 227472 -69553
12393A83340d1390k157A23350e3394C5514g9934F0717K75372E0953J13065d7207
$$ 183340 -41390 -43547 123350 -53394 35514 -79934 60717 336089 50953 164018 -47207
12381a6853B9930J20790E8906b85890A47165c6229j25742P2139I1766a57984c6287
$$ -16853 29930 150720 58906 -285890 147165 -36229 -161971 -89832 91766 -157984 -36287
12369A48941J40046G0346a63425D1040K43480A365J07852k0032b22167L9536O6096
$$ 148941 288987 70346 -163425 41040 284520 1365 109217 89185 -222167 -182631 -116535
12358a16535G3983a5981j54911A0454J8064O5756B6413a1829k83990a23376E658
$$ -116535 73983 -15981 -170892 10454 28518 94274 26413 -11829 -295819 -123376 5658
12346f9202k2519a8575k08782L2817d6779k02062A59290b096D07500A75750a52511
$$ -69202 -91721 -18575 -227357 -194540 -46779 -248841 159290 -2096 407500 175750 -152511
12334a94206c5683B6036K80565M5269j47187G9295j9117E936L64169j07097o2165
$$ -194206 -35683 26036 306601 351870 204683 79295 60178 5936 370105 263008 200843
12323B00843J99659j90156h9468C7613J04725j133C1980K74926J873b4307j56040
$$ 200843 400502 210346 -89468 37613 142338 141205 31980 306906 308779 -24307 -180347
12312a80347C44662C5435b4342j65268C16255j55626b00743C0093M65013B04670
$$ -180347 344662 35435 -24342 -189610 316255 160629 -200743 30093 495106 204670
12301A92030e3273j25145A53346K38322I6129B4732K38291J20860d5107B5449
$$ 192030 -53273 -178418 153346 391668 96129 24732 263023 383883 -45107 25449
12290a73320E3475a08539A10454M5632J24508j17725J17773G9611n0J28707A8119
$$ -173320 53475 -108539 110454 156086 280594 162869 280642 79611 79561 208268 18119
12278A87265q9406f1220i303C50112A4413K52242M1764j49035K56120h8315A69097
$$ 187265 97859 -61220 -9303 350112 14413 266655 308419 159384 415504 -88315 169097
12266d7036A57207K46860A60643J41016C0233J20784k4730K09983H5608J09939
$$ -47036 157207 404067 160643 301659 30233 151017 126287 336270 85608 195547
12256A95547D9007J09446K4430a94630A38238J60235B963P1385J26489J9889M20730
$$ 195547 49007 158453 182883 -194630 138238 298473 2963 74348 200837 220726 641456
12245F41456E690K89189a05021A12973J66081G5498a22413C55408H1676a80022
$$ 641456 5690 294879 -105021 112973 279054 75498 -122413 355408 81676 -180022
12234C09108b60849g7833I5898P6378D9648K73746j01674I091h5172A88009a21014
$$ 309108 -260849 -77833 95898 172276 49648 323394 221720 9091 -85172 188009 -121014
12222A51325b49606A17927Q8755Q0204L59042k62677A4051O4186K95302a39172
$$ 151325 -249606 117927 206682 286886 645928 383251 14051 78237 373539 -139172
12211C8665J1052e4594C8308f8925H4872L62642j48352a77252A05484e5651o5315
$$ 38665 49717 -54594 38308 -68925 84872 447514 299162 -177252 105484 -55651 -120966
12200a20966A31451K08411j03487c56181E94236a20691C51597A64271a44120B22227
$$ -120966 131451 339862 236375 -356181 594236 -120691 351597 164271 -144120 222227
12189D3195M74624A21202N4316J24256c3120B10281J91015j24503f1283E232L02231
$$ 43195 517819 121202 175518 299774 -33120 210281 401296 276793 -61283 5232 307463
12178C07463E6474L40359b67761A93970G1130k5952J54856K40553b68946I6065
$$ 307463 56474 396833 -267761 193970 71130 45178 200034 440587 -268946 96065
12167a8163A92449J18809J03859M080d0594B76514J12544q8273F6640j2863L38512
$$ -18163 192449 311258 415117 419197 -40594 276514 389058 300785 66640 53777 392289
12156C92289j83343I1060e4662A65674a70950e628D45470A87065c42737B54137
$$ 392289 208946 91060 -54662 165674 -170950 -5628 445470 187065 -342737 254137
12145b01586B05961a1303j18961F9080Q0921a06004o7697C20162a75969A78173
$$ -201586 205961 -11303 -130264 69080 150001 -106004 -173701 320162 -175969 178173
12134A32331f8013C5759f3008I6829J19889L7578q1106Q0959A04623k0992a59737
$$ 132331 -68013 35759 -63008 96829 216718 254296 173190 254149 104623 83631 -159737
12122D5538L51118J07903A78818h3901E8406K96188A07045a72474A44018k335
$$ 45538 396656 504559 178818 -83901 58406 354594 107045 -172474 144018 141683
12112A41683a55121g0947D28166A73709m8271J25808E0991J88939q1884M3983
$$ 141683 -155121 -70947 428166 173709 125438 251246 50991 239930 158046 202029
12102B02029A00255q303a19381B45013k7392O1024A23218b6598n2833D84a469
$$ 202029 100255 91952 -119381 245013 217621 278645 123218 -26598 -79431 484 -1469
12090A46767e4098q6926B47373K9680j14390p7933D2112a10969C9331e7198A67734
$$ 146767 -54098 -141024 247373 277053 162663 84730 42112 -110969 39331 -57198 167734
12078D32974j06563J27880a05898A91702I2411P8968R7869B80L75946C5450e3165
$$ 432974 326411 454291 -105898 191702 92411 171379 269248 280 376226 35450 -53165
12066C97590F4372K85872B3355K28805k922a29040A34823J9440J1136n1108C3200
$$ 397590 64372 350244 23355 252160 249238 -129040 134823 154263 165399 114291 33200
12054B179J88854E938b31330C7807a09320D5187a07411A73870b1097B663L4322
$$ 2179 191033 5938 -231330 37807 -109320 45187 -107411 173870 -21097 2663 36985
12043C6985b67719B36073a06988A2362i964H9185c1863j43574a3475A94789p9194
$$ 36985 -267719 236073 -106988 12362 -9964 89185 -31863 -175437 -13475 194789 115595
12032A15595K51429A18918J49430B584c10698A02432a27777M3496A26259K42983
$$ 115595 367024 118918 268348 2584 -310698 102432 -127777 -84281 126259 369242
12022C69242j60592R1082a2483B96255f0086j82849B3239Q2019m9283c0292B54858
$$ 369242 208650 299732 -12483 296255 -60086 -242935 23239 105258 55975 -30292 254858
12010A46021a354j70426A32719a34061o7310A06J73007M242a78909A83778i703
$$ 146021 -1354 -171780 132719 -134061 -201371 106 173113 177355 -178909 183778 -9703
11998E8841K36289a12158B22258m0778p8107K02494B2483P3361a77301C37148
$$ 58841 295130 -112158 222258 181480 103373 305867 22483 95844 -177301 337148
11987i5635k57371Q6634R7327L6363E5453J30242q4549e7830q9891A61390B7886
$$ -95635 -353006 -266372 -169045 -132682 55453 185695 101146 -57830 -147721 161390 27886
11975g6004a8531B04355N8139j18827J7102C9668A3122c73575B1209h5510j13023
$$ -76004 -18531 204355 262494 143667 160769 39668 13122 -373575 21209 -85510 -198533
11964a98533k3525h8640A59770c9255B11661f873j47493D4729j3504L8589b52059
$$ -198533 -222058 -88640 159770 -39255 211661 -6873 -154366 44729 31225 69814 -252059
11952e9911k0977r3234D12223j75877e0803A4248K62763D8004a64274o0072h0023
$$ -59911 -80888 -174122 412223 236346 -50803 14248 277011 48004 -164274 -224346 -80023
11940a98593B58424B7773O206a31936A5561a12025q9045A57875b54355D2036N3980
$$ -198593 258424 27773 33979 -131936 15561 -112025 -201070 157875 -254355 42036 96016
11929I6016l3041b56692F8066B7411h6072C2870j420L5273M436b93403a3531j42000
$$ 96016 62975 -256692 68066 27411 -86072 32870 31450 66723 71159 -293403 -13531 -155531
11917a55531I9925R1438i5043C5717b85597A15179C8201a73119o6567F5101a02902
$$ -155531 99925 191363 -95043 35717 -285597 115179 38201 -173119 -239686 65101 -102902
11905A32676p461m4866B6931a50284O6442A05333a84704C76037a38507B7338b59667
$$ 132676 125215 80349 26931 -150284 -83842 105333 -184704 376037 -138507 27338 -259667
11893a03367j62819q5867J02111B27882a09265n8078g3569K2847k51507r5777
$$ -103367 -266186 -352053 -249942 227882 -109265 -167343 -73569 -50722 -302229 -398006
11883c98006B3576b86565A02251D6855a49960A59937I526L8597a09459A59925
$$ -398006 23576 -286565 102251 46855 -149960 159937 9526 48123 -109459 159925
11872b91392a3713e186k4679j23369B12531g8439E0456c22933A23578l3984d2514
$$ -291392 -13713 -5186 -29865 -153234 212531 -78439 50456 -322933 123578 89594 -42514
11860b53906L1549q4074J09853Q2920J8794j17268d1943j26130j83565a69667
$$ -253906 -222357 -306431 -196578 -113658 -94864 -212132 -41943 -168073 -351638 -169667
11849a43797H2905P9877g4716A9277M34593j56778h1098j00454G124f2702j10709
$$ -143797 82905 162782 -74716 19277 453870 297092 -81098 -181552 7124 -62702 -173411
11838a73411Q4165A83363b9149G3898k7688c53523G6035J39440a10699j25056
$$ -173411 -89246 183363 -29149 73898 46210 -353523 76035 215475 -110699 -235755
11828b35755B75120j17672f6302k37280C6848b83433a20047j92943L2377b8181
$$ -235755 275120 157448 -66302 -303582 36848 -283433 -120047 -312990 -280613 -28181
11817f0450C7140a42945M6233G605J94694e0043a9493j1507o6230B0514n110a98207
$$ -60450 37140 -142945 -96712 7605 202299 -50043 -19493 -31000 -97230 20514 15404 -198207
11804B11412b98379A64225b28071B89284j40636a36442A85747n0042C5589A6420
$$ 211412 -298379 164225 -228071 289284 148648 -136442 185747 135705 35589 16420
11793b554k68121G9336a63456Q1151L1298A73841f178j66212g8809A25875a73364
$$ -2554 -270675 79336 -163456 -82305 -51007 173841 -6178 -172390 -78809 125875 -173364
11781d25311a67200f7251G0983c78348C7830h5091I8555a38506B30260j07356
$$ -425311 -167200 -67251 70983 -378348 37830 -85091 98555 -138506 230260 122904
11771A22904a5822j86548e2458A30766f9086K3516j96232a15888A40666D6465
$$ 122904 -15822 -202370 -52458 130766 -69086 -45570 -241802 -115888 140666 46465
11760I9837a34399N4219C1446a01568M5463C25500a83199j3886J307Q7247J2807
$$ 99837 -134399 -80180 31446 -101568 -56105 325500 -183199 -197085 -195778 -108531 -95724
11749i5724A43476b47622E06032A69603m1016J97796A17785e6995B18134K5267
$$ -95724 143476 -247622 506032 169603 128587 326383 117785 -56995 218134 243401
11739B43401q6683M7762J14178a3473B32103l7612P0282b43910A93590a01666
$$ 243401 156718 204480 318658 -13473 232103 194491 264773 -243910 193590 -101666
11728c9602J010j74705k07381a59752g8731B18381a34392A23035J89357a2670
$$ -39602 -38592 -213297 -420678 -159752 -78731 218381 -134392 123035 312392 -12670
11717c8913D8924J3332J76508m6624l996d5750H8333d0761A80184H0959J4992
$$ -38913 48924 62256 238764 192140 188144 -45750 88333 -40761 180184 80959 95951
11706I5951B3291K16668a27047A73250h5495H1539B0367L9925L153A8494c7214
$$ 95951 23291 239959 -127047 173250 -85495 81539 20367 60292 63445 18494 -37214
11694D9557K11559k0792i9175C26895a0750l7903k99822Q6087A15449f3424C27485
$$ 49557 261116 240324 -99175 326895 -10750 -48653 -348475 -262388 115449 -63424 327485
11682f6726k7142A08161J21033R8D186J15898J19332j19237n3248j9373J9348
$$ -66726 -93868 108161 229194 229292 4186 120084 239416 120179 66931 47558 66906
11671F6906K37128a43461e9362j84477A75703i717B03713a25705A54605f0159
$$ 66906 304034 -143461 -59362 -243839 175703 -9717 203713 -125705 154605 -60159
11660a75495A57699a51936D09711a17345A21916A4182K9401d4363r9908N0972
$$ -175495 157699 -151936 409711 -117345 121916 14182 43583 -44363 -144271 -93299
11650i3299e639m6039B30444L3096E4648A2728L83646A8542f0812k43721A784
$$ -93299 -5639 -51678 230444 263540 54648 12728 396374 18542 -60812 -304533 1784
11638B7140c54085a6224A34051J10952b1472A98069p033d69569i846F9200a10430
$$ 27140 -354085 -16224 134051 245003 -21472 198069 191036 -469569 -9846 69200 -110430
11626F9662J04870a44074N4487C27508b59883B8792E26a3033A94194a0929A09994
$$ 69662 174532 -144074 -89587 327508 -259883 28792 526 -13033 194194 -10929 109994
11614a95417F383J38542M9291a90865M3442B9792a01108B53707b45145G2511c43369
$$ -195417 6383 144925 194216 -190865 -147423 29792 -101108 253707 -245145 72511 -343369
11602C95481F9500j2670b15030R7903B8127a46145A48934J96159C2610K94186
$$ 395481 69500 56830 -215030 -117127 28127 -146145 148934 345093 32610 326796
11592C26796A48885b7253E8207a52319j83656B3702P0336a92420c7775j95293
$$ 326796 148885 -27253 58207 -152319 -335975 23702 94038 -192420 -37775 -233068
11582b33068c0184A49137J00525c44088A32981D7828j5948J53507a47930B63901
$$ -233068 -30184 149137 249662 -344088 132981 47828 31880 185387 -147930 263901
11571A55900b46771b0223m6228A81990h4144A05505M20556N2903a22403B02564
$$ 155900 -246771 -20223 -66451 181990 -84144 105505 526061 578964 -122403 202564
11560A06016M4583b29535f4275A14927f1320I2373K50997A17635b92196o5562
$$ 106016 150599 -229535 -64275 114927 -61320 92373 343370 117635 -292196 -357758
11550c57758g6877G4090a18290A65467M2586n2261M5905M3688H0310C4441b16334
$$ -357758 -76877 74090 -118290 165467 208053 155792 201697 245385 80310 34441 -216334
11538c96995a7953A10481b65719A42659J04547O0287b70999L494B35285c69437
$$ -396995 -17953 110481 -265719 142659 247206 307493 -270999 -267505 235285 -369437
11527B93699B8471g5180j8965n721r6999c6920G5040b04909A88699b30580I125
$$ 293699 28471 -75180 -94145 -99866 -196865 -36920 75040 -204909 188699 -230580 9125
11515D22385a45966C59162A31349a31979A10129a38743G5153O364b65926F7479
$$ 422385 -145966 359162 131349 -131979 110129 -138743 75153 81517 -265926 67479
11504A80937F499L52387A19677b21071J8922A35591j1151M20542B72463J4501
$$ 180937 6499 358886 119677 -221071 -202149 135591 124440 544982 272463 286964
11494B86964j09277P3634a43807B09306K5735O3694D0062g4952A52089J20311
$$ 286964 177687 251321 -143807 209306 235041 298735 40062 -74952 152089 272400
11484B72400D4514a04373C2273K38607B207K40911d7665A74819J88555J310A19263
$$ 272400 44514 -104373 32273 270880 2207 243118 -47665 174819 363374 364684 119263
11472A43336a45193C05527A11641M7145n6887C9207A7916K91598j27127J09229
$$ 143336 -145193 305527 111641 158786 101899 39207 17916 309514 182387 291616
11462B91616c6330A978L13894h3078A66250k1882B4835R8943a65890D7710N9113
$$ 291616 -36330 1978 315872 -83078 166250 144368 24835 123778 -165890 47710 106823
11451A06823K9569M3903C5083K6922d8241A16949N9643A7170Q9273Q2519B9851
$$ 106823 136392 180295 35083 62005 -48241 116949 176592 17170 106443 188962 29851
11439H0905C6416P9248A871b757B4726R8471a62757j63573F765M1584e3785n779
$$ 80905 36416 115664 1871 -2757 24726 123197 -162757 -326330 6765 48349 -53785 -59564
11427e9564A94233e1288r083k30142B11955N6094a30235I1557j4295k5324K8648
$$ -59564 194233 -51288 -60371 -290513 211955 268049 -130235 91557 77262 51938 80586
11416H0586a35109b9992I0041N6682c5700A76569N0739a86459B85126C509J9270
$$ 80586 -135109 -29992 90041 146723 -35700 176569 227308 -186459 285126 3509 22779
11405B2779J35617b2862k91023B40374A4382d5313A51016f8236B98033B7528h8119
$$ 22779 158396 -22862 -313885 240374 14382 -45313 151016 -68236 298033 27528 -88119
11393A17159a84272f1013A2332K66711I4694c16282F2187P5798h1344n660k86930
$$ 117159 -184272 -61013 12332 279043 94694 -316282 62187 137985 -81344 -87004 -373934
11382c73934a23241C8673a10733B65910f5248A39051a85984B37515j08017J0783
$$ -373934 -123241 38673 -110733 265910 -65248 139051 -185984 237515 129498 140281
11372A40281a08707c9500B30587a61502j5865b479A85820a09505B14044d1350
$$ 140281 -108707 -39500 230587 -161502 -177367 -2479 185820 -109505 214044 -41350
11361I5255R9147R6430a42822B90801l3304a01558G7461P6504b25771A3303L0694
$$ 95255 194402 290832 -142822 290801 257497 -101558 77461 153965 -225771 13303 43997
11350D3997L550R2698o2127b12290K2385j06609E3152c56641H5827J5785A295
$$ 43997 47547 140245 78118 -212290 -189905 -296514 53152 -356641 85827 101612 1295
11338a48045Q057e7229j13879N4766N2883A38919d2626n1806j21195C22480k8310
$$ -148045 -139988 -57229 -171108 -116342 -63459 138919 -42626 -94432 -215627 322480 294170
11327B94170h4019I1509i1231j73680J09496C45523b94048f3489b4081B5280c15430
$$ 294170 -84019 91509 -91231 -264911 -155415 345523 -294048 -63489 -24081 25280 -315430
11315A82001g3435B07535a01403b1862A34291f3399A51643c58030C13439H3556
$$ 182001 -73435 207535 -101403 -21862 134291 -63399 151643 -358030 313439 83556
11304b60435J19946J8639G1821i9929B6231P6880d03093a90089p8502A69300a08581
$$ -260435 -140489 -121850 71821 -99929 26231 103111 -403093 -190089 -268591 169300 -108581
11292b86027h4441q9870c387A74885b81284D3250K7891a46921A7913c65153H505
$$ -286027 -84441 -174311 -3387 174885 -281284 43250 71141 -146921 17913 -365153 8505
11280c62035D06778A06541h5345C4675a10923k24391P2433J27282L3934m5523
$$ -362035 406778 106541 -85345 34675 -110923 -335314 -262881 -135599 -101665 -147188
11270a47188K9339d7752A88956b68468K8336R2687L1929F8280A4753c62886B49002
$$ -147188 -117849 -47752 188956 -268468 -240132 -147445 -115516 68280 14753 -362886 249002
11258c83721B44178F0886b50547F6468J9273B8439J4586b41733A58221a85690
$$ -383721 244178 60886 -250547 66468 85741 28439 43025 -241733 158221 -185690
11247H6878Q5047f4222A99429A8361d1754m7496G3982J13538a94157e9358A74321
$$ 86878 171925 -64222 199429 18361 -41754 -89250 73982 187520 -194157 -59358 174321
11235D3736P5628h7019O52l409H8690b70255f3323D4262a71921k96802H9552h0010
$$ 43736 119364 -87019 -86367 -89776 88690 -270255 -63323 44262 -171921 -468723 89552 -80010
11222B0868f9522A95551J84837G6022N6058a59466j30350J20374A50617J7189
$$ 20868 -69522 195551 380388 76022 132080 -159466 -289816 -169442 150617 167806
11212A67806b9071l72879B2432a07298j0127M1036r5490j04067d4773p0483B2879
$$ 167806 -29071 -401950 22432 -107298 -117425 -76389 -171879 -275946 -44773 -115256 22879
11200b6593B19428e3497j46025j84625A31832b96411C4093q867K25381a14742
$$ -26593 219428 -53497 -199522 -384147 131832 -296411 34093 25226 250607 -114742
11189a64862C15710a94474g0618B35552c80370a10775A9819O6854R743a92888
$$ -164862 315710 -194474 -70618 235552 -380370 -110775 19819 86673 96416 -192888
11178a94689E0122h1631j08222K9956E6600c18117d6647A1122h0378L1029F8057
$$ -194689 50122 -81631 -189853 -159897 56600 -318117 -46647 11122 -80378 -49349 68057
11166a14851j57098L2820B09793a9813A0345b65363K3925A75293B5003b66339
$$ -114851 -271949 -239129 209793 -19813 10345 -265363 -241438 175293 25003 -266339
11155A93074g5845B3471K88320a4526k23056A82367D5355A7218h272j7106j30284
$$ 193074 -75845 23471 311791 -14526 -237582 182367 45355 17218 -8272 -25378 -155662
11144a55662f4665m2884j03151n6096R5939E4397J08938b1414k77436d2413B70191
$$ -155662 -64665 -107549 -210700 -266796 -170857 54397 163335 -21414 -298850 -42413 270191
11132A6522R9268a08274j14599A93016l5549b34971A93510p763j8094b2968I7698
$$ 16522 115790 -108274 -222873 193016 157467 -234971 193510 185747 167653 -22968 97698
11120a26825A77835J30617N7928a49758F3011C1360b68933H0016J9339K999J31011
$$ -126825 177835 308452 366380 -149758 63011 31360 -268933 80016 99355 102354 233365
11109B33365j7890c75546C1343a38282O3390o667B69612B8175L48460A07757b1051
$$ 233365 215475 -375546 31343 -138282 -74892 -81559 269612 28175 376635 107757 -21051
11097C44070G7362L07206c9788P656D17408G5261K17030J32846B07804c5967j05617
$$ 344070 77362 384568 -39788 -32132 417408 75261 292291 425137 207804 -35967 -141584
11086a41584B01522K16540j37679Q5138I426a7387B44176D0521J87606o2626J4525
$$ -141584 201522 418062 280383 365521 9426 -17387 244176 40521 228127 165501 180026
11075A80026b62820A15216K2335M8234B6456a20767D29867j61922j22087D7020
$$ 180026 -262820 115216 137551 185785 26456 -120767 429867 267945 145858 47020
11064B89464H4059R7353J81785J81942J7699B59170Q2268K16099J40872j13724
$$ 289464 84059 181412 363197 545139 562838 259170 341438 557537 698409 584685
11054E84685A52469J28361L8679L61972q5805j19116j86126K13098M22532l99346
$$ 584685 152469 280830 319509 681481 595676 476560 290434 503532 926064 526718
11044E26718O4732L4643Q9891r4712J25521k96704J36670M1287k61940M31539
$$ 526718 591450 626093 715984 621272 746793 450089 586759 628046 366106 797645
11034G97645j23056r5873K08141j98967k49790K42572j50559L20868j87719k53594
$$ 797645 674589 578716 786857 587890 338100 580672 430113 750981 563262 309668
11024C09668P97475n25911K11048j35805J19805M0127l25672K53864k67035Q3634
$$ 309668 1107143 581232 792280 656475 776280 816407 490735 744599 477564 561198
11014E61198k37555K10528j71718p4507O13271l25654J37747j96556p6960K4473
$$ 561198 323643 534171 362453 287946 901217 575563 713310 516754 439794 464267
11004D64267L70195k50908B63779J76756K48526k32374J21090J6644A48586N31762
$$ 464267 834462 583554 263779 440535 689061 456687 577777 594421 148586 680348
10994F80348C24041K63108J73858j70648o5109J65370k39990n021K49433q843
$$ 680348 324041 587149 761007 590359 525250 690620 450630 445609 695042 686199
10984F86199k18954M77016q8187k61212j54824M72690R2320q9887l0026L68895
$$ 686199 467245 944261 856074 594862 440038 912728 1005048 915161 885135 1254030
10974A254030L0606o1007L63428N00344n1059J8189O05257M4878j05010k89153
$$ 1254030 1284636 1223629 1587057 2087401 2036342 2054531 2659788 2704666 2599656 2310503
10964B310503L7904m02331k25250j24709J15903l9736j8003R8028K8728j37054
$$ 2310503 2348407 1946076 1720826 1596117 1712020 1672284 1654281 1752309 1781037 1643983
10954A643983j29741j89744O9876J86747j01884j50716K33028n02072j83676l52978
$$ 1643983 1514242 1324498 1394374 1581121 1479237 1328521 1561549 1059477 875801 522823
10944E22823N78777l73821A28682N0985J64227a15466A55401p0595a30132C12627
$$ 522823 1101600 727779 128682 179667 343894 -115466 155401 84806 -130132 312627
10933C19665e3341G8056K44224p6510m1148c7910A28025b06087D4675b0023D070
$$ 319665 -53341 78056 322280 245770 204622 -37910 128025 -206087 44675 -20023 4070
10921A68647A3696N0293K09411A12808a22799G9167K52696e5134j01713D4462
$$ 168647 13696 63989 273400 112808 -122799 79167 331863 -55134 -156847 44462
10910b31964J6194H9771c0904m7561k33137k18318b2268B38815c695A07088a31066
$$ -231964 -215770 89771 -30904 -78465 -311602 -529920 -22268 238815 -3695 107088 -131066
10898A18735k5667B8009J47916e35184h5421q8174B76487a78749r99q4974B71843
$$ 118735 93068 28009 175925 -535184 -85421 -173595 276487 -178749 -179748 -264722 271843
10886A61808a24703q3482O3279m3372g8438k05512a19760RA90947a75201Q3079
$$ 161808 -124703 -208185 -144906 -188278 -78438 -283950 -119760 -119751 190947 -175201 -92122
10875i2122c0256A36337g1341F05h4889g494C17873b16677j17006A58540b6840
$$ -92122 -30256 136337 -71341 605 -84889 -7494 317873 -216677 -333683 158540 -26840
10863a82599P0534e4172a8829I2025g4672A79657P5178c28314a08j15768o1862
$$ -182599 -112065 -54172 -18829 92025 -74672 179657 254835 -328314 -108 -115876 -177738
10852a77738A85828B9000a65785A06158a22578b6712o210E0597N1072R7057H4878
$$ -177738 185828 29000 -165785 106158 -122578 -26712 -32922 50597 101669 198726 84878
10840c9444G7270l2546A1079a39961j61857H149e4186k0861B75689A18407d9747
$$ -39444 77270 44724 11079 -139961 -301818 8149 -54186 -75047 275689 118407 -49747
10828e6183E4140G843h705m7608A05207a07891e1666l1634r6149j7678G9465L5574
$$ -56183 54140 7843 -8705 -56313 105207 -107891 -51666 -83300 -179449 -197127 79465 115039
10816A15039j9568b98166H7085a59200K0478A68868a7976k3033k99184B9088c47091
$$ 115039 95471 -298166 87085 -159200 -138722 168868 -17976 -41009 -340193 29088 -347091
10804d14182B211O0232l0736G202b79541A89074G9647j7023Q9966a8761A68399
$$ -414182 2211 62443 31707 7202 -279541 189074 79647 62624 152590 -18761 168399
10792d7098A23250l3298K6887e7346j04124O9441Q202bC7327e32116B06149a13739
$$ -47098 123250 89952 116839 -57346 -161470 -92029 -83827 -2 37327 -532116 206149 -113739
10779A02436b93208A11692l9601K28661a33587H5160L2516L3943B5122i7548C1841
$$ 102436 -293208 111692 72091 300752 -133587 85160 117676 151619 25122 -97548 31841
10767a07301C5965K50155a26377K9357k17073b8999D1883b02529d8162r4950N0424
$$ -107301 35965 286120 -126377 -97020 -314093 -28999 41883 -202529 -48162 -143112 -92688
10756i2688B5232J08202c5109l3506K0003A66553k7285o7018e83929a30672A42656
$$ -92688 25232 133434 -35109 -68615 -48612 166553 139268 72250 -583929 -130672 142656
10744B88928g8309A95108l7387b28176A12497b66064I2388a26596k18299J28036
$$ 288928 -78309 195108 157721 -228176 112497 -266064 92388 -126596 -344895 -216859
10734b16859C09782c01100P1094M3194C55143f5166K6267J3268l1856A7714c6725
$$ -216859 309782 -301100 -230006 -186812 355143 -65166 -38899 -25631 -57487 17714 -36725
10722b14748I6739a1379k81216i0746A13381J11495A1049e0746j4726a802l21388
$$ -214748 96739 -11379 -292595 -90746 113381 224876 11049 -50746 -65472 -1802 -323190
10711c23190J53315j34247J34732r5336b8316k30807L5255K8602f6307A346J888
$$ -323190 -169875 -304122 -169390 -264726 -28316 -259123 -223868 -195266 -66307 1346 3234
10700C234J36783G894J09037M373E2805b69996m2887r8306a02146B32178b51442
$$ 3234 140017 7894 116931 121304 52805 -269996 -312883 -411189 -102146 232178 -251442
10688B1601a39855F1805N3004a72393D2608c2039j65192C4254i4765H9755a86464
$$ 21601 -139855 61805 114809 -172393 42608 -32039 -197231 34254 -94765 89755 -186464
10676a3636D925a2216k52232i8944I5626b56214Q6916j25562J39347E5784c23861
$$ -13636 4925 -12216 -264448 -98944 95626 -256214 -169298 -294860 -155513 55784 -323861
10664g2158j39096h9561j71832a13711l44489a08860c8915l6098j20309A16007
$$ -72158 -211254 -89561 -261393 -113711 -458200 -108860 -38915 -75013 -195322 116007
10653H4918j7567a42786A02325M7843a54411D3262J3579K902a03496l2821j21130
$$ 84918 67351 -142786 102325 150168 -154411 43262 56841 59743 -103496 -136317 -257447
10642b57447h1669A01780m8087a78630e0559k77554B8783K86717g6316A1277c50614
$$ -257447 -81669 101780 53693 -178630 -50559 -328113 28783 315500 -76316 11277 -350614
10630b1378j41560O7683A68536c00233a36151B70385D1440j1874c09868o3662
$$ -21378 -162938 -95255 168536 -300233 -136151 270385 41440 29566 -309868 -373530
10620c73530A78448c29619A54710k2216h6490j84917n3091A63318a90238A9944
$$ -373530 178448 -329619 154710 132494 -86490 -271407 -324498 163318 -190238 19944
10609A53887P4666b10867e2324k0757j49974B3390a06289k14046A02464c40928
$$ 153887 228553 -210867 -52324 -73081 -223055 23390 -106289 -320335 102464 -340928
10598F9502b5811A21638a91441K8673j9351B24020B2300b55729B29608r5076a15109
$$ 69502 -25811 121638 -191441 -162768 -182119 224020 22300 -255729 229608 134532 -115109
10586g9172A06254h620C08036i6902C41836C9069b12724j11335A70081N738q1680
$$ -79172 106254 -8620 308036 -96902 341836 39069 -212724 -324059 170081 175819 94139
10575I4139a9251j90633g7086r5598h0970H461J33889b05931C6780R7270e0244
$$ 94139 -19251 -209884 -77086 -172684 -80970 8461 142350 -205931 36780 134050 -50244
10563G9405a41654A03434N0951o9976b85250J36276A54523F9410K27881r0450
$$ 79405 -141654 103434 154385 84409 -285250 -148974 154523 69410 297291 206841
10553B06841i1253J9472j04052g7330j58885j59707c6989k28411C49940a21344
$$ 206841 -91253 -71781 -175833 -77330 -236215 -395922 -36989 -265400 349940 -121344
10542a42643H5652b34602I1419m4510n991K21735A25653d24220J21112A72072
$$ -142643 85652 -234602 91419 46909 40918 262653 125653 -424220 -303108 172072
10531b51873a18937j34591C03232B7365a84213q5481F5073c32400H1775b39750
$$ -251873 -118937 -253528 303232 27365 -184213 -269694 65073 -332400 81775 -239750
10520b20381P9566L684D8563a0556m3706k16333N5301A4003a39070J676k3500
$$ -220381 -140815 -137131 48563 -10556 -54262 -270595 -215294 14003 -139070 -137394 -160894
10509a60894b7338A5574b95365a24059d9579l6548A66491a26132j59605h146k03828
$$ -160894 -27338 15574 -295365 -124059 -49579 -86127 166491 -126132 -285737 -8146 -211974
10498b11974L9564q4308k07516b03137E2994b02524B63869N711A03401K377a89197
$$ -211974 -172410 -256718 -464234 -203137 52994 -202524 263869 269580 103401 105778 -189197
10486D3749b47290a8338n9071C47738A51847a8452C34346C5421h2043A39111d5166
$$ 43749 -247290 -18338 -77409 347738 151847 -18452 334346 35421 -82043 139111 -45166
10474B62509l6609K45336k30341J47603I2814m1849L3635d30562J95180B2645
$$ 262509 225900 471236 240895 388498 92814 50965 84600 -430562 -235382 22645
10463d11236a05307d3874E8464k5328a94468b581k39453A74663a00053B45412
$$ -411236 -105307 -43874 58464 33136 -194468 -2581 -242034 174663 -100053 245412
10452e4922q4225O5293j42844f0482B07886b7553k30084d1107I0974R6543O4129
$$ -54922 -139147 -73854 -216698 -60482 207886 -27553 -257637 -41107 90974 187517 251646
10441B51646r4811l5855b07909b018j33647A44923m0350m8236c1238k87937J19846
$$ 251646 156835 120980 -207909 -2018 -135665 144923 104573 56337 -31238 -319175 -199329
10430a99329K6356M2449c9666j72161A36028b12718B38665c54779E645g2174e85
$$ -199329 -172973 -130524 -39666 -211827 136028 -212718 238665 -354779 5645 -72174 -585
10418D31942h8253B14898Q8014a43656H3371A1368b43990b5764B31496b02751
$$ 431942 -88253 214898 302912 -143656 83371 11368 -243990 -25764 231496 -202751
10407a72950B03275a65365k75033j1494J93263j26362f6214D1588b17447d1011
$$ -172950 203275 -165365 -440398 -451892 -258629 -384991 -66214 41588 -217447 -41011
10396F8479R3304m3659O0007D8445a76090A56756j7070F2485J02343n994j4980
$$ 68479 161783 118124 178131 48445 -176090 156756 139686 62485 164828 158834 143854
10385A43854l9874J92769c9665A05345b40915C71094m1492G049P5394c9333A91636
$$ 143854 103980 296749 -39665 105345 -240915 371094 329602 7049 82443 -39333 191636
10373h6351A55063a39257A91085a70217A35305E9769L82887A94125J99180J39873
$$ -86351 155063 -139257 191085 -170217 135305 59769 442656 194125 393305 533178
10363E33178J84333C25678r8613E1880M63467G3313J55844J4351J22729a7864
$$ 533178 717511 325678 227065 51880 515347 73313 229157 243508 366237 -17864
10352D44852B18188J58564F1232N07880J18178k48226P8785q2523k01024O040
$$ 444852 218188 376752 61232 569112 687290 439064 517849 435326 234302 240342
10342B40342k5534p6295K84764C435P4935J47799b74692A10369O131K3835D4821
$$ 240342 214808 138513 423277 3435 78370 226169 -274692 110369 116500 140335 44821
10330B65434i2806C39924q6460f0624l6398q5092I0127C7984L1923K00057O9306
$$ 265434 -92806 339924 253464 -60624 -97022 -182114 90127 37984 69907 269964 339270
10319C39270B761K72446d9979E3912L14771a02536A79361O3823A0435e1529l0172
$$ 339270 2761 275207 -49979 53912 368683 -102536 179361 243184 10435 -51529 -81701
10308h1701L6331l6050A06780L36774j15010j49910B9360C248c36486B62929o1327
$$ -81701 -45370 -81420 106780 443554 328544 178634 29360 3248 -336486 262929 201602
10297B01602p2212e2739A5956J8729K1799a17768j15895L9040b8097j15055J1298
$$ 201602 129390 -52739 15956 34685 56484 -117768 -233663 -194623 -28097 -143152 -131854
10286a31854J4479k1481H7819g9226J8567A4722b9250C71722c7331k10044B54571
$$ -131854 -117375 -138856 87819 -79226 -60659 14722 -29250 371722 -37331 -247375 254571
10274G6386J79205a10900c2404J3977C2858e3408B9109a8641k15725n1565f0929
$$ 76386 255591 -110900 -32404 -18427 32858 -53408 29109 -18641 -234366 -285931 -60929
10262a23356k432l3820A39489a14312j44597G8703K51839G9164e9580H8338J38242
$$ -123356 -125788 -159608 139489 -114312 -258909 78703 330542 79164 -59580 88338 226580
10251B26580E4171J00741O091B3804c7906A55041R9176N330F5837A4700a53703
$$ 226580 54171 154912 161003 23804 -37906 155041 254217 259547 65837 14700 -153703
10239A83543D7075N2240b4348C3361b81077a17840q2461L2561A27354Q8699a60905
$$ 183543 47075 99315 -24348 33361 -281077 -117840 -200301 -167740 127354 216053 -160905
10227a68955D7052a61843M8650N1587m05385b8923n6078H6687m1283R5668h3775
$$ -168955 47052 -161843 -113193 -61606 -466991 -28923 -85001 86687 45404 141072 -83775
10215B15958a18262J0975r1923g9102A57294a566r4036o2101j0120j04964D01081
$$ 215958 -118262 -107287 -199210 -79102 157294 -1566 -95602 -157703 -167823 -272787 401081
10203B87405a29807I3529c48591b3424l48340B07956b56535a07279m4868A34497
$$ 287405 -129807 93529 -348591 -23424 -371764 207956 -256535 -107279 -152147 134497
10192f7096A12529a3813E0223a41086A06434b52138g9236c9568A3212f0021L153
$$ -67096 112529 -13813 50223 -141086 106434 -252138 -79236 -39568 13212 -60021 -56868
10181e6868j45680A38016a15424a2938A22199a61754K1854A30404o0967K15384
$$ -56868 -202548 138016 -115424 -12938 122199 -161754 -139900 130404 69437 284821
10171B84821a35967e4240A47185c26897a50893l0707j29271D6332j6083Q501K247
$$ 284821 -135967 -54240 147185 -326897 -150893 -181600 -310871 46332 30249 38750 40997
10160D0997a55436I5627b73691g1662A0701a18534b4891k82687E04e4166k68586
$$ 40997 -155436 95627 -273691 -71662 10701 -118534 -24891 -307578 504 -54166 -322752
10149c22752J01551Q9323M7118B74806b77755f4199k60708A83430c37566G8141
$$ -322752 -221201 -131878 -84760 274806 -277755 -64199 -324907 183430 -337566 78141
10138h5656n4903k10352a17205b4551l43904I6694c1152k43183G611g5374p2243
$$ -85656 -140559 -350911 -117205 -24551 -368455 96694 -31152 -274335 7611 -75374 -147617
10127a47617C87509I3836a61134B5066c73589a07517j98354a49748j47854f8369
$$ -147617 387509 93836 -161134 25066 -373589 -107517 -305871 -149748 -297602 -68369
10116a45180A12187l6175D497J47789m9289J80256f286o8627q6497A85584e8995
$$ -145180 112187 76012 4497 152286 102997 283253 -6286 -74913 -161410 185584 -58995
10104f4970j11144N8312e0401F264a74304j01937R6886k04357C6311B634J30158
$$ -64970 -176114 -117802 -50401 6264 -174304 -276241 -179355 -383712 36311 2634 132792
10093A32792b93774b5725G4760c55017a0863j59049k19405J17636o663K9294J6875
$$ 132792 -293774 -25725 74760 -355017 -10863 -169912 -389317 -271681 -278344 -249050 -232175
10082b32175b2429A39574a01066r1752O4308j0930J2641k7040c3233A36176a52293
$$ -232175 -22429 139574 -101066 -192818 -128510 -139440 -126799 -153839 -33233 136176 -152293
10070c19914P5054g0393A03388A262L2882J20178b3722j4296o2159G7982c29724
$$ -319914 -244860 -70393 103388 1262 34144 154322 -23722 -38018 -100177 77982 -329724
10058h7791D4480J00203J10350c58019A07697e9754J1438D9475L8618a87581J7694
$$ -87791 44480 144683 255033 -358019 107697 -59754 -48316 49475 88093 -187581 -169887
10047a69887A64902Q6368C7322i4125M5371o4383j18321A15527j9246J17266a74991
$$ -169887 164902 251270 37322 -94125 -48754 -113137 -231458 115527 96281 213547 -174991
10035a50373K4508n746l036k8163k7715Q5585K3573j34817i5790d3998j16072
$$ -150373 -125865 -131611 -134647 -162810 -190525 -104940 -81367 -216184 -95790 -43998 -160070
10024a60070P8811A11000d53062d9547n5685A220J1234b13735d2346j70211h9012
$$ -160070 -81259 111000 -453062 -49547 -105232 1220 12454 -213735 -42346 -212557 -89012
10012A0514J04151c11227e9488k64953A61825f0055k4011B57118c8498n9887G4450
$$ 10514 114665 -311227 -59488 -324441 161825 -60055 -84066 257118 -38498 -98385 74450
10000C3871j5500O722L3251a83595f2390A07089a23975d5369l52342i0505p3515
$$ 33871 18371 25093 58344 -183595 -62390 107089 -123975 -45369 -397711 -90505 -164020
9989a64020P8239k9932d730l02018b8848E6128a56845n6058q2852A77132E9193
$$ -164020 -85781 -115713 -4730 -306748 -28848 56128 -156845 -212903 -295755 177132 59193
9977b55393r8216B9425d8083j22256c8509j49561f1860j01617e8691q2698m6173
$$ -255393 -353609 29425 -48083 -170339 -38509 -188070 -61860 -163477 -58691 -141389 -187562
9966a87562E4287O9658d386m67239e5607F8189d9314j10922G3957K90129e2189
$$ -187562 54287 123945 -4386 -471625 -55607 68189 -49314 -160236 73957 364086 -52189
9954e3268l19837P2236F5352R7441b96720J40500H6171b48502J06264G8545d0393
$$ -53268 -373105 -300869 65352 162793 -296720 -156220 86171 -248502 -142238 78545 -40393
9942A91240b05834B36451d2486m8674k04085R6446A39256b68525B46805a45358
$$ 191240 -205834 236451 -42486 -91160 -295245 -198799 139256 -268525 246805 -145358
9931A53019r866j259N7676m8861B5117d9762k70357A63601E1101a79440D3625
$$ 153019 143153 141894 199570 150709 25117 -49762 -320119 163601 51101 -179440 43625
9919c43339a34997k8575r7406A5450Q5604e2958B49277a56005b3400o1393L0317
$$ -343339 -134997 -163572 -260978 15450 101054 -52958 249277 -156005 -23400 -84793 -54476
9908e4476I553f6120I4735D0023b25868j06151r173A27381a39989A70109J29971
$$ -54476 9553 -66120 94735 40023 -225868 -332019 -341192 127381 -139989 170109 300080
9897C00080c87896e7150b2417k50048F0155d85923h7008k9651a3152j00078E9917
$$ 300080 -387896 -57150 -22417 -272465 60155 -485923 -87008 -116659 -13152 -113230 59917
9885H7670b11805k39705A3135J7099a74854K5428g847G2219J479J20533b47548
$$ 87670 -211805 -451510 13135 30234 -174854 -149426 -7847 72219 73698 194231 -247548
9873f3574j66731k5204j4093i6884B70349d8127m6116A66316f3230n6109N6490
$$ -63574 -230305 -255509 -269602 -96884 270349 -48127 -94243 166316 -63230 -119339 -62849
9862f2849A77216f9734A30303b9635j4794E158L9474J9529g0191j02078A38060
$$ -62849 177216 -69734 130303 -29635 -44429 5158 44632 64161 -70191 -172269 138060
9850a47269B18342a63895A78591a51567k87853F0508c5467q4511G3612a813k69794
$$ -147269 218342 -163895 178591 -151567 -439420 60508 -35467 -119978 73612 -1813 -271607
9839b71607i7846k64631k9059a0606k7005j68939A31907a45745F084b25220e8015
$$ -271607 -97846 -362477 -391536 -10606 -37611 -206550 131907 -145745 6084 -225220 -58015
9827b53721p1398e8005l4177j35780d0085k20332C7382c17432E9728B4452b42516
$$ -253721 -325119 -58005 -92182 -227962 -40085 -260417 37382 -317432 59728 24452 -242516
9815H4234a69056g6830j48597p441o7279J28210A51235a88247M199k98573C5674
$$ 84234 -169056 -76830 -225427 -232868 -300147 -171937 151235 -188247 -184048 -482621 35674
9803a63606c036B0313a81219G0782b53284C9579d6326Q11A63589p0353A571g5318
$$ -163606 -3036 20313 -181219 70782 -253284 39579 -46326 -45515 163589 93236 1571 -75318
9790b29243L5399j2018b6338A36446J18590D3761c48275A98960E5613f7300j44134
$$ -229243 -193844 -205862 -26338 136446 255036 43761 -348275 198960 55613 -67300 -211434
9779b11434c6050k60529D938a66920j106p643k54454f3715o5843j637A24215a79317
$$ -211434 -36050 -296579 4938 -166920 -168026 -175669 -430123 -63715 -129558 -131195 124215 -179317
9766e96586a9517C1656f8368l35181I2565L0175K719j2989N9246b77087P0396
$$ -596586 -19517 31656 -68368 -403549 92565 122740 125459 112470 171716 -277087 -206691
9755b06691A93892k9735a09631A61277i2725n184k96432J28620B9127P413M6445
$$ -206691 193892 164157 -109631 161277 -92725 -97909 -394341 -265721 29127 36540 82985
9744H2985J53769H5711h7133C3802a18692B47479c64727A73559b64477e6864j38382
$$ 82985 236754 85711 -87133 33802 -118692 247479 -364727 173559 -264477 -56864 -195246
9733a95246j46765a14303J7130j09025f2767j50393A85238a7881j50999a5968
$$ -195246 -342011 -114303 -97173 -206198 -62767 -213160 185238 -17881 -168880 -15968
9722a05506B51010A19958b27694o2069K9606H8004e20935A48698d6517q995A57674
$$ -105506 251010 119958 -227694 -289763 -260157 88004 -520935 148698 -46517 -55512 157674
9710A6563B145a63716j6897H1978d2557C3874a54755G0348K2182C4014a29005
$$ 16563 2145 -163716 -180613 81978 -42557 33874 -154755 70348 92530 34014 -129005
9698b29390j39472A23024g4907k17196M4915O6182Q8671j6962B26775r3479O3351
$$ -229390 -368862 123024 -74907 -292103 -247188 -181006 -92335 -109297 226775 133296 196647
9687A96647a9544p3336q1219B52185a64537g0487A43467a41177o7007D8066a99546
$$ 196647 -19544 -92880 -174099 252185 -164537 -70487 143467 -141177 -208184 48066 -199546
9675b23987G6153a93210F1800b47188f3752j32895P4627B23190c44691A17122
$$ -223987 76153 -193210 61800 -247188 -63752 -196647 -122020 223190 -344691 117122
9664b0725G2648e0563n6100D068d6492A11584b32727j07115R9293M4218c4412
$$ -20725 72648 -50563 -106663 4068 -46492 111584 -232727 -339842 -240549 -196331 -34412
9652d38210H3713k9026A1552M8500J04633b65221B3362J74565E3401b21899A38056
$$ -438210 83713 54687 11552 60052 164685 -265221 23362 197927 53401 -221899 138056
9640C6602a37812j94952D8765a29440M2456A71839K4240c95976B2448K9009e243
$$ 36602 -137812 -332764 48765 -129440 -86984 171839 196079 -395976 22448 51457 -5243
9628a5026l8195j7444D0538j0526e7688a8780k9928j20060A27568P2860b44121
$$ -15026 -53221 -70665 40538 30012 -57688 -18780 -48708 -168768 127568 200428 -244121
9616A33009b74542h4144c4424k87789A20911k7143a23752n161A91350a87641j34544
$$ 133009 -274542 -84144 -34424 -322213 120911 93768 -123752 -128913 191350 -187641 -322185
9605c22185E0759a04257D783e5450j62218f031C29812a35510F4967p726a59780
$$ -322185 50759 -104257 4783 -55450 -217668 -6031 329812 -135510 64967 57241 -159780
9593B51125r6861J980a92410H3567b31821A19427b09475b1313G6150a79524a8079
$$ 251125 154264 156244 -192410 83567 -231821 119427 -209475 -21313 76150 -179524 -18079
9581B39996b31830N1584O3455l1628N1632G7894b66207J31026A12917R9213f8083
$$ 239996 -231830 -180246 -116791 -148419 -96787 77894 -266207 -135181 112917 212130 -68083
9569G627a00073C24561a41672B07532b6321H2381b72658J06907a2234k54452p8554
$$ 7627 -100073 324561 -141672 207532 -26321 82381 -272658 -165751 -12234 -266686 -345240
9558c45240A31198a48952d3918A91141G4526f0622b6227j43420A99154e7565A52554
$$ -345240 131198 -148952 -43918 191141 74526 -60622 -26227 -169647 199154 -57565 152554
9546B48592A09353b93216a39203l5347k2300h7591A6059i9894A3505a26866C7460
$$ 248592 109353 -293216 -139203 -174550 -196850 -87591 16059 -99894 13505 -126866 37460
9534a38029c2237B49921F0456b12549R8455m3324L5549k28263F0252a9847k01121
$$ -138029 -32237 249921 60456 -212549 -114094 -157418 -121869 -350132 60252 -19847 -220968
9523b20968n7231q6628a18686l6757I5083C5903b23897K5698E6370c03424a09854
$$ -220968 -278199 -364827 -118686 -155443 95083 35903 -223897 -198199 56370 -303424 -109854
9511B71798a258D6799b62388b2663B12157e29368F7442c26243D4505i098j08425
$$ 271798 -1258 46799 -262388 -22663 212157 -529368 67442 -326243 44505 -9098 -117523
9500a17523b7170j79755D32274j76877a94609B05332c215n1072M59B82269a6787
$$ -117523 -27170 -206925 432274 255397 -194609 205332 -3215 -54287 -53828 282269 -16787
9488A81931a06861A42009b23511K4595j2184g1831j96007g4551k22136K0839J06603
$$ 181931 -106861 142009 -223511 -198916 -211100 -71831 -267838 -74551 -296687 -275848 -169245
9477a69245A9258a62329r9301K3014A33436a87962l0409d5636l8997k9150j14809
$$ -169245 19258 -162329 -261630 -238616 133436 -187962 -218371 -45636 -84633 -113783 -228592
9466b28592J774N1468C1378J73791L6674a7019F9619a09568j32138F181L17258
$$ -228592 -226818 -175350 31378 205169 241843 -17019 69619 -109568 -241706 6181 323439
9455C23439b47286D7047b63336r2771J41736c0199m2596k21582f884j3945B4931
$$ 323439 -247286 47047 -263336 -356107 -214371 -30199 -72795 -294377 -6884 -20829 24931
9443d7857B5046J69369a15626B01357p2066i6615H2302a51547d0395j42373A37158
$$ -47857 25046 194415 -115626 201357 129291 -96615 82302 -151547 -40395 -182768 137158
9431B19072a82490d617H3074b20721F2406j1807g8431r5571c6354B6467a05820
$$ 219072 -182490 -4617 83074 -220721 62406 50599 -78431 -174002 -36354 26467 -105820
9419A14343A1587m271K73992a06991A64444h2366p9280H9852j537A6669d3218
$$ 114343 11587 7316 281308 -106991 164444 -82366 -161646 89852 88315 16669 -43218
9407a22479m0459d1129F2329a17759k87343J22527g4488r2826n5074J08940A45411
$$ -122479 -162938 -41129 62329 -117759 -405102 -282575 -74488 -167314 -222388 -113448 145411
9395A25220a02814c45j85018j63353H7579A1448b09709f9740F085J73672e243
$$ 125220 -102814 -345 -185363 -348716 87579 11448 -209709 -69740 6085 179757 -5243
9383f0292A11088e5351f334j1425B49578G0540a49345L317L7909M6011k46843
$$ -60292 111088 -55351 -6334 -17759 249578 70540 -149345 -146028 -108119 -62108 -308951
9372c08951e2846D2633A7897d61932b7517R331j06236e5884a2310A57800b91600
$$ -308951 -52846 42633 17897 -461932 -27517 -18186 -124422 -55884 -12310 157800 -291600
9360a36509f6330B05303c17463B60778g0055B6509c49088N9925b5920k68578J4029
$$ -136509 -66330 205303 -317463 260778 -70055 26509 -349088 -289163 -25920 -294498 -280469
9349b80469J12906c009j60167G8961c82493A80823J78764b76745e9440F8134B4576
$$ -280469 -167563 -3009 -163176 78961 -382493 180823 359587 -276745 -59440 68134 24576
9337c54935M3162A126b09501A39304i3003F2111R4477r659E3928B4030c3025F5473
$$ -354935 -311773 1126 -209501 139304 -93003 62111 156588 146929 53928 24030 -33025 65473
9324G8286a99717O7257N0001R126B37086k2687D0532K32563b32031A63804h0014
$$ 78286 -199717 -132460 -82459 -73333 237086 214399 40532 273095 -232031 163804 -80014
9312a96013E448a20746M0316m8234A3874a71492F878a94199h2405q7110b7790
$$ -196013 5448 -120746 -80430 -128664 13874 -171492 6878 -194199 -82405 -169515 -27790
9300a4470j30513D548h9078o4184K9767j70781K9653E7698a007k24929Q4820j72569
$$ -14470 -144983 4548 -89078 -153262 -123495 -294276 -264623 57698 -1007 -225936 -141116 -313685
9288c13685a25629a3816j00327l80170c6608a5353A01268a70111D4889a46503
$$ -313685 -125629 -13816 -114143 -494313 -36608 -15353 101268 -170111 44889 -146503
9277a30221j43585B25592d17090d6401j42181A05700a27500B9989b46198L1794
$$ -130221 -273806 225592 -417090 -46401 -188582 105700 -127500 29989 -246198 -214404
9267b14404R9785N0540k2006j62252a15831k10837a54672d1778k1554B47578B600
$$ -214404 -114619 -64079 -86085 -248337 -115831 -326668 -154672 -41778 -63332 247578 2600
9255b32643b2825j87899I9688m5983j8118J78587c06857E5837a61535m7094b2901
$$ -232643 -22825 -210724 99688 53705 35587 214174 -306857 55837 -161535 -208629 -22901
9243c80803a13129J5444A4484L34419a61922M7208A32071a19031C2643b71747
$$ -380803 -113129 -97685 14484 348903 -161922 -114714 132071 -119031 32643 -271747
9232b1284l33420M86a04594m2456j53734J25694A3298b20870G6110b92799R2711
$$ -21284 -354704 -354218 -104594 -147050 -300784 -175090 13298 -220870 76110 -292799 -200088
9221b00088b2663j71071A29228i0007i231l4027A82947G2847a98842A32767D23
$$ -200088 -22663 -193734 129228 -90007 -9231 -43258 182947 72847 -198842 132767 423
9209b03169P0241A37994J55165b383A85586M6446a21703d3521J2062A11766e5954
$$ -203169 -132928 137994 293159 -2383 185586 232032 -121703 -43521 -31459 111766 -55954
9197a81989d9600j60169c4803k1009r445j03450j10521k27857b33021A38789a21757
$$ -181989 -49600 -209769 -34803 -55812 -65257 -168707 -279228 -507085 -233021 138789 -121757
9185a98322B13484R2580p8500h8135G6570b28167b4106D38551a48372d9815A01324
$$ -198322 213484 306064 227564 -88135 76570 -228167 -24106 438551 -148372 -49815 101324
9173E7164e0058j82129N2117g7882j5801q7865M75N1006k50980b7528p1330B81175
$$ 57164 -50058 -232187 -180070 -77882 -93683 -181548 -181073 -130067 -381047 -27528 -98858 281175
9160a3155j13684j04484M8322p3870a26293A67929f969C6936b36485C3686g8870
$$ -13155 -126839 -231323 -183001 -256871 -126293 167929 -6969 36936 -236485 33686 -78870
9148A17427a48184j60348a10927A45226a64712b4742j5637j03980q3042b4624
$$ 117427 -148184 -308532 -110927 145226 -164712 -24742 -40379 -144359 -227401 -24624
9137A8610i5326l1059o5875G6872N6469g3372j00928C76608b1434l76216F1715
$$ 18610 -95326 -126385 -192260 76872 133341 -73372 -174300 376608 -21434 -397650 61715
9125A99095a95730O3629A10185J01241f8530a4935m0568h674j3666r3086j00193
$$ 199095 -195730 -132101 110185 211426 -68530 -14935 -55503 -8674 -22340 -115426 -215619
9114b15619H3930d5388l09520b4635C23728b8209A67360C7655a12195p8352B7802
$$ -215619 83930 -45388 -354908 -24635 323728 -28209 167360 37655 -112195 -190547 27802
9102e9155H6812k9449a75316I023a1079l636A7069J25202a2537C96750b700m06412
$$ -59155 86812 57363 -175316 9023 -11079 -14715 17069 142271 -12537 396750 -2700 -409112
9090d09112b3738I600K59025e3088A28691b47318J15662c9471k46673J37418N1538
$$ -409112 -23738 9600 268625 -53088 128691 -247318 -131656 -39471 -286144 -148726 -97188
9079i7188C41K8929a39602E5350b16003Q8129k36880i86k10223h8209A34051f1689
$$ -97188 341 29270 -139602 55350 -216003 -127874 -364754 -986 -211209 -88209 134051 -61689
9066A827a37113G1383k1136b18063R8432B49531a56993a2248l94629E6752b5802
$$ 1827 -137113 71383 50247 -218063 -119631 249531 -156993 -12248 -406877 56752 -25802
9054c5323J1836o9355A38504A0669d00913d6049D2984b26405A30610J00780c2016
$$ -35323 -23487 -92842 138504 10669 -400913 -46049 42984 -226405 130610 231390 -32016
9042f7681k26496G0733a94887B6642a82740m0691J11690l3761k56102e1537j04593
$$ -67681 -294177 70733 -194887 26642 -182740 -223431 -111741 -145502 -401604 -51537 -156130
9031a56130j25240D6933m805f3911m977J6429I7474K2006J35081b20829L034A01966
$$ -156130 -281370 46933 42128 -63911 -68888 -52459 97474 119480 254561 -220829 -217795 101966
9018a06596K0885E7637a56923j10254a23580o792e8664k91951J59547a6577M855
$$ -106596 -85711 57637 -156923 -267177 -123580 -130372 -58664 -350615 -191068 -16577 -11722
9007a1722E7679h0697K7062n9192B9098b06164B17744b2895A60912b31626B34077
$$ -11722 57679 -80697 -53635 -112827 29098 -206164 217744 -22895 160912 -231626 234077
8995a15955A06997b61660k2116C6499J02036i1344k74620J16432c1827k77675
$$ -115955 106997 -261660 -283776 36499 138535 -91344 -365964 -249532 -31827 -309502
8985c09502b9844A84852o3468f4252l4568C92593A20869c6419B81152h4019k24207
$$ -309502 -29844 184852 121384 -64252 -98820 392593 120869 -36419 281152 -84019 -308226
8974c08226N1653B3153b888k48362J7130A61283c26303a61901H2393a70630R211
$$ -308226 -256573 23153 -2888 -251250 -234120 161283 -326303 -161901 82393 -170630 -161419
8963a61419K0153K3873B59186b77647C6243p638J4448b46350A2563f4674C95565
$$ -161419 -141266 -117393 259186 -277647 36243 28605 43053 -246350 12563 -64674 395565
8951g4127E5744J61775o9838J18482a00327C3795K43995A2497A366a1811n05645
$$ -74127 55744 217519 147681 266163 -100327 33795 277790 12497 1366 -11811 -517456
8940e17456K31047B13795j7656h0750a6755j66420h8192A29929K07473J6048d9360
$$ -517456 -286409 213795 196139 -80750 -16755 -183175 -88192 129929 337402 353450 -49360
8928B73806D4764R1342L1283F1473K11875j26540K81336K68638K608652P862756
$$ 273806 44764 136106 167389 61473 273348 146808 428144 696782 3305434 11168190
8918A1168190D271370A820771F40446j57140j52581P1149j74832r4006g7568l64890
$$ 11168190 4271370 1820771 640446 483306 330725 401874 227042 133036 -77568 -442458
8908d42458a36534E067J07404g3986B39520a46398C1690J55953b5590r3723A1795
$$ -442458 -136534 5067 112471 -73986 239520 -146398 31690 187643 -25590 -119313 11795
8896E3505J47714e245B67803l6233R4436b0958D29867b25797B34429A17204a07346
$$ 53505 201219 -5245 267803 231570 326006 -20958 429867 -225797 234429 117204 -107346
8884c2989j97579H1876b10130A71899h9920j20845n951P1793G2881a82354c5665
$$ -32989 -230568 81876 -210130 171899 -89920 -210765 -216716 -144923 72881 -182354 -35665
$$ [...]
##END NTUPLES=NMR SPECTRUM
##END=
