
##TITLE=AC1298_ECUAH12110_6666759_k2qTeoWIL1
##JCAMPDX= 6.0         $$ Bruker NMR JCAMP-DX V2.0
##DATA TYPE= NMR SPECTRUM
##DATA CLASS= NTUPLES
##ORIGIN= BRUKER
##OWNER= Administrator
$$ 1.72 TOPSPIN		Version 2.1
$$ 2012-08-13 21:07:33.765 -0500  Administrator@TOPSPIN
$$ Compression mode = diff/dup
##.OBSERVE FREQUENCY= 400.02188249412
##.OBSERVE NUCLEUS= ^1H
##.ACQUISITION MODE= SIMULTANEOUS (DQD)
##.ACQUISITION SCHEME= undefined
##.AVERAGES= 8
##.DIGITISER RES= 22
##SPECTROMETER/DATA SYSTEM= spect
##.PULSE SEQUENCE= zg30
##.SOLVENT NAME= COFFEE_meoh
##.SHIFT REFERENCE= INTERNAL, COFFEE_meoh, 1, 14.98509
##AUDIT TRAIL= $$ (NUMBER, WHEN, WHO, WHERE, PROCESS, VERSION, WHAT)
$$ ##TITLE= Audit trail, TOPSPIN		Version 2.1
$$ ##JCAMPDX= 5.01
$$ ##ORIGIN= Bruker BioSpin GmbH
$$ ##OWNER= Administrator
$$ $$ C:\Bruker\TOPSPIN/data/COFFEE/nmr/AC1298_ECUAH12110_6666759_k2qTeoWIL1/10/pdata/1/auditp.txt
$$ ##AUDIT TRAIL=  $$ (NUMBER, WHEN, WHO, WHERE, PROCESS, VERSION, WHAT)
(   1,<2012-08-13 21:07:24.437 -0500>,<Administrator>,<TOPSPIN>,<go>,<TOPSPIN 2.1>,
      <created by zg
	started at 2012-08-13 21:06:17.890 -0500,
	POWCHK enabled, PULCHK disabled,
       configuration hash MD5:
       6B 1B 68 BB D9 2E 58 E2 7F 35 AD 54 07 DF 0E 41
       data hash MD5: 64K
       66 AE 43 93 24 D7 C9 AC 5A 57 21 E0 23 5E 2C 70>)
(   2,<2012-08-13 21:07:29.187 -0500>,<Administrator>,<TOPSPIN>,<proc1d>,<TOPSPIN 2.1>,
      <Start of raw data processing
       efp LB = 0 FT_mod = 6 PKNL = 1 PHC0 = 0 PHC1 = 0 SI = 32K 
       data hash MD5: 32K
       06 42 B3 BE 3B FF AF E1 33 82 63 41 C2 54 62 9A>)
(   3,<2012-08-13 21:07:29.500 -0500>,<Administrator>,<TOPSPIN>,<proc1d>,<TOPSPIN 2.1>,
      <pk PHC0 = 182.1149 PHC1 = 0 
       data hash MD5: 32K
       0F 2A 94 D2 E7 0F 40 71 FE C5 8A 2C E2 16 99 70>)
(   4,<2012-08-13 21:07:29.593 -0500>,<Administrator>,<TOPSPIN>,<proc1d>,<TOPSPIN 2.1>,
      <abs ABSG = 1 
       data hash MD5: 32K
       11 59 A7 2C 4E 69 A5 31 2C B3 27 F7 4F 07 21 D4>)
(   5,<2012-08-13 21:07:29.625 -0500>,<Administrator>,<TOPSPIN>,<proc1d>,<TOPSPIN 2.1>,
      <abs ABSG = 2 
       data hash MD5: 32K
       A8 CC DF 1C 76 1D A4 67 8E C3 02 B7 F9 B6 95 A0>)
(   6,<2012-08-13 21:07:29.656 -0500>,<Administrator>,<TOPSPIN>,<proc1d>,<TOPSPIN 2.1>,
      <abs ABSG = 3 
       data hash MD5: 32K
       C9 81 D9 9D 29 50 3A 77 36 74 00 D0 D2 43 EE ED>)
(   7,<2012-08-13 21:07:29.703 -0500>,<Administrator>,<TOPSPIN>,<proc1d>,<TOPSPIN 2.1>,
      <abs ABSG = 4 
       data hash MD5: 32K
       BC C4 B4 69 78 3D F9 7D F9 55 97 7C E2 B4 F3 BB>)
(   8,<2012-08-13 21:07:29.734 -0500>,<Administrator>,<TOPSPIN>,<proc1d>,<TOPSPIN 2.1>,
      <abs ABSG = 5 
       data hash MD5: 32K
       0E C9 48 88 C0 6C FA E5 49 76 59 30 42 1F D3 7B>)
$$ ##END=
$$ 
$$ $$ hash MD5
$$ $$ EC C3 0E 98 8D 89 5A 11 A2 77 9D E1 D4 7E F5 14
##$RELAX= 
##$RELAX= 
##$RELAX= 
##$RELAX= 
##$RELAX= 
##$RELAX= 
##$RELAX= 
$$ Bruker specific parameters
$$ --------------------------
$$ [...]
150 150 150 150 150 150 150 150
##$TP07= 0
##$TPNAME0= <>
##$TPNAME1= <>
##$TPNAME2= <>
##$TPNAME3= <>
##$TPNAME4= <>
##$TPNAME5= <>
##$TPNAME6= <>
##$TPNAME7= <>
##$TPOAL= (0..7)
0.5 0.5 0.5 0.5 0.5 0.5 0.5 0.5
##$TPOFFS= (0..7)
0 0 0 0 0 0 0 0
##$TUNHIN= 0
##$TUNHOUT= 0
##$TUNXOUT= 0
##$USERA1= <user>
##$USERA2= <user>
##$USERA3= <user>
##$USERA4= <user>
##$USERA5= <user>
##$V9= 5
##$VALIST= <valist>
##$VCLIST= <CCCCCCCCCCCCCCC>
##$VD= 0
##$VDLIST= <DDDDDDDDDDDDDDD>
##$VPLIST= <PPPPPPPPPPPPPPP>
##$VTLIST= <TTTTTTTTTTTTTTT>
##$WBST= 1024
##$WBSW= 4
##$XGAIN= (0..3)
0 0 0 0
##$XL= 0
##$YL= 0
##$YMAX_a= 483301
##$YMIN_a= -614183
##$ZGOPTNS= <>
##$ZL1= 120
##$ZL2= 120
##$ZL3= 120
##$ZL4= 120
##$ABSF1= 14.98509
##$ABSF2= -5.573092
##$ABSG= 5
##$ABSL= 3
##$ALPHA= 0
##$AQORDER= 0
##$ASSFAC= 0
##$ASSFACI= 0
##$ASSFACX= 0
##$ASSWID= 0
##$AUNMP= <proc_prof1d_extract_pilot.lims>
##$AXLEFT= 0
##$AXNAME= <>
##$AXNUC= <1H>
##$AXRIGHT= 0
##$AXTYPE= 0
##$AXUNIT= <>
##$AZFE= 0.1
##$AZFW= 0.1
##$BCFW= 0
##$BC_mod= 0
##$BYTORDP= 0
##$COROFFS= 0
##$CY= 15
##$DATMOD= 1
##$DC= 0
##$DFILT= <>
##$DTYPP= 0
##$F1P= 0
##$F2P= 0
##$FCOR= 0.5
##$FTSIZE= 32768
##$FT_mod= 6
##$GAMMA= 0
##$GB= 0
##$INTBC= 1
##$INTSCL= 1
##$ISEN= 128
##$LB= 0
##$LEV0= 0
##$LPBIN= 0
##$MAXI= 10000
##$MC2= 0
##$MEAN= 0
##$ME_mod= 0
##$MI= 0
##$NCOEF= 0
##$NC_proc= -8
##$NLEV= 6
##$NOISF1= 0
##$NOISF2= 0
##$NSP= 0
##$NTH_PI= 0
##$NZP= 0
##$OFFSET= 14.98509
##$PC= 1
##$PHC0= 182.1149
##$PHC1= 0
##$PH_mod= 1
##$PKNL= yes
##$PPARMOD= 0
##$PPDIAG= 0
##$PPIPTYP= 0
##$PPMPNUM= 2147483647
##$PPRESOL= 1
##$PSCAL= 4
##$PSIGN= 0
##$PYNMP= <proc.py>
##$REVERSE= no
##$SF= 400.02
##$SI= 32768
##$SIGF1= 0
##$SIGF2= 0
##$SINO= 400
##$SIOLD= 32768
##$SPECTYP= <>
##$SREGLST= <1H.CDCl3>
##$SSB= 0
##$STSI= 32768
##$STSR= 0
##$SW_p= 8223.68421052631
##$SYMM= 0
##$S_DEV= 0
##$TDeff= 65536
##$TDoff= 0
##$TI= <>
##$TILT= no
##$TM1= 0
##$TM2= 0
##$TOPLEV= 0
##$USERP1= <user>
##$USERP2= <user>
##$USERP3= <user>
##$USERP4= <user>
##$USERP5= <user>
##$WDW= 1
##$XDIM= 32768
##$YMAX_p= 473226151
##$YMIN_p= -721725
##$CURPLOT= <Network HP LaserJet P1505>
##$CURPRIN= <$Network HP LaserJet P1505>
##$DFORMAT= <normdp>
##$LAYOUT= <+/1D_H.xwp>
##$LFORMAT= <normlp>
##$PFORMAT= <normpl>
##$SURQMSG= 1
$$ End of Bruker specific parameters
$$ ---------------------------------
##NTUPLES= NMR SPECTRUM
##VAR_NAME=  FREQUENCY,     SPECTRUM/REAL,   SPECTRUM/IMAG
##SYMBOL=    X,             R,               I
##VAR_TYPE=  INDEPENDENT,   DEPENDENT,       DEPENDENT
##VAR_FORM=  AFFN,          ASDF,            ASDF
##VAR_DIM=   32768,         32768,           32768
##UNITS=     HZ,            ARBITRARY UNITS, ARBITRARY UNITS
##FACTOR=    0.250966925370066, 1,           1
##FIRST=     8223.43324360094, -10208,       205163
##LAST=      0,             123430,          -147417
##MIN=       0,             -721725,         0
##MAX=       8223.43324360094, 473226151,    0
$$ Real data points
##PAGE= N=1
##DATA TABLE= (X++(R..R)), XYDATA
$$ [...]
19555a8530F1083b94051C623b16019A15165l8675b56052A10708b65681A57933
19544h1511o004a8893F9559K84226c0168G6577R8309a08266j9468A14732Q0555
19533A95287b1615j07125j9809A05027C0296J47274F0887P0414D3008Q6365b59378
19521a15370M3267k06471G4389b24558c8318C51941A02567L365K01211a20633
19510b96185a28177k9138M188F3019K9614a87986B05397e6261k12314E9597E019
19498a35002k91361I8143a06697L9446n5617k04193f9775j37139G175K78274a96949
19486c55030E47262A39967L027O9519a70159C78419b61818H7828a73918m4491
19476b18409O9532b7180A71094g6637B097J17076b4647k52965a23554k1945j4852
$$ y = [-18530, 61083, -294051, 3623, -216019, 115165, 76490, -256052, 110708, -265681, 157933, -81511, -87515, -18893, 69559, 353785, -30168, 76577, 174886, -108266, -127734, 114732, 195287, -21615, -128740, -148549, 105027, 30296, 177570, 60887, 131301, 43008, 129373, -259378, -115370, -72103, -278574, 74389, -224558, -38318, 351941, 102567, 105932, 307143, -120633, -296185, -128177, -157315, -153127, 63019, 92633, -187986, 205397, -56261, -268575, 59597, 5019, -135002, -426363, 98143, -106697, -67251, -122868, -327061, -69775, -206914, 7175, 285449, -196949, -355030, 547262, 139967, 142994, 212513, -170159, 378419, -261818, 87828, -173918, -218409, -148877, -27180, 171094, -76637, 2097, 119173, -24647, -277612, -123554, -145499, -160351]
19465a60351b6903j0864o4977A20770C4185J44621a19660j77409F3594K8814J87721
19454B80129g0602o6344A49673g4912j60426F4386k3557J40432f4581l00405a43541
19442b26666j35511c3212j45343A27053a57108E9027L7248g5151r9452C9579J13447
19431A53026b07037A17215a34972F2618e1029F90c7700q1433k50438d5014j77
19420d5191E9415a31947A06573a41859A51313o1139g5781l9989p1048c4199k67598
19409c01797a17789c2396A9374a4358A19530c20811J1092B34889b22034e4650
19398c0055L951B8943c946k4594j1929q1476l4348k8317P173J1718A10926e1957
19385d12306b4220r043a0144k63113a12887k40718A19971D7822d58575i0991e496
$$ y = [-160351, -26903, -37767, -102744, 120770, 34185, 178806, -119660, -297069, 63594, 92408, 280129, -70602, -136946, 149673, -74912, -235338, 64386, 40829, 181261, -64581, -364986, -143541, -226666, -362177, -33212, -178555, 127053, -157108, 59027, 96275, -75151, -174603, 39579, 153026, -207037, 117215, -134972, 62618, -51029, 690, -37700, -119133, -369571, -45014, -45191, 59415, -131947, 106573, -141859, 151313, 90174, -75781, -115770, -186818, -34199, -301797, -117789, -32396, 19374, -14358, 119530, -320811, -309719, 234889, -222034, -54650, -30055, -26104, 28943, -3946, -28540, -40469, -121945, -156293, -184610, -177437, -165719, 110926, -51957, -412306, -24220, -33263, -10144, -273257, -112887, -353605, 119971, 47822, -458575, -90991, -5496]
19373a41459L4599D3149a63479C6988a2921E7839M3949d28032a58400I657P0774
19362H0431b36291j37641J15248G1101b3127m82603b30880h7747K5227q7071E4796
19350I7083g2288j68667E1808M9326a52638A06245P170c01228b7530k13807j54044
19339c95381i8380B4538b12673E2885M11881a39761a5066m3466B59995b30950
19328B64938A25716a5321m74432a68319g4796k07942M2805K8359j12736g4263
19317A55438C4573K03882b06732a1280J640A08689C1076f9999B68589d0812j3832
19306e4644J1580m6357l1174j2671H2299a94938B72919a18072b8563l90543A40537
19294a02082b5194o5329D8904L649d3255n33692a84037M9609k7013O4859A53298
$$ y = [-141459, -106860, 43149, -163479, 36988, -12921, 57839, 101788, -428032, -158400, 9657, 80431, -236291, -373932, -258684, 71101, -23127, -505730, -230880, -87747, -62520, -149591, 54796, 97083, -72288, -240955, 51808, 101134, -152638, 106245, 113415, -301228, -27530, -241337, -395381, -98380, 24538, -212673, 52885, 464766, -139761, -15066, -58532, 259995, -230950, 264938, 125716, -15321, -489753, -168319, -74796, -282738, -239933, -211574, -324310, -74263, 155438, 34573, 238455, -206732, -11280, -9640, 108689, 31076, -69999, 268589, -40812, -54644, -43064, -89421, -120595, -133266, 82299, -194938, 272919, -118072, -28563, -419106, 140537, -102082, -25194, -90523, 48904, 52553, -43255, -576947, -184037, -134428, -161441, -96582, 153298]
19282b13173I3543a382H510M5675J65777A9866K09628p1998c33137b4285B71700
19270b43909I060d40116J82001B04690a19033E3174d2072l2348g891A61950a93012
19258A04844a78767D9366J11734A5204J19994a0545j54820m0065B56963j22863
19248A34100B3287d7126B32543a11100k53001A21897c01445I0057K0711C6295
19237B9328a18434p3811d17j43276l17622G7617b7730j17760k9631A24323E236
19225b73610J16700A5154Q8535A9395J43237o4105A6677A222a61961m49g0480
19213a35276l2051C05519H7295B1829b63880R2766B27503B1483e8702l23788B45618
19201B36883h2424C70843H778a56243F04440c546m58512i2601B96819j41837f5986
$$ y = [-213173, 93543, -1382, 8510, 54185, 219962, 19866, 229494, 157496, -333137, -24285, 271700, -243909, 9060, -440116, -258115, 204690, -119033, 53174, -42072, -74420, -7891, 161950, -193012, 104844, -178767, 49366, 161100, 15204, 135198, -10545, -165365, -205430, 256963, 134100, 23287, -47126, 232543, -111100, -364101, 121897, -301445, 90057, 110768, 36295, 29328, -118434, -192245, -417, -143693, -461315, 77617, -27730, -145490, -175121, 124323, 5236, -273610, -156910, 15154, 103689, 19395, 162632, 98527, 16677, 1222, -161961, -162410, -70480, -135276, -167327, 305519, 87295, 21829, -263880, -171114, 227503, 21483, -58702, -382490, 245618, 236883, -82424, 370843, 8778, -156243, 604440, -3546, -462058, -92601, 296819, 154982, -65986]
19189f5511K0124m244A47130b96714g066B69836a31332B9702j1543J46684b89302
19177D5221J9141a60009r047B19250D2719c70597D4214h554D4966b02799J794
19166b01005B77796a61876A38741F4725N6426K78840e20218a37259C0365b06772
19155a52083p3181E0154a86335b7430j68086A6028a47754A15267i6831B6217R9613
19144A25830a45029j50701a23495j190j93145g2916n662r2422b3317A79427f0916
19132a39807A23149a32334k52994A04879a43231A3406f5151o5428F83c48048i9452
19120e9274k03593O3782B9747M4749j2879B0063F600K12323b94891N2189h0629
19108B98781c52230a24457N5166q4552d0125q3822m5243j7334n615p493C623L9354
$$ y = [-65511, -45387, -49631, 147130, -296714, -7066, 269836, -131332, 29702, 18159, 164843, -289302, 45221, 64362, -160009, -169056, 219250, 42719, -370597, 44214, -8554, 44966, -202799, -201005, 277796, -161876, 138741, 64725, 121151, 399991, -520218, -137259, 30365, -206772, -152083, -225264, 50154, -186335, -27430, -195516, 16028, -147754, 115267, -96831, 26217, 125830, -145029, -295730, -123495, -124685, -317830, -72916, -78578, -171000, -23317, 179427, -60916, -139807, 123149, -132334, -385328, 104879, -143231, 13406, -65151, -130579, 683, -348048, -99452, -59274, -262867, -199085, 29747, 74496, 61617, 20063, 6600, 218923, -294891, -242702, -80629, 298781, -352230, -124457, -69291, -153843, -40125, -123947, -169190, -186524, -192139, -199632, 3623, 42977]
19096D2977N8715h3364j71450q4485b6524D7838a29428j10084J9284g4343k30738
19085c05081A31114e3411A59913A2458c10719O1713r4284h9687D33252c07161
19074b54860A00673J9913c2761A17789R0979a27465J8813A38481a27726A78905
19063b2684q0569q6022N0641k06868J68604A05729a68329p5274a3438j33695k88054
19052d35187B4821a87761j69391f8388D3618h0020A88471R8904j08571M2178a72594
19040A02234P8089G4397P076b48728a8931B36779h8640L4674l1469k7601j68232
19029b81268H697b40158A1892J233J1638A1994a2197j9056r2430I9460a89341
19017B07306A1442a7824B5493P2454a11636A17835c98347e7134m8855B13174a75209
$$ y = [42977, 101692, -83364, -254814, -339299, -26524, 47838, -129428, -239512, -220228, -74343, -305081, 131114, -53411, 159913, 12458, -310719, -249006, -343290, -89687, 433252, -307161, -254860, 100673, 120586, -32761, 117789, 208768, -127465, -108652, 138481, -127726, 178905, -22684, -103253, -189275, -138634, -345502, -176898, 105729, -168329, -243603, -13438, -147133, -435187, 24821, -187761, -357152, -68388, 43618, -80020, 188471, 287375, 178804, 220982, -172594, 102234, 180323, 74397, 81473, -248728, -18931, 236779, -88640, -53966, -85435, -113036, -281268, 8697, -240158, 11892, 13125, 24763, 11994, -12197, -31253, -123683, 99460, -189341, 207306, 11442, -17824, 25493, 97947, -111636, 117835, -398347, -57134, -105989, 213174, -175209]
19005A34784c4472J3004o4583q2487b5330A75358i5920B30257h09A44476J53282
18994B97758I3366k7997a31767F526a26644D183K04838a80948O8631j03223A70799
18982i9962A40748J41614e0358c778C36451A7262J52303g1779l51721A4941b12950
18970i9002L1936e218j94954I6133a97850j19720B6108J6054D896L01408c51948
18958A99219J12178g7377C91094F7466c3522B59113b7599k99743i8263F6271b90003
18946A11709a5816C10618h0281K6798j1686A23623b72028a24731j2237f0449f66
18934e8428j44872c454n6287F9851h1619C6716a68788b669j25955N7967j87420
18923b58077m6598J21481F9590g09A91324c66995a17167A37341A915b10887A42585
$$ y = [134784, -34472, -21468, -86051, -168538, -25330, 175358, -95920, 230257, -809, 144476, 297758, 93366, 65369, -131767, 6526, -126644, 4183, 209021, -180948, -112317, -215540, 170799, -99962, 140748, 282362, -50358, -3778, 336451, 17262, 169565, -71779, -423500, 14941, -212950, -99002, -67066, -5218, -200172, 96133, -197850, -317570, 26108, 42162, 4896, 306304, -351948, 199219, 311397, -77377, 391094, 67466, -33522, 259113, -27599, -327342, -98263, 66271, -290003, 111709, -15816, 310618, -80281, -53483, -65169, 123623, -272028, -124731, -136968, -60449, -666, -58428, -203300, -3454, -59741, 69851, -81619, 36716, -168788, -2669, -128624, -70657, -258077, -304675, -183194, 69590, -709, 191324, -366995, -117167, 137341, 1915, -210887, 142585]
18911c18427F6374h3303E18565A83303P4050a70259G6980a42484A67809a83943
18900d89491K11877J33613q4969b5244o0507n0465l2314m3707e2007j80432g5899
18888a49279E4674a63728F8031a58067A35131b77325Q7537g1619A35275P1984
18878B07259C3239a51872B6173b34567M0676A01588b50839a16319N5248A0946
18867i7231l3944A3456i9107k93938E7697a93993A32568c36150g9694B11783q5256
18856A26527a11769e3249B643J36021a43538A87949a82517F6713L8723h2980j81159
18845b64139Q9365A16770b85215A48547m686b11317Q2573I0773K59452a65752
18834A49942b35352B2266d14792i7504d7132j40640O3067K992A67192c6487A7516
$$ y = [-318427, 66374, -83303, 518565, 183303, 257353, -170259, 76980, -142484, 167809, -183943, -489491, -277614, -144001, -228970, -25244, -85751, -136216, -168530, -212237, -52007, -232439, -75899, -149279, 54674, -163728, 68031, -158067, 135131, -277325, -189788, -71619, 135275, 207259, 33239, -151872, 26173, -234567, -193891, 101588, -250839, -116319, -61071, 10946, -97231, -131175, 13456, -99107, -393045, 57697, -193993, 132568, -336150, -79694, 211783, 126527, -111769, -53249, 2643, 138664, -143538, 187949, -182517, 66713, 105436, -82980, -264139, -174774, 116770, -285215, 148547, 143861, -211317, -128744, 90773, 350225, -165752, 149942, -235352, 22266, -414792, -97504, -47132, -187772, -124705, -121713, 167192, -36487, 17516]
18822c28535a33766q9941F6200c01933C09283I7716a80131P2096j69640F2427
18811D33962q9579o6988j03710n9082i294j67963l6654K1283B8960a17045N0688
18800f6357j84018B20857a7881C6124A1575f3069j35271A47701K9032Q215a82152
18788a17291A24133i4547C50255A3955K4908L37695c41373I5336L9863a48293
18777c51363e470B90084b97441o3583B27830N1312j29275h2293p6772L0646A53167
18765a2597F6917R083i3671F2601c19390B33113j06105e0048j21461G8170a78452
18753b23157i6514L8815K6383j46769o7465H4615f3157n7046B02554F6046J38652
18742B04698i2894j57935B22072b15296Q5283f4453k57069b2233D2760b86683
$$ y = [-328535, -133766, -223707, 66200, -301933, 309283, 97716, -180131, -108035, -277675, 62427, 433962, 344383, 277395, 173685, 114603, -9294, -177257, -213911, -192628, 28960, -117045, -66357, -250375, 220857, -17881, 36124, 11575, -63069, -198340, 147701, 176733, 184948, -182152, -117291, 124133, -94547, 350255, 13955, 38863, 376558, -341373, 95336, 135199, -148293, -351363, -5470, 290084, -297441, -361024, 227830, 279142, 149867, -82293, -159065, -128419, 153167, -12597, 66917, 76000, -93671, 62601, -319390, 233113, 127008, -50048, -171509, 78170, -178452, -223157, -96514, -57699, -31316, -178085, -245550, 84615, -63157, -120203, 202554, 66046, 204698, -92894, -250829, 222072, -215296, -130013, -64453, -321522, -22233, 42760, -286683]
18731a90785j0101B03816c6961n8895j09359B02283E2998D851b47100g6619k40581
18720c17200c5671a85B93966a99103a1510k23471B30166A08180a81640B40453
18709I7341d7000C18720D3340o332K4639c58076B14070A5621d38381J91286f5972
18697b02039A4213b00609N0816b6736D7377J89145a86122C9036J3475f6862B7927
18685a04243A72013a21582c0370C9488a75188q8694A23332N0824k8713g8060p3340
18674a51400m2269c8690j90612h9605m35051A02298D6587c0208j67563B20461
18663e1100A18752b01991c6622j5242Q115k27819k1944l15567b48288J18639r371
18652a39020C6482a07395o3758g9128F1719b63942A8774c4447C09982E6298a0574
$$ y = [-190785, -200886, 203816, -36961, -95856, -205215, 202283, 52998, 4851, -247100, -76619, -317200, -35671, -185, 293966, -199103, -11510, -234981, 230166, 108180, -181640, 240453, 97341, -47000, 318720, 43340, 37008, 61647, -358076, 214070, 15621, -438381, -247095, -65972, -202039, 14213, -200609, -149793, -26736, 47377, 236522, -186122, 39036, 52511, -66862, 27927, -104243, 172013, -121582, -30370, 39488, -175188, -263882, 123332, 174156, 145443, -78060, -151400, -193669, -38690, -229302, -89605, -524656, 102298, 46587, -30208, -197771, 220461, -51100, 118752, -201991, -36622, -51864, -43749, -271568, -293512, -609079, -248288, -129649, -139020, 36482, -107395, -171153, -79128, 61719, -263942, 18774, -34447, 309982, 56298, -10574]
18640H5330c7253n39691K67138A24433a05928A26680h928k0259D6990N8632D4318
18628c7467q7318B6716R4786j4974d7146j38128p8359j9156A42681J32211c32502
18616e3592A14153h8719l00686J06995b9051j94346K0921B67198D61b2167l6626
18605e8793E2710h6605k43795C1008c9840C04624a79476B1671J5255K9882k6307
18594D0501g8556l599j66176i2092o7356A13259B0624a20644A74640b86464A02845
18582H498R8925g4304j76396C2638K87362a9710k31606D9100b5768l96764J58063
18571b64469M2906I5565h560B42620D0911a53020A59497m3919J4015b66509A22736
18559a00653k33610C5818r749a45443M6267B8124Q3311C1370l629O0277k2886
$$ y = [85330, -37253, -576944, -309806, 124433, -105928, 126680, -8928, -29187, 46990, 105622, 44318, -37467, -124785, 26716, 121502, 106528, -47146, -185274, -263633, -282789, 142681, 274892, -332502, -53592, 114153, -88719, -389405, -282410, -29051, -223397, -202476, 267198, 461, -22167, -58793, 52710, -86605, -330400, 31008, -39840, 304624, -179476, 21671, 36926, 66808, 40501, -78556, -82155, -248331, -92092, -159448, 113259, 20624, -120644, 174640, -286464, 102845, 8498, 107423, -74304, -250700, 32638, 320000, -19710, -251316, 49100, -25768, -422532, -264469, -221563, 95565, -8560, 242620, 40911, -153020, 159497, 115578, 129593, -266509, 122736, -100653, -334263, 35818, 26069, -145443, -99176, 28124, 111435, 31370, 27741, 88018, 65132]
18548F5132L4212J52936a80406g5380o7272j3726k02216B79204A17250J09816
18538B27066r9163D2649b65537a5354B57888D0398a65269C99023a19308M2726
18528g6582g429o1778J4545l60062A04439a38181d6773j02803M7527k01277J47678
18517a55648C720a74560A84955H7741b03606f8858r1713B24734J3802c97660B72486
18505A52237G5031a07188d6994B90734b6671r1294j6078M1142B72891C352a67899
18493B6572P4728c82796J56355b138A53119d0138r8393l0120e6696A9259K57947
18482B77206A22596P3576c11589I3729e9544B7231d2129k1768c14E6861A9068
18470a77093d7012k15631h152m3779a6618j83600g5424H9035K8662b33771B82904
$$ y = [65132, 99344, 252280, -180406, -75380, -142652, -156378, -358594, 279204, 117250, 227066, 127903, 42649, -265537, -15354, 257888, 40398, -165269, 399023, -119308, -76582, -7429, -69207, -54662, -414724, 104439, -138181, -46773, -149576, -102049, -303326, -155648, 3720, -174560, 184955, 87741, -203606, -68858, -160571, 224734, 238536, -397660, 272486, 152237, 75031, -107188, -46994, 290734, -26671, -117965, -134043, -92901, 272891, 3352, -167899, 26572, 101300, -382796, -226441, -2138, 153119, -40138, -138531, -168651, -56696, 19259, 277206, 122596, 196172, -311589, 93729, -59544, 27231, -42129, -63897, -314, 56861, 19068, -177093, -47012, -262643, -8152, -51931, -16618, -200218, -75424, 89035, 117697, -233771, 282904]
18458B0486h8970B37426j04501b15574B04776r1306a89104a6396B41217G1414
18447h554A55532p5905K03390r6636J55247b17806f0089H3779b7583r6021f9F97376
18434a52045j32090J15317F4103M8479c13099B02128f0701A89527c929k84568
18424b88497c4281A12789n0359A1645c5136r2501A07242D2010c00706J43441j20536
18413b77801c8837A16978J62579F2033J12701j3612P1316a68471G4682b8221j76776
18402b04997I9193J07087B1284b0409j27823A22892b43848q3479Q648J48828d9659
18390E1103a47022A01123a04672p0018H8605b16287f0845j34971J2421j11703
18380b95098A83328Q1841a92282e1621B1012a18740B79216C5020J11273a11200
$$ y = [20486, -88970, 237426, 132925, -215574, 204776, 113470, -189104, -16396, 241217, 71414, -8554, 155532, 79627, 283017, 186381, 341628, -217806, -60089, 83779, -27583, -123604, -69, 697376, -152045, -284135, -168818, 64103, 112582, -313099, 202128, -60701, 189527, -3929, -288497, -34281, 112789, 62430, 11645, -35136, -127637, 107242, 42010, -300706, -157265, -277801, -38837, 116978, 279557, 62033, 174734, 161122, 232438, -168471, 74682, -28221, -204997, 99193, 206280, 21284, -20409, -148232, 122892, -243848, -327327, -318679, -169851, -49659, 51103, -147022, 101123, -104672, -174690, 88605, -216287, -60845, -195816, -183395, -295098, 183328, 265169, -192282, -51621, 21012, -118740, 279216, 35020, 146293, -111200]
18369C3487e5941B29a77350B42339d30069a14951j06678m8605A8579b05729k17315
18358d23044G30f898n9386B93183b26439j29986A60699c7804k49704J28505k45137
18347d04140b8860j85011j0808D5806N3469k6658j9505g73B0424L29952a10271
18335A15306B2328e3411A9829P8899l3934J6018C7949a47457M1113K7270c4842
18323H6526f3470G635a24797K6083E4304c25903e3899B55949D5549b01765C936
18311H4356I367a26643k11307a41155P212j18860M6798A42999C9200j0383b4903
18299i8449n2651A41098J24595c58143e7982A77087K01085h8047A01341a85316
18288b11207i6145n5673a3133j25549K4287o350k42883n1359E8668R6174G3650
$$ y = [33487, -55941, 229, -177350, 242339, -430069, -114951, -221629, -270234, 18579, -205729, -423044, 730, -6898, -66284, 293183, -226439, -356425, 160699, -37804, -287508, -159003, -404140, -28860, -213871, -224679, 45806, 99275, 72617, 53112, -773, 20424, 350376, -110271, 115306, 22328, -53411, 19829, 98728, 64794, 80812, 37949, -147457, -106344, -79074, -34842, 86526, -63470, 7635, -124797, -98714, 54304, -325903, -53899, 255949, 45549, -201765, 3936, 84356, 9367, -126643, -337950, -141155, -133943, -252803, -206005, 142999, 39200, 28817, -24903, -98449, -151100, 141098, 265693, -358143, -57982, 177087, 378172, -88047, 101341, -185316, -211207, -96145, -151818, -13133, -138682, -114395, -120745, -363628, -414987, 58668, 154842, 73650]
18276f8279H0942C4186a80667B2433d2437C13378j31616D071J68966R1232E963
18264C43836E5462a9772H5330a05609B59261F5749a73264L2962G0258j337B8053
18252A5608L0205R6181C6166J35494N4645b06343O4243C48237d76489C1644O003
18241C7647b99521i2390A05749B3900c19089A32283a67280B7056M5269a26624
18230B17334H5505p717h3447m9923l02373A12014I105g4866o7841A92481c6195
18218A41970f0711L345k83613k3592A2787P5489Q6743a84014C4311M25889A188
18206c4969j35630f3470j59935C03127j14486b99269f7304b8400A90653a67818
18195A3806b1785j25125e7884j0536H8724a94761A79044K5118j9566a07344l31316
$$ y = [-68279, 80942, 34186, -180667, 22433, -42437, 313378, 181762, 4071, 173037, 264269, 5963, 343836, 55462, -19772, 85330, -105609, 259261, 65749, -173264, -140302, 70258, 68921, 28053, 15608, 45813, 141994, 36166, 171660, 226305, -206343, -142100, 348237, -476489, 31644, 37647, -299521, -92390, 105749, 23900, -319089, 132283, -167280, 27056, 72325, -126624, 217334, 85505, 77788, -83447, -133370, -435743, 112014, 9105, -74866, -142707, 192481, -36195, 141970, -60711, -57366, -340979, -364571, 12787, 88276, 175019, -184014, 34311, 460200, 1188, -34969, -170599, -63470, -223405, 303127, 188641, -299269, -67304, -28400, 190653, -167818, 13806, -21785, -146910, -57884, -68420, 88724, -194761, 179044, 204162, 184596, -107344, -438660]
18184d38660c8188j72754j42910h2095B31789e1503A22687J58720b71259P2445
18174a98814A2583h9369B86607a924l45200F4510d1387A54555a9263A61523o3938
18163I7585f6851G0860a43988G8323b91222a8981C93814b13240O7102p7566A28140
18151b43299A13688P2111c2560j0461l32432i1516B73723A3802J69223n4221J31882
18140B60686a22668l61380a37520l2161C39522b07184p7327B8596a49393g4511
18129f0273n1236B33727f5976k7710C40320a40302O1241K7134L70n9432l7368
18118a48357M1146A19622b15763E8028K26203A25887O2241e8994k60803a58951
18107c53121A01160l5636a6595I1854b85613f0797j53713A63665a16717L5389
$$ y = [-438660, -38188, -210942, -353852, -82095, 231789, -51503, 122687, 281407, -271259, -198814, 12583, -89369, 286607, -1924, -347124, 64510, -41387, 154555, -19263, 161523, 97585, -66851, 70860, -143988, 78323, -291222, -18981, 393814, -213240, -146138, -223704, 128140, -243299, 113688, 185799, -32560, -43021, -375453, -91516, 273723, 13802, 183025, 128804, 260686, -122668, -484048, -137520, -169681, 339522, -207184, -284511, 28596, -149393, -74511, -60273, -111509, 233727, -65976, -93686, 340320, -140302, -79061, -51927, -51557, -110989, -148357, -107211, 119622, -215763, 58028, 284231, 125887, 188128, -58994, -319797, -158951, -353121, 101160, 65524, -16595, 91854, -285613, -60797, -214510, 163665, -116717, -81328]
18097h1328D46109A5536a68756I0847d8694n8930j08896K7878b0851n6985A09063
18085a44101H817J25655n9881J91J82929B8793e7579j64636A84232b50464r0788
18074c41252B37225F8879c79844G0790c81522A39619C7080c44322a41635C20491
18063I0964d4247p2035c9523A34191a5512G438b9812B05164b156j18483q9132
18052b09771C7990J12800a86856C4987b75057d8849k01335d158C2604a9760l0828
18041e0588m521k28971j9425A57173P562i1596B06557a69827A93672g1673k0976
18030i2649C9169O4610g1922r4525k1388d5742j28093M3119J5122j48177J23461
18019a40310E6137P4500n2809P7714b46209A17874C1617J55078a12787j14435
$$ y = [-81328, 446109, 15536, -168756, 90847, -48694, -107624, -216520, -188642, -20851, -77836, 109063, -144101, 8817, 134472, 74591, 74782, 257711, 28793, -57579, -222215, 184232, -250464, -341252, 237225, 68879, -379844, 70790, -381522, 139619, 37080, -344322, -141635, 320491, 90964, -44247, -116282, -39523, 134191, -15512, 7438, -29812, 205164, -2156, -120639, -209771, 37990, 150790, -186856, 34987, -275057, -48849, -250184, -4158, 32604, -19760, -50588, -55109, -284080, -303505, 157173, 164735, -91596, 206557, -169827, 193672, -71673, -92649, 39169, 103779, -71922, -166447, -187835, -45742, -173835, -130716, -115594, -263771, -140310, 56137, 130637, 77828, 155542, -246209, 117874, 31617, 186695, -112787, -227222]
18009b27222H6819c7j84959k1380D4331J53072I4898R8704i2167B21720b60729
17997H5673K55067c6853B56528n1242J26355i9299n8683P4361E5609i4099K9811
17986f4288F0674O6113M5193B6920L8596a54808A95406p8662O7560C1338b99755
17974A16417P7353i5889K0136I3990e57234A03070J86516o9563a35794B48345
17963A16650c81391A61274K0474b38866H4493a40017B14072g012m7787a0347B27334
17951B80040j8212a29178m1508A37447g1289n4986p8979B33275D6251O2141b18393
17939b8624k48158J4087A5365a48500A36488c15296n6744h8892K063j47800P7819
17928a56810C44203a53030M3357L7709D9517J19009g5081k6742A45968i0905P723
$$ y = [-227222, 86819, -37, -184996, -206376, 44331, 197403, 94898, 193602, -92167, 221720, -260729, 85673, 340740, -36853, 256528, 205286, 331641, -99299, -157982, -83621, 55609, -94099, -64288, 60674, 126787, 171980, 26920, 65516, -154808, 195406, 116744, 184304, 31338, -299755, 116417, 193770, -95889, -75753, 93990, -557234, 103070, 289586, 220023, -135794, 248345, 116650, -381391, 161274, 181748, -238866, 84493, -140017, 214072, -7012, -54799, -10347, 227334, 280040, 261828, -129178, -170686, 137447, -71289, -126275, -205254, 233275, 46251, 108392, -218393, -28624, -276782, -262695, 15365, -148500, 136488, -315296, -372040, -88892, -86829, -234629, -156810, 344203, -153030, -109673, -71964, 49517, 168526, -75081, -101823, 145968, -90905, -83182]
17917h3182J1474B10743b94518j80493d4370C07946d8952q2197m039j02352D04198
17905b24232G1505a85364M7924m6106B0064a89052Q2188B74178b3312F5229P7086
17894A42315b14215k32708J42243B87383g7145C53964l3172i0659B8534o88M6385
17883G4231L2518a7476A48352b79783F4852g4000B0233a55124D4187K49219a41085
17871b38339H3050e1174k842j4897k06399d7530B16759C0423a65084e7386o4297
17860a21683C19861b5639j35553B16927H5320h4068l5111E0770L9819l3730B0090
17848B81484J2459a73040l610l29925I8631a00331B27042o5585C0404a24918n3177
17837a78095f4460q2218C1312R1463a32999p7036B02903D3383a89369j01773a8464
$$ y = [-83182, -71708, 210743, -294518, -475011, -44370, 307946, -48952, -131149, -135188, -237540, 404198, -224232, 71505, -185364, -137440, -183546, 20064, -189052, -106864, 274178, -23312, 65229, 142315, -214215, -446923, -304680, 287383, -77145, 353964, 320792, -90659, 28534, 27846, 74231, 106749, -17476, 148352, -279783, 64852, -74000, 20233, -155124, 44187, 293406, -141085, -238339, 83050, -51174, -54016, -68913, -275312, -47530, 216759, 30423, -165084, -57386, -121683, 319861, -25639, -161192, 216927, 85320, -84068, -119179, 50770, 90589, 56859, 20090, 281484, 293943, -173040, -176650, -506575, 98631, -100331, 227042, 161457, 30404, -124918, -178095, -64460, -146678, 31312, 122775, -132999, -210035, 202903, 43383, -189369, -291142, -18464]
17825a5053l7583k77643m2957J83974C398b0631j52027j7377C46567L1060e1567
17813B07123b3507k938C97442D2729a06270H6236B4622K21472E337K36846c68493
17801a27484M8061B9414J03094A2248P8240b86713A44089h4345D4420b2726A59396
17789A75711m1722A9596f0326A57157j3868o4329d7783j29480D07737f010l54900
17778c60910B6639j1171e0745J905B16810r7484J47752c85977a9475k7026l8781
17767h5282m5396j6787B2278J3626a80970H6295J46645a18931B28054g7346k02455
17756b79801A66326a55514C3527L28050A13288O664c1743j34274A29124F204b38280
17744b72777H7798j3134a60016K3255B61647a03958p2752E3219L9704a85796A28365
$$ y = [-15053, -52636, -330279, -373236, -189262, 3398, -20631, -172658, -190035, 346567, 377627, -51567, 207123, -23507, -26445, 397442, 42729, -106270, 86236, 24622, 246094, 5337, 242183, -368493, -127484, -79423, 29414, 132508, 12248, 90488, -286713, 144089, -84345, 44420, -22726, 159396, 175711, 133989, 19596, -60326, 157157, 143289, 78960, -47783, -177263, 407737, -6010, -360910, 26639, 15468, -50745, -48840, 216810, 119326, 267078, -385977, -19475, -46501, -85282, -130678, -147465, 22278, 35904, -180970, 86295, 232940, -118931, 228054, -77346, -279801, 166326, -155514, 33527, 361577, 113288, 119952, -31743, -166017, 129124, 6204, -238280, -272777, 87798, 74664, -160016, -136761, 261647, -103958, -176710, 53219, 92923, -185796, 128365]
17732a7587j42525A1225C956N9720K29950a03658Q715A17541M16362A98978q6509
17721A12469k9984h9695m63j82427a17767D66132B14795j7984c44193a13534H25
17709A24431f2758B03628g2494m856K5122B6828I656d7603B40759q7574C896h0660
17696E09848c758j9051E5304J68226A07733b61900d7006G2582g4642j51852B8095
17684A32363a3323A2515J15214B6656c44634j3361a11808N3056G9280K2944j3829
17673H8395J690K03081I6048j7964a56371A79256a87002D9350L46293L8171I95
17661a97699B49203C058b06983H3173a85229A39209b51155c9886G1397c3114k00204
17650b33318b2304A33890c2582A82345F4874e3407J9586A28838l2708J26791b02253
$$ y = [-17587, -160112, 11225, 3956, 63676, 293626, -103658, -94943, 117541, 533903, 198978, 112469, 82485, -89695, -90158, -272585, -117767, 466132, 214795, 196811, -344193, -113534, 825, 124431, -62758, 203628, -72494, -77350, -52228, 26828, 9656, -47603, 240759, 153185, 3896, -80660, 509848, -3758, -22809, 55304, 223530, 107733, -261900, -47006, 72582, -74642, -226494, 28095, 132363, -13323, 12515, 127729, 26656, -344634, -357995, -111808, -58752, 79280, 102224, 88395, 90085, 293166, 96048, 78084, -156371, 179256, -187002, 49350, 395643, 433814, 995, -197699, 249203, 3058, -206983, 83173, -185229, 139209, -251155, -39886, 71397, -33114, -233318, -22304, 133890, -32582, 182345, 64874, -53407, -33821, 128838, 96130, 222921, -202253]
17638a86966P0406C81901d336C1925J95952E094a30191j38966B19538J0238b58677
17626g2773A25735a52488L4080c1163B74852A03472N6217p0241j5749a7982p5017
17615i2999K0005C2585f6746C31776f0547A07615a97692K9875E3522g7476A74955
17603a2370B0333b27407C1637N8965c24649F1130a27235A79043R9131e8648a4613
17591e6803k04896C1619N0955l6691J87786n3270c7380J4539A80073f4140B20310
17579a8076o7809n9896N0842A66900C8430a73500B12308i0818B90937k0247d4990
17567a22641A4580N19352b60269B85056g5530j68812a8962A29895J95886c2295
17556B2789P0149j9440J13071b15841i5542H0400J78923j26643f9002G0663M6185
$$ y = [-186966, -116560, 381901, -4336, 31925, 227877, 5094, -130191, -269157, 219538, 229776, -258677, -72773, 125735, -152488, -118408, -31163, 274852, 103472, 159689, 89448, 73699, -17982, -92999, -72994, 32585, -66746, 331776, -60547, 107615, -197692, -167817, 53522, -77476, 174955, -12370, 20333, -227407, 31637, 90602, -324649, 61130, -127235, 179043, 278174, -58648, -14613, -56803, -261699, 31619, 82574, 45883, 233669, 180399, -37380, -22841, 180073, -64140, 220310, -18076, -85885, -145781, -94939, 166900, 38430, -173500, 212308, -90818, 290937, 270690, -44990, -122641, 14580, 533932, -260269, 285056, -75530, -244342, -18962, 129895, 325781, -32295, 22789, 92938, 73498, 186569, -215841, -95542, 80400, 259323, 132680, -69002, 70663, 116848]
17545A16848d3072C34248A61294F2179K3762K17963b1259C1110e7100A26864E8602
17533B9051N3376c6063A3658J08110a04352a1619C85997b25987Q9737M1169N486
17522h9595L4535B43516p2091l5878E7999a05582A78124J8656E3789A3408K72854
17511B86262i2720C18838a5782n08423A97409o1576c29192A21398N0817j3899
17501A58316d6829B47605A16450P0278a4208H1777J14423q2947m0058O087J35614
17490B14896a38412f3475A94768a74918g5219E32612A38286k3388R1411H9746
17479A12908C5033L5441N03282B01783o6746j8381d4022D37079K7451i8256C17059
17467A67714D5958K7099K7113a38081C04721F7308b54832A85659n3495J0631J42143
$$ y = [116848, -43072, 334248, 161294, 62179, 85941, 303904, -21259, 31110, -57100, 126864, 58602, 29051, 82427, -36063, 13658, 121768, -104352, -11619, 385997, -225987, -136250, -95081, -89595, -55060, 243516, 171425, 135547, 57999, -105582, 178124, 196780, 53789, 13408, 286262, -92720, 318838, -15782, -524205, 197409, 135833, -329192, 121398, 172215, 158316, -46829, 247605, 116450, 186728, -14208, 81777, 196200, 113253, 73195, 79282, 214896, -138412, -63475, 194768, -174918, -75219, 532612, 138286, 114898, 206309, 89746, 112908, 35033, 70474, 573756, 201783, 135037, 116656, -44022, 437079, 464530, -98256, 317059, 167714, 45958, 73057, 100170, -138081, 304721, 67308, -254832, 185659, 132164, 142795, 284938]
17456B84938B9816f2941H0964a98731k14952B96878o8853k4746A0048g9932D10554
17444H1658c7263A2695J97705M1634J4326F8174o803R8127G133J89977a2780A93125
17431A21294J10783n7455C0208M00337B02106K43029o0659K59072k33297g9275
17420C87483J62330k30138j46137m4600b2180C83361j9401A02264K79551n9453
17410C22362a0332C29672Q6148a27017G9300h9776D51498A52271a82311A43634
17399i5941B79940J72542e0427B73969F9266J5249a67582k1317B08147g7793D04915
17387g4835B49070M3507r9959J41769b33039a08448A02772M2850l544f3766D14650
17375A98703K421K3936b49675L8412M2073B30327b7715j05306E24400a38407A33282
$$ y = [284938, 29816, -62941, 80964, -198731, -413683, 296878, 228025, 203279, 10048, -79932, 410554, 81658, -37263, 12695, 210400, 252034, 266360, 68174, 61371, 159498, 7133, 197110, -12780, 193125, 121294, 232077, 174622, 30208, 430545, 202106, 445135, 384476, 643548, 410251, -79275, 387483, 549813, 319675, 173538, 128938, -22180, 383361, 363960, 102264, 381815, 322362, -10332, 329672, 415820, -127017, 79300, -89776, 451498, 152271, -182311, 143634, -95941, 279940, 452482, -50427, 273969, 69266, 84515, -167582, -188899, 208147, -77793, 404915, -74835, 249070, 292577, 192618, 334387, -233039, -108448, 102772, 145622, 142078, -63766, 414650, 198703, 201124, 225060, -249675, -211263, -169190, 230327, -27715, -133021, 524400, -138407, 133282]
17363A98390I0479g1179C6237J58192b3954B1736K62786A13386f786C04890j8696
17352B86194f0460K1308F0841J64695m3639p6753K06880h4623H2949C6194f1368
17340H0261K29410J0147M7372b6170A93932N7339p3847Q5472m1382A1500c49321
17328a30568A44943k7803K85918j70737C6349Q4190A0840M2303J22807e638B0695
17316A24754J25607H3738j8439K15877J00609E753J82872F6360L76967A79653
17305A17470K23170A069K98515j12548e1430J6358B26976b42C30117A49323j7845
17294A31478g1008A76013P9655B0221M45348E7190J85267G9774R4661b74919D08757
17282B43730J43667j65018a3923A0981B521J53047K13066o1194p3224A12167e503
$$ y = [198390, 90479, -71179, 36237, 194429, -23954, 21736, 284522, 113386, -6786, 304890, 286194, -60460, -39152, 60841, 225536, 181897, 105144, 312024, -84623, 82949, 36194, -61368, 80261, 309671, 319818, 367190, -26170, 193932, 251271, 177424, 262896, 221514, 11500, -349321, -130568, 144943, 117140, 403058, 232321, 36349, 120539, 10840, 53143, 175950, -5638, 20695, 124754, 250361, 83738, 65299, 281176, 381785, 5753, 188625, 66360, 443327, 179653, 117470, 340640, 1069, 299584, 187036, -51430, -35072, 226976, -242, 330117, 149323, 131478, -71008, 176013, 255668, 20221, 465569, 57190, 242457, 79774, 174435, -274919, 408757, 243730, 387397, 222379, -13923, 10981, 2521, 155568, 368634, 307440, 234216, 112167, -5503]
17270d9224C68306j61734K69243j09198A31953J65783l6246H5978J85527J67846
17260D39351c7641A40468h0669G8540B7330K27707k0378C6048L95590C9231K44579
17249B83810K5617A36521a39095B78206J04606j27660a35861A21050K3397K63628
17239D08075j07273a96914A74064J63176b65653A91315J9798H2779l4683j524
17229D6572K58472l1240a46804G6956j3439L7899k2513J65456K6737I0090K08020
17218B98110i8892D6428J02182N4999G5798k3078M0981c3241j24494F3536N2388
17207A15924K17170j44029m0992R7120c8141A96216n7873N1476L5656n3295H258
17195A49512R9700J49865j84760q2182J38521F031J18657B7220J46139K3937P396
$$ y = [-49224, 368306, 206572, 475815, 366617, 131953, 297736, 261490, 85978, 271505, 439351, -37641, 140468, -80669, 78540, 27330, 255037, 234659, 36048, 431638, 39231, 283810, 309427, 136521, -139095, 278206, 382812, 255152, -135861, 121050, 144447, 408075, 300802, -196914, 174064, 337240, -265653, 191315, 211113, 82779, 48096, 46572, 305044, 273804, -146804, 76956, 63517, 101416, 78903, 244359, 271096, 90090, 298110, -98892, 46428, 148610, 203609, 75798, 52720, 93701, -33241, -157735, 63536, 115924, 333094, 189065, 148073, 245193, -38141, 196216, 138343, 189819, 225475, 172180, 8258, 149512, 249212, 399077, 214317, 132135, 270656, 6031, 124688, 27220, 173359, 197296, 204692]
17184B04692o978L61168H8303j4675K77666K64283k17474q5144A1204J46606b9954
17172F8732K02254p9248J57790m2038k2971J66887j27085A11874J99516L9902
17162C51292A75206o6307J72429f3208B88830O4860j3701a693E11523j30136j63305
17151B18082R9662m3585B9024P12637C29056a39052A18706l7730J26580m1818
17141A65738n2303M29247j95801B9771N340a0918D08308m631k00434P5289F4958
17129C35294n0239k606E239O98390j18453B33602J94314C3672K85651J35164j02730
17118C51757J18370A02496L17224j48338D3801L20859J11479r8016A80750R6883
17108B77633M0035j50723J49542H4801j8784k3964O33253j85942r7040q5536m8477
$$ y = [204692, 197714, 558882, 88303, 73628, 351294, 615577, 398103, 312959, 11204, 157810, -29954, 68732, 270986, 191738, 349528, 307490, 284519, 451406, 324321, 111874, 311390, 351292, 175206, 108899, 281328, -63208, 288830, 353690, 339989, -1693, 511523, 381387, 218082, 317744, 274159, 29024, 741661, 329056, -139052, 118706, 80976, 207556, 165738, 113435, 542682, 346881, 29771, 35111, -10918, 408308, 403677, 203243, 278532, 64958, 335294, 285055, 282449, 5239, 703629, 585176, 233602, 427916, 33672, 319323, 454487, 351757, 470127, 102496, 419720, 271382, 43801, 364660, 476139, 378123, 180750, 277633, 317668, 166945, 316487, 84801, 66017, 42053, 675306, 489364, 392324, 306788, 258311]
17097B58311l3647K56787k35417J43156K42434p895k00315A97731N2772r2797
17087A57706M02834K58180l68255J23693r0341q9486K82634p4847B62942k2774
17077B40168O68J22116j06866L75272j73067K26748L9681C05116J68411Q2512
17067E56039k58863P9903J1061K52369j83477j11066O3396J03748K18478j96107
17057E35481k37579j24683M72646k18421j04424k3810n3683L8176O2089N1608
17047C97400M61511m06567A66354M75969j19578j37414J44618J61611r3406j38932
17037D59222A91079K83588K81755B61057J69446J52024n8762j01204n1634M15600
17027G86527C52420P0835K11512j85349K26582j00890K62140l68819J9198J11259
$$ y = [258311, 224664, 481451, 246034, 389190, 631624, 623729, 423414, 197731, 250503, 157706, 560540, 818720, 450465, 574158, 483817, 394331, 676965, 602118, 262942, 240168, 240836, 362952, 256086, 631358, 458291, 685039, 724720, 305116, 473527, 556039, 297176, 377079, 388140, 640509, 457032, 345966, 409362, 513110, 731588, 535481, 297902, 173219, 645865, 427444, 323020, 299210, 245527, 283703, 345792, 397400, 858911, 452344, 166354, 642323, 522745, 385331, 529949, 691560, 598154, 459222, 191079, 474667, 756422, 261057, 430503, 582527, 523765, 422561, 370927, 786527, 352420, 423255, 634767, 449418, 676000, 575110, 837250, 468431, 487629, 598888]
17017E98888k00664K15744p433N9547p7500P406O3140N3411o4838j20554L78691
17006I05838D40800M53527q4804j20030J6052J4852j86954A74529K04780K22303
16996F01612J0015J35055K69128l40374j1664R887r3390j01868O7504l4504J54312
16985F65713G2584M88623J30130K30574j26085P7746j79662R5668C81935L88791
16975G70726j39112M44818j84669K05686P7391E84711L11817k74401M02396l44723
16965F79800J87769j15905L10861j55115K15216k62562k01170j32214O93980k13945
16955A006715k25314N0456L90187O505l70278O0218J65264j55057M57197k67605
16945A118288L8860k04216L56491m14644K57515l94321Q0401K20728l77534M33755
$$ y = [598888, 398224, 613968, 606535, 666082, 588582, 595988, 659128, 712539, 647701, 527147, 905838, 440800, 894327, 809523, 689493, 705545, 720397, 533443, 174529, 379309, 601612, 611627, 746682, 1015810, 675436, 663772, 673659, 580269, 478401, 545905, 511401, 665713, 72584, 561207, 691337, 921911, 795826, 873572, 693910, 789578, 381935, 770726, 631614, 1076432, 891763, 1097449, 1174840, 584711, 896528, 622127, 1024523, 679800, 867569, 751664, 1062525, 907410, 1122626, 860064, 658894, 526680, 1220660, 1006715, 781401, 831857, 1222044, 1228549, 858271, 918489, 1083753, 928696, 1385893, 1118288, 1157148, 952932, 1309423, 894779, 1152294, 757973, 838374, 1059102, 681568, 1115323]
16935A115323k50941J36445j28002J8993M80671l04877P2444j20176O9683P5501
16925A165064k07469J64160J42913O3211j39068K64378j31128P029L853J64869
16915A497812k00075O1467k40451L07828m36368K85448J3834j56318M46449j66774
16905A412852K5069j7855k41627J45249R8114k06848L50596q0420k0459L9855
16895A504526O9121k92373N58397j52251k15922L77137p9266k01783K40940k62300
16885A546226J63732J24105J72483j11782M2561j30613j57203L75979q0013j00309
16875A845166L83099k27795j64653M67051l1456P5270J4387l32956O1242j63872
16865A925483J88175K70916M8747j06760L4355n2314L52502k94607K30286o9312
$$ y = [1115323, 864382, 1000827, 872825, 891818, 1372489, 1067612, 1140056, 1019880, 1089563, 1165064, 957595, 1121755, 1264668, 1327879, 1188811, 1453189, 1322061, 1329090, 1332943, 1497812, 1297737, 1359204, 1118753, 1426581, 990213, 1275661, 1289495, 1133177, 1579626, 1412852, 1437921, 1420066, 1178439, 1323688, 1421802, 1214954, 1565550, 1485130, 1464671, 1504526, 1573647, 1281274, 1839671, 1687420, 1471498, 1848635, 1769369, 1567586, 1808526, 1546226, 1709958, 1834063, 2006546, 1894764, 1937325, 1806712, 1649509, 2025488, 1945475, 1845166, 2228265, 2000470, 1835817, 2302868, 2271412, 2346682, 2361069, 2028113, 2089355, 1925483, 2113658, 2384574, 2433321, 2326561, 2360916, 2308602, 2661104, 2366497, 2596783, 2527471]
16855B527471q8084M81546m10805M5243K11872j1086K07448k35610K76309M899
16845C009203J9741K36147p6833k15522l1473J69184K09488K68409j44811J43978
16835C587511j7596J7398J90772k20348j51247Q39153r8616j62293R9428k07919
16825C876243L82784k97555M69511K08966j39501N395J45997m4037n5330L68384
16815D920857M90450l75573K02463K07612J61738K3420j28945J22505N14434k94677
16805E844284K07090L11684M93398k32908J9283J1377L78537K5288L77601l50245
16795G085389Q04650K1705J83956L698O39768k52072M66645N81165o0108J19813
16785I594609N94575o0702L47864K28672L186Q17606M48815J94704K36619L21588
$$ y = [2527471, 2439387, 2920933, 2510128, 2555371, 2767243, 2756157, 2963605, 2727995, 3004304, 3009203, 3028944, 3265091, 3188258, 2972736, 2941263, 3110447, 3319935, 3588344, 3443533, 3587511, 3569915, 3587313, 3778085, 3557737, 3406490, 4245643, 4147027, 3984734, 4084162, 3876243, 4259027, 3961472, 4430983, 4639949, 4500448, 4505843, 4651840, 4607803, 4552473, 4920857, 5411307, 5035734, 5238197, 5445809, 5607547, 5630967, 5502022, 5624527, 6138961, 5844284, 6051374, 6363058, 6856456, 6623548, 6642831, 6654208, 7032745, 7058033, 7435634, 7085389, 7890039, 7911744, 8095700, 8099398, 8739166, 8487094, 8953739, 9534904, 9474796, 9594609, 10189184, 10128482, 10476346, 10705018, 10708204, 11525810, 11974625, 12169329, 12405948, 12727536]
16775A2727536N95926L94351J99675O63105M10245O62574K70056Q03243O11380
16766A7338091O68875N10570Q94110N32529J195190L09679J068272P68565R44488
16757B4230369Q71167J175007J353731Q43481J363676J160889J597495J428840
16749C4024655J799773J849141J524025K389116J967366K210016K225542K751027
16741E0740661L075355L010644K890537L653851L623766M122835M780449M398906
16733H0297004N004682N134700N934848N800492O586739O975517P020768P896051
16725A30650801P402185Q315869P590628P901057P323649P138613O683893N306300
16717A88312995M567945L387773J632375K08245q54484k547728m153199m959640
$$ y = [12727536, 13323462, 13717813, 13917488, 14580593, 14990838, 15653412, 15923468, 16726711, 17338091, 18006966, 18517536, 19411646, 19944175, 21139365, 21449044, 22517316, 23285881, 24230369, 25101536, 26276543, 27630274, 28473755, 29837431, 30998320, 32595815, 34024655, 35824428, 37673569, 39197594, 41586710, 43554076, 45764092, 47989634, 50740661, 53816016, 56826660, 59717197, 63371048, 66994814, 71117649, 75898098, 80297004, 85301686, 90436386, 96371234, 102171726, 108758465, 115733982, 122754750, 130650801, 138052986, 146368855, 153959483, 161860540, 169184189, 176322802, 183006695, 188312995, 192880940, 196268713, 197901088, 198109333, 197254849, 194707121, 190553922, 185594282]
16709A85594282o967235o362280p900809q121333p968397q412883q400114p604880
16701A23856351p756592p194487o749113o481947n722683n720973n403760m503945
16693G4322851m656167m142969l860485l590175l763601k555542l007920k776146
16685D5969846k378699k328422j758044k260109j898050j726973j589330j521690
16677C0508529j360843r85177j312958j276376q99024j498254r28746m46196r16128
16668B0884827j313379n06808q30127l79408q44301o15193p59447o69339l39206
16659A4627619m41640n96695l55620o59719m04571n36420l22463n9053m23814
16650A0827624k1962n62564n22470m32748J09969l57891M8022j35144q33296l52294
$$ y = [185594282, 178627047, 172264767, 164363958, 156242625, 148274228, 139861345, 131461231, 123856351, 116099759, 108905272, 102156159, 95674212, 89951529, 84230556, 78826796, 74322851, 69666684, 65523715, 61663230, 58073055, 54309454, 51753912, 48745992, 45969846, 43591147, 41262725, 39504681, 37244572, 35346522, 33619549, 32030219, 30508529, 29147686, 28162509, 26849551, 25573175, 24674151, 23175897, 22247151, 21800955, 20884827, 19571448, 19064640, 18234513, 17855105, 17010804, 16395611, 15636164, 14966825, 14627619, 14185979, 13589284, 13233664, 12573945, 12169374, 11632954, 11310491, 11251438, 10827624, 10805662, 10243098, 9720628, 9287880, 9397849, 9039958, 9087980, 8952836, 8119540, 7767246]
16640G767246J00501J100l7599l94760l01398K129n51705m6176K47629m11788
16630F375179l70029J26933n9119o58759l3306j73888L56332q4274p07095K24055
16620D996029K1727j75212k01026k29341Q5828l0583k17890Q1911l6857k33560
16610D061026J66228n20797k77883J25712n4542P4123k32046L04549k57318K43760
16600C632812j66850m11275k983L32699k08291k22591j36607O815j11727K93470
16590C005472m78195L28113j50426j35766j93551J63382J56299j11699n6268k83363
16580B243998L44399l29578j32954k03379L08700l77443K37043J87091R2140k84986
16570B085031l25004M1490K91483k14246j91486K77865j69815j97634K77338m47434
$$ y = [7767246, 7867747, 7868847, 7831248, 7436488, 7135090, 7137219, 6585514, 6539338, 6786967, 6375179, 6005150, 6132083, 6072964, 5414205, 5380899, 5207011, 5563343, 5479069, 4771974, 4996029, 5017756, 4842544, 4641518, 4412177, 4498005, 4467422, 4249532, 4331443, 4294586, 4061026, 4227254, 3706457, 3428574, 3554286, 3499744, 3573867, 3341821, 3646370, 3389052, 3632812, 3465962, 3054687, 3051704, 3384403, 3176112, 2953521, 2816914, 2823729, 2712002, 3005472, 2527277, 2855390, 2704964, 2569198, 2375647, 2539029, 2695328, 2583629, 2527361, 2243998, 2588397, 2258819, 2125865, 1922486, 2231186, 1853743, 2090786, 2277877, 2370017, 2085031, 1760027, 1801517, 2093000, 1878754, 1687268, 1965133, 1795318, 1597684, 1875022, 1427588]
16560A427588L74174k74841M15457k85536R6078l99083J97492l69007K75875q3148
16550A375049L08926k24940K08553k91666J09359l08463K14432R5486l34739N8526
16540A210523J6335J8748k27556J31404J12920l739l57747K03986K32777k78627
16530A059024R9399O637k68757J16838K12209n00177L42139r691K38261k68151
16520A027731j67765L61580k15105K11658k38836m1853j88555L66736l5694k05699
16510H74198P6720R6164l80070J28184J99889J71078l11461j79609o160J25963
16500G94896N6339k17782J19694J95049l49545K96074k8517k69429J62848O3872
16490H23499j26742r639j31522q9337K72891P2451k11047R4043Q931L1822k40004
$$ y = [1427588, 1801762, 1526921, 1942378, 1656842, 1752920, 1353837, 1551329, 1182322, 1458197, 1375049, 1683975, 1459035, 1667588, 1375922, 1485281, 1176818, 1391250, 1486736, 1151997, 1210523, 1226858, 1245606, 1018050, 1149454, 1262374, 1258635, 900888, 1104874, 1337651, 1059024, 1158423, 1165060, 896303, 1013141, 1225350, 725173, 1067312, 1057621, 1295882, 1027731, 859966, 1221546, 1006441, 1218099, 979263, 937410, 748855, 1115591, 1079897, 874198, 950918, 1047082, 667012, 795196, 995085, 1166163, 854702, 675093, 668933, 794896, 851235, 633453, 753147, 948196, 598651, 894725, 866208, 596779, 759627, 823499, 696757, 687118, 555596, 466259, 739150, 811601, 600554, 694597, 703528, 735350, 495346]
16479D95346K06484J555p5439Q4012l49133L02052K42603k1853j58238k49989
16469D77400J43596P6201C35129K80681L9174j30564L25680D18408K01062k2149
16459E97321J1887O0438o3606j47399A42075O8021M22988k17092L26407j36943
16449F05456O721n2540j96440J15789J8490r7988J49812j88433J22051k8703q7691
16438C66524J13629n4046L4498p6310M09396B26990K47958j60910P2139j14224
16428B71953J7562q5735j6340L74465B39789Q7767K66791B38056M08550j38717
16418E07889j70795K76171l9899j38290J35811j23639J45005B59727K97324B04094
16407C74706R6132n2203r2127J51618j99437E0746L10316r4840o4751N3805A07163
$$ y = [495346, 701830, 703385, 627946, 711958, 362825, 664877, 907480, 885627, 727389, 477400, 620996, 697197, 335129, 615810, 654984, 524420, 850100, 418408, 619470, 597321, 609208, 669646, 606040, 458641, 142075, 210096, 633084, 415992, 742399, 605456, 612177, 559637, 363197, 478986, 497476, 399488, 549300, 360867, 482918, 454215, 366524, 480153, 426107, 460605, 384295, 793691, 226990, 474948, 314038, 386177, 271953, 289515, 203780, 187440, 561905, 239789, 327556, 594347, 238056, 646606, 507889, 337094, 613265, 573366, 435076, 570887, 447248, 592253, 259727, 557051, 204094, 374706, 470838, 418635, 326508, 478126, 278689, 50746, 361062, 266222, 201471, 255276, 107163]
16395C71045j50115J57617J01011A71105J8870J59227O3144A31412K56492A47506
16384C85188J44714F8125k4234J77656L73718j49727J67565r8575I2673J72994
16374B65667j26840D1083L72553A66654J65468j31236Q8314J3041M4573m2163
16364C04651R6193j69732K41461j59088o2350A06932N0948P368R9195j00048A4182
16352B34880J43623r3509l1743H4188c1999B11486K4186q0595c07689D3028J30264
16341A73292D5682M92001A24155Q4593I8929J02260K67457A54075G521K32571
16331B40092N0635a40737A82852L59896f6719A92622E7148K32600a82309A68965
16320C8041R7303m4473a9988B22772a2862E39554A56141N1459D0650J41467K09766
$$ y = [371045, 220930, 378547, 479558, 171105, 189975, 349202, 412346, 131412, 387904, 147506, 385188, 529902, 68125, 43891, 221547, 595265, 445538, 613103, 514528, 92673, 265667, 138827, 41083, 413636, 166654, 332122, 200886, 289200, 302241, 346814, 304651, 400844, 231112, 472573, 313485, 251135, 106932, 157880, 165248, 264443, 164395, 14182, 234880, 378503, 284994, 253251, 84188, -31999, 211486, 235672, 155077, -307689, 43028, 173292, 45682, 537683, 124155, 208748, 98929, 201189, 468646, 154075, 7521, 240092, 290727, -140737, 182852, 542748, -66719, 192622, 57148, 289748, -182309, 168965, 38041, 135344, 90871, -19988, 222772, -12862, 539554, 156141, 207600, 40650, 182117, 391883]
16309C91883j59522o2982F5811K51383A49757J61323a09529B32956L4537q1783
16299A85710g1811B80363A25867J46034p8047I2019a0756l5820o3123B95189G7178
16287i1678B32172H7280g0981I1523K6049a72315c2361I4082O9538o3696m4749
16276E5175a15753A89177h9604c0430C0659J1067A9727K77895j04053j8353J17789
16265B93005d3098q0687D29976c4135C1136J89597K51952E8053J48470D5547b40787
16253a26117M4817H2246J97475A23807E8182A1715N1918k4395c04464B44115h7027
16241d0988a6650j70722B25575j6469a72599O1133C96211f8840G2147d924m4239
16230d9163j66173C5222J09136a091H1446c5939A08452a64907g2063j36913B17751
$$ y = [391883, 232361, 169379, 65811, 317194, 149757, 311080, -109529, 232956, 267493, 185710, -71811, 280363, 125867, 271901, 193854, 92019, -10756, -46576, -109699, 295189, 77178, -91678, 232172, 87280, -70981, 91523, 117572, -172315, -32361, 94082, 163620, 99924, 55175, -115753, 189177, -89604, -30430, 30659, 41726, 19727, 297622, 193569, 175216, 293005, -43098, -123785, 429976, -34135, 31136, 220733, 472685, 58053, 206523, 45547, -240787, -126117, -81300, 82246, 279721, 123807, 58182, 11715, 63633, 39238, -304464, 244115, -87027, -40988, -16650, -187372, 225575, 209106, -172599, -111466, 396211, -68840, 72147, -4924, -49163, -215336, 35222, 144358, -1091, 81446, -35939, 108452, -164907, -72063, -208976, 217751]
16218e3547C91286A5915J71834c38j85680k52695B24702D6071j6858K5976O8210
16207A23399g3131A26871b55932A11939d7793l6998I5181m517K6766C3025a42546
16195b759I0629m3501J64069h4972D4500J73418e6683J5229A24615n0918K86327
16184C60024H4072a63439C01069f3176B2122a0008A02188a67946F024R345a12715
16172B6450e9635A97823d4711A30725P5808q9551a22916A94786A2524Q3438P1781
16161A67743a53005F7871R1206a46771j18569I6416a30664f1948J3486A43463
16150i1086H3794M01308h4964d2446o6441l1918F717J01005b5944q7372N5021
16139e8295F6474b79421h3007I8099J92389a54482J777B3965N4563O2121C365
$$ y = [-53547, 391286, 15915, 187749, -338, -186018, -438713, 224702, 46071, 29213, 55189, 123399, -73131, 126871, -255932, 111939, -47793, -84791, 95181, 90664, 117430, 33025, -142546, -2759, 90629, 47128, 211197, -84972, 44500, 217918, -56683, -41454, 124615, 73697, 360024, 84072, -163439, 301069, -63176, 22122, -10008, 102188, -167946, 6024, 15369, -112715, 26450, -59635, 197823, -44711, 130725, 206533, 116982, -122916, 194786, 12524, 95962, 167743, -153005, 67871, 159077, -146771, -265340, 96416, -130664, -61948, -48462, 143463, -91086, 83794, 485102, -84964, -42446, -108887, -140805, 6717, 107722, -25944, -113316, -58295, 66474, -279421, -83007, 98099, 290488, -154482, -152705, 23965, 78528, 140649, 3365]
16127a99760A65433E7299L61409a45899A85086J91889b03491B2662N5932J78270
16117B56864b48470J405c5786m72887b0669E7478a39482d0397l4286A12945b36182
16105A86872a5950A25214a7713A16438Q0238b73140A18510D7393J40229E5653
16094b59672f6336E39547a7351k6988j24498a1007H743b59173A51500B4217a98184
16082a82208A41682r520J38373q2621K66287a65805A29530a88314N9119A50027
16071B88563a59465K2410a8284K853B44398i9395n2395a1304H3431J37300r923
16060B10808C422c60474a13079K7938b8343A7722O1395J78440j0098j22335K2368
16049A47492c18813n9435J81075D4213L3291i5611b3181p9266B07053b16519A02664
$$ y = [-199760, 165433, 57299, 418708, -145899, 185086, 376975, -203491, 22662, 78594, 256864, -248470, -247065, -35786, -508673, -20669, 57478, -139482, -40397, -74683, 112945, -236182, 186872, -15950, 125214, -17713, 116438, 196676, -273140, 118510, 47393, 187622, 55653, -259672, -66336, 539547, -17351, -44339, -168837, -11007, 8743, -259173, 151500, 24217, -198184, -182208, 141682, 132162, 270535, 187914, 454201, -165805, 129530, -188314, -129195, 150027, 288563, -159465, -137055, -18284, -15431, 244398, -99395, -151790, -11304, 83431, 220731, 210808, 3422, -360474, -113079, -85141, -28343, 17722, 79117, 257557, 247459, 125124, 147492, -318813, -378248, -197173, 44213, 77504, -95611, -23181, -102447, 207053, -216519, 102664]
16037A23529e0610j22860c9250b246B38972G189c42449q5381e2951j31924A31989
16025H914a8083k9688j62050a9560j12575G8877a57652A6196b42064J08250H7356
16013a37657n7126b6899B65221a06758D71348A42903a8024n5311b7018o5961J9573
16002g3406l9830r3145I6172L0346D8050c3751J4640j90228I795b3817F2906L8769
15990A01675a39068b6513B9118b89460g1724j7582j1278A04557D2734j3514J34274
15979A63494J19606G8797b26492D1033a51277j19031B5738a36598l3468B74718
15968D2831b1155E2956B2844a30673n7195G4264J79111C3443a29402B03515H3219
15956B94973a93065Q5921j11791g2592F478N9764f2322k54040a33412D1818a02263
$$ y = [123529, -50610, -173470, -39250, -2246, 238972, 7189, -342449, -427830, -52951, -184875, 131989, 8914, -18083, -47771, -209821, -19560, -132135, 78877, -157652, 16196, -242064, -133814, 87356, -137657, -194783, -26899, 265221, -106758, 471348, 142903, -18024, -73335, -27018, -92979, -73406, -113236, -206381, 96172, 126518, 48050, -33751, -19111, -209339, 9795, -23817, 62906, 101675, -139068, -26513, 29118, -289460, -71724, -89306, -100584, 104557, 42734, 29220, 163494, 283100, 78797, -226492, 41033, -151277, -270308, 25738, -136598, -170066, 274718, 42831, -21155, 52956, 22844, -130673, -187868, 74264, 253375, 33443, -129402, 203515, 83219, 294973, -193065, -107144, -218935, -72592, 6478, 66242, -62322, -316362, -133412, 41818, -102263]
15944C05644h6410I945L7939a69346j35035c8885r4530j31338J19687D02860D4835
15932A89067g8729L0152C59779F5760b22704P2334A43862a13362J8918q6646e5839
15920A50037a09257C33J04977d5556a4030l5581K3866m42733A44641m6287b46309
15908A07807a43944B51111o0167a49043c9266A20224K050n8189c06830d3099m29355
15897d72454a75604d2905k6877A00608H1a77682B37760N1793n4319a5901E5135
15885B02027a13783j14166A50778g7361p7283A0431b11405f15E3167e01294J56957
15874c44337Q6678K4072J00348a3726k13075L8709M2381l3340A35864b20170A67086
15862a1331A3527g0108j12230O6592k16150J02822r5634D6034b76604A28533a0581
$$ y = [305644, -86410, 9945, 47884, -169346, -304381, -38885, -133415, -264753, -145066, 402860, 44835, 189067, -78729, -48577, 359779, 65760, -222704, -150370, 143862, -113362, -94444, -181090, -55839, 150037, -109257, 333, 105310, -45556, -14030, -49611, -25745, -468478, 144641, 98354, -246309, 107807, -143944, 251111, 190944, -149043, -39266, 120224, 122274, 64085, -306830, -43099, -472454, -175604, -42905, -69782, 100608, 81, -177682, 237760, 289553, 235234, -15901, 55135, 202027, -113783, -227949, 150778, -77361, -154644, 10431, -211405, -615, 53167, -501294, -344337, -257659, -233587, -133239, -13726, -226801, -188092, -145711, -179051, 135864, -220170, 167086, -11331, 13527, -70108, -182338, -115746, -331896, -229074, -324708, 46034, -276604, 128533, -10581]
15850a52886C049c542D20d49077b9509a0613o9628A63687a52580A1652c18036
15838a09707C23841e09355C07150a88119N1428C13229d45541a87437M5524B51046
15827A61214P8143O5831m2646b02099C4775g1257K6593j40971N9872D08498b3318
15815A81859H3285b07122B40838C601b35477d6635j17257A87744R6261a42501
15804b3141A31977m3019B3602R5317d2282o1707A48021b20307B02836c7754F8110
15792H0532J66104P124F6204a49523j69031a48972B7821J63237p3604b01721m6800
15781b48521o4470C1971M97919h9900k0844H1831d39441c1839j86625k3009l7387
15770b78860a37881j65115h6055k52131G7727g2665F1883b753p1798m0041B11131
$$ y = [-152886, 3049, -3542, 420, -449077, -29509, -10613, -80241, 163687, -152580, 11652, -318036, -109707, 323841, -509355, 307150, -188119, -136691, 313229, -445541, -187437, -141913, 251046, 161214, 239357, 305188, 262542, -202099, 34775, -71257, -44664, -185635, -125763, 408498, -23318, 181859, 83285, -207122, 240838, 3601, -235477, -46635, -163892, 187744, 284005, -142501, -23141, 131977, 88958, 23602, 118919, -42282, -103989, 148021, -220307, 202836, -37754, 68110, 80532, 246636, 253760, 66204, -149523, -318554, -148972, 27821, 191058, 117454, -201721, -248521, -312991, 31971, 529890, -89900, -110744, 81831, -439441, -31839, -218464, -241473, -278860, -137881, -302996, -86055, -338186, 77727, -72665, 61883, -2753, -74551, -114592, 211131]
15758E1026N9889K08715j32098g6571B9637J92319a17784D67113A70912d1166
15747e9491A20963h8722K490k87532A3019L09596c924B23894r9903a4923B85153
15735a27136j93024A18080b20329A55820f1510p8613F5261N6621O350M6220R0780
15724B65232a09469b7962G2291b50670B43866a72473d2121B70213e8786I411c21514
15712B16560e1545R986k08249B00783f1647D49744i3686a2451n2580B41645j20370
15701A21275c86458j78603i2857j40805g1509j42867P6074B82569E9468j3009
15691D6459g611A45728c32427h8805M3707a2494E7971i4535C2493c24842B62071
15679g5238D104O3957b23258B7536J99222a66144A3706O8344J25028i1139B99441
$$ y = [51026, 110915, 319630, 187532, -76571, 29637, 221956, -117784, 467113, 170912, -41166, -59491, 120963, -88722, -86232, -373764, 13019, 322615, -3924, 223894, 123991, -14923, 285153, -127136, -320160, 118080, -220329, 155820, -61510, -140123, 65261, 121882, 128232, 174452, 265232, -109469, -27962, 72291, -250670, 243866, -172473, -42121, 270213, -58786, 9411, -321514, 216560, -51545, -41559, -249808, 200783, -61647, 449744, -93686, -12451, -65031, 241645, 121275, -386458, -565061, -92857, -233662, -71509, -214376, -138302, 282569, 59468, 46459, -7611, 145728, -332427, -88805, -45098, -12494, 57971, -94535, 32493, -324842, 262071, -75238, 4104, 68061, -223258, 27536, 226758, -166144, 13706, 82050, 207078, -91139, 299441]
15667A47728a73947L4378G2626b73557A1682M7889d42778J42447A95512a06015
15656b22014A49435b33181i4503J8402A01984f7725B39394i4682A72762P7425
15646B50187c4774p7913e0619H4720f678j16834l631C84036C7628M0040a77469
15634a26390J0084M9813m0854C4613F198L2826p693n613i7562B04583c22520H725
15621I6695m1839a16073F9479K3310l2185a40274M3578F8101J24668a82588j22723
15610c05311A3486i0628H929L4181b46481a13778d6808C1527N2828b16183j82494
15599c98677a92119A68202m6720O520b54660B70678E0358g2578j66119F0918b47547
15587a70035D7575b3667A60417p9049N0492K8380p9442a76287Q0438j5287I2996
$$ y = [147728, -173947, -139569, 72626, -273557, 11682, 59571, -442778, -300331, 195512, -106015, -222014, 149435, -233181, -94503, -76101, 101984, -67725, 239394, -94682, 172762, 250187, -34774, -112687, -50619, 84720, -6678, -123512, -127143, 384036, 37628, 77668, -177469, -126390, -116306, -66493, -107347, 34613, 6198, 39024, 31331, 25718, -97562, 204583, -322520, 8725, 96695, 54856, -116073, 69479, 92789, 60604, -140274, -96696, 68101, 192769, -182588, -305311, 13486, -90628, 8929, 43110, -246481, -113778, -46808, 31527, 84355, -216183, -398677, -192119, 168202, 121482, 128002, -254660, 270678, 50358, -72578, -238697, 60918, -247547, -170035, 47575, -23667, 160417, 81368, 131860, 160240, 80798, -176287, -95849, -111136, 92996]
15575a09782G6541K27358b33252k10643B07161b27430B8896c4863m3741j59689
15565b38293J04213j53544c7410A55514m5833c07194D4064h6709H8615C5929Q6906
15554A22835D813N8078J5469a705k84068h3104C4458L54250A29175h7349k89933
15543c77282C06205A40728J61666b43300B41379n1334a93598C37412b45780b5075
15532b53614a6926j47193O3467B62524b75210C16078E8420J30226e5139C3981
15521i2840D8684n700K1591L53006F8078j8774i8178Q191B2291R0156b2190j34626
15509a56816n478A31103b26900a09091F4281M7715a09714n5620l7298B79747r4479
15498A85268a56530N7914k08895E8641d2569H4177f3235j09174j45892R7468k2986
$$ y = [-109782, 76541, 303899, -233252, -443895, 207161, -227430, 28896, -34863, -78604, -238293, -134080, -287624, -37410, 155514, 109681, -307194, 44064, -86709, 88615, 35929, 122835, 4813, 62891, 78360, -1705, -285773, -83104, 34458, 388708, 129175, -87349, -377282, 306205, 140728, 302394, -243300, 241379, 190045, -193598, 337412, -245780, -25075, -253614, -16926, -164119, -100652, 262524, -275210, 316078, 58420, 188646, -55139, 33981, -92840, 48684, 42984, 64575, 417581, 68078, 49304, -98178, -89987, 22291, 112447, -22190, -156816, -162294, 131103, -226900, -109091, 64281, 111996, -109714, -165334, -202632, 279747, 185268, -156530, -98616, -307511, 58641, -42569, 84177, -63235, -172409, -318301, -220833, -243819]
15487b43819a3810C8261a39068K7331c5182f762j05502j6866M1699l02040a61505
15475A46104F6241a41106B01272J38448h37C25036j18213a75027C2316L384K25981
15464B61681d88398I3109e330k56718g9984j1548I434a846B29968J3901j00563
15453A43306c1060l1492a0624m0296p4446D17525A94061C1646d3274o6027b0488
15441b52617f4141B67046K6846h4381H335J18103J9827E6855a0134D7046J56287
15430B03333a09141B61435D3768d46975f6713b4219C7283K1845f0491C5882b03215
15418c82967e2324k51072e2912A38035a79296j22601B45596j09601n8175a60935
15407b03169B866O8628b12656A04820d8354C10510c6564A6034g1483k26844C43570
$$ y = [-243819, -13810, 38261, -139068, -111737, -35182, -6762, -112264, -129130, -87431, -389471, -161505, 146104, 66241, -141106, 201272, 339720, -837, 325036, 206823, -175027, 32316, 35700, 261681, -488398, 93109, -5330, -262048, -79984, -91532, 9434, -1846, 229968, 243869, 143306, -31060, -62552, -10624, -50920, -125366, 417525, 194061, 31646, -43274, -109301, -20488, -252617, -64141, 267046, 293892, -84381, 8335, 126438, 146265, 56855, -10134, 47046, 203333, -109141, 261435, 43768, -446975, -66713, -24219, 37283, 59128, -60491, 35882, -203215, -382967, -52324, -303396, -52912, 138035, -179296, -301897, 245596, 135995, 77820, -160935, -203169, 2866, 71494, -212656, 104820, -48354, 310510, -36564, 16034, -71483, -298327, 343570]
15395a07430A73093p9518b8123C996J55657b65669C00031G9529K10685D5689B0584
15383i589A41855D6377c4690n2036B26243e55728A81653A617b912m3891A80688
15371a16359j43173e3910D3626b57496B88029p870b63234C1617E648e5919B62861
15359H3630C7427K62772F6J6286R7163b18362L6627A57616b33666A89465b04624
15347h6767c8542C73560A68512b91728C133P0996J2117K10236j43075a60173A68149
15335G4798a04662A9809c2831A06006h9582C44858j33532J12250E7801K3186J4494
15324I5481e5572C1296Q7222l0870K2180a25483k21489B13306I6959P2518a44326
15312A72080J83052b35385A82275j1307p8568m4587b08380A02942K35180A5425
$$ y = [-107430, 173093, 93575, -28123, 3996, 159653, -265669, 300031, 79529, 290214, 45689, 20584, -9589, 141855, 46377, -34690, -86726, 226243, -555728, 181653, 1617, -2912, -46803, 180688, -116359, -259532, -53910, 43626, -257496, 288029, 280159, -263234, 31617, 5648, -55919, 262861, 83630, 37427, 300199, 66, 16352, 113515, -218362, -181735, 157616, -233666, 189465, -204624, -86767, -38542, 373560, 168512, -291728, 3133, 74129, 86246, 296482, 153407, -160173, 168149, 74798, -104662, 19809, -32831, 106006, -89582, 344858, 211326, 323576, 57801, 80987, 95481, -55572, 31296, 118518, 87648, 109828, -125483, -346972, 213306, 96959, 169477, -144326, 172080, 355132, -235385, 182275, 170968, 92400, 47813, -208380, 102942, 338122, 15425]
15301H1444P7769a21943j14341q1290D6508K0824d9463j84826D37044H7444Q4112
15290A71556B2714O4343b58727E0421b06110a30C4383J43297a19688G4248O0628
15279A34876L2122a51835A36964J65492b30168A16158A5411g7068D8634i5949
15268A87256p121q5539b56526A20823n2466a20493A05026N5349a02633q4806B85365
15256B27014A01366a0378l4841D56819A95828p9402K56154N23255q4121M11189
15246A222903k50535J55121m16625a17495A21902J1419a54405c6625A6045J1963
15236B8008J35947K83172j84065d0608B09116f2918A92508a13439A19014a6408
15225a14883k25353C9585h3289B36089a65547B16225b4888D01518j7859E7208
$$ y = [81444, 159213, -121943, -236284, -317574, 46508, 67332, -49463, -234289, 437044, 87444, 171556, 22714, 87057, -258727, 50421, -206110, -130, 34383, 177680, -119688, 74248, 134876, 166998, -151835, 136964, 302456, -230168, 116158, 15411, -77068, 48634, -95949, 187256, 180135, 94596, -256526, 120823, 68357, -120493, 105026, 160375, -102633, -187439, 285365, 227014, 101366, -10378, -45219, 456819, 195828, 116426, 372580, 895835, 811714, 1222903, 972368, 1127489, 710864, -117495, 121902, 133321, -154405, -36625, 16045, 28008, 163955, 447127, 263062, -40608, 209116, -62918, 192508, -113439, 119014, -16408, -114883, -340236, 39585, -83289, 236089, -165547, 216225, -24888, 401518, 383659, 57208]
15214a60086A1056a40438j9271N7267m1769k2364A48932R3617g0730B21565l7857
15203A83708d6743n0904j85338p5241B79328m8781a31938N2759I2801Q7426K48885
15192D29112B5740K29116A22909a51363D5964J79937K7222j18661M2961P5941
15182B53364f5987k07676A9408J26784K32949I6044M2106J52305q9396i7331D43775
15170b55108b8301A18251J31643K24376K64906a11883G4618K1967J16102a89339
15159B31928i0058K3018c2021A6431b33372J03673B01714I476K38605f3247G1305
15147B45297a8908F3875M5701J5456J99977b16423A16866d1938B103K16400A9659
15135I4614a4936B62804l6765N0415j31440a19623A31421F3133O9646b17932e5087
$$ y = [-160086, 11056, -140438, -159709, -102442, -144211, -166575, 148932, 242549, -70730, 221565, 183708, -46743, -97647, -282985, -358226, 279328, 230547, -131938, -79179, 92801, 180227, 429112, 25740, 254856, 122909, -151363, 45964, 225901, 253123, 134462, 177423, 253364, -65987, -273663, 19408, 146192, 379141, 96044, 138150, 290455, 201059, -97331, 443775, -255108, -28301, 118251, 249894, 474270, 739176, -111883, 74618, 96585, 212687, -189339, 231928, -90058, -67040, -32021, 16431, -233372, -129699, 201714, 9476, 248081, -63247, 71305, 245297, -18908, 63875, 109576, 125032, 325009, -216423, 116866, -41938, 2103, 218503, 19659, 94614, -14936, 262804, 226039, 276454, 145014, -119623, 131421, 63133, 132779, -217932, -55087]
15123A03097C0267j1130J59684B0153Q305K4269Q0361a92588B15898I6282J95428
15112B91710m135q3301K98477A94960H8066B2013Q0411l50l3985K9451m2264Q7782
15100A43058I839J64164g0987I1270a52605b1501A81281c38466C84003q4132F0246
15088I6250k2550M14111j88171k8971J48128a58104j82169C8893c46034A78576
15077a21631A9037L13938M9894j57316K63389B21531Q6588m2114K73432b34330
15066B72999A15166g6547j27712I9180J40059r8767g5364C00483a2186C51514
15055H6122J88811b31974C64185l8701E5496N53379i4529P273B26810R8143A17202
15043a15954l5861c0341C2357R7271K20398j46966K46657k03460c0913o3150A95337
$$ y = [103097, 30267, 19137, 178821, 20153, 28458, 52727, 133088, -192588, 215898, 96282, 291710, 287575, 204274, 502751, 194960, 88066, 22013, 102424, 102074, 68089, 97540, 55276, 143058, 9839, 174003, -70987, 91270, -152605, -21501, 181281, -338466, 384003, 299871, 60246, 96250, 73700, 487811, 299640, 270669, 418797, -158104, -340273, 38893, -346034, 178576, -121631, 19037, 332975, 382869, 225553, 488942, 221531, 308119, 266005, 539437, -234330, 272999, 115166, -76547, -204259, 99180, 239239, 140472, -75364, 300483, -12186, 351514, 86122, 274933, -231974, 364185, 325484, 55496, 608875, -94529, -87256, 226810, 324953, 117202, -115954, -151815, -30341, 32357, 129628, 350026, 203060, 449717, 246257, -30913, -94063, 195337]
15031B5613f9862K3137C22041A48612a12874A30121D5233J39651k1868J92490
15021C55506A35312N4265O0719R7705g7597j15073F296O9822J29724f0455H3271
15009b250A5339L04636h2743C7926K2235a4622A47100m7819h7527C9295N30967
14998E70262b7130B3143K78389j44789J36781L10452j63403I3428K53825A25702
14987C19523F7415L93224B19234l7950J33680m2879r700J87236A22111J40991
14977B63102R4626A53185E1059K06746j00273K43822j97731e779C38464n0738
14967B87726A02232L75595b7255A64064c20940C91145d7083j86861D36860F8434
14956C26322j55606A0079R5379J51743P1635M2712A25761a70668A86470o7833
$$ y = [25613, -69862, -46725, 322041, 148612, -112874, 130121, 45233, 184884, 163016, 355506, 135312, 189577, 250296, 348001, -77597, -192670, 6296, 76118, 205842, -60455, 83271, -2250, 15339, 319975, -82743, 37926, 60161, -14622, 147100, 99281, -87527, 39295, 570262, -27130, 23143, 301532, 156743, 293524, 603976, 440573, 93428, 347253, 125702, 319523, 67415, 460639, 219234, 181284, 314964, 272085, 262385, 449621, 122111, 263102, 357728, 153185, 51059, 257805, 157532, 401354, 203623, -5779, 338464, 287726, 102232, 477827, -27255, 164064, -320940, 391145, -47083, -233944, 436860, 68434, 326322, 170716, 10079, 105458, 257201, 328836, 371548, 125761, -170668, 186470, 118637]
14946A18637L29697I2720L25025j89255J42467K9286j76364k8920J35467J40032
14936D70458A73126J05049l1459m175l989K30508q2423p7753O1181J35047j98738
14925C06374J29086B06963K346J70882k0892m6680p7001J60337j28726A693O9588
14914G1281K6384K88495j84952K51988J66805e9101A67945O80280A90443J55046
14904C45489J5358p7660K74562A68906m7176M88048j55223j75806a85946D59907
14893B94818K60359A69628J23171j9438l2878A6492K45391O2280j11854J29975
14883C42284j28964J98875A77428K59328j04423j18504K35199j73029K41812n3475
14873D64336n4173E3570K78131o2526K10621I6687K96756j31485o7212J47521
$$ y = [118637, 448334, 92720, 417745, 228490, 370957, 400243, 223879, 194959, 330426, 470458, 173126, 278175, 246716, 242541, 238552, 469060, 386637, 308884, 370065, 505112, 306374, 435460, 206963, 209309, 380191, 359299, 312619, 235618, 395955, 267229, 1693, 71281, 97665, 386160, 201208, 453196, 620001, -59101, 167945, 848225, 190443, 345489, 360847, 283187, 557749, 168906, 121730, 609778, 454555, 278749, -185946, 459907, 294818, 555177, 169628, 292799, 273361, 240483, 16492, 261883, 324163, 212309, 342284, 213320, 412195, 177428, 436756, 332333, 213829, 449028, 275999, 517811, 464336, 410163, 53570, 331701, 269175, 479796, 96687, 393443, 261958, 194746, 342267]
14863C42267A20071J41469l0308K09475A12410M07543O9950k04005k8228j55325
14853B02345K64908j70860K3444J72368H7303J46974K82937k12840H0703J70590
14843B51293L58033k62939L13155j63949k22248J50244P8544K11443k85222m5740
14833C82614K05763j43024A33673L46984A3202L21379l2707L684n5069A19348
14822D01080J27663j38475J41726O02P8066k50623L35084j53252A07073M16814
14812E23887P5405K02488k96069J09883J13257j44176k01023K01661j38536o1368
14802C85409P3831k1291A42988M10074j84438J72240k08742j32049M13808B07570
14791B71604J77465n9152J1226J91086K02767C66213k1676L60641j01687B79747
$$ y = [342267, 120071, 261540, 231232, 440707, 112410, 519953, 589903, 385898, 357670, 202345, 467253, 296393, 319837, 492205, 87303, 234277, 517214, 304374, 80703, 251293, 609326, 346387, 659542, 495593, 273345, 423589, 502133, 713576, 428354, 382614, 588377, 445353, 133673, 480657, 13202, 334581, 301874, 305558, 250489, 119348, 401080, 528743, 390268, 531994, 532596, 610662, 360039, 695123, 541871, 107073, 523887, 599292, 801780, 505711, 615594, 728851, 584675, 383652, 585313, 446777, 385409, 459240, 437949, 142988, 553062, 368624, 540864, 332122, 200073, 613881, 207570, 271604, 449069, 389917, 401143, 592229, 794996, 366213, 344537, 705178, 603491, 279747]
14780F80782J33985k35066B66805J75548j04389J42071J3917K62784C58986P0370
14770D29356K3580m3856K04706N8734j53706j41333m7089M07902B96694Q2340
14760C79034L17744M1082k41120J42669K34828k52530J30605o1580j37239K61458
14750H14951k97075J10433k59660A79805K77250L61267k84779k9894O8060J6423
14740E88132K14594l03908J34767j04031L1919L31527N8731j09169p6574o7541
14730F98447B41662N18411j78362R3775k26491K81731j47246K08418K9702j26387
14720F95213j51280K48525r3267L56939l10987O5778l02517J37602J97293l40566
14710E02733N39422m78299J56729k64192P80997m82365j50783M6231K41113j51636
$$ y = [680782, 814767, 579701, 266805, 442353, 337964, 480035, 493952, 756736, 358986, 429356, 452936, 409080, 613786, 672520, 518814, 377481, 330392, 738294, 296694, 379034, 696778, 737860, 496740, 639409, 874237, 621707, 752312, 690732, 553493, 814951, 517876, 628309, 368649, 179805, 457055, 818322, 533543, 503649, 571709, 588132, 802726, 498818, 633585, 529554, 561473, 893000, 951731, 842562, 765988, 698447, 241662, 760073, 581711, 675486, 448995, 730726, 583480, 791898, 821600, 695213, 543933, 792458, 699191, 1056130, 745143, 810921, 508404, 646006, 843299, 502733, 1042155, 563856, 720585, 456393, 1237390, 755025, 604242, 650473, 891586, 739950]
14700G39950K18454j26277m2637n5340o9854K38479J27734k21858p5125J41740
14690H75266j98375j02018L02607C51176P34071m3191j24625K70561n90828J18318
14680G15482L63900j44964m33158M73843j06883J02967M6103Q2861K58651n67048
14670G91754M4904L68735k83664J51416j94677k7909M25255p2184n03883K48813
14660I48560J61775j11239J31491k27646O7937M5027K29483m36787k55730K82149
14650H35020K28140J9646k79537J2354N56018k04175m4145k50143L04714k70614
14640I07278J85277k6147K1278K27136M2062j55215J14989m39749N61864j67785
14630A270988j49246R5247j59414L37455J83771j43148l40719J49643n3845K56691
$$ y = [739950, 958404, 832127, 789490, 734150, 664296, 902775, 1030509, 808651, 733526, 875266, 676891, 574873, 877480, 351176, 1085247, 1042056, 917431, 1187992, 597164, 715482, 1079382, 934418, 501260, 975103, 868220, 971187, 1017290, 1100151, 1358802, 791754, 836658, 1205393, 921729, 1073145, 878468, 850559, 1275814, 1203630, 699747, 948560, 1110335, 999096, 1130587, 902941, 970878, 1015905, 1245388, 808601, 552871, 835020, 1063160, 1082806, 803269, 815623, 1371641, 1167466, 1123321, 873178, 1177892, 907278, 1092555, 1066408, 1087686, 1314822, 1356884, 1201669, 1316658, 876909, 1438773, 1270988, 1121742, 1216989, 1057575, 1395030, 1578801, 1435653, 1094934, 1244577, 1190732, 1447423]
14620A447423l03559M86297j66331k09619L98665j7676l87444P4714J17198K39118
14610A678786o5508l79489q21J18336K31470l43562L80555k49837K98165l64795
14600A303300K06103p4918k64299K24053J40866j50077K3527J60721k704k16316
14590A350256L649K63052J22054j7317k56399m7134M65457j60899q4761Q9364
14580A727322L81531l73483P5166K35548J69061p57428L07151L64597j84331L856
14570A948990J20719K27715P1721k77996K41618l65062P060N53086k57714k9829
14560B240308M08279l41193M16026J30249J63320j27611L67963K09970N68097
14551D035408O17187J213635J561724L529716P643133J5971457P113115j5797599
$$ y = [1447423, 1143864, 1630161, 1463830, 1254211, 1652876, 1635200, 1247756, 1322470, 1439668, 1678786, 1613278, 1233789, 1232968, 1351304, 1582774, 1239212, 1619767, 1369930, 1668095, 1303300, 1509403, 1434485, 1170186, 1394239, 1535105, 1385028, 1408555, 1569276, 1566572, 1350256, 1353905, 1616957, 1739011, 1721694, 1465295, 1418161, 1883618, 1722719, 1637958, 1727322, 2108853, 1735370, 1810536, 2046084, 2215145, 1457717, 1764868, 2129465, 1945134, 1948990, 2069709, 2297424, 2369145, 2091149, 2332767, 1967705, 1974765, 2527851, 2270137, 2240308, 2648587, 2307394, 2723420, 2853669, 3016989, 2889378, 3257341, 3467311, 4035408, 4652595, 5866230, 7427954, 10957670, 18600803, 34572260, 41685375, 25887776]
14543B5887776H896597C934641j441669m53711o32597L15141L0873R1365K1340
14534A865383m131K26302j52195q3081J56532M5256j52920L64335k26592K34668
14524B273557k81280L53110k60494J85810j20187L54176K36260m46176J59531
14515B454307l78367O28723k87989K06706j23556j80637k08165L61003n1113O03415
14505C024327m78477J64471j11942k0061K46412L09634o00029K53206K14811k29674
14495B772678l1535L02428j22257P8050Q3420J00764J29013j38610R7249j41016
14485C130184K91392P3941j30547M2592K76506k07409k1910K0153J55913J71323
14475C802138m3798q3304M9527R8772K92194k30721l890Q3105k2961M70256o36284
$$ y = [25887776, 8896597, 3934641, 2492972, 2039261, 1406664, 1721805, 1752678, 1844043, 1865383, 1861252, 2087554, 1935359, 1852278, 2008810, 2054066, 1901146, 2265481, 2038889, 2273557, 1992277, 2345387, 2084893, 2270703, 2150516, 2504692, 2740952, 2294776, 2454307, 2075940, 2704663, 2416674, 2623380, 2499824, 2319187, 2111022, 2472025, 2420912, 3024327, 2545850, 2710321, 2598379, 2578318, 2824730, 3134364, 2534335, 2787541, 3002352, 2772678, 2741143, 3043571, 2921314, 2999364, 3082784, 3183548, 3312561, 3173951, 3271200, 3130184, 3421576, 3495517, 3364970, 3407562, 3684068, 3476659, 3454749, 3474902, 3630815, 3802138, 3758340, 3675036, 3724563, 3823335, 4115529, 3884808, 3880918, 3964023, 3941062, 4411318, 3775034]
14464C775034K58867J15161L46746j13474J31913l17202L69117l79835N38247
14455D724574l60108L96996k26264K43573L0413k20141L11870J31837j32383M27952
14445E328319m2397M0940J00791p3041j59020N04878j84649K89062O2529j78180
14435E689232n6714M27241j97667q5077L72300K37243n5193l0128M61094j13898
14425F648433n4925L71045o0989K27596K12717J07131j51252N6824J66117M10209
14415G932906k67913J74655J93906r1051o3075N66818j72324L49966K05321m6597
14405H782612J0487K54467L38685j95396J91787K29283K39140j02348P47359p39834
14395I756242N06526K4976L34133J55270J69691J79532J22271K28284L47961N49357
$$ y = [3775034, 4033901, 4149062, 4495808, 4382334, 4514247, 4197045, 4566162, 4186327, 4724574, 4364466, 4761462, 4535198, 4778771, 4809184, 4589043, 4900913, 5032750, 4900367, 5328319, 5285922, 5326862, 5427653, 5354612, 5195592, 5700470, 5515821, 5804883, 5867412, 5689232, 5632518, 6059759, 5862092, 5777015, 6149315, 6386558, 6331365, 6301237, 6762331, 6648433, 6593508, 6964553, 6903564, 7131160, 7343877, 7451008, 7299756, 7356580, 7522697, 7932906, 7664993, 7839648, 8033554, 7942503, 7879428, 8446246, 8273922, 8623888, 8829209, 8782612, 8793099, 9047566, 9386251, 9190855, 9382642, 9611925, 9851065, 9748717, 10496076, 9756242, 10262768, 10287744, 10621877, 10777147, 10946838, 11126370, 11248641, 11476925, 11824886, 12374243]
14385A2374243p3899R2026J30488N18232O3908J3349L94147O62144O3438J58000
14375A4396076j42974R50901P3691L24973K79616N5839M43570P79744J38959K19855
14365A7520250M54043R5134O41329M19249M0881M96050P41075M91196M31392L80660
14355B1711259M04799P01639N83614L73657O17451O63521L31545Q56207O58369
14346B6902061P36900Q06154P22649R50137K87906R11017Q75240R25887R89891
14337C4107842J306560P98075P76120J327090J343317R17538J476637J038428
14329D3091607J713624J510651J596947J405096J393205J764238K304931J461957
14321E6242256K187361J855338K204448K561342K120630K857735K486207K735216
$$ y = [12374243, 12300344, 12392370, 12522858, 13041090, 13104998, 13118347, 13512494, 14174638, 14238076, 14396076, 14253102, 15204003, 15277694, 15602667, 15882283, 15938122, 16381692, 17161436, 17300395, 17520250, 17974293, 18069427, 18710756, 19130005, 19170886, 19666936, 20408011, 20899207, 21330599, 21711259, 22116058, 22817697, 23401311, 23774968, 24392419, 25055940, 25387485, 26243692, 26902061, 27638961, 28445115, 29167764, 30117901, 30405807, 31316824, 32192064, 33117951, 34107842, 35414402, 36212477, 36988597, 38315687, 39659004, 40576542, 42053179, 43091607, 44805231, 46315882, 47912829, 49317925, 50711130, 52475368, 54780299, 56242256, 58429617, 60284955, 62489403, 65050745, 67171375, 70029110, 72515317, 75250533]
14313G5250533L332511K985641L390190L459073M061531L857351M308031M219796
14305A04864657M877291N040924N561531N812551N860765O613466O652537P126398
14297A52410120P638578Q342713Q687136Q864483J0146374J0142003J1168459
14290B17399866J1629795J2013753J2947521J3812436J3853605J5004804J5527166
14283C12188946J5650769J6218545J6456673J6285852J6517301J5767916J5050538
14276D24136540J4334026J1343385Q947127O109858M251387K630852J472976l059281
14268D70166870J243332j871141o263248r699189j1986945j4233415j5846584
14261D11509680j6440625j7264227j7499245j7160367j7315971j6334857j5623842
$$ y = [75250533, 78583044, 81568685, 84958875, 88417948, 92479479, 96336830, 100644861, 104864657, 109741948, 114782872, 120344403, 126156954, 132017719, 138631185, 145283722, 152410120, 160048698, 168391411, 177078547, 185943030, 196089404, 206231407, 217399866, 229029661, 241043414, 253990935, 267803371, 281656976, 296661780, 312188946, 327839715, 344058260, 360514933, 376800785, 393318086, 409086002, 424136540, 438470566, 449813951, 458761078, 464870936, 469122323, 471753175, 473226151, 470166870, 471410202, 469539061, 463275813, 453576624, 441589679, 427356264, 411509680, 395069055, 377804828, 360305583, 343145216, 325829245, 309494388, 293870546]
14254B93870546j5102301j4798492j4165637j3235898j2475757j1917414j1346136
14247B00828911j0454583r733090q948967q886540p566947p948050p116919o634014
14239A33539801o287667n718128n359544n220955m990854m792260m224007m246063
14231I2700323l464181l390734l592652l636374k769010l119706k824344k696828
14223F7206494k516016k365617k212469j616048k219806k137375j835531j508925
14215E0794707j769964j366727j089749j837138j304594j642052j346669p32149
14207C9705665j161838l80347j743450q89546j231267p30125p50878p12798j101165
14198C1004251p75921j165594q23986q84828j24249j088318l71225p48351n66260
$$ y = [293870546, 278768245, 263969753, 249804116, 236568218, 224092461, 212175047, 200828911, 190374328, 180641238, 171692271, 162805731, 155238784, 147290734, 140173815, 133539801, 127252134, 121534006, 116174462, 110953507, 105962653, 101170393, 96946386, 92700323, 89236142, 85845408, 82252756, 78616382, 75847372, 72727666, 69903322, 67206494, 64690478, 62324861, 60112392, 58496344, 56276538, 54139163, 52303632, 50794707, 49024743, 47658016, 46568267, 44731129, 43426535, 41784483, 40437814, 39705665, 38543827, 38163480, 36420030, 35530484, 34299217, 33569092, 32818214, 32105416, 31004251, 30228330, 29062736, 28238750, 27353922, 27229673, 26141355, 25770130, 25021779, 24455519]
14189B4455519p92969J9027j141279N9965o61615r56867J303o65259m13885n81368
14179A9322572j00347m55823m90743o04096k90417m70913k04917l48632J5379
14170A6372063l87624o26007J5633k61096k05177k15928n64199j93007j06537
14161A3828121l72373p112m87020l28647j22988j75982l27578l96123M2541m08958
14151A1243881m26411L54561k10215p1044k91081r9024l00602m5963m13997l33691
14141I406414K2519k83616L83792j9071p79010J66382J00681p76191P60618p31261
14131H251257p4385l6801l08544J04644n61303J64284J84103m34351k1638J7876
14121G285142j32976J59247k64588J07153l21225k4414j98199k06758k7724L2975
$$ y = [24455519, 23662550, 23681577, 22540298, 22600263, 21938648, 20981781, 20983084, 20317825, 19903940, 19322572, 19222225, 18766402, 18275659, 17671563, 17381146, 16910233, 16705316, 16356684, 16372063, 15984439, 15358432, 15374065, 15112969, 14907792, 14691864, 14127665, 13934658, 13828121, 13455748, 13448636, 12961616, 12632969, 12509981, 12333999, 12006421, 11610298, 11652839, 11243881, 10817470, 11172031, 10961816, 10890772, 10599691, 10500667, 10200065, 10154102, 9740105, 9406414, 9428933, 9145317, 9529109, 9510038, 8731028, 8897410, 8998091, 8221900, 8982518, 8251257, 8176872, 8140071, 7831527, 7936171, 7374868, 7539152, 7723255, 7288904, 7267266, 7285142, 7152166, 7311413, 7046825, 7153978, 6832753, 6808339, 6610140, 6403382, 6375658, 6408633]
14111F408633J0577Q7658n48123M82455k92165r5177k71328J3565L11543m26779
14101E680859p2111r9569j62189k98505K30421L5494K55364k71435k01526J02040
14091E198843l51885j97421J57937K4052j98704J53586r6414j15686p366j43369
14081D423573P7041J11904l13715j11276o3891K54944l23291M3330j67827N0481
14071C981273o313R1945K46477k92517n00935J83312q9844L1113M1227N1471k11331
14060C525878J92209k98570J18922J14562j70309m3437j08410J93464m6610r6007
14050C381692l40142K7054J10381J72519k67314J54904k91689P1637J64800j54623
14040C029219L9557l61219J71976j50999O7985j86780K48490N9240L0793m1089
$$ y = [6408633, 6419210, 6506868, 5958745, 6441200, 6149035, 6053858, 5782530, 5796095, 6107638, 5680859, 5608748, 5509179, 5346990, 5048485, 5278906, 5314400, 5569764, 5298329, 5096803, 5198843, 4846958, 4649537, 4807474, 4831526, 4632822, 4786408, 4689994, 4574308, 4566942, 4423573, 4500614, 4612518, 4298803, 4187527, 4123636, 4378580, 4055289, 4098619, 3930792, 3981273, 3974960, 4066905, 4313382, 4020865, 3519930, 3703242, 3613398, 3644511, 3685738, 3737209, 3525878, 3718087, 3419517, 3538439, 3653001, 3482692, 3439255, 3330845, 3524309, 3477699, 3381692, 3041550, 3068604, 3178985, 3351504, 3084190, 3239094, 2947405, 3019042, 3183842, 3029219, 3068776, 2707557, 2879533, 2728534, 2796519, 2609739, 2858229, 2917469, 2948262, 2907173]
14030B907173M0823k02011M44236o03726j17585L92975K10043p77445P1231K25188
14020B590902l09930m6571J53697n9760L22488k51642j61301j07771j9147L9635
14010B150600K34553j54204j98935K57078k14841k7123K06899j21926k5481j09557
14000A997063K11595k02398L75611p35340K19495L31352l24245L40503k45483
13991A968153N24263O70225J249422K246330O417541J5461960J1292172r281462
13983C0548604A3182134n348231k550629q37639n99052o04814k38579k89726k6212
13974B687252j15722k12730j74944J10670J07613O0746k98010k31709J08741j01233
13964A940674J87019J23568J79792k99661j10132k95660K77906j7347l24313L58522
$$ y = [2907173, 2947996, 2745985, 3190221, 2586495, 2468910, 2861885, 3071928, 2294483, 2365714, 2590902, 2280972, 2234401, 2388098, 2328338, 2650826, 2399184, 2237883, 2130112, 2110965, 2150600, 2385153, 2230949, 2032014, 2289092, 2074251, 2047128, 2254027, 2132101, 2106620, 1997063, 2208658, 2006260, 2381871, 1646531, 1866026, 2197378, 1873133, 2213636, 1968153, 2492416, 3162641, 4412063, 6658393, 13075934, 28537894, 39830066, 30548604, 13182134, 7833903, 5283274, 4445635, 3846583, 3241769, 3003190, 2713464, 2687252, 2571530, 2358800, 2183856, 2294526, 2402139, 2462885, 2164875, 1933166, 2041907, 1940674, 2127693, 2251261, 2431053, 2131392, 2021260, 1725600, 2003506, 1986159, 1661846, 2020368]
13954B020368l08747J5589j81951K61820N7029k62934p0211K12429l66890M56668
13944A833170j37632j81545P3864J9303j45684m0670J83559q0383l07232J92306
13934A409056J64874l48554N04353k86261K72259l37779k23603L03593K87197
13925A745135k73080M3969j5968o3833k34506J28935J66438L5541L7015k29684
13915A339962k15960M22930j72209n9966K00074J17976l23864j96833K39089l44512
13905A006687J6780K26887J99548j86305k74339M78887j15426j69911K63416k06879
13895A239345j54545j60592K07693k01873Q6818L79455j84817j71462N954J25162
13885A171138j28131k10046L35287R5750m36965M50179k56846r5929K41329k81886
$$ y = [2020368, 1711621, 1727210, 1545259, 1807079, 1864108, 1601174, 1530963, 1743392, 1376502, 1833170, 1695538, 1513993, 1587857, 1607160, 1461476, 1420806, 1604365, 1523982, 1216750, 1409056, 1573930, 1225376, 1729729, 1443468, 1715727, 1377948, 1154345, 1457938, 1745135, 1472055, 1516024, 1500056, 1436223, 1201717, 1330652, 1497090, 1532631, 1569646, 1339962, 1124002, 1546932, 1374723, 1314757, 1514831, 1632807, 1308943, 1112110, 1351199, 1006687, 1023467, 1250354, 1449902, 1263597, 989258, 1468145, 1352719, 1182808, 1446224, 1239345, 1084800, 924208, 1131901, 930028, 1016846, 1396301, 1211484, 1040022, 1045976, 1171138, 1043007, 832961, 1168248, 1263998, 827033, 1277212, 1020366, 924437, 1165766, 883880]
13875H83880K89069j19130L31809k17879r6924n78j84462J96280k5954j86491
13865H69620q6115R6607J06111l3986j09964K07933k99715K03304N0594k72364
13855G32025J0956N37905l03480o2503K07593k05633Q4379p0210k50186J23987
13845H04833R423L159J20827m5027J31283k75866K95626j90093M09469l19976
13835I43658L04420m10303r9228M6290j2010K18633j00540o0940M5372J37493
13825A012845J05266j88015j60790K93861j76455l77350J56291j8399k0244J54570
13815G81580k04441K57027q62j16337L05390j95805P8760k79456j12238J59651
13805F73269Q2347r8693K10141D02380M25036C52937J99563R7325K12910k49005
$$ y = [883880, 1172949, 1053819, 1385628, 1167749, 1070825, 1070247, 885785, 1082065, 1056111, 869620, 783505, 880112, 986223, 952237, 842273, 1050206, 750491, 953795, 1004389, 732025, 742981, 1280886, 977406, 914903, 1122496, 916863, 1001242, 931032, 680846, 804833, 814256, 817415, 938242, 893215, 1024498, 748632, 1044258, 854165, 1263634, 943658, 1248078, 837775, 738547, 784837, 772827, 991460, 890920, 829980, 875352, 1012845, 1118111, 930096, 769306, 1063167, 886712, 509362, 665653, 647254, 627010, 781580, 577139, 834166, 833304, 716967, 1022357, 826552, 905312, 625856, 513618, 673269, 755616, 656923, 867064, 402380, 827416, 352937, 552500, 649825, 862735, 613730]
13795F13730O4422K2068Q1162j94045k5012K53053J21211k31442J1211K28612
13785I44970m44081J81351j95919K34162n0034J57554D07562J58066m430n4706
13775E06492J86847J27384o4234k67569L04642B42064M57487J9368J35588k81764
13765E72743L69197j96900j0905m9026k82432m2423K86962O9578L8606l45719
13755D09681K41025P9093K96132l66350j57620M5579P2749n3537k62227J33694
13745D38219m910K06159j11162P5530J14747j29278o5245j5710m137L98619m21531
13734D81301L14814C48787K44412K36295M3735l79043J40104j6114L62255l51235
13724F29196m5183L5432j80214K0015k9820K74810k21571L32726C09407L44653
$$ y = [613730, 678152, 700220, 781382, 587337, 562325, 815378, 936589, 705147, 716358, 944970, 500889, 682240, 486321, 720483, 670449, 828003, 407562, 565628, 561198, 506492, 693339, 820723, 756489, 488920, 793562, 242064, 699551, 718919, 854507, 572743, 941940, 745040, 734135, 685109, 402677, 360254, 647216, 716794, 755400, 409681, 650706, 729799, 1025931, 659581, 501961, 547540, 620289, 566752, 304525, 438219, 433309, 639468, 528306, 603836, 718583, 589305, 524060, 508350, 504213, 902832, 481301, 796115, 348787, 593199, 829494, 873229, 494186, 634290, 618176, 980431, 629196, 584013, 619445, 439231, 459246, 429426, 704236, 482665, 815391, 309407, 654060]
13714F54060j3111j65370m0104j56357L36731L29527m62976M6120M3262p0225
13704E01557R4738k08190k7141J44105j16170A85595J50144K09338O4832j63104
13694D46805j11024J67452l0795R9927l9566j02441N4583B02324L33267K682k28922
13683C09351j50339K57523m7520K5892K06823K6778k06391j38234A10949J20087
13673B31036J95582K44519A18618L11412J02284k43691K36227p3576j0407A90449
13662B08821L73157M0492j99982L16934k12326j56858J26556B14374K59011j28118
13652C45267j05992K86247j91613N6922l8408j74229J57160J5697k6878J14721
13642D38894h7989C51165A73243n5897M41293B38168a9428F05572k06890k2962
$$ y = [654060, 640949, 475579, 435475, 279118, 615849, 945376, 482400, 528520, 571782, 501557, 596295, 388105, 360964, 505069, 388899, 185595, 335739, 545077, 609909, 446805, 335781, 503233, 472438, 572365, 532799, 430358, 484941, 202324, 535591, 538273, 309351, 159012, 416535, 369015, 394907, 601730, 628508, 422117, 283883, 110949, 231036, 426618, 671137, 118618, 430030, 532314, 288623, 524850, 451274, 440867, 190449, 208821, 581978, 622470, 422488, 739422, 527096, 370238, 496794, 214374, 473385, 345267, 239275, 525522, 333909, 390831, 352423, 178194, 335354, 351051, 324173, 438894, -87989, 351165, 173243, 117346, 558639, 238168, -19428, 605572, 398682, 375720]
13632C75720l613K6664R3714o1403j88898J46851J7179j95527a23909H74439I2334
13620I8357L75164j29019o5320J99176o8660j03376K73422B82912m2970B090J86737
13609A88827J30610K83507A55292L93318j38732I7876J56447B2791N45422j24984
13599D43229j68852J64472j39896J6955j4481I5542L85639I5297J94240q2499
13589B07038K09746C8245L44207A13090n3302J44659N0515K4848J68581k09625
13579B38766K13664j59155m6484K38926m1636E4021K45166K89644k79240G7089
13568A67181K18194n1671O1579A86646L31048A68095p4032L02428p3085I1800
13557A9928R2793N9866o8853L06490G267M34419J37421A12961K20207A57478a30423
$$ y = [375720, 372107, 398771, 492485, 431082, 242184, 389035, 406214, 210687, -123909, 874439, 92334, 98357, 473521, 344502, 279182, 478358, 409698, 306322, 579744, 282912, 239942, 2090, 188827, 319437, 602944, 155292, 548610, 409878, 97876, 254323, 22791, 568213, 443229, 274377, 438849, 298953, 315908, 301427, 95542, 481181, 95297, 289537, 207038, 416784, 38245, 382452, 113090, 59788, 204447, 254962, 279810, 448391, 238766, 452430, 293275, 246791, 485717, 444081, 54021, 299187, 588831, 309591, 77089, 167181, 385375, 333704, 395283, 186646, 517694, 168095, 94063, 396491, 323406, 91800, 19928, 112721, 172587, 103734, 410224, 7267, 441686, 579107, 112961, 333168, 157478, -130423]
13545B53275m7230R7794A49563J38719A20716D1758L42922a22932E0003K45412
13535B95415c1963b678D04116G163J27177J09867D1311b7751E88406F1921L24365
13524C86286A69023K83812A35502J30464K27250B05474I2076L00955L2468H5108
13513B33956C9438a62508F47715I0671J36080I5136M82764B64398L3242K37276
13503E34916A57796M9189q7566J54245M03706B06695c8106q2207B61041J01063
13493C62104b19839C73553A40040L17358H6640J06645K99250B14744e0782B57158
13482D46127j36741J90147A41098d6341B76750f6441C68541A74343M66345E5978
13471B84121l0351e9764A06179K76264j27938m448J23307A75267J21530k9896
$$ y = [253275, 206045, 303839, 149563, 288282, 120716, 41758, 384680, -122932, 50003, 295415, -31963, -2678, 404116, 7163, 134340, 244207, 41311, -27751, 588406, 61921, 386286, 169023, 452835, 135502, 265966, 493216, 205474, 92076, 393031, 425499, 85108, 233956, 39438, -162508, 647715, 90671, 226751, 95136, 577900, 264398, 297640, 534916, 157796, 206985, 119419, 273664, 677370, 206695, -38106, -120313, 261041, 362104, -219839, 373553, 140040, 457398, 86640, 193285, 492535, 214744, -50782, 257158, 446127, 309386, 499533, 141098, -46341, 276750, -66441, 368541, 174343, 640688, 55978, 284121, 253770, -59764, 106179, 382443, 254505, 250057, 373364, 175267, 296797, 266901]
13461B66901a11657A38433J06417L71059B26114j783j00100A4413N39177k48491
13451C05099j3292k4437A00121b7875C52589L57616A99518J89100l9052i624C17750
13439C41525O356D3287J64625a2835B15462N6944a8649B15806j4677K47171A70731
13427A96193b43878e9482C36582J35267k35191n4500H5930J41659c2998A83346
13416D04094M9440j06824j33141M3536o5013n8840A1617P2873J69790O0259B5137
13404a27155M8314B85537A17771J48063O2764h1806B59617J88490D7116n109n518
13393C6489b66880H3735A5644L23166A30520L40150p0657b15301G1865O0696J16479
13382B49040F7726O1405f9919D59638h8683A05587K49381A750K65346q9360C7391
$$ y = [266901, -111657, 138433, 244850, 615909, 226114, 224331, 124231, 14413, 553590, 305099, 291807, 267370, 100121, -27875, 352589, 710205, 199518, 388618, 349566, -9624, 317750, 341525, 347881, 43287, 207912, -12835, 215462, 272406, -18649, 215806, 201129, 448300, 170731, 196193, -243878, -59482, 336582, 471849, 236658, 182158, 85930, 227589, -32998, 183346, 404094, 453534, 346710, 213569, 257105, 192092, 133252, 11617, 84490, 254280, 314539, 25137, -127155, -78841, 285537, 117771, 265834, 328598, -81806, 259617, 448107, 47116, 42007, 36489, -266880, 83735, 15644, 338810, 130520, 470670, 400013, -215301, 71865, 132561, 249040, 67726, 129131, -69919, 459638, -88683, 105587, 354968, 1750, 267096, 177736, 37391]
13370a84224B70527i6138G0490l3900M3714J06997K64781a1A62113K7049c0188
13358C46324N8246N9956G4286d2146A31232J33359L61934H3642J51425J75716
13348D10783j24919K9878a8675D55074A22347N43587B13735I2628C2924M10025
13338D42949j65092P2921k4938D975K36786K0092J1744A2918f9598H9729F195
13326A27759A4275K90765A10455J8461K39280O8405k07283j3201L9434J08515
13316C64066C4854L4407a9099A08859K00593F533b50532G5153L51617j80408j15943
13305A30419N934J25266J57305a0745B11689C4760J16598l9204a35426O2110C78827
13293C28122j15326B4539L74603j72397a91574C47797g9677C70756G7814a49672
$$ y = [-184224, 270527, -96138, 70490, 36590, 80304, 187301, 452082, -11, 162113, 189162, -30188, 346324, 404570, 464526, 74286, -42146, 131232, 264591, 626525, 83642, 235067, 410783, 285864, 315742, -18675, 455074, 122347, 665934, 213735, 92628, 32924, 442949, 277857, 350778, 325840, 4975, 241761, 261853, 273597, 12918, -69598, 89729, 6195, 127759, 14275, 305040, 110455, 128916, 368196, 436601, 229318, 216117, 255551, 364066, 34854, 69261, -19099, 108859, 309452, 6533, -250532, 75153, 426770, 246362, 130419, 136353, 261619, 418924, -10745, 211689, 34760, 151358, 112154, -135426, -73316, 378827, 328122, 212796, 24539, 399142, 226745, -191574, 347797, -79677, 370756, 77814, -149672]
13282A20904J25030G4627a93953B07003K7161L7100A25461e7445B22613f1726
13271A66534J86126j04426j06498K44645c08250C15562J29655B7809J52680J54014
13261C34503b34301K6596F6765J16577h568A67139m7062g0521B22136c67573B67676
13249a92066H3161f8192j68276e6504B72786p6278L21290B36411r4530K53032
13239C94913f1945K4275D0335J96982M3492I2374k0137a9144j16402B87222h2057
13227D1895b76504B72253p270G2590P6594k9200J59671q9580K4599J98212D4601
13215C38560J21822A73230D8684K14107e9024B1899a94353a9819B73545a1836
13204I1558j1568J88745d13699A97115F7282M1678m5720i3350A28970a66251A38002
$$ y = [120904, 245934, 74627, -193953, 207003, 234164, 271264, 125461, -57445, 222613, -61726, 166534, 352660, 248234, 141736, 386381, -308250, 315562, 445217, 27809, 180489, 334503, -234301, -207705, 66765, 183342, -8568, 167139, 120077, -70521, 222136, -367573, 267676, -192066, 83161, -68192, -236468, -56504, 272786, 196508, 517798, 236411, 141881, 394913, -61945, -37670, 40335, 237317, 280809, 92374, 72237, -19144, -135546, 287222, -82057, 41895, -276504, 272253, 264983, 72590, 149184, 119984, 279655, 190075, 214674, 412886, 44601, 338560, 460382, 173230, 48684, 262791, -59024, 21899, -194353, -19819, 273545, -11836, 91558, 79990, 268735, -413699, 197115, 67282, 108960, 63240, -93350, 128970, -166251, 138002]
13192B24821a36958F5732a66629A35424a39383B46560j12483J7733a62750P020
13182a55730N7939C51562b41573D1546a52218D7595O1381f0706D03226A26310
13171a49431A30777O9278k8147G5440f5911a556o3318j2841j57807P7416F6759
13159A59053K6109j4863j4696L37413B43497q6768b5796c698k6734A84698F237
13147b9912a2586j69009J1648A31351F0060J50637J06494b9020A4098J63713a84074
13135B70876a75150F1240b6160H7933a27121p4067B8170L5472P1186k4290a2446
13123A88898b988A68126E795J01772E2595M7765a15324A35976a23246A9235Q8503
13112A07738J36399f6570C2047K21191a237D51892H4677a64396l52999a24258
$$ y = [224821, -136958, 65732, -166629, 135424, -139383, 246560, 134077, 151810, -162750, -155730, -97791, 351562, -241573, 41546, -152218, 47595, 108976, -60706, 403226, 126310, -149431, 130777, 200055, 171908, 75440, -65911, -1556, -64874, -77715, -235522, -158106, 66759, 159053, 185162, 170299, 155603, 493016, 243497, 156729, -25796, -3698, -30432, 184698, 6237, -29912, -12586, -181595, -169947, 131351, 60060, 210697, 317191, -29020, 14098, 177811, -184074, 270876, -175150, 61240, -26160, 87933, -127121, -201188, 28170, 63642, 134828, 110538, -12446, 188898, -2988, 168126, 5795, 107567, 52595, 100360, -115324, 135976, -123246, 19235, 107738, 244137, -66570, 32047, 253238, -1237, 451892, 84677, -164396, -517395, -124258]
13101E067P5929J31487Q7709A08619J2628k8703b20740A03854e1416A60209o1043
13090I9166j6739Q9650a60883a0813B7123K7227N9987a38248e3999o3494C30710
13078B2476K30407D4334K07245J8489D5397J04923J31397A01303K0285a77156
13067C33759d7120A95205a61072f8991A79797k3103o0244J35351j6944q6159H285
13055A90999c22762C83880j85713l2434a40565e76j49209G3292c19205B81555
13044A30569g4235J9876D99211B39730b57290E5559J84313a64649J0039A46446
13033a4410D18698j93793K51293m647a33372A69863L0302M01485A77962c730p9160
13022h2890A12822b08535B0314a26609C9087e0769B90266J4816A00008a5312A68063
$$ y = [5067, 80996, 212483, 300192, 108619, 121247, 92544, -220740, 103854, -51416, 160209, 99166, 82427, 172077, -160883, -10813, 27123, 54350, 114337, -138248, -53999, -117493, 330710, 22476, 252883, 44334, 251579, 270068, 45397, 150320, 281717, 101303, 121588, -177156, 333759, -47120, 195205, -161072, -68991, 179797, 156694, 96450, 231801, 214857, 128698, 8285, 190999, -322762, 383880, 198167, 165733, -140565, -576, -149785, 73292, -319205, 281555, 130569, -74235, -54359, 499211, 239730, -257290, 55559, 239872, -164649, -154610, 146446, -14410, 418698, 224905, 476198, 471551, -133372, 169863, 200165, 601650, 177962, -3730, -82890, 112822, -208535, 20314, -126609, 39087, -50769, 290266, 305082, 100008, -15312, 168063]
13010d0951H168h9115I655J1373J8103L12829B6362K79329c2773A80761b3794
12998d3528A24791k5825A6401h2952j66741a13062A84724c3053n6051L036H4205
12986A9435J38606j9978F539f0524b2418n3554B28468j2137A0037M8333K94223
12975C52593b43034B30262R5725F6122a69653A20152J55065i3103j92107A54966
12964F037K14946r0026b05929B57583A20830J36690b06486N9189L8813r3294G0182
12952B92797c34869A29406K2033o2006M7298n3183f4150B09805b80034A09115
12941A55723a06228n9247d4918A22927J37424a09531j98305D6671e24646A89786
12930B54842r818a03007B987b7420E2089a88792F0659h8307A66422R565M3446
$$ y = [-40951, 8168, -89115, 9655, 21028, 39131, 351960, 26362, 305691, -32773, 180761, -23794, -43528, 124791, 98966, 16401, -82952, -249693, -113062, 184724, -33053, -89104, -86068, 84205, 19435, 158041, 138063, 6539, -60524, -22418, -75972, 228468, 216331, 10037, 58370, 352593, -243034, 230262, 325987, 66122, -169653, 120152, 275217, -93103, -285210, 154966, 6037, 220983, 130957, -205929, 257583, 120830, 257520, -206486, -147297, -108484, -201778, 70182, 292797, -334869, 129406, 151439, 89433, 136731, 83548, -64150, 209805, -280034, 109115, 155723, -106228, -165475, -44918, 122927, 260351, -109531, -307836, 46671, -524646, 189786, 254842, 245024, -103007, 2987, -27420, 52089, -188792, 60659, -88307, 166422, 175987, 219433]
12919B19433a59584B28143k0834d4632I7638K09882c28907C83779A8018J89231
12909B07249A0076c11697H7023O7230b92638J18356B1698L33135D2480J34807
12899A77287a03996H7286R8848N643a82443h2152A33059C0759J45518j0917a08380
12887E0349J28440d4513k3431p5240f1561G3999K22842G2840a17540E936J3066
12876A9002P5723m6013a62445B29676L0138o8742g4094D0524M2959K57402g8614
12864b51928J20453E8445c01514A23678i8446H6634l7294c45681a12446D7060
12853b43952A44994N5606a08923M2611a2850o5244p0599I3671J69184a99052f7359
12841B63771D9159c02737R8037B0446K6712K24071a24571k31991B86559a80301
$$ y = [219433, -159584, 228143, 207309, -44632, 97638, 307520, -328907, 383779, 18018, 207249, 10076, -311697, 87023, 154253, -292638, -174282, 21698, 354833, 42480, 177287, -103996, 87286, 186134, 191777, -182443, -82152, 133059, 30759, 176277, 165360, -108380, 50349, 178789, -44513, -67944, -143184, -61561, 73999, 296841, 72840, -117540, 5936, 19002, 94725, 48712, -162445, 229676, 259814, 191072, -74094, 40524, 83483, 340885, -78614, -251928, -131475, 58445, -301514, 123678, -98446, 86634, 49340, -345681, -112446, 47060, -243952, 144994, 200600, -108923, -66312, -12850, -78094, -148693, 93671, 262855, -199052, -67359, 263771, 49159, -302737, -204700, 20446, 47158, 271229, -124571, -356562, 286559, -180301]
12830F4399b18561b2558B13826e2436D52396a46158c6960C509J94619j9889a030
12818b73487F5423J68745a09641k6856j67436a02937B12814m1488D744b76559
12807A62541J00646M4580I6108D1714e46740a78222A04747K4064Q3341a34455
12796A13217a67571H1693a33045d3946A6682a43575A16068a8330k6383H5494Q9052
12785A74546a25638A8668a05813k76933J59181I2809C273P0661K1559d30560G8621
12773B5826K80532d19507A89228a69890K9380A85176D4150O6218B6323Q9035D7610
12761b83209O3959j71380c4400C2308J66285k9562F0054b02939A4771L80332c54650
12749A62092a44005l8874A13642c9271A171b86914A30504E6407b88056O6635B52140
$$ y = [64399, -218561, -22558, 213826, -52436, 452396, -146158, -36960, 3509, 198128, 178239, -1030, -273487, 65423, 234168, -109641, -136497, -303933, -102937, 212814, 171326, 4744, -276559, 162541, 263187, 307767, 96108, 41714, -546740, -178222, 104747, 128811, 212152, -134455, 113217, -167571, 81693, -133045, -43946, 16682, -143575, 116068, -18330, -44713, 85494, 174546, -125638, 18668, -105813, -382746, -223565, 92809, 3273, 73934, 95493, -430560, 78621, 25826, 306358, -419507, 189228, -169890, -140510, 185176, 44150, 110368, 26323, 115358, 47610, -283209, -219250, -390630, -34400, 32308, 198593, 169031, 60054, -202939, 14771, 395103, -354650, 162092, -144005, -182879, 113642, -39271, 1171, -286914, 130504, 56407, -288056, -221421, 252140]
12737a67475A02373K6375K24686e7170A01381d9085A63176J45886l1320C4231
12726A07379D9331F068J14440g7094d369q2563A88644I3777h3048B36677I0128
12714h4011A78228q5151L68460k30186e423D26561n0387g157B36073I5278g1993
12702F2828R8702k9137J02615h6927B60747f0547r3700j4137A07964L17426A87301
12690b13851B64705e9431k53878B44914b20194B97849Q3665a41760A60301g5265
12679A72293a80113A30539m2404j1869i557B56777j0301b3056E466e364A23803
12667B57711A20082a053n37210a12389a8091l49358i1966B02957n5142M2142a34336
12655f1547B23117a39929B02315J27885A61391Q0111a63623C36587j30348l4243
$$ y = [-167475, 102373, 128748, 353434, -57170, 101381, -49085, 163176, 309062, 277742, 34231, 107379, 49331, 6068, 120508, -77094, -4369, -86932, 188644, 93777, -83048, 236677, 90128, -84011, 178228, 93077, 461537, 231351, -5423, 426561, 376174, -7157, 236073, 95278, -71993, 62828, 161530, 132393, 235008, -86927, 260747, -60547, -154247, -168384, 107964, 425390, 187301, -213851, 264705, -59431, -313309, 244914, -220194, 297849, 381514, -141760, 160301, -75265, 172293, -180113, 130539, 88135, 76266, -9557, 256777, 246476, -23056, 5466, -5364, 123803, 257711, 120082, -1053, -538263, -112389, -18091, -367449, -91966, 202957, 147815, 189957, -134336, -61547, 223117, -139929, 202315, 330200, 161391, 241502, -163623, 336587, 206239, 171996]
12645A71996a24142A77032m7203b3694A44041F0067c04299H090a88641l068L3416
12634a58293A41333F2905b44526A81988J53075j31513c03833A21511J68914A32978
12623B43983b4056j04855A55363M1682a72764j62253B9731c6496f283A21674C6758
12611A19686a25942e7574C13194o8039A2398c65512C3656R3522B7513L30858a12509
12599A64279b2817q1214B09612h818l9610C00450b4599A17405a09284f169k92199
12588b98368A69967a99362A30409k3226h5427B01521l6526D1472b87085A57352
12577a07039A23723E6161h9533i749n6683E3621e0642G088C532b14575Q0031A99551
12564A98485c72095h6754j9712F0002P0542D4734K68070b951B63940a57112D5588
$$ y = [171996, -124142, 177032, 129829, -23694, 144041, 60067, -304299, 8090, -188641, -191709, -158293, 141333, 62905, -244526, 181988, 335063, 203550, -303833, 121511, 290425, 132978, 243983, -24056, -128911, 155363, 197045, -172764, -335017, 29731, -36496, -6283, 121674, 36758, 119686, -125942, -57574, 313194, 245155, 12398, -365512, 33656, 127178, 27513, 358371, -112509, 164279, -22817, -104031, 209612, -8818, -48428, 300450, -24599, 117405, -109284, -6169, -298368, 169967, -199362, 130409, 107183, -85427, 201521, 164995, 41472, -287085, 157352, -107039, 123723, 56161, -89533, -9749, -66432, 53621, -50642, 7088, 3532, -214575, -134544, 199551, 198485, -372095, -86754, -106466, 60002, 130544, 44734, 312804, -2951, 263940, -157112, 45588]
12552H7326J4180P583K0931L1466C4924a08072B1986J09643b20267C16429b24278
12540B91812R784E4549a76996b974k52414l3124E7193J93840g574B6042R9019
12529A25061l5522j0651b06475B02979f5593E5649g3745A62380m8774e4269J5162
12518c9107F4293a61643A60474B4474a60206l6070B10157a26007e7616A06288
12507C0271M2433K35991j25784J7306m0134E808A923b71441D32439b23357C80623
12495I5141o440l8541b42570i1142D612R3751i1828C2110i5681F9647O4723F5707
12482b73845M7826a10420A64361a52028B38707o1705a34445r7533a10683D5264
12471F3548a44824j88748q5977I7302J60501b4656A46152C1132a46851k26986
$$ y = [87326, 101506, 109089, 130020, 161486, 34924, -108072, 21986, 131629, -220267, 316429, -224278, 291812, 301596, 54549, -176996, -2974, -255388, -288512, 57193, 251033, -7574, 26042, 125061, 89539, 78888, -206475, 202979, -65593, 55649, -73745, 162380, 113606, -54269, -39107, 64293, -161643, 160474, 24474, -160206, -196276, 210157, -126007, -57616, 106288, 30271, 72704, 308695, 182911, 200217, 160083, 5808, 1923, -271441, 432439, -223357, 380623, 95141, 88701, 50160, -242570, -91142, 4612, 98363, -91828, 32110, -95681, 69647, 134370, 65707, -273845, -226019, -110420, 164361, -152028, 238707, 177002, -134445, -231978, -110683, 45264, 63548, -144824, -333572, -419549, 97302, 257803, -24656, 146152, 31132, -146851, -373837]
12461c73837A5500b12822D7192e99040A95770j9055l5568A3684c33758J63685
12451a70073c2366B53526a05351B1852L3874d1147A36360J1515F2187h5044B38701
12439a78217e7639A54494b57255h5718A75732b46432B49465l8347b11356b0139
12428C6335a22617q9084A61698b39848a5759k4892j40082E1958i3825A14119m5617
12417F8502b68148F0046J23275M9052c96979j8484a90432h1289a8823j73487M7520
12406a44790C2391A6163a63946n7919D262a53689A70823F2211k700n100a62362
12394A38832c5835E7017K64581a56862A26930b74698A26028h1140F7224a36102
12383a93047j30688C54310a08824l72805J93039c2911j709j33173P6135c0774
$$ y = [-373837, 15500, -212822, 47192, -599040, 195770, 176715, 141147, 13684, -333758, -170073, -32366, 253526, -105351, 21852, 55726, -41147, 136360, 147875, 62187, -85044, 238701, -178217, -57639, 154494, -257255, -85718, 175732, -246432, 249465, 211118, -211356, -20139, 36335, -122617, -211701, 161698, -239848, -15759, -40651, -180733, 51958, -93825, 114119, 68502, -268148, 60046, 183321, 232373, -396979, -415463, -190432, -81289, -18823, -192310, -144790, 32391, 16163, -163946, -221865, 4262, -153689, 170823, 62211, 59511, 54411, -162362, 138832, -35835, 57017, 321598, -156862, 126930, -274698, 126028, -81140, 67224, -136102, -193047, -323735, 354310, -108824, -481629, -288590, -32911, -34620, -167793, -91658, -30774]
12372B59552F3123a43794A13360b29292p5798L6471B23019a50819o0119c0614
12361D3223b43375O5874B73966f5905b0460j4043q3171d8577G2671a84397H4828
12349g4797G508d2098j19542I3313d37934A32907m0128e1906j6207A3402J31380
12338A44782F5445K75748K8573a05144o3915e6991e205A87860B1486K02883c748
12326B02490a56933M288O8710m1991a0000F2415l056f294k44627d7138A30670
12314e3181p3441A39679n6553A8129J27065b74810C53712A27816M237a29281k67455
12303c96736A35716k3852b94883I0703c4023E6082a94630F3372b6680A52719a52872
12291C41377b54663R0219B77562g6082j21200A05955f9928A78740c991A84980
$$ y = [259552, 63123, -143794, 113360, -229292, -305090, -268619, 223019, -150819, -210938, -30614, 43223, -243375, -177501, 273966, -65905, -20460, -34503, -117674, -48577, 72671, -184397, 84828, -74797, 7508, -42098, -161640, 93313, -437934, 132907, 92779, -51906, -68113, 13402, 144782, 65445, 341193, 369766, -105144, -169059, -56991, -5205, 187860, 21486, 224369, -3748, 202490, -156933, -152645, -83935, -125926, -10000, 62415, 59359, -6294, -250921, -47138, 130670, -53181, -126622, 139679, 83126, 18129, 145194, -274810, 353712, 127816, 132053, -129281, -396736, 135716, 111864, -294883, 90703, -34023, 56082, -194630, 63372, -26680, 152719, -152872, 341377, -254663, -164444, 277562, -76082, -197282, 105955, -69928, 178740, -3991, 184980]
12280A44826L9057b45979B68814J60451a65744A58917k3262J65798j06799a09477
12269A55372N4901J55575A37511L6622J45891J69415B28073A9971J41592a17041
12258C44579A10016a32987A32846b22223B7085a42170M8237M3213B04943q2841
12248A22102L85539b38700R3708B69970J1677A09237g5712n965B92520d8358B68655
12236B4052L8470p018d6541a4911o8727C6518J95532F9415M99598i263A60460
12224B12123J535D47R3529J42211a13633A51952K0303L3411j00010J99467L097
12213C08220B6944m878N5129a33828c9555E12535k38134J54367A21762J30544
12203B52306a37823A9332J10157i6147G2964M638J89585d9678F25317k47886I9722
$$ y = [144826, 183883, -245979, 268814, 429265, -165744, 158917, 135655, 301453, 194654, -109477, 155372, 210273, 365848, 137511, 174133, 320024, 489439, 228073, 19971, 161563, -117041, 344579, 110016, -132987, 132846, -222223, 27085, -142170, -93933, -50720, 204943, 122102, 507641, -238700, -144992, 269970, 281647, 109237, -75712, -81677, 292520, -48358, 268655, 24052, 62522, 55504, -46541, -14911, -83638, 36518, 232050, 69415, 569013, -9263, 160460, 212123, 213658, 447, 93976, 236187, -113633, 151952, 172255, 205666, 105656, 305123, 308220, 26944, 22066, 77195, -133828, -39555, 512535, 274401, 428768, 121762, 252306, -137823, 19332, 129489, -96147, 72964, 77602, 267187, -49678, 625317, 377431, 99722]
12191I0456K6969C7299J58952H141a60800B12742n03K21456A39468R3651f5333
12179C99188f6523H1365A328M3850K67091c32810B53749b43282E1317a50892B1430
12167F2683a39245j2187B22980A4584a97737B16874q7579J35595a00793a9034
12156C62261j43197J56996g6463A26961J76737j50198b20582G1762e4725r3671
12146a48396A40390J59129j44526a31347a2099A60362e0420G3139A3847b01960
12135I205K95990i6288E3979J1756N8063b48712B99673d91106B3437b1408F2836
12123b07539P3982A13062a44312B09591a78282A78554h0891o0598L3867A73553
12112i6097E4125J18456G5213d20338E951L4659J1326g0323I0674O9096D8881
$$ y = [90456, 117425, 37299, 196251, 8141, -160800, 212742, 212239, 433695, 139468, 233119, -65333, 399188, -66523, 81365, 1328, 45178, 312269, -332810, 253749, -243282, 51317, -150892, 21430, 62683, -139245, -151432, 222980, 14584, -197737, 216874, 129295, 264890, -100793, -19034, 362261, 219064, 376060, -76463, 126961, 303698, 153500, -220582, 71762, -54725, -148396, 140390, 299519, 154993, -131347, -12099, 160362, -50420, 73139, 13847, -201960, 9205, 305195, -96288, 53979, 65735, 123798, -248712, 299673, -491106, 23437, -21408, 62836, -207539, -133557, 113062, -144312, 209591, -178282, 178554, -80891, -141489, -107622, 173553, -96097, 54125, 172581, 75213, -420338, 5951, 40610, 51936, -70323, 90674, 159770, 48881]
12100d16307G1252g2439E0472H602a2465F1313a66925G4442f30840H1807c2535
12088B05920c7280I5770O2580d5099k9543l3657B10333a37165d483C04184j21226
12077A82958L63794R74727j67618A74676a16174G7142M1058h8418j5629J3969
12067i0078j67196a6600B9850K65236g609j1992H5284A2852L32585g6574D7929
12055g9779c3876A84631a55365G3681a36089l17491D00520e6971F7637c6987J0013
12044b6974I9872a52493A07600J67429e08H1683c00463f9244j13056e0312j47649
12033a97961A68687O6941f5599j7447D09836e0274A84841F6679C3164M51236A27867
12021B7932J09071M8184B6437b84018H399J74518c3191k94391i2735C57243D0544
$$ y = [-416307, 71252, -72439, 50472, 8602, -12465, 61313, -166925, 74442, -630840, 81807, -32535, 205920, -37280, 95770, 158350, -45099, -74642, -108299, 210333, -137165, -4483, 304184, 182958, 546752, 1521479, 1353861, 174676, -116174, 77142, 118200, -88418, -104047, -90078, -257274, -16600, 29850, 295086, -7609, -19601, 85284, 12852, 345437, -76574, 47929, -79779, -33876, 184631, -155365, 73681, -136089, -453580, 400520, -56971, 67637, -36987, -26974, 99872, -152493, 107600, 275029, -508, 81683, -300463, -69244, -182300, -50312, -197961, 168687, 235628, -65599, -83046, 409836, -50274, 184841, 66679, 33164, 484400, 127867, 27932, 137003, 185187, 26437, -284018, 8399, 182917, -33191, -327582, -92735, 357243, 40544]
12009c21898b8648k57854Q4695j3078E3510a4890n5014F8329a38482c5600E73
11997A38991a8969A09851B6790J0960K80715a20572N2389l6694H3096N8239a34677
11985d0506G5400a78483N2385B1022K6700J04686D185e2509H3703A2900d24516
11973B37228D0292N708b140n7500k06084h925k45103A70076D02b32570C58004
11961b82373g9402n9368A10185C0193M17704H1150h9863n61o2944g3896G7846
11949a2437A58641I683J82898b10808a03152A14781l1792d4996A02372b68213
11938b33395G2443J0672e7336q477A47376C4784J52104k9079D5377N0802D5869
11926D6614a34947j51438B01601A2782a87515j1550E5378b3193A09662K2970a26458
$$ y = [-321898, -28648, -286502, -201807, -214885, 53510, -14890, -69904, 68329, -138482, -35600, 573, 138991, -18969, 109851, 26790, 37750, 318465, -120572, -68183, -104877, 83096, 141335, -134677, -40506, 75400, -178483, -126098, 21022, 47722, 152408, 4185, -52509, 83703, 12900, -424516, 237228, 40292, 46000, -2140, -59640, -265724, -8925, -254028, 170076, 402, -232570, 358004, -282373, -79402, -138770, 110185, 30193, 447897, 81150, -89863, -90424, -153368, -73896, 77846, -12437, 158641, 9683, 192581, -210808, -103152, 114781, 82989, -44996, 102372, -268213, -233395, 72443, 83115, -57336, -65813, 147376, 34784, 186888, 157809, 45377, 96179, 45869, 46614, -134947, -286385, 201601, 12782, -187515, -199065, 55378, -23193, 109662, 132632, -126458]
11914a26145A25999J49007a39933E8216e060A10721a34726A04561c00514B53993
11903b2365k5650j47848K4382A19818N3104a30007A06445a64222j8969j53541
11893c36732A64230e16614a91201A92854a74089h1125J0930A07126f4336j06158
11883a70494I4106c0984C4883h7314d0098k3734A60123b56108A17543D991a61679
11871f4380F2506a2546A499a5530A95059e9464j0739A20889B1269a21141E4251
11859A80646o5044Q0273c36987D9848R2707D0636c7687a7129p1095B5248g4434
11847C21412d1851B0234P2755b61560n2072J03747B79343A2838a21947C078b8101
11835g595E5597A3074e5487C2016J00067O2126a38985l0349b3587D26158c09491
$$ y = [-126145, 125999, 275006, -139933, 58216, -5060, 110721, -134726, 104561, -300514, 253993, -22365, -48015, -195863, -171481, 119818, 172922, -130007, 106445, -164222, -183191, -336732, 164230, -516614, -191201, 192854, -174089, -81125, -70195, 107126, -64336, -170494, 94106, -30984, 34883, -87314, -40098, -63832, 160123, -256108, 117543, 4991, -161679, -64380, 62506, -12546, 1499, -15530, 195059, -59464, -70203, 120889, 21269, -121141, 54251, 180646, 115602, 195875, -336987, 49848, 142555, 40636, -37687, -17129, -88224, 25248, -74434, 321412, -41851, 20234, 92989, -261560, -313632, -209885, 279343, 12838, -121947, 3078, -28101, -7595, 55597, 13074, -55487, 32016, 132083, 194209, -138985, -169334, -23587, 426158, -309491]
11823A031J6528d28684a61176C05339G2665K74511E6144J17071a03748L903c3976
11811A4602a41202f9913j03231F0489c45520A5151a65635M7611L790a272F6312
11799B26051a15933j9735O3280A41032g4360K1762o0043E2427m716K19187r6711
11788A70187n8645h1920H8374f2776J3285B15564a12357j90172A246M42328A60554
11776A23073E1041R4751E4808c0476k29233c856n3238m2000M0131d3k44994a348
11763B08562J9812a00984r2907A49503J0791N7148a14742A62503g7228A48254
11752d3175j14080A15264a12939B83096A36676F104K79915a52068A8610L4835
11742E3445a34501o2024l7530I2074b3548q5216A87659F0141J37396H6091B6257
$$ y = [1031, 17559, -428684, -161176, 305339, 72665, 347176, 56144, 173215, -103748, -99845, -33976, 14602, -141202, -69913, -173144, 60489, -345520, 15151, -165635, -118024, -114234, -1272, 66312, 226051, -115933, -135668, -72388, 141032, -74360, -52598, -112641, 52427, 47711, 266898, 170187, 111542, -81920, 88374, -62776, -49491, 215564, -112357, -302529, 1246, 443574, 160554, 123073, 51041, 145792, 54808, -30476, -259709, -3856, -57094, -99094, -58963, -43, -245037, -1348, 208562, 228374, -100984, -193891, 149503, 160294, 217442, -114742, 162503, -77228, 148254, -43175, -157255, 115264, -112939, 283096, 136676, 6104, 286019, -152068, 18610, 53445, -134501, -196525, -234055, 92074, -23548, -108764, 187659, 60141, 197537, 86091, 26257]
11730B93117J09366h0411j02404e402A24771b3310F8027a37359J3483m3846C61300
11718f6647B2272a87179A59887a45334I0945L06892b65704e3398A00917K53621
11708C54538a1672n72k37534N8191B87838b25843a09938A72355j7434i8070F1962
11696b50495C12301A46487N6799B8036N0477a58013A73245E7975h2957j1743L561
11685i1139E56620i4757E7761a39540H1277d6057A30397g179D0009a19880A86451
11673a62734o8059d895j08817N1610A137b09965R6918j45330m5131A15218a54766
11661A25675j8605K86853A81259p2771c0114A63106c16953D03637a71610E010
11650a96374B7583b4525E0788L973J147J21371c19436b3982A9248b27661J01043
$$ y = [293117, 402483, -80411, -182815, -5402, 124771, -23310, 68027, -137359, -123876, -167722, 361300, -66647, 22272, -187179, 159887, -145334, 90945, 397837, -265704, -53398, 100917, 354538, -11672, -12244, -249778, -191587, 287838, -225843, -109938, 172355, 154921, -98070, 61962, -250495, 312301, 146487, 203286, 28036, 78513, -158013, 173245, 57975, -82957, -94700, -91139, 556620, -94757, 57761, -139540, 81277, -46057, 130397, -7179, 40009, -119880, 186451, -162734, -230793, -4895, -113712, -62102, 1137, -209965, -113047, -258377, -303508, 115218, -154766, 125675, 107070, 393923, 181259, 108488, -30114, 163106, -316953, 403637, -171610, 5010, -196374, 27583, -24525, 50788, 54761, 55908, 177279, -319436, -23982, 19248, -227661, -126618]
11639a26618B7151J24920K42460I8988d1414r3191A7117i3285B12519o1218J67004
11628C18305a9969F4518C537c19112c555B51409Q4722a45452N9030A18760a1623
11616a6499C95764h3902A94880a85977A15509J62122R3863G1436P0929a18287
11605b08873o1883Q8385j27947A26852R686F5144a59509B34688J96401C4058L10966
11594C45024I8094g6505K5287r5283C45799K46401a69238A96055p1290d52336
11583B71901a45070G8798a63911Q1273A01349c1853k41756A79861d0813B64928
11572a38130D9767N8491a9056j00801B67888j01940J44433A44915J69034a07234
11561a53438B7398c6259E0706K70043A24730a00153A69963b57136d7448J1643
$$ y = [-126618, 27151, 152071, 394531, 98988, -41414, -134605, 17117, -93285, 212519, 151301, 318305, -19969, 64518, 3537, -319112, -3555, 251409, 336131, -145452, -86422, 118760, -11623, -16499, 395764, -83902, 194880, -185977, 115509, 277631, 371494, 71436, 142365, -118287, -208873, -270756, -182371, -310318, 126852, 136538, 65144, -159509, 234688, 431089, 34058, 345024, 98094, -76505, -51218, -146501, 345799, 592200, -169238, 196055, 124765, -452336, 271901, -145070, 78798, -163911, -82638, 101349, -31853, -273609, 179861, -40813, 264928, -138130, 49767, 108258, -19056, -119857, 267888, 165948, 310381, 144915, 313949, -107234, -153438, 27398, -36259, 50706, 320749, 124730, -100153, 169963, -257136, -47448, -35805]
11551c5805o2676C1970j5777N40361a70821C41596A23294J26209j04879J08627
11541B53251r834f3897H5461k4037c49194I7886L14853e1399n9576q3992A11932
11529B13355P0608m4736F7720b13186C94120a51937H7015c3896B79607A34463
11518B61728j11382b2034C56794j41009g9265o9477c8984A32093i6220C42538
11507b21854E1330b0236H0497a48455B42657K44567B26807F6290a52999A06261
11496C6086J40695J95861q6413a47996Q144j36877F0339a06281d171D54438a4861
11484B18710c09728P7313B55618j19516L07986B17803I395i5169A24923J67056
11474B91979A03418l1882L45724p3774A29981K10422C069R5458h8186A98054q5357
$$ y = [-35805, -98481, 31970, 16193, 556554, -170821, 341596, 123294, 249503, 144624, 253251, 243417, -63897, 85461, 61424, -349194, 97886, 412739, -51399, -110975, -194967, 111932, 213355, 283963, 239227, 67720, -213186, 394120, -151937, 87015, -33896, 279607, 134463, 261728, 150346, -22034, 356794, 215785, -79265, -148742, -38984, 132093, -96220, 342538, -221854, 51330, -20236, 80497, -148455, 242657, 487224, 226807, 66290, -152999, 106261, 36086, 176781, 372642, 286229, -147996, -139852, -276729, 60339, -106281, -4171, 454438, -14861, 218710, -309728, -232415, 255618, 136102, 444088, 217803, 9395, -95169, 124923, 291979, 103418, 71536, 417260, 343486, 129981, 340403, 3069, 98527, -88186, 198054, 112697]
11463A12697R2833G083i6979A47883l3041J09075b06095B53878J61534j37539
11453B77873g3330O356p4910A14956B7958b31223g4473C1889a29823B28960o9515
11442A59445G0501a17187o2195C9072N6703g6762a5178A97728A9477a29617B64924
11430B85190a09512D20308A20966a05648A91655b70297c2218b246C70396j07650
11420B62746g4422J1495A33886b40083E7630a77395j1770o8891E6398K5471B8111
11408e4105D26228G1115a0474A44497J1554e18A18830c0075j84117F5993b2956
11396a93413h6202A14389b99491C5864b8969A75156d5666J5198C44165F2743b09806
11384a5711j84512A91838J6244M7335a95206B53561d9364q0950B37754d1323A4243
$$ y = [112697, 205530, 7083, -96979, 147883, 114842, 223917, -206095, 253878, 415412, 277873, -73330, -66974, -141884, 114956, 27958, -231223, -74473, 31889, -129823, 228960, 159445, 70501, -117187, -179382, 39072, 95775, -76762, -15178, 197728, 19477, -129617, 264924, 285190, -109512, 420308, 120966, -105648, 191655, -270297, -32218, -2246, 370396, 262746, -74422, -62927, 133886, -240083, 57630, -177395, -189165, -258056, 56398, 81869, 28111, -54105, 426228, 71115, -10474, 144497, 156051, -518, 118830, -30075, -214192, 65993, -22956, -193413, -86202, 114389, -299491, 35864, -28969, 175156, -45666, -30468, 344165, 62743, -209806, -15711, -200223, 191838, 208082, 255417, -195206, 253561, -49364, -130314, 237754, -41323, 14243]
11372H3605N0330M8362B5223L9359L04701A2405a37479G721O4123a02787k05547
11361c08334H3436c9611p1832C76691D4069J02225f4898H7102c76331C1863c45535
11349b63747E0679O0450a78519m580E9J13259J04728m5598c0303m0967A66567
11337b82300J5608A16833a66141B0436b88323f5385A92335g1486m2375A20146
11326d9674A86381o3502i1541A30462M2445c36372d6678F0593a18211R411C6708
11314a43971B5983K5111J74017o7192b7170A69300h2348a3568p3033A2720L12483
11303C25203H6808j7022B2548a82065j00301J30769o010B40729g3709Q356k41474
11292c06827Q1820m133A344c67212B45297d953A78623I39h5776a2207j21101j5799
$$ y = [83605, 133935, 182297, 25223, 64582, 369283, 12405, -137479, 7721, 71844, -102787, -308334, 83436, -39611, -111443, 376691, 44069, 146294, -64898, 87102, -376331, 31863, -345535, -263747, 50679, 111129, -178519, -183099, 59, 113318, 218046, 172448, -30303, -71270, 166567, -282300, -266692, 116833, -166141, 20436, -288323, -65385, 192335, -71486, -113861, 120146, -49674, 186381, 122879, -91541, 130462, 172907, -336372, -46678, 60593, -118211, -108800, 36708, -143971, 25983, 51094, 225111, 157919, -27170, 169300, -82348, -13568, -86601, 12720, 325203, 86808, 69786, 22548, -182065, -282366, -151597, -157607, 240729, -73709, -65353, -306827, -225007, -229140, 1344, -367212, 245297, -4953, 178623, 939, -85776, -12207, -133308, -149107]
11280a49107g3386j3639b8977F3080a80978J6504A35682E1326a64746j25867f4388
11268b06263k05953B39239j4007a40742d7770A64713a99949B9610N7046m2745
11258D3911d2345j17657A47414d9119C47331a27576H0208d4182B55161G633L6618
11247D4251M7712m3301c947k97441R2161A56814m4681a89228i2134m1996L0654
11236a03476M0194A04560h776A06724J72431a7253k11244i1074c869A40314P5632
11225B15946C94K50168a10921M5242k2621j49506A39703a24574L9101I9912J6472
11214A16384J49144j17608f9127A68880b21706c6402k96645A2635J77781a65808
11203D8264N2752a06714M6187j16550O8001I8667J38733c48323n568H7546f73365
$$ y = [-149107, -73386, -87025, -28977, 63080, -180978, -164474, 135682, 51326, -164746, -290613, -64388, -206263, -412216, 239239, 225232, -140742, -47770, 164713, -199949, 29610, 86656, 43911, -42345, -160002, 147414, -49119, 347331, -127576, 80208, -44182, 255161, 7633, 44251, 91963, 48662, -3947, -301388, -209227, 156814, 112133, -189228, -92134, -134130, -103476, -63282, 104560, -8776, 106724, 279155, -17253, -228497, -91074, -3869, 140314, 215946, 394, 250562, -110921, -65679, -88300, -237806, 139703, -124574, -85473, 99912, 116384, 265528, 147920, -69127, 168880, -221706, -36402, -333047, 12635, 190416, -165808, 48264, 101016, -106714, -60527, -177077, -109076, 98667, 237400, -348323, -353891, 87546, -673365]
11191d2432A58771A1105J64444d9348j35667D5568b95680B28566a65723j82992
11181c48715A25757a46454I9968a10540N3256A5277a73085I2017b0372C49244
11170b7594B16603a23111D0133Q129K11896a86065C3359b22455r2384J16386A40982
11158B51056r011N1623G2951c44710a45810q2748a00934n9228B34514b55782A31470
11146A58062a386k58057N7670D3341J37053C4421J34778J52974p9117j08313P0333
11135B05076a16293n0001a1236B43973f050E0310N8074N9325C9605M8551j1259
11124G6897C5405M8106J46915a26718c4603l87070B57299a55904B38203g6415
11113a92939G2318a30372D6985M8576D0607b42944A24473Q3093b00091B1108a69404
$$ y = [-42432, 158771, 11105, 175549, -49348, -185015, 45568, -295680, 228566, -165723, -348715, 125757, -146454, 99968, -110540, -57284, 15277, -173085, 92017, -20372, 349244, -27594, 216603, -123111, 40133, 48262, 260158, -186065, 33359, -222455, -314839, -198453, 140982, 251056, 242045, 293668, 72951, -344710, -145810, -228558, -100934, -160162, 234514, -255782, 131470, 158062, -1386, -259443, -201773, 43341, 180394, 34421, 169199, 322173, 243056, 134743, 205076, -116293, -166294, -11236, 243973, -6050, 50310, 108384, 167709, 39605, 88156, 76897, 35405, 83511, 230426, -126718, -34603, -421673, 257299, -155904, 238203, -76415, -192939, 72318, -130372, 46985, 95561, 40607, -242944, 124473, 207566, -200091, 21108, -169404]
11101G8053K41593b14414A27428n9463a23768D02380b32510A31852L1234r808
11091A53278F9333e4835B15231o8640J74733b2855A82818H6731J09579D3516J51126
11080A94642L5411J34635j51964i6140A84427J4709N11112B18183q2393O1361
11070A97151L02058A06001a00985c4373B33278M76000D4814L4945N31107A61293
11059D11610O506L4255j14740L57394l02017K43954J31007k43036j65623O7284
11049D26594B08622M76869k62818J94234J41991J40680l63035J68931j27082k51437
11039C26955N78125j69462j90086J97180j08937K08504j72547J56031q3102k666
11029G39995L08506k53964k39385J67756k9684k95495N0405K90159J52931j65386
$$ y = [78053, 319646, -214414, 127428, 67965, -123768, 402380, -232510, 131852, 163086, 153278, 69333, -54835, 215231, 146591, 321324, -22855, 182818, 86731, 196310, 43516, 194642, 230053, 364688, 212724, -96140, 184427, 199136, 710248, 218183, 135790, 197151, 499209, 106001, -100985, -34373, 233278, 709278, 44814, 79759, 610866, 161293, 411610, 418116, 452371, 337631, 695025, 393008, 636962, 767969, 524933, 359310, 426594, 208622, 685491, 422673, 616907, 758898, 899578, 536543, 705474, 578392, 326955, 905080, 735618, 545532, 742712, 633775, 842279, 669732, 825763, 742661, 739995, 1048501, 794537, 555152, 722908, 693224, 397729, 448134, 738293, 891224, 725838]
11019G25838P4999k35671K6809o1259A89472O00073j75817J5058j77807l2402
11009D18577N705K13881k05587K13665M5280k07429K73927k16462J36144o1295
10999F16406p316j28754q8647J46416J69086J3661r2048k52332K50382K78460
10989I05314l60506K93130P4618j89159L38643n01063M73976j44014K57160j60176
10979I87923M43037m20606M50137K09134K8813M85894l9339O32744n28975K57860
10969B506622o5791k68264m6582m82697k50277n3199J43469l68472L17167l8663
10959A393313J72489j15391k9366j94089K75567k83795R8329j58321m05219N7725
10949H11242J72748D52834f7544D987J19940J49125l4847J68788j44075A18255
$$ y = [725838, 800837, 565166, 591975, 530716, 189472, 789545, 613728, 628786, 450979, 418577, 424282, 638163, 432576, 646241, 691521, 484092, 758019, 541557, 677701, 616406, 609090, 480336, 391689, 538105, 707191, 720852, 628804, 376472, 626854, 905314, 544808, 837938, 912556, 723397, 1062040, 560977, 1034953, 890939, 1148099, 987923, 1430960, 1010354, 1460491, 1669625, 1698438, 2184332, 2144993, 2777737, 2248762, 2506622, 2440831, 2172567, 2125985, 1643288, 1393011, 1339812, 1483281, 1114809, 1431976, 1393313, 1565802, 1450411, 1421045, 1226956, 1502523, 1218728, 1317057, 1158736, 753517, 811242, 983990, 452834, -67544, 4987, 124927, 274052, 239205, 407993, 263918, 118255]
10938F08981B17334b4226A64785G7943J34356e4185B33239o4942F1934A3627a94807
10926b6293A03497M7035n7398P0081i2876j09551Q3346I3392K2709A2148h9022
10914C706J56822a11850A39206D3039c63639d1697l04187C9220a36219A48559
10903B38115a81651A43765Q2648f3090j07626A1223a91907j31654a15172B76661
10892a46766o6622G5539a19926B76336g0524E5449b51588j94895H6379h5249C8035
10880a06043j29287A48382c21380J52208B7669a18828A53868N7664d1041j53863
10870a94904q2668C32767b51095f3513D5724J33955l8783f0239F6843K7125a3994
10858A13744l8075K40239c3625j14514B70690g1822K8375j18622b3824n3982A15111
$$ y = [608981, 217334, -24226, 164785, 77943, 212299, -54185, 233239, 168297, 61934, 13627, -194807, -26293, 103497, 150532, 93134, 163215, -92876, -202427, -119081, 93392, 116101, 12148, -89022, 3706, 160528, -111850, 139206, 43039, -363639, -41697, -345884, 39220, -136219, 148559, 238115, -181651, 143765, 226413, -63090, -170716, 11223, -191907, -323561, -115172, 276661, -146766, -213388, 75539, -119926, 276336, -70524, 55449, -251588, -446483, 86379, -85249, 38035, -106043, -235330, 148382, -321380, -169172, 27669, -118828, 153868, 211532, -41041, -194904, -277572, 332767, -251095, -63513, 45724, 179679, 140896, -60239, 66843, 93968, -13994, 113744, 75669, 315908, -33625, -148139, 270690, -71822, -43447, -162069, -23824, -77806, 115111]
10846B02164c63202P7005j4506B18148G1511f7192C2077K08591r4140i6912C1280
10834F2411d9935E1850K9818A8778b43772M5690g5007C8065L99718D3733c22426
10822F6330B5415a2915o5663j30787L9100M7075j04999l1546B4227d84630A9062
10810E6334k763b29438A64329c2920P388m2427B63355p9634h8415l0868j19350
10799b38633P4575a1149A62702a0934I0485D0362r658K01440A288a22325q5130
10788b07455B16493d50132d4209A36714i5934A01906e88391a86618p1672P371
10778b50919A70281q148A1454J59012n1633a54335B42873d3430j85244A95655
10767A66001A6986O5514b68363i9393F9616a06304F419a71593k25730A87432J93699
$$ y = [202164, -363202, -286197, -300703, 218148, 71511, -67192, 32077, 240668, 146528, -96912, 31280, 62411, -49935, 51850, 81668, 18778, -243772, -198082, -75007, 38065, 437783, 43733, -322426, 66330, 25415, -12915, -78578, -209365, -170265, -123190, -228189, -259735, 24227, -484630, 19062, 56334, 53571, -229438, 164329, -32920, -25532, -67959, 263355, 183721, -88415, -119283, -238633, -164058, -11149, 162702, -10934, 90485, 40362, 30704, 232144, 1288, -122325, -207455, 216493, -450132, -44209, 136714, -95934, 101906, -588391, -186618, -258290, -250919, 170281, 162133, 11454, 170466, 118833, -154335, 242873, -43430, -228674, 195655, 166001, 16986, 82500, -268363, -99393, 69616, -106304, 6419, -171593, -397323, 187432, 381131]
10756C81131A16837J89797B467N0998c2056q3896B46221c9432j97903f234j0807
10745a7041F8550k3491M5781l4774N5689j794c9521n8103B13315F152d24482N8852
10733c65630a28924k6298A3599a39593F8734a61195l8318a7326j9050G9378b35153
10721a62074I8531a16652q0266B10310P4571B4202j1015b28643e8402l27754J72421
10710b13735C6266b50679l3584i9713b2901k08827A00401l6911a15904k674E5781
10698c3381C9347K21316q4283I944a19316j9307C2821b62411M8378j10732J20176
10687b04589Q711P1043A51158D45Q6776a93423A1646K51717e2157j11981K098
10676a62040g3040b743j5833k32285c4583B0381h9355B20065E5075K8500a01266
$$ y = [381131, 116837, 306634, 2467, 53465, -32056, -115952, 246221, -39432, -237335, -6234, -17041, 68550, 45059, 90840, 56066, 111755, 109961, -39521, -97624, 213315, 6152, -424482, -365630, -128924, -155222, 13599, -139593, 68734, -161195, -199513, -17326, -36376, 79378, -235153, -162074, 98531, -116652, -196918, 210310, 284881, 24202, 13187, -228643, -58402, -386156, -213735, 36266, -250679, -284263, -99713, -22901, -231728, 100401, 63490, -115904, -118578, 55781, -33381, 39347, 260663, 176380, 9944, -119316, -138623, 32821, -262411, -214033, -324765, -204589, -195878, -124835, 151158, 445, 87221, -193423, 11646, 263363, -52157, -164138, -162040, -73040, -2743, -18576, -250861, -34583, 20381, -89355, 220065, 55075, 83575, -101266]
10664f0984o572j300l7239k9257k1372d6359l067I2857c06337A21382o533J46521
10652B61370c71838h4843l9102J5384k02537H6933M6576c85567I0020c28804B845
10640F8272d0230o3140j91009c9492j16063j76526g2333q7975l7704R4558B59697
10628b88999N3472A40855m3289l5626j7152i4488F0058c29187G5343J53300b47723
10616B77965A18568c25783l543F4812h306l05238J19052N9941j58602F2842l1379
10605C1463i3577j70348J13493L5144k46915a16865b6913C4142a85146B47801
10594a63432L8497D03276d615D9853g7227J6409G9317c98179i824E4572N195P6965
10582A36732a50874j15675B6768M5457M2660b49084B53199K78228A94926B7138
$$ y = [-60984, -67556, -68856, -106095, -135352, -156724, -46359, -49426, 92857, -306337, 121382, 114849, 261370, -371838, -84843, -123945, -108561, -311098, 86933, 133509, -385567, 90020, -328804, 2845, 68272, -40230, -103370, -294379, -39492, -155555, -332081, -72333, -160308, -198012, -103454, 259697, -288999, -235527, 140855, 97566, 61940, 44788, -94488, 60058, -329187, 75343, 228643, -247723, 277965, 118568, -325783, -329326, 64812, -8306, -313544, -194492, -134551, -293153, 62842, 31463, -93577, -263925, -150432, -115288, -362203, -116865, -26913, 34142, -185146, 247801, -163432, -124935, 403276, -4615, 49853, -77227, -60818, 79317, -398179, -9824, 54572, 59767, 136732, -150874, -266549, 26768, 72225, 114885, -249084, 253199, 531427, 194926, 27138]
10571b4106A21545a48397H2090j9407a85075h8295M3849h786D7013c29636J12486
10560b17150A51266d6785D3433R9541o4767J29160a84784I9138c6719A24884a13562
10548g2264c5960H2945k611b44370j095P8027A91822b87359A5521R3541c34992
10536B81606a01864A31191b65708A67592a83178D2429J01082d574C62783A4151
10525e1874a679C3628a62950g3216a8650I3483j4340o501a86545j44599A03953
10513H688J07218C4362J51956H2769a80455b3528m22615B72263a9601B45474a36844
10501B53116h877j91985b9403F7108b44375d1583k34525F7508J62925E7121i8085
10489F1936b08769J00131M4610r7418B08861d757A25989L09085M7110Q7247m0359
$$ y = [-24106, 121545, -148397, 82090, 62683, -185075, -88295, -44446, -8786, 47013, -329636, -217150, 151266, -46785, 43433, 142974, 78207, 207367, -184784, 99138, -36719, 124884, -113562, -72264, -35960, 82945, 80334, -244370, -245465, -167438, 191822, -287359, 15521, 109062, -334992, 281606, -101864, 131191, -265708, 167592, -183178, 42429, 143511, -4574, 362783, 14151, -51874, -1679, 33628, -162950, -73216, -18650, 93483, 79143, 72642, -186545, -331144, 103953, 8688, 115906, 34362, 186318, 82769, -180455, -23528, -446143, 272263, -19601, 245474, -136844, 253116, -8877, -200862, -29403, 67108, -244375, -41583, -276108, 67508, 230433, 57121, -98085, 61936, -208769, -108638, -64028, -161446, 208861, -4757, 125989, 435074, 482184, 569431, 529072]
10478E29072A61202n3078N6669J3230F7201L6912C1564b4980G7576b608o5685
10467f8293B8908b93980a33671j58567h7159k94176a47394j19944J28403J6489
10457a22446M500e8655a3246B20250b03399j1927D53241c94703J50843A49896
10446A76215J1470b73338g5944j1106a9796j35965M8518A44162f306l0123k20779
10435b57208A96283k2411a95410g0813B23791A00942q032b47004B91714b14299
10424a6767j07671A66280a0876k46179E192J41255g0800A39691l5603b3583A23559
10412A43765b61141P0651A9607e8521B03508a66948A05745R1145a13801D9637
10401A38859a58873f7076A14416c2972m5864B13510K0644B0f9690F0676M26278
$$ y = [529072, 161202, 108124, 164793, 178023, 67201, 104113, 31564, -24980, 77576, -2608, -68293, 28908, -293980, -133671, -292238, -87159, -381335, -147394, -267338, -138935, -122446, -117946, -58655, -13246, 220250, -203399, -215326, 453241, -394703, -243860, 149896, 176215, 187685, -273338, -75944, -87050, -19796, -155761, -107243, 144162, -6306, -36429, -257208, 196283, 173872, -195410, -70813, 223791, 100942, 92910, -247004, 291714, -214299, -16767, -124438, 166280, -10876, -257055, 5192, 146447, -70800, 139691, 104088, -23583, 123559, 143765, -261141, -190490, 19607, -58521, 203508, -166948, 105745, 196890, -113801, 49637, 138859, -158873, -67076, 114416, -32972, -78836, 213510, 234154, 20, -69690, 60676, 486954]
10390D86954B6237L36913j54008f1130j37560C72532A70682K03298A0272L97982
10380D08254b16318A81275L38517f1107B20989A5845N11151a24432I57a11096
10369A07263J45778k843J71582A64134K44968k00421G9688N16854k63329A53642
10358A82068A2253a7025F4703M3386a71913g22D5327K11926j0008K66935A10644
10346E7241f6531D05266K2967o4733j66531K9889L399r613R3646A37839B0219
10334G7828k6841J98071p4960a7394A77725L2267q174r3629c8011j76021Q5838
10323a28194D7937n920K1597J39044l3721a73762A86646c1979B49667F7797a82353
10311D71270B7152R363E347c7521A8313b0038n245j27496g773r1751M1409q9760
$$ y = [486954, 26237, 363150, 209142, -61130, -198690, 372532, 170682, 373980, 10272, 408254, -216318, 181275, 519792, -61107, 220989, 15845, 526996, -124432, 957, -111096, 107263, 253041, 250198, 421780, 164134, 409102, 208681, 79688, 596542, 333213, 153642, 182068, 12253, -17025, 64703, 108089, -171913, -722, 45327, 257253, 247245, 514180, 110644, 57241, -66531, 405266, 428233, 363500, 196969, 226858, 230257, 220644, 314290, 137839, 20219, 77828, 50987, 249058, 174098, -17394, 177725, 209992, 201818, 108189, -38011, -214032, -128194, 47937, 42017, 63614, 202658, 168937, -173762, 186646, -31979, 249667, 67797, -182353, 471270, 27152, 36515, 5347, -37521, 18313, -20038, -25283, -152779, -7773, -99524, -58115, -147875]
10299a47875K6491m0370C0069a69097O6579a9219O605j10187A49576o1819a25486
10287a48804N0415j9412I4156M1146a47689D4786L9311c0388E32229H7162b9130
10275d0119A136J52419A3485e5667k23617a17068k43787g2960m281j45337A05609
10263A17249a3754I6066L1326a49573B45595G8231N4689B2510Q317R9738a52745
10251D1870a48867B58280a62967f6082r4125j28911J33019n9688Q1585I0776b22362
10239b52792D8715g2212l6198H6910C6608h3215j3090L1259B14109h6870m6825
10228a33695o5884N5046J7303H9139B4399J90030o5450a05121A56978o1715g8704
10216I4495a12951A51198a98516A83258c28825A94102g193j4175n9041j78926
$$ y = [-147875, -121384, -161754, 30069, -169097, -102518, -19219, -12614, -122801, 149576, 87757, -125486, -148804, -98389, -117801, 94156, 135302, -147689, 44786, 84097, -30388, 532229, 87162, -29130, -40119, 1136, 153555, 13485, -55667, -279284, -117068, -360855, -72960, -77241, -222578, 105609, 117249, -13754, 96066, 127392, -149573, 245595, 78231, 132920, 22510, 30827, 130565, -152745, 41870, -148867, 258280, -162967, -66082, -160207, -289118, -156099, -215787, -134202, 90776, -222362, -252792, 48715, -72212, -108410, 86910, 36608, -83215, -96305, -65046, 214109, -86870, -133695, -199579, -144533, -127230, 89139, 24399, 214429, 148979, -105121, 156978, 95263, -78704, 94495, -112951, 151198, -198516, 183258, -328825, 194102, -7193, -21368, -80409, -259335]
10206b59335A06699a36007D786a02551B31563m3374a62249A89042J10203b00216
10195C31380H6071J20701A1849b4730L142n1131a5298j53495j50284G9924e015
10183c6016R715p3934F3034O9689b5883G34d35837a13099B37259k6087c69554
10171a62319M5056E7317H357a26760C89747g2783j08125m5568g5944C01231b53849
10159I2442c69319f6219K2249j93603O530P3110j05565d4073l91827b09194j94557
10148d03751h7031j17073F2742b42329I7316b90431A31269G078e9394m4019k89575
10137c92988A08478d7516j46601E7767g49A79707a42562E6265a10237A61962p4673
10126H7289a44608M1706H995a81872c1645k49631e4986l5145D89616b47644E8852
$$ y = [-259335, 106699, -136007, 4786, -102551, 231563, 188189, -162249, 189042, 299245, -200216, 331380, 86071, 206772, 11849, -24730, -21588, -72719, -15298, -168793, -319077, 79924, -5015, -36016, -26301, -100235, 63034, 132723, -25883, 734, -435837, -113099, 237259, 211172, -369554, -162319, -117263, 57317, 8357, -126760, 389747, -72783, -180908, -226476, -75944, 301231, -253849, 92442, -369319, -66219, -43970, -237573, -231043, -157933, -263498, -44073, -435900, -209194, -403751, -87031, -204104, 62742, -242329, 97316, -290431, 131269, 7078, -59394, -103413, -392988, 108478, -47516, -194117, 57767, -749, 179707, -142562, 56265, -110237, 161962, 87289, -144608, -102902, 8995, -181872, -31645, -281276, -54986, -90131, 489616, -247644, 58852]
10114B36246G2531K08925a53847j13135j1716D688K12877k8285a5273k52482h6419
10102I3160b52195j21494a40516J0420A17656a93999L6456C58577b66832J29526
10092a37306A08834d3212j41725A03474a30376k3880A22490h4007F8481K2196
10082I0677L6038J67889a47370B96977f6316k5760j8796k98683b3594A9507c312
10070A85445J28010A2986K2144d27534L5421a54690I7867g2687l5202l6802A72030
10058D6345a51429j21841i9805C76279b7006a0714j75656p3358A95477E9511a87880
10046A7685a57443A59855b32215C8896J31637c07765a19000k7595m8848D3892
10035b90187a9321f60m84758a80018j05989O5586N2786I863a28035A15576R2121
$$ y = [236246, 72531, 281456, -153847, -266982, -278698, 4688, 217565, 189280, -15273, -267755, -86419, 93160, -252195, -373689, -140516, -130096, 117656, -193999, -157543, 358577, -266832, -137306, 108834, -43212, -184937, 103474, -130376, -154256, 122490, -84007, 68481, 90677, 126715, 294604, -147370, 296977, -66316, -92076, -110872, -409555, -23594, 19507, -3312, 185445, 313455, 12986, 35130, -427534, -392113, -154690, 97867, -72687, -107889, -144691, 172030, 46345, -151429, -273270, -99805, 376279, -27006, -10714, -186370, -259728, 195477, 59511, -187880, 17685, -157443, 159855, -232215, 38896, 170533, -307765, -119000, -146595, -195443, 43892, -290187, -19321, -660, -485418, -180018, -286007, -220421, -167635, 9863, -128035, 115576, 207697]
10024B07697a76565L384M1871j37200a29979H4147b21170h2522k5336B0944e218
10012A45691L5204e08915A4120d1762j5124j50381G0777d5440j06207P2841L8038
10001d0768j46476R2521n7261B07973d1559n79B58409a79509B99196q7497J18629
9990C30328a31714n691b6448A602h9661c2171j95739C484e724A35248e37839F5192
9977a46772l1906D37452b47537I1046b70045F6520g1871A63819b01615e3743k09049
9966b62792A3176g7217n708l3711B05585e2783p6928A64899A1664h2306A24672
9954E8451J42726C8332b25830I3279R7135d5666G1507e81764E2137a53259a4553
9942a73797c4926k11535A38537i3929j02053A23664a52755B16532a49072a9726
$$ y = [207697, -176565, -173181, -131310, -268510, -129979, 84147, -221170, -82522, -107858, 20944, -5218, 145691, 180895, -508915, 14120, -41762, -56886, -207267, 70777, -45440, -151647, -78806, -40768, -187244, -94723, -151984, 207973, -41559, -42138, 258409, -179509, 299196, 211699, 330328, -131714, -137405, -26448, 1602, -89661, -32171, -227910, 3484, -5724, 135248, -537839, 65192, -146772, -178678, 437452, -247537, 91046, -270045, 66520, -71871, 163819, -201615, -53743, -262792, 13176, -77217, -82925, -116636, 205585, -52783, -129711, 164899, 11664, -82306, 124672, 58451, 201177, 38332, -225830, 93279, 190414, -45666, 71507, -581764, 52137, -153259, -14553, -173797, -34926, -246461, 138537, -93929, -195982, 123664, -152755, 216532, -149072, -19726]
9931f2642l68768P1419C9143a61816j43051A2030e9478p2202K5190B0078J00265
9920A20343f5794A20052j9983a90724q9278h7303B36736c2211a3831k9574B5998
9908f374j62421H5645C8959b78780B20002N5561C5771a18459N7588o5124o4620
9897a90615d5903p9257j25996P38A7105a60595I8388d9320b3338r3428j3910b0330
9884B32779J03205d19613C8164b33919k7008J01927p757l6810i9178k24659a26735
9872g0175k40526j71455A75683a54196k4898j76700d9899q4951d7495A71364a68533
9860F7853K05511b03289K851j29927A0661d5391j64885j41454I702i9282k14185
9849c13467E2962b99948d8749A44263b80570O3241B42775a34726B36420A12942
$$ y = [-62642, -431410, -359991, 39143, -161816, -304867, 12030, -59478, -131680, -106490, 20078, 120343, -65794, 120052, 100069, -190724, -280002, -87303, 236736, -32211, -13831, -43405, 25998, -6374, -168795, 85645, 38959, -278780, 220002, 275563, 35771, -118459, -60871, -125995, -190615, -45903, -125160, -251156, -250418, 17105, -160595, 98388, -49320, -23338, -116766, -130676, -20330, 232779, 335984, -419613, 38164, -233919, -260927, -159000, -166757, -203567, -99178, -323837, -126735, -70175, -310701, -482156, 175683, -154196, -179094, -355794, -49899, -134850, -47495, 171364, -168533, 67853, 273364, -203289, -200438, -330365, 10661, -45391, -210276, -351730, 9702, -99282, -313467, 52962, -299948, -48749, 144263, -280570, -217329, 242775, -134726, 236420, 112942]
9838I2810B3184i48B3658a14969k8188j97269g5969H8801K4616J32266m9992o4322
9826A31369b4261A69171E6750h9804B94457c5057j71130c7194k8850m7879G0039
9814H330e6318A93372D4014c15939q9115e9048l66189F4320B6425J94984e23538
9802C2939J55626d90070C07784b91658J25462c2705k51479D82838h6677a871k27919
9791b29790a05851k76229J04199J07695N6247b7333F0529e5149B20016i7104A94063
9779d061q6599J2372A50490F042N7960b84445d8424k19729b3337p4202J7135F0172
9766B6608c4243l49818D52578B06266q8696E5763F171g5409H998c23729B03131
9754A43919O6391c00706M443F5689M4824c457m35333F4701a82539A18211a77984
$$ y = [92810, 23184, -948, 23658, -114969, -143157, -340426, -75969, 88801, 113417, 245683, 195691, 131369, -24261, 169171, 56750, -89804, 294457, -35057, -206187, -37194, -66044, -113923, 70039, 8330, -56318, 193372, 44014, -315939, -405054, -59048, -425237, 64320, 26425, 221409, -523538, 32939, 188565, -490070, 307784, -291658, -166196, -32705, -284184, 482838, -86677, -1871, -229790, -105851, -382080, -277881, -170186, -113939, -27333, 60529, -55149, 220016, -97104, 194063, -4061, -90660, -78288, 150490, 6042, 64002, -284445, -48424, -268153, -23337, -97539, -80404, 60172, 26608, -34243, -384061, 452578, 206266, 117570, 55763, 6171, -75409, 8998, -323729, 203131, 143919, 210310, -300706, -296263, 65689, 110513, -3457, -438790, 64701, -182539, 118211, -177984]
9742f7169k01710B64171r9740i8971p5805Q6221J9456A7667a24081o6450A69228
9730B35651c20755B2162d9214j2495D4597j4223J13422N5367n3017J99481D5657
9718e0374k22565A81662D8311a72769A99361a1366k45113H2069J1297O334K609
9707A02309j5277L2768a26165b8205O653B47800A0494a84199B67051f9412j3652
9696h3064q3144a1816l64417A55269b2446A7844h2304H1794h3482k22646J7826
9685b88302A68305G2254B1137c85261a47984j666H9333L44971A18983J24462c22492
9673A69994f8592C9128c31210a60841d5856Q208B08590m5239f7615j03149j1937
9662a82701k28573a07425H2338b09181o1700q9090J06422b1668F453i4647B97008
$$ y = [-67169, -268879, 264171, 164431, -98971, -174776, -88555, -69099, 17667, -124081, -190531, 169228, 235651, -320755, 22162, -49214, -61709, 44597, 30374, 143796, 199163, 146146, 345627, 45657, -50374, -272939, 181662, 48311, -172769, 199361, -11366, -256479, 82069, 93366, 99700, 102309, 87032, 119800, -126165, -28205, -21552, 247800, 10494, -184199, 267051, -69412, -83064, -166208, -11816, -376233, 155269, -22446, 17844, -82304, 81794, -83482, -306128, -288302, 168305, 72254, 21137, -385261, -147984, -149650, 89333, 434304, 118983, 243445, -322492, 169994, -68592, 39128, -331210, -160841, -45856, -37648, 208590, 163351, -67615, -170764, -182701, -411274, -107425, 82338, -209181, -270881, -359971, -253549, -21668, 6453, -94647, 297008]
9650b61855k4949b6239A20115d24414C17193a14150c7089E3412K2421l4100c94521
9638D1673b37712J04193C6238J3001R518d8716I4398J5064l2481a26009A35783
9626c3727l32044I5137d5992j9759m9089d3419k05463j95624f718j61628N2229
9615a16117j39750D5185a79256B62291a8017p5733E0776K14126f0674A8567K28484
9604B47051A15419c07592A13817b78534J33852A35894c97712B89928g9478E8567
9593H6893q702K4436C7444d10672P010A9292a90152R4308M6826k0511q0725A41798
9580b65699B0321d37107h2018a4306q3925F3288d4764j25796B05015M1440d0736
9568C1647c30740A6191c52631B4231J36527i2907k19921B24118B3865J21358k2255
$$ y = [-261855, -286804, -26239, 120115, -424414, 317193, -114150, -37089, 53412, 75833, 41733, -394521, 41673, -237712, -133519, 36238, 49239, 58757, -48716, 94398, 109462, 76981, -126009, 135783, -33727, -365771, 95137, -45992, -65751, -114840, -43419, -248882, -444506, -6718, -168346, -116117, -255867, 45185, -179256, 262291, -18017, -93750, 50776, 264902, -60674, 18567, 247051, 115419, -307592, 113817, -278534, -144682, 135894, -397712, 289928, -79478, 58567, 86893, 78191, 102627, 37444, -410672, -403662, 19292, -190152, -95844, -49018, -69529, -150254, 141798, -265699, 20321, -437107, -82018, -14306, -98231, 63288, -44764, -170560, 205015, 246455, -40736, 31647, -330740, 16191, -352631, 24231, 160758, -92907, -312828, 224118, 23865, 145223, 122968]
9557A22968b45705B4457J3295a88422N5530A00288b13399K3152g4427n5628l0007
9546a60062I81i2764B21248i8939G0604a52855D0684b67909K9627B46425a5231
9534e6864F4846M1104b25260i6325j10560q2166C73474B4777N6266a40120j49369
9523b89489B12057I8609a55260O6604M2179o21650A1304d44021D9010g2980o3483
9512a36463A93733h939k10628h0359A95061A2003a2005F1587M9323a1640C07629
9500a75817F4945c08074a13626r1904e2295A41032b15582l841B3557b7740m19753
9489d47493b4766l35456E6518d2829j27088r6712e6864k61393c1655l7634A65503
9477a46225F4785J5451b70715J05597j64300E5808B2958A0354a32031b8992C55782
$$ y = [122968, -245705, 24457, 37752, -188422, -132892, 100288, -213399, -190247, -74427, -130055, -160062, 981, -92764, 221248, -98939, 70604, -152855, 40684, -267909, -238282, 246425, -15231, -56864, 64846, 105950, -225260, -96325, -206885, -289051, 373474, 24777, 81043, -140120, -289489, 212057, 98609, -155260, -88656, -46477, -668127, 11304, -444021, 49010, -72980, -136463, 193733, -8939, -219567, -80359, 195061, 12003, -12005, 61587, 110910, -11640, 307629, -175817, 64945, -308074, -113626, -205530, -52295, 141032, -215582, -219423, 23557, -27740, -447493, -24766, -360222, 56518, -42829, -169917, -266629, -56864, -318257, -31655, -69289, 165503, -146225, 64785, 80236, -270715, -165118, -329418, 55808, 22958, 10354, -132031, -28992, 355782]
9465g5204k63180C3191a22541N6068q3853F7543J11501F1939b27244M323A62859
9453e697l98236a82151F4885L83193d9066E8953a38251J7507L0276b3171l7665
9442f0836k14991g6719o3130n4148B61416j06130h7776j49543F3613d1610j31707
9431a73317g125q7914C60819b76830K0879J23164r4162F8447a40802r695D8316
9419a23823l0976C3421i6332E3152a70524M9329p2124J791q993h5380j57300j9962
9407b62642j94565A32327a27112R367a1168n7124A26054J344a40811q8387O1826
9396a67372G7161K1987c13951J44302I1508J737a27172n3689H6565b20386I3009
9384c43256d4793A8417b7578q7930j34829B41059c2405r0073A65669d0337n4936
$$ y = [-75204, -338384, 33191, -122541, -66473, -150326, 67543, 179044, 61939, -227244, -222921, 162859, -5697, -403933, -182151, 64885, 448078, -49066, 58953, -138251, -120744, -90468, -23171, -60836, -275827, -76719, -139849, -193997, 261416, 155286, -87776, -237319, 63613, -41610, -173317, -7125, -95039, 360819, -276830, -255951, -132787, -226949, 68447, -140802, -150497, 48316, -123823, -154799, 33421, -96332, 53152, -170524, -121195, -193319, -191528, -200521, -85380, -242680, -262642, -457207, 132327, -127112, -117745, -11168, -68292, 126054, 127398, -140811, -229198, -167372, 77161, 99148, -313951, -169649, 91508, 93245, -127172, -180861, 86565, -220386, 93009, -343256, -44793, 18417, -27578, -115508, -250337, 241059, -32405, -122478, 165669, -40337, -95273]
9373i5273L4429B24125c56775A74102a45747E3822d27575l7002E6304e4601J5883
9362c8718B36318G7336f3800A79619b03636l8509Q8626c4239k05205B22802b0920
9350B69754j26241c62989a73762K4877e3788A98479b8645J0834A2430d1398C9172
9338b27297B14805C8175c9550B66570A07634a29969r5700K9236B33701c97589
9327g4845n7837A6952J94403A00570K82517a94478c0333E7254d03130J77207J02285
9316a23638j29876B1233K61675a6021B06374a74757H0501M9653o0752b61349D4970
9304i6508k28087e4386j06746A00595B1805M318N0715a20120j55161A23420b95723
9292A39724b42015J19905I7380B584a26906J7837F8781d0998j07581D1165c29497
$$ y = [-95273, -60844, 224125, -356775, 174102, -145747, 53822, -427575, -464577, 56304, -54601, -38718, 236318, 77336, -63800, 179619, -203636, -242145, -153519, -34239, -239444, 222802, -20920, 269754, 143513, -362989, -173762, -148885, -53788, 198479, -28645, -17811, 12430, -41398, 39172, -227297, 214805, 38175, -39550, 266570, 107634, -129969, -225669, -196433, 233701, -397589, -74845, -132682, 16952, 211355, 100570, 383087, -194478, -30333, 57254, -403130, -225923, -123638, -253514, 21233, 282908, -16021, 206374, -174757, 80501, 130154, 69402, -261349, 44970, -96508, -324595, -54386, -161132, 100595, 21805, 26123, 76838, -120120, -275281, 123420, -295723, 139724, -242015, -122110, 97380, 2584, -126906, -109069, 68781, -40998, -148579, 41165, -329497]
9280a34468j17383e3180j34619N713d5229j5921r7792a9720j23116O3134D6824
9268F566K30987b595k45939L6270O2919A3464K72953c94427J01670j47631A02733
9256c7702C86348C9553J87075a72085g8883b0111A06904J11346B2533c1833k32065
9245b63898R6823D9853B1461b50537f2839D912a69382I5281b12594e0342l1614
9234h1956p715k6532L8038L3595a8464k32859J18357b0688j02830N753j29753
9223b47518P1122C7819h9278B18727a88472A66282J21081c23329F3126A2839b09550
9211d88242J82481a16443A12241C4958b7581L826j5147B3736k60c00128g0579
9199a84996m358A27656d5686B9105e8747A22847a70572A9880c8310A56636a4651
$$ y = [-134468, -251851, -53180, -187799, -182086, -45229, -61150, -158942, -19720, -142836, -79702, 46824, 6566, 237553, -2595, -248534, -212264, -149345, 13464, 286417, -394427, -292757, -440388, 102733, -37702, 386348, 39553, 226628, -172085, -78883, -20111, 106904, 218250, 22533, -31833, -263898, -167075, 49853, 21461, -250537, -62839, 4912, -169382, 95281, -212594, -50342, -81956, -89671, -116203, -78165, -44570, -18464, -251323, -132966, -20688, -123518, -117765, -247518, -176396, 37819, -89278, 218727, -188472, 166282, 287363, -323329, 63126, 12839, -209550, -488242, -305761, -116443, 112241, 34958, -27581, -23755, -38902, 23736, 23476, -300128, -70579, -184996, -189354, 127656, -45686, 29105, -58747, 122847, -170572, 19880, -38310, 156636, -14651]
9187b67839O3348a01771d548I7715D540J39888c51073H2976c83700J75180k0616
9176b29136j8787p791j1738C9392e363k17897C2631b43915A13846c1125B46334
9164B03715b40537o930a21217j05302a7228E1263P5328m7188J29879d01337B46244
9152A47645d6136g254D317a03449M2475m35495A12542d21731A49062B4354c8598
9140B36574a27742j00698k6541B52273g6846c1376C10865B332a06917j45878J14752
9129a38043A52708a0854F998O0714a63100A46464c61805a41988M9188M1506B18305
9117C51680c93296J26501a2800p3218H9482a31280j50542b7679N706j44338f2609
9105d5612A28935h1741J0416l2555K6503G9340M532b1155j32494n1311C736b88210
$$ y = [-267839, -204491, -101771, -4548, 97715, 4540, 144428, -351073, 82976, -383700, -208520, -229136, -247923, -255714, -267452, 39392, -5363, -223260, 32631, -243915, 113846, -31125, 246334, 203715, -240537, -247467, -121217, -226519, -17228, 51263, 126591, 79403, 209282, -401337, 246244, 147645, -46136, -7254, 4317, -103449, -60974, -496469, 112542, -421731, 149062, 24354, -38598, 236574, -127742, -228440, -254981, 252273, -76846, -31376, 310865, 2332, -106917, -252795, -138043, 152708, -10854, 6998, 67712, -163100, 146464, -361805, -141988, -92800, -51294, 218305, 351680, -393296, -266795, -12800, -86018, 89482, -131280, -281822, -27679, -21973, -166311, -62609, -45612, 128935, -81741, -71325, -103880, -77377, 79340, 83872, -21155, -153649, -204960, 3736, -288210]
9092D7622a67886c065q6257B0375N0301b61410B35299a84173f3771K7857E4122
9080A04441b3015k09856Q686g656o3591k25394h7436j34133A90844r1168j7273
9069H2403f2411J1775j52005B76463A02191b14898q7098b667A78567b19748J05332
9058a14416G8860a97170B9691M0160c86092g3102K7773C22069G0528b24078d079
9046i5757b8591j06401F1628a11056n410M2142A3560b04044B5492J2463J6099
9035E4054L09377d12256F7K73760j3296f0494k30739a4177l43419f8653R144D9131
9022A42508b23063N2710D0696a81839l02889A23706a42521O5193o44A65684b44652
9010f0901l84572M4607A20279a32648K089A87304i0142m0661C58818a78835d7183
$$ y = [47622, -167886, -3065, -89322, 20375, 70676, -261410, 235299, -184173, -63771, -35914, 54122, 104441, -23015, -232871, -224185, -7656, -71247, -296641, -87436, -221569, 190844, 99676, 82403, -62411, -50636, -202641, 276463, 102191, -214898, -301996, -2667, 178567, -219748, -114416, 78860, -197170, 29691, 69851, -386092, -73102, -45329, 322069, 70528, -224078, -4079, -95757, -28591, -134992, 61628, -111056, -116466, -74324, 13560, -204044, 25492, 37955, 54054, 363431, -412256, 67, 273827, 260531, -60494, -291233, -14177, -357596, -68653, -59509, 49131, 142508, -223063, -170353, 40696, -181839, -484728, 123706, -142521, -77328, -77972, 165684, -244652, -60901, -445473, -400866, 120279, -132648, -130559, 187304, -90142, -130803, 358818, -178835, -47183]
8998D9701b34656h5634F6508c76776A7341a36458J9327n2838A41173L0959L57549
8987E29681p1617C0766a31437A57055c36135a04432E5025a20519k3127A0711a22574
8975I7160C8628a25818l7560B2627f200m7853j23161j41141F8290K2920c86373
8963A84427a78513B46000c01881a30743D7583J29463D3898a12886B42597A07348
8952B49627c48557h8167m5659C3461j1918i1516Q685A80706q0555a43641J7314
8941a26327D5139O9942P415D5087m810j7010M52024j64400r8117A5296d9574B43081
8928d42547A33732o224L63898J97726J303120J975030P794948J112614B209728
8918D69721B00327N8748J05733a3021A15088a53578m9823A8664L1720c1835E3194
$$ y = [49701, -234656, -85634, 66508, -376776, 17341, -136458, -117131, -169969, 141173, 172132, 529681, 458064, 30766, -131437, 157055, -336135, -104432, 55025, -120519, -143646, 10711, -122574, 97160, 38628, -125818, -163378, 22627, -6200, -54053, -177214, -318355, 68290, 91210, -386373, 184427, -178513, 246000, -301881, -130743, 47583, 177046, 43898, -112886, 242597, 107348, 249627, -348557, -88167, -133826, 33461, 21543, -91516, -82831, 180706, 100151, -143641, -126327, 45139, 115081, 122496, 45087, 40277, 23267, 475291, 310891, 212774, 15296, -49574, 243081, -442547, 133732, 127508, 491406, 689132, 1992252, 3967282, 11762230, 12874844, 2209728, 469721, 200327, 259075, 364808, -13021, 115088, -153578, -203401, 18664, 50384, -31835, 53194]
8906A47362a04252j51772A33357K47388C8402M5323f9695A32937A8364c3588a2215
8894b64274E5043a2309k31292J14951G1700B8778a78606A65509a65227n7843B6004
8882a62133K4620A6913b83898R2942A26613a593j01299A94993H156g4518r6593
8871a71111A69391a92369k10871a98327K6579A37002b71627f228A79110a2926
8860b10481j40527A29971N8439c63551d834F8680b5162A56417J53191d452A94762
8848A48222l5261j3848k6015A3812O362J20308e0506D7998a24693K2581A49981
$$ y = [147362, -104252, -256024, 133357, 380745, 38402, 83725, -69695, 132937, 18364, -33588, -12215, -264274, 55043, -12309, -243601, -128650, 71700, 28778, -178606, 165509, -165227, -223070, 26004, -162133, -137513, 16913, -283898, -190956, 126613, -1593, -102892, 194993, 8156, -74518, -171111, 169391, -192369, -403240, -198327, -171748, 137002, -271627, -6228, 179110, -12926, -210481, -351008, 129971, 188410, -363551, -4834, 68680, -25162, 156417, 309608, -4452, 194762, 148222, 112961, 99113, 73098, 13812, 20174, 140482, -50506, 47998, -124693, -102112, 149981]
$$ [...]
##END NTUPLES=NMR SPECTRUM
##END=
