
##TITLE=AC1298_ECUAH12110_6666759_k2qTeoWIL1
##JCAMPDX= 6.0         $$ Bruker NMR JCAMP-DX V2.0
##DATA TYPE= NMR SPECTRUM
##DATA CLASS= NTUPLES
##ORIGIN= BRUKER
##OWNER= Administrator
$$ 1.72 TOPSPIN		Version 2.1
$$ 2012-08-13 21:20:37.406 -0500  Administrator@TOPSPIN
$$ Compression mode = diff/dup
##.OBSERVE FREQUENCY= 400.02188249412
##.OBSERVE NUCLEUS= ^1H
##.ACQUISITION MODE= SIMULTANEOUS (DQD)
##.ACQUISITION SCHEME= undefined
##.AVERAGES= 64
##.DIGITISER RES= 22
##SPECTROMETER/DATA SYSTEM= spect
##.PULSE SEQUENCE= noesygpps1d.comp
##.SOLVENT NAME= COFFEE_meoh
##.SHIFT REFERENCE= INTERNAL, COFFEE_meoh, 1, 14.96097
##AUDIT TRAIL= $$ (NUMBER, WHEN, WHO, WHERE, PROCESS, VERSION, WHAT)
$$ ##TITLE= Audit trail, TOPSPIN		Version 2.1
$$ ##JCAMPDX= 5.01
$$ ##ORIGIN= Bruker BioSpin GmbH
$$ ##OWNER= Administrator
$$ $$ C:\Bruker\TOPSPIN/data/COFFEE/nmr/AC1298_ECUAH12110_6666759_k2qTeoWIL1/12/pdata/1/auditp.txt
$$ ##AUDIT TRAIL=  $$ (NUMBER, WHEN, WHO, WHERE, PROCESS, VERSION, WHAT)
(   1,<2012-08-13 21:20:31.703 -0500>,<Administrator>,<TOPSPIN>,<go>,<TOPSPIN 2.1>,
      <created by zg
	started at 2012-08-13 21:09:01.296 -0500,
	POWCHK enabled, PULCHK disabled,
       configuration hash MD5:
       6B 1B 68 BB D9 2E 58 E2 7F 35 AD 54 07 DF 0E 41
       data hash MD5: 64K
       FA 7B 17 E1 9B CD 93 0F 84 CE C6 30 B3 74 F9 8B>)
(   2,<2012-08-13 21:20:35.359 -0500>,<Administrator>,<TOPSPIN>,<proc1d>,<TOPSPIN 2.1>,
      <Start of raw data processing
       efp LB = 0.3 FT_mod = 6 PKNL = 1 PHC0 = 0 PHC1 = 0 SI = 128K 
       data hash MD5: 128K
       65 15 37 CF 3E 1A 96 FC 4D 44 24 D7 AE 06 CA B9>)
(   3,<2012-08-13 21:20:36.500 -0500>,<Administrator>,<TOPSPIN>,<proc1d>,<TOPSPIN 2.1>,
      <pk PHC0 = 4.432983 PHC1 = 0 
       data hash MD5: 128K
       13 D8 EC 93 EC 08 B5 26 9B A3 9D CD 8A 94 3B 6C>)
(   4,<2012-08-13 21:20:37.046 -0500>,<Administrator>,<TOPSPIN>,<proc1d>,<TOPSPIN 2.1>,
      <abs ABSG = 1 
       data hash MD5: 128K
       70 C3 64 40 94 DA 4C 6F 4A FB F4 C4 A6 53 5A 25>)
(   5,<2012-08-13 21:20:37.125 -0500>,<Administrator>,<TOPSPIN>,<proc1d>,<TOPSPIN 2.1>,
      <abs ABSG = 2 
       data hash MD5: 128K
       DB AC A0 11 3E 53 BB A7 07 83 2C 90 66 90 35 7D>)
(   6,<2012-08-13 21:20:37.171 -0500>,<Administrator>,<TOPSPIN>,<proc1d>,<TOPSPIN 2.1>,
      <abs ABSG = 3 
       data hash MD5: 128K
       F1 E4 B9 2C 5E 10 23 BF 02 8A CE 5A 72 B1 D1 92>)
(   7,<2012-08-13 21:20:37.234 -0500>,<Administrator>,<TOPSPIN>,<proc1d>,<TOPSPIN 2.1>,
      <abs ABSG = 4 
       data hash MD5: 128K
       38 81 07 48 F8 6E E3 F3 68 84 0A 90 8E 4E 2B 2C>)
(   8,<2012-08-13 21:20:37.328 -0500>,<Administrator>,<TOPSPIN>,<proc1d>,<TOPSPIN 2.1>,
      <abs ABSG = 5 
       data hash MD5: 128K
       39 94 36 01 6B 80 EE B1 87 F3 B8 F6 AD F7 19 AB>)
$$ ##END=
$$ 
$$ $$ hash MD5
$$ $$ 94 BB 33 7F F8 27 91 31 4E 6A 51 07 9B D6 41 9E
##$RELAX= 
##$RELAX= 
##$RELAX= 
##$RELAX= 
##$RELAX= 
##$RELAX= 
##$RELAX= 
##$RELAX= 
$$ Bruker specific parameters
$$ [...]
150 150 150 150 150 150 150 150
##$TP07= 0
##$TPNAME0= <>
##$TPNAME1= <>
##$TPNAME2= <>
##$TPNAME3= <>
##$TPNAME4= <>
##$TPNAME5= <>
##$TPNAME6= <>
##$TPNAME7= <>
##$TPOAL= (0..7)
0.5 0.5 0.5 0.5 0.5 0.5 0.5 0.5
##$TPOFFS= (0..7)
0 0 0 0 0 0 0 0
##$TUNHIN= 0
##$TUNHOUT= 0
##$TUNXOUT= 0
##$USERA1= <user>
##$USERA2= <user>
##$USERA3= <user>
##$USERA4= <user>
##$USERA5= <user>
##$V9= 5
##$VALIST= <valist>
##$VCLIST= <CCCCCCCCCCCCCCC>
##$VD= 0
##$VDLIST= <DDDDDDDDDDDDDDD>
##$VPLIST= <PPPPPPPPPPPPPPP>
##$VTLIST= <TTTTTTTTTTTTTTT>
##$WBST= 1024
##$WBSW= 4
##$XGAIN= (0..3)
0 0 0 0
##$XL= 0
##$YL= 0
##$YMAX_a= 11489966
##$YMIN_a= -8444241
##$ZGOPTNS= <>
##$ZL1= 120
##$ZL2= 120
##$ZL3= 120
##$ZL4= 120
##$ABSF1= 14.96097
##$ABSF2= -5.597212
##$ABSG= 5
##$ABSL= 3
##$ALPHA= 0
##$AQORDER= 0
##$ASSFAC= 0
##$ASSFACI= 0
##$ASSFACX= 0
##$ASSWID= 0
##$AUNMP= <proc_prof1d_extract.lims>
##$AXLEFT= 0
##$AXNAME= <>
##$AXNUC= <1H>
##$AXRIGHT= 0
##$AXTYPE= 0
##$AXUNIT= <>
##$AZFE= 0.1
##$AZFW= 0.1
##$BCFW= 0
##$BC_mod= 0
##$BYTORDP= 0
##$COROFFS= 0
##$CY= 15
##$DATMOD= 1
##$DC= 0
##$DFILT= <>
##$DTYPP= 0
##$F1P= 0
##$F2P= 0
##$FCOR= 0.5
##$FTSIZE= 131072
##$FT_mod= 6
##$GAMMA= 0
##$GB= 0
##$INTBC= 1
##$INTSCL= 1
##$ISEN= 128
##$LB= 0.3
##$LEV0= 0
##$LPBIN= 0
##$MAXI= 10000
##$MC2= 0
##$MEAN= 0
##$ME_mod= 0
##$MI= 0
##$NCOEF= 0
##$NC_proc= -2
##$NLEV= 6
##$NOISF1= 0
##$NOISF2= 0
##$NSP= 0
##$NTH_PI= 0
##$NZP= 0
##$OFFSET= 14.96097
##$PC= 1
##$PHC0= 4.432983
##$PHC1= 0
##$PH_mod= 1
##$PKNL= yes
##$PPARMOD= 0
##$PPDIAG= 0
##$PPIPTYP= 0
##$PPMPNUM= 2147483647
##$PPRESOL= 1
##$PSCAL= 4
##$PSIGN= 0
##$PYNMP= <proc.py>
##$REVERSE= no
##$SF= 400.020009647028
##$SI= 131072
##$SIGF1= 0
##$SIGF2= 0
##$SINO= 400
##$SIOLD= 131072
##$SPECTYP= <>
##$SREGLST= <1H.CDCl3>
##$SSB= 0
##$STSI= 131072
##$STSR= 0
##$SW_p= 8223.68421052631
##$SYMM= 0
##$S_DEV= 0
##$TDeff= 65536
##$TDoff= 0
##$TI= <>
##$TILT= no
##$TM1= 0
##$TM2= 0
##$TOPLEV= 0
##$USERP1= <user>
##$USERP2= <user>
##$USERP3= <user>
##$USERP4= <user>
##$USERP5= <user>
##$WDW= 1
##$XDIM= 131072
##$YMAX_p= 389959967
##$YMIN_p= -18943
##$CURPLOT= <Network HP LaserJet P1505>
##$CURPRIN= <$Network HP LaserJet P1505>
##$DFORMAT= <normdp>
##$LAYOUT= <+/1D_H.xwp>
##$LFORMAT= <normlp>
##$PFORMAT= <normpl>
##$SURQMSG= 1
$$ End of Bruker specific parameters
$$ ---------------------------------
##NTUPLES= NMR SPECTRUM
##VAR_NAME=  FREQUENCY,     SPECTRUM/REAL,   SPECTRUM/IMAG
##SYMBOL=    X,             R,               I
##VAR_TYPE=  INDEPENDENT,   DEPENDENT,       DEPENDENT
##VAR_FORM=  AFFN,          ASDF,            ASDF
##VAR_DIM=   131072,        131072,          131072
##UNITS=     HZ,            ARBITRARY UNITS, ARBITRARY UNITS
##FACTOR=    0.0627417313425164, 1,          1
##FIRST=     8223.62146879497, -1058,        -59589
##LAST=      0,             12,              -60686
##MIN=       0,             -18943,          0
##MAX=       8223.62146879497, 389959967,    0
$$ Real data points
##PAGE= N=1
##DATA TABLE= (X++(R..R)), XYDATA
$$ [...]
67993 164720 160734 156498 151920 147244 142913 139120 135633 132330 129707 128287 127568 126278 123881 121157
67979 121157 118959 117038 114667 111877 109386 107589 106290 105227 104304 103376 102355 101431 100659 99416 96866
67964 96866 93091 89249 86450 84794 83616 82279 80641 79048 77984 77531 77201 76553 75843 75597 75603 74923 73115
67947 73115 70854 69100 68057 67331 66687 66252 66172 66504 67279 68345 69274 69734 69846 69897 69868 69594 69281 69456 70338
67928 70338 71618 72879 73942 74714 75018 74865 74723 75207 76471 78007 79094 79433 79350 79452 80025 80740 80914
67911 80914 80108 78502 76711 75243 74136 73100 71900 70593 69458 68826 68905 69556 70164 69990 68844 67300
67895 67300 66087 65363 64791 64215 63912 64171 64874 65603 65980 65871 65429 65047 65090 65593 66279 66869 67292 67636 68067
67876 68067 68734 69532 70061 70102 70132 70979 72896 75184 76819 77182 76305 74808 73671 73522 73958 73974 73274 72589
67858 72589 72450 72227 70991 68905 67094 66326 66411 66730 66719 65908 64105 61732 59571 58096 57355 57390 58294 59804
67840 59804 61356 62612 63529 63922 63530 62677 62264 62733 63436 63375 62324 60909 59904 59777 60666 62396 64541
67823 64541 66742 68956 71255 73511 75437 76839 77684 78083 78266 78418 78411 77940 77059 76342 76225 76395 76146 75187
67805 75187 73804 72283 70558 68530 66479 64948 64238 64106 63973 63428 62537 61663 61080 60776 60567 60244 59695
67788 59695 59032 58550 58317 57915 56872 55358 54141 53776 54127 54709 55156 55335 55437 56039 57534 59290 59946
67771 59946 58974 57445 56747 56992 57323 57369 57606 58456 59881 61904 64689 67911 70766 72902 74735 76440
67755 76440 77234 76237 73694 70816 68615 67372 67007 67340 67952 68298 68196 67976 67976 68099 67979 67452 66687 65920
67737 65920 65212 64511 63876 63473 63341 63229 62843 62153 61331 60390 59168 57725 56460 55610 54878 53822 52478
67720 52478 51236 50181 48995 47648 46751 46914 47930 49012 49770 50560 51753 53031 53707 53554 52917 52018
67704 52018 50599 48525 46505 45742 46743 48704 50247 50676 50412 50350 51057 52547 54409 55914 56242 55112
67688 55112 53265 52003 52014 52859 53696 54241 54763 55383 55800 55644 54750 53130 51069 49297 48625 49183 50263
67671 50263 51081 51493 51881 52643 53947 55666 57297 58204 58276 58210 58855 60380 62232 63768 64707 65138 65356 65605
67653 65605 65837 65820 65540 65204 64758 63865 62647 61924 62142 62460 61646 59748 58179 58097 59292 60736 61590 61491
67635 61491 60492 59072 57896 57278 57034 56860 56567 56007 55252 54860 55447 56862 58361 59679 61262 63197 64718
67618 64718 65325 65758 67109 69351 71436 72636 73103 73239 73173 72895 72351 71342 69783 68134 67102 66854 66918
67601 66918 67006 67485 68780 70578 71949 72170 71269 69824 68421 67284 66317 65339 64221 62897 61385 59787
67585 59787 58148 56404 54677 53520 53474 54319 55210 55681 56043 56545 56733 56168 55333 55145 55786 56632 57211 57584
67567 57584 57793 57597 56907 56026 55328 55066 55530 56889 58751 60281 60920 60673 59679 58051 56261 55123 55024
67550 55024 55545 56094 56556 57012 57238 56841 55755 54325 53070 52482 52683 53080 52779 51631 50472 49968 49747
67533 49747 49195 48608 48753 49579 50317 50843 51973 54065 56186 57174 56956 56220 55284 54086 53039 53024 54304
67516 54304 55983 56861 56526 55450 54303 53440 52860 52398 51989 51808 52050 52532 52800 52752 52834 53292 53497 52556 50527
67497 50527 48501 47325 46780 46267 45818 45914 46586 47274 47566 47564 47438 47017 46088 44840 43792 43383 43753 44795
67479 44795 46267 47867 49362 50629 51607 52239 52534 52571 52418 52048 51391 50469 49479 48693 48210 47855 47466 47259
67461 47259 47652 48615 49425 49387 48657 48136 48521 49673 50872 51483 51423 51138 51130 51387 51380 50719 49634 48680 48252 48610
67441 48610 49987 52156 54176 55218 55572 56192 57273 58014 57939 57704 58186 59362 60543 61269 61460 61066 60066
67424 60066 58665 57153 55748 54768 54581 55038 55377 55106 54618 54459 54394 53839 52950 52523 52831 53246 53099 52391
67406 52391 51504 50687 49987 49362 48775 48396 48647 49697 51051 52062 52713 53354 53800 53416 52199 51018 50518
67389 50518 50464 50502 50887 51859 52877 53192 52876 52613 52633 52548 52224 52109 52472 52839 52464 51112 49221 47622 47247
67370 47247 48673 51464 54133 55245 54695 53665 53283 53660 54280 54882 55432 55531 54562 52645 50911 50447 51220
67353 51220 52308 52913 52798 52050 50973 50121 49968 50488 51330 52300 53286 53967 54185 54459 55455 56911 57841 57935
67335 57935 57971 58571 59413 60127 61086 62539 63681 63589 62682 62226 62614 63131 63393 63933 65100 66302 66816 66738 66644
67316 66644 66819 67235 67889 68637 69021 68681 67796 66812 65845 64697 63320 62007 61194 61188 61952 63015 63775 64049
67298 64049 64219 64696 65448 66140 66511 66461 66034 65493 65218 65410 66061 67190 68677 69817 69727 68554 67644 67932
67280 67932 68697 68651 67778 67099 66878 66270 64923 63753 63613 64073 64298 64442 65318 67019 68708 69717 70199 70704
67262 70704 71633 73098 74847 76257 76847 76854 76943 77345 77701 77778 77851 78202 78647 78802 78519 77826 76771 75596 74763
67243 74763 74512 74601 74757 75114 75808 76353 75967 74569 72957 71886 71322 70868 70586 70960 72087 73285 73724 73347
67225 73347 72939 73243 74125 74778 74676 74073 73536 73305 73353 73789 74781 76107 77196 77718 77830 77750 77505 77229 77311
67206 77311 77915 78623 78958 79023 79255 79758 80351 81180 82629 84576 86291 87261 87655 87727 87318 86363 85391 84969 84940
67187 84940 84795 84583 84833 85700 86828 88062 89559 91063 91776 91351 90461 89995 90159 90711 91551 92546 93225 93363
67169 93363 93570 94590 96176 97432 98151 98934 99832 99871 98439 96471 95507 95987 97119 98183 99213 100438
67153 100438 101727 102807 103578 104000 104031 103913 104226 105261 106450 106811 106058 105042 104929 106088 107974 109931
67137 109931 111738 113318 114375 114738 114807 115163 115791 116212 116413 117016 118268 119457 119807 119516 119333 119406 119324 119163
67119 119163 119651 120990 122225 122366 121834 122175 124310 127471 130044 131270 131900 133190 135504 138048 139864
67104 139864 140746 141120 141418 141831 142419 143046 143363 143247 143193 143862 145290 146974 148714 150750 152954 154549 155084
67087 155084 155203 155878 157193 158422 159145 159700 160540 161646 162777 163914 165279 167054 169244 171731 174411
67072 174411 177281 180276 182959 184647 185122 185007 185061 185279 185141 184665 184615 185539 187189 189119 191322 193806 195998
67055 195998 197214 197562 197844 198622 199842 201350 203262 205665 208363 211147 213968 216671 218855 220296 221319
67040 221319 222458 223890 225428 226959 228588 230382 232256 234131 236008 237828 239445 240814 242124 243716
67026 243716 245924 248900 252462 256068 259154 261573 263718 266171 269226 272638 275731 277903 279169 280134
67012 280134 281287 282518 283595 284902 287179 290470 293865 296520 298560 300703 303321 306214 309070 311769
66998 311769 314355 317062 320253 324004 327832 331170 334077 337231 341219 346047 351209 355963 359699 362470
66984 362470 365148 368645 372935 377141 380647 383735 387089 391052 395533 400336 405377 410741 416569 422672
66970 422672 428360 433096 437323 442078 447651 453201 458075 462904 468789 475740 482604 488426 493304 497948
66956 497948 502938 508554 514889 521850 529219 536814 544574 552513 560682 569075 577489 585727 594076 603265
66942 603265 613597 624376 634610 644099 653360 662716 672131 681912 692796 705041 718000 730962
66930 730962 743999 757632 772025 786923 802097 817427 832750 848003 863435 879349 895738
66919 895738 912492 929822 948091 967222 986605 1005744 1024770 1044242 1064588 1085851 1107869
66908 1107869 1130573 1154058 1178372 1203298 1228533 1254100 1280422 1307876 1336481 1366133 1396885
66897 1396885 1428691 1461058 1493318 1525258 1557210 1589644 1623007 1657869 1694687 1733183 1772317
66886 1772317 1811126 1849384 1887339 1925193 1963155 2001583 2040506 2079142 2116503 2152584 2188458
66875 2188458 2224958 2261627 2297207 2330858 2362538 2392451 2420620 2446995 2471576 2494232 2514643
66864 2514643 2532577 2548104 2561460 2572782 2581982 2588713 2592451 2592867 2590222 2585163 2578005 2568454 2556211
66851 2556211 2541514 2524736 2505681 2483742 2458710 2431008 2401149 2369414 2336139 2301835 2266738
66840 2266738 2230612 2193254 2154937 2116058 2076694 2036857 1996904 1957201 1917549 1877463 1836990
66829 1836990 1796787 1757322 1718491 1680117 1642295 1605031 1568038 1531296 1495406 1460889 1427294
66818 1427294 1393520 1359057 1324579 1291286 1259892 1230234 1201531 1172974 1144315 1116018 1088742
66807 1088742 1062655 1037413 1012687 988483 964994 942439 921063 901006 882039 863654 845497
66796 845497 827492 809559 791563 773666 756408 740160 724714 709632 694786 680392 666681
66785 666681 653732 641341 628874 615564 601388 587414 574884 564039 554177 544627 535166 525632
66773 525632 515772 505666 495802 486497 477567 468741 460136 452142 445043 438769 432741 425987 417833 408681
66759 408681 399758 391950 385195 379059 373411 368228 363209 358022 352675 347326 341935 336382 330722 325038
66745 325038 319354 313918 309173 305096 300918 296057 290982 286604 283016 279483 275529 271375 267298 263218
66731 263218 259078 255131 251649 248682 246117 243619 240632 236984 233447 230994 229381 227239 223809 219888
66717 219888 216636 214179 211939 209701 207579 205268 202261 198740 195601 193511 192378 191709 190955 189520 187020
66702 187020 183775 180675 178347 176655 175087 173359 171533 169812 168330 166943 165156 162490 159025 155377
66688 155377 152106 149380 147242 145839 145174 144919 144690 144352 143922 143368 142700 142033 141340 140347 138943 137499 136423
66671 136423 135566 134467 133091 131867 130953 129972 128680 127438 126682 126240 125543 124329 122822 121417 120521 120401
66655 120401 120729 120440 118713 116073 113967 113150 113071 112983 112895 112988 112774 111575 109555 107567 106159 105285 104885 105055
66637 105055 105586 105837 105280 103841 101748 99501 97892 97490 97958 98325 98027 97192 95922 94018 91705 89922
66621 89922 89344 89549 89637 89361 89162 89384 89945 90592 91049 90984 90227 88948 87372 85563 83754 82487 81966 81558
66603 81558 80560 79290 78717 79051 79382 78926 77995 77433 77559 78055 78625 79329 80343 81631 82889 83752 84073 83981
66585 83981 83599 82792 81429 79772 78298 77152 76119 75151 74527 74325 74145 73619 72936 72557 72545 72503 72090 71363
66567 71363 70593 69940 69339 68621 67759 67017 66776 67129 67703 68012 67968 67953 68327 68927 69177 68752 68074 67945 68640 69530
66547 69530 69756 69098 68000 66916 65920 64915 63900 63054 62730 63325 64738 65984 65829 64144 62302 61890
66531 61890 63123 64775 65521 65049 63925 62728 61568 60329 59144 58444 58459 58841 58984 58699 58369 58340 58420 58194
66513 58194 57705 57524 58098 59169 59923 59724 58672 57465 56717 56470 56405 56400 56643 57194 57746 58021 58265 59032 60435
66494 60435 61817 62320 61725 60595 59619 58950 58263 57350 56421 55889 56009 56786 57971 59057 59532 59343 58921 58541
66476 58541 57874 56495 54662 53171 52439 52121 51690 51066 50592 50651 51347 52340 52910 52553 51593 50886 50820 50941 50699
66457 50699 50181 49836 49843 50100 50584 51291 51960 52217 52028 51718 51557 51547 51610 51770 52070 52415 52564 52302 51721 51315
66437 51315 51600 52509 53381 53697 53706 54123 55302 56862 58003 58137 57391 56709 57207 59159 61657 63436 63948 63543
66419 63543 62901 62551 62649 62804 62243 60570 58338 56514 55457 54768 54072 53396 52726 51773 50484 49373 48954
66402 48954 49081 49215 49196 49381 50064 51075 51960 52356 52177 51621 51074 50816 50782 50740 50762 51290 52559 54076 54970
66383 54970 54891 54336 53998 54036 54160 54186 54155 54035 53768 53655 54224 55488 56684 57070 56725 56200 55654 54834 53826
66364 53826 53271 53652 54729 55881 56751 57351 57751 57918 57792 57349 56655 55916 55396 55084 54507 53099 50873 48592
66346 48592 47116 46604 46543 46588 47045 48213 49512 49829 48882 47733 47585 48398 49092 48904 48062 47263 46980 47300
66328 47300 48009 48700 49114 49457 50037 50589 50397 49264 47914 47132 46839 46369 45472 44658 44587 45361 46438 47117
66310 47117 47214 47368 48478 50665 52952 54194 54238 53899 53949 54439 54954 55149 54886 54113 52862 51316 49783 48651
66292 48651 48296 48888 50187 51624 52671 53141 53222 53322 53814 54733 55636 55940 55481 54673 54070 53903 54126 54652
66274 54652 55290 55602 55163 54096 53069 52616 52623 52668 52704 53108 54072 55233 55987 56038 55544 54895 54443 54320 54362 54297
66254 54297 54106 54067 54335 54584 54274 53236 51849 50686 50125 50217 50732 51313 51757 52153 52663 53251 53816 54505 55530
66235 55530 56628 57103 56607 55599 54728 54014 53078 52039 51685 52588 54348 55937 56611 56358 55704 55291 55457
66218 55457 55965 56257 56176 56264 57053 58254 59093 59336 59394 59340 58540 56702 54724 53860 54359 55513 56776 58069
66200 58069 59086 59197 58315 57244 56798 57024 57517 57972 58097 57493 56146 54709 53913 53902 54346 54828 54856 54099
66182 54099 53034 52838 54028 55639 56436 56511 56878 57839 58719 59131 59508 60167 60707 60604 59803 58507 56969 55632
66164 55632 54853 54362 53648 52987 53234 54375 55221 55055 54650 54946 55475 55089 53813 52992 53670 55592 57765 59355
66146 59355 59995 59778 59143 58542 58207 58343 59160 60379 61111 60794 59989 59656 59898 60072 60029 60424 61694 63389
66128 63389 64759 65456 65447 64760 63676 62814 62602 62792 62718 61951 60609 59200 58301 58203 58710 59283 59459 59113 58451
66109 58451 57880 57789 58234 58838 59115 58865 58222 57587 57625 58959 61403 63801 65091 65371 65450 65580 65337 64724 64504
66090 64504 65072 65688 65375 64222 63241 63145 63663 64043 63881 63414 63187 63450 63888 64028 63843 63768 64107 64718 65361
66071 65361 66059 66964 68062 69144 69886 69955 69291 68361 67805 67762 67865 67965 68312 68825 68771 67779 66748 67052 68855
66052 68855 70847 71743 71518 70982 70643 70403 70126 69991 70184 70611 71128 71857 72973 74160 74697 74261 73385 72806
66034 72806 72557 72179 71679 71657 72354 73175 73567 73869 74769 76232 77582 78550 79582 81027 82513 83379 83359 82616
66016 82616 81440 80199 79379 79294 79790 80437 80991 81444 81720 81654 81351 81293 81904 83116 84535 85902 87245 88748
65998 88748 90653 93160 96108 98905 101174 103433 106623 110837 115014 118133 120207 121766 122912 123496 123838
65983 123838 124482 125304 125556 124794 123240 121287 119242 117560 116563 115761 114148 111471 108602 106394 104724 103007
65967 103007 101080 99112 97195 95492 94327 93650 92784 91316 89832 89212 89487 89994 90368 90708 90994 91066 91176
65950 91176 91811 92924 93904 94490 95201 96651 98834 101238 103371 104985 106054 106718 107168 107590 108233 109304
65934 109304 110656 111794 112487 113067 113770 114142 113659 112685 112218 112784 114122 115838 117670 119245 120339 121484
65918 121484 123605 126945 130971 135347 140151 144961 148708 150950 152515 154315 156187 157585 158710 160130
65904 160130 161658 162506 162419 161959 161705 161759 161971 162123 161957 161483 161160 161276 161252 160106 157577 154302 150953 147778
65886 147778 144936 142558 140257 137269 133524 130087 128000 126961 125625 123092 119681 116286 113420 111071
65872 111071 109184 107906 107320 107131 106766 105804 104278 102586 101182 100263 99647 98944 97983 97104 96850 97369 98227
65855 98227 98856 98970 98581 97936 97551 97942 99056 100160 100569 100256 99594 98793 97939 97319 97350 98305 100307 103243
65837 103243 106313 108146 108041 106955 106551 107338 108411 108962 109203 109650 110381 111408 113094 115597 118457 121315
65821 121315 124590 128830 133714 138363 142427 146188 149711 152617 154769 156544 158147 159163 159108 158163 157042
65806 157042 156235 155540 154233 151634 147695 143156 139014 135738 133073 130577 128145 126009 124418 123477 123089
65791 123089 122987 122919 122884 123020 123204 123002 122218 121323 121098 121872 123293 124811 126279 128099 130899 134975 139890
65774 139890 144675 148664 152131 155897 160308 164797 168475 170841 171824 171450 169813 167156 163644 159166 153705
65759 153705 147844 142463 137869 133670 129606 126120 123821 122831 122967 124238 126657 129811 133162 136630 140441
65744 140441 144562 148892 153918 160358 167942 175296 181420 186648 191664 196224 199556 201552 202619 202554 200532
65729 200532 196378 191041 185457 179539 172723 165041 157174 149724 142898 136747 131235 126094 120953 115775
65715 115775 111016 107262 104691 102823 100788 98052 94993 92639 91733 92114 93053 93950 94568 94847 94790 94502
65699 94502 94074 93485 92683 91728 90708 89654 88719 88305 88760 89978 91496 92924 94110 94989 95582 96097 96729
65682 96729 97344 97676 97859 98422 99658 101364 103378 106012 109625 113987 118429 122529 126398 130419 135027
65667 135027 140643 147373 154702 161886 168828 176293 185015 194753 204444 213116 220387 226257 230798 234144
65653 234144 236519 238162 239375 240602 242177 243872 245025 245359 245444 246005 246959 247531 247300 246683 246301 246180 245775
65636 245775 244408 241450 236404 229250 220669 211576 202394 192955 183061 172959 163296 154758 147628 141529
65622 141529 135733 129944 124604 120157 116297 112442 108792 106171 104688 103257 100858 97791 95228 93893
65608 93893 93678 94167 94872 95127 94406 92933 91537 90816 90717 90930 91289 91718 92218 93057 94545 96392 97619 97523
65590 97523 96574 96054 96755 98209 99255 99255 98749 98896 100333 102744 105552 108665 112166 115549 117963 119415
65574 119415 121187 124699 130212 136906 143902 150873 157953 165473 173677 182314 190567 197671 203588 208776
65560 208776 213411 217131 219469 220190 219209 216493 212152 206393 199390 191401 182988 174817 167202 160068 153330
65545 153330 147002 140946 134940 129115 124015 120044 117126 114991 113466 112389 111598 111250 111772 113213 114982
65530 114982 116554 118116 120093 122344 124323 125811 126846 127096 125990 123643 120954 118547 116159 113456
65516 113456 110842 108912 107458 105802 103982 102894 103059 103871 104391 104443 104461 104530 104177 103159 101991 101474 101897
65499 101897 102913 104000 104832 105308 105524 105741 106196 106816 107281 107442 107617 108368 110035 112516 115376 118110 120424
65482 120424 122351 124091 125688 127062 128381 130117 132368 134329 134870 133744 131883 130359 129410 128673 127931
65467 127931 127157 126020 123912 120646 116794 113138 109989 107210 104672 102470 100783 99757 99497 99991 100939
65452 100939 101802 102075 101548 100324 98734 97303 96649 97137 98549 100185 101398 101998 102164 102173 102393 103319 105143
65435 105143 107251 108604 108927 109231 110757 113575 116600 118859 120246 121083 121595 122055 122844 123837 124052 122545
65419 122545 119598 116537 114355 112945 111746 110627 109844 109485 109360 109346 109525 109979 110636 111364 112094 112849 113708
65402 113708 114700 115704 116537 117252 118208 119686 121421 122758 123323 123438 123746 124584 125907 127786 130543 134105
65386 134105 137376 138817 137908 135702 133621 131971 130120 127901 126072 125229 124953 124560 124249 124836 126475 128234
65370 128234 129010 128488 127196 126028 125769 126686 128401 130418 132789 135912 139653 143196 146038 148702 152114
65355 152114 156584 161843 167773 174537 181963 189286 195634 200557 204087 206537 208334 209785 210915 211594
65341 211594 211754 211299 209932 207424 204050 200450 196994 193552 189895 185999 181824 177161 171889 166162 160138
65326 160138 153818 147382 141439 136623 133056 130461 128617 127396 126507 125629 124838 124526 124784 125129 125032 124544
65310 124544 124191 124258 124337 123730 122322 120881 120276 120455 120565 120138 119683 119826 120368 120750 121097 122026 123528 124861
65292 124861 125722 126743 128481 130613 132597 134540 136789 139115 141000 142422 143623 144298 143809 142218 140382
65277 140382 138942 137906 137370 137777 139023 139978 139632 138371 137486 137551 137873 137519 136360 134967 133894 133229 132621
65260 132621 131549 129721 127347 124993 123120 121829 121011 120615 120695 121231 121970 122500 122598 122464 122472 122670 122711 122351
65242 122351 121726 120973 119891 118287 116452 114929 113883 113056 112240 111400 110413 109200 108188 108142 109332 111228
65226 111228 113183 114947 116282 116608 115634 114035 112906 112657 112929 113478 114461 115727 116483 116075 114776 113476
65210 113476 112831 112976 113764 114863 115764 116115 116039 115901 115841 115853 116148 116996 118143 118904 119020 119014 119437 120069 120262 119825
65190 119825 119245 119164 119958 121611 123528 124658 124418 123590 123744 125560 128146 130146 131065 131280 131350 131782 132950
65173 132950 134654 136062 136687 137084 137981 139046 139458 139575 140883 143988 147577 149960 150962 151679 152988 155102
65157 155102 158155 162291 167196 172237 177126 182014 186983 192004 197380 203677 211098 219449 228849 239917
65143 239917 252969 267438 282461 297819 313996 331463 350111 369164 387404 403652 417443
65132 417443 429333 440435 451520 462436 472210 479697 484305 486222 485967 483770 479480 472947 464210
65119 464210 453362 440482 425786 409647 392447 374570 356457 338401 320393 302546 285584
65108 285584 270348 256807 244156 232129 221500 212848 205452 198083 190510 183488 177455 172026 166804
65095 166804 161975 157929 154740 152204 150036 147858 145402 142899 140981 140021 139798 139918 140319 141174 142503
65080 142503 144018 145225 145671 145308 144651 144347 144461 144404 143662 142397 141204 140448 139973 139397 138572 137792 137437 137422
65062 137422 137223 136648 136259 136618 137335 137437 136622 135561 134917 134743 134981 135860 137420 139194 140750 142085 143087
65045 143087 143216 142316 141277 141126 141724 142019 141465 140457 139429 138248 136681 134873 133101 131432 129831 128344
65029 128344 126989 125663 124225 122579 120746 119067 118155 118327 119210 120196 121090 121927 122451 122408 122146 122231 122486
65012 122486 122224 121469 121087 121469 121922 121817 121544 121749 122338 122979 124001 125930 128491 130916 133072 135432 137992
64995 137992 140026 141075 141509 141913 142454 143058 143724 144475 145341 146526 148237 150225 151927 153180 154366 155667
64979 155667 156677 157066 157236 157913 159249 160648 161322 160781 158985 156345 153518 150967 148748 146789 145151
64964 145151 143858 142697 141419 139944 138192 135986 133458 131259 129869 128825 127247 125150 123647 123621 124642
64949 124642 125562 125752 125323 124479 123282 122034 121269 121141 121212 121070 120837 120742 120534 119822 118958 119042 120789 123597
64931 123597 125999 126866 126086 124297 122334 120949 120686 121691 123527 125351 126456 126740 126615 126434 126152 125655
64915 125655 125195 125201 125696 126293 126803 127448 128256 128747 128610 128371 128829 129962 130977 131517 132266 134148 137269 140899
64897 140899 144250 147118 150001 153731 158754 164627 170425 175724 180839 186010 190805 194658 197606 200016
64883 200016 201867 202864 203154 203372 203864 204353 204508 204441 204390 204208 203436 201751 199122 195697 191787 187888 184470
64866 184470 181645 179151 176764 174684 173422 173267 173859 174356 174045 172765 170764 168366 165837 163379 161034
64851 161034 158616 155927 152981 149835 146366 142538 138883 136273 134992 134308 133274 131827 130803 130888 131837
64836 131837 132860 133623 134592 136293 138350 139573 139163 137655 136363 135983 136053 135824 135226 134778 134840 135366 136230
64819 136230 137485 139258 141633 144557 147635 150188 151877 153324 155707 159575 164286 168798 172809 176949
64805 176949 182029 188330 195470 202637 208938 213811 217302 219938 222196 223993 224632 223323 219897 215048
64791 215048 209705 204127 197836 190563 183023 176489 171735 168644 166676 165320 164119 162760 161371 160419
64777 160419 160112 160150 160264 160635 161495 162568 163380 164011 165097 167042 169635 172596 176202 181122 187665 195247
64761 195247 202632 208795 213701 218158 222750 227176 230897 234132 237572 241169 243924 245107 245150 245040 245339
64746 245339 246162 247436 248606 248542 246561 243330 240078 237023 233331 228533 223155 217845 212692 207738 203399
64731 203399 199873 196698 193439 190373 187979 186159 184538 183251 182743 182893 183027 182888 183062 184223 186284
64716 186284 188414 189700 189803 189252 189165 190394 192841 195717 198377 200657 202518 203794 204305 203884 202282 199477
64700 199477 196085 192950 190102 186642 182007 176908 172567 169340 166621 163905 161318 159122 157258 155662
64686 155662 154632 154587 155599 157357 159467 161620 163627 165485 167426 169721 172390 175156 177774 180357 183318
64671 183318 186938 191063 195380 199960 205327 211818 219021 225977 231877 236406 239537 241213 241238 239356 235531
64656 235531 230286 224655 219482 214798 210172 205595 201585 198364 195450 192388 189548 187736 187237 187623 188437
64641 188437 189647 191437 193921 197143 201105 205752 211146 217587 225251 233674 242032 250110 258621 268239
64627 268239 278544 288240 296270 302429 306954 309834 310637 308915 304800 299235 293465 288147 283071 277892
64613 277892 272850 268470 264731 261023 256979 252975 249629 247155 245359 243944 242559 240797 238486 235895
64599 235895 233369 230854 228020 224808 221511 218264 214750 210575 205772 200775 196040 191829 188236 185264
64585 185264 182852 181027 180018 180092 181174 182739 184212 185482 187003 189385 192859 197021 201040 204257 206707
64570 206707 209015 211644 214284 216191 217046 217230 217143 216618 215240 212963 210076 206713 202800 198514 194368
64555 194368 190721 187444 184241 181083 178208 175862 174166 173077 172359 171694 170871 169761 168184 166145 164226
64540 164226 163337 163787 164928 165973 166860 167978 169364 170687 171832 172906 173649 173468 172291 170982 170513 170946
64524 170946 171445 171185 170079 168749 167937 167886 168157 168104 167554 166939 166800 167344 168500 170151 172113 174088 175822
64507 175822 177320 178796 180457 182339 184314 186254 188291 190849 194265 198470 203254 208768 215339 222757
64493 222757 230157 236859 242938 248691 253797 257342 258509 257053 253389 248547 243790 239825 236424 233117
64479 233117 230016 227533 225500 223194 220294 217287 214735 212545 210187 207266 203687 199649 195725 192661
64465 192661 190831 189995 189809 190266 191431 193008 194516 195796 197082 198707 200941 203858 207049 209649 211078
64450 211078 211725 212538 213963 215682 217358 219174 221443 224134 227059 230283 234062 238513 243588 249218 255235
64435 255235 261366 267626 274607 283015 292937 303932 315945 329707 345968 364670 385291 407855
64423 407855 433181 462177 495367 533302 576931 627132 684035 747127 815794 889208 965700
64412 965700 1042816 1118282 1190592 1258464 1320165 1373847 1418329 1453064 1477416 1490454 1491542 1480767
64400 1480767 1458657 1425859 1383238 1331997 1273357 1208267 1137624 1062672 985127 907074 830833
64389 830833 758519 691341 629430 572705 521769 477599 440383 409132 382526 359758 340422
64378 340422 324058 310264 298985 290148 282980 276161 268889 261568 255173 250069 245680 241262 236690
64365 236690 232375 228615 225285 222107 218947 215735 212351 208847 205661 203335 201942 201036 200246 199758 200038
64350 200038 201257 203152 205388 207881 210816 214540 219371 225293 231692 237550 242046 245008 246845 248059
64336 248059 248784 248676 247249 244441 240831 237256 234240 231920 230404 229900 230444 231705 233183 234500 235481
64321 235481 236187 236922 237892 238728 238661 237428 235644 233937 232037 229330 226110 223497 221921 220438 218025 214982
64305 214982 212402 210542 208501 205513 201901 198481 195567 192965 190646 188909 187927 187475 187180 186874 186610
64290 186610 186558 186908 187760 188983 190298 191613 193222 195513 198477 201670 204716 207711 210975 214559 218262
64275 218262 222143 226600 231742 236912 241290 244896 248627 253165 258113 262371 265173 266575 267076 267030 266411
64260 266411 264997 262760 260194 258216 257646 258626 260465 261994 262230 260979 258905 256789 254626 251633 247259
64245 247259 241846 236057 230004 223476 216873 211240 207228 204467 202253 200471 199526 199597 200301 200979 201118 200586
64229 200586 199699 198921 198385 197830 197119 196558 196437 196569 196588 196523 196606 196643 196107 194875 193350 191724 189643 186867
64211 186867 183882 181476 179997 179367 179532 180436 181683 182754 183617 184669 185930 186733 186525 185698 185176 185327
64195 185327 185754 186229 187320 189678 193022 196404 199529 203317 208951 216712 226024 236219 246802 257246
64181 257246 267160 276665 286054 294928 302109 306543 307904 306231 301532 294083 284653 274023 262628 251069
64167 251069 240544 232077 225505 219793 214328 209324 204990 201027 197178 193788 191434 190283 190023 190160
64153 190160 190200 189841 189223 188828 188984 189713 191087 193329 196267 199085 201018 202115 203028 204224 205751 207581
64137 207581 209755 212237 214908 217675 220309 222263 223013 222528 221192 219292 216901 214198 211540 209241 207641
64122 207641 207322 208762 211638 214966 218181 221696 226094 231218 236503 241909 247936 254819 262247 269970
64108 269970 278155 286920 295866 304373 312100 318898 324438 328376 330902 332735 334440 336101 337863 340465
64094 340465 344744 350622 356991 362758 367671 371973 375616 378176 379298 378770 376299 371690 365299 357854
64080 357854 349712 340761 331237 322073 314030 306834 299721 292586 285999 280219 274895 269884 265712 262907
64066 262907 261293 260399 260209 260963 262310 263220 262916 261650 260410 260002 260502 261404 262204 262883 263904 265717 268299
64049 268299 271274 274421 277846 281697 285947 290629 295992 302231 309250 316982 325769 335951 347023 357726
64035 357726 367277 376177 385364 394750 403083 409257 413232 415531 416318 415418 412996 409734 406261 402689 398778
64020 398778 394400 389807 385552 382118 379504 377256 374984 372637 370024 366350 360832 353766 346424 339713
64006 339713 333429 327157 321379 317139 314836 313888 313456 312985 312175 311059 310240 310486 311788 313266 314250 315136
63990 315136 316848 319815 323864 328795 334417 340088 344905 348687 352417 357386 364044 371944 380553 389761
63976 389761 399657 410214 421414 433401 446246 459723 473625 488247 504287 522152 541606 562194
63964 562194 583816 606730 631221 657497 685786 716285 749071 784272 822242 863445 908415
63953 908415 958162 1014529 1079726 1155452 1242784 1342811 1456877 1586143 1731396 1893448
63943 1893448 2073102 2270298 2483673 2711338 2951686 3202902 3461972 3724711 3986590
63934 3986590 4242964 4488616 4717758 4924700 5104176 5251155 5361139 5431212 5460609 5450025
63924 5450025 5400446 5312687 5187763 5027602 4835666 4617018 4377547 4122977 3858711 3590401
63914 3590401 3323964 3064614 2816033 2580612 2360163 2156138 1969542 1800975 1650608
63905 1650608 1517817 1401108 1298814 1209845 1133488 1068588 1013236 965303 923081 885505 851991
63894 851991 822055 795027 770172 747141 726028 706823 689046 672088 655654 639563 623472
63883 623472 607292 591718 577878 566446 557477 550966 546976 545160 544749 545330 547307 551401 557981 566989
63869 566989 578127 590849 604474 618601 633277 648511 663875 678768 692891 706214 718665
63858 718665 730095 740369 749249 756257 760966 763345 763634 761943 758187 752344 744581 735095 723928 710891
63844 710891 695638 678067 658793 639021 619658 600632 581290 561285 540765 519884 498638
63833 498638 477212 456082 435701 416399 398661 382977 369231 356591 344385 332804 322435
63822 322435 313305 304861 296741 289134 282352 276398 271093 266298 261870 257644 253647 250150 247313 244890
63808 244890 242454 239827 237176 234819 233088 232227 232106 232111 231620 230667 229852 229501 229179 228233 226556 224485 222105
63791 222105 219109 215444 211705 208625 206379 204660 203306 202514 202410 202674 202769 202435 201833 201261 200837 200428 199852
63774 199852 199117 198438 198002 197719 197351 196885 196604 196691 196943 197024 196931 196949 197198 197467 197518 197297 196746 195697 194170 192592
63754 192592 191432 190752 190340 190258 190906 192511 194744 196953 198614 199518 199736 199592 199583 200190 201712 204202 207439
63737 207439 210914 214046 216539 218539 220431 222520 224860 227297 229700 232221 235205 238714 242296 245500
63723 245500 248491 251721 255067 257787 259490 260691 262181 264332 267240 270983 275121 278377 279552 278697
63709 278697 276837 274676 272224 269554 267096 264928 262496 259528 256737 255119 254793 255027 255261 255646 256599
63694 256599 258173 260008 261734 263278 264834 266603 268620 270868 273435 276393 279540 282471 284929 286933
63680 286933 288542 289705 290425 290885 291293 291683 291873 291560 290546 289093 287947 287758 288475 289588 290808 292115
63664 292115 293201 293446 292635 291248 289812 288420 287061 285848 284547 282364 278797 274433 270386 267095 264083
63649 264083 260709 256723 252296 248042 244872 243270 242657 241906 240569 239242 238715 239199 240404 241943 243503
63634 243503 244942 246430 248351 251003 254502 258872 263954 269333 274719 280376 286805 294027 301555 309107
63620 309107 316919 325343 334573 344867 356509 369285 382504 395887 410137 426240 444437 464283
63608 464283 485448 508045 532242 557911 584662 611865 638523 663309 684854 702086 714563
63597 714563 722668 727306 729099 727890 723306 715784 706718 697463 688421 679184 669294 658554 646661 632865
63583 632865 616254 596468 574190 550999 528639 508187 489776 473084 458051 444999 434111
63572 434111 425148 417892 412526 409174 407306 406147 405661 406550 409222 413371 418762 425639 433905 442591 450887
63557 450887 459213 468436 478414 488320 498217 509233 521989 535966 550877 567806 588267 612635
63545 612635 640058 669523 700346 731886 763301 793501 820915 843425 858980 866487 866178 859471
63533 859471 848635 836139 823738 812082 801208 791110 781652 772232 761910 749765 734968 716813
63521 716813 695067 670147 642747 613489 583134 552833 523800 496858 472423 450607 431058
63510 431058 413087 396431 381649 369355 359273 350560 342830 336292 330937 326178 321472 316860 312722
63497 312722 309245 306222 303232 300068 297198 295670 296153 298050 299858 300502 300171 299879 300480 302088 304246
63482 304246 306529 309002 311958 315285 318429 321122 323668 326267 328522 330138 331643 333757 336295 338319
63468 338319 339164 338666 336616 332890 328176 323707 320019 316593 312931 309282 306056 303191 300547 298418 297165
63453 297165 296749 296998 298036 300055 302895 306205 309885 314124 319187 325245 332180 339476 346622 353815 361918
63438 361918 371615 382896 395455 409207 424249 440717 458852 478789 500090 521870 543451 564347
63426 564347 583470 599159 610589 618730 625504 632472 640715 651317 665138 682349 702783 726549
63414 726549 753716 783600 814855 846076 875884 902724 925216 942555 954143 959226 957638 950744
63402 950744 940863 929689 917724 904997 891528 877107 861396 844410 826221 806110 782835 756038
63390 756038 726862 696849 666850 637270 608721 581821 556749 533569 512775 495030 480425
63379 480425 468396 458349 450103 443757 439333 436645 435521 436115 438899 444097 451245 459558 468717 478932
63365 478932 490293 502543 515615 529937 545902 563323 581725 601033 621764 644688 670401
63354 670401 698959 729719 761631 793737 825203 854883 881250 902961 919236 929586 933633 931548
63342 931548 924478 914143 902073 889249 876150 862798 848927 834295 818733 801801 782738 761064
63330 761064 737033 711274 684239 656376 628645 602391 578647 557780 539784 524658 512443
63319 512443 503020 495898 490276 485450 481165 477300 473162 467408 458881 447338 433341 417853 402147
63306 402147 387614 375156 364869 356466 349693 344080 338805 333345 328057 323708 320759 319427 319867 321562
63292 321562 322917 322395 320031 317076 314214 310953 306820 302244 297947 294248 291298 289309 288095 286912
63278 286912 285245 283360 281818 280903 280740 281363 282207 282222 281100 279900 279828 280776 281764 282475 283548 285530 288276
63261 288276 291380 294511 297327 299729 302284 305704 309698 312988 314857 316237 318882 323733 330403 337910
63247 337910 345497 352918 360424 368605 378006 388758 400607 413319 426982 441893 458219 475855
63235 475855 494643 514624 535882 558205 581221 604961 629876 655994 682401 708071 732984
63224 732984 757863 782864 807192 830183 852168 873904 895610 916967 937825 958405 978814
63213 978814 998626 1016921 1032596 1044705 1052681 1056173 1054649 1047326 1033694 1014059 989492 961311
63201 961311 930640 898317 865103 831993 800293 771133 744916 721449 700697 683063 668817
63190 668817 657592 648735 641938 637271 634814 634556 636466 640312 645460 651219 657448 664574 673000 682628
63176 682628 692970 703599 714442 725758 737775 750302 762719 774394 784990 794393 802547 809377
63164 809377 814555 817236 816381 811571 803176 791529 776416 757856 736989 715502 694231 672839 650876
63151 650876 628640 606968 586608 567859 550490 534021 518448 504602 493359 484530 477001 469965
63139 469965 463424 457520 452059 447009 442809 439832 437934 436848 436561 437001 437826 438925 440722 443534 447018
63124 447018 450710 454746 459531 464953 470484 475901 481373 486982 492644 498413 504305 509861 514419 517889
63110 517889 520785 523420 525545 526874 527536 527862 528145 528761 530089 531962 533587 534397 534778 535562 536869 537854
63094 537854 537659 536334 534671 533328 532367 531611 531163 531304 531965 532614 532893 533254 534724 537971 542616 547471
63078 547471 551446 554392 557233 561220 566962 574118 581993 590229 598919 608320 618715 630379 643376
63065 643376 657518 672701 689217 707497 727613 749317 772519 797490 824601 854171 886612
63054 886612 922455 962062 1005358 1051962 1101546 1154039 1209409 1267174 1326270 1385709 1445391
63043 1445391 1505825 1566897 1627390 1686088 1742918 1798533 1853146 1906483 1958591 2009895 2060440
63032 2060440 2109747 2157372 2202737 2244112 2278564 2303461 2317554 2320378 2311225 2289420 2255206 2209734
63020 2209734 2154325 2090228 2018988 1942581 1863131 1782652 1702956 1625621 1552210 1484553 1424405
63009 1424405 1372455 1328052 1290299 1259148 1235003 1217683 1206412 1200609 1199967 1203735 1210685 1220045
62997 1220045 1231980 1246875 1264455 1283791 1303808 1323610 1342706 1361197 1379488 1397479 1414216
62986 1414216 1428617 1440438 1450234 1458396 1464384 1466926 1464818 1457544 1445225 1428016 1405606 1377435
62974 1377435 1343457 1304612 1262420 1218206 1172802 1126878 1081380 1037554 996616 959323 925741
62963 925741 895326 867282 840892 815658 791317 767953 746113 726545 709574 694751 681236
62952 681236 668481 656279 644233 631601 617974 603862 590259 577764 566386 555985 546374 536993
62940 536993 527135 516788 506877 498329 491188 484876 479032 473706 468951 464642 460650 456870 453134 449352
62926 449352 445733 442580 439936 437702 436046 435372 435798 436885 437961 438593 438766 438737 438705 438444 437311 434808
62910 434808 431191 427449 424685 423450 423393 423362 422140 419449 416181 413385 411228 409269 407439 406121 405345
62895 405345 404641 403906 403793 404804 406389 407384 407199 406264 405530 405754 407040 408654 409430 408750 407207 406057 406063
62878 406063 406971 408064 408938 409737 410788 412080 413072 413118 412142 410748 409549 408579 407642 407008 407313 408705 410534
62861 410534 412104 413407 414842 416427 417765 418707 419589 420653 421647 422405 423522 425875 429377 432724 434698
62846 434698 435453 436198 437777 439947 441917 443204 443868 444237 444571 444830 444675 443824 442456 441114 440199 439691 439342
62829 439342 438938 438344 437634 437282 437947 439862 442541 445226 447492 449340 451009 452890 455461 458988 463292
62814 463292 467936 472567 477011 481200 485226 489357 493791 498464 503233 508104 513094 518015 522752 527762
62800 527762 533985 542108 552037 563134 574909 587458 601389 617303 635273 654815 675486 697475
62788 697475 721468 748103 777806 811122 848830 891577 939707 993614 1053927 1120993 1194330
62777 1194330 1272973 1356269 1443977 1535581 1629931 1725597 1821070 1914271 2002275 2082052 2151383
62766 2151383 2208654 2251961 2279127 2288849 2281352 2257663 2218687 2165409 2099576 2023570 1939647 1849804
62754 1849804 1756352 1662002 1569005 1478426 1390498 1305562 1224557 1148674 1078653 1014381 955178
62743 955178 900524 850452 805143 764341 727480 694297 664931 639357 617031 597197 579308
62732 579308 563118 548720 536561 526991 519603 513384 507685 502672 498605 495151 491858 488924 486937
62719 486937 486060 485986 486544 487840 489924 492869 497164 503397 511417 520412 530081 541186 554648 570489
62705 570489 588187 607771 630018 655587 684385 715944 750156 787444 828221 872242 918485
62694 918485 965745 1013455 1061829 1111128 1160848 1209705 1256221 1299031 1336631 1367202 1389046
62683 1389046 1401208 1403628 1396669 1380655 1355909 1323117 1283530 1238747 1190289 1139346 1086825 1033552
62671 1033552 980414 928366 878374 831317 787842 748150 711976 678903 648779 621703 597564
62660 597564 575815 555869 537586 521154 506602 493725 482425 472726 464357 456669 449184 442007
62648 442007 435472 429584 424003 418424 412797 407323 402495 398964 397003 396143 395574 394920 394454 394610 395485 396811
62632 396811 398203 399375 400284 401081 401860 402548 403096 403657 404340 404943 405241 405520 406513 408715 411946 415682 419627
62615 419627 423891 428698 434046 439675 445407 451551 458752 467358 477068 487429 498444 510415 523415
62602 523415 537327 552348 568984 587502 607807 629996 654662 682417 713404 747427 784373
62591 784373 824276 867141 912702 960058 1007436 1052713 1094415 1131905 1164418 1190335 1207876
62580 1207876 1216294 1215863 1206842 1189040 1162616 1128919 1090226 1048739 1005886 962276 918045 873342
62568 873342 828808 785696 745355 708385 674359 642540 612852 585951 562364 541826 523674
62557 523674 507587 493642 481793 471684 462914 455120 447859 440875 434551 429636 426292 423745 421105
62544 421105 418191 415353 412895 411026 410062 410168 411007 412027 413018 414089 415216 416158 416753 416954 416634 415742
62528 415742 414719 414409 415459 418017 422022 427464 434260 442152 451010 461121 473079 487408 504313
62515 504313 523655 545085 568297 593227 619970 648504 678549 709601 740997 771997 801958
62504 801958 830405 856843 880566 900855 917323 929861 938333 942595 942866 939730 933661 924864 913876
62491 913876 902119 891425 882983 877045 873797 874176 879447 890052 905337 924564 947828 975644 1007973
62478 1007973 1044235 1084155 1127776 1174255 1221228 1265943 1306686 1342591 1372357 1393939 1405614
62467 1405614 1406872 1398238 1380716 1355420 1323046 1283393 1235926 1181277 1121891 1060851 1000300 941332
62455 941332 884950 832341 784193 740396 700777 665784 636050 611383 590633 572676 557349
62444 557349 545169 536296 530088 525736 522927 521594 521290 521316 521472 522266 524231 527327 531065 534888 538246
62429 538246 540649 541884 541971 540697 537486 532051 524947 517120 509028 500552 491684 482874 474574 466773 459202
62414 459202 451836 444983 438862 433178 427292 420959 414902 410398 408125 407552 407557 407362 406678 405339 403352 401249
62398 401249 399801 399175 398803 398256 397939 398592 400371 402697 404927 406837 408525 410144 411869 413966 416719
62383 416719 420221 424200 428110 431515 434500 437687 441750 446962 453177 460132 467674 475737 484276 493228
62369 493228 502540 512245 522582 533962 546753 561086 576959 594550 614345 636881 662383 690710
62357 690710 721729 755707 793197 834465 879075 926112 974634 1023704 1072000 1117707 1158945
62346 1158945 1194170 1222157 1241957 1253246 1256618 1253133 1243449 1227633 1205865 1179053 1148520 1115260
62334 1115260 1079725 1042295 1003744 965222 927916 892785 860448 831247 805383 782974 763893
62323 763893 747611 733273 719964 706827 693126 678491 663188 647848 632733 617417 601310
62312 601310 584326 566864 549435 532649 517338 504177 493053 483213 474178 466215 459817 455079
62300 455079 451850 450140 449991 451079 452779 454573 456247 457897 459999 463218 467771 473105 478624 484629
62286 484629 491990 500818 510034 518533 526337 534235 542589 550899 558411 564802 570279 575347 580439 585546
62272 585546 590182 593957 597212 600951 606040 612537 619744 626878 633790 641293 650834 663650 680115 699842
62258 699842 722388 747827 776706 809591 846624 887406 931254 977530 1025632 1074555 1122585
62247 1122585 1167562 1207478 1240878 1266880 1285030 1295174 1297333 1291678 1278609 1258701 1232506 1200490
62235 1200490 1163257 1121631 1076425 1028437 978958 929949 883167 839141 797530 758469 722980
62224 722980 691874 664858 641177 620693 603802 590457 579801 570723 562443 554633 547337 540795
62212 540795 534991 529418 523607 517901 513357 510738 509857 509902 510127 510140 509937 509886 510467 511819 513734 516155 519364
62195 519364 523455 527995 532583 537521 543433 550365 557764 565397 573701 582987 592746 602223 611486 621440
62181 621440 632686 644718 656397 667036 676813 686206 695282 703652 711002 717520 723825 730697 738943
62168 738943 749347 762482 778549 797586 819804 845531 874807 907262 942389 979543 1017423
62157 1017423 1053887 1086748 1114735 1137340 1153902 1163406 1165370 1160479 1150069 1135252 1116775 1095291
62145 1095291 1071223 1044567 1015416 984694 953873 923854 894623 866191 839361 815174 793947
62134 793947 775416 759609 747018 737782 731136 725898 721276 717090 713473 710595 708548 707286 706683 706756
62120 706756 707799 710199 714129 719390 725420 731390 736472 740157 742273 742697 741300 738393 734938 731885
62106 731885 729227 726019 721402 715271 707852 699068 688831 677828 667535 659297 653576 650103 648449
62093 648449 648298 649426 651689 654970 659082 663829 669187 675188 681471 687276 692247 697087 702989 710441
62079 710441 718918 727678 736447 745311 754448 764271 775436 788359 802891 818661 835445 852903 870330
62066 870330 887231 903989 921469 939996 959251 979133 1000069 1022114 1044241 1064963 1083384
62055 1083384 1099231 1112019 1120741 1124468 1122970 1116568 1105606 1090223 1070541 1046865 1019657 989467
62043 989467 956953 922864 887848 852261 816361 780736 746388 714224 684580 657348 632371
62032 632371 609552 588839 570435 554788 541964 531113 521095 511572 502987 495468 488426 481437
62020 481437 474777 468701 462825 456779 450893 445525 440153 434005 427411 421661 417512 414606 412374 410719
62006 410719 409535 408356 406979 405987 406262 408320 412277 417941 424628 431361 437686 443902 450130 455652 459681
61991 459681 462356 464342 465801 466468 466480 466251 465465 463013 458240 451739 444641 437591 430703 424029 417658
61976 417658 411620 406077 401375 397562 394019 389988 385429 381056 377501 374741 372395 370278 368428 366706
61962 366706 364717 362291 359899 358345 358002 358498 359214 359883 360596 361444 362456 363735 365337 367110 369021 371628
61946 371628 375816 381939 389531 397900 406648 415528 424361 433479 443790 455911 469392 483212 496824
61933 496824 510274 523489 536086 547939 559394 570655 581296 590632 598351 604594 609538 613031
61921 613031 614555 613497 609656 603564 596243 588612 581233 574496 568779 564381 561538 560538 561574 564477
61907 564477 568886 574741 582294 591538 602001 613199 624889 636587 647222 655658 661343 664146 663878
61894 663878 660424 654233 646198 637140 627691 618483 609892 601583 592823 583444 574125 565659 558265 551681
61880 551681 545478 539089 531916 523785 515089 506273 497382 488321 479306 470790 463098 456399 450888 446707
61866 446707 443770 441869 440951 441092 442278 444423 447526 451684 456920 463215 470623 479255 489229 500796
61852 500796 514460 530678 549356 569743 590902 612305 633985 656175 678731 700924 721861
61841 721861 741117 758777 774826 788716 799622 806838 809799 808103 802017 792856 782395 771861
61829 771861 761700 752222 744095 738162 735126 735502 739460 746557 755804 766136 776676 786584 795007 801239
61815 801239 804608 804203 799195 789639 776577 761022 743215 723208 701761 680126 659125 638975
61803 638975 619928 602483 586868 572738 559556 546991 534887 523207 512150 501996 492738 484188
61791 484188 476538 470338 465623 461504 457072 452440 448413 445262 442389 439207 435809 432629 429890 427667
61777 427667 426105 425213 424609 423802 422651 421310 419888 418480 417477 417384 418189 419245 419995 420664 421958 424150
61761 424150 426683 428752 430108 431209 432662 434666 437037 439652 442732 446558 450982 455312 458753 460958
61747 460958 462170 462854 463213 463014 461875 459648 456462 452464 447658 442123 436264 430722 426069 422600 420269
61732 420269 418655 417177 415606 414312 413768 413865 414065 414191 414671 415853 417457 418978 420334 421830 423641 425619
61716 425619 427494 429042 430174 431091 432261 434019 436226 438429 440153 440910 440213 438001 434913 431761 428790
61701 428790 425784 422781 420172 418005 415694 412650 408963 405253 402015 399233 396438 393031 388748 383921
61687 383921 379154 374722 370491 366400 362714 359630 356928 354232 351485 348976 346971 345489 344357 343400
61673 343400 342627 342218 342233 342339 342011 341032 339639 338217 337070 336478 336640 337452 338575 339792 341148 342710 344493
61656 344493 346609 349154 351889 354460 357063 360374 364540 368631 371475 372779 373136 373256 373606 374542 376309
61641 376309 378878 382025 385467 388770 391437 393344 394849 396108 396638 395965 394464 393050 392187 391672 391187
61626 391187 390453 388974 386365 383101 380312 378492 376827 374133 370238 366153 363025 361128 359830 358395
61612 358395 356720 355163 353768 352044 349708 347167 344796 342083 338132 332845 327006 321315 316073 311737
61598 311737 308885 307316 305890 303706 300951 298275 295860 293461 290893 288034 284768 281336 278374 276177
61584 276177 274311 272372 270704 269822 269438 268733 267475 266258 265672 265736 266147 266601 266852 266864 266981 267578 268461 268972
61566 268972 268794 268354 268294 268764 269411 269946 270560 271757 273776 276228 278501 280475 282538 284828 286883 288358
61550 288358 289635 291219 292858 293891 294294 294673 295230 295470 295208 295207 296286 298203 299945 300978 301696 302655 303780
61533 303780 304531 304620 304354 304258 304569 305196 305961 306591 306485 305014 302371 299788 298377 297886 297096 295446 293689
61516 293689 292791 292698 292571 291893 290893 290024 289419 288947 288549 288363 288573 289246 290376 292018 294173 296444 298055
61499 298055 298538 298291 298146 298461 298964 299496 300379 301837 303454 304571 305087 305583 306744 308791 311364 313831
61483 313831 315779 317257 318450 319219 319249 318716 318353 318675 319490 320459 321800 324003 327052 330374 333448 335979
61467 335979 337560 337649 336188 333951 332006 330883 330341 329861 329246 328688 328330 327879 326804 324935 322726 320837
61451 320837 319579 318797 318150 317380 316502 315887 315973 316746 317643 318160 318420 318956 320139 321992 324355 326917 329252
61434 329252 331197 333081 335261 337519 339303 340461 341322 342057 342466 342413 342054 341495 340763 340311 341055 343443 346798
61417 346798 350006 352648 355011 357181 358732 359399 359578 359889 360507 361181 361702 362027 361964 361087 359163 356539 353943
61400 353943 351897 350433 349297 348204 346898 345276 343665 342766 343065 344328 345861 347190 348311 349393 350533
61385 350533 351792 353150 354361 355117 355436 355704 356223 356960 357810 358901 360491 362735 365652 369170 373061 376940
61369 376940 380471 383550 386297 388921 391531 393902 395551 396314 396722 397420 398227 398342 397586 396901 397302 398812
61353 398812 400798 402979 405523 408445 411437 414303 417155 420217 423738 427887 432378 436280 438672 439489
61339 439489 439440 439203 439052 439216 440093 442022 445055 448880 452661 455151 455594 454554 453383 452735 452024 450387
61323 450387 447654 444270 440868 438233 437086 437392 438244 438893 439650 441351 444227 447814 451807 456451 462085
61308 462085 468811 476722 486053 496864 508812 521325 533906 546204 558015 569316 580061 589732
61296 589732 597178 601210 601463 598673 594080 588657 582803 576526 569668 562058 553769 545268 537056 529096
61282 529096 520917 512437 504293 497125 490955 485643 481510 478818 476952 474994 473046 472206 473103 475322 478373
61267 478373 482233 486482 489920 491899 493346 495609 498774 502034 505304 509399 514692 520626 526681 532928
61253 532928 539350 545289 549935 552922 554277 554289 553621 553041 552769 552450 551924 551561 551589 551526 550619 548576 545698
61236 545698 542550 539673 537278 535030 532447 529595 527063 525183 523778 522855 522949 524366 526647 529287 532573
61221 532573 537023 542259 547170 551226 555074 559685 565312 571415 577290 582597 587477 592295 597215 602001
61207 602001 606269 609795 612529 614542 616187 618112 620796 624139 627771 631654 636113 641404 647638 655128
61193 655128 664335 675316 687420 699680 711332 721977 731393 739304 745223 748607 749384 748228 746033
61180 746033 743167 739528 735233 730753 726265 721361 715672 709402 702952 696348 689411 682249 675152 668149
61166 668149 661050 653800 646374 638444 629690 620470 611662 603636 595842 587680 579360 571537 564447 557910
61152 557910 552022 547306 544096 542176 541193 541121 542125 544077 546289 547689 547315 544876 540822 535725 529652
61137 529652 522415 514374 506596 500109 495305 492150 490601 490579 491838 494154 497452 501558 506132 511131 517074
61122 517074 524462 533144 542577 552555 563314 575076 587914 602008 617605 634753 653333 673255
61110 673255 694226 715434 735976 755670 775045 794500 813809 832484 850113 866221 880200
61099 880200 891627 900404 906489 909771 910308 908344 903948 896951 887382 875729 862639 848627 834118
61086 834118 819500 805102 791359 778903 768045 758237 748607 739115 730654 723945 718970 715577 713792
61073 713792 713199 712885 712605 713381 716264 721123 727368 735260 745522 757982 771622 785958 801521 818938
61059 818938 838336 859738 883255 908575 934921 961872 989845 1019555 1051344 1085190 1120990
61048 1120990 1158599 1197872 1238731 1280909 1323572 1365594 1406363 1445953 1484392 1521113 1555325
61037 1555325 1586600 1614882 1640235 1662879 1683255 1701770 1718582 1733920 1748538 1763544 1779631
61026 1779631 1796659 1814224 1832622 1853060 1876921 1905202 1939028 1980351 2031474 2093868 2168105
61015 2168105 2255025 2356307 2473674 2608507 2762995 2941338 3149461 3394209 3683440 4026438
61005 4026438 4433855 4918223 5495721 6187779 7021513 8028805 9239567 10662307 12257963
60996 12257963 13931760 15561037 17039078 18291926 19258031 19874966 20115305 20044162 19821781
60987 19821781 19621712 19530341 19517922 19491401 19355381 19022109 18395223 17388988 15989058
60978 15989058 14292735 12477769 10722388 9142702 7783452 6643529 5701472 4928272
60970 4928272 4293950 3772561 3343671 2990415 2697883 2453429 2247071 2070934 1918700
60961 1918700 1785475 1667601 1562417 1468230 1384025 1308813 1241555 1181823 1129717 1084659 1044951
60950 1044951 1009087 976778 947955 921462 895744 870311 845582 821687 798524 776762 757589
60939 757589 741304 726959 713507 700545 687919 675396 662951 650756 638781 626940 615613
60928 615613 605328 595913 586708 577688 569643 563024 557319 551900 546817 542426 538720 535468 532513 529578
60914 529578 526145 521911 517185 512587 508614 505589 503652 502551 501845 501507 501955 503206 504387 504511 503497
60899 503497 502085 500903 499860 498359 495889 492518 488922 485771 483022 480021 476315 472067 467545 462625
60885 462625 457043 450839 444253 437408 430395 423482 416923 410689 404626 398755 393188 387920 382993 378811
60871 378811 375981 374749 374720 375161 375497 375612 375833 376677 378478 381169 384414 387943 391798 396268 401544 407393
60855 407393 413203 418388 422729 426327 429438 432414 435580 438892 441875 444099 445598 446621 447235 447496 447717
60840 447717 448057 448021 446984 445148 443294 441536 439071 435412 431142 426995 422828 418140 413146 408618 404793
60825 404793 401135 397181 393104 389354 386146 383448 381095 378756 375979 372535 368626 364647 360717 356499
60811 356499 351601 346163 340928 336534 332835 329201 325465 322215 320029 318772 317800 316565 314834 312670
60797 312670 310497 308914 308140 307796 307472 307269 307514 308264 309463 311269 313742 316371 318479 320097 321866 324127
60781 324127 326595 329098 332015 335673 339643 343042 345368 346804 347843 348834 349762 350221 349721 348241 346433
60766 346433 345114 344555 344401 344195 343707 342744 340958 338168 334836 331973 330370 329929 329805 329201 327958 326454
60750 326454 325087 323945 322919 321991 321350 321236 321717 322678 323980 325503 326957 327801 327540 326074 323609 320368
60734 320368 316586 312741 309411 306790 304552 302303 300016 297936 296270 295051 294096 293037 291665 290435
60720 290435 290303 291786 294333 296856 298692 299793 300305 300440 300724 301800 303754 305912 307555 308685 309911
60705 309911 311734 314147 316913 319977 323364 326759 329463 331059 331995 333156 334815 336332 337047 337134 337237
60690 337237 337550 337624 337023 335762 334100 332235 330278 328281 326203 324037 321986 320326 319083 318037 317072
60675 317072 316324 315984 316133 316789 317919 319395 321087 322985 324953 326367 326349 324536 321450 318019 314919 312415
60659 312415 310564 309345 308734 308757 309342 310122 310702 311204 312222 314016 316139 318152 320304 322998 325925 328410
60643 328410 330488 332863 335585 337514 337537 335856 333567 331339 329100 326755 324517 322452 320285 317866 315428
60628 315428 313251 311383 309845 308739 308010 307441 307109 307424 308419 309432 309920 310266 311191 312549 313360 313060 312178
60611 312178 311630 311835 312689 313916 315152 316036 316515 316826 316993 316701 315962 315519 316093 317425 318575 319155 319764
60594 319764 321118 323148 325248 327082 328744 330176 330879 330556 329820 329794 330836 332059 332377 331817 331384 331845
60578 331845 333182 335163 337727 340586 343049 344739 346203 348400 351815 356382 361956 368432 375545 382974
60564 382974 390599 398384 406121 413541 420495 426743 431733 434928 436179 435508 432887 428691 424085 420296
60550 420296 417592 415500 413953 413523 414524 416607 419471 423300 428239 434016 440515 448222 457620 468505
60536 468505 480368 493197 507342 522715 538559 553947 568086 580126 589112 594415 596103 594751
60524 594751 590928 584902 576795 566998 556388 546070 536838 528902 522095 516293 511666 508620 507469 508029
60510 508029 509589 511465 513506 515933 518855 522326 526833 533311 542493 554567 569531 587559 608829
60497 608829 633319 660984 691797 725336 760518 796004 830751 864123 895716 925176 951866
60486 951866 974517 991675 1002785 1008333 1008442 1001802 986792 963577 934342 901349 865357 826159
60474 826159 784061 740490 697526 657149 620668 588420 560016 535028 513381 495041 479593
60463 479593 466332 454636 444095 434456 425695 418084 411973 407427 404051 401097 397753 393592 388939
60450 388939 384675 381432 379008 376723 374254 371905 370058 368647 367300 365815 364296 362914 361739 360796
60436 360796 360141 359743 359428 358983 358313 357411 356307 355187 354493 354604 355334 355994 356117 355965 356138 356792 357500 357757
60418 357757 357343 356281 354926 354128 354823 357048 359710 361675 362966 364447 366530 368719 370456 371863 373371
60403 373371 375028 376555 377830 378936 379894 380735 381781 383435 385664 387997 390131 392191 394307 396301 398091
60388 398091 400105 402931 406639 410704 414518 417704 420074 421749 423390 425902 429614 433947 438119 441962
60374 441962 445803 449730 453433 456739 459877 462988 465719 467660 469071 470798 473428 476760 480196 483406
60360 483406 486502 489773 493430 497503 501850 506347 511190 516847 523581 531216 539546 548684 558647 568755
60346 568755 577910 585394 590928 594067 594282 591881 588150 584008 578978 572128 563754 555461 548592 543177
60332 543177 538492 534093 530024 526344 522745 518622 513485 507459 501320 495846 491142 486779 482510 478602
60318 478602 475601 474032 474241 476139 479204 483097 488219 495146 503583 512500 521489 531376 543122 556591
60304 556591 570727 584484 597082 607734 615810 621303 624661 626046 624931 620437 612002 599964 585623
60291 585623 570518 555389 540071 524611 510100 497931 488478 480980 474623 469235 464989 462003 460291
60278 460291 459647 459430 458874 457764 456503 455380 454152 452483 450406 448113 445629 442927 440040 436774 432703
60263 432703 427879 423285 420040 418203 416831 415153 413233 411428 409809 408392 407411 406894 406268 404964 403350
60248 403350 402558 403318 405372 408037 410863 413533 415582 416649 416814 416397 415656 414960 414949 416042 417912 419842
60232 419842 421533 423121 424569 425584 426220 426982 428178 429602 431024 432508 434030 435333 436449 437926 440128
60217 440128 442740 445455 448768 453471 459562 466210 472725 479058 485419 491881 498418 504907 511091 516838
60203 516838 522431 528266 534319 540270 546079 551979 557949 563706 569241 574813 580230 584675 587548 589152
60189 589152 590263 591294 592101 592329 591658 589904 587128 583599 579562 575178 570679 566257 561668 556346 550158
60174 550158 543766 538003 533111 528824 524952 521523 518490 515638 512823 510116 507683 505601 503754 501915
60160 501915 500071 498609 497869 497494 496599 494805 492704 491086 490101 489537 489517 490288 491499 492286 492168 491478 490895
60143 490895 490897 491708 493321 495414 497516 499412 501297 503550 506544 510568 515587 521103 526516 531656 536653
60128 536653 541399 545623 549562 553943 558947 563580 566569 567704 567981 568564 569974 572174 574952 578048 581215
60113 581215 584376 587691 591300 595018 598352 600881 602692 604355 606352 608481 609954 610137 609064 607159
60099 607159 604683 601659 598274 595014 592315 590156 588099 585733 583051 580383 577986 575776 573543 571325
60085 571325 569398 567870 566459 564728 562429 559610 556579 553838 551815 550515 549527 548455 547150 545443
60071 545443 542941 539364 534942 530220 525496 520608 515189 509025 502293 495579 489518 484285 479644 475548
60057 475548 472303 469874 467471 464330 460639 457172 454226 451613 449483 448419 448584 449491 450840 452904 455876
60042 455876 459449 463360 467759 472653 477554 482144 486770 491737 496614 500847 504643 508546 512362 515223
60028 515223 516639 516935 516704 516297 515709 514474 511787 507278 501528 495318 488570 480679 471720 462517 453564
60013 453564 444769 436432 429536 424593 420902 417483 414225 411591 409653 407996 406318 404618 402937 401360
59999 401360 400111 399320 398783 398198 397534 396987 396763 397064 398012 399417 400876 402311 404120 406595 409517 412608
59983 412608 415994 419843 423824 427391 430429 433197 435754 437815 439136 439730 439696 439014 437530 435067 431737
59968 431737 428195 425251 423108 421341 419813 419081 419533 420541 421001 420507 419553 418843 418839 419717 421274 422988 424546
59951 424546 426071 427469 427999 427127 425514 424439 424382 424861 425490 426375 427457 428260 428536 428524 428413 428104 427618 427140
59933 427140 426494 425223 423457 422141 422143 423604 426375 430494 435830 441725 447427 452666 457565 462284 466851
59918 466851 470928 473611 473964 472056 469079 466260 464084 462695 462303 462832 463795 465042 467059 469983 472902
59903 472902 474855 476137 477821 480220 482547 484021 484636 484846 485022 485211 485001 483756 481495 479452 479154 480959
59887 480959 484005 487554 491719 496784 502477 508251 513870 519417 525067 531050 537544 544316 550751 556501
59873 556501 561884 567396 572942 577773 581136 582857 583370 583309 583046 582551 581687 580507 579198 577807 576278 574721
59857 574721 573386 572338 571401 570501 569884 569928 570901 572997 576389 580988 586190 591089 595020 597884 599896 601050
59841 601050 600922 599123 595860 591899 587974 584439 581492 579309 577676 575765 572704 568374 563447 558737
59827 558737 554766 551812 549967 549071 548865 549237 550091 550949 551051 549948 547818 545126 542176 539089 536031 533305
59811 533305 531269 530190 530056 530507 531014 531126 530535 529081 526861 524206 521360 518354 515329 512698 510610
59796 510610 508541 505943 503072 500604 498525 496172 493423 491021 489397 487927 485893 483538 481541 479880
59782 479880 477864 475083 471785 468552 466137 465289 466051 467392 468188 468459 469075 470429 472186 474219 476809
59767 476809 479795 482595 485451 489617 495575 501889 506820 510466 514264 518752 523081 526722 530395 534914
59753 534914 540104 545466 551130 557443 564104 570488 576516 582542 588551 594115 599081 603682 608004 611819
59739 611819 615018 617685 619665 620589 620475 619867 619212 618511 617753 617143 616569 615413 613408 611368 610476 610998 612202
59722 612202 613387 614414 615213 615430 614790 613464 611825 610143 608650 607545 606721 605766 604561 603599 603429 603953
59706 603953 604650 605341 606336 607835 609642 611541 613595 615883 618304 620906 624135 628331 633075 637432 640764
59691 640764 642971 643984 643603 642107 640530 639788 639764 639671 639168 638534 637803 636413 634011 631116 628496 626153
59675 626153 623341 619486 614679 609303 603537 597412 591141 585272 580463 577034 574609 572285 569338 565802
59661 565802 562338 559657 558122 557678 557905 558337 559040 560779 564251 569186 574551 579589 584183 588201 591196
59646 591196 593108 594668 596378 597370 596115 592305 587327 582559 577920 572575 566577 560936 556154 551543
59632 551543 546293 540607 535328 530888 527226 524453 522870 522224 521549 520011 517584 514662 511381 507605 503282
59617 503282 498434 492981 486873 480336 473757 467514 462148 458442 456860 456902 457391 457469 457083 456600 456409 456904
59601 456904 458362 460512 462503 463596 463777 463538 463303 463285 463705 464767 466426 468400 470398 472159 473350 473726
59585 473726 473509 473394 474016 475382 476883 477752 477528 476217 474117 471506 468428 464852 461062 457711 455294
59570 455294 453545 451593 448830 445511 442436 440189 438851 438275 438276 438561 438801 438907 439040 439219 439164 438685 438000
59553 438000 437468 437211 437286 438035 439823 442453 445207 447603 449847 452430 455586 459304 463640 468763 474904
59538 474904 482546 492566 505706 521584 538386 553876 566832 577317 585442 590137 589591 583152 572578
59525 572578 561197 551786 545261 541111 538626 537537 537717 538685 539652 540103 540161 540184 539998 538774 535786 531156
59509 531156 525675 520080 514692 509593 504786 500100 495266 490213 485179 480392 475783 471167 466671 462834
59495 462834 460227 458987 458699 458694 458463 457869 457175 456986 457970 460306 463381 466265 468521 470330 471915 473296
59479 473296 474736 476855 479817 482844 485092 486832 489160 492592 496551 500300 503708 506890 509630 511626
59465 511626 513006 514183 515328 516221 516555 516192 515274 514296 513959 514704 516387 518568 521127 524483 529124 534954
59449 534954 541182 546950 552075 557042 562242 567436 572097 575929 578658 579563 577821 573430 567393 560862
59435 560862 554436 548352 542913 538412 534948 532553 531299 531043 531330 531819 532643 534121 536334 539212 542926
59420 542926 547890 554435 562672 572613 584244 597502 612371 629100 648273 670446 695303 720957
59408 720957 744484 763734 778476 789140 794673 792813 783112 768912 755532 746789 743662 745393 750530
59395 750530 757083 762983 766950 768234 765401 756392 740537 720056 698880 680122 664917 653165 644589
59382 644589 639014 636115 635130 634873 634285 633192 632270 632002 631993 631696 631411 631820 632655 632691 631339 629474 628226 627517
59364 627517 626496 625008 623815 623430 623543 623827 624625 626445 629178 632342 635862 640174 645589 651890 658627
59349 658627 665637 673282 682245 692991 705323 718533 732077 745873 759875 773659 786749 799111
59337 799111 810901 821829 831166 838405 843576 846902 848426 848028 845522 840702 833514 824266 813471 801560
59323 801560 788968 776323 764101 752099 739739 727010 714626 703057 691939 680815 670046
59312 670046 660445 652198 644671 637335 630416 624519 619889 616344 613853 612976 614512 618657 624595 631069
59298 631069 637257 642925 647804 651068 651463 647808 639509 627032 612005 596575 582384 570168 560091
59285 560091 552064 545686 540402 536018 532884 531392 531547 533043 535405 538006 540463 543284 547654 554217
59271 554217 562432 571451 581143 591775 603106 614504 625702 636766 647354 656729 664655 671677 678213
59258 678213 683749 687235 688024 686287 682735 678202 673338 668455 663634 658976 654737 651174 648384 646344
59244 646344 645048 644547 644821 645657 646813 648425 651090 655170 660058 664548 668082 671200 674485 677535 679432
59229 679432 679957 679760 679375 678584 676819 673821 669766 664971 659556 653300 645847 637259 628267 619769 612117
59214 612117 605047 598171 591248 584091 576563 568842 561512 555292 550606 547267 544584 542026 539841 538654
59200 538654 538351 537910 536767 535851 536589 539181 542534 545722 548743 551899 555337 559386 564588 570938 577621
59185 577621 583905 589827 595669 601219 606100 610531 615258 620769 626910 633140 638806 643308 646309 647878
59171 647878 648279 647658 646086 643756 640961 637975 635076 632530 630329 628071 625389 622410 619534 616838 614049
59156 614049 611112 608395 606083 603675 600387 595964 590767 585085 578788 571781 564516 557727 551789 546583
59142 546583 541840 537293 532657 527820 523075 518754 514623 510067 504982 500035 495885 492623 490165 488630
59128 488630 487870 487231 486417 486304 488133 492008 496813 501581 506350 511654 517796 524762 532323 540098 547935
59113 547935 556359 566087 576929 587710 597555 606728 615832 624663 632464 639016 644797 650036 654238 656925
59099 656925 658472 659782 661263 662543 663193 663284 662947 661781 659303 655927 652831 650623 648744 646508 644203
59084 644203 642573 641589 640416 638431 635636 632115 627735 622460 616443 609722 602276 594495 587136 580667
59070 580667 574949 569662 564635 559792 555164 551042 547637 544522 540877 536452 531875 527834 524373 521198
59056 521198 518246 515666 513519 511733 510185 508683 507082 505496 504175 503151 502270 501452 500601 499351 497459
59041 497459 495409 494023 493402 492910 492339 492367 493515 495339 497112 498759 500624 502818 505316 508301 511817
59026 511817 515456 518991 523118 528961 536943 546607 557387 569078 581537 594417 607208 619276 629868
59013 629868 638464 645174 650520 654661 656996 656654 653478 648521 643455 639289 635799 632453 629621 628365
58999 628365 629101 631169 633801 636833 640198 643383 645863 647484 648095 647440 645922 644802 644866 645348 644955 643571
58983 643571 642160 641261 640456 639228 637543 635570 633571 632181 632128 633525 635931 639235 643998 650894 660208
58968 660208 671759 684760 697825 709811 720779 731555 742262 751989 760019 766581 772085 776344
58956 776344 779098 780674 781488 781216 779060 774612 767914 758923 747542 734183 719829 705392 691288
58943 691288 677579 664235 651201 638568 626758 616382 607824 601129 596214 592963 591079 590070 589482
58930 589482 588938 588020 586426 584404 582720 581956 582003 582438 583134 584158 585261 585915 585868 585304 584462 583509 582787 582616
58912 582616 582685 582236 581222 580724 581677 583649 585570 587350 589970 594123 599601 606114 613877 623129 633707
58897 633707 645392 658092 671381 684360 696372 707510 718198 728658 739023 749469 759996
58886 759996 770565 781754 794606 809361 824828 839553 853107 865659 876741 885234 890421 892443
58874 892443 891809 889028 884604 878883 871979 864168 856112 848225 840144 831431 822580 814644 807964 801928
58860 801928 795940 789916 783724 776859 768980 760338 751472 742817 734623 726804 718748 709738 699743 689517
58846 689517 679867 671217 663832 657794 652515 646869 640270 633328 627030 621522 616071 610022 603374 596502
58832 596502 589715 583236 577359 572411 568461 565141 561899 558497 555241 552637 550927 550114 550307 551773 554597
58817 554597 558469 562827 567127 571022 574561 578230 582557 587467 592131 595658 597929 599556 600920 601482
58803 601482 600413 597908 595333 593723 592541 590445 587016 582993 578954 574655 569897 565131 560736 556412
58789 556412 551854 547468 543786 540648 537631 534935 533196 532725 533531 535774 539500 544152 548988 553776 558466
58774 558466 562529 565436 567572 569730 571670 572115 570404 567364 564224 561310 558161 554430 550226 545821
58760 545821 541313 536511 531195 525652 520798 517398 515284 513705 512290 511229 510736 510893 511874 513741 516108
58745 516108 518588 521359 524644 527877 530318 532377 535286 539347 543572 547384 551617 557249 563992 570763
58731 570763 576893 582283 586986 591318 595894 600874 605531 609049 611403 612991 613960 614531 615491 617460 619954
58716 619954 622007 623653 625932 629327 633054 636275 639349 643262 648149 653013 656913 659749 661616 661831
58702 661831 659266 653616 645755 636605 626171 614125 600880 587393 574048 560414 546247 532176
58690 532176 519172 507696 497562 488369 479902 472296 465869 460652 456177 451971 448131 445139 443270
58677 443270 442427 442315 442337 441637 439912 437997 437007 437049 437459 438143 439746 442459 445610 448761 452361 456983 462573
58660 462573 468818 475590 482659 489516 495718 500832 503901 503861 500886 496580 492361 488334 484172 480190 476829
58645 476829 473810 470705 467849 465856 464611 463509 462473 461982 462252 462966 463721 464293 464739 465698 468244 472778
58629 472778 478195 482690 485273 486116 485758 484617 483165 481947 481264 481107 481358 481845 482428 483233 484511 486037
58613 486037 487141 487721 488677 490678 492951 494117 494030 493942 494865 496551 498240 499701 501192 502844 504501 505973
58597 505973 507190 508170 508953 509599 510235 511043 511968 512487 512080 511094 510764 512139 515364 520217 526777 535062 544401
58580 544401 553849 563081 572467 582456 593331 605181 617441 628688 637602 644263 649974 655812 661851
58567 661851 667736 673469 679524 686767 696397 709453 726037 745336 766487 788992 812135 834561
58555 834561 854994 873154 889477 903978 915837 924223 929095 930949 930047 926347 920179 912514 904379
58542 904379 896245 888144 880051 871815 862915 852661 840550 826260 809585 790824 771036 751481
58530 751481 732891 715656 700332 687289 675971 665309 654938 645430 637327 630568 624897 620111
58518 620111 615781 611422 607095 603241 599909 596870 594447 593217 592750 591789 590016 588519 587905 587104 584950
58503 584950 582072 580140 579839 580487 581244 581800 582139 582400 582829 583456 584077 584878 586495 589046 591787 594328 597475
58486 597475 602116 607863 613673 619319 625417 632449 640535 649815 660265 671479 683376 696662 711805
58473 711805 727922 743469 757625 770140 780230 786645 788770 786887 781566 773565 764073 754206 744414
58460 744414 735031 727090 721775 719317 719256 721511 726299 733256 741582 750975 761497 772592 783090 792155
58446 792155 799425 804327 806172 804940 801130 794804 785669 774241 762106 750701 740468 731318 723350
58433 723350 716849 712038 709006 707620 707523 708528 710827 714534 719302 724844 731470 739521 748556 757645 766177
58418 766177 773817 780025 784298 786651 787240 785803 782071 776402 769416 761429 752868 744736 737837 731941
58404 731941 726488 721606 717547 713700 709295 704789 701459 699791 699294 699708 701323 704173 707893 712312 717361
58389 717361 722496 727013 730755 733793 735840 736773 737254 737845 738044 737328 736623 737405 739779 742887 746886 752886
58373 752886 760984 769907 778766 787786 797179 806703 816519 827173 838427 849303 859537 869820 880423
58360 880423 890822 900926 911410 922476 933401 943725 953856 964130 974100 983089 990726 996839
58348 996839 1001569 1005562 1009263 1012306 1014441 1016586 1019788 1023690 1027522 1032183 1039555 1049858 1061503 1073579
58334 1073579 1086588 1100478 1114005 1126669 1139611 1153835 1168983 1184436 1200129 1215610 1229663
58323 1229663 1241657 1252124 1261479 1269378 1275881 1281965 1288290 1294566 1300656 1307130 1314284 1321761 1329603
58310 1329603 1338518 1348759 1359851 1371713 1384813 1398968 1413312 1427728 1443003 1459344 1476148
58299 1476148 1493486 1512334 1532986 1554631 1576713 1599190 1621399 1642478 1663145 1685179 1708751
58288 1708751 1732142 1754483 1776821 1800009 1823706 1848128 1874588 1903305 1932711 1961988 1992503
58277 1992503 2025625 2060879 2097321 2135115 2174702 2215860 2258481 2302879 2348659 2394901 2441983
58266 2441983 2491507 2543983 2598539 2655337 2715922 2780497 2847376 2916013 2988030 3064041 3142020
58255 3142020 3220267 3299708 3381666 3465570 3550418 3636562 3724523 3814013 3905525 4000980 4101555
58244 4101555 4206827 4317076 4434224 4559354 4691734 4831469 4980540 5139889 5308297
58235 5308297 5485755 5675181 5878933 6096220 6325893 6569360 6828889 7105374 7399604
58226 7399604 7713471 8048399 8405076 8786211 9196970 9641348 10121021 10639043 11201575
58217 11201575 11814705 12483166 13213778 14016675 14901950 15879499 16964247 18177658 19542471
58208 19542471 21080367 22816593 24782295 27010792 29537315 32405595 35671004 39397044
58200 39397044 43656435 48540120 54162294 60658218 68187224 76944291 87168765 99149705
58192 99149705 113241201 129885496 149616987 173002742 200447441 231809552 265957260
58185 265957260 300631797 332899231 359942873 379544778 389959967 389685371 377812153
58178 377812153 354866467 323259266 286721358 249085756 213296412 181101203 153230756
58171 153230756 129703471 110116073 93902987 80508402 69437740 60253755 52587724
58164 52587724 46152685 40726037 36123751 32197506 28837701 25958065 23478979 21331122
58156 21331122 19463069 17832602 16396486 15117220 13972334 12947384 12024837 11187307
58148 11187307 10425906 9736842 9113359 8547400 8034963 7573027 7154215 6770155 6417147
58139 6417147 6093681 5795405 5517153 5256789 5012717 4780850 4558446 4347949 4152677
58130 4152677 3971391 3800974 3641434 3493992 3356847 3227133 3104891 2991107 2883812
58121 2883812 2780014 2679807 2585013 2495357 2409367 2327458 2250860 2178879 2110205 2045527 1985910
58110 1985910 1929959 1875458 1822615 1773030 1726682 1682505 1640631 1601367 1563084 1523789 1483971
58099 1483971 1445523 1408702 1372391 1336457 1301706 1268243 1235906 1205593 1178310 1153616 1130560
58088 1130560 1109183 1089570 1070571 1051253 1032518 1015536 999519 982779 965050 947193 929609
58077 929609 912540 896880 882987 869564 855219 840211 825338 810373 795147 780855 768475
58066 768475 756946 744688 731924 719858 708634 697883 688239 680350 673246 665517 657356 649596 641563
58053 641563 631909 620994 610516 601139 592255 583757 576305 570000 564262 558867 553862 548768 543043 536992
58039 536992 531124 525181 518837 512633 507032 501361 494983 488655 483273 478063 471662 464321 457400 451191
58025 451191 444884 438301 431995 425912 419455 412795 406659 401029 395338 389768 385050 381181 377505 373807
58011 373807 370159 366029 360916 355658 351810 349785 348692 347816 347157 346727 346418 346493 347171 347986 348460 349146 351001
57994 351001 354084 357800 361977 366665 371315 375244 378457 380955 381791 380077 376448 372232 367673 362345
57980 362345 356822 352216 348226 343345 337196 331256 326952 324213 322138 320061 317752 315493 314123 314262
57966 314262 315430 316597 317406 318171 319070 320185 321868 324064 325697 325784 324713 323389 321711 319168 316368
57951 316368 314327 312559 309577 305279 301231 298447 296392 294451 292975 292487 293024 294578 297127 300055 302665
57936 302665 305430 309633 315628 322595 329991 337935 345969 352901 358305 362930 367078 369737 369872 367609
57922 367609 363581 358025 351036 342904 333796 323819 313644 304252 295786 287594 279661 273089 268742 266271
57908 266271 264830 263956 263404 262965 262865 263585 264856 265511 264646 262380 259393 256474 254579 254339 255207 255860 255767
57891 255767 255634 256255 257811 260382 264019 268038 271284 273488 275449 277653 279772 281838 284604 288161 291351
57876 291351 293268 294332 295167 295416 294587 293223 292311 292065 292060 291964 291520 290414 288895 287879 287780 287831 287215 286260
57858 286260 285843 286299 287637 290117 293675 297306 299996 301950 304082 306627 309095 311264 313272 314881 315500
57843 315500 314964 313579 311408 308231 304266 300350 297180 294774 292796 291113 289902 289398 289566 290005 290319
57828 290319 290594 291271 292523 294135 296054 298556 301647 304813 307647 310242 312599 314266 315025 315382 315742
57813 315742 315514 313754 310406 306097 300833 293711 284176 273023 261885 251952 243311 235248 227058 218707
57799 218707 210863 204320 199425 196017 193693 192068 190983 190568 190963 191915 192885 193662 194658 196486 199430 203352
57783 203352 207841 212371 216582 220552 224602 228814 232988 237071 241233 245502 249671 253595 257187 260098
57769 260098 261874 262559 262681 262524 261864 260564 258891 257039 254784 251861 248300 244209 239694 235219 231550
57754 231550 229087 227581 226717 226534 227107 228336 230315 233394 237626 242567 247870 253491 259061 263736 267108
57739 267108 269735 272243 274421 275727 276244 276532 276899 277379 278086 279026 279836 280244 280585 281304 282153 282391 281712
57722 281712 280499 279238 278027 276665 275004 273356 272603 273554 275924 278393 279988 281022 282267 283678 284482
57707 284482 284213 283076 281480 279744 278152 276869 275877 275310 275664 277315 280066 283458 287197 290885 293761
57692 293761 295370 296249 297194 297879 296853 293119 287255 280821 274996 269970 265454 261549 258966 258361 259660
57677 259660 262453 267010 274312 284834 297971 313146 331116 353703 382561 418485 461310 509537
57665 509537 560138 609205 652863 687431 709317 715607 704830 677160 634614 581688 524974 470701
57653 470701 422245 380316 344949 316217 293326 274586 258853 246106 236220 228118 220800 214488
57641 214488 209978 207310 205783 204971 205002 205863 207031 207926 208351 208366 207951 206972 205433 203674 202295 201760 202006
57624 202006 202456 202488 201861 200734 199335 197621 195270 192081 188403 185000 182363 180326 178478 176754 175316
57609 175316 174067 172682 171138 169880 169344 169511 170004 170420 170456 169902 168667 166829 164564 162080 159632 157572
57593 157572 156256 155673 155155 153733 151101 148059 145649 144031 142635 141267 140321 139841 139210 138164 137417 137638
57577 137638 138371 138675 138454 138374 138649 138696 137984 136615 134928 133022 130805 128169 125079 121782 118926 117138
57561 117138 116506 116665 117202 117649 117383 116154 114658 113998 114449 115184 115312 114795 114243 114198 114785 115746 116606 117010
57543 117010 116965 116691 116323 115918 115667 115838 116579 117951 119965 122343 124480 125984 127088 128160 129026 129258 128973
57526 128973 128797 129109 129851 131070 133076 135867 138813 141085 142224 142413 142556 143900 147019 151189 155209
57511 155209 158771 162472 166516 170172 172715 174262 175379 176391 177400 178463 179330 179392 178343 176696 175270
57496 175270 174308 173366 171898 169716 166982 163980 160892 157723 154485 151455 149078 147616 146952 146637 146013
57481 146013 144534 142430 140837 140711 141585 141985 141231 140251 140272 141195 141705 140759 138522 135979 134016 132996 132877
57464 132877 133422 134118 134121 132759 130331 128028 126676 125806 124446 122570 121126 120766 121196 121834 122358 122471 121867
57447 121867 120815 120196 120541 121397 121999 122172 122293 122708 123538 124719 125882 126537 126701 127069 128255 130104 132059
57430 132059 133866 135556 137032 138126 138943 139763 140656 141447 142010 142401 142818 143550 144782 146299 147589 148392
57414 148392 148893 149249 149338 149233 149573 151014 153436 155981 157722 158196 157655 157127 157847 160043 162438 163419 162661
57397 162661 161260 160413 160438 161025 161891 162926 164010 164968 165673 166183 166860 168296 170911 174584 178790 183079
57381 183079 187361 191736 196206 200544 204309 207086 208844 210082 211501 213434 215567 217181 217805 217791 218153
57366 218153 219638 221914 223949 225187 226044 227259 229147 231658 234728 238182 241584 244563 247229 250035
57352 250035 253351 257365 262175 267727 273734 279889 286027 291966 297433 302421 307383 312783 318584 324425
57338 324425 330089 335486 340450 345007 349727 355341 361947 368960 375873 382717 389735 397068 404886 413502
57324 413502 423008 432908 442347 450755 458276 465687 473949 483715 495077 507714 521212 535226 549407
57311 549407 563394 577011 590523 604584 619715 635715 651687 666874 681414 696052 711201
57300 711201 726602 741931 757267 772750 788056 802630 816291 829366 842280 855235 868246
57289 868246 881320 894596 908330 922618 937132 951347 965119 978761 992461 1006025 1019383
57278 1019383 1033007 1047454 1062750 1078592 1094942 1112012 1129879 1148589 1168459 1189679 1211601
57267 1211601 1233038 1253460 1273439 1293682 1314085 1334112 1353755 1373612 1394039 1414638 1434718
57256 1434718 1454022 1472926 1492143 1512422 1534394 1558443 1584611 1612799 1643172 1676197 1712046
57245 1712046 1749981 1788559 1826529 1863428 1899390 1934549 1968748 2001648 2033039 2063121 2092467
57234 2092467 2121623 2150810 2180196 2210330 2242002 2275740 2311779 2350496 2392298 2436988 2483737
57223 2483737 2531982 2581878 2633500 2686067 2738467 2790263 2841602 2892303 2941611 2988912 3034273
57212 3034273 3078171 3121027 3163108 3204657 3245959 3287372 3329268 3371879 3415318 3459823 3505823
57201 3505823 3553564 3602745 3652703 3702904 3753192 3803730 3854757 3906150 3957179 4007012 4055579
57190 4055579 4103578 4151438 4198781 4245139 4290621 4335352 4378822 4420479 4460598 4499775 4537804
57179 4537804 4573914 4608008 4640790 4672553 4702642 4730370 4755821 4779526 4801908 4823240 4843490
57168 4843490 4861960 4877652 4890349 4900771 4909381 4915663 4919109 4920271 4920126 4918681 4914883 4907767 4897135
57155 4897135 4883252 4866505 4847352 4826128 4802770 4777167 4749846 4722019 4694856 4669091 4645469
57144 4645469 4625246 4610030 4601213 4599555 4604992 4616610 4632923 4652331 4673189 4693370 4710100 4720739
57132 4720739 4723892 4719747 4709446 4694424 4676388 4657503 4640088 4625897 4615702 4609532 4607160 4608291
57120 4608291 4612433 4618961 4627674 4639488 4656487 4681008 4714465 4757026 4808350 4868560 4938578 5019876
57108 5019876 5114184 5223443 5350106 5497685 5671066 5876032 6118487 6404674 6742459 7142167
57098 7142167 7616223 8179050 8848443 9646894 10600902 11739067 13090973 14686362 16552555
57089 16552555 18710687 21173272 23943054 27010384 30348158 33906181 37606478 41341889
57081 41341889 44984708 48410556 51528498 54296077 56707096 58762871 60446529 61707795
57073 61707795 62456430 62569913 61925363 60448312 58149361 55124992 51527749 47530395
57065 47530395 43301890 38996361 34749343 30676902 26874206 23411471 20329509 17639676
57057 17639676 15329263 13368812 11718459 10333775 9171459 8193117 7366021 6662370
57049 6662370 6058909 5536909 5081736 4682125 4329589 4017777 3741660 3496887 3279563
57040 3279563 3086159 2913393 2758314 2618609 2492764 2379935 2279693 2191737 2115765 2051796
57030 2051796 2000699 1963951 1942136 1933407 1933501 1937248 1939764 1936150 1920471 1885924 1827273 1744420 1644098
57017 1644098 1537453 1434861 1342043 1260057 1187688 1123410 1066072 1015107 970430 931718 897846
57006 897846 867463 839904 815011 792283 771035 751311 733680 717840 702285 685927 669370
56995 669370 653971 640097 627097 614625 603150 593143 584534 577233 571605 568020 566278 565872 566648
56982 566648 568779 571997 575086 576290 574117 567792 557167 542511 524532 504503 484149 465168 448640
56969 448640 434833 423526 414551 408018 404128 402914 404293 408296 415116 424932 437690 452988 470004
56956 470004 487573 504439 519502 531735 539904 542512 538207 526449 508069 485400 461672 439808
56944 439808 421397 406610 394891 385671 378717 374253 372810 374749 379916 388046 399480 415097 435304
56931 435304 459261 485053 510296 532552 549678 560116 562714 556278 539950 514480 482722 448309
56919 448309 413923 381083 351124 325492 304958 289078 276634 266401 257553 249744 242945 237006
56907 237006 231408 225788 220555 216462 213505 210844 208072 206032 205915 207826 210732 213633 216387 219450
56893 219450 223343 228533 235511 244734 256562 271314 289174 309824 332170 354559 375351 393254
56881 393254 407266 416530 420467 419096 413071 403453 391613 379348 368683 361108 356986 356053 358518
56868 358518 365296 377013 393199 412909 435981 463305 495994 534704 579456 629119 680602 729193
56856 729193 770483 801871 821913 828829 820771 797771 762800 720721 676729 635625 601239 575470
56844 575470 558176 548658 547034 553808 568807 591510 622189 661827 711037 769905 838558 916272
56832 916272 999221 1080029 1150534 1204751 1238874 1249495 1233516 1190372 1123979 1042270 954854
56821 954854 870435 795130 732035 681876 644054 617451 600870 593345 594254 603305 620561 646534
56809 646534 681899 726720 779639 837433 895055 946441 986041 1010023 1016015 1002108 967254 913290
56797 913290 846050 773693 703594 640463 586356 541455 504989 476183 454774 440648 433323 432064
56785 432064 436316 445793 460467 480666 506563 536833 568061 596107 617954 631854 636216 629476
56773 629476 611272 583010 547084 506065 462781 420302 381180 346743 317245 292422 271749
56762 271749 254567 240279 228347 218127 209024 200816 193497 186763 180134 173706 168310 164595 162272
56749 162272 160585 159240 158501 158458 158553 157944 156283 154122 152489 151937 152017 151839 151093 150310 150147 150673 151423 151847
56731 151847 151619 150733 149501 148358 147630 147538 148297 149886 151754 153152 153919 154622 155746 156997 157660 157490 157023
56714 157023 157031 157802 158928 159753 160054 160221 160700 161343 161564 161111 160472 160451 161459 163163 164659 165062 164269 163165
56696 163165 162819 163396 164119 164340 164280 164568 165377 166310 166949 167225 167343 167660 168623 170528 173128 175581 177035 177394
56678 177394 177386 177756 178503 179119 179423 179713 180032 179769 178359 176017 173380 170689 167854 165203 163637 163806 165399
56661 165399 167355 168702 169215 169381 169708 170109 170196 170128 170663 172112 173799 174967 175772 176825 178191 179511 180793
56644 180793 182318 184018 185670 187518 189871 192228 193702 194282 194781 195509 195974 196057 196432 197463 198591 199296
56628 199296 199846 200580 201165 201138 200571 199706 198520 197132 195980 195059 193606 191117 188148 185487 183132 180762
56612 180762 178619 177146 176193 175377 174855 174884 175071 174949 174958 175822 177071 177309 176127 174783 174643 175776 177439
56595 177439 179211 181026 182608 183548 183881 184178 185058 186774 189136 191622 193627 194769 195056 194768 194248 193806
56579 193806 193767 194441 195915 197782 199317 200173 200844 202076 203912 205750 207400 209451 212325 215492 218129
56564 218129 220212 222445 225358 229005 233522 239475 247453 257351 268038 277812 285469 290959 294674 296236
56550 296236 294725 290300 284777 280058 276572 273756 271327 269243 266998 264058 260816 258154 256137 254043
56536 254043 251678 249756 248779 248348 247871 247277 246669 245813 244402 242482 240402 238618 237669 237906 238996 240011
56520 240011 240216 239518 238065 235821 232793 229396 226281 223769 221554 218951 215549 211790 208734 206995 206048
56505 206048 204916 203409 202279 202159 202803 203466 203678 203498 203266 203292 203603 203893 203791 203195 202280 201362 200792 200725
56487 200725 200795 200348 199261 198230 197942 198315 198935 199808 201099 202534 203789 205232 207385 209743 211016 210696
56471 210696 209615 208754 208239 207742 207199 206683 206126 205569 205343 205675 206404 207302 208355 209557 210744 211826 212876
56454 212876 213785 214185 213940 213513 213644 214722 216408 217745 217887 217074 216639 217506 218887 219159 217938 216449 215822
56437 215822 215919 216084 216116 216018 215538 214658 213969 213935 214161 213955 213264 212478 211647 210589 209606 209388 210166 211414 212514
56418 212514 213358 214190 215182 216339 217668 219255 221181 223369 225520 227225 228148 228129 227244 225891 224687 224138
56402 224138 224482 225850 228253 231209 233791 235489 236773 238381 240360 242276 244062 245960 247900 249702
56388 249702 251704 254313 256944 258357 258179 257339 256877 257194 258506 261006 264193 267015 269073 270844 272383
56373 272383 272858 271899 270257 268423 265708 261761 258019 256309 256545 257110 257183 257393 258327 259670 260920 261932
56357 261932 262537 262561 262450 263047 264429 265652 265976 265741 265742 266318 267442 269123 271192 273003 273937 274158 274464 275440
56339 275440 277056 279108 281723 285177 289390 293885 298326 302822 307521 312060 315718 318035 319079 319221
56325 319221 318973 318986 319757 321214 322854 324291 325399 326046 326156 326033 326128 326445 326612 326568 326644 327014 327605 328562 330096
56306 330096 331864 333321 334726 336877 339670 342065 343908 346566 350992 356263 361072 365705 371235 377392
56292 377392 382647 386242 388922 391614 394500 397567 401225 406016 412113 419213 426572 433337 439338 445453
56278 445453 452776 461584 471420 481775 492144 501935 511151 520968 532807 546842 561994 577231 592369
56265 592369 607899 624772 644092 666233 690371 715582 742290 771942 805498 843047 884764
56254 884764 931280 983027 1040093 1102898 1172351 1249179 1333706 1426211 1526767 1634691 1748941
56243 1748941 1869088 1994966 2125087 2256201 2384861 2508729 2625988 2734157 2830067 2910574
56233 2910574 2972853 3014464 3033882 3031026 3006978 2963192 2901128 2822597 2730282 2627694 2518430
56222 2518430 2405281 2290065 2174232 2059307 1946653 1837260 1732067 1632168 1538397 1451011
56212 1451011 1369975 1295148 1225958 1161548 1101748 1047240 998199 953436 911712 873309 839333
56201 839333 809857 783682 759642 737204 716119 696524 679188 664593 651871 639643 627807
56190 627807 617440 609021 601900 595562 590213 585899 582169 578924 576630 575329 574323 573127 571918 570799
56176 570799 569519 568244 567692 568101 568894 569762 571300 574083 577830 581934 586248 590924 596024 601601 607745
56161 607745 614304 621095 628457 637024 646864 657529 669017 681837 696002 710883 726431 743711
56149 743711 763798 786808 812428 840836 872781 909307 951622 1000727 1057073 1121063 1193705
56138 1193705 1275798 1366251 1461986 1559563 1656072 1748576 1834118 1910926 1978851 2038377 2090211
56127 2090211 2136012 2178168 2217971 2254768 2287192 2314095 2333707 2343295 2340948 2327023 2302877 2268711
56115 2268711 2223527 2166643 2098299 2019152 1930212 1833492 1732261 1630512 1532054 1439714 1355243
56104 1355243 1280158 1216240 1164389 1123205 1089791 1062185 1040068 1023096 1009864 998990 990095
56093 990095 983140 977775 973913 971946 971778 972582 974041 976859 981412 986922 992682 999142 1006972 1015887 1025202
56078 1025202 1034841 1045007 1055548 1066338 1077651 1089541 1101517 1113381 1125734 1139182 1153774
56067 1153774 1169556 1186669 1204433 1221431 1237244 1253151 1270503 1289375 1309350 1330403 1352150
56056 1352150 1373435 1393811 1414484 1436679 1459797 1482293 1503693 1524726 1545939 1567117 1587720
56045 1587720 1607318 1626054 1645077 1665867 1688742 1712775 1737436 1763351 1791100 1820461 1851331
56034 1851331 1884221 1919307 1956085 1994462 2035006 2077626 2121389 2166092 2212624 2261210 2310893
56023 2310893 2361389 2413755 2468509 2524837 2582490 2642656 2706046 2771942 2840114 2911718 2987191
56012 2987191 3065306 3145576 3229506 3318066 3410027 3504415 3602587 3706150 3814756 3927765 4046243
56001 4046243 4171585 4303982 4443873 4592844 4751272 4917263 5089963 5271785 5465344
55992 5465344 5670473 5886518 6115196 6358691 6617159 6890876 7182771 7496098 7831634
55983 7831634 8190013 8574891 8990966 9440799 9926526 10453009 11026617 11652831 12337757
55974 12337757 13090135 13919484 14834902 15848759 16979445 18247892 19674137 21280398
55966 21280398 23095175 25151921 27487226 30144231 33176108 36644833 40621390 45191792
55958 45191792 50462099 56558419 63629410 71854672 81452436 92686998 105885298 121459543
55950 121459543 139916067 161816737 187619505 217314402 249939717 283351983 314620798
55943 314620798 340886317 359971088 370275642 370393029 359305889 337290898 306609686
55936 306609686 271080603 234728282 200553839 170154372 144034988 122065113 103795569
55929 103795569 88664119 76134084 65745450 57103122 49870617 43781617 38633100
55922 38633100 34259898 30524184 27320366 24568238 22196220 20138913 18346153 16780782
55914 16780782 15407276 14191614 13110004 12147347 11287336 10512086 9810066 9175807 8601944
55905 8601944 8078544 7599531 7162705 6763548 6395078 6053463 5738048 5446193 5173534
55896 5173534 4918965 4684129 4468046 4266940 4079121 3905466 3745234 3595689 3455859
55887 3455859 3326787 3208165 3098207 2996361 2902504 2813969 2727045 2641074 2557576 2475831
55877 2475831 2393082 2309033 2226530 2147628 2072158 2000243 1933025 1870463 1811091 1754193 1699982
55866 1699982 1647881 1597134 1548848 1504836 1464622 1426003 1388259 1352252 1317717 1283208 1248678
55855 1248678 1215540 1184202 1154004 1125474 1100000 1077146 1054779 1032058 1009947 988565 966436
55844 966436 942766 918299 893556 868325 843311 820316 800208 782316 766012 751269 737567
55833 737567 724120 711455 701033 693009 685887 678537 671013 663354 655205 646742 638483 630164 621217
55820 621217 612163 603894 595796 586390 575682 565044 554943 544764 534838 526465 519659 513011 506188
55807 506188 500579 496955 494411 492245 491009 490962 491280 491651 493001 495735 498676 500684 502005 503175 503869
55792 503869 503790 503576 503788 503844 502866 500914 498697 496610 494566 492217 488952 484260 478366 471884 464760 456279
55776 456279 446265 435583 425405 416779 410859 408593 409975 414224 420576 428097 435085 439807 441676
55763 441676 440630 435711 425833 412064 397568 384857 374178 364858 356886 350690 346422 343997 343059
55750 343059 342707 342026 340912 339491 336924 332015 324985 317374 310171 303310 296975 291877 287965 284311 280595
55735 280595 277406 274854 272276 269625 267596 266018 263616 259925 255989 252610 249329 245722 242187 238771
55721 238771 234744 230159 226346 223979 221991 219398 216872 215453 215022 215233 216749 220206 224834 229399 233726
55706 233726 238195 242469 245853 248196 249363 248512 245083 239950 234502 229004 222876 216127 209507 203522
55692 203522 198139 193179 188374 183455 178786 175354 173565 172724 172380 173306 176202 180168 183556 185885 187851
55677 187851 189940 192081 194317 196709 198710 199632 199703 199836 200390 200830 200545 199371 197420 195015 192737 191030
55661 191030 189789 188621 187401 186347 185862 186420 188113 190101 191211 191399 191903 193556 195787 197745 199407
55646 199407 200834 201383 200724 199850 199864 200329 199961 198488 196631 194597 191826 188110 183824 179079 173688 167984
55630 167984 162782 158493 154981 152181 150044 148073 145870 144039 143555 144232 144768 144448 143811 143452 143065 142079
55614 142079 140501 138736 137075 135691 134705 133964 133118 132051 130912 129709 128240 126412 124241 121581 118339
55599 118339 114987 112334 110723 109831 109276 108969 108893 108964 109243 109864 110748 111714 112853 114379 116142 117654 118592
55582 118592 119062 119491 120579 122973 126482 129950 132600 135263 139467 145392 151662 157279 162822 169392 177162
55567 177162 185461 193625 201046 206815 209986 210167 207558 202629 196103 188973 181898 174581 166197 156652
55553 156652 147122 139109 133085 128332 123982 119866 116282 113378 111135 109672 109057 108900 108663 108395 108581
55538 108581 109151 109272 108433 107146 106190 105638 105158 104843 105103 105948 106940 107779 108523 109276 110036 110678 110832 109951
55520 109951 107844 104947 101797 98520 95087 91694 88452 85120 81636 78589 76587 75420 74447 73521 72916
55505 72916 72561 72074 71441 70953 70516 69676 68426 67404 67244 68164 70131 72811 75346 76808 77053 76732 76407
55488 76407 76165 76110 76662 78116 80247 82502 84313 85262 85337 85076 85126 85676 86601 87961 89817 91707 92937
55471 92937 93479 93998 94853 95588 95539 94475 92541 90123 87962 86806 86605 86385 85265 83378 81578 80485
55455 80485 80012 79669 79197 78946 79526 80892 81989 81749 80352 78968 78303 77972 77428 76882 76928 77657 78577 79247
55437 79247 79694 80245 81087 81973 82393 82140 81604 81340 81504 81986 82822 84007 85050 85264 84606 83803 83632 84389
55419 84389 85965 87964 89765 90986 91861 92707 93148 92583 91452 91160 92431 94450 95978 96625 96552 95594 93495
55402 93495 90661 87927 85693 83827 82284 81212 80466 79609 78590 77980 78222 78965 79452 79460 79505 80121 81276
55385 81276 82680 84345 86398 88463 89798 90205 90268 90395 90105 88777 86709 84816 83500 82418 81276 80147
55369 80147 79091 78123 77661 78329 80103 82204 84047 85734 87387 88579 88856 88382 87648 86836 85835 84674
55353 84674 83557 82589 81665 80607 79371 78311 78149 79285 81059 82128 81780 80559 79417 78742 78505 78849
55337 78849 79932 81296 81918 81108 79209 77369 76612 77066 78006 78657 78842 78782 78486 77699 76377 74819 73328
55320 73328 72089 71348 71313 71827 72509 73290 74356 75485 75923 75153 73498 71808 70868 71084 72306 73770 74662
55303 74662 74912 75076 75357 75323 74762 74155 73917 73741 73227 72718 72865 73669 74550 75223 75958 77010 78277 79516
55285 79516 80503 80963 80696 79948 79363 79432 80049 80670 80851 80589 80168 79698 78947 77762 76470 75612 75356 75535 76170
55266 76170 77511 79450 81380 82833 83942 85058 86264 87412 88330 88746 88354 87214 85819 84574 83502
55251 83502 82623 82224 82473 83080 83681 84245 84802 85072 84725 83844 82839 82054 81696 81836 82169 82016 80983 79518
55233 79518 78498 78342 78769 79275 79545 79466 79057 78451 77939 78035 79362 82042 85162 87266 87685 87097 86611 86652
55215 86652 86945 87136 86976 86266 85115 84075 83551 83251 82643 81832 81494 81923 82552 82579 81847 80976 80716 81166 81705
55196 81705 81741 81473 81585 82225 82725 82523 81903 81510 81478 81389 80832 79732 78402 77506 77619 78472 79036 78748 78261
55177 78261 78510 79446 80329 80911 81537 82164 82144 81226 80147 79895 80776 82395 84223 85885 87124 87758 87708 87067
55159 87067 86186 85553 85380 85400 85302 85206 85412 85777 85790 85360 85092 85558 86542 87304 87449 87237 87035 86766 86131 85189
55139 85189 84348 83726 82955 81889 81095 81144 81761 82296 82864 84127 85902 86956 86612 85778 85740 86557 87298 87453
55121 87453 87398 87696 88512 89600 90387 90294 89348 88278 87680 87470 87512 88179 89654 91169 91786 91647 91628 91992 92295
55102 92295 92526 93301 94720 95877 95837 94573 92670 90673 88994 87969 87694 88084 89185 91095 93495 95692
55086 95692 97234 98152 98605 98659 98444 98047 97315 96222 95364 95444 96240 96765 96624 96505 97059 97999 98681 98947 98870
55067 98870 98215 96776 94991 93667 93219 93554 94413 95412 95989 95846 95410 95427 96108 96974 97516 97650 97500 97085
55049 97085 96382 95545 94883 94627 94760 95059 95335 95606 96016 96554 96937 96813 96083 95011 94051 93488 93206 92839 92190
55030 92190 91412 90777 90450 90564 91247 92337 93279 93600 93377 93006 92699 92485 92426 92425 92014 90941 89928 90169 91854
55011 91854 93709 94339 93710 92939 92887 93348 93570 93244 92800 92830 93432 94298 95333 96808 98695 100263 100780 100447
54993 100447 100227 100776 101920 103037 103573 103280 102416 101667 101411 101115 99917 97798 95632 94140 93378 93284 93973
54976 93973 95266 96643 97995 99813 102252 104649 106387 107620 108575 108720 107473 105381 103767 103280 103517
54961 103517 103998 104739 105713 106476 106686 106539 106368 106195 106005 106158 107094 108727 110395 111339 111057 109441 107008
54944 107008 104877 103999 104216 104424 103949 103411 103899 105489 107077 107633 107173 106402 105884 105805 106159 106784 107364 107723
54926 107723 108060 108678 109595 110604 111622 112860 114802 118072 123037 129329 136008 142398 148525 154539 160106
54911 160106 164732 168397 171364 173541 174417 173509 170531 165407 158634 151436 145013 139640 134883 130567 126989
54896 126989 124302 122262 120671 119597 119048 118745 118218 116984 114890 112611 111394 111739 112644 112845 112499 112818
54880 112818 114227 115927 117286 118658 120608 123301 127004 132245 138878 145723 151691 156753 161356 165471
54866 165471 168722 170890 171707 170640 167504 162986 158066 153189 148425 144066 140492 137623 134965 132086
54852 132086 128811 125119 121205 117446 114104 111190 108712 106719 104996 103122 101088 99479 98779 98842 99211
54837 99211 99529 99417 98489 96921 95611 95335 96021 97124 98375 99818 101438 103104 104615 105650 105970 105831
54821 105831 105767 105832 105630 105233 105370 106342 107452 107976 108042 108075 108050 107927 108154 108936 109577 109348 108585 108125 108008 107657
54801 107657 107042 106760 107064 107613 108119 108508 108562 108136 107674 107725 107988 107508 105954 104018 102499 101590 101155 101127 101446
54782 101446 102037 102972 104274 105582 106457 107005 107801 109188 111065 113315 116002 119119 122474 125843 129009
54767 129009 131848 134698 138323 143111 148571 154077 159726 165860 172119 177785 182767 187355 191066 192729
54753 192729 191833 189017 185036 180025 173977 167214 160074 152736 145624 139425 134476 130616 127823 126347
54739 126347 126033 126134 126056 125780 125311 124378 123078 122220 122562 124053 126171 128577 131041 133153 134602 135577 136567
54722 136567 137991 140177 143365 147371 151585 155591 159557 163759 167959 171597 174318 175989 176353 175075
54708 175075 172131 167994 163384 158854 154510 150093 145446 140874 136888 133684 131132 129115 127496 125869
54694 125869 123885 121857 120526 120100 120003 119682 119115 118348 117147 115475 113789 112455 111268 109966 108812 108183
54678 108183 107908 107548 107136 107106 107602 108321 109017 109763 110662 111560 112102 111876 110631 108599 106519 105022 104061 103232
54660 103232 102591 102718 103829 105248 106108 106311 106425 106677 106585 105811 104956 105035 106236 107654 108283 107914 106994 106100
54642 106100 105735 106166 107092 107800 107991 108153 108774 109605 110133 110367 110541 110412 109541 108115 106798 105862 105174 104905
54624 104905 105444 106573 107513 107913 108041 107936 107217 106052 105473 106180 107626 108770 109301 109659 110256 111109 112009
54607 112009 112727 113255 113925 114961 115889 115973 115310 114804 114837 114763 114051 113169 112708 112358 111524 110468 110002 110324 110886
54588 110886 111311 111782 112542 113501 114337 114669 114281 113464 112934 113113 113664 113958 113735 113083 112251 111805 112450 114115
54570 114115 115674 116139 115770 115384 115020 114128 112820 111975 112011 112345 112323 112084 112244 113120 114484 115840 116813 117423
54552 117423 117965 118484 118607 118117 117421 117048 116996 117047 117334 117984 118462 118168 117666 118400 120881 123840 125574 125657 124928
54533 124928 124267 123853 123470 123065 122908 123247 123836 123968 123181 121819 120620 119829 119045 117839 116198 114436 113099
54516 113099 112834 113817 115274 116102 116053 115833 116007 116388 116628 116721 116661 116245 115703 115889 117257 119026 119935 119528 118161
54497 118161 116149 113727 111642 110865 111469 112522 113383 114508 116577 119364 121995 124002 125520 126639 127212
54482 127212 127329 127442 127810 128232 128500 128758 129117 129280 128846 127845 126669 125705 125305 125849 127316 128931 129788
54465 129788 129891 130105 131015 132257 133133 133424 133334 133077 132785 132555 132270 131711 131094 131121 132098 133302 133725 133307 132965
54446 132965 133383 134205 134503 133763 132296 130876 130014 129512 128716 127228 125265 123370 122012 121565 122212 123563
54430 123563 124665 124820 124305 123942 124149 124765 125576 126528 127436 128050 128490 129215 130364 131441 131868 131610 131071 130529
54412 130529 129950 129266 128637 128260 128041 127657 127090 126866 127509 128813 130044 130863 131635 132729 133972 135051 135963
54395 135963 136733 137125 137063 137007 137403 138073 138643 139283 140356 141562 142159 141987 141650 141572 141523 141195 140674 140133 139583
54376 139583 139193 139411 140426 141804 142936 143664 144293 145212 146704 148913 151719 154616 156862 157897 157825 157552
54360 157552 158164 159914 161959 163314 163787 163638 162734 160714 157895 155255 153307 151546 149226 146269 143203
54345 143203 140654 139062 138507 138486 138155 137075 135567 134239 133427 133207 133590 134476 135598 136703 137614 138051 137677
54328 137677 136495 135011 133881 133464 133678 134046 133989 133434 133106 133800 135327 136604 136871 136283 135246 133820 132165
54311 132165 130999 130970 131785 132475 132478 132103 131988 132409 133113 133648 133796 133725 133648 133435 132784 131794 130998 130715 130759 130981
54291 130981 131701 133213 135106 136538 137141 137341 137741 138414 138876 138646 137788 136913 136613 136896 137250 137186 136625 135859
54273 135859 135379 135635 136642 137870 138805 139584 140679 142051 143148 143789 144437 145311 145807 145279 144038 143051 142858
54256 142858 143184 143508 143660 143849 144344 145130 145810 146011 145916 146175 147116 148327 149219 149692 149969 149973 149298 147841 146197
54237 146197 145251 145344 145797 145486 144059 142377 141497 141457 141580 141700 142255 143127 143322 142274 140736 139841 139815 140185
54219 140185 140718 141430 142049 142212 142122 142423 143433 144902 146358 147339 147460 146748 145792 145184 144943 144784 144695 144791 144894
54200 144894 144795 144746 145106 145559 145311 144128 142726 142007 142240 143059 143889 144303 144192 143699 142977 142163 141596 141665 142184
54181 142184 142365 141826 141210 141281 141841 142176 142219 142464 142985 143403 143757 144518 145646 146442 146496 146083 145443 144473 143355
54162 143355 142716 142738 142734 142076 140983 139938 138875 137530 136206 135563 135776 136365 136779 136784 136382 135714 135075 134825 135221
54143 135221 136273 137634 138698 139143 139347 139890 140583 140516 139229 137346 135786 134784 134114 133861 134443 135997
54127 135997 138138 140276 141920 142800 142976 142771 142517 142488 143077 144619 146794 148621 149445 149690 150306 151693 153540
54110 153540 155484 157413 159178 160451 161058 161290 161838 163382 166046 169192 172005 174433 177135 180270 182853
54095 182853 183838 183460 182779 182114 180692 177996 174717 172003 170182 168696 167079 165646 165167 165980 167465 168450
54079 168450 168265 167390 166964 167731 169553 171731 173573 174698 175149 175192 174879 173932 172304 170646 169843 170138 171100
54062 171100 172301 173466 174039 173318 171347 169149 167732 167227 167295 167907 169295 171440 174063 176944 179874 182450
54046 182450 184325 185576 186561 187590 189001 191266 194557 198416 202332 206513 211514 217242 222971 228356
54032 228356 233771 239461 245027 250039 254559 258674 262044 264441 266269 267988 269333 269728 269244 268537 267923
54017 267923 267151 266069 264944 264033 263281 262496 261380 259404 256171 251984 247533 242993 238025 232799 228192
54002 228192 224651 221611 218552 215923 214228 212764 210287 206713 203244 200832 199375 198396 197619 196630 194914
53987 194914 192747 191316 191335 192033 192142 191481 190918 190970 191213 191112 190835 191034 192102 193826 195570 196820 197758
53970 197758 199289 202249 206578 211525 216646 222243 228776 236176 243908 251367 257917 262685 264713 263516
53956 263516 259446 253499 246758 239914 233304 227356 222850 220482 220165 221062 222414 224124 226370 228978 231570
53941 231570 234189 237325 241237 245635 250186 254982 260237 265750 271023 275767 279957 283414 285729 286787
53927 286787 287178 287867 289462 291876 294623 297323 299943 302627 305454 308470 311947 316378 322011 328502 335223
53912 335223 341835 348326 354613 360493 365951 370981 374946 376706 375945 374053 373053 373553 374243 373482 370985
53897 370985 367809 365060 362937 360818 357890 353670 348202 341946 335423 328854 322031 314616 306625 298608
53883 298608 291223 284663 278697 273288 268778 265267 262176 258845 255394 252438 250059 247587 244546 241269
53869 241269 238316 235687 232972 229961 226672 223034 219028 215150 212234 210636 209803 208809 207169 205033 202768
53854 202768 200609 198725 197323 196444 195705 194515 192708 190809 189455 188683 188008 187111 186104 185157 184262 183553
53838 183553 183507 184525 186437 188550 190101 190641 190243 189539 189285 189646 190073 190047 189684 189365 189157 189000 189180 190024
53820 190024 191283 192424 193600 195629 198805 202232 204700 205854 206191 206282 206471 207098 208512 210815 213837
53805 213837 217291 220844 224222 227579 231562 236601 242233 247547 252243 256776 261462 265996 270019 273645
53791 273645 277071 280147 282717 285020 287240 288957 289713 289985 290852 292563 294087 294341 293245 291168 287919
53776 287919 283125 277297 271706 267023 262709 258047 253181 248739 244792 240765 236314 231816 227931 225003
53762 225003 222966 221529 220233 218582 216381 213948 211812 210241 209194 208596 208408 208357 207840 206372 204043
53747 204043 201446 199165 197474 196509 196495 197594 199557 201659 203114 203615 203508 203390 203518 203637 203431 203005 202787
53730 202787 202982 203333 203489 203451 203500 203781 204189 204695 205534 206917 208599 209993 210806 211414 212402 213820 215220 216432
53712 216432 217884 219902 222113 223983 225718 227930 230464 232252 232661 232447 232984 234876 237709 240791 243650
53697 243650 246111 248427 251257 254982 259094 262723 265694 268558 271564 274216 276030 277219 278314 279475
53683 279475 280462 280965 280668 279333 277168 274947 273363 272361 271348 270001 268587 267601 267276 267439 267651 267564
53667 267564 267276 267259 267764 268457 268839 268897 269048 269516 270084 270489 270724 270826 270631 269970 268997 268127 267667 267632 267937 268620
53647 268620 269755 271154 272350 273062 273655 274924 277257 280140 282639 284339 285693 287499 290163 293428 296700
53632 296700 299575 302138 304775 307715 310815 313816 316607 319100 321078 322448 323642 325349 327758 330289
53618 330289 332334 334050 336167 339091 342523 345976 349392 353038 357046 361295 365688 370238 374802 379016
53604 379016 382645 385810 388650 390907 392145 392404 392339 392602 393281 394025 394511 394643 394490 394248 394161 394237 394114 393388
53586 393388 392033 390271 388139 385514 382562 379783 377456 375399 373479 371997 371156 370365 368585 365420 361517
53571 361517 357833 354865 352613 350829 349073 346974 344791 343400 343345 344151 344960 345513 345999 346232 345769 344829
53555 344829 344290 344542 345044 345374 346043 347675 349879 351648 352653 353533 354944 356911 359088 361248 363381 365634
53539 365634 368248 371384 375060 379369 384543 390562 396959 403411 410282 418159 427054 436537 446511 457282
53525 457282 468917 481058 493361 505603 517485 528994 540913 554184 568651 583214 597475
53514 597475 612462 629290 647841 667267 687161 707578 728429 749601 771389 794149 817648
53503 817648 841272 864705 887988 911121 934037 956661 978475 998367 1015586 1030773 1045475
53492 1045475 1060681 1076288 1091812 1106976 1121673 1136047 1150705 1166290 1182662 1198980 1214690
53481 1214690 1229994 1245251 1260430 1275277 1289486 1302444 1313297 1321686 1328161 1333511 1337794 1340248
53469 1340248 1340066 1337112 1331980 1325384 1317447 1307734 1296178 1283700 1271324 1258751 1244574 1228163 1210748
53456 1210748 1194108 1178644 1163242 1146756 1129001 1110451 1091649 1073066 1055094 1037827 1021005
53445 1021005 1004348 987883 971882 956651 942553 930207 920393 913530 909238 906637 905156 904888 905955
53432 905955 907799 909502 910869 912783 916329 921760 928425 935484 942496 949577 957268 966235 976900 989291
53418 989291 1003180 1018295 1034476 1051866 1071020 1092490 1116166 1141272 1167171 1193967 1222127
53407 1222127 1251800 1282826 1315229 1349321 1385352 1423314 1463040 1504299 1546851 1590672 1636015
53396 1636015 1682958 1730955 1779185 1827372 1875910 1925136 1974808 2024468 2073899 2122957 2171156
53385 2171156 2217852 2262771 2306021 2347513 2386630 2422592 2455051 2484198 2510383 2533689 2553786
53374 2553786 2570066 2581942 2589087 2591463 2589188 2582399 2571184 2555437 2534695 2508234 2475631 2437354
53362 2437354 2394720 2349246 2302059 2253879 2205233 2156443 2107542 2058558 2009985 1962800 1917809
53351 1917809 1875093 1834251 1795076 1757768 1722408 1688412 1654721 1620533 1585787 1550974 1516704
53340 1516704 1483586 1452336 1423664 1397856 1374575 1353231 1333561 1315784 1300180 1286554 1274155
53329 1274155 1262184 1250460 1239550 1229984 1221276 1211910 1200569 1187351 1173564 1160413 1148161 1136586
53317 1136586 1125817 1116321 1108199 1100925 1093938 1087300 1081627 1077507 1075169 1074582 1075591 1077831 1080729 1083856
53303 1083856 1087347 1091910 1098321 1106843 1117032 1128140 1139851 1152754 1167964 1186112 1206718 1228616
53291 1228616 1250853 1273058 1295158 1317167 1339201 1361215 1382542 1402058 1419103 1434017 1447460
53280 1447460 1459442 1469365 1476823 1481885 1484595 1484651 1481786 1476171 1468259 1458394 1446718 1433233 1417795
53267 1417795 1400224 1380657 1359680 1337868 1315186 1291124 1265419 1238479 1211035 1183620 1156534
53256 1156534 1130054 1104363 1079339 1054744 1030662 1007412 984946 962686 940200 917770 895969
53245 895969 874884 854101 833324 812616 792110 771943 752531 734478 718044 702976 689000
53234 689000 676198 664800 654878 646360 639022 632356 625786 619163 612755 606599 600162 592847 584507 575215
53220 575215 564918 553590 541494 528954 516089 502985 489861 476806 463663 450526 438083
53209 438083 427115 417776 409633 402152 394883 387496 380047 372975 366473 360084 353293 346181 339027 331617
53195 331617 323563 315155 307225 300176 293670 287291 281043 275169 269974 265854 263094 261529 260652 259975 259044
53180 259044 257387 254933 252318 250248 248634 246837 244669 242576 240954 239772 238796 237654 235924 233781
53166 233781 232352 232582 233782 234149 232767 230354 228063 226493 225879 226142 226401 225550 223832 222893 223660 225041
53150 225041 225417 224606 223504 222494 221279 219870 218820 218475 218680 219076 219246 218825 218024 217724 218549 220074 221444
53133 221444 222449 223450 224588 225687 226676 227562 228165 228484 229055 230340 231929 232984 233362 233700 234487 235594
53117 235594 236654 237352 237440 237050 236968 238047 240279 242812 244806 245863 245826 244789 243252 241682 239856 237207
53101 237207 233828 230604 228272 226838 225972 225413 224811 223743 222246 220997 220655 221140 221737 221777 221181 220437 220035
53084 220035 219872 219425 218601 218027 218129 218294 217574 216009 214650 214281 214745 215481 216085 216226 215657 214606 213698 213192
53066 213192 212622 211356 209256 206676 204151 202200 201096 200714 200826 201552 203144 205326 207272 208368 208587
53051 208587 208075 206903 205422 204423 204536 205656 207141 208403 209183 209545 209790 210227 210905 211640 212265 212660 212647
53034 212647 212174 211554 211199 211143 211163 211265 211612 212040 212173 212085 212352 213296 214613 215804 216556 216630 215931 214831 213929
53015 213929 213365 212806 212265 212360 213487 215217 216768 217683 217884 217573 217306 217652 218479 219099 219268 219412 219593 219093
52997 219093 217592 216067 215755 216678 217919 218922 219695 220111 219951 219585 219774 220708 221812 222591 223101 223577 224206
52980 224206 225310 227187 229560 231725 233435 235144 237193 239219 240727 241867 243188 244733 245750 245430
52966 245430 243775 241700 240303 240065 240743 241852 243016 243861 244003 243400 242479 241589 240615 239430 238438 238124 238224
52949 238224 237943 237018 235930 234943 233566 231313 228523 225966 223995 222549 221686 221545 221847 222082 222238 222781
52933 222781 223670 224035 223314 222323 222410 223686 224807 224690 223710 222834 222296 221803 221500 221747 222142 221783 220663 219871
52915 219871 220097 220769 221149 221419 221958 222218 221365 219739 218671 218852 219646 220119 219980 219392 218592 218066 218520 220139
52897 220139 222164 223551 223905 223574 223098 222780 222591 222285 221711 221136 221018 221405 221902 222394 223371 225171 227255
52880 227255 228723 229345 229546 229500 228915 227902 227417 228337 230438 232723 234614 236331 238154 239846 240988 241544
52864 241544 241811 242078 242540 243354 244468 245494 246035 246101 246013 245952 245784 245234 243977 241660 238194 234037 229889
52847 229889 226045 222329 218680 215459 213084 211632 210889 210476 209871 208718 207243 206013 205093 203899 202152
52832 202152 200535 199963 200563 201803 203385 205399 207701 209629 210487 210059 208671 206993 205672 204951 204659 204678
52816 204678 205195 206248 207415 208264 208853 209346 209486 209013 208386 208382 209048 209706 210027 210366 210946 211412 211481 211383 211277
52797 211277 210770 209505 207770 206136 204809 203723 202967 202592 202266 201656 201005 200892 201433 202133 202547 202687 202729
52780 202729 202622 202193 201516 201021 201181 202036 203070 203727 204049 204549 205356 205856 205401 204144 202815 201879 201265 200769
52762 200769 200316 199821 199142 198282 197410 196670 196207 196303 197164 198547 199934 201179 202674 204695 206856 208447 209250
52745 209250 209794 210833 212656 214873 216771 217930 218569 219307 220566 222233 223877 225203 226241 227126 227821
52730 227821 228171 228344 229020 230736 232961 234272 233888 232780 232690 234062 235488 235296 233221 230344 227918 226579
52714 226579 226253 226282 225842 224720 223593 223156 223193 222941 222249 221764 221963 222573 223127 223510 223719 223609 223276 223234 223704
52695 223704 223942 222879 220399 217535 215372 214169 213626 213535 213887 214586 215410 216268 217250 218375 219360 219741 219255
52678 219255 218096 216788 215782 215226 215099 215406 216038 216590 216611 216162 215964 216762 218603 220841 222845 224506 225990
52661 225990 227220 227898 228046 228147 228547 228951 228898 228633 229073 230762 233196 235343 236598 237033 236982 236641 235989 234887
52643 234887 233314 231575 230139 229180 228458 227736 227052 226515 226156 226165 226844 228062 229179 229899 230786 232419 234357
52626 234357 235567 235714 235432 235453 236059 237282 238920 240290 240631 239869 238501 236809 234835 233127 232597 233333
52610 233333 234288 234578 234442 234519 234832 235067 235298 235750 236217 236255 235799 235128 234478 234087 234229 234712 234672 233501 231793
52591 231793 230819 231152 232303 233564 234698 235811 237069 238576 240187 241406 241783 241353 240477 239436 238512 238236
52575 238236 238985 240365 241450 241751 241624 241689 242116 242526 242445 241833 241270 241401 242092 242449 241929 241042 240544 240330 239703
52556 239703 238498 237296 236629 236572 236986 237523 237413 236014 233760 231976 231516 232023 232734 233482 234625 236299 238104
52539 238104 239363 239629 239166 238891 239512 240653 241204 240558 239146 237752 236728 236014 235472 235018 234722 234885 235710
52522 235710 236909 237984 238881 239896 240951 241594 241841 242326 243349 244427 245202 246214 248217 251076 253928
52507 253928 256195 257969 259554 261096 262528 263547 263700 262800 261168 259234 257112 254864 252894 251609 250786
52492 250786 249713 248023 246034 244196 242524 240779 239009 237657 237099 237180 237319 237161 237032 237536 238696 239746
52476 239746 239956 239489 239232 239808 240880 241450 240832 239387 238273 238393 239619 241137 242418 243640 245258 247540
52460 247540 250548 254191 258097 261664 264434 266297 267302 267517 267139 266468 265575 264216 262202 259695 257008
52445 257008 254324 251776 249609 248031 246945 245953 244664 243031 241484 240612 240555 240783 240681 240204 239698 239237
52429 239237 238605 237881 237534 237797 238394 239001 239633 240463 241575 242997 244645 246224 247607 249251 251693 254563
52413 254563 256798 258057 259318 261694 265209 269153 273149 277483 282782 289721 298521 308157 316512 321939
52399 321939 324499 325271 324807 322774 318822 313212 306670 300070 294136 289153 285051 281894 279862 278587 277165
52384 277165 275383 274346 275133 277217 279014 279766 280087 280808 282113 283834 285829 287925 290074 292663 296193
52369 296193 300588 305304 310056 314898 319608 323626 326682 328943 330453 330976 330505 329437 328110 326658 325372
52354 325372 324672 324596 324820 325325 326479 328318 330200 331477 332126 332655 333814 336452 340957 346579 351904 356366
52338 356366 360805 366213 372575 379435 386990 395797 405683 415781 425720 436087 447567 460130 473389
52325 473389 487431 502894 520297 539529 559995 581075 602342 623511 644427 665102 685531
52314 685531 705345 723991 741393 758137 774657 790575 805361 819379 833519 847801 861152
52303 861152 872851 883457 893822 903782 912466 919551 925504 930666 934787 937512 938750 938339 935804 930822
52289 930822 923732 915260 905847 895592 884911 874874 866527 859934 854210 848640 843581 840105 838972
52276 838972 840161 843262 847990 854241 861879 870614 880134 890434 901936 914961 928932 942518 954963
52263 954963 966967 979674 992984 1005557 1016522 1026428 1036210 1045869 1054708 1062444 1069471 1076194 1082566
52250 1082566 1088289 1093054 1096478 1098071 1097449 1094492 1089198 1081444 1071024 1058025 1043128 1027340 1011289
52237 1011289 994924 978009 960690 943345 926123 909039 892419 876772 862190 848348 835208
52226 835208 823316 813244 804994 798046 791696 785356 778976 773296 769218 766762 765101 763822 763557 764970
52212 764970 767630 770504 773253 776439 780577 785535 790811 795862 800079 802959 804529 805358 806053 806894 808029
52197 808029 809691 812024 814901 818098 821572 825404 829448 833246 836356 838723 840616 842343 844107 846033
52183 846033 847973 849291 849263 847856 845734 843163 839423 833858 827114 820523 814429 808060 801132 794623 789567
52168 789567 785885 782971 780742 779486 779157 779541 780765 783004 785979 789325 793176 797715 802373 806265 809338
52153 809338 812386 815894 819512 822798 825778 828579 831076 833228 835324 837543 839638 841392 843214 845905
52139 845905 849922 855037 860635 866230 871782 877677 884422 892367 901749 912769 925397 939217 953933
52126 953933 970042 988608 1010117 1033907 1058937 1084881 1112189 1141233 1171700 1202738 1233388
52115 1233388 1262853 1290591 1316289 1339696 1360526 1378602 1394087 1407315 1418292 1426482 1431310 1432930
52103 1432930 1432295 1430305 1426956 1421567 1413854 1404545 1394801 1385197 1375451 1365025 1353725 1341765 1329467
52090 1329467 1316961 1304036 1290154 1274795 1257884 1239938 1221780 1204164 1187627 1172598 1159573
52079 1159573 1149170 1141915 1137874 1136555 1137381 1140313 1145792 1153970 1164138 1175270 1187098 1200265 1215164
52066 1215164 1230917 1245990 1259826 1273339 1287560 1302246 1316248 1328911 1340429 1350890 1359702
52055 1359702 1366286 1370841 1374033 1376216 1377309 1377252 1376079 1373557 1369109 1362194 1352641 1340550 1326041 1309139
52041 1309139 1289857 1268325 1244921 1220237 1194960 1169715 1145017 1121252 1098708 1077658 1058366
52030 1058366 1040977 1025409 1011440 998772 986961 975540 964455 954202 945194 937112 929184 920931
52018 920931 912239 902941 892970 882908 873610 865120 856648 847857 839446 831989 824841 816783 807282 796537
52004 796537 784742 772042 758969 746161 733704 721293 708937 696940 685281 673609 661923
51993 661923 650741 640517 631340 623291 616667 611620 607800 604445 600761 596280 591060 585414 579347 572496
51979 572496 564818 556864 548958 540488 530679 519846 509172 499390 490392 482087 474820 468771 463714 459706
51965 459706 457405 457295 459030 461899 465560 470015 475244 481201 487909 495107 501932 507237 510205 510672 509070
51950 509070 506180 502740 499181 495784 492992 491267 490735 491413 493761 498568 506149 516122 528107 542207
51936 542207 558675 577520 598548 621234 644268 665783 684484 700128 712456 720004 720536 712628
51924 712628 696626 674449 648818 622332 596546 571760 547846 525116 504176 485306 468467
51913 468467 453741 441245 430577 420842 411375 402274 394183 387798 383516 381314 380871 382001 384856 389498
51899 389498 395393 401653 407787 413834 419699 424724 428082 429389 428719 426215 421892 415733 407871 398812
51885 398812 389620 381664 375791 371736 368611 366047 364624 365085 367486 371366 376363 382190 388200 393686
51871 393686 398699 403956 409680 415106 419505 423100 426382 428982 429959 428991 426528 422963 418494 413770 409829
51856 409829 407143 405415 404496 404762 406326 408621 411187 414152 417388 419855 420503 419415 417392 414729 411140
51841 411140 406638 401722 396649 391142 384986 378488 372260 366842 362571 359511 357442 356092 355413 355503 356360
51826 356360 357801 359422 360527 360439 359144 357411 355982 354884 353760 352479 351066 349405 347518 345844 344741
51811 344741 344001 343440 343674 345577 349036 352913 356217 358700 360381 361277 361778 362511 363459 363782 362826 360900
51795 360900 358768 356816 354995 353196 351329 349334 347345 345560 343782 341507 338697 336097 334472 333927
51781 333927 334207 335194 336643 337933 338692 339458 341127 343800 346700 349174 351266 353292 355380 357623 360376
51766 360376 364134 369222 375535 382450 389075 394971 400567 406532 412646 417692 420548 421004 419348 415659
51752 415659 409990 402976 395698 388858 382411 376016 369509 362887 356224 349889 344625 341112 339525 339683
51738 339683 341401 344449 348295 352389 356714 361700 367414 373241 378613 383657 388730 393569 397445 400145
51724 400145 402260 404378 406404 407918 408777 409009 408355 406398 403172 399273 395246 391125 386729 382239 378168
51709 378168 374739 371539 367999 364202 360959 358993 358181 357835 357668 358217 360198 363629 367682 371218 373300
51694 373300 373458 371932 369758 368252 368031 368609 369140 369445 369996 370858 371071 369406 365630 360732 355966 351983
51678 351983 348865 346598 345181 344530 344627 345780 348435 352610 357693 362930 368074 373477 379612 386578 394087
51663 394087 401726 409093 415653 420702 423685 424517 423408 420440 415583 409248 402587 397077 393772 392944 394176
51648 394176 396626 399408 401972 404145 405685 405903 403921 399363 392787 385504 378928 373863 370200 367307
51634 367307 364789 362775 361547 361140 361376 361996 362575 362583 361772 360318 358401 355869 352606 348939 345355 342033
51618 342033 338999 336467 334510 332629 330258 327642 325613 324424 323369 321722 319517 317173 314870 312639
51604 312639 310725 309492 309126 309644 311014 313158 316098 320204 325954 333312 341628 350282 358982 367291 374381
51589 374381 379650 383149 384926 384403 381062 375558 369485 364042 359459 355725 353301 352846 354633 358466 363961
51574 363961 370711 378389 386850 396108 406197 417168 429139 442092 455611 469033 481934 494304
51562 494304 506234 517720 528897 540262 552544 566445 582624 601683 623872 648603 674274
51551 674274 698610 719383 735066 744951 748748 746230 737475 723364 705515 685534 664335 642214
51539 642214 619437 596602 574497 553792 535012 518751 505688 496130 489528 484636 480294 475887
51527 475887 471000 464978 457283 448168 438590 429312 420398 411683 403337 395682 388707 382093 375714 369746
51513 369746 364299 359188 354242 349678 346010 343601 342373 341886 341639 341288 340672 339760 338581 337224 335863
51498 335863 334712 333903 333400 333122 333163 333843 335384 337561 339769 341510 342782 343953 345291 346681 347799 348525
51482 348525 349122 349957 350997 351707 351527 350372 348564 346364 343824 341017 338094 334986 331384 327228 322976
51467 322976 319171 315904 312956 310319 308247 306901 306198 305947 305826 305329 304139 302577 301332 300665 300208 299686
51451 299686 299430 299985 301519 303929 307294 311803 317297 323269 329474 336385 344813 355053 366432 377721
51437 377721 387955 396772 403998 409248 412260 413400 413377 412492 410633 408101 405767 404028 402050 398569 393234
51422 393234 386709 379744 372708 365915 359719 354154 348972 344203 340275 337434 335473 334181 333664 333961 334744
51407 334744 335667 336739 338019 339282 340328 341401 342858 344595 346125 347168 347875 348648 350067 352776 356938
51392 356938 361844 366587 371155 376409 382931 390483 398808 408353 419681 432552 446258 460784 477132
51379 477132 496382 518854 544405 573190 605655 641679 679943 718322 754873 788293 817341
51368 817341 840171 854713 859952 856602 846351 830531 809677 784091 754430 721639 686631 650271
51356 650271 613618 577965 544477 513701 485536 459780 436710 416972 400843 387828 377070
51345 377070 367946 360100 353145 346823 341394 337505 335447 334735 334508 334130 333363 332258 331130 330467 330576 331282
51329 331282 332102 332651 332730 332089 330445 327873 325053 322881 321729 321118 320162 318378 316072 313935 312338 311120
51313 311120 310025 309194 308989 309454 310121 310437 310213 309613 308921 308482 308659 309476 310380 310704 310486 310502 311297 312518
51295 312518 313381 313510 312976 311921 310735 310383 311769 314571 317296 318798 319272 319563 320114 321090 322979 326301
51279 326301 330813 335645 340188 344354 348036 350950 353137 355054 356917 358330 358883 358793 358714 359134 360149 361577
51263 361577 363052 364152 364687 364743 364363 363337 361475 358895 355876 352595 349189 345933 343114 340786 338795
51248 338795 336962 335083 332865 330089 326874 323621 320692 318223 316222 314718 313767 313384 313526 314161 315282
51233 315282 316772 318239 319186 319460 319419 319505 319783 320099 320466 320938 321184 320743 319757 318984 318859 318947 318615 317918 317468
51214 317468 317640 318280 319103 320081 321414 323263 325432 327370 328701 329834 331632 334307 337037 338961 340209
51199 340209 341564 343446 345700 348081 350345 352012 352665 352488 352037 351433 350294 348490 346426 344482 342698
51184 342698 341203 340407 340421 340670 340484 339884 339537 340097 341765 344214 346693 348433 349227 349468 349476 349077 348058 346702
51166 346702 345432 344179 342636 341070 340317 340770 341796 342471 342627 342902 343847 345306 346685 347579 347978 347986 347576
51149 347576 346677 345345 343694 341740 339533 337455 336183 336160 337132 338296 338924 338835 338390 338125 338347 338969 339665
51132 339665 340176 340448 340520 340448 340388 340604 341257 342286 343637 345515 348164 351389 354513 356896 358349 358959 358814
51115 358814 358179 357742 358189 359359 360247 360113 359385 359122 359793 361039 362527 364380 366597 368682 370365 372198
51099 372198 374841 377964 380541 382239 383822 385989 388406 390259 391319 391991 392582 393026 393251 393397 393613 393927
51083 393927 394346 394857 395242 395139 394351 393066 391709 390689 390213 390229 390522 390997 391816 393130 394748 396365 398158
51066 398158 400895 405265 411237 418286 426176 435345 446514 460026 475522 492081 508658 524531 539419
51053 539419 553164 565415 575795 584385 591763 598477 604702 610616 616731 623350 629624 633665 633970 630654
51039 630654 625138 618745 611779 603870 594935 585692 577182 569816 562968 555635 547323 538005 527353 514838
51025 514838 500937 487637 476981 469325 463681 459537 457396 457480 458976 461121 464316 469374 476148 483763
51011 483763 491992 501534 512755 524822 536369 546612 555586 563612 570857 577215 582457 586603 590145
50998 590145 593669 597074 599481 600115 599104 597307 595618 594668 594855 596183 598142 600249 602796 606774 612923
50983 612923 621157 631068 642701 656467 672406 689853 707908 726125 744692 764032 784225 804848
50971 804848 825485 846600 869837 897244 930083 968382 1011478 1058758 1109955 1165055 1224101
50960 1224101 1286884 1352641 1420220 1488693 1557581 1626215 1693040 1755907 1813096 1863812 1907718
50949 1907718 1944337 1973049 1993411 2005295 2008904 2004940 1994627 1979363 1960329 1938544 1915136 1891185
50937 1891185 1867151 1842670 1817143 1790495 1763197 1735604 1707567 1678874 1649895 1621384 1593542
50926 1593542 1565499 1535960 1504272 1470669 1435558 1398932 1360610 1320843 1280433 1240289 1201011
50915 1201011 1162952 1126455 1091864 1059278 1028539 999632 972998 949246 928446 909941 892980
50904 892980 877435 863741 852153 842226 832961 823456 813559 804001 795789 789309 784157 779881 776593
50891 776593 774608 773798 773772 774485 776141 778519 780969 783140 785226 787345 789257 790949 792993 795904 799576
50876 799576 803832 809210 816664 826537 838205 850592 862795 874539 886514 900084 916116 934236
50864 934236 953744 975056 999449 1027325 1057690 1089795 1124564 1163669 1207666 1255902 1308205
50853 1308205 1365837 1430580 1503512 1585017 1675482 1775354 1884536 2002251 2127638 2260175
50843 2260175 2399375 2544342 2693802 2846328 3000153 3152786 3301070 3441650 3571163
50834 3571163 3686026 3782561 3857684 3909499 3937246 3941091 3922328 3883548 3828110 3759364 3680625
50823 3680625 3595772 3509272 3425180 3346139 3273452 3207902 3150173 3100402 3057504 3019166 2982544
50812 2982544 2944918 2903759 2856607 2801467 2737581 2665548 2586449 2500958 2409482 2312958 2213197
50801 2213197 2112452 2012819 1915969 1823259 1736084 1656079 1584629 1521923 1466857 1418325 1376410
50790 1376410 1341858 1314568 1293342 1277047 1265284 1257661 1253216 1251001 1250669 1251947 1254003 1255929 1257521
50777 1257521 1258924 1259801 1259505 1258009 1255923 1253479 1250029 1244732 1237324 1228089 1217460 1205804 1193259 1179550
50763 1179550 1164227 1147208 1128916 1109902 1090722 1072203 1055256 1040169 1026475 1013846 1002695
50752 1002695 993553 986337 980871 977854 978515 983268 991360 1002061 1015689 1033098 1054525 1079347 1106861
50739 1106861 1137047 1170672 1208804 1252081 1300209 1352270 1407670 1466640 1529597 1596214 1665554
50728 1665554 1737121 1811295 1888434 1967722 2047233 2125130 2200531 2273064 2341810 2405014 2460855
50717 2460855 2508102 2545684 2571864 2584336 2581324 2562377 2528198 2480356 2421611 2356127 2288555
50706 2288555 2222599 2160471 2103499 2052788 2009255 1973356 1944853 1922604 1904654 1889000 1874343
50695 1874343 1859741 1843571 1823484 1797719 1765942 1728447 1685138 1636045 1582531 1527177 1472330
50684 1472330 1419288 1368955 1322640 1281817 1247343 1219174 1196705 1179329 1166938 1160117 1159703 1165981
50672 1165981 1178359 1195795 1217357 1242349 1270175 1300172 1331372 1362289 1391241 1417196 1440214
50661 1440214 1460916 1479599 1496052 1510187 1522645 1534676 1547326 1560705 1574147 1587289 1600874
50650 1600874 1616153 1633520 1652139 1671023 1690046 1709658 1730164 1751806 1775239 1801239 1829859
50639 1829859 1860359 1892063 1924874 1958875 1993800 2029075 2064045 2097971 2130074 2159902 2187622
50628 2187622 2213892 2239542 2265172 2290475 2313661 2332046 2343721 2348389 2346059 2335302 2313950 2282049
50616 2282049 2243565 2204544 2169718 2141177 2119565 2105229 2097803 2095658 2096738 2099779 2104007 2107794
50604 2107794 2108391 2103273 2091180 2071552 2043559 2006383 1960257 1906615 1847224 1783631 1717422 1650376
50592 1650376 1583950 1518990 1456211 1396696 1341515 1290978 1244614 1201808 1162268 1125995 1093153
50581 1093153 1063973 1038475 1016245 996735 979821 965801 954827 946649 940958 937684 936735 937798
50569 937798 940631 945304 951873 960089 969836 981617 996066 1012967 1031285 1050280 1070207 1091717
50557 1091717 1114938 1139433 1164805 1191054 1218434 1247182 1277210 1307897 1338302 1367746 1396120
50546 1396120 1423601 1450391 1476946 1504075 1532424 1562011 1592627 1624575 1658660 1695652 1736211
50535 1736211 1781279 1831942 1888719 1951292 2019016 2091404 2168096 2248833 2333661 2422785 2516027
50524 2516027 2612678 2712006 2813462 2916156 3018484 3118654 3215286 3307078 3392083 3467696
50514 3467696 3531315 3580818 3614624 3631768 3631932 3615184 3581718 3532126 3467859 3391216 3304980 3212288
50502 3212288 3116646 3021633 2930544 2846486 2772654 2711972 2666335 2636397 2622083 2622931 2637811 2664600
50490 2664600 2700208 2740676 2781242 2816713 2842149 2853317 2846772 2820087 2772398 2704648 2619189
50479 2619189 2519293 2408979 2292796 2175165 2059671 1948833 1844286 1746993 1657393 1575555
50469 1575555 1501181 1433619 1372111 1316217 1265888 1221066 1181399 1146355 1115360 1087709 1062700
50458 1062700 1040220 1021056 1006289 996331 990668 988392 988770 991325 995719 1001814 1009845 1020346 1033696
50445 1033696 1049669 1067575 1086999 1108249 1131810 1157374 1183630 1208960 1232061 1251931 1267705
50434 1267705 1278725 1284617 1285456 1282311 1277579 1273929 1272460 1272347 1272687 1274102 1277965 1284621 1293260 1303320
50420 1303320 1315147 1329289 1345930 1365226 1387538 1413101 1441919 1474178 1510331 1550678 1595219
50409 1595219 1643920 1696480 1751685 1807600 1862769 1916793 1969498 2020029 2067104 2109677 2146992
50398 2146992 2178347 2203169 2220896 2230479 2230428 2219830 2198909 2168173 2127579 2077280 2018851 1955028
50386 1955028 1888453 1821400 1756540 1696874 1644496 1599965 1563161 1534242 1513516 1500906 1495974
50375 1495974 1498234 1507035 1521132 1538524 1556597 1572533 1583887 1588946 1586478 1575338 1554746 1524976
50363 1524976 1487385 1443736 1395882 1346047 1296685 1249585 1205461 1164595 1127507 1094700 1066177
50352 1066177 1041649 1020841 1003078 986876 970507 952964 933964 913220 890387 865856 841048
50341 841048 817609 796598 778668 764608 755130 750083 748244 748145 749055 751106 754558 759199 764434 769719
50327 769719 774789 779689 784828 790810 797774 804921 811093 815925 820124 824539 829296 833989 838260 841961
50313 841961 845065 847715 850052 851835 852602 852565 852849 854373 856913 859848 863414 868399 874828 881889 889168
50298 889168 897063 905776 914876 924379 935460 949368 966089 984815 1005468 1029135 1057095 1089820
50286 1089820 1126494 1164675 1200469 1229980 1251021 1262905 1264407 1252868 1226429 1187285 1141990
50275 1141990 1098023 1059942 1028613 1003262 983386 968735 958471 951265 946271 943545 943435 945923
50263 945923 950697 957519 966359 977356 990862 1007271 1026525 1047852 1070177 1092753 1115271 1137449
50251 1137449 1158748 1178512 1196275 1211991 1226038 1238897 1250623 1260587 1267710 1270869 1269097 1261719
50239 1261719 1248654 1230610 1208877 1184879 1159973 1135437 1112422 1091815 1074072 1058910 1045051
50228 1045051 1030583 1014014 994917 973389 949165 921855 892013 861377 831785 804201 778962
50217 778962 756466 737113 720797 706946 695053 684825 675866 667661 660030 653333 648086 644540 642653
50204 642653 642160 642469 642795 642672 642236 641750 641047 639787 638141 636679 635440 633606 630464 626393 622443 619136
50188 619136 616105 612820 609167 605245 601102 596895 592918 589241 585622 582059 579050 576930 575288 573556
50174 573556 571931 571113 571225 571669 572198 573483 576229 580215 584592 588729 592360 595296 597681 600395 604543
50159 604543 610415 617451 625277 634213 644569 656086 668540 682433 698456 716555 736265 757974
50147 757974 783061 812433 845409 880488 916909 954976 995083 1036955 1079840 1122918 1165318
50136 1165318 1206120 1244719 1281141 1315921 1349764 1383363 1417112 1450566 1482151 1509588 1530628
50125 1530628 1543345 1546047 1537515 1517620 1487560 1449310 1404900 1356119 1304578 1251741 1199016 1147971
50113 1147971 1100307 1057300 1019277 985820 956363 930315 906813 885002 864798 846847 831340
50102 831340 817287 803503 789990 777634 766687 756426 746502 737790 731325 726938 723563 720516 717892
50089 717892 716029 715332 716431 719659 724190 728404 731459 734031 737257 741409 745874 749946 753176 755256
50075 755256 756046 755648 754195 751807 748946 746384 744410 742375 739524 736083 732913 730220 727274 723517 719350
50060 719350 715521 712208 709008 705535 701728 697850 694508 692477 692118 693002 694367 695966 698212 701504 705670
50045 705670 710239 715105 720680 727318 734779 742503 750413 759208 769588 781369 793597 805522 817133
50032 817133 828734 840393 852066 864032 876852 890971 906607 924039 943709 965821 989891
50021 989891 1014822 1039531 1063516 1086767 1109109 1129754 1147766 1162966 1176142 1188195 1199276
50010 1199276 1208903 1216625 1222123 1224710 1223180 1216427 1203974 1185731 1161459 1130845 1094174 1052910
49998 1052910 1009669 967626 929449 896278 867617 842498 820778 803044 789320 778366 768486
49987 768486 758692 748851 739038 729252 719585 710188 700979 691671 682074 672081 661418 649825 637585
49974 637585 625535 614472 604781 596616 589912 584087 578258 572199 566763 562972 560838 559355 557448 554652
49960 554652 551186 547747 545120 543582 542783 542390 542601 543735 545713 548469 552579 558784 566970 576265 586111
49945 586111 596494 606998 616472 624078 630100 635213 639408 642211 643692 644614 645552 646200 645586 642734 637215
49930 637215 629293 619637 608848 597319 585452 573739 562584 552351 543638 537011 532280 528485 525015
49917 525015 522367 521339 521869 523282 525449 528828 533276 537587 540614 542425 543950 545810 547927 550131
49903 550131 552696 556166 560863 566683 573295 580473 588248 596830 606394 616818 627464 637154 644652 649372
49889 649372 651576 651777 650159 646801 642254 637389 632600 627473 621379 614068 605600 596025 585503 574583
49875 574583 564041 554412 545858 538414 532119 526895 522525 518858 515978 514101 513436 514165 516404 520002
49861 520002 524488 529403 534723 540776 547716 555302 563329 572025 581681 591998 602183 611729 620705 629161
49847 629161 636634 642592 647068 650435 652712 653563 652983 651525 649677 647260 643658 638450 631634 623418 614086
49832 614086 604131 594379 585842 579277 574759 571695 569340 567324 565652 564393 563580 563340 563870 565286 567680
49817 567680 571268 576204 582241 588962 596378 604856 614179 623094 630278 635631 640210 644928 649664 653595
49803 653595 656008 656696 655924 654254 652215 649923 647063 643303 638582 632914 626093 617845 608265 597940
49789 597940 587600 577727 568512 560072 552613 546383 541512 537886 535155 532877 530714 528560 526529 524807
49775 524807 523437 522225 520953 519762 519341 520530 523626 528128 533270 538754 544790 551514 558624 565728
49761 565728 572694 579393 585333 590005 593622 597078 600958 604823 607604 608477 607198 603940 599152 593391
49747 593391 586922 579483 570842 561602 553189 546844 542798 540465 539216 538760 538924 539331 539420 538881 538033 537735
49731 537735 538708 540936 543778 546636 549424 552411 555800 559474 563078 566447 570080 574996 581764 589769
49717 589769 597856 605778 614464 624639 635636 645937 654479 660946 665110 666590 665316 661716 656371
49704 656371 649897 643205 637322 632636 628665 624832 621281 618626 617097 616249 615480 614514 613292 611594 609060
49689 609060 605733 602528 600883 601732 604823 609127 613846 618952 624941 632284 641016 650665 660714 671428
49675 671428 683959 699167 716363 733670 749598 763768 776059 785703 791550 792883 789855 783632
49663 783632 776364 770434 767266 767064 769748 775346 783050 790649 795833 797767 796631 791923 782270 767065
49649 767065 747631 726578 706414 688703 673882 661546 651146 642454 635261 629070 623747 620253
49637 620253 619853 622450 626348 629764 631969 632874 632428 630796 628484 625789 622539 618698 614646 610492 605660
49622 605660 599661 592875 586139 580019 574928 571418 569682 569040 568526 567802 567068 566432 565962 566063 567114 568853
49606 568853 570715 572698 575207 578096 580571 582182 583293 584442 585778 587403 589658 592630 595748 598355
49592 598355 600485 602590 604563 605582 605208 604313 604402 605963 607895 608880 608980 609339 610478 611626 611932 611674
49576 611674 611801 612790 614457 616587 619140 622060 625373 629310 633873 638525 642856 647381 653110 660373 668621
49561 668621 677269 686054 694504 701759 707144 710524 711975 711574 709611 706521 702432 697268 691450 685994
49547 685994 681679 678519 676281 675043 674947 675817 677331 679344 681772 684481 687430 690612 693629 695843 697242
49532 697242 698824 701704 706178 712015 719347 728694 740277 753857 769193 786200 804480 823065 840815
49519 840815 856963 871186 883214 892456 898063 899555 897465 893333 888948 885640 884084 884416 886351 889446
49505 889446 893419 898010 902359 904815 903734 898457 889358 877092 862077 844738 826063 807697 791244
49492 791244 777329 765436 754893 745803 738684 733316 728608 723791 719203 715622 713313 712084 711849 712615
49478 712615 714142 716053 718089 719961 721265 721968 722733 724245 726398 728584 730571 732580 734644 736550 738401
49463 738401 740579 742995 744966 746100 746931 748404 751047 754832 759457 764381 768736 771606 772513 771656 769737
49448 769737 767501 765279 762899 760169 757341 754818 752568 750260 748051 746774 747065 748633 750684 752823
49434 752823 755188 757939 761024 764455 768485 773396 779308 786214 794154 803334 814128 826822 841228
49421 841228 856623 872236 887680 902609 916065 926595 933248 936119 935716 932139 925411 916551 907775
49408 907775 901312 898212 898487 902035 908984 919142 931557 944917 958374 971871 985709 999866 1013779
49395 1013779 1026810 1038861 1050381 1061758 1072808 1082948 1091699 1098875 1104394 1108068 1109580 1108602 1105083
49382 1105083 1099499 1092591 1084721 1075787 1065955 1056104 1047127 1039104 1031703 1025233 1020599 1018279 1017903 1018901
49368 1018901 1020949 1023706 1026755 1030075 1033995 1038410 1042533 1045676 1047788 1049002 1049225 1048495 1047176 1045358
49354 1045358 1042620 1038873 1034908 1031605 1028927 1026223 1023064 1019322 1014903 1009988 1005131 1000563 995845 990857
49340 990857 986506 983614 981520 978787 975034 971066 967400 963770 960132 957086 955118 954363 955272 958550 964133
49325 964133 971143 979276 989359 1002056 1016709 1031870 1046292 1058959 1068890 1075552 1078897 1078518 1073409
49312 1073409 1063204 1049234 1033721 1018275 1003504 989495 975991 962581 949429 937547 927831
49301 927831 920178 914143 909894 907693 906798 905951 904918 904677 905923 908168 910506 912599 914565 916427 917914
49286 917914 918490 917386 914011 908637 902427 896605 891656 887293 882877 877915 872551 867726 864557 863436
49272 863436 863935 865546 868073 871200 874179 876362 877873 879420 881477 883816 885792 886925 887264 887265 887378 887790
49256 887790 888669 890544 894241 900396 909217 920731 935002 951867 970488 989315 1006565 1020826 1031314
49243 1031314 1037550 1038827 1034264 1023642 1008157 990110 971763 954545 939142 925933 915160 906954
49231 906954 901341 898150 896887 896967 898211 900919 905292 910923 916949 922563 927278 931003 934207 937854 942763
49216 942763 948903 955588 962392 969624 977829 987152 997308 1007876 1018341 1028185 1037394 1046767 1057177
49203 1057177 1068516 1079824 1090633 1101677 1113998 1127744 1142159 1156370 1169677 1181456 1191452
49192 1191452 1200186 1208553 1216966 1225322 1233653 1242201 1250769 1258683 1265696 1272379 1279300 1286372 1293483 1301365
49178 1301365 1311234 1323683 1338397 1354893 1373214 1393941 1417882 1445756 1477932 1514310 1554327
49167 1554327 1596739 1639306 1679041 1713120 1739542 1757022 1764928 1763911 1756349 1745637 1734894 1726309
49155 1726309 1721087 1719312 1719988 1721871 1724460 1727974 1732548 1737927 1743897 1750500 1757794 1765832 1774870 1785104
49141 1785104 1796120 1807067 1817558 1828047 1839114 1850780 1862743 1875006 1887889 1901561 1915870
49130 1915870 1930642 1946051 1962588 1980543 1999430 2018062 2035450 2051622 2067453 2083810 2101085
49119 2101085 2119386 2138815 2159605 2182329 2207937 2237256 2270429 2307242 2348037 2394088 2447281
49108 2447281 2510071 2585679 2677171 2785193 2906627 3036293 3170581 3309309 3453289 3599312
49098 3599312 3737557 3855264 3944511 4006585 4047434 4067935 4059367 4009868 3916168 3789107 3647667
49087 3647667 3507205 3372117 3238138 3100731 2961583 2828332 2709329 2609085 2527723 2463149
49077 2463149 2412925 2374638 2345680 2323293 2305009 2289149 2275079 2262884 2252613 2243787 2235524 2227023
49065 2227023 2217949 2208606 2199805 2192285 2186142 2180959 2176445 2172619 2169352 2166225 2163086 2160363 2158464 2157165
49051 2157165 2155900 2154451 2153032 2151949 2151523 2152095 2153733 2156067 2158796 2162169 2166506 2171374 2175674 2178577
49037 2178577 2179867 2179374 2176655 2171704 2165706 2160681 2158238 2158719 2161411 2165430 2170276 2175622 2180833 2185089
49023 2185089 2188117 2190542 2193274 2196660 2200426 2204231 2208022 2211922 2216116 2220822 2226146 2232065 2238720 2246526
49009 2246526 2255520 2264733 2272815 2279468 2285828 2293123 2301378 2309709 2317460 2324518 2330734 2335709 2339299 2341851
48995 2341851 2343631 2344286 2343154 2340021 2335365 2329933 2324267 2318473 2312175 2304716 2295760 2285862 2276175 2267452
48981 2267452 2259498 2251767 2244264 2237554 2232060 2227763 2224516 2222252 2220780 2219747 2218962 2218490 2218235 2217657 2216160
48966 2216160 2213646 2210557 2207451 2204634 2202082 2199687 2197685 2196823 2197831 2200680 2204648 2209289 2215002 2222394
48952 2222394 2231427 2241614 2252948 2266169 2282022 2300483 2320893 2342733 2366155 2391676 2419389
48941 2419389 2448558 2478145 2507664 2537354 2567632 2598738 2630859 2664194 2698784 2734674 2772361
48930 2772361 2812528 2855103 2899077 2943734 2989638 3037885 3088650 3141010 3193959 3247045 3300130
48919 3300130 3353145 3406134 3459084 3511639 3563310 3613919 3663511 3711859 3758448 3802930 3845276
48908 3845276 3885575 3924002 3960871 3996276 4029830 4061216 4090850 4119483 4147240 4173631 4198428
48897 4198428 4221796 4243519 4262813 4279165 4292685 4303401 4310816 4314555 4314881 4312175 4306418 4297627 4286314
48884 4286314 4272992 4257541 4239553 4219011 4196171 4171064 4143638 4114199 4083135 4050253 4014807
48873 4014807 3976254 3934749 3890994 3845800 3799679 3752508 3703708 3652991 3600846 3548135 3495525
48862 3495525 3443643 3393557 3346591 3303584 3264526 3228825 3195713 3164655 3135721 3109523 3086538
48851 3086538 3066637 3049484 3035002 3023004 3012699 3003265 2994869 2988486 2984664 2983116 2983647 2986799 2993164
48838 2993164 3002491 3013892 3026586 3040171 3054467 3069569 3085893 3103748 3122884 3142633 3162383
48827 3162383 3181783 3200749 3219579 3238843 3258762 3278759 3298044 3316580 3335027 3353691 3372077
48816 3372077 3389743 3407155 3425215 3444192 3463630 3483246 3503278 3523738 3543798 3562420 3579483
48805 3579483 3595992 3613236 3632027 3652602 3674760 3697910 3721293 3744465 3767519 3790734 3814192
48794 3814192 3837845 3861729 3885729 3909171 3930946 3950219 3966870 3981116 3992844 4001607 4007312 4010684
48782 4010684 4012745 4013826 4013255 4009989 4003203 3992175 3976068 3954347 3927323 3895821 3860307 3820722
48770 3820722 3777229 3730662 3682058 3632070 3580990 3529036 3476450 3423588 3371082 3319596 3269267
48759 3269267 3219759 3171028 3123620 3078002 3034164 2992235 2952825 2916149 2881368 2847676 2815731
48748 2815731 2787005 2761833 2739150 2718319 2700112 2685379 2673632 2663716 2655273 2648712 2644082 2640817
48736 2640817 2638521 2637285 2637097 2637513 2638163 2639223 2641113 2643889 2647078 2650016 2652259 2653824 2655139 2656661 2658416
48721 2658416 2659918 2660573 2660205 2659159 2657816 2656010 2653102 2648823 2643916 2639627 2636536 2634207 2632102 2630429
$$ [...]
##END NTUPLES=NMR SPECTRUM
##END=
