##TITLE=AC1298_ECUAH12110_6666759_k2qTeoWIL1
##JCAMPDX= 6.0         $$ Bruker NMR JCAMP-DX V2.0
##DATA TYPE= NMR SPECTRUM
##DATA CLASS= NTUPLES
##ORIGIN= BRUKER
##OWNER= Administrator
$$ 1.72 TOPSPIN		Version 2.1
$$ 2013-07-18 15:38:59.046 -0700  Administrator@X
$$ Compression mode = diff/dup
##.OBSERVE FREQUENCY= 400.02188249412
##.OBSERVE NUCLEUS= ^1H
##.ACQUISITION MODE= SIMULTANEOUS (DQD)
##.ACQUISITION SCHEME= undefined
##.AVERAGES= 8
##.DIGITISER RES= 22
##SPECTROMETER/DATA SYSTEM= spect
##.PULSE SEQUENCE= zg30
##.SOLVENT NAME= COFFEE_meoh
##.SHIFT REFERENCE= INTERNAL, COFFEE_meoh, 1, 14.98509
##AUDIT TRAIL= $$ (NUMBER, WHEN, WHO, WHERE, PROCESS, VERSION, WHAT)
$$ ##TITLE= Audit trail, TOPSPIN		Version 2.1
$$ ##JCAMPDX= 5.01
$$ ##ORIGIN= Bruker BioSpin GmbH
$$ ##OWNER= Administrator
$$ $$ E:\/data/COFFEE/nmr/AC1298_ECUAH12110_6666759_k2qTeoWIL1/10/pdata/1/auditp.txt
$$ ##AUDIT TRAIL=  $$ (NUMBER, WHEN, WHO, WHERE, PROCESS, VERSION, WHAT)
(   1,<2013-07-18 15:38:52.577 -0700>,<Administrator>,<X>,<go>,<TOPSPIN 2.1>,
      <created by zg
	started at 2013-07-18 15:37:46.890 -0700,
	POWCHK enabled, PULCHK disabled,
       configuration hash MD5:
       C8 4E 4E 5D D3 5C D8 9E 9F 52 82 E0 59 8A DE 15
       data hash MD5: 64K
       2D CC C1 40 63 34 82 B8 F8 16 20 DB D9 60 A3 79>)
(   2,<2013-07-18 15:38:55.405 -0700>,<Administrator>,<X>,<proc1d>,<TOPSPIN 2.1>,
      <Start of raw data processing
       efp LB = 0 FT_mod = 6 PKNL = 1 PHC0 = 0 PHC1 = 0 SI = 32K 
       data hash MD5: 32K
       A3 49 86 36 F5 AE E5 39 64 E2 A5 F2 88 4A B4 10>)
(   3,<2013-07-18 15:38:55.686 -0700>,<Administrator>,<X>,<proc1d>,<TOPSPIN 2.1>,
      <pk PHC0 = 98.74512 PHC1 = 0 
       data hash MD5: 32K
       2D C7 85 EB B5 C1 7A E4 31 69 3B F3 7B 4B 55 DD>)
(   4,<2013-07-18 15:38:55.796 -0700>,<Administrator>,<X>,<proc1d>,<TOPSPIN 2.1>,
      <abs ABSG = 1 
       data hash MD5: 32K
       AD 14 7D E7 04 12 16 42 DD 34 DC 06 40 61 1B 80>)
(   5,<2013-07-18 15:38:55.843 -0700>,<Administrator>,<X>,<proc1d>,<TOPSPIN 2.1>,
      <abs ABSG = 2 
       data hash MD5: 32K
       EE 1F 81 62 03 46 32 5C A3 5F F0 33 B1 55 A2 12>)
(   6,<2013-07-18 15:38:55.905 -0700>,<Administrator>,<X>,<proc1d>,<TOPSPIN 2.1>,
      <abs ABSG = 3 
       data hash MD5: 32K
       D4 B5 6D 79 F1 92 57 2C 7B CE F5 52 11 96 6A DD>)
(   7,<2013-07-18 15:38:55.952 -0700>,<Administrator>,<X>,<proc1d>,<TOPSPIN 2.1>,
      <abs ABSG = 4 
       data hash MD5: 32K
       D9 B9 9B CF 76 A3 06 B4 1F F2 95 A0 E4 99 9D D0>)
(   8,<2013-07-18 15:38:55.999 -0700>,<Administrator>,<X>,<proc1d>,<TOPSPIN 2.1>,
      <abs ABSG = 5 
       data hash MD5: 32K
       76 91 A1 A6 AA 4C E5 30 10 33 F1 5A 67 DB 9B 10>)
$$ ##END=
$$ 
$$ $$ hash MD5
$$ $$ 88 70 E8 9E 75 C5 97 E3 B1 9B 40 B3 37 32 EC 50
##$RELAX= 
##$RELAX= 
##$RELAX= 
##$RELAX= 
##$RELAX= 
##$RELAX= 
##$RELAX= 
$$ Bruker specific parameters
$$ --------------------------
##$DU= <E:\>
##$EXPNO= 10
##$NAME= <AC1298_ECUAH12110_6666759_k2qTeoWIL1>
$$ [...]
##$TP= (0..7)
150 150 150 150 150 150 150 150
##$TP07= 0
##$TPNAME0= <>
##$TPNAME1= <>
##$TPNAME2= <>
##$TPNAME3= <>
##$TPNAME4= <>
##$TPNAME5= <>
##$TPNAME6= <>
##$TPNAME7= <>
##$TPOAL= (0..7)
0.5 0.5 0.5 0.5 0.5 0.5 0.5 0.5
##$TPOFFS= (0..7)
0 0 0 0 0 0 0 0
##$TUNHIN= 0
##$TUNHOUT= 0
##$TUNXOUT= 0
##$USERA1= <user>
##$USERA2= <user>
##$USERA3= <user>
##$USERA4= <user>
##$USERA5= <user>
##$V9= 5
##$VALIST= <valist>
##$VCLIST= <CCCCCCCCCCCCCCC>
##$VD= 0
##$VDLIST= <DDDDDDDDDDDDDDD>
##$VPLIST= <PPPPPPPPPPPPPPP>
##$VTLIST= <TTTTTTTTTTTTTTT>
##$WBST= 1024
##$WBSW= 4
##$XGAIN= (0..3)
0 0 0 0
##$XL= 0
##$YL= 0
##$YMAX_a= 600188
##$YMIN_a= -512159
##$ZGOPTNS= <>
##$ZL1= 120
##$ZL2= 120
##$ZL3= 120
##$ZL4= 120
##$ABSF1= 14.98509
##$ABSF2= -5.573092
##$ABSG= 5
##$ABSL= 3
##$ALPHA= 0
##$AQORDER= 0
##$ASSFAC= 0
##$ASSFACI= 0
##$ASSFACX= 0
##$ASSWID= 0
##$AUNMP= <proc_prof1d_extract_pilot.lims>
##$AXLEFT= 0
##$AXNAME= <>
##$AXNUC= <1H>
##$AXRIGHT= 0
##$AXTYPE= 0
##$AXUNIT= <>
##$AZFE= 0.1
##$AZFW= 0.1
##$BCFW= 0
##$BC_mod= 0
##$BYTORDP= 0
##$COROFFS= 0
##$CY= 15
##$DATMOD= 1
##$DC= 0
##$DFILT= <>
##$DTYPP= 0
##$F1P= 0
##$F2P= 0
##$FCOR= 0.5
##$FTSIZE= 32768
##$FT_mod= 6
##$GAMMA= 0
##$GB= 0
##$INTBC= 1
##$INTSCL= 1
##$ISEN= 128
##$LB= 0
##$LEV0= 0
##$LPBIN= 0
##$MAXI= 10000
##$MC2= 0
##$MEAN= 0
##$ME_mod= 0
##$MI= 0
##$NCOEF= 0
##$NC_proc= -8
##$NLEV= 6
##$NOISF1= 0
##$NOISF2= 0
##$NSP= 0
##$NTH_PI= 0
##$NZP= 0
##$OFFSET= 14.98509
##$PC= 1
##$PHC0= 98.74512
##$PHC1= 0
##$PH_mod= 1
##$PKNL= yes
##$PPARMOD= 0
##$PPDIAG= 0
##$PPIPTYP= 0
##$PPMPNUM= 2147483647
##$PPRESOL= 1
##$PSCAL= 4
##$PSIGN= 0
##$PYNMP= <proc.py>
##$REVERSE= no
##$SF= 400.02
##$SI= 32768
##$SIGF1= 0
##$SIGF2= 0
##$SINO= 400
##$SIOLD= 32768
##$SPECTYP= <>
##$SREGLST= <1H.CDCl3>
##$SSB= 0
##$STSI= 32768
##$STSR= 0
##$SW_p= 8223.68421052631
##$SYMM= 0
##$S_DEV= 0
##$TDeff= 65536
##$TDoff= 0
##$TI= <>
##$TILT= no
##$TM1= 0
##$TM2= 0
##$TOPLEV= 0
##$USERP1= <user>
##$USERP2= <user>
##$USERP3= <user>
##$USERP4= <user>
##$USERP5= <user>
##$WDW= 1
##$XDIM= 32768
##$YMAX_p= 445115107
##$YMIN_p= -850228
##$CURPLOT= <Network HP LaserJet P1505>
##$CURPRIN= <$Network HP LaserJet P1505>
##$DFORMAT= <normdp>
##$LAYOUT= <+/1D_H.xwp>
##$LFORMAT= <normlp>
##$PFORMAT= <normpl>
##$SURQMSG= 1
$$ End of Bruker specific parameters
$$ ---------------------------------
##NTUPLES= NMR SPECTRUM
##VAR_NAME=  FREQUENCY,     SPECTRUM/REAL,   SPECTRUM/IMAG
##SYMBOL=    X,             R,               I
##VAR_TYPE=  INDEPENDENT,   DEPENDENT,       DEPENDENT
##VAR_FORM=  AFFN,          ASDF,            ASDF
##VAR_DIM=   32768,         32768,           32768
##UNITS=     HZ,            ARBITRARY UNITS, ARBITRARY UNITS
##FACTOR=    0.250966925370066, 1,           1
##FIRST=     8223.43324360094, -96657,       246191
##LAST=      0,             -36575,          -93129
##MIN=       0,             -850228,         0
##MAX=       8223.43324360094, 445115107,    0
$$ Real data points
##PAGE= N=1
##DATA TABLE= (X++(R..R)), XYDATA
$$ [...]
19580a83203h1972a8483A13250d9101a4279j66583e9367A42905a30101M0625A42350
$$ -183203 -81972 -18483 113250 -49101 -14279 -180862 -59367 142905 -130101 -89476 142350
19568d213I2281e161o0940E0601N322A9625b95488A43707A127K40651e0706o5509
$$ -4213 92281 -5161 -66101 50601 55923 19625 -295488 143707 1127 241778 -50706 -116215
19556a16215j98236B09209C2812L18325a72981F4060c2763l46840C98711A37781
$$ -116215 -314451 209209 32812 351137 -172981 64060 -32763 -379603 398711 137781
19545d7526q1064q5336F7094h2668A42985A3572d34732a94971Q3772j11910A83000
$$ -47526 -128590 -213926 67094 -82668 142985 13572 -434732 -194971 -111199 -223109 183000
19533a25480J5196i998l35179A04467J33564a78065Q7373I7884a03364n2099L1129
$$ -125480 -110284 -9998 -345177 104467 238031 -178065 -90692 97884 -103364 -155463 -124334
19522a24334p6682D7058b50608J08058J579A74063c42710D3000c7240A04148a91536
$$ -124334 -201016 47058 -250608 -142550 -140971 174063 -342710 43000 -37240 104148 -191536
19510A48881d6426j62655B61990b2010A97006a60914l06619a21231a141B952R9420
$$ 148881 -46426 -209081 261990 -22010 197006 -160914 -467533 -121231 -1141 2952 102372
19499A02372R6293c08571A9217c71285d7745j59228Q2608J4822D14774A1940J16827
$$ 102372 198665 -308571 19217 -371285 -47745 -206973 -124365 -109543 414774 11940 128767
19488A28767a85050J9182f0974A63997c10120a27074n6451k212n806E00a3678
$$ 128767 -185050 -165868 -60974 163997 -310120 -127074 -183525 -185737 -191543 500 -13678
19476A7733f8657b595j06989A0740a34123j35509P9708E8952c00493a07368C47137
$$ 17733 -68657 -2595 -109584 10740 -134123 -269632 -189924 58952 -300493 -107368 347137
19464A081K71415j14643a5287k82274C25572D5151h1443j18190O7338A10070d6124
$$ 1081 272496 157853 -15287 -297561 325572 45151 -81443 -199633 -132295 110070 -46124
19452a04363k73579c7998k4925F5923c5768C88954a56620E3077i3929a454l0935
$$ -104363 -377942 -37998 -62923 65923 -35768 388954 -156620 53077 -93929 -1454 -32389
19441c2389A46179a62954L7934p6145A9238f0200k36818J6707M519A8320M1172
$$ -32389 146179 -162954 -125020 -201165 19238 -60200 -297018 -280311 -275792 18320 59492
19430E9492c605q8896q7061G1185d30374a76499g5951J0869k26143a9256r9532
$$ 59492 -3605 -92501 -179562 71185 -430374 -176499 -75951 -65082 -291225 -19256 -118788
19419a18788A98026F1259e0915F2360O249c0430j306k9406A33196K8950p8666
$$ -118788 198026 61259 -50915 62360 68609 -30430 -31736 -61142 133196 162146 83480
19408H3480a53657c469C25847A7779a3844A80124b61393A61535a16494j17416
$$ 83480 -153657 -3469 325847 17779 -13844 180124 -261393 161535 -116494 -233910
19398b33910A12588C2692P1516P8704c5266F7589j4746b25007k298A32486C3362
$$ -233910 112588 32692 104208 182912 -35266 67589 52843 -225007 -227305 132486 33362
19386a38380G1992b08897A1498a49337A05614j3353b04711f1550A6676R8025a42581
$$ -138380 71992 -208897 11498 -149337 105614 92261 -204711 -61550 16676 114701 -142581
19374A09063d44140K05546A94889f6035B26225j07574a30731n895A25773c340
$$ 109063 -444140 -238594 194889 -66035 226225 118651 -130731 -136626 125773 -3340
19363a54673e178j02582j03947J4789B04727a23364g480q6225B6357c59268d7803
$$ -154673 -5178 -107760 -211707 -196918 204727 -123364 -7480 -93705 26357 -359268 -47803
19351e6403k27047q0585a35779G3147J60629c5970g220G2152J41306b76740J29720
$$ -56403 -283450 -364035 -135779 73147 233776 -35970 -7220 72152 213458 -276740 -147020
19340a47020A09694C6269b7709j61219b6547k2073h307j49739A59441a38715c4264
$$ -147020 109694 36269 -27709 -188928 -26547 -48620 -8307 -158046 159441 -138715 -34264
19328i6897C4764j1892M809K56142c28748a55280c4159j75274c6677j52796g1205
$$ -96897 34764 22872 27681 283823 -328748 -155280 -34159 -209433 -36677 -189473 -71205
19316a9466C47937d5382A49332a40393O1579B51907d47031a02882a936B71807
$$ -19466 347937 -45382 149332 -140393 -78814 251907 -447031 -102882 -1936 271807
19305g5684c7784k18124a9493C9073R2764c04265I2010J49720b44452r1183C36621
$$ -75684 -37784 -255908 -19493 39073 131837 -304265 92010 241730 -244452 -335635 336621
19293A26362b01840c6509l4702n5383j8415j01380A2459e9332A48235a15381A55213
$$ 126362 -201840 -36509 -71211 -126594 -145009 -246389 12459 -59332 148235 -115381 155213
19281i8157C3717R406a85140J1855g5112n1349H5257a75417h6470o1527M7270
$$ -98157 33717 43123 -185140 -173285 -75112 -126461 85257 -175417 -86470 -147997 -100727
19270a00727J6746A7391J31245g8094l84558A08887a74584f7511o0937G7655g7508
$$ -100727 -83981 17391 148636 -78094 -462652 108887 -174584 -67511 -128448 77655 -77508
19258a82828K5527A16029J29853h8208A30849a8809j52951b2276k09438n7162
$$ -182828 -157301 116029 245882 -88208 130849 -18809 -171760 -22276 -231714 -288876
19248b88876B67447b90336d4410C9207c0700j57828A68315a20328J4775M2633
$$ -288876 267447 -290336 -44410 39207 -30700 -188528 168315 -120328 -105553 -62920
19238f2920A22024a54553j89207A64441f5271B23288c47m5025j68450k6355d4646
$$ -62920 122024 -154553 -343760 164441 -65271 223288 -347 -45372 -213822 -240177 -44646
19226h3207j45622R3139l9111a5551I5475a00430D605b43151A05011b00764f9728
$$ -83207 -228829 -135690 -174801 -15551 95475 -100430 4605 -243151 105011 -200764 -69728
19214e5336J3720l2530A64203c52944J55226E8612L9969h1215q517L5513j39913
$$ -55336 -41616 -74146 164203 -352944 -197718 58612 98581 -81215 -89732 -54219 -194132
19203a94132A4851a59420k95943a33588b7351m7481a5010l12193m3644g6127j42197
$$ -194132 14851 -159420 -455363 -133588 -27351 -74832 -15010 -327203 -370847 -76127 -218324
19192b18324D1961a86267c974k9819A4949d21217G2332L3754B2613i2385j96940
$$ -218324 41961 -186267 -3974 -33793 14949 -421217 72332 106086 22613 -92385 -289325
19181b89325b7992A81846i4536I6347B1709a59689B51017E6153b60043G65b45229
$$ -289325 -27992 181846 -94536 96347 21709 -159689 251017 56153 -260043 765 -245229
19169b55082l9119B28444c83701A6508K96968E5338a38075m8127B06328a71765
$$ -255082 -294201 228444 -383701 16508 313476 55338 -138075 -186202 206328 -171765
19158b42178J17284A26178a57626a6893p5184j13011M9337A50205o9381b1190
$$ -242178 -124894 126178 -157626 -16893 -92077 -205088 -155751 150205 80824 -21190
19147A79526C2194J5608a05245e056k33423j82493A73223b34645A54654a14328
$$ 179526 32194 47802 -105245 -5056 -238479 -420972 173223 -234645 154654 -114328
19136b19482D6592M6168K51477G854K00733c2026n58C65912h8553J1767B01073
$$ -219482 46592 92760 344237 7854 208587 -32026 -32584 365912 -88553 -76786 201073
19124c12490J02719K3289f5413j8979c7250j99354A49918b81033H2015P3330a16630
$$ -312490 -209771 -186482 -65413 -84392 -37250 -236604 149918 -281033 82015 155345 -116630
19112b53277g148j90648b5850n4263K1423j95137A18220a1227l0053A70844O4390
$$ -253277 -7148 -197796 -25850 -80113 -58690 -253827 118220 -11227 -41280 170844 235234
19101B35234H9142b25010N8046C40041A21948g9774c7644A6646K46155a40446
$$ 235234 89142 -225010 -166964 340041 121948 -79774 -37644 16646 262801 -140446
19090F7888a6400B7698N7535b7909k11527i2415k24610c0401A06236C4727K4434
$$ 67888 -16400 27698 85233 -27909 -239436 -92415 -317025 -30401 106236 34727 59161
19079E9161b72717a25730k24608h0916B82254E4018J0219b0138A04715C2438K02369
$$ 59161 -272717 -125730 -350338 -80916 282254 54018 64237 -20138 104715 32438 234807
19068B34807K3173C4415J57585a2746m2780p3589j22571B8272K22611o3327b32647
$$ 234807 257980 34415 192000 -12746 -55526 -129115 -251686 28272 250883 187556 -232647
19056d1847K0511k02038P2121j35757B45984b01830H6029L5483b8952l0085j63518
$$ -41847 -21336 -223374 -151253 -287010 245984 -201830 86029 121512 -28952 -59037 -222555
19045b22555J4872Q9206B08863F1920H607i3644q9818j48209O3204J2369b4478
$$ -222555 -207683 -118477 208863 61920 8607 -93644 -183462 -331671 -268467 -256098 -24478
19033E3265L12108e7181E7858M2132p432A5508c72542H6880f6548H8097K27234
$$ 53265 365373 -57181 57858 99990 92558 15508 -372542 86880 -66548 88097 315331
19022C15331B1436J07131l7527c1408C34449a28685F4605J16426a0313E3558g2174
$$ 315331 21436 128567 91040 -31408 334449 -128685 64605 181031 -10313 53558 -72174
19010a41560M3454B38494B5852K7541a16642e6390j84929I9377L00401A81169
$$ -141560 -98106 238494 25852 53393 -116642 -56390 -241319 99377 399778 181169
18999E1886K5933L0911K9016i7322k08193J45787p4303i2884j20607e1444A44428
$$ 51886 77819 108730 137746 -97322 -305515 -159728 -234031 -92884 -213491 -51444 144428
18987a41505j63845J14773p4811D2458a00819A57725b34487k4238D4425J00645
$$ -141505 -305350 -190577 -265388 42458 -100819 157725 -234487 -258725 44425 145070
18977A45070a3538j05628j894A02724k5248L7017a03277A11854B8783d9270B8442
$$ 145070 -13538 -119166 -121060 102724 77476 114493 -103277 111854 28783 -49270 28442
18965c05472f6376J2903A6975a61142K0392J6621A25643b22845Q7799A25497e8572
$$ -305472 -66376 -53473 16975 -161142 -140750 -124129 125643 -222845 -135046 125497 -58572
18953a08584A00346l4807N4592g3901a3519l7895B20691C9923c64491c2696H2280
$$ -108584 100346 65539 120131 -73901 -13519 -51414 220691 39923 -364491 -32696 82280
18941B17195D1000L0327a03974p163j33101D59434d34288b4885I7669h9530B13869
$$ 217195 41000 71327 -103974 -111137 -244238 459434 -434288 -24885 97669 -89530 213869
18929g9100J4373B31504d7305B30061r4795e8799a1122B59911r9383A1406J12102
$$ -79100 -64727 231504 -47305 230061 135266 -58799 -11122 259911 160528 11406 123508
18918A23508c0260j4233m3693c8391A60181a35766l1299I9056e030k41773m0409
$$ 123508 -30260 -44493 -88186 -38391 160181 -135766 -167065 99056 -5030 -246803 -287212
18907b87212f9088j5291q3368B6193c7021n9279p5124O0432p9234A54236b3515
$$ -287212 -69088 -84379 -167747 26193 -37021 -96300 -171424 -110992 -190226 154236 -23515
18895a69937B4343a30669p9200Q2196C32837c7069A1326J30524b33171d7467F8108
$$ -169937 24343 -130669 -209869 -127673 332837 -37069 11326 141850 -233171 -47467 68108
18883a11849M1257k7438m2071q073A2394a15820K6059k86303J51423c1314A0895
$$ -111849 -70592 -98030 -140101 -148174 12394 -115820 -89761 -376064 -224641 -31314 10895
18871c73035C5828b77155J03778f5033o0094m5206c7506k30364e9456n9269k21615
$$ -373035 35828 -277155 -173377 -65033 -125127 -170333 -37506 -267870 -59456 -118725 -340340
18860c40340i0295H35J26770f4494B1715O0N9145b04015d7135B12851A00954K02223
$$ -340340 -90295 835 127605 -64494 21715 21775 80920 -204015 -47135 212851 100954 303177
18848C03177a23518N0270a3324q0248K6123j17919h6309D09917b88317m352a13622
$$ 303177 -123518 -73248 -13324 -93572 -67449 -185368 -86309 409917 -288317 -292669 -113622
18836a1665D2351f7034A39330a13126c8358k6946A51062i9070J8249q1124A00576
$$ -11665 42351 -67034 139330 -113126 -38358 -65304 151062 -99070 -80821 -161945 100576
18824H3592A975J29634l1941J02180a23648p5907A7652J54088M1275J38757A26345
$$ 83592 1975 131609 99668 201848 -123648 -199555 17652 171740 213015 351772 126345
18812A80270k8595J64356k2387J3386j39083a75404B49284i904n19575b23508
$$ 180270 151675 316031 293644 307030 167947 -175404 249284 -9904 -529479 -223508
18801A63067J22107a80839c5305j89948H45a08535H026O3978K17086o9472e4769
$$ 163067 285174 -180839 -35305 -225253 845 -108535 8026 72004 289090 219618 -54769
18789b39806h7442q1746f5903A7169b38894Q5696B15514q275a61708c3775D0969
$$ -239806 -87442 -169188 -65903 17169 -238894 -153198 215514 207239 -161708 -33775 40969
18777B8872K53364E6929J15002a00213r1575k6689i4152m2149A57515b5902A7144
$$ 28872 282236 56929 171931 -100213 -191788 -218477 -94152 -136301 157515 -25902 17144
18765a51437B15468c58460J76393a6170A67761J98776i4875K403j06977g8217
$$ -151437 215468 -358460 -182067 -16170 167761 366537 -94875 -92472 -199449 -78217
18754D9138c33887c5544m6212I8476c68574B6069Q5291a11061o3134B53401b44816
$$ 49138 -333887 -35544 -81756 98476 -368574 26069 111360 -111061 -174195 253401 -244816
18742b20554c1352a3361j58546f3282q3747K596N440n0638Q9517j117b6092F8076
$$ -220554 -31352 -13361 -171907 -63282 -147029 -144433 -138993 -189631 -100114 -101231 -26092 68076
18729g81B99200a4543m3687E474K40540a25897A77946a03261B20431a24281B12250
$$ -781 299200 -14543 -58230 5474 246014 -125897 177946 -103261 220431 -124281 212250
18717a24492K7127k97192E8324a20085A54318E608b25993g6911j19753A42636
$$ -124492 -97365 -394557 58324 -120085 154318 5608 -225993 -76911 -196664 142636
18706c7244j03492d8569J3658A06536m5626a60538d1582p4465I365b13085J06488
$$ -37244 -140736 -48569 -34911 106536 60910 -160538 -41582 -116047 9365 -213085 -106597
18695a06597A233c89069c1083A76853d29751A83847b3531g911p1284c5232H9342
$$ -106597 1233 -389069 -31083 176853 -429751 183847 -23531 -7911 -79195 -35232 89342
18683B00738r1457D9808a3288q8961r1411O586P1369m4952N9111F2393J83477
$$ 200738 109281 49808 -13288 -102249 -193660 -187074 -115705 -160657 -101546 62393 245870
18672B45870d8554l6757a518B44220O185e1741j09515D4667a77395P9620b6701
$$ 245870 -48554 -85311 -1518 244220 250405 -51741 -161256 44667 -177395 -97775 -26701
18660A86857Q2152b7534j98674D4959j7359f9744b5191I6092b51302d7296A97889
$$ 186857 269009 -27534 -226208 44959 27600 -69744 -25191 96092 -251302 -47296 197889
18648a44535B16521I6435a2937j45346B52346i4931c9933m5744C08097n4224b74255
$$ -144535 216521 96435 -12937 -158283 252346 -94931 -39933 -85677 308097 253873 -274255
18636a45398m1800c1620A82898a62934b519j39735C0675c7635A69967G1526g3649
$$ -145398 -187198 -31620 182898 -162934 -2519 -142254 30675 -37635 169967 71526 -73649
18624i2462B55414H28a06295A00672J17218A3770J60075k6623b61865g1873k11459
$$ -92462 255414 828 -106295 100672 217890 13770 173845 147222 -261865 -71873 -283332
18613b83332B00977g86B15908d5975m6419j5790A17548a76441M8761l6641A64047
$$ -283332 200977 -786 215908 -45975 -92394 -108184 117548 -176441 -127680 -164321 164047
18601a08685l85136G0398b94024j15247F1209k06J28536F7646c37700e7610A18672
$$ -108685 -493821 70398 -294024 -409271 61209 61003 189539 67646 -337700 -57610 118672
18589a64703a1285E6095a16743A41931I75b05186g2847c6263j46658j43797f0782
$$ -164703 -11285 56095 -116743 141931 975 -205186 -72847 -36263 -182921 -326718 -60782
18577i9399j7128C78835H1875J03891q7371f8131A5083J91788C2453J10868e6635
$$ -99399 -116527 378835 81875 185766 98395 -68131 15083 206871 32453 143321 -56635
18565a11374o4877Q6144b7389B2501J56562d6082k85610A37312a5498D3205c57505
$$ -111374 -176251 -90107 -27389 22501 179063 -46082 -331692 137312 -15498 43205 -357505
18553a68310c9744n7562B74856h9184A56436h7014k14082A51477p1092B4481i7373
$$ -168310 -39744 -97306 274856 -89184 156436 -87014 -301096 151477 80385 24481 -97373
18541A10514a1844C03796o5976A01033A0887J30301M005n0044c43437a53269C23721
$$ 110514 -11844 303796 237820 101033 10887 141188 145193 95149 -343437 -153269 323721
18529A38574d14111a84594A27921b19547i0905j98036E9836k5084e21380a52896
$$ 138574 -414111 -184594 127921 -219547 -90905 -288941 59836 34752 -521380 -152896
18518e3100j1644H0808L62026a55594D7728J80431a5566A74996a3570k09476B20061
$$ -53100 -64744 80808 442834 -155594 47728 228159 -15566 174996 -13570 -223046 220061
18506b29161J07965j04991g5762a7997m1569I8765j0778c59298a3737I383b95049
$$ -229161 -121196 -226187 -75762 -17997 -59566 98765 87987 -359298 -13737 9383 -295049
18494C7101J63339a86801d0479k40772g9460F7659a60277P7708q9214g6099j77768
$$ 37101 200440 -186801 -40479 -281251 -79460 67659 -160277 -82569 -171783 -76099 -253867
18483b53867h0043j87804c7674I1564g0610j73464D20568j67983g4068J5896B847
$$ -253867 -80043 -267847 -37674 91564 -70610 -244074 420568 252585 -74068 -58172 2847
18471A09816a20469E6453b10527k16343E1251a04079A56456b6307A53020c49708
$$ 109816 -120469 56453 -210527 -426870 51251 -104079 156456 -26307 153020 -349708
18460b61306B1704R712a44003j3124g5520B83952b2237C64056a36583M48M1627
$$ -261306 21704 31416 -144003 -157127 -75520 283952 -22237 364056 -136583 -136135 -94508
18449i4508J732r2564A86366G7851a93218O6180e5263C1114l118f2326r8417A38491
$$ -94508 -92776 -185340 186366 77851 -193218 -127038 -55263 31114 27996 -62326 -160743 138491
18436b33563h1054p2535B82435A5293N8211C2017c31533a24473A17634a99937
$$ -233563 -81054 -153589 282435 15293 73504 32017 -331533 -124473 117634 -199937
18425a10559K7618J2976A99591c06618D7125b88118g3523C22140o1463b78401
$$ -110559 -82941 -69965 199591 -306618 47125 -288118 -73523 322140 260677 -278401
18414a623j85259B843R4004a2138o680l9386C72547a29566G55L816J82391R5459
$$ -1623 -186882 2843 96847 -12138 -18818 -58204 372547 -129566 755 4571 186962 282421
18402B82421m0543c36664E3742e03452f5069A66160G0597c40402b4263m629j61951
$$ 282421 241878 -336664 53742 -503452 -65069 166160 70597 -340402 -24263 -28892 -190843
18391a90843D245c10301A63491J34970a58238O0948A34753a35531A67522E8053
$$ -190843 4245 -310301 163491 298461 -158238 -97290 134753 -135531 167522 58053
18380e9204j31670n5304Q2597N0717D5981b43159c1251k87425g0274I5396H286
$$ -59204 -190874 -246178 -163581 -112864 45981 -243159 -31251 -318676 -70274 95396 8286
18368a15355N4366p7959l0961o5119E7940a04992B3346d1256K9k33367e2119A9905
$$ -115355 -60989 -138948 -169909 -235028 57940 -104992 23346 -41256 -41227 -274594 -52119 19905
18355a35924m2546A55692a41723a0662k7638j46828j41210e2233R512D5842f0440
$$ -135924 -178470 155692 -141723 -10662 -38300 -185128 -326338 -52233 -42721 45842 -60440
18343a87268g1700A02638f6611l37753C83208b16129g4970B2237e4066l13524
$$ -187268 -71700 102638 -66611 -404364 383208 -216129 -74970 22237 -54066 -367590
18333c67590C1587a08012A32979d4917m9233j54376Q8714A30588B3096a4979k36336
$$ -367590 31587 -108012 132979 -44917 -94150 -248526 -159812 130588 23096 -14979 -251315
18322b51315e270k61535A36460j3619c89643A49246a79845B37572f5409k5935
$$ -251315 -5270 -266805 136460 122841 -389643 149246 -179845 237572 -65409 -91344
18312i1344B12155h4736j78388F3796a91728g6510j68320A49388a36952a4947
$$ -91344 212155 -84736 -263124 63796 -191728 -76510 -244830 149388 -136952 -14947
18301a61014A36253J33934h2056j48248i3569K0810D106J44275d2127k73788e1458
$$ -161014 136253 270187 -82056 -230304 -93569 -72759 4106 148381 -42127 -315915 -51458
18289a701l46113B74762b48546a14140j19285A80428i5958d0885n1294k0676k1669
$$ -1701 -347814 274762 -248546 -114140 -233425 180428 -95958 -40885 -92179 -112855 -134524
18278a34524B75270d5278a8057Q817k37287a11134B70204e382j14734j72685N3010
$$ -134524 275270 -45278 -18057 -9240 -246527 -111134 270204 -5382 -120116 -292801 -239791
18267b39791C2339a46326A7374P0391j8462b32073E1875a30450F0873O4651l8603
$$ -239791 32339 -146326 17374 87765 69303 -232073 51875 -130450 60873 125524 86921
18256H6921n677a6042k43045h8164D1142c84433d0605l88876A02145A5907P4739
$$ 86921 81244 -16042 -259087 -88164 41142 -384433 -40605 -429481 102145 15907 90646
18245I0646K1765R482f6716a8504A85451d1450l6642G8677a34100b3517n05612
$$ 90646 112411 121893 -66716 -18504 185451 -41450 -78092 78677 -134100 -23517 -529129
18234e29129h2020C97053A40611A5440a23110m7967c6431B26326d44j76218b4464
$$ -529129 -82020 397053 140611 15440 -123110 -171077 -36431 226326 -444 -176662 -24464
18222C5634a8084C8706L1933A3657a78881r020d7034K1360k61942C5447d1193
$$ 35634 -18084 38706 70639 13657 -178881 -187901 -47034 -25674 -287616 35447 -41193
18210B38477a53730e0744A3908b00916b5798k9401C2646J87308P6150d2263J8719
$$ 238477 -153730 -50744 13908 -200916 -25798 -55199 32646 219954 296104 -42263 -23544
18199b3544j04404k597O0933G3457b0913o3992k17942a48784F6417e716j72202
$$ -23544 -127948 -130545 -69612 73457 -20913 -84905 -302847 -148784 66417 -5716 -177918
18188a77918k8447C6346b06557A60633k8068e0249k3109p376K0841A41588g6112
$$ -177918 -206365 36346 -206557 160633 132565 -50249 -73358 -80734 -59893 141588 -76112
18176d34826c3886k31492d0650D5706f9071g757j32950B85113a03307L2826b0649
$$ -434826 -33886 -265378 -40650 45706 -69071 -7757 -140707 285113 -103307 -70481 -20649
18164h2322l8998M4126n4454H9612J21580G8868c46727b9243k25075I5387a39800
$$ -82322 -121320 -77194 -131648 89612 211192 78868 -346727 -29243 -254318 95387 -139800
18152A4733a64015c7740j51297Q4333l21297K02722A06630C6078c89080a59713
$$ 14733 -164015 -37740 -189037 -104704 -426001 -223279 106630 36078 -389080 -159713
18141A55275b62924A75892a8987q5017A19041b21889A26480c65863e8303B06661
$$ 155275 -262924 175892 -18987 -104004 119041 -221889 126480 -365863 -58303 206661
18130a18043D2450Q7386l5950o719c3941k77886a45658A88559b60695b7972j66493
$$ -118043 42450 129836 93886 87167 -33941 -311827 -145658 188559 -260695 -27972 -194465
18119a94465h197F707R079f7469b7832m5572j3965a5116j74379C5584L24743h0215
$$ -194465 -8197 6707 15786 -67469 -27832 -73404 -87369 -15116 -189495 35584 360327 -80215
18106a13076A93817h7333G5195b88498d2346m7529A07231e080j35167d1701C1517
$$ -113076 193817 -87333 75195 -288498 -42346 -89875 107231 -5080 -140247 -41701 31517
18094a18467e559j1611D5637c43907M604C89240a54549m2850M4158E5865c7300
$$ -118467 -5559 -17170 45637 -343907 -339303 389240 -154549 -197399 -153241 55865 -37300
18082b16623j6574Q3934K3366J7883r8725M9709m0152C27995i784k14763F0137
$$ -216623 -233197 -149263 -125897 -108014 -206739 -157030 -197182 327995 -9784 -224547 60137
18070i2709k47660A54172a74813F3525B4166a45780A7160a70342f1241k45240
$$ -92709 -340369 154172 -174813 63525 24166 -145780 17160 -170342 -61241 -306481
18060c06481A00156h3958k96275c5307k34325F7558i4325C24636a90932B67J12551
$$ -306481 100156 -83958 -380233 -35307 -269632 67558 -94325 324636 -190932 267 112818
18049A12818B7549O549J45131N0836a14192B02734d8225n3225I6989b94576D2758
$$ 112818 27549 34098 179229 230065 -114192 202734 -48225 -101450 96989 -294576 42758
18037a00101k00141g7467D7202a97676H8131m2778i736k76778A87645m8857a74111
$$ -100101 -300242 -77467 47202 -197676 88131 45353 -9736 -286514 187645 138788 -174111
18025a08216n7304g6173k1411K5695C1798J310a29238n5728k47373b6899p8649
$$ -108216 -165520 -76173 -97584 -71889 31798 33108 -129238 -184966 -432339 -26899 -105548
18014a05548B20026e8326h57j71333B08489a9661D58b9885A11748d29908Q0858
$$ -105548 220026 -58326 -857 -172190 208489 -19661 458 -29885 111748 -429908 -349050
18003c49050H2374a6161k21368J15810m3598A53087K660C2262c07157a17101k47586
$$ -349050 82374 -16161 -237529 -121719 -165317 153087 155747 32262 -307157 -117101 -364687
17992c64687N1324F1961L7339g7966E9722a03786C32082a59171q094l6091o3962
$$ -364687 -313363 61961 99300 -77966 59722 -103786 332082 -159171 -167265 -203356 -267318
17981b67318a0504I9436e6090B98950d6755B72944j3578k7605b11973M8908A27098
$$ -267318 -10504 99436 -56090 298950 -46755 272944 259366 231761 -211973 -163065 127098
17969b04195A5608J02408a19384i891j28195l56p032F5269B5037a69429A34769
$$ -204195 15608 118016 -119384 -9891 -138086 -138442 -145474 65269 25037 -169429 134769
17957c3889r7069L1724B315K12064B5865b60541A6515a82653f8002j43445D7285
$$ -33889 -130958 -99234 2315 214379 25865 -260541 16515 -182653 -68002 -211447 47285
17945B64410H164J37015o3755J49024a28841A20846K22269n8551e6413l15130
$$ 264410 8164 145179 81424 230448 -128841 120846 343115 284564 -56413 -371543
17935c71543h3315j7153r7997N8019a33A1526K9371F099J5275f3107J5935l7978
$$ -371543 -83315 -100468 -198465 -140446 -133 11526 40897 6099 21374 -63107 -47172 -85150
17923h5150G626J46566k4705a25210A36526P7040d9369A93114b6522A29440a60103
$$ -85150 7626 154192 129487 -125210 136526 213566 -49369 193114 -26522 129440 -160103
17911A03105c08421L2786A15281d2077k57235H5880J31083C3969c07096B28644
$$ 103105 -308421 -275635 115281 -42077 -299312 85880 216963 33969 -307096 228644
17900B3834i669k25314C0753a07500j91172E3685K7905a16824k23848J65891r4512
$$ 23834 -9669 -234983 30753 -107500 -298672 53685 81590 -116824 -340672 -174781 -269293
17889b69293p1814J50928A703c9970j2641H0446J91249a20355I7796d560j38397
$$ -269293 -341107 -190179 1703 -39970 -52611 80446 271695 -120355 97796 -4560 -142957
17878a42957C66800a63133A40596b5028A4768o918J53399d491k82134N7366f8046
$$ -142957 366800 -163133 140596 -25028 14768 7850 161249 -4491 -286625 -229259 -68046
17866B03105c19548A09134b17098A66742M0581a35873F8566b56139d7674j21348
$$ 203105 -319548 109134 -217098 166742 207323 -135873 68566 -256139 -47674 -169022
17856a69022A3019K13067L1028P6309b10356h4482m809j36821B33928k9188k5499
$$ -169022 13019 226086 257114 333423 -210356 -84482 -89291 -226112 233928 204740 179241
17845A79241G7697a26745B54974a03779A86554l1736D0899d3847C46451b50590
$$ 179241 77697 -126745 254974 -103779 186554 154818 40899 -43847 346451 -250590
17834A3986a61951B09999i9722G2379O6018a26588A84221d8287j46868i6169A79132
$$ 13986 -161951 209999 -99722 72379 138397 -126588 184221 -48287 -195155 -96169 179132
17822a08594A91775a8558D77086h6460l4177F0967K17050J37062i5545j41024
$$ -108594 191775 -18558 477086 -86460 -120637 60967 278017 415079 -95545 -236569
17812b36569B50375H5864J22910c50663E5621K8146l5377J15045a0174r892j56506
$$ -236569 250375 85864 208774 -350663 55621 83767 48390 163435 -10174 -20066 -176572
17801a76572f3836o5719H0523a17144K940H9751a7573p8265A85222p2405h3170
$$ -176572 -63836 -129555 80523 -117144 -114204 89751 -17573 -95838 185222 112817 -83170
17789A30941a04656A16801D0693J65226d9189J4546k04547N1289C3870a97474
$$ 130941 -104656 116801 40693 205919 -49189 -34643 -239190 -187901 33870 -197474
17778a04847K1481D2102g9810F5908a01312A15180d7406K0035A81354c12155d836
$$ -104847 -83366 42102 -79810 65908 -101312 115180 -47406 -27371 181354 -312155 -4836
17766d0358B1073K3748J43952G0318a62796P4171E8483a22990A1283a29867A11171
$$ -40358 21073 44821 188773 70318 -162796 -88625 58483 -122990 11283 -129867 111171
17754B03732b47264O5959B052c8988E7237A4824b5702B38925b36998J02472F5326
$$ 203732 -247264 -181305 2052 -38988 57237 14824 -25702 238925 -236998 -134526 65326
17742g2419m2317M0440c2169G2090k9037K0678O7664j361l6006A8928D104d134
$$ -72419 -114736 -74296 -32169 72090 43053 63731 131395 130034 94028 18928 4104 -4134
17729A85414i2639A2529L04329F2671O7726a41372j5828f4093C5821a24991j27329
$$ 185414 -92639 12529 316858 62671 130397 -141372 -157200 -64093 35821 -124991 -252320
17718b52320g8547n29A27457E2263a16037N7673j885m04363J52448N0418B25101
$$ -252320 -78547 -79076 127457 52263 -116037 -58364 -60249 -464612 -312164 -261746 225101
17706A74318a73305l071c5910A8583N3865a38988A69734P2584G0066b76860I7161
$$ 174318 -173305 -176376 -35910 18583 72448 -138988 169734 242318 70066 -276860 97161
17694d863j470k9173B50615j19772J13417a9377F4009d546k4021o527A44674K08689
$$ -4863 -6333 -35506 250615 130843 244260 -19377 64009 -4546 -28567 -35094 144674 353363
17682C53363b01509h5790B46914B1763e6243j29782C32059k1498p1832g3136F2212
$$ 353363 -201509 -85790 246914 21763 -56243 -186025 332059 310561 238729 -73136 62212
17670A59958a03586B554N1571a43463C70131j17211a21898A8136a18497j04814
$$ 159958 -103586 2554 54125 -143463 370131 252920 -121898 18136 -118497 -223311
17660b23311h5581j42476B60282J63184a4055C89108e6580a5068F5774d9615A81464
$$ -223311 -85581 -228057 260282 423466 -14055 389108 -56580 -15068 65774 -49615 181464
17648a75655A10780B1144P2659L0493R5223l7914g584H2215g8145B17656J2822
$$ -175655 110780 21144 93803 124296 219519 181605 -7584 82215 -78145 217656 230478
17637B30478g6764B81111E853j016a5007A81087P2126d0335B45358D9297J74782
$$ 230478 -76764 281111 5853 4837 -15007 181087 253213 -40335 245358 49297 224079
17626B24079D2885d0614D6791a6731j6810C0309L7735b9212B9373J11204E3676
$$ 224079 42885 -40614 46791 -16731 -33541 30309 68044 -29212 29373 140577 53676
17614a09372I0143a80881f820G5709P6564C0074L45850A04016m0276i7183j03547
$$ -109372 90143 -180881 -6820 75709 152273 30074 375924 104016 63740 -97183 -200730
17603b00730A6428J62558R696B1674d8118j29542j6032H7124J09334D6961K20641
$$ -200730 16428 178986 188682 21674 -48118 -177660 -193692 87124 196458 46961 267602
17592B67602a95376I1435m0238f8951j86502A14595A7465J44556b99278b8483
$$ 267602 -195376 91435 51197 -68951 -255453 114595 17465 162021 -299278 -28483
17581d1387B50595A01548b46303A48612b15352j35823a54941J1856D75055A02115
$$ -41387 250595 101548 -246303 148612 -215352 -351175 -154941 -143085 475055 102115
17570d8707Q904A80828G1314J46579c2100A11707K86171b35070F4611O6760c4322
$$ -48707 -39803 180828 71314 217893 -32100 111707 397878 -235070 64611 131371 -34322
17558b0948F4323J29643A6358P882a19102C50993B751N5703R1921b06973B28918
$$ -20948 64323 193966 16358 24240 -119102 350993 2751 58454 150375 -206973 228918
17546c69076D1370A3580J13270b39572B63276h0495B59101q4759j2100g2301j59227
$$ -369076 41370 13580 126850 -239572 263276 -80495 259101 174342 162242 -72301 -231528
17535b31528B66902F2661f9248p3346k94374B00480q0736a27376A55388K8363
$$ -231528 266902 62661 -69248 -142594 -436968 200480 119744 -127376 155388 183751
17525A83751d4928B53760c1848B12630b0819o4661H9269b6899B94122j15982C0166
$$ 183751 -44928 253760 -31848 212630 -20819 -85480 89269 -26899 294122 178140 30166
17513A3714J44115L71003a33430L7385A86478g3850B69443a30610B01837b3350
$$ 13714 157829 528832 -133430 -96045 186478 -73850 269443 -130610 201837 -23350
17502a06147C96988a70214B7517a41849H5537J2776b43046b4842E25713A09410
$$ -106147 396988 -170214 27517 -141849 85537 98313 -243046 -24842 525713 109410
17491A59778p2763J12842q4132e3831A03630e938H389K42055c00223A08106R574
$$ 159778 87015 199857 115725 -53831 103630 -5938 8389 250444 -300223 108106 117680
17480A17680L35463A10363a15888C68412j79867h5441A96009B2645E499b42706
$$ 117680 453143 110363 -115888 368412 188545 -85441 196009 22645 5499 -242706
17469C33998a55884d3078B52643d6754I7117d4350A65590j7303b89040d0497c095
$$ 333998 -155884 -43078 252643 -46754 97117 -44350 165590 148287 -289040 -40497 -3095
17457B92334d4094D66833D8847K6982b29352E21230A57397R1251E3128K89896
$$ 292334 -44094 466833 48847 75829 -229352 521230 157397 248648 53128 343024
17447C43024n9003p1179J82558j60029J16502a44104C49845E254L52771a23254
$$ 343024 284021 212842 395400 235371 351873 -144104 349845 5254 358025 -123254
17436I0501J91235A05743h0272C44195j61511M4383j5643K60102c4044I3571a1480
$$ 90501 281736 105743 -80272 344195 182684 227067 211424 471526 -34044 93571 -11480
17424C59520i6475F60823B43820B2370p0D477b67046A43015j9400L02678a7312
$$ 359520 -96475 660823 243820 22370 22300 4477 -267046 143015 123615 426293 -17312
17412C44005A16338l3903Q3093O5456E3172Q7373K7689C0673f0998j77610G9990
$$ 344005 116338 82435 165528 230984 53172 140545 168234 30673 -60998 -238608 79990
17400i817C13982H6428N57302c5811D50893G0841a79927A96058K29136j79613
$$ -9817 313982 86428 643730 -35811 450893 70841 -179927 196058 425194 245581
17390B45581I6219J7734M0033E2000f6994l8521D0297a14798A56392A6655L05178
$$ 245581 96219 113953 153986 52000 -66994 -105515 40297 -114798 156392 16655 321833
17379C21833A363Q6312R9211B058M58144a77885C42341q3982o1579K77870m4812
$$ 321833 1363 87675 186886 2058 460202 -177885 342341 258359 196780 474650 429838
17368D29838A83568l0690a26230f75I091d6535A28163O8319J53962C9666b31839
$$ 429838 183568 152878 -126230 -675 9091 -46535 128163 196482 350444 39666 -231839
17356D2438O3850J5891d518A52026K2858B1398L1361e1183j37189A21771l3411
$$ 42438 106288 122179 -4518 152026 174884 21398 52759 -51183 -188372 121771 88360
17345H8360J14694P2772G8068J16711K15503j42668Q6660A39901k1606J9490Q5661
$$ 88360 203054 275826 78068 194779 410282 267614 354274 139901 118295 137785 223446
17334B23446c0837A94218F2683Q2241C2316e1709B52721d8739B87927a97694A29001
$$ 223446 -30837 194218 62683 144924 32316 -51709 252721 -48739 287927 -197694 129001
17322D4629f2849C27126d3773A5170M58699I8861J55153A13692n2305K2191O5811
$$ 44629 -62849 327126 -43773 15170 473869 98861 254014 113692 61387 83578 149389
17311A49389Q4545e4846l85D03091d4225D64375A03819J76331b7581A34627J84239
$$ 149389 233934 -54846 -55231 403091 -44225 464375 103819 280150 -27581 134627 318866
17300C18866L1616j42080b6964G6926b0721p9291C61768A24321R0778k1429L4076
$$ 318866 350482 208402 -26964 76926 -20721 -100012 361768 124321 215099 193670 227746
17289B27746H7512L773M1099J64293j9050l9808l7377f6811A93269q4187A113
$$ 227746 87512 91285 132384 296677 277627 237819 200442 -66811 193269 109082 1113
17277B8433a12504A08900K12197c2007A48077a21554a8025G1425J53050H2734
$$ 28433 -112504 108900 321097 -32007 148077 -121554 -18025 71425 224475 82734
17266A14968K53514j32617J56276b60102E07195A88142R2328j4337b20350B49796
$$ 114968 368482 235865 392141 -260102 507195 188142 280470 266133 -220350 249796
17255A82740K66759D3505J7908K56519l0911i4025B33240P0199c04991I5647L10577
$$ 182740 449499 43505 61413 317932 287021 -94025 233240 303439 -304991 95647 406224
17244D06224b9023D90005d9113C24758A41675j0913J13359K33490C0824J57781
$$ 406224 -29023 490005 -49113 324758 141675 130762 244121 477611 30824 188605
17234A88605a9705B90065A35776J39601I7039J38775q3831o9787c0108D84108
$$ 188605 -19705 290065 135776 275377 97039 235814 151983 82196 -30108 484108
17223A18513l7898J90309l2022n111j6560m4326J63927k96H0554J12125O0965
$$ 118513 80615 270924 238902 233791 217231 172905 336832 336536 80554 192679 253644
17212B53644r3815K8344D8504K30450R0673A69407E5610L18126o6861P2334j37515
$$ 253644 159829 188173 48504 278954 369627 169407 55610 373736 306875 379209 241694
17201B41694J55041A48406f5713B36871J97972M043o9560A37790R0874K98112
$$ 241694 396735 148406 -65713 236871 434843 438886 369326 137790 228664 526776
17191E26776B21760H2102l8046L40579B1958O2313K56923A3367L01192K42008
$$ 526776 221760 82102 44056 384635 21958 84271 341194 13367 314559 556567
17181E56567B20925K1243M30450B71852P7138I6652J11059P917r9101N4044g8992
$$ 556567 220925 242168 672618 271852 348990 96652 207711 215628 116527 170571 -78992
17169B35925q85d3853B42989J14770M8704k00806C2825J93089P4728K9248l7688
$$ 235925 235040 -43853 242989 357759 406463 205657 32825 225914 300642 329890 292202
17158B92202F461R6210K85877j06790N2806A0018K48831B0473M26156l1584A32431
$$ 292202 6461 102671 388548 281758 334564 10018 258849 20473 446629 415045 132431
17146D51919K229j17137p7357p2286p046K15023A42023L41366A72620L74097k68925
$$ 451919 454148 337011 259654 187368 180322 395345 142023 483389 172620 546717 277792
17135B77792J17875j36135J5003k9022q8026O9457k2235J53384l1435o6898J52572
$$ 277792 395667 259532 274535 245513 157487 226944 204709 358093 326658 259760 412332
17124D12332J26420m2642A36393L96624j7552A40515a4000B36366J44581j48423
$$ 412332 538752 496110 136393 533017 515465 140515 -14000 236366 380947 232524
17114B32524O7754k0014N759O660j06267K81489j05138p5272J57373C6549J46541
$$ 232524 300278 280264 286023 292683 186416 467905 362767 287495 444868 36549 183090
17103A83090K91306N1285A62199J72474I4054N64039B63276O4807O0938Q1705
$$ 183090 474396 525681 162199 334673 94054 658093 263276 328083 389021 470726
17093D70726k23005J80117j30805J86908k08135J93963j95155J90355K88497r8551
$$ 470726 247721 427838 297033 483941 275806 469769 274614 464969 753466 654915
17083F54915l26330P4631E5749J39587L02209G8410Q2012L43948q6793j43228
$$ 654915 328585 403216 55749 195336 497545 78410 160422 504370 417577 274349
17073B74349F0922M45238l3407j26346L62833k08865k073G3183J57540N0667N12765
$$ 274349 60922 506160 472753 346407 709240 500375 498302 73183 230723 281390 794155
17062G94155C81784j09554K7537R7506K5146J19010j73369L5185r8835J72784
$$ 794155 381784 272230 299767 397273 422419 541429 368060 403245 304410 477194
17052D77194r1540P3479J4123k2181n8279K02157P2597k6803j36635l0239j53157
$$ 477194 385654 459133 473256 451075 392796 594953 667550 640747 504112 473873 320716
17041C20716K74910Q5994C36845L24891k52955a1553G34198k10779B54550L18946
$$ 320716 595626 681620 336845 661736 408781 -11553 734198 523419 254550 573496
17031E73496j09093j82262l7927L52961Q4134p4650J08822j76073Q8006B28262
$$ 573496 464403 282141 244214 597175 681309 606659 715481 539408 627414 228262
17020F95724j91441L6106q036N5810K5861K16064k4909k51402r6430L18573k36711
$$ 695724 504283 540389 532353 588163 614024 830088 805179 553777 457347 775920 539209
17009E39209J93296j83227K26030j27486Q0914k63464K05749j1212J10615l00841
$$ 539209 732505 549278 775308 647822 728736 465272 671021 659809 770424 469583
16999D69583K72918j04674K6237N6659m5035J04453J69598l08714O3415K3366
$$ 469583 742501 637827 664064 720723 675688 780141 949739 641025 704440 727806
16989G27806j19945J19445P2220Q590K6446n5578K41041k38667m8130r2507J61924
$$ 727806 607861 727306 799526 808116 834562 778984 1020025 781358 733228 640721 802645
16978H02645L0450K3268k50372K49020j19743N041J97284K62548n38307J98613
$$ 802645 833095 856363 605991 855011 735268 740309 937593 1200141 661834 860447
16968H60447j87307L71187k77497J68071K52223j72807k96567J26987K8071k84796
$$ 860447 673140 1044327 766830 934901 1187124 1014317 717750 844737 872808 588012
16958E88012K37321K19891M5673l90133O0591J36953m4647J05713j42215L78984
$$ 588012 825333 1045224 1090897 700764 761355 898308 853661 959374 817159 1196143
16948A196143E74198L70903n139J37272M44027o78018M00763m04924K95928L00033
$$ 1196143 574198 945101 939962 1077234 1521261 843243 1244006 839082 1135010 1435043
16938A435043m56420J59667K28354l07202Q1423l28576K50357n339J0757L16072
$$ 1435043 978623 1138290 1366644 1059442 1140865 812289 1062646 1057307 1068064 1384136
16928A384136k17143q3933J53098J46107j72059J30387K12852n76745K87489O6634
$$ 1384136 1166993 1083060 1236158 1382265 1210206 1340593 1553445 976700 1264189 1330823
16918A330823l2343M41317p49302M77125j21792K1741K60962j35550N4514k52485
$$ 1330823 1298480 1739797 990495 1467620 1345828 1367569 1628531 1492981 1547495 1295010
16908A295010L02237l20089J47801L26641l86032M9237N43457k53350R8697K6565
$$ 1295010 1597247 1277158 1424959 1751600 1365568 1414805 1958262 1704912 1803609 1830174
16898A830174j23547K2884M6912J6051O4332k50161L6019M30098n63907N83955
$$ 1830174 1706627 1729511 1776423 1792474 1856806 1606645 1642664 2072762 1508855 2092810
16888B092810l91563O7319j4478j59364K87991L85867n59869L19958J58065j51871
$$ 2092810 1701247 1768566 1754088 1594724 1882715 2268582 1708713 2028671 2186736 2034865
16878B034865J98854k04315L50972j38036J35672k10406J75419L7526p2604L46856
$$ 2034865 2233719 2029404 2380376 2242340 2378012 2167606 2343025 2380551 2307947 2654803
16868B654803m24579M2882j69325L84658j91961K08843j47332L28740k7145L376
$$ 2654803 2230224 2273106 2103781 2488439 2296478 2505321 2357989 2686729 2659584 2662960
16858B662960K6596N7108K71179l47719J71522J0141j88364r5654N67475l35998
$$ 2662960 2689556 2746664 3017843 2670124 2841646 2851787 2663423 2567769 3135244 2799246
16848B799246P14193m37441R1799j8483j74720N65171k39953L88897k56980L97888
$$ 2799246 3513439 3075998 3167797 3149314 2974594 3539765 3299812 3688709 3431729 3829617
16838C829617k72601O1053L00575j69458M71356k58773R3647q6426J88198r1764
$$ 3829617 3557016 3618069 3918644 3749186 4220542 3961769 4055416 3968990 4157188 4065424
16828D065424K64830l36536K99780K57729r3105K29632J85720j25972J78659m6630
$$ 4065424 4330254 3993718 4293498 4551227 4458122 4687754 4873474 4747502 4926161 4879531
16818D879531J87958K59167p0782L17600q3061p1732Q16192n21058L35541L9605
$$ 4879531 5067489 5326656 5255874 5573474 5490413 5418681 6234873 5713815 6049356 6088961
16808F088961M57595k60292M89384K17491l09334M30703j3245N09649M9244l62753
$$ 6088961 6546556 6286264 6775648 6993139 6683805 7114508 7101263 7610912 7660156 7297403
16798G297403N82533J67803L94938o4847K24309K40931R3553M38215J58656J79243
$$ 7297403 7879936 8047739 8442677 8377830 8602139 8843070 8936623 9374838 9533494 9712737
16788I712737O01339j81951M12252N51720J89560J48190P04831k36007N43365
$$ 9712737 10314076 10132125 10544377 11096097 11285657 11433847 12138678 11902671 12446036
16779A2446036L21615M91318N01409K39033N25331O66686M82792O04170N60639
$$ 12446036 12767651 13258969 13760378 13999411 14524742 15191428 15674220 16278390 16839029
16770A6839029K18665P20261P92964M92968N18910J121597O83120K99932J492458
$$ 16839029 17057694 17777955 18570919 19063887 19582797 20704394 21387514 21687446 23179904
16761B3179904P78970J057508Q05522J502514Q13705J029818J024059K191309
$$ 23179904 23958874 25016382 25821904 27324418 28138123 29167941 30192000 32383309
16753C2383309Q89026J744206J774815J784402J396634K439463J792723K241463
$$ 32383309 33272335 35016541 36791356 38575758 39972392 42411855 44204578 46446041
16745D6446041K924109K617378K664825L313728L026305L184505L978584M023110
$$ 46446041 49370150 51987528 54652353 57966081 60992386 64176891 68155475 72178585
16737G2178585M306535M968600M531451N097386N737958N665829O008680O253702
$$ 72178585 76485120 81453720 85985171 91082557 96820515 102486344 108495024 114748726
16729A14748726O630397O575775P148287O754506O628293O333112O013324N053074
$$ 114748726 121379123 127954898 135103185 141857691 148485984 154819096 160832420 165885494
16721A65885494M985556L699458K920820J267881N95780o50610k494422k855361
$$ 165885494 170871050 174570508 177491328 178759209 179354989 178704379 176209957 173354596
16713A73354596l971205n097172n792266o251329o707889o642027p155225o648888
$$ 173354596 169383391 164286219 158493953 152242624 145534735 138892708 131737483 125088595
16705A25088595p075445o470128o314653n923240n988628n391190n397645m694070
$$ 125088595 118013150 111543022 105228369 99305129 93316501 87925311 82527666 77833596
16697G7833596m325465m228423l864002l687057l850299k777202l010111k883906
$$ 77833596 73508131 69279708 65415706 61728649 57878350 55101148 52091037 49207131
16689D9207131k461288k375588k415863j679255k391579k088668j590252j616634
$$ 49207131 46745843 44370255 41954392 40275137 37883558 35794890 34204638 32588004
16681C2588004j459976j164915j114828j616421j137118j127220q49363j344568
$$ 32588004 31128028 29963113 28848285 27231864 26094746 24967526 24118163 22773595
16673B2773595o61167r48935o85624r33139l44703j256206o92545l78206n00326
$$ 22773595 22112428 21163493 20477869 19544730 19200027 17943821 17251276 16873070 16372744
16664A6372744p67224l05298q43919m90699m94033l00907n90202n01872l57616
$$ 16372744 15605520 15300222 14456303 13965604 13471571 13170664 12580462 12078590 11720974
16655A1720974j86190m77288L7814l87482k50922m38320l72558m1447m85699J15086
$$ 11720974 11534784 11057496 11095310 10707828 10456906 10018586 9646028 9604581 9118882 9233968
16645I233968m99978m8505m08434r6249l94816j66871n7531j73232m21293k64022
$$ 9233968 8733990 8685485 8277051 8180802 7785986 7619115 7561584 7388352 6967059 6703037
16635F703037M3230k02308k90014j6541j3370m04002j44350l1120J44570m20981
$$ 6703037 6746267 6543959 6253945 6237404 6224034 5820032 5675682 5644562 5789132 5368151
16625E368151K41362n86258K46790k37295n9832P7187m09772j47122j86074M7687
$$ 5368151 5609513 5023255 5270045 5032750 4972918 5050105 4640333 4493211 4307137 4354824
16615D354824q7321N688j54793N516p1468M4117m94096N6159J13736k11036j56855
$$ 4354824 4267503 4273191 4118398 4123914 4052446 4096563 3602467 3658626 3772362 3561326 3404471
16604C404471R1948k78887K5879K31135l80303Q388J42914l17357l6812M2897
$$ 3404471 3496419 3217532 3243411 3474546 3094243 3102631 3245545 2928188 2891376 2934273
16594B934273K1964j85628j75245J09553M2395l24956M69088j16586r1831n83455
$$ 2934273 2956237 2770609 2595364 2704917 2747312 2422356 2891444 2774858 2683027 2099572
16584B099572O56114k83700j3220n8643O5397m56137M08213o6082J27848m80744
$$ 2099572 2755686 2471986 2458766 2400123 2465520 2009383 2417596 2351514 2479362 1998618
16574A998618K76443k55340N3723L56583n70875M7696n0212M4326L9844J74341
$$ 1998618 2275061 2019721 2073444 2430027 1859152 1906848 1856636 1900962 1940806 2115147
16564B115147l63388l474j11588J89182j32450j48863J84199j50361L5051P743
$$ 2115147 1751759 1748285 1636697 1825879 1693429 1544566 1728765 1578404 1613455 1621198
16554A621198l7624J40513r1871Q0687l29389N0285O9344J34358j61536l9782
$$ 1621198 1583574 1724087 1632216 1712903 1383514 1433799 1503143 1637501 1475965 1436183
16544A436183K01176m05824K44551j08573r7731j16201N96753n40065o9031k53770
$$ 1436183 1637359 1231535 1476086 1367513 1269782 1153581 1750334 1210269 1141238 887468
16534H87468J45789L6013L22293k35489j49749J83673l7772j88588p3220M41508
$$ 887468 1033257 1069270 1391563 1156074 1006325 1189998 1152226 963638 890418 1331926
16524A331926l23152m31R9836j12424J09525J91503n55709J87826R6278N0874
$$ 1331926 1008774 1008343 1108179 995755 1105280 1296783 741074 928900 1025178 1076052
16514A076052J59949m33030l5284M57832j79673r0931m12699L51934N7305N5933
$$ 1076052 1236001 802971 767687 1225519 1045846 954915 542216 894150 951455 1007388
16504A007388j7585l73628J86050j61734J56676r2413J740K30655k87747J2062
$$ 1007388 989803 616175 802225 640491 797167 704754 706494 937149 649402 661464
16494F61464m3453J21559J84253l17050J67374j58175k9583P4588j64524L27930
$$ 661464 618011 739570 923823 606773 774147 615972 586389 660977 496453 824383
16484H24383p9286Q5385J98756m19053M6707J28916o7975j40310j14501K60987
$$ 824383 745097 830482 1029238 610185 656892 785808 717833 577523 463022 724009
16474G24009j68306J61510j24978L05374l37578K76064k45852j47425P1251L2
$$ 724009 555703 717213 592235 897609 560031 836095 590243 442818 514069 514101
16464E14101L05561l56613j54663J51167A92818K25973N599j0969K21078L0969
$$ 514101 819662 463049 308386 459553 192818 418791 424390 413421 634499 665468
16454F65468C04071M87185l02002R0694j60628Q8799n0651M17766k46333j24437
$$ 665468 304071 791256 489254 579948 419320 508119 457468 875234 628901 504464
16444E04464J52690A24064L89216A01624K83793j52377Q2006M2088l8033J31734
$$ 504464 657154 124064 513280 101624 385417 233040 315046 357134 319101 450835
16434D50835k00458Q2732o3148J23420M3816p6288O5450P9423k37611Q0208R0973
$$ 450835 250377 333109 269961 393381 437197 360909 426359 505782 268171 348379 439352
16423D39352A83657J32445J24686a948E79487l7106j31540l6629j14971n4830
$$ 439352 183657 316102 440788 -1948 579487 542381 410841 374212 259241 204411
16413B04411K01800j42883m8717Q3064J89088k8505k00754o6277K5304J43819
$$ 204411 406211 263328 214611 297675 486763 458258 257504 191227 216531 360350
16403C60350a74237B18462K21888j97402C7846R2954R1093J33484J82935j91769
$$ 360350 -174237 218462 440350 242948 37846 130800 221893 355377 538312 346543
16393C46543j59372L91814j34564k11026J27738J01685J876j12029J27619A43580
$$ 346543 187171 578985 444421 233395 361133 462818 464694 352665 480284 143580
16382E39927k02489M0860A2679J44292i4405B33244J03122A27298M580f1135D00936
$$ 539927 337438 378298 12679 156971 -94405 233244 336366 127298 131878 -61135 400936
16370D06873j01808q0187p4316E6163P6156J31588K2078H0456K13664j45916J68399
$$ 406873 305065 224878 150562 56163 132319 263907 285985 80456 294120 148204 316603
16359C16603P3622j36383D0176N12920B55146c5233D20036K22858F6526q197O2046
$$ 316603 390225 253842 40176 553096 255146 -35233 420036 642894 66526 58329 120375
16348A20375J79276E1583O6083J94344D0508K36891n4767F4730a98133B73247
$$ 120375 299651 51583 117666 312010 40508 277399 222632 64730 -198133 273247
16337B61232P2850j05020j8276L59388B58424D6636K21041A09278L64318A33846
$$ 261232 334082 229062 210786 570174 258424 46636 267677 109278 473596 133846
16326d7241K887j23259G4055J81621L0528B2579L29195o5692a20600K6235D29860
$$ -47241 -44354 -167613 74055 255676 286204 22579 351774 286082 -120600 -94365 429860
16314A60071Q2315E7796K70181A09572C4440K04518J04571j53853L0120a25972
$$ 160071 242386 57796 327977 109572 34440 238958 343529 189676 219796 -125972
16303i0114D79181b0126E178L30793J44837A12643a01002a3152B74388a1858H4233
$$ -90114 479181 -20126 5178 335971 480808 112643 -101002 -13152 274388 -11858 84233
16291d725E38213E6312K68335g2163I7857J59337I8072J70161a1006A46140o6735
$$ -4725 538213 56312 324647 -72163 97857 257194 98072 268233 -11006 146140 79405
16280G9405k3167K27445o4087J06854j04885d0563B58299q6971a26359B12875
$$ 79405 56238 283683 219596 326450 221565 -40563 258299 171328 -126359 212875
16269E46778e2860D07499q607H4279J40179K3551I7543J44452k6633c2439A79116
$$ 546778 -52860 407499 398892 84279 224458 248009 97543 241995 215362 -32439 179116
16257H2845M10831B18416G9962N6200J55010h1162C6851rB332c9428r6708A79505
$$ 82845 493676 218416 79962 136162 291172 -81162 36851 36842 2332 -39428 -136136 179505
16244C93303f5451k0872A92319j771K9174F5310h2894A80984P0662a27905A76759
$$ 393303 -65451 -86323 192319 190548 219722 65310 -82894 180984 251646 -127905 176759
16232A288L06069h0960B80485G2542K54454I0148h8010B12975c7212B14826r7207
$$ 1288 307357 -80960 280485 72542 326996 90148 -88010 212975 -37212 214826 117619
16221A17619m2255J96227a12959d2776o3583C2941f6864B98839E2851J246F849
$$ 117619 75364 271591 -112959 -42776 -106359 32941 -66864 298839 52851 54097 6849
16209B56745N9450H4389a0206A06823h0277G1956a72269B0028J63494E1848K5547
$$ 256745 316195 84389 -10206 106823 -80277 71956 -172269 20028 183522 51848 77395
16198G7395J36681A540L5621j2731e5515B13107J21208D5046Q2160J520R0156
$$ 77395 214076 1540 37161 24430 -55515 213107 334315 45046 127206 128726 218882
16187B18882i4441o5983j07208G2153d8589j14756O2434C50211a15062k2459A40168
$$ 218882 -94441 -160424 -267632 72153 -48589 -163345 -100911 350211 -115062 -137521 140168
16175A62954k97A327a22199c8100j54417B95292c7615j58629c375B694O3160d2708
$$ 162954 162657 1327 -122199 -38100 -192517 295292 -37615 -196244 -3375 2694 65854 -42708
16162C45236j10067F9741k3291R9277J75540B5681i9769B25418b89633i1916B41240
$$ 345236 235169 69741 46450 145727 321267 25681 -99769 225418 -289633 -91916 241240
16150B56256q1586b6105k39105d1676a4651G3997K64783F7036g365m0551l6965
$$ 256256 174670 -26105 -265210 -41676 -14651 73997 338780 67036 -7365 -47916 -84881
16139h4881a3486o6062B29438b71135B75396a03712l59933h3594L7206A23519
$$ -84881 -13486 -79548 229438 -271135 275396 -103712 -463645 -83594 -46388 123519
16128G3767d0641A17385a45875k03139A04087f0205k41245J04660B40734d6674
$$ 73767 -40641 117385 -145875 -349014 104087 -60205 -301450 -196790 240734 -46674
16117c31448A52733D8710J16315i9660l6882D4630K6804l1021J8008g4308E2603
$$ -331448 152733 48710 165025 -99660 -136542 44630 71434 40413 58421 -74308 52603
16105a9031D38316a81769C90004A23393m4362f6976A5054c8665p2596d6827j64123
$$ -19031 438316 -181769 390004 123393 79031 -66976 15054 -38665 -111261 -46827 -210950
16094b10950a6l7455J7280D3762d08320h8048C19372a24052A57266b22155J567
$$ -210950 -16 -37471 -20191 43762 -408320 -88048 319372 -124052 157266 -222155 -220588
16083b20588A67552a99529P3724A3582b35853B09083C2729f4404H3501a41997
$$ -220588 167552 -199529 -125805 13582 -235853 209083 32729 -64404 83501 -141997
16072a12718q6188A89927a18787c0628l026j56837h7114G2656g6109B1473b79133
$$ -112718 -198906 189927 -118787 -30628 -33654 -190491 -87114 72656 -76109 21473 -279133
16060C34794b44978l8758D4003c7983A11420a50939n4234F5399a52902C4803N0074
$$ 334794 -244978 -283736 44003 -37983 111420 -150939 -205173 65399 -152902 34803 84877
16049H4877e887j7940J470o813A41815f9891J1292n1638k2218N5138A29806k0351
$$ 84877 -5887 -23827 -22357 -29170 141815 -69891 -58599 -110237 -132455 -77317 129806 109455
16037A09455c41532e0133o5740G3737a73191g4512c4349B09307Q1468E6930k3597
$$ 109455 -341532 -50133 -115873 73737 -173191 -74512 -34349 209307 290775 56930 33333
16026C3333a3105p0796B10040o9579R3867a20283H6389a82384F7607J5286a33751
$$ 33333 -13105 -83901 210040 140461 234328 -120283 86389 -182384 67607 82893 -133751
16014a51127B45972a34324B7880j1404J00351b3991B43282a34858b1246D7925
$$ -151127 245972 -134324 27880 16476 116827 -23991 243282 -134858 -21246 47925
16003A2743R3861C0381c1228K743I9528a58877D0463a2520F4548k7886b655A68927
$$ 12743 106604 30381 -31228 -28485 99528 -158877 40463 -12520 64548 36662 -2655 168927
15990g2784A097L3174c1822a1212C65887a16534C20460L18223A33499J32868m2200
$$ -72784 1097 34271 -31822 -11212 365887 -116534 320460 638683 133499 266367 224167
15979B24167m6602J2808H0346C1616J77812a05794L6534A7145K64139a60800k7963
$$ 224167 177565 190373 80346 31616 209428 -105794 -69260 17145 281284 -160800 -188763
15968a88763R0802a0348B0978K03480p976G7255B4199e6202m0669F7R4985C0239
$$ -188763 -97961 -10348 20978 224458 216482 77255 24199 -56202 -96871 67 95052 30239
15955a61098p7111E923a19867C7386d90897a09604D5779a39271k04069a64963
$$ -161098 -238209 5923 -119867 37386 -490897 -109604 45779 -139271 -343340 -164963
15944h2338K0472B6519g3681B3494b01132B32266B7164c49350a46606M5110r003
$$ -82338 -61866 26519 -73681 23494 -201132 232266 27164 -349350 -146606 -101496 -110499
15933a10499j59059J03714k8917l4179C7686n696d2582G3513c2905A38457c17776
$$ -110499 -269558 -165844 -194761 -228940 37686 31990 -42582 73513 -32905 138457 -317776
15921a17550o1451d5164B34845l6671b10678b0006l6689D824a96072B12615e5368
$$ -117550 -179001 -45164 234845 198174 -210678 -20006 -56695 4824 -196072 212615 -55368
15909B8682O4246b61103R4505A633b51738R5907G3411J7343b01772A90370a28832
$$ 28682 92928 -261103 -166598 1633 -251738 -155831 73411 90754 -201772 190370 -128832
15897b18827j07157L954h3082o7859c0660j94832d5240k20796A60767h5681k33795
$$ -218827 -325984 -322030 -83082 -150941 -30660 -225492 -45240 -266036 160767 -85681 -319476
15886c19476J06818F4441r516K9921O22333a03934B11173f0320l08724A06533
$$ -319476 -212658 64441 54925 84846 707179 -103934 211173 -60320 -369044 106533
15875C5735d24277g9971j47654P9020O8058p9254A16567l6200a7080q0925l2020
$$ 35735 -424277 -79971 -227625 -148605 -80547 -159801 116567 80367 -17080 -98005 -130025
15864a30025K7811c8314m6059D6658a64922A84709C9368P2745O5479n5730a54802
$$ -130025 -102214 -38314 -84373 46658 -164922 184709 39368 112113 177592 121862 -154802
15852e3992A57410M6549D9563J83812A0666J1221a70518l1760A43154a86203Q2761
$$ -53992 157410 203959 49563 233375 10666 21887 -170518 -202278 143154 -186203 -103442
15841a03442j25469I6534h5393d111A068d41021G8958a34209j684D2937J01498
$$ -103442 -228911 96534 -85393 -4111 1068 -441021 78958 -134209 -135893 42937 144435
15830A44435c93754B74781a634k61253a16627A07647b97646a45235A12285J18267
$$ 144435 -393754 274781 -1634 -262887 -116627 107647 -297646 -145235 112285 230552
15820B30552f6911B10933H8978M1463b64955c1130E5933a27172k6738f4524k94248
$$ 230552 -66911 210933 88978 130441 -264955 -31130 55933 -127172 -153910 -64524 -358772
15809c58772B60176a54288a9372o0602k11417K4934B01950L3621b01584A73580
$$ -358772 260176 -154288 -19372 -79974 -291391 -266457 201950 235571 -201584 173580
15798a96913A08167h9380g76l18642a07792k2882o9521D0493i9614A32690N7312
$$ -196913 108167 -89380 -776 -319418 -107792 -130674 -200195 40493 -99614 132690 190002
15787A90002b4186A4506c6416B24597r1836b12157A97117G0038K21192j05116
$$ 190002 -24186 14506 -36416 224597 132761 -212157 197117 70038 291230 186114
15777A86114i2533g338B96027D5950f1203B33143c2727C29181A7271a52678A2253
$$ 186114 -92533 -7338 296027 45950 -61203 233143 -32727 329181 17271 -152678 12253
15765f802j0472A08052M1722a0603n3478m5544a5173j90113G4500h3938j5818
$$ -6802 -17274 108052 149774 -10603 -64081 -109625 -15173 -205286 74500 -83938 -99756
15754i9756F8028b19323A64388a89510N0486F960N2576c98188E9901a00599A89716
$$ -99756 68028 -219323 164388 -189510 -139024 6960 59536 -398188 59901 -100599 189716
15742A8754J23536a44501a042A69764k5513c23322A86579c25667a47653B05596
$$ 18754 142290 -144501 -1042 169764 144251 -323322 186579 -325667 -147653 205596
15731a99574I3076g8224C32456b24155c7505j68902A23238c2297C02502f335r4907
$$ -199574 93076 -78224 332456 -224155 -37505 -206407 123238 -32297 302502 -6335 -101242
15720a01242a6465p4039A32754O9740e48851A85501H2065a83128A32330J8085
$$ -101242 -16465 -90504 132754 202494 -548851 185501 82065 -183128 132330 150415
15710A50415N6447i8646A35581c13858B88957B4130g3424j4803c3554j45361D3644
$$ 150415 206862 -98646 135581 -313858 288957 24130 -73424 -88227 -33554 -178915 43644
15698b18638C2947b391A53560r354a53092C18286E649a63308I9254A7751c7074
$$ -218638 32947 -2391 153560 144206 -153092 318286 5649 -163308 99254 17751 -37074
15686D26545e16569b07637j56881B05537C8901b18212B67683j18764d73534a47158
$$ 426545 -516569 -207637 -364518 205537 38901 -218212 267683 148919 -473534 -147158
15675D5120a52410l5974C29714N7891a51177j30970J09783A08380D5185b67374
$$ 45120 -152410 -188384 329714 387605 -151177 -282147 -172364 108380 45185 -267374
15664A15057a63292d4714k7245j98745A24352c19550a27268B52908g7307K5309
$$ 115057 -163292 -44714 -71959 -270704 124352 -319550 -127268 252908 -77307 -51998
15654e1998A42366A7435J44060a10117n8002L0131K4422I0533J089J18699L6494
$$ -51998 142366 17435 161495 -110117 -168119 -137988 -113566 90533 91622 210321 246815
15643B46815E4707L1506i2152m25514a78683A95507a71606j6484g5610k00225
$$ 246815 54707 86213 -92152 -517666 -178683 195507 -171606 -188090 -75610 -275835
15633b75835C45819d3893k35540G7200d05816A29827c31553a28765d2228l31217
$$ -275835 345819 -43893 -279433 77200 -405816 129827 -331553 -128765 -42228 -373445
15623c73445A56820d44008a24073I0797G526b33304A27902e4028q7205B96341
$$ -373445 156820 -444008 -124073 90797 7526 -233304 127902 -54028 -141233 296341
15612b73425e3147K0408k61238Q476A3032e1213H1945b29278C7955J24151b56320
$$ -273425 -53147 -32739 -293977 -285501 13032 -51213 81945 -229278 37955 162106 -256320
15600f0712A03172h2246C7272a00344m3038H7070m1072b3267G9135c02683f0264
$$ -60712 103172 -82246 37272 -100344 -143382 87070 45998 -23267 79135 -302683 -60264
15588i1445p8731M5319k1756E3813J17803a84116A85968a7166A08482D1503J91307
$$ -91445 -170176 -124857 -146613 53813 171616 -184116 185968 -17166 108482 41503 232810
15577B32810a76505A53611J95221A2380a10140b9521j80890B39621j01022c811
$$ 232810 -176505 153611 348832 12380 -110140 -29521 -210411 239621 138599 -3811
15566A7358N4803b1610j03793j13866B99029n0876H1085a25516A56108e4184A81481
$$ 17358 72161 -21610 -125403 -239269 299029 248153 81085 -125516 156108 -54184 181481
15554A42474J17702b96758A09818E2267b31908A50167c33238i7838J2585C88554
$$ 142474 260176 -296758 109818 52267 -231908 150167 -333238 -97838 -85253 388554
15543a98715F2665c3898k4539j57633d7486j93012h8283J7090A35598l4356l3785
$$ -198715 62665 -33898 -58437 -216070 -47486 -240498 -88283 -71193 135598 101242 67457
15532F7457c97024D6314A2852a1313B30618H7280i7095M0430A06315b48618A07357
$$ 67457 -397024 46314 12852 -11313 230618 87280 -97095 -56665 106315 -248618 107357
15520a15187J0335A60978l7946m7093O47a5672B55964f0346A55690F7549A626
$$ -115187 -104852 160978 123032 75939 76586 -15672 255964 -60346 155690 67549 1626
15508c3088o9590B12436f7165B72384j22616g4845j88357h5381B46730H0277f7324
$$ -33088 -102678 212436 -67165 272384 149768 -74845 -263202 -85381 246730 80277 -67324
15496e6479n2412B44682C8332M8922J02236I816a08931m0480B0834b13778B67153
$$ -56479 -108891 244682 38332 87254 189490 9816 -108931 -149411 20834 -213778 267153
15484b6701G8188P8071b03130a6036j18105d7921A6981k972b82549g1630J2430
$$ -26701 78188 156259 -203130 -16036 -134141 -47921 16981 14009 -282549 -71630 -59200
15473e9200j23907C9865K1771k4270b83554h7918m801A65784J23609a97205D3805
$$ -59200 -183107 39865 61636 37366 -283554 -87918 -92719 165784 289393 -197205 43805
15461a52414O4555m8469a7572E4219c1273j01778A1886g3716j06871n754J1336
$$ -152414 -87859 -136328 -17572 54219 -31273 -133051 11886 -73716 -180587 -186341 -175005
15450a75005B35434b45798C1703a45725j27982J36704g786j40329B98180d5469
$$ -175005 235434 -245798 31703 -145725 -273707 -137003 -7786 -148115 298180 -45469
15439c3946j1990B01756F8624c46673J59097A37714c98190d3445G2230M4784n4331
$$ -33946 -45936 201756 68624 -346673 -187576 137714 -398190 -43445 72230 117014 62683
15428F2683A7578b8971l7619a9383A7598E1b97860G2554J16515a94463c9693A30309
$$ 62683 17578 -28971 -66590 -19383 17598 51 -297860 72554 189069 -194463 -39693 130309
15415A6416a53967K496A54205a1451j11031A09804e472C28780j07126c41905n7855
$$ 16416 -153967 -151471 154205 -11451 -122482 109804 -5472 328780 221654 -341905 -399760
15404c99760e2484A8407i2800K3784A57185o1836J03675b2862B88185A0072O952
$$ -399760 -52484 18407 -92800 -69016 157185 95349 199024 -22862 288185 10072 17024
15393A7024d2447m1236B4924e7728h747A50485P567b09958i2633B3049a29081
$$ 17024 -42447 -83683 24924 -57728 -8747 150485 158052 -209958 -92633 23049 -129081
15381B55878J09345a01444A11286b6560n4301n2307n4600A964K61051B5634N1152
$$ 255878 365223 -101444 111286 -26560 -80861 -133168 -187768 1964 263015 25634 76786
15370G6786N0479a24574e390A73585j8303a23065L8188A40344N8323d3194A63030
$$ 76786 127265 -124574 -5390 173585 155282 -123065 -84877 140344 198667 -43194 163030
15358C07159E6136J21100n9578d34126B24248j09742a01335E7838a97871B60285
$$ 307159 56136 177236 117658 -434126 224248 114506 -101335 57838 -197871 260285
15347e3027l2522r5205A12117L2890a51316B44463B8743a19572M9771A88083H6441
$$ -53027 -85549 -180754 112117 145007 -151316 244463 28743 -119572 -69801 188083 86441
15335b5230J1385j19931O6662j18208B45553b06609A0940M07133a99524C04105
$$ -25230 -13845 -133776 -67114 -185322 245553 -206609 10940 418073 -199524 304105
15324c891l03959Q531J11331B44038d5169q5893G9124J3358j919o136a46997I7964
$$ -3891 -307850 -299319 -187988 244038 -45169 -131062 79124 92482 90563 84427 -146997 97964
15311G5541c1576m5991C30771g033j05122H4400O58d6113C9047a03464A04532
$$ 75541 -31576 -77567 330771 -7033 -112155 84400 85058 -46113 39047 -103464 104532
15299A00562O5637a05608A55445a72275f4398C75560A09326d8720I2289A9711
$$ 100562 166199 -105608 155445 -172275 -64398 375560 109326 -48720 92289 19711
15288B56384o5379f2341j00423H1416J18591a57927e502G673M9170a75264d6233
$$ 256384 191005 -62341 -162764 81416 200007 -157927 -5502 7673 56843 -175264 -46233
15276d6205C0762K19818c4486k35550a06954G020J34061b25484A46696h5184l0420
$$ -46205 30762 250580 -34486 -270036 -106954 7020 141081 -225484 146696 -85184 -115604
15265a15604C21082f4565o805j0132j95712B76528H5276K89702b2290k85017B40146
$$ -115604 321082 -64565 -71370 -81502 -277214 276528 85276 374978 -22290 -307307 240146
15253b9808C99684A51027N9104J69107K35483J030190n14016k15659N69652C99485
$$ -29808 399684 151027 210131 379238 614721 1644911 1130895 915236 1484888 399485
15242D85255F4092J5154c90770A53760N261B8345a15671M6394A30917j2654k4778
$$ 485255 64092 79246 -390770 153760 159021 28345 -115671 -69277 130917 118263 93485
15231I3485K17473C4769K25703r2290J20553j13532B7694K06370c9089C5397e7955
$$ 93485 310958 34769 260472 168182 288735 175203 27694 234064 -39089 35397 -57955
15219a16323A25500b31303R2411F1712L84642G5937b6594G3532K6757a01766c9107
$$ -116323 125500 -231303 -138892 61712 446354 75937 -26594 73532 100289 -101766 -39107
15207B37734g4632L533A24855c23596B13242h8696C81872a49118A55094d1338
$$ 237734 -74632 -71099 124855 -323596 213242 -88696 381872 -149118 155094 -41338
15196h6921F7606M27913A30239M2359N7580H319a36561A84845G2229d5790A65199
$$ -86921 67606 495519 130239 172598 230178 8319 -136561 184845 72229 -45790 165199
15184C80107p9765h8336b7391F5480a25371A61606J7713J45857i1549K3528N872
$$ 380107 300342 -88336 -27391 65480 -125371 161606 179319 325176 -91549 -68021 -62149
15173f2149A26906R9093E4420r078e8852A69092p7223b7453B13905b5496k95736
$$ -62149 126906 225999 54420 45342 -58852 169092 91869 -27453 213905 -25496 -321232
15162c21232a19264A45494J70631a93986N1674B1333R6972f2744D10170g539p0934
$$ -321232 -119264 145494 316125 -193986 -142312 21333 118305 -62744 410170 -7539 -78473
15151g8473B19095A723b34555R3435A56818C0851M2766N0429J45872D6745J21215
$$ -78473 219095 1723 -234555 -141120 156818 30851 73617 124046 269918 46745 167960
15140A67960J91861b1970j82606A07868A4472N680b12025C12471K11635b25363
$$ 167960 359821 -21970 -204576 107868 14472 20152 -212025 312471 524106 -225363
15129b93974H7832J04277Q4705e4437A92463K34861E762k397K53420f9383I8928
$$ -293974 87832 192109 276814 -54437 192463 427324 5762 3365 256785 -69383 98928
15117a4446A38689j2605K90573A00083K46795A16996K92478c25782I8129L39640
$$ -14446 138689 126084 416657 100083 346878 116996 409474 -325782 98129 437769
15107D37769c6502A53764c79026A67649j1424N4473A02970l9204J3253A6691a13807
$$ 437769 -36502 153764 -379026 167649 156225 210698 102970 63766 77019 16691 -113807
15095A05450H37O86J87403F6716h159j8764e803o4456B14012a69758i483C1997
$$ 105450 837 1523 188926 66716 -8159 -26923 -5803 -70259 214012 -169758 -9483 31997
15082A23021K55361A2190N18292A48839E3384K44536I6898B8061a9674D66010
$$ 123021 378382 12190 530482 148839 53384 297920 96898 28061 -19674 466010
15071C98394A51055j643a59162E4041P0435J71661A34299J95796I365b08403J6534
$$ 398394 151055 149412 -159162 54041 124476 296137 134299 330095 9365 -208403 -191869
15060a91869D0041J7994J57751C1327J27194K22763G541K17905B2213a9612B95036
$$ -191869 40041 58035 215786 31327 158521 381284 7541 225446 22213 -19612 295036
15048E4696J52249L10849k04476F5687N6080K21873A33647J30803d6534A65844
$$ 54696 206945 517794 313318 65687 121767 343640 133647 264450 -46534 165844
15037H2270L82731j5930c7930l6161F7853j2296C324L36913L3204A81486P817
$$ 82270 465001 449071 -37930 -74091 67853 55557 3324 340237 373441 181486 189303
15026A89303a10394A81479n0600J75452j04885J91387C7527J28893e312A30091
$$ 189303 -110394 181479 130879 306331 201446 392833 37527 166420 -5312 130091
15015E30791A08556L74133A29641L3975h0096H8446L65755B2711J96005k4475
$$ 530791 108556 482689 129641 163616 -80096 88446 454201 22711 218716 194241
15005A94241K12179d2856D63399k25173M1358j4782A07216C8483J48091A5322
$$ 194241 406420 -42856 463399 238226 279584 264802 107216 38483 186574 15322
14994A4094L4972K39327r8989C4756Q1712K33587A21308J67615f0931K5730e946
$$ 14094 49066 288393 189404 34756 116468 350055 121308 288923 -60931 -35201 -5946
14982A61968b8251A77829J42039j45541J09859F8035K04044j27812N3436J7131
$$ 161968 -28251 177829 319868 174327 284186 68035 272079 144267 197703 214834
14972B14834K697P3742P050L7812k0499j05330M9044A2214O9435J58091A06252
$$ 214834 217531 291273 298323 336135 315636 210306 259350 12214 81649 239740 106252
14960B32535q0939J17353J77690B07551M6275f0720A64460O9584Q4337E9117J99376
$$ 232535 151596 268949 446639 207551 253826 -60720 164460 234044 318381 59117 258493
14949B58493M4340a96607D8383L1545K06554D4520a9555B84323a04062A96580
$$ 258493 302833 -196607 48383 79928 286482 44520 -19555 284323 -104062 196580
14938C86150A31209K43037A24376l41K22466A59469O05116l20784d875C56496
$$ 386150 131209 374246 124376 124035 346501 159469 764585 443801 -4875 356496
14927C24243J21712j732A42638L28053B20273o2725J59841L5052j42970K17940
$$ 324243 445955 444223 142638 470691 220273 157548 317389 352441 209471 427411
14917D27411k6405I1508K80000p8827R8511k5814G749L56409A46200N67049B24068
$$ 427411 401006 91508 371508 292681 391192 365378 7749 364158 146200 713249 224068
14905B46444L2188o7094P088J47895n6107b3333C72701j18223p7239Q8805J51266
$$ 246444 278632 211538 218626 366521 310414 -23333 372701 254478 177239 266044 417310
14894D17310L83813B32349C5299L84031B07281l9024b0620B50724K80323j74543
$$ 417310 801123 232349 35299 419330 207281 168257 -20620 250724 531047 356504
14884C56504J7653A35650K34861m9462J01542J02466o0017j73319J69220G1119
$$ 356504 374157 135650 370511 321049 422591 525057 465040 291721 460941 71119
14873A83137m449J57443C177M71677A05722Q8327K82207a65B07042K60160J417
$$ 183137 178688 336131 3177 474854 105722 194049 476256 -165 207042 467202 468619
14862D68619p8008l0490J54025A99038G2724K36392K78700e9033B68006L61775
$$ 468619 390611 360121 514146 199038 72724 309116 587816 -59033 268006 629781
14852F29781A13935c452D56152A85332K17690r3980J69750p5561i8677B86592
$$ 629781 113935 -3452 456152 185332 403022 309042 478792 403231 -98677 286592
14841A38171L07731M2267j4717A32240R3887J43346o6350A50159M36700n7701
$$ 138171 445902 488169 473452 132240 226127 369473 303123 150159 586859 529158
14831E29158L4888j35795p4102m5901M9898j33108r4251K41038p4154K36369m1632
$$ 529158 564046 428251 354149 308248 358146 225038 130787 371825 297671 534040 492408
14820D92408j88694Q996L427L74460A70631K91212L5010O0377k63437K28941k55955
$$ 492408 303714 312710 316137 690597 170631 461843 496853 557230 293793 522734 266779
14809B66779N15107G2865L88985R0396k29267L62090B43591J57897j5033J3394
$$ 266779 781886 72865 461850 552246 322979 685069 243591 401488 386455 399849
14799C99849j69730K73860J94481l15003J74455k08540j47528k9797k4811L67546
$$ 399849 230119 503979 698460 383457 557912 349372 201844 172047 147236 514782
14789E14782K43831k82625A87600L84430O1061k08304M0474j82409K41745K42314
$$ 514782 758613 475988 187600 572030 633091 424787 465261 282852 524597 766911
14779G66911l58530j31519j12369O58022B00829K59382J97493j08983j22697A85868
$$ 766911 408381 276862 164493 822515 200829 460211 657704 548721 426024 185868
14768H13925l68818K80410l31042K47512m7828j01061j09011o2897M23265n5053
$$ 813925 445107 725517 394475 641987 594159 493098 384087 321190 744455 689402
14758F89402k99113J64785q2255M76226k91810j3J53012l06145K98325j97381
$$ 689402 390289 555074 472819 949045 657235 657222 810234 504089 802414 605033
14748F05033N9374j77838K50280r7960R3145j31142L8304l08028L41750J29712
$$ 605033 664407 486569 736849 638889 732034 600892 639196 331168 672918 802630
14738H02630j6637l33305L27015l67311L64110m9398R0853K8945l6612l10403
$$ 802630 785993 452688 779703 412392 776502 727104 817957 846902 810290 499887
14728D99887L02422j91663m8598N7363L0J16351m6250K37491j65466J9127j43260
$$ 499887 802309 610646 562048 619411 619441 735792 689542 927033 761567 780694 637434
14717F37434J92970k4111l387C99752K95670N7622M6231j09070j50330L33380
$$ 637434 830404 806293 802906 399752 695422 753044 799275 690205 539875 873255
14707H73255j65370k07517L32001q4242L5333L553j6757O7254L0720J75702j42108
$$ 873255 707885 500368 832369 748127 783460 787013 770256 837510 868230 1043932 901824
14696I01824l71896N32109l41638J54171j73865J59314o0972l5341M3969j01306
$$ 901824 529928 1062037 720399 874570 700705 860019 799047 763706 807675 706369
14686G06369j8744L1514L805j1196Q6973K62973m55718O01763k49981j38580K70381
$$ 706369 687625 719139 722944 711748 798721 1061694 605976 1207739 957758 819178 1089559
14675A089559P0458m65646j03865J61357M28653j22354l16645J56891j43208k291
$$ 1089559 1160017 694371 590506 751863 1180516 1058162 741517 898408 755200 752909
14665G52909L05563k72668O8074J24617K26534j34198j10617l11488N11509j86256
$$ 752909 1058472 785804 853878 978495 1205029 1070831 960214 648726 1160235 973979
14655I73979j03127R9681j04771M6350J56692k68894K06318J36390j44181j5817
$$ 973979 870852 970533 865762 912112 1068804 799910 1006228 1142618 998437 982620
14645I82620m0944J30708k04344M51891l0975j52205N0619m4023M5238n9463J37903
$$ 982620 941676 1072384 868040 1319931 1288956 1136751 1187370 1143347 1188585 1129122 1267025
14634A267025l73264J4225K07286L29073n21295p392M35296j30495J30218j22735
$$ 1267025 893761 907986 1115272 1444345 923050 915658 1350954 1220459 1350677 1227942
14624A227942J6296j61551j66299M16150j56430p0451L6255K91024k18159k07508
$$ 1227942 1244238 1082687 916388 1332538 1176108 1105657 1141912 1432936 1214777 1007269
14614A007269K64157K2439n96466R68009m62748L70679o9812k86527j51967L17790
$$ 1007269 1271426 1293865 697399 1665408 1202660 1573339 1503527 1217000 1065033 1382823
14604A382823J12689j40390J53542j49287j46187J71628J42021L7979j10415J88626
$$ 1382823 1495512 1355122 1508664 1359377 1213190 1384818 1526839 1564818 1454403 1643029
14594A643029j04541m05094M46306J047l09684K06068K51839p2089M8299J72933
$$ 1643029 1538488 1133394 1579700 1580747 1271063 1477131 1728970 1656881 1705180 1878113
14584A878113m75886N16274n10062k65797N72162J63552O1119l5251l9059J64744
$$ 1878113 1402227 1918501 1408439 1142642 1714804 1878356 1939475 1904224 1865165 2029909
14574B029909q5947j22429J45719J72180k62865L22654l71580m8045L19669J15359
$$ 2029909 1943962 1821533 1967252 2139432 1876567 2199221 1827641 1779596 2099265 2214624
14564B214624j49375K63019k67842K82872n1358k15255L50567J6703P09497m87698
$$ 2214624 2065249 2328268 2060426 2343298 2291940 2076685 2427252 2443955 3153452 2665754
14554B665754J75843Q1041O70630L45787O45576J556290L477942Q291465J9172735
$$ 2665754 2841597 2922638 3593268 3939055 4584631 6140921 9618863 17910328 37083063
14545C7083063J0508736B1513058H098665C481837j154450j40745k81023j51m0492
$$ 37083063 47591799 21513058 8098665 3481837 2327387 2186642 1905619 1905468 1864976
14536A864976k28998j60130L11414q316J15290j93644L90282q2669n1850J85838
$$ 1864976 1635978 1475848 1787262 1778946 1894236 1700592 2090874 2008205 1956355 2142193
14526B142193k03922L2280l9836K84895o3018J58329j05647k69194K33975K169
$$ 2142193 1938271 1970551 1930715 2215610 2152592 2310921 2205274 1936080 2170055 2172224
14516B172224m1776L96606k82952N7748K5224j58766L23857J47297J88949j96775
$$ 2172224 2130448 2527054 2244102 2301850 2327074 2168308 2492165 2639462 2828411 2631636
14506B631636J38964j56440J11638J99567m3050k97780M2875P9698j3161n8138
$$ 2631636 2770600 2614160 2725798 2925365 2882315 2584535 2627410 2707108 2693947 2635809
14496B635809J97103K71160l36271O51755n94216M49520n65273N81653O945j52236
$$ 2635809 2832912 3104072 2767801 3419556 2825340 3274860 2709587 3291240 3298185 3145949
14486C145949M1459q4692M26753p1890N4995r9386j2692j6445K86000j90029k16514
$$ 3145949 3187408 3102716 3529469 3457579 3512574 3413188 3400496 3384051 3670051 3480022 3263508
14475C263508J58681K51396l7779J21148Q0660L30039j08793j72179K51581J3328
$$ 3263508 3422189 3673585 3635806 3756954 3837614 4167653 4058860 3886681 4138262 4151590
14465D151590j34695J25322R497R2952J3107j22451L00132J57351l89176K67619
$$ 4151590 4016895 4142217 4151714 4244666 4257773 4135322 4435454 4592805 4203629 4471248
14455D471248q9548O7638J35801j37402M56292m13831J17563J15912Q4729J65828
$$ 4471248 4381700 4449338 4585139 4447737 4904029 4490198 4607761 4723673 4808402 4974230
14445D974230L08139k4618L9740k55974j8396l8080L11009K41503k47861J25748
$$ 4974230 5282369 5257751 5297491 5041517 5023121 4985041 5296050 5537553 5289692 5415440
14435E415440j10376L45798J55839N0484n3050M70884l57130J33805K47047Q996
$$ 5415440 5305064 5650862 5806701 5857185 5804135 6275019 5917889 6051694 6298741 6307737
14425F307737L08290m2616O5436M37831l63584m4905J68158L4063M56789N9486
$$ 6307737 6616027 6573411 6638847 7076678 6713094 6668189 6836347 6870410 7327199 7386685
14415G386685J60553J8359j91405K91051J41261L1367J31899K43208J87526O635
$$ 7386685 7547238 7565597 7374192 7665243 7806504 7837871 7969770 8212978 8400504 8407139
14405H407139k48858O57678k10530K21538L17583j87181M98478K01508j487K43584
$$ 8407139 8158281 8815959 8605429 8826967 9144550 8957369 9455847 9657355 9655868 9899452
14395I899452N7956P2836J14234L82011L09350m7438J90396J0732M08926L34967
$$ 9899452 9957408 10030244 10144478 10526489 10835839 10788401 10978797 10989529 11398455 11733422
14385A1733422j97664M23787M26347J80353J93636N10225j80186N34586L0788
$$ 11733422 11535758 11959545 12385892 12566245 12759881 13270106 13089920 13624506 13655294
14376A3655294J18658M38324J04699N36336O2113M79140J61618N07532L4968O93967
$$ 13655294 13773952 14212276 14316975 14853311 14915424 15394564 15556182 16063714 16098682 16792649
14366A6792649K51411K53644Q2195O66941L34671M45444M95407M53081M53104
$$ 16792649 17044060 17297704 17379899 18046840 18381511 18826955 19322362 19775443 20228547
14357B0228547J45920O07672K76938O32693N13805M89419O19117M12643O50636
$$ 20228547 20374467 20982139 21259077 21891770 22405575 22894994 23514111 23926754 24577390
14348B4577390P97488N45432P09097N19209J112807K87923J018053N84279Q26565
$$ 24577390 25374878 25920310 26629407 27148616 28261423 28549346 29567399 30151678 30978243
14339C0978243M84275J229473R09398R54596J067236J014390J101434R64961J507385
$$ 30978243 31462518 32691991 33601389 34555985 35623221 36637611 37739045 38704006 40211391
14330D0211391J078716J258634J022363J855022J112828J317389J468851K445131
$$ 40211391 41290107 42548741 43571104 45426126 46538954 47856343 49325194 51770325
14322E1770325J504350K026207J669366K123674K143326K028919K538713K609660
$$ 51770325 53274675 55300882 56970248 59093922 61237248 63266167 65804880 68414540
14314F8414540K645138K663446L039328L017136L191596L627709L692285L821226
$$ 68414540 71059678 73723124 76762452 79779588 82971184 86598893 90291178 94112404
14306I4112404M279643M465127M285809N224316M634960N825722O336940O243453
$$ 94112404 98392047 102857174 107142983 112367299 117002259 122827981 129164921 135408374
14298A35408374O687068O973686P770593Q179009Q459394R429868R767766J0393005
$$ 135408374 142095442 149069128 156839721 165018730 173478124 182907992 192675758 203068763
14290B03068763J0861289J1684943J1842376J3273313J3212531J3868034J4591346
$$ 203068763 213930052 225614995 237457371 250730684 263943215 277811249 292402595
14283B92402595J4783368J5147723J5756974J5452141J5305863J4812144J3843499
$$ 292402595 307185963 322333686 338090660 353542801 368848664 383660808 397504307
14276C97504307J3090792J1848502R930753O551696L086685J400010J497588K04774
$$ 397504307 410595099 422443601 432374354 438926050 442012735 443412745 444910333 445115107
14268D45115107j979260k778087n211940q709608j0333902j1962670j3394859
$$ 445115107 443135847 440357760 435145820 426436212 416102310 404139640 390744781
14261C90744781j4776675j5171600j5640422j5640165j5706653j5506999j4311276
$$ 390744781 375968106 360796506 345156084 329515919 313809266 298302267 283990991
14254B83990991j3428683j4090204j3161955j2930156j1732680j1309324j0484553
$$ 283990991 270562308 256472104 243310149 230379993 218647313 207337989 196853436
14247A96853436j0200779r402029r142546p609275p877579p608407p014723o644108
$$ 196853436 186652657 177250628 168108082 160498807 152621228 145012821 137998098 131353990
14239A31353990o494812n203872n106704n018937m892488m803344m491441l673806
$$ 131353990 124859178 119655306 114548602 109529665 104637177 99833833 95342392 91668586
14231I1668586l748996l336354l263793l431565l241859k689508l005878k621593
$$ 91668586 87919590 84583236 81319443 77887878 74646019 71956511 68950633 66329040
14223F6329040k392356k015095k592003j958159k008271j556003k034883j803584
$$ 66329040 63936684 61921589 59329586 57371427 55363156 53807153 51772270 49968686
14215D9968686j409280j467579j289803j390822k043385j283831q97367j186389
$$ 49968686 48559406 47091827 45802024 44411202 42367817 41083986 40186619 39000230
14207C9000230n14209j287207j159475j199837j100886r52287n00644l21245j053842
$$ 39000230 38486021 37198814 36039339 34839502 33738616 32786329 32285685 31964440 30910598
14198C0910598j045804p97781p37752p43105q37078l52937r46829r63467m93350
$$ 30910598 29864794 29067013 28329261 27586156 26749078 26396141 25449312 24485845 23992495
14189B3992495k62262p90321n25001m69001o62388m51612k28133n90970k14535
$$ 23992495 23730233 22939912 22414911 21945910 21283522 20831910 20603777 20012807 19798272
14180A9798272r50101J45687n10732k38359n08270l04845o42584L4886m01372
$$ 19798272 18848171 18993858 18483126 18244767 17736497 17431652 16789068 16823954 16422582
14171A6422582j96955p68868j98178p2829l32221l48531l47930k99371l5734k57795
$$ 16422582 16225627 15456759 15258581 15185752 14853531 14505000 14157070 13857699 13821965 13564170
14161A3564170k7554o45538n4674K5669m94485k64124k45155o4404m96799r4102
$$ 13564170 13536616 12891078 12836404 12862073 12367588 12103464 11858309 11793905 11297106 11203004
14151A1203004m9681L22961o88711j82196j83638k62330l76681J00160k22818
$$ 11203004 11153323 11476284 10787573 10605377 10421739 10159409 9782728 9882888 9660070
14142I660070k95456K0840M5035j98465o2410L8893k61224l6862j71118k83470
$$ 9660070 9364614 9385454 9430489 9232024 9169614 9208507 8947283 8910421 8739303 8455833
14132H455833R510l7600j88869k06391R6475l37849k9266m70697n9254J86849
$$ 8455833 8465343 8427743 8238874 8032483 8128958 7791109 7761843 7291146 7231892 7418741
14122G418741k52588K15049k40359j01299j07j29550l99266J18421l06201p4433
$$ 7418741 7166153 7381202 7140843 7039544 7039437 6909887 6510621 6629042 6322841 6248408
14112F248408K70447J7570m05122k69457R7602o9296L1602k16035J14243O5861
$$ 6248408 6518855 6536425 6131303 5861846 5959448 5890152 5921754 5705719 5819962 5885823
14102E885823n8286J11190o54391n689J31783k86895K29586k44071k07035J23899
$$ 5885823 5827537 5938727 5284336 5278647 5410430 5123535 5353121 5109050 4902015 5025914
14092E025914k01853P6832K21194m37283k4088j96422K26043L20907n30152J90203
$$ 5025914 4824061 4900893 5122087 4684804 4660716 4464294 4690337 5011244 4481092 4671295
14082D671295l40180k42093O5283J48660k3551k18635N7602J95543k03000m6756
$$ 4671295 4331115 4089022 4154305 4302965 4279414 4060779 4118381 4313924 4110924 4064168
14072D064168L7455j75940l85693K47479j57060K52083N4651l22498L95883p08528
$$ 4064168 4101623 3925683 3539990 3787469 3630409 3882492 3937143 3614645 4010528 3302000
14062C302000L89777R4406k53966q666p335Q2480j05330j9822J02092j34278O4495
$$ 3302000 3691777 3786183 3532217 3523551 3516216 3598696 3493366 3473544 3575636 3441358 3505853
14051C505853n59813L33181L9003k14073j19931K88752m36382J48338K55523j92459
$$ 3505853 2946040 3279221 3318224 3104151 2984220 3272972 2836590 2984928 3240451 3047992
14041C047992j87090L6128j15096P3941j22823k94743K07497J95777N4677K6176
$$ 3047992 2860902 2897030 2781934 2855875 2733052 2438309 2645806 2841583 2896260 2922436
14031B922436l31383K26095l41467K71930l14207k13446L28310k11673K16772
$$ 2922436 2591053 2817148 2475681 2747611 2433404 2219958 2548268 2336595 2553367
14022B553367j04839k74079J97995j58840J38470j35884J95413j51803M0498k11604
$$ 2553367 2448528 2174449 2372444 2213604 2352074 2216190 2411603 2259800 2300298 2088694
14012B088694K26861j53698J25024j43916L906k49286K15117m23788M26259K04730
$$ 2088694 2315555 2161857 2286881 2142965 2146871 1897585 2112702 1688914 2115173 2319903
14002B319903k28269m24269J57611M8629K35240m29396M65692m96246Q3103j29442
$$ 2319903 2091634 1667365 1824976 1873605 2108845 1679449 2145141 1648895 1731998 1602556
13992A602556P893K31123J67169R55121J951201O325331J7878304K0750368k4444918
$$ 1602556 1610449 1841572 2008741 2963862 4915063 11240394 29118698 49869066 25424148
13983B5424148A2148902n123842j831142r37362p68397k63816k26742j11434k99697
$$ 25424148 12148902 7025060 5193918 4256556 3488159 3224343 2997601 2886167 2586470
13974B586470J25649j55083N023m06918j70344Q7294K23758k40285m9779J81923
$$ 2586470 2712119 2557036 2562059 2155141 1984797 2072091 2295849 2055564 2005785 2187708
13964B187708k54153l218K39189l44958J56828j57129J43578l05457L37686l42765
$$ 2187708 1933555 1930337 2169526 1824568 1981396 1824267 1967845 1662388 2000074 1657309
13954A657309J51282M5495k77395R5370k23626K9113L38266q1184j31377J6773
$$ 1657309 1808591 1854086 1576691 1672061 1448435 1477548 1815814 1734630 1603253 1620026
13944A620026K00461N7090l82616R5887R8119J9286j21108M057j17328J67614
$$ 1620026 1820487 1877577 1494961 1590848 1688967 1708253 1587145 1591202 1473874 1641488
13934A641488k74188P3910L04748m46971N30023j54386l05430j14853L44928l44378
$$ 1641488 1367300 1441210 1745958 1298987 1829010 1674624 1369194 1254341 1599269 1254891
13924A254891Q7118Q9576k46480M67005l25061k39875R2030K46641r6992o342
$$ 1254891 1342009 1431585 1185105 1652110 1327049 1087174 1179204 1425845 1328853 1322511
13914A322511j78420L4708P2150K7969m7593j81754J17054j26580L17512J9582
$$ 1322511 1144091 1178799 1250949 1278918 1231325 1049571 1166625 1040045 1357557 1377139
13904A377139k69476n8480Q6726j7602J81496j88084p7994q0731K64840q45P0202
$$ 1377139 1107663 1049183 1135909 1118307 1299803 1111719 1033725 952994 1217834 1216989 1287191
13893A287191j54070K0801m0064K36164j80173l29579N60266m20330L62869j08403
$$ 1287191 1133121 1153922 1113858 1350022 1169849 840270 1400536 980206 1343075 1234672
13883A234672m12239K14846K15980n57115N35610k54561L48186n6648l78737K35298
$$ 1234672 822433 1037279 1253259 696144 1231754 977193 1325379 1268731 889994 1125292
13873A125292J19064L3206k04728L9911j38205J49332k43929K23195j88273j48810
$$ 1125292 1244356 1277562 1072834 1112745 974540 1123872 879943 1103138 914865 766055
13863G66055K84854K9059k00494L38829l08544n6353j0746K95430n9436O60k49743
$$ 766055 1050909 1079968 879474 1218303 909759 853406 842660 1138090 1078654 1079314 829571
13852H29571o365K09809j27741J48780q0449j74562P0691K38865k8258k74739
$$ 829571 823206 1033015 905274 1054054 973605 799043 869734 1108599 1080341 805602
13842H05602J2527L07257q2331k32598p9761K90602j6740k17688L74688l89238
$$ 805602 818129 1125386 1043055 810457 730696 1021298 1004558 786870 1161558 772320
13832G72320L7946K36371m6973J11929j56382q9696N4000j07342j86727N08988
$$ 772320 810266 1046637 999664 1111593 955211 865515 919515 812173 625446 1134434
13822A134434m54708M54931J26829l52406l56482M33436k17460J42003J45097
$$ 1134434 679726 1134657 1261486 909080 552598 986034 768574 910577 1055674
13813A055674k88203J01102j76459m6478Q0988j08516Q3789j37835K96340p6238
$$ 1055674 767471 868573 692114 645636 726624 618108 701897 564062 860402 784164
13803G84164r6805n7298L33141j15767l33486K14055J3260J49848j69572q006
$$ 784164 687359 630061 963202 847435 513949 728004 741264 891112 721540 713534
13793G13534J97878j45433k64314J93005J80445j37986K09828q6094l66993j3301
$$ 713534 911412 765979 501665 694670 875115 737129 946957 860863 493870 480569
13783D80569k03987O30781j50977j40422j63837M38806k78679M6149j72135k13403
$$ 480569 276582 907363 756386 615964 452127 890933 612254 658403 486268 272865
13773B72865R5555J74078M32374B92145N18965c1225D94476p7835r8175K88276
$$ 272865 368420 542498 974872 292145 811110 -31225 494476 416641 318466 606742
13763F06742k12535J05293K08556k09116j81994L24777k25097L09560j52465j38
$$ 606742 394207 499500 708056 498940 316946 641723 416626 726186 573721 573583
13753E73583m065O6782j02994F1704N94897l18622O1030J39442j28155K74384
$$ 573583 569518 636300 533306 61704 656601 337979 399009 538451 410296 684680
13743F84680M5559n9834C23694J43913j3565N2198J29710k07489j20834O64310
$$ 684680 730239 670405 323694 467607 454042 506240 635950 428461 307627 971937
13733I71937k74905n6356k27145K44304J35250l22585J4568K46552C59771L61811
$$ 971937 697032 640676 413531 657835 793085 470500 485068 731620 359771 721582
13723G21582q0426k43342K06210B88321K07976NJ02145j70786j7642J13316R7544
$$ 721582 641156 397814 604024 288321 496297 496302 598447 427661 410019 523335 620879
13712F20879k9827A72850N02665j42928J09637j47115P5143G2024P04957l54338
$$ 620879 591052 172850 675515 532587 642224 495109 570252 72024 776981 422643
13702D22643P8640J82652k6353j2483k15219K96944C35182K78603A56328K24747
$$ 422643 501283 683935 657582 645099 429880 726824 335182 613785 156328 381075
13692C81075m8759j2516K09862m8983M7385l1849J38014j30901J88990n7500C09872
$$ 381075 332316 319800 529662 480679 528064 496215 634229 503328 692318 634818 309872
13680A91990M06892B68277J48034R1068J19703j66361p1889L96906j79671B64079
$$ 191990 598882 268277 416311 507379 627082 460721 388832 785738 606067 264079
13669G17217l51446l0864K5768N6290j69630J22940J68205p541j29633J23214
$$ 717217 365771 334907 360675 416965 247335 370275 538480 530939 401306 524520
13659E24520k08796j0125j46735K29521K95072j21393o1125A61176C4733L61225
$$ 524520 315724 305599 158864 388385 683457 562064 500939 161176 34733 395958
13649C95958J49257A12807K97427J70637j12016J12847j43355J59924j77512l4041
$$ 395958 545215 112807 410234 580871 468855 581702 438347 598271 420759 386718
13639C86718p3283L9045m3376O4036j44731j13202N55156k78137j44092l2693
$$ 386718 313435 352480 309104 373140 228409 115207 670363 392226 248134 215441
13629B15441J055M0346r2616L17672r8116A39479L15222p4688M7899B13301q4819
$$ 215441 216496 256842 164226 481898 383782 139479 454701 380013 427912 213301 128482
13618A28482K85460A73781R0744J12425K44753j42955k3066O412A39644O4360
$$ 128482 413942 173781 264525 376950 621703 478748 455682 462094 139644 204004
13608B04004q9969M80162k92475M2329Q7142b606D08302J26647g8177C69105O1886
$$ 204004 114035 594197 301722 344051 431193 -2606 408302 534949 -78177 369105 430991
13597D30991A67459R5472J76237k5138J13589A62319N3749O3567A39272a0780
$$ 430991 167459 262931 439168 414030 527619 162319 216068 279635 139272 -10780
13586A90859M4167K07237A70065K07532A77414J73547a53519A75448D4950J91994
$$ 190859 235026 442263 170065 377597 177414 350961 -153519 175448 44950 236944
13576B36944L35254E41K0379d9290C64956K05226k61396q2815n2439J09496A13717
$$ 236944 572198 541 20920 -49290 364956 570182 308786 225971 173532 283028 113717
13564A07079J2906M01115k31945p4617a4262F45412c8082C39215J03610q373A08265
$$ 107079 119985 521100 289155 214538 -14262 645412 -38082 339215 442825 434452 108265
13552A51649M17677k27625j67846l9468n7113K57913A18868K82820m3467A51354
$$ 151649 569326 341701 173855 134387 77274 335187 118868 401688 358221 151354
13541B75554K7892n2353Q3104o1524q2729p7514r356M08140k43888o5438K3161
$$ 275554 303446 251093 334197 272673 189944 112430 103074 511214 267326 201888 225049
13530B25049Q3603o0394A20741J15367M09413A97923J39653l7700k3566K23236
$$ 225049 308652 248258 120741 236108 645521 197923 337576 299876 276310 499546
13520D99546j96460j21997B9186d492B67176a15540B54831j00491C6006J51061
$$ 499546 303086 181089 29186 -4492 267176 -115540 254831 154340 36006 187067
13510A87067J19412M5129A14296J67580J8115L2641I5041K42319b44138C57092
$$ 187067 306479 351608 114296 281876 299991 332632 95041 337360 -244138 357092
13499D40132h0029D06091J391D0663O8439M6996h7869B809K46793K22448L4332
$$ 440132 -80029 406091 407482 40663 109102 156098 -87869 2809 249602 472050 506382
13488E06382B27798q4817K0475E426K68789P3699m3624J43878k15257a1191I2704
$$ 506382 227798 142981 163456 5426 274215 347914 304290 448168 232911 -11191 92704
13476f8119I4497K60469K07298B45895K0115K21258A80953K7765p4295O7989q174
$$ -68119 94497 354966 562264 245895 266010 487268 180953 208718 134423 202412 194238
13465A94238J65644b5554E39J36518K48543A69866J82622n0713B4156P2554P1821
$$ 194238 359882 -25554 539 137057 385600 169866 352488 301775 24156 96710 168531
13454A68531O0097k0773G1996L98997j08036q6424A5167J89982J86875A50583
$$ 168531 228628 207855 71996 470993 362957 276533 15167 205149 392024 150583
13443b1454A57665f44A01422L0553J21298R723J54041B7904b5902A22540a93263
$$ -21454 157665 -644 101422 131975 253273 262996 417037 27904 -25902 122540 -193263
13431E1680M2968B4778K73434p5714q4554K24719j64085n8254a3955A52836B0596
$$ 51680 94648 24778 298212 222498 137944 362663 198578 140324 -13955 152836 20596
13419b9377C57808j12224L91120B68911A11765N5048k7580k166J11108A17392
$$ -29377 357808 245584 636704 268911 111765 166813 139233 137067 248175 117392
13408I1003K54847A47311M8116o1527G979M30814j82604A23409c2664E5926h2509
$$ 91003 345850 147311 195427 133900 7979 438793 256189 123409 -32664 55926 -82509
13396i932A58039l4993a10151G5699J56615M3929G1814K33039o5789J1241j24910
$$ -9932 158039 123046 -110151 75699 232314 276243 71814 304853 239064 250305 125395
13385A25395d747j44032B36949E9220h9239I3630m846k4505a29501I4538J16442
$$ 125395 -4747 -148779 236949 59220 -89239 93630 88784 64279 -129501 94538 210980
13374B10980R5184E4338L32855A92599a2261B41069l6084D2520J17140Q5796E8791
$$ 210980 306164 54338 387193 192599 -12261 241069 204985 42520 159660 245456 58791
13362A59342J75097j64130G2724a755C71128j18592G1156R8646J29475A11971
$$ 159342 334439 170309 72724 -1755 371128 252536 71156 169802 299277 111971
13351g8425G94465k21600B55119q9639J87576G6258N6220K04525j45458J92118
$$ -78425 794465 572865 255119 165480 353056 76258 132478 337003 191545 383663
13341C83663p7618h905C13194J12065A24751J87352M5834l4821A08063o343C072
$$ 383663 306045 -8905 313194 425259 124751 312103 357937 323116 108063 101720 3072
13329c8456B50328J61173A92587J51299A19522k9365J39048N2767H5517h3434
$$ -38456 250328 411501 192587 343886 119522 90157 229205 281972 85517 -83434
13318C24589l2390e2556A76606M7123j00956j4971K40292j24622K02100a09032
$$ 324589 292199 -52556 176606 223729 122773 107802 348094 223472 425572 -109032
13307c8452B26926p1766K51797I7070a28463F96404A43642o8457J93370r2990
$$ -38452 226926 155160 406957 97070 -128463 696404 143642 75185 268555 175565
13297A75565m3669L19584D3462J78378D3383J89003g2506C3050d0470k2109C1232
$$ 175565 131896 451480 43462 221840 43383 232386 -72506 33050 -40470 -62579 31232
13285D87471B223b87343e6006K2054A63386q0219Q6496J79472q5031I9393h3814
$$ 487471 2223 -287343 -56006 -33952 163386 83167 169663 349135 264104 99393 -83814
13273G1653N3831a30332K8791e265m03337A85713K4655J31270C2555K46820n8755
$$ 71653 125484 -130332 -101541 -5265 -408602 185713 210368 341638 32555 279375 220620
13262B20620b7187H8458C7524L85939A0702K0766f1960B19788J33717C3888M3033
$$ 220620 -27187 88458 37524 423463 10702 31468 -61960 219788 353505 33888 76921
13251G6921i688D8097L26350j58509G7215b56329h9612C03210q0322Q7627j45976
$$ 76921 -9688 48097 374447 215938 77215 -256329 -89612 303210 222888 310515 164539
13240A64539j2163K08881q4239a43823A27925c1901H1178K04328j19789e5632
$$ 164539 152376 361257 277018 -143823 127925 -31901 81178 285506 165717 -55632
13229A31566e4096A82964a10925A79272J80103a84611h1018B10391o7964O4629
$$ 131566 -54096 182964 -110925 179272 359375 -184611 -81018 210391 142427 207056
13219B07056C2012a64438B627a0469A62458L4966k4631C8791P3436J61995c2553
$$ 207056 32012 -164438 2627 -10469 162458 197424 172793 38791 112227 274222 -32553
13207B26210A07035a53848B07379c7380A61821N167b82145A79806E8960J2120
$$ 226210 107035 -153848 207379 -37380 161821 166988 -282145 179806 58960 71080
13197G1080J43598J90849l2603A59353B5774K67495j695C001R91K65882A32016
$$ 71080 214678 405527 372924 159353 25774 293269 291574 3001 3992 269874 132016
13185h0018A03792J12919p5310b69733C08195C021K93481n8759f9170r3917a9331
$$ -80018 103792 216711 141401 -269733 308195 3021 296502 237743 -69170 -163087 -19331
13173b21488B54462o8272G7514J6924e1686A26704D9256a46089e3885C04704N1801
$$ -221488 254462 186190 77514 94438 -51686 126704 49256 -146089 -53885 304704 356505
13162C56505a30746B2668J01923n8417P1525l8988J86284A1856K71667b23552
$$ 356505 -130746 22668 124591 66174 137699 98711 284995 11856 283523 -223552
13151A28213k5215P738c53284J49735B9000b34797C5092b88303B3402c57929B84421
$$ 128213 102998 110736 -353284 -203549 29000 -234797 35092 -288303 23402 -357929 284421
13139B07574O8949e7843B9172b3013I9544g7286A50310l1869J51043A29304L5020
$$ 207574 276523 -57843 29172 -23013 99544 -77286 150310 118441 269484 129304 164324
13128A64324J5481c6992j36707N3588A48308J65995j56019d8061k78839B64433
$$ 164324 179805 -36992 -173699 -120111 148308 314303 158284 -48061 -326900 264433
13117I022K24755C992e9161A00737f5753A60548a01956C37943b05899D75276A82060
$$ 9022 233777 3992 -59161 100737 -65753 160548 -101956 337943 -205899 475276 182060
13105A51526l770B2006c6833D90561A03504D8658N3533O1837E3257M3177a48423
$$ 151526 147756 22006 -36833 490561 103504 48658 102191 164028 53257 96434 -148423
13093a04884G8394c96766j13040e8562A64761C3525M4323K4452J16026L8229q1624
$$ -104884 78394 -396766 -509806 -58562 164761 33525 77848 102300 218326 256555 174931
13082A74931J36213E8309M8797O5628N3141O521j09881K4152g3382B16300o1870
$$ 174931 311144 58309 107106 172734 225875 232396 122515 146667 -73382 216300 154430
13071A54430O4310b96170C55564Q5809m8939g8385B77586F5225b34643B95596
$$ 154430 218740 -296170 355564 441373 392434 -78385 277586 65225 -234643 295596
13060H7310c9038B49068o6142q3733A1642J6475b33883G3656h4062m5318K171
$$ 87310 -39038 249068 182926 99193 11642 28117 -233883 73656 -84062 -129380 -127209
13049a27209o5813I5862a22234j05376B40880d9235O020j09859A44174F3348Q8848
$$ -127209 -193022 95862 -122234 -227610 240880 -49235 -43215 -153074 144174 63348 152196
13038A52196b0779m7392k7961A65981P7702E8503P4602J88808A26974E0172L40952
$$ 152196 -20779 -68171 -96132 165981 243683 58503 133105 321913 126974 50172 391124
13027C91124j52258b96351a48019B51386l8005A4326J30801a00747k45724B0225
$$ 391124 238866 -296351 -148019 251386 213381 14326 145127 -100747 -346471 20225
13016A36381L5906J13980f7467r0439O0853p4781e5124A1836f3116A96232p8710
$$ 136381 172287 286267 -67467 -157906 -97053 -171834 -55124 11836 -63116 196232 117522
13005A17522L1046D6902J13059d5201C26017d7970k01601A90416a39035C75215
$$ 117522 148568 46902 159961 -45201 326017 -47970 -249571 190416 -139035 375215
12994b86833B24450J1179j003b87730A10036a43351B7319b55389B82821j9225
$$ -286833 224450 235629 234626 -287730 110036 -143351 27319 -255389 282821 263596
12984B63596d9419A96827J9633D8436N6142Q2362n9537a15837A13951A7094f3812
$$ 263596 -49419 196827 216460 48436 104578 186940 127403 -115837 113951 17094 -63812
12972H0072l7102P2771E0917M3707b0510j192E5147q627J926L55198c78878B14995
$$ 80072 42970 115741 50917 94624 -20510 -21702 55147 46520 48446 403644 -378878 214995
12959C3751a52491P0103j03736A25462m1722A8105J79239A1253P4371C9987A4641
$$ 33751 -152491 -82388 -186124 125462 83740 18105 197344 11253 85624 39987 14641
12947a05563A32538e3120J4095B60820a53350I2362a10433A30899J17937r5235
$$ -105563 132538 -53120 -39025 260820 -153350 92362 -110433 130899 248836 153601
12937A53601n2548J13045b47200A67849d9276k7472j27126A31814K7455a02124
$$ 153601 101053 214098 -247200 167849 -49276 -76748 -203874 131814 159269 -102124
12926I092O9226q053e9924A3250J7387g5209A14184L8596D9371a30027k5326G8235
$$ 9092 78318 70265 -59924 13250 30637 -75209 114184 152780 49371 -130027 -155353 78235
12913i9457H2756p018K52929a50307H7993j1254a49349D88378A72689a70390Q0293
$$ -99457 82756 75738 328667 -150307 87993 76739 -149349 488378 172689 -170390 -90097
12902i0097l7380M3457l22277D1689K39294H0961b0495A2585L0569K04247G3287
$$ -90097 -127477 -84020 -406297 41689 280983 80961 -20495 12585 43154 247401 73287
12890B9396a40577D79576h0029B4554c5221A48579f8427k3293A48494a36572j2103
$$ 29396 -140577 479576 -80029 24554 -35221 148579 -68427 -91720 148494 -136572 -148675
12879a48675M8084l88175B66248l8755H6970K64630d3394B54642b40161I7917
$$ -148675 -100591 -488766 266248 227493 86970 351600 -43394 254642 -240161 97917
12868A5650d9448C74209E1094J12808c197j67121I7411O2260J3295q0142J80307
$$ 15650 -49448 374209 51094 163902 -3197 -170318 97411 159671 172966 92824 273131
12857B73131b3862j62718k78849A54361i8649A65422B1516a83865A82960a70734
$$ 273131 -23862 -186580 -465429 154361 -98649 165422 21516 -183865 182960 -170734
12846A86378k7840J98421b47933P4512A53865b04890C39537b50615P7607h5284
$$ 186378 158538 356959 -247933 -173421 153865 -204890 339537 -250615 -173008 -85284
12835a4486A03941a58225j8320A8313d7607H4923c2831D259a13509C5525c8081
$$ -14486 103941 -158225 -176545 18313 -47607 84923 -32831 4259 -113509 35525 -38081
12823A56925L7276a25796A65503b6664F6268g1541b20A02192a6950k8263C02888
$$ 156925 194201 -125796 165503 -26664 66268 -71541 -220 102192 -16950 -45213 302888
12811d868F215a41410e6056a4588E8449L5793J57033b58533H3545b95372D9183
$$ -4868 6215 -141410 -56056 -14588 58449 94242 251275 -258533 83545 -295372 49183
12799a61807d7678A42226J60999n7091a52976A15431a60578j0952B59023M3463
$$ -161807 -47678 142226 303225 246134 -152976 115431 -160578 -171530 259023 302486
12789C02486k8384b3673j87234C43807a56149L9327G6718J4936b50861a1647A05193
$$ 302486 274102 -23673 -210907 343807 -156149 -116822 76718 91654 -250861 -11647 105193
12777c1561E6852J18386b6093o3983l6881C03637a71770a0130j44884d1112G9014
$$ -31561 56852 175238 -26093 -90076 -126957 303637 -171770 -10130 -155014 -41112 79014
12765a58780C98586i8934C76047c1573C68974i0782A87157E3532c7943k8627E1681
$$ -158780 398586 -98934 376047 -31573 368974 -90782 187157 53532 -37943 -66570 51681
12753f091B8918J34693a39084N8728C914L18801a28181r1940A69820F8657b54245
$$ -6091 28918 163611 -139084 -80356 3914 322715 -128181 -220121 169820 68657 -254245
12741d0375A17216d9715j91048H5449L1567J32031j07199A3938J91805E7908M1566
$$ -40375 117216 -49715 -240763 85449 117016 249047 141848 13938 205743 57908 99474
12730I9474a3524j50657B26480m2750a65339J0973q1395d1793k40894J0346F1761
$$ 99474 -13524 -164181 226480 183730 -165339 -154366 -235761 -41793 -282687 -272341 61761
12718d7910G0328p630h7775I5309a37068N1929A5490N649J74406C2794L63101
$$ -47910 70328 62698 -87775 95309 -137068 -85139 15490 21139 195545 32794 395895
12707C95895F3083Q7007F856O8729b32055B47232a19379k26375A58164L09364
$$ 395895 63083 150090 6856 75585 -232055 247232 -119379 -345754 158164 467528
12697D67528E1843K23648b2203j32050I8085R6834H4758i0913H695K28152p3395
$$ 467528 51843 275491 -22203 -154253 98085 194919 84758 -90913 8695 236847 163452
12686A63452k1490K1876a5091A35027N224R822A1598J19766K76721a07030B7438
$$ 163452 141962 163838 -15091 135027 140251 150073 11598 131364 408085 -107030 27438
12674D75843A08991g7511D1116M6005b82906J07038b8760C43757B845a14941A42990
$$ 475843 108991 -77511 41116 87121 -282906 -175868 -28760 343757 2845 -114941 142990
12662a61011J9307C1711K7577f3649C58675A63856p0654L3171o2971M9396B2992
$$ -161011 -141704 31711 59288 -63649 358675 163856 93202 126373 63402 112798 22992
12650I45N5348J09185a99424h2196A03384e1947H3905A0378J31725h9109a2055
$$ 945 56293 165478 -199424 -82196 103384 -51947 83905 10378 142103 -89109 -12055
12638B84417I754J63365G2695N9495c0738C67509r9683a57448C74823A7559K35369
$$ 284417 9754 173119 72695 132190 -30738 367509 267826 -157448 374823 17559 252928
12627B52928R5952K2390j32603a9199B38181a60777B54817a08994b66A80924c98312
$$ 252928 348880 371270 238667 -19199 238181 -160777 254817 -108994 -266 180924 -398312
12615f9251j60904c4959k54750A97200l6218N217B6311J98984f3345k43433E9300
$$ -69251 -230155 -34959 -289709 197200 160982 166199 26311 225295 -63345 -306778 59300
12603F3205J61404D92O8426J86345j10794g9298I0297K04165b0367C90725F7103
$$ 63205 224609 492 68918 255263 144469 -79298 90297 294462 -20367 390725 67103
12591A54808b6530l23631B1331L23386b37593G1645b34989a14213a6255A83537
$$ 154808 -26530 -350161 21331 344717 -237593 71645 -234989 -114213 -16255 183537
12580c5669K982k7865B06861a87879A45431b26411J13043B09672K8153e6456D57631
$$ -35669 -32687 -60552 206861 -187879 145431 -226411 -113368 209672 237825 -56456 457631
12568a25231G6966B9651e4049B66190a42218A01224b26212F6573k5113J33572
$$ -125231 76966 29651 -54049 266190 -142218 101224 -226212 66573 41460 175032
12558A75032J38376H669B636d5646B01041k1660b4727F6736B4416g4167o9421
$$ 175032 313408 8669 2636 -45646 201041 179381 -24727 66736 24416 -74167 -143588
12547a43588a2933j76246b8752j49982D1608O1823a15914o6835m3832j0839A29609
$$ -143588 -12933 -189179 -28752 -178734 41608 103431 -115914 -182749 -226581 -237420 129609
12535B64299C923J19176b723B33775a57829r0785e0060B70090b06485B82996a27759
$$ 264299 3923 123099 -2723 233775 -157829 -248614 -50060 270090 -206485 282996 -127759
12523C19667c90863A10763j9077B3677K86736j6881a58403C10642a290l3423B30865
$$ 319667 -390863 110763 91686 23677 310413 293532 -158403 310642 -1290 -34713 230865
12511a42211C1859K83117a7597k8570A02862c4551A16370J0164i0060A77527d8358
$$ -142211 31859 314976 -17597 -46167 102862 -34551 116370 126534 -90060 177527 -48358
12499a21354M5898A26744A6167J86369B440d7905q9903C2418J87799a8383B46750
$$ -121354 -75456 126744 16167 202536 2440 -47905 -137808 32418 220217 -18383 246750
12487A80908m3210a09700j3427j43379o270I0497k7540a52282B83666b0570j09207
$$ 180908 137698 -109700 -123127 -266506 -272776 90497 62957 -152282 283666 -20570 -129777
12476a29777A56626a9469B36162C8862Q9379c8055J1684B78738c8332C5746a16799
$$ -129777 156626 -19469 236162 38862 128241 -38055 -26371 278738 -38332 35746 -116799
12464H4687L0168Q9167B6788R7828a13609B86215b32256l2981N6050a7050k55241
$$ 84687 114855 204022 26788 124616 -113609 286215 -232256 -265237 -209187 -17050 -272291
12453b72291J08501B1495E361i611A02954N957a31345m5841o8720a12660A00561
$$ -272291 -163790 21495 5361 -9611 102954 108911 -131345 -177186 -245906 -112660 100561
12441a43137E8824i2885j00116j63531D8694K33689G1045b43227c2572j2361j48004
$$ -143137 58824 -92885 -193001 -356532 48694 282383 71045 -243227 -32572 -44933 -192937
12430a92937A91c2428A65064i0828a1407I4266i014j99937B51858c8524q0670
$$ -192937 191 -32428 165064 -90828 -11407 94266 -9014 -208951 251858 -38524 -119194
12419a19194B12233n4652c38277C5213K16525a12232D6712K34328A04730f3923
$$ -119194 212233 157581 -338277 35213 251738 -112232 46712 281040 104730 -63923
12408A48916a95865B90984g7151A70481H2947f3891b4812j6349B4611N5825d960
$$ 148916 -195865 290984 -77151 170481 82947 -63891 -24812 -41161 24611 80436 -4960
12396a08020L510N1320B69114A34200F757L1244c962k3819C14057a96883f506
$$ -108020 -104510 -53190 269114 134200 6757 38001 -3962 -27781 314057 -196883 -6506
12384c03554B35408f696j94126A30548i3774j05270o2306A1045J20377a32126
$$ -303554 235408 -6696 -200822 130548 -93774 -199044 -261350 11045 131422 -132126
12373a44482j65374j8161a46723F7937a90692j9621A66014a65637G1502L7594
$$ -144482 -309856 -328017 -146723 67937 -190692 -210313 166014 -165637 71502 109096
12363A09096c6287j41185M1630c7913A22897J31507c36390J34455A11842M3788
$$ 109096 -36287 -177472 -135842 -37913 122897 254404 -336390 -201935 111842 155630
12353A55630f5990j5577F0845J95632d32852a20606f674H2848C6134K5107R549
$$ 155630 -65990 -81567 60845 256477 -432852 -120606 -6674 82848 36134 61241 70790
12342G0790a00381k5696A438J66025j3651C0010c90381C5828N2499l5737P0012
$$ 70790 -100381 -126077 1438 167463 153812 30010 -390381 35828 88327 52590 122602
12331A22602B7231f6507b7828B9924H766K20557I5464L11148a98565A73089J19898
$$ 122602 27231 -66507 -27828 29924 8766 229323 95464 406612 -198565 173089 292987
12320B92987b02553C8323a36157B18648o8292e9540j50005A34660J8261R894A5413
$$ 292987 -202553 38323 -136157 218648 150356 -59540 -209545 134660 152921 162815 15413
12308c61108D2462K04799G1211h0544q996k1037D3418N4799J98340k939e4623
$$ -361108 42462 247261 71211 -80544 -89540 -110577 43418 98217 296557 293618 -54623
12296D60865D4950a96359A35340K61726b39712E7692M9166B8945i5757B60039
$$ 460865 44950 -196359 135340 397066 -239712 57692 106858 28945 -95757 260039
12285A51908P958j1536J54200E1837Q1414F722J34278j3281E0846K80817g8845
$$ 151908 159866 148330 302530 51837 133251 6722 141000 127719 50846 331663 -78845
12273C08203j29664N1229A07861J48826a34054A39278n0615C5821Q3335f3629
$$ 308203 178539 229768 107861 256687 -134054 139278 88663 35821 119156 -63629
12262b12508B88163b0227A18885J07634e8808H5277K0799J93766K4148m84a21548
$$ -212508 288163 -20227 118885 226519 -58808 85277 106076 299842 323990 323506 -121548
12250h6056L4510a7990j44868d2389j1562A9648K58839q4026a99346B41479j09303
$$ -86056 -51546 -17990 -162858 -42389 -53951 19648 278487 194461 -199346 241479 132176
12239A32176a4045C54234Q7007A33816m1154N5856a02162M1003C34153J06515
$$ 132176 -14045 354234 441241 133816 92662 148518 -102162 -61159 334153 440668
12229D40668k14831H2649J31412k4572K0870o1908J82401A4454R755K11136j09043
$$ 440668 225837 82649 214061 189489 210359 148451 330852 14454 24209 235345 126302
12218A26302c3281B39616r3407F6986L60821c97409D12107A8239i734j39484C12170
$$ 126302 -33281 239616 146209 66986 427807 -397409 412107 18239 -9734 -149218 312170
12206a58759D5390b096C07042m5499K2409K8725P6969j76823M2097c460D0608
$$ -158759 45390 -2096 307042 261543 283952 312677 389646 212823 254920 -3460 40608
12194C04220j3223p1312H3945D0069M04964e2070D23438F6642b26860g4863A1209
$$ 304220 290997 219685 83945 40069 445033 -52070 423438 66642 -226860 -74863 11209
12182A83915a70312A8717J44422J08979j1958k7269j9780q9494b50616J14612
$$ 183915 -170312 18717 163139 272118 260160 232891 213111 123617 -250616 -136004
12172a36004A14396j1101A1597K65276m3735a5933C05794d9252A40744D9524M9300
$$ -136004 114396 103295 11597 276873 233138 -15933 305794 -49252 140744 49524 98824
12161I8824f6288j19952B12602a51751B53897r717m5746a96682F182K08974Q6662
$$ 98824 -66288 -186240 212602 -151751 253897 244180 198434 -196682 6182 215156 301818
12150C01818j7471c10q4495j94707J28915o4700f3924A64381C4782j1560L92543
$$ 301818 284347 -310 -84805 -279512 -150597 -215297 -63924 164381 34782 23222 415765
12139D15765a30247A97998J83417g386r9223j7320D0787J28498p1840h2031B50232
$$ 415765 -130247 197998 381415 -7386 -106609 -123929 40787 169285 97445 -82031 250232
12127A10968P357f3558a6353D00077j2056b17143A72715F9114a90075e7006C5355
$$ 110968 118325 -63558 -16353 400077 388021 -217143 172715 69114 -190075 -57006 35355
12115c2626r9372h766A53265h4009k32438a44414o128B36369i3108B04979a24721
$$ -32626 -131998 -8766 153265 -84009 -316447 -144414 -150542 236369 -93108 204979 -124721
12103i4860L5705A14635b29757A44298n8155k1108B0917b40946l723J9615A53465
$$ -94860 -59155 114635 -229757 144298 86143 65035 20917 -240946 -244669 -225054 153465
12091a31214B9236g2555l3471D5722d5019F0094P5246A9124c1301B43320p3880
$$ -131214 29236 -72555 -106026 45722 -45019 60094 135340 19124 -31301 243320 169440
12080A69440b55401B97313N29376R91160D51050F7839k7075a02305A04724a00177
$$ 169440 -255401 297313 826689 1817849 451050 67839 40764 -102305 104724 -100177
12069B46357a85041b405r2024A07717b84085a13190A48166L4332b0071C6547K68954
$$ 246357 -185041 -2405 -94429 107717 -284085 -113190 148166 182498 -20071 36547 305501
12058C05501A22424m9760L4546R1326E6754O6560b5338c179G7985b2922B47127
$$ 305501 122424 72664 107210 198536 56754 123314 -25338 -3179 77985 -22922 247127
12046D1902j7967b77672A72048O7493F4656K89563g5201m13959f8195B46270J05174
$$ 41902 23935 -277672 172048 239541 64656 354219 -75201 -489160 -68195 246270 351444
12035C51444b02040A98711b26534A1515a75197j07582a2398A45286c2454F543
$$ 351444 -202040 198711 -226534 11515 -175197 -282779 -12398 145286 -32454 6543
12024B17544a26706C5906c07143B15694a08780r0843A06598f0983C23880C6936
$$ 217544 -126706 35906 -307143 215694 -108780 -199623 106598 -60983 323880 36936
12013B49152p6094A0450M15167b41069B06952I7523b07355B8749f3798A82639
$$ 249152 173058 10450 425617 -241069 206952 97523 -207355 28749 -63798 182639
12002B50403b28003h5682k86459a64651a8963E3383d3439B71203g9821j08851
$$ 250403 -228003 -85682 -372141 -164651 -18963 53383 -43439 271203 -79821 -188672
11992a88672D3164A4184g578j03224o8667C40914F6467J1837l6590J36747h4091
$$ -188672 43164 14184 -7578 -110802 -179469 340914 66467 78304 41714 178461 -84091
11980A32128b0535A86873a29846A02321g9173j35900A76306c931F9539a81355
$$ 132128 -20535 186873 -129846 102321 -79173 -215073 176306 -3931 69539 -181355
11969g5424b6896a2533j49511I9766b79250h7467c5594j9422F3927R2155a6286
$$ -75424 -26896 -12533 -162044 99766 -279250 -87467 -35594 -55016 63927 156082 -16286
11957F3430L0850L9873o6743d9183A19971B2832b85578h6008M2736O256j31178
$$ 63430 94280 134153 67410 -49183 119971 22832 -285578 -86008 -43272 -37016 -168194
11946a68194B912P4101e0314J7041C6037c5256j88718A01299r904c06146A2405
$$ -168194 2912 77013 -50314 -33273 36037 -35256 -223974 101299 91395 -306146 12405
11934a99836A18355a71714b9319B07388C1029a15998N4163D6981R6635a13920
$$ -199836 118355 -171714 -29319 207388 31029 -115998 -61835 46981 143616 -113920
11923I7496P1390a30294j017J75j50461B30198E0676J72910c0103l11854J31017
$$ 97496 168886 -130294 -131311 -131136 -281597 230198 50676 223586 -30103 -341957 -210940
11912b10940f515o1842D388K95633C0293b58337f5604J4672J5871o3172q1203
$$ -210940 -6515 -68357 4388 300021 30293 -258337 -65604 -50932 -35061 -98233 -179436
11901a79436A73143g3390l86434i9077K250d6951b0453I843a2702r2360C03103
$$ -179436 173143 -73390 -459824 -99077 -96827 -46951 -20453 9843 -12702 -105062 303103
11889E5350J11755O0922j07149a28363J7409A27286L01828c14198B59963c72378
$$ 55350 167105 228027 120878 -128363 -110954 127286 429114 -314198 259963 -372378
11878i9069j1358a9035j44052A59652o1801a76079e6026A21308d3279H5834c34397
$$ -99069 -110427 -19035 -163087 159652 97851 -176079 -56026 121308 -43279 85834 -334397
11866i9797j11484c4465l60182F8945a14570E7607p170a12512n0100k78245I6209
$$ -99797 -211281 -34465 -394647 68945 -114570 57607 50437 -112512 -162612 -440857 96209
11854d1633B49390b39797c9777J4559j67657N5759B46901D3715q171M4585i116
$$ -41633 249390 -239797 -39777 -25218 -192875 -137116 246901 43715 35544 80129 -9116
11842i3983A24118a12842n932c1007E8440b22053g7362B67784i3334P198L4724
$$ -93983 124118 -112842 -118774 -31007 58440 -222053 -77362 267784 -93334 -86136 -51412
11831e1412A2347e1604k917B59940f8814A13471a0115G0379a34621K8166k65328
$$ -51412 12347 -51604 -54521 259940 -68814 113471 -10115 70379 -134621 -106455 -371783
11820c71783B58725c36336J09235k7950B37404i5832A49465c70873c9283j1897
$$ -371783 258725 -336336 -227101 -255051 237404 -95832 149465 -370873 -39283 -51180
11810e1180n9484C0214E225L70101j71969k7392b11629P167B2539f7367j84079
$$ -51180 -110664 30214 5225 375326 203357 175965 -211629 -204462 22539 -67367 -251446
11799b51446Q0556N3082N3713k10167J28513j96133B01061i5874d7673o5797L1389
$$ -251446 -170890 -117808 -64095 -274262 -145749 -341882 201061 -95874 -47673 -113470 -82081
11788h2081c4599A33340E0439b93331L0734k27038a31646B58796A21480b83159
$$ -82081 -34599 133340 50439 -293331 -262597 -489635 -131646 258796 121480 -283159
11777A03210K2002c3264A45095J8351a98217B10001J4574a2548E3216L21101i3097
$$ 103210 125212 -33264 145095 163446 -198217 210001 224575 -12548 53216 374317 -93097
11765a8414A38613a04830F0892b02205C03717F5871L47053G7848d1212l33989
$$ -18414 138613 -104830 60892 -202205 303717 65871 412924 77848 -41212 -375201
11755c75201A07213a4692j7934l12935g5572B2220J11789m2566N6834K15201f1435
$$ -375201 107213 -14692 -32626 -345561 -75572 22220 134009 91443 148277 363478 -61435
11743B14445H0730a07986A32863b53926R2250a1760C4062b60699A32930a09516
$$ 214445 80730 -107986 132863 -253926 -161676 -11760 34062 -260699 132930 -109516
11732A64499a70393d006l7474A59466m7188B362M0783N3611b2810D9612k3288
$$ 164499 -170393 -4006 -41480 159466 112278 2362 43145 96756 -22810 49612 26324
11721B6324b9624n1216A1132R4506b10873F8417L41376b09688C0090Q9815b26887
$$ 26324 -29624 -80840 11132 105638 -210873 68417 409793 -209688 30090 119905 -226887
11709e730j74958d1910B9843i061p9405k46749A54426c14847f360l04k92815L9335
$$ -5730 -180688 -41910 29843 -9061 -88466 -335215 154426 -314847 -6360 -6664 -299479 -260144
11697b60144f2114K0801J8436D4016j9501c69588A40120q504C2062L47284A0278
$$ -260144 -62114 -41313 -22877 44016 24515 -369588 140120 131616 32062 379346 10278
11685a87827j80708f8986B18302c65119b7673k0049k4620A00699B4055J65715
$$ -187827 -368535 -68986 218302 -365119 -27673 -47722 -72342 100699 24055 189770
11675A89770h1612B54611j22913C4095M9541e6092j39312R4999A3391J66419h5642
$$ 189770 -81612 254611 131698 34095 83636 -56092 -195404 -100405 13391 179810 -85642
11663c0717a2087B11932l3597a95480A62849b89742B0324M31595d6164k5762k56794
$$ -30717 -12087 211932 178335 -195480 162849 -289742 20324 451919 -46164 -71926 -328720
11652c28720a13057k249j46168A92753L8404a29265B59870a99957B17995K6778
$$ -328720 -113057 -115306 -261474 192753 231157 -129265 259870 -199957 217995 244773
11642B44773A7611L64585C2021O3404a52940f8759j3360k6233A04112h0890b6533
$$ 244773 17611 382196 32021 95425 -152940 -68759 -82119 -108352 104112 -80890 -26533
11630b41315D6960P3831E5706e437n5368B49015I4840k7088K68542b80604a40214
$$ -241315 46960 120791 55706 -5437 -60805 249015 94840 67752 336294 -280604 -140214
11618H6027b56894A10317a60169J3355B46912b14111h2325j49245A0986a67314
$$ 86027 -256894 110317 -160169 -146814 246912 -214111 -82325 -231570 10986 -167314
11607b1622m9316D6753J30272A6271K58668f1981L769K5150j08609A58640d0376
$$ -21622 -70938 46753 177025 16271 274939 -61981 -58212 -33062 -141671 158640 -40376
11595I9635d8759A14876c38853e6643I1218k3461J57458E7672c27454C02485H8125
$$ 99635 -48759 114876 -338853 -56643 91218 67757 225215 57672 -327454 302485 88125
11583B25570D9330N0044K5545E333g6985j11268n2374C529a00959n5482E7307
$$ 225570 49330 99374 124919 5333 -76985 -188253 -240627 3529 -100959 -156441 57307
11571D3695J55130j6101E3248J09093g3046B8304J18105R8543j7047a3368B61301
$$ 43695 198825 182724 53248 162341 -73046 28304 146409 244952 227905 -13368 261301
11559F7591f508A35970J5914h7136C33875j47034a43875B29648b5152A48412p0831
$$ 67591 -6508 135970 151884 -87136 333875 186841 -143875 229648 -25152 148412 77581
11548G7581P8917C1544L65095j29823R6551a3542k3259F9434P6519k2026b27414
$$ 77581 156498 31544 396639 266816 363367 -13542 -36801 69434 145953 123927 -227414
11536B12055Q8474D2568A7353K68143O19b59467A14020m9250J71493b8446C91090
$$ 212055 300529 42568 17353 285496 286115 -259467 114020 64770 236263 -28446 391090
11524B94656r7380D6078a02885A33128b14409D518K00295a42421B06525r2676
$$ 294656 197276 46078 -102885 133128 -214409 4518 204813 -142421 206525 113849
11514A13849e6682E1207R8974b04019A44538P9427J28458A01293K4652A2767a66221
$$ 113849 -56682 51207 150181 -204019 144538 223965 352423 101293 125945 12767 -166221
11502B13195K6864r7113a2013A6574i4612K1655A48785c8645G9609M4516J90267
$$ 213195 240059 142946 -12013 16574 -94612 -72957 148785 -38645 79609 124125 314392
11491C14392A24260O4583O8817j02888m0296g8030A818O3594K54155b1384B27568
$$ 314392 124260 188843 257660 154772 114476 -78030 1818 65412 319567 -21384 227568
11479a9193A95890i592B59713d2304B60950A1005c4992I876K18068H5455L03050
$$ -19193 195890 -9592 259713 -42304 260950 11005 -34992 9876 227944 85455 388505
11468C88505M5764j72897c5024C78467N7858A26461e4480A01584J31641P865C8822
$$ 388505 434269 261372 -35024 378467 436325 126461 -54480 101584 233225 241090 38822
11456D18382A64354h1995A2485e7614B8433a67980A70917e5727a5683j15494B77811
$$ 418382 164354 -81995 12485 -57614 28433 -167980 170917 -55727 -15683 -131177 277811
11444b0975A03125a8185C6365a13599F1398J12086j7102a35474A81467i964k69250
$$ -20975 103125 -18185 36365 -113599 61398 173484 156382 -135474 181467 -9964 -279214
11433b79214C79264I6747K3014D9613J11428E3810N0126P813b28169f6374I8281
$$ -279214 379264 96747 119761 49613 161041 53810 103936 111749 -228169 -66374 98281
11421C8508b326A7542d6011B40287a82923C3275J57643B9153b64931A47345a90278
$$ 38508 -2326 17542 -46011 240287 -182923 33275 190918 29153 -264931 147345 -190278
11409A08409J02034q5421N1944E7582a10581H1599o533a85589b3553F1188i5283
$$ 108409 210443 125022 176966 57582 -110581 81599 75066 -185589 -23553 61188 -95283
11397A13105A9521C799K9915f0434p5097j41755C4411K6736d024k08595B11612
$$ 113105 19521 3799 33714 -60434 -135531 -277286 34411 61147 -4024 -212619 211612
11385h4906A14622a76218B47703A274a26933O960N5776p5982a0801o1398j08795
$$ -84906 114622 -176218 247703 1274 -126933 -119973 -64197 -140179 -10801 -72199 -180994
11374a80994C05729e6888A18025a18821I1278J65542H7039l7536O964b00640L6786
$$ -180994 305729 -56888 118025 -118821 91278 256820 87039 49503 56467 -200640 -163854
11363a63854E9011e6144m6780j05987f1491j99477C19953j34662n4917c213j13775
$$ -163854 59011 -56144 -102924 -208911 -61491 -260968 319953 185291 130374 -3213 -116988
11352a16988A6715b82616b2694A04148C6031a0950A87439M5239Q5092c8440k3519
$$ -116988 16715 -282616 -22694 104148 36031 -10950 187439 232678 317770 -38440 -61959
11341f1959D19382A45602J86089o889A41112j5530N02478c04117R0490H5500b35520
$$ -61959 419382 145602 331691 324802 141112 125582 628060 -304117 -213627 85500 -235520
11329A39843F275L1647d1632E0724b6256j56678C2076M13244I225b17824d4700
$$ 139843 6275 37922 -41632 50724 -26256 -182934 32076 445320 9225 -217824 -44700
11317F3131b01210Q1706A69367d82653C104a70509P0319j19936j54973g4123j33469
$$ 63131 -201210 -119504 169367 -482653 3104 -170509 -100190 -220126 -375099 -74123 -207592
11306b07592G3366a08142j65505a23506B98442a09813A63313b23109J07845r3065
$$ -207592 73366 -108142 -273647 -123506 298442 -109813 163313 -223109 -115264 -208329
11296b08329C41209a14199m7509j69801N7328A04695A8232a3328e391B33986D258
$$ -208329 341209 -114199 -161708 -331509 -274181 104695 18232 -13328 -5391 233986 4258
11284B35100a10259A35009n6015N4507b02648d3343A20178b35274J16470k5133
$$ 235100 -110259 135009 78994 133501 -202648 -43343 120178 -235274 -118804 -143937
11274a43937j19986b8811G3353d61522K25368A88226d02768A09370f049m34360
$$ -143937 -263923 -28811 73353 -461522 -236154 188226 -402768 109370 -6049 -440409
11264d40409Q5894a2480j6851j34022f6214j03721q0257H7103a98046A02375b62013
$$ -440409 -354515 -12480 -29331 -163353 -66214 -169935 -250192 87103 -198046 102375 -262013
11252d43391a94387f343D4964Q0705b97916b3358j18659A18639a19496a4182B58815
$$ -443391 -194387 -6343 44964 125669 -297916 -23358 -142017 118639 -119496 -14182 258815
11240C48478a9675m9545q2264e6875I5311K4862n7460B5019a212k7682o1743A68658
$$ 348478 -19675 -69220 -151484 -56875 95311 120173 62713 25019 -1212 -28894 -90637 168658
11227b3444k59177A9041J84362a06808A3224b18406A34996P6262b45074P4657
$$ -23444 -282621 19041 203403 -106808 13224 -218406 134996 211258 -245074 -170417
11217a70417e5631o3841p0816A62169A8564K01090d4828B23231e0355H8836h861
$$ -170417 -55631 -119472 -190288 162169 18564 219654 -44828 223231 -50355 88836 -8861
11205B1614g6709j40742e2804A10447J24260c0150D2617b8103j59718c0088A54303
$$ 21614 -76709 -217451 -52804 110447 234707 -30150 42617 -28103 -187821 -30088 154303
11193b49000N1733e9625F045i8609o9786A4770a39314A08608K1103b99125b8449
$$ -249000 -197267 -59625 6045 -98609 -168395 14770 -139314 108608 129711 -299125 -28449
11181D141K10794B4264P3316O4794h0828j36919j47328A35789g5865a9231k5306
$$ 4141 214935 24264 97580 162374 -80828 -217747 -365075 135789 -75865 -19231 -44537
11170d4537H2270B4719b2362j5944o1885k00710G9359K21762C4798c57966e853
$$ -44537 82270 24719 -22362 -38306 -100191 -300901 79359 301121 34798 -357966 -5853
11158a46042c7573k92250g2368D5882a12332L7140j00225r6212R1775j40075a25933
$$ -146042 -37573 -329823 -72368 45882 -112332 -75192 -175417 -271629 -179854 -319929 -125933
11146b11411f6668L2786a6307A01325C9851O6734L22411A40204m2541h0736A94940
$$ -211411 -66668 -33882 -16307 101325 39851 106585 428996 140204 97663 -80736 194940
11134A9897O4488L2565a67210j21605H7983K98766a98853H612a17567M0459B06449
$$ 19897 84385 116950 -167210 -288815 87983 386749 -198853 8612 -117567 -77108 206449
11122C03036E1339a67353C51014q4458F9447a71938A46689f1526D1085b6216j86174
$$ 303036 51339 -167353 351014 266556 69447 -171938 146689 -61526 41085 -26216 -212390
11111b12390E5165b37172E231J40206J08487k6870R7473b84308A78565d0797B47598
$$ -212390 55165 -237172 5231 145437 253924 227054 324527 -284308 178565 -40797 247598
11099A95839P6466b1678j68454A21264J86126c2257A06372N9062k8062J83388
$$ 195839 272305 -21678 -190132 121264 307390 -32257 106372 165434 137372 320760
11089C20760j00563c5077B83755I9959J31861K35360B18984M1982J20778m5228
$$ 320760 220197 -35077 283755 99959 231820 467180 218984 260966 381744 336516
11079C36516j02281K74772F6989K10223J38988A33460M33346B04678J72478j46217
$$ 336516 234235 509007 66989 277212 416200 133460 566806 204678 377156 230939
11069B30939J30369p0109A09503M36754Q6849k44170j08860J12962j21226O3179
$$ 230939 361308 291199 109503 546257 633106 388936 280076 393038 271812 334991
11059C34991Q451L15612J2711k81270J38264r0353l2975Q2945J66463j61232L01526
$$ 334991 343442 659054 671765 390495 528759 438406 405431 488376 654839 493607 795133
11048G95133j40570q4996A32420M14199M42963k60560P3643l08089J44090J11348
$$ 795133 654563 569567 132420 546619 989582 729022 802665 494576 638666 750014
11038G50014j96226k43517L05141m832J74182A36184M55252j44627j37507J01670
$$ 750014 553788 310271 615412 610580 784762 136184 591436 446809 309302 410972
11028D10972J98107o6821K31973k72459J9447o2803J36874L46647k73032k42699
$$ 410972 609079 542258 774231 501772 521219 458416 595290 941937 668905 426206
11018D26206q7385J41857j57455L16917A86981O74108C63934L30487j19359j68998
$$ 426206 338821 480678 323223 640140 186981 861089 363934 694421 575062 406064
11008D06064N2372l3779q3085J02319k9768L55256k57467M4232J24877k18417
$$ 406064 458436 424657 341572 443891 414123 769379 511912 556144 681021 462604
10998D62604K02795J84950k66806K18707j61503K28616k23349P6562q4646M5710
$$ 462604 665399 850349 583543 802250 640747 869363 646014 722576 637930 683640
10988F83640j11773J08712J21071j19820M1768K38969k38796K92231k11682J88096
$$ 683640 571867 680579 801650 681830 723598 962567 723771 1016002 804320 992416
10978I92416N15353j03823J85929M78116j80292L84196M80221l95768L40641m02080
$$ 992416 1507769 1403946 1589875 2067991 1887699 2271895 2752116 2356348 2696989 2294909
10968B294909j67192j73544k62928J11435l85197N4299j55620j35881M34946J12241
$$ 2294909 2127717 1954173 1691245 1802680 1417483 1471782 1316162 1180281 1615227 1727468
10958A727468j37731R1610j48291K23117m60419O6128l77233j18621k28615J12526
$$ 1727468 1589737 1681347 1533056 1756173 1295754 1361882 984649 866028 637413 749939
10948G49939m352C34379A19402a82864B9770P32176C72946j43952o6436F1561
$$ 749939 745587 334379 119402 -182864 29770 761946 372946 228994 162558 61561
10937A51672k7199m3907E473K89602J76827F8024J28278G2274i9866B09672g5459
$$ 151672 124473 80566 5473 295075 471902 68024 196302 72274 -99866 209672 -75459
10925F1317b9413A39506n3478a05247j26992k5458H3305d0624A99014K8369n3592
$$ 61317 -29413 139506 86028 -105247 -232239 -257697 83305 -40624 199014 227383 173791
10914A73791b53956A03242i6182e20n6911j9138D49041E8863b2771j19238B32365
$$ 173791 -253956 103242 -96182 -520 -57431 -76569 449041 58863 -22771 -142009 232365
10902a00028K9303a711j95221B204a76113L7019k15960D3136B344a30599p2008
$$ -100028 -70725 -1711 -196932 2204 -176113 -139094 -355054 43136 2344 -130599 -202607
10891b02607A05268h4844A18969N0679a16814F5531a51650P829A5318h007A2648
$$ -202607 105268 -84844 118969 169648 -116814 65531 -151650 -143821 15318 -8007 12648
10879b44134F4394J14843F1960M5843G866M31916H1817f237j51844D46335g187
$$ -244134 64394 179237 61960 107803 7866 439782 81817 -6237 -158081 446335 -7187
10867e0351B9071A4128Q9165f6106A58665B3283N9381A95a33077k5992k52738
$$ -50351 29071 14128 103293 -66106 158665 23283 82664 195 -133077 -159069 -411807
10856d11807J68737f4325B11679a77243O057A1470h6562A64926D1269G94J56074
$$ -411807 -243070 -64325 211679 -177243 -171186 11470 -86562 164926 41269 794 156868
10845A56868F7659A6459Q8289L57080A00774l8864c19382B15287f0906C10037
$$ 156868 67659 16459 104748 461828 100774 61910 -319382 215287 -60906 310037
10834G5382b19189Q2764m1225K2691E9323N0495A7468a61862C14034m2657A08132
$$ 75382 -219189 -136425 -177650 -154959 59323 109818 17468 -161862 314034 271377 108132
10822A05851c19893c5645j03980p1175B1720J51590D1258a0697A15031a99438
$$ 105851 -319893 -35645 -139625 -210800 21720 173310 41258 -10697 115031 -199438
10811A4101a23469j20655e2313C06082A8309O8276J7839m6797a97454A48492g7621
$$ 14101 -123469 -244124 -52313 306082 18309 86585 104424 57627 -197454 148492 -77621
10799E582b25348A51293a975l1168r0208p3628F7953c66762B49956j11710b68440
$$ 5582 -225348 151293 -1975 -33143 -123351 -196979 67953 -366762 249956 138246 -268440
10787A9953h4048O798L1060k3129j40089a964B9988c45096a4422k63712A92100
$$ 19953 -84048 -77250 -46190 -69319 -209408 -1964 29988 -345096 -14422 -278134 192100
10775D6851M9970A3568d1710B38188a71113A43568d09160F8820e5645I1606a35772
$$ 46851 96821 13568 -41710 238188 -171113 143568 -409160 68820 -55645 91606 -135772
10763I3054b63731E275L0543a53170l6569E7287b0585j08226r9104F4485c824
$$ 93054 -263731 5275 35818 -153170 -189739 57287 -20585 -128811 -227915 64485 -3824
10751C2616b73226P8007M7385b3026H493J2409a81225j14665J21459f9696r4919
$$ 32616 -273226 -195219 -147834 -23026 8493 20902 -181225 -295890 -174431 -69696 -164615
10740a64615h1408A06333a62227K8771A42920a04765k0567L1055E3387a10538
$$ -164615 -81408 106333 -162227 -133456 142920 -104765 -125332 -94277 53387 -110538
10729c4240j95820E9824b75351c4524B84047I8738h3293E4646a13582k27239e2413
$$ -34240 -230060 59824 -275351 -34524 284047 98738 -83293 54646 -113582 -340821 -52413
10717E4934c3492B88110a79709f794j17388A10152n3733f8805B14770H0476b92882
$$ 54934 -33492 288110 -179709 -6794 -124182 110152 56419 -68805 214770 80476 -292882
10705i3495C2789b48194i6793a1756j70149A14660b22319A12942f0659j11920
$$ -93495 32789 -248194 -96793 -11756 -181905 114660 -222319 112942 -60659 -172579
10695a72579o7802Q7117k04916i6015C00005E1299J317A3732b84157D57i6789
$$ -172579 -240381 -153264 -358180 -96015 300005 51299 52616 13732 -284157 457 -96789
10683A66348b48351C8531a45392l6581A01213b96837B21193G6272e53237i0373
$$ 166348 -248351 38531 -145392 -181973 101213 -296837 221193 76272 -553237 -90373
10672a67731c0155B6701J19212l131C9613g6800p0969a3654l05727b0159F198
$$ -167731 -30155 26701 145913 142782 39613 -76800 -147769 -13654 -319381 -20159 6198
10660b14197g6165a0784j48532j9056b587k79k6875m2571G8354h7171A13394e3367
$$ -214197 -76165 -10784 -159316 -178372 -2587 -2866 -29741 -72312 78354 -87171 113394 -53367
10647f4979l73034a62264a3576A7032a90853C63499A27697b20155c613l8345a9438
$$ -64979 -438013 -162264 -13576 17032 -190853 363499 127697 -220155 -3613 -41958 -19438
10635C01102j17478C9290m384M3211B3607J68931i9469l2935B82993b6284D9611
$$ 301102 183624 39290 34906 78117 23607 192538 -99469 -132404 282993 -26284 49611
10623b86559J15573j29620a00683A09538b29600b9896j48909A17419b19020A0314
$$ -286559 -170986 -300606 -100683 109538 -229600 -29896 -178805 117419 -219020 10314
10612c32899J02721M8287a9496o1225B66092c83729J6285a4536n5067I6323m2963
$$ -332899 -230178 -181891 -19496 -80721 266092 -383729 -367444 -14536 -69603 96323 53360
10601E3360a22377L5923A70484a30028j7220G7489g0189A86212b14013h3956G4537
$$ 53360 -122377 -86454 170484 -130028 -147248 77489 -70189 186212 -214013 -83956 74537
10589B61208a7669l01796B42899B9073J70921b35916j37024D8203b5485B8556
$$ 261208 -17669 -319465 242899 29073 199994 -235916 -372940 48203 -25485 28556
10578c63922g3423b7320k84244A32804E2780e19424K31745l3897o0549a19404
$$ -363922 -73423 -27320 -311564 132804 52780 -519424 -287679 -321576 -382125 -119404
10567D1395c37069G5644A5317M3912L24304p9510b22082f0554j92558E4239A168
$$ 41395 -337069 75644 15317 59229 383533 304023 -222082 -60554 -253112 54239 1168
10555D2674j5909J27821M5411b53501A15184J72687b99705A03651d40851J80187
$$ 42674 26765 154586 199997 -253501 115184 287871 -299705 103651 -440851 -260664
10545b60664d3704j71303k30595a13752A60379a60785B45838a69303e698I0189
$$ -260664 -43704 -215007 -445602 -113752 160379 -160785 245838 -169303 -5698 90189
10534A93332J96155b15731n8142A74225A3979J85997c15085J03670R1513N2612
$$ 193332 389487 -215731 -273873 174225 13979 199976 -315085 -211415 -119902 -67290
10524f7290C80778b6053G7479c2817a3983m2826A50709b26803M7933O2774k782
$$ -67290 380778 -26053 77479 -32817 -13983 -56809 150709 -226803 -178870 -116096 -118878
10513a18878A40073a70352O5560C28068d02105E7270c3117B19621r6021c63452
$$ -118878 140073 -170352 -104792 328068 -402105 57270 -33117 219621 123600 -363452
10502F3286a40097B47497j14435a54079B71716D6418K15323C0312c84831B2874
$$ 63286 -140097 247497 133062 -154079 271716 46418 261741 30312 -384831 22874
10491B5443J9917M1163a17270C7568a30744L0879A68429J96113j59528J8910R1371
$$ 25443 45360 86523 -117270 37568 -130744 -99865 168429 364542 205014 223924 315295
10480C15295J24740l0522K63318k67324i3026A13036h319F4556b0665F8658O2779
$$ 315295 440035 409513 672831 405507 -93026 113036 -8319 64556 -20665 68658 131437
10469A31437A8862a14737A78131m1505d196m1950p7703r1694D1383a76682e1963
$$ 131437 18862 -114737 178131 136626 -4196 -46146 -123849 -215543 41383 -176682 -51963
10457g540q2783B5159h225B3327K53935I9509a47370L379G5156K40015b96805
$$ -7540 -90323 25159 -8225 23327 277262 99509 -147370 -143991 75156 315171 -296805
10445c12299P6125A00445a73387A67514d934k08500H8361a37571o7592E3437b4166
$$ -312299 -236174 100445 -173387 167514 -4934 -213434 88361 -137571 -205163 53437 -24166
10433d00276A93716d6928o8823j56578A48277M3421a61778A00069b7288H952L9518
$$ -400276 193716 -46928 -115751 -272329 148277 191698 -161778 100069 -27288 8952 48470
10422D8470K56735a8008j20656f7861A28239a77243k6684b1322k5376k23611A2881
$$ 48470 305205 -18008 -138664 -67861 128239 -177243 -203927 -21322 -46698 -270309 12881
10410I0067a83941A1589a35704c1406g473k7686A39123A0588c5586B56434A15389
$$ 90067 -183941 11589 -135704 -31406 -7473 -35159 139123 10588 -35586 256434 115389
10398I7005b99679I5825J04918J8310g9743j65714D99616k32559M2081g602G4813
$$ 97005 -299679 95825 200743 219053 -79743 -245457 499616 267057 309138 -7602 74813
10386c4365B62860j04274a41618A96950a34695A96393r2917a28186F22033j74109
$$ -34365 262860 158586 -141618 196950 -134695 196393 103476 -128186 622033 447924
10376D47924c2385H2495d7220D32919C9714b5922A32963M9554C0888M4973P22716
$$ 447924 -32385 82495 -47220 432919 39714 -25922 132963 182517 30888 75861 798577
10365G98577k62085r2058r3488J38472A42904R6262R1135b50419O2502R1875A11390
$$ 798577 536492 444434 350946 489418 142904 239166 330301 -250419 -187917 -96042 111390
10353D23032b6133B63592J42899K14637p8396j97816A45421K99702A93205M6092
$$ 423032 -26133 263592 406491 621128 542732 344916 145421 445123 193205 239297
10343B39297R4191H3969K32515a37327F9986A0920Q1267Q5214F0617K8647C2146
$$ 239297 333488 83969 316484 -137327 69986 10920 92187 177401 60617 89264 32146
10331D62477B23469O2145g2696g861D09826a06968j1184B20416l7480K17254A81115
$$ 462477 223469 285614 -72696 -7861 409826 -106968 -118152 220416 182936 400190 181115
10319C24992j54692m2728Q4684B1706M9421K3119K4620N3606R5020F2254b46737
$$ 324992 170300 127572 212256 21706 71127 94246 118866 172472 267492 62254 -246737
10307A5720b95627D422a48338H7145K8364f3519B61146c2695G1526N2563b30655
$$ 15720 -295627 4422 -148338 87145 115509 -63519 261146 -32695 71526 124089 -230655
10295B5160O7660a07913A15676B1669d9940A8198J78905c81114D3453c56023a26056
$$ 25160 92820 -107913 115676 21669 -49940 18198 197103 -381114 43453 -356023 -126056
10283h8951I8338D3330J07391J504P4574a06944c0743B669a07147A06594g2757
$$ -88951 98338 43330 150721 152225 226799 -106944 -30743 2669 -107147 106594 -72757
10271i1635C7839b3717q1473j03271A91422E0469d4175k92196h5512C14982A50110
$$ -91635 37839 -23717 -105190 -208461 191422 50469 -44175 -336371 -85512 314982 150110
10259C67025d3159A20031K3765Q4746c0257j05966N8292C1076f8946j164o246
$$ 367025 -43159 120031 143796 228542 -30257 -136223 -77931 31076 -68946 -70110 -76356
10248g6356j80838C2973L26139a01649c8418C79428A58734a46452I9351A0840
$$ -76356 -257194 32973 359112 -101649 -38418 379428 158734 -146452 99351 10840
10237b74924E7734k3657j5918J65481j0237G3540L9479e8580j64810n599B26050
$$ -274924 57734 34077 18159 183640 173403 73540 113019 -58580 -223390 -228989 226050
10225a49598k67212a67283D3192f6390a9547j35381f6239A58919J94778a75603
$$ -149598 -416810 -167283 43192 -66390 -19547 -154928 -66239 158919 353697 -175603
10214D202J44350A3348e06264A27551b2121B69955d88440I2540k0945e2497H7557
$$ 4202 148552 13348 -506264 127551 -22121 269955 -488440 92540 71595 -52497 87557
10202a99834A29351b31533k29011C6946a184p6770E03236G780J35590H695b9666
$$ -199834 129351 -231533 -460544 36946 -1184 -77954 503236 7780 143370 8695 -29666
10190a65080N8868J6099l95114J72508b1276l25309C7076P8001K9528d6482C40
$$ -165080 -106212 -90113 -485227 -312719 -21276 -346585 37076 115077 144605 -46482 340
10178a73669Q6252I7325d67164J43039i904B21171g6918L1117k2531j34146A85486
$$ -173669 -87417 97325 -467164 -324125 -9904 221171 -76918 -45801 -68332 -202478 185486
10166b35082C4104i1633l07415a04353l2903b4697j12586n1120M987b3366A18605
$$ -235082 34104 -91633 -399048 -104353 -137256 -24697 -137283 -188403 -183416 -23366 118605
10154A92104b9139C241i5948k57993g4495G7495c37098a6901D3711J90237f1216
$$ 192104 -29139 3241 -95948 -353941 -74495 77495 -337098 -16901 43711 233948 -61216
10142a87549D216e9811l48587d4032A3401R6941b1603B5931K58339G6886c67697
$$ -187549 4216 -59811 -408398 -44032 13401 110342 -21603 25931 284270 76886 -367697
10130A55666g8490j01924c0824q5545j74695b4944q1161l183n730I3217J34622
$$ 155666 -78490 -180414 -30824 -116369 -291064 -24944 -106105 -109288 -115018 93217 227839
10119B27839f9732j40037k26363i9621M7296j50621p5205R4577E4794a71505d2769
$$ 227839 -69732 -209769 -436132 -99621 -52325 -202946 -278151 -183574 54794 -171505 -42769
10107D0589q597b88888a39063n0082b7193o6280C17853C7873a5010j17542F5398
$$ 40589 31992 -288888 -139063 -189145 -27193 -93473 317853 37873 -15010 -132552 65398
10095i0061B16742a57735G928J95282e9032j95533c0099k16408D5517c23076J38042
$$ -90061 216742 -157735 7928 203210 -59032 -254565 -30099 -246507 45517 -323076 -185034
10084a85034A96671h37j17665a889l16716b1048D1676Q8483C0426b15862d0571
$$ -185034 196671 -837 -118502 -1889 -318605 -21048 41676 130159 30426 -215862 -40571
10072a74573L7663j08674f749l00134a812B5467b73697d7166B13251g1516j44708
$$ -174573 -136910 -245584 -6749 -306883 -1812 25467 -273697 -47166 213251 -71516 -216224
10061b16224K5060d8790A59317C7732b17536A48173a65036L1453B3842a87231
$$ -216224 -191164 -48790 159317 37732 -217536 148173 -165036 -133583 23842 -187231
10050A3950b85088g276A98142n5452a30811r5256a6796k03926A7934b95595c2201
$$ 13950 -285088 -7276 198142 142690 -130811 -226067 -16796 -220722 17934 -295595 -32201
10038D27930B12717D1094j8508a06660A03658l0246g3479l2906A07257b00707
$$ 427930 212717 41094 22586 -106660 103658 73412 -73479 -106385 107257 -200707
10027c50687B5893a37300d1941r1670a9736j15265j56531B2282K89210a25741
$$ -350687 25893 -137300 -41941 -133611 -19736 -135001 -291532 22282 311492 -125741
10016a37924F0c37779A26678a66973c1364j2934l47077A15868l4125a48953f7112
$$ -137924 60 -337779 126678 -166973 -31364 -44298 -391375 115868 81743 -148953 -67112
10004b43214D2658a44184p467m13517b5242j29277g1435j38791Q1148k03167A32475
$$ -243214 42658 -144184 -151651 -565168 -25242 -154519 -71435 -210226 -129078 -332245 132475
9992b40234A35316c84005F0334Q2860a39825N3470C2335b17464N4188h1306A9242
$$ -240234 135316 -384005 60334 143194 -139825 -86355 32335 -217464 -163276 -81306 19242
9980a39664A98659L6191d34667i7436E2375i9127A18703B7672E352b09220j12257
$$ -139664 198659 234850 -434667 -97436 52375 -99127 118703 27672 5352 -209220 -321477
9969c21477O5374c0265M010k78003M0591R8349g5026j65516A54287L1415a27906
$$ -321477 -256103 -30265 -26255 -304258 -263667 -165318 -75026 -240542 154287 185702 -127906
9957a47326j62448a32073D818a10049A3357f3770j72491M8141K0056j84603a52598
$$ -147326 -309774 -132073 4818 -110049 13357 -63770 -236261 -188120 -168064 -352667 -152598
9945E632K1732b8690k44462a7769k29672H656b48788J24040I5676K4097g8531
$$ 5632 27364 -28690 -273152 -17769 -247441 8656 -248788 -124748 95676 119773 -78531
9933d3249J7053k2151k5213b8399B2608J39064h8771n4770g493j19054A94183
$$ -43249 -26196 -48347 -73560 -28399 22608 161672 -88771 -143541 -7493 -126547 194183
9921b31816h6265j78606i8125A14553D9224b3054C0690J36736f054l3505H8948
$$ -231816 -86265 -264871 -98125 114553 49224 -23054 30690 167426 -6054 -39559 88948
9909d8707A5849c47244A40420P7068h9137l65049I4909b84902j0994B23805b40839
$$ -48707 15849 -347244 140420 217488 -89137 -454186 94909 -284902 -295896 223805 -240839
9897A74493h7442p7202k1736L7127H2928l8206e2972m39154g0690p3901A35757
$$ 174493 -87442 -164644 -186380 -149253 82928 44722 -52972 -492126 -70690 -144591 135757
9885E6238f6281a0305D4744c24480h6535j6297C41760c37263b9319q7877l8625
$$ 56238 -66281 -10305 44744 -324480 -86535 -102832 341760 -337263 -29319 -117196 -155821
9874a55821e4143b4296F4197a82506h2012n0574j39000E4955J0089J42486d7540
$$ -155821 -54143 -24296 64197 -182506 -82012 -132586 -271586 54955 65044 207530 -47540
9862g7941C6574Q4246b26596A98741k8673F5460K326j4321d09843E6040c02559
$$ -77941 36574 120820 -226596 198741 170068 65460 67786 53465 -409843 56040 -302559
9850d11875a40502r9593P2665P8604c7305l3928K6372F7707g9142k5075E6218
$$ -411875 -140502 -240095 -167430 -88826 -37305 -71233 -44861 67707 -79142 -104217 56218
9838c72254m77974C6127K51423b21670G9061a77904B36690i7468d2394k41992
$$ -372254 -850228 36127 287550 -221670 79061 -177904 236690 -97468 -42394 -284386
9828b84386B68155b81138A34851J34734C4348a08014H9806I601a67099B05376
$$ -284386 268155 -281138 134851 269585 34348 -108014 89806 9601 -167099 205376
9817a01392p2366a9645l63573J84539P3119I8585b94805H1420c21220R0575R8573
$$ -101392 -173758 -19645 -383218 -198679 -125560 98585 -294805 81420 -321220 -230645 -132072
9806a32072N4379A37207a21185j4188b2953A90963I918b52964e0442A78497f6338
$$ -132072 -77693 137207 -121185 -135373 -22953 190963 9918 -252964 -50442 178497 -66338
9794A20810C3852c76439A3763c88664B75833G6080J50854e629k88266A39806b90161
$$ 120810 33852 -376439 13763 -388664 275833 76080 226934 -5629 -293895 139806 -290161
9782B47510p3306b00278L5589A12687a15762m13034B00441a19286r2943d3360
$$ 247510 174204 -200278 -164689 112687 -115762 -528796 200441 -119286 -212229 -43360
9771H5983a96353m4075f6723A37494e5323E1053a39660k67794i891k5293j46112
$$ 85983 -196353 -240428 -66723 137494 -55323 51053 -139660 -407454 -9891 -35184 -181296
9760a81296A32163b38160i2199K1223A9287K6512M6221a87379G4201d57868G0096
$$ -181296 132163 -238160 -92199 -70976 19287 45799 92020 -187379 74201 -457868 70096
9748B6755a19230A66470a70402O538a1825E930M1155J97389b39037B23662E6046
$$ 26755 -119230 166470 -170402 -163864 -11825 5930 47085 244474 -239037 223662 56046
9736a93164b9459k37592r1695c2118k95320B14132H1640a45128l6663Q1840J8884
$$ -193164 -29459 -267051 -358746 -32118 -327438 214132 81640 -145128 -181791 -99951 -81067
9725h1067k00327F8573b09892a00854l5170B23692a04741c348l41187A1804a10612
$$ -81067 -281394 68573 -209892 -100854 -136024 223692 -104741 -3348 -344535 11804 -110612
9713a22398j135a6835l1954q9494M3530A51479K06361a86839Q3467j5295J456
$$ -122398 -123533 -16835 -48789 -138283 -94753 151479 357840 -186839 -103372 -118667 -117211
9702a17211j73955H4305a02925c2859I3620a29959O1958A61344A4313J50088a50111
$$ -117211 -291166 84305 -102925 -32859 93620 -129959 -68001 161344 14313 164401 -150111
9690A1087a20623K4364B42011H8513a84932r9281d6470k68391f145A86480e1765
$$ 11087 -120623 -96259 242011 88513 -184932 -284213 -46470 -314861 -6145 186480 -51765
9678h6966j70457k53757a61543n8469P0666k50169C53428f6824A92627a04026
$$ -86966 -257423 -511180 -161543 -220012 -149346 -399515 353428 -66824 192627 -104026
9667a97423f449A40265m4436b70404l3557D6988n544R2400E9947a53429r2602
$$ -197423 -6449 140265 95829 -270404 -303961 46988 41444 133844 59947 -153429 -246031
9656b46031B88707b66186l2897d0942I6798a66925h869E8846c68130B4108R2354
$$ -246031 288707 -266186 -299083 -40942 96798 -166925 -8869 58846 -368130 24108 116462
9645A16462D3642L829b0569B9568a77201O1050D5949a89778K9372a1623B2945
$$ 116462 43642 47471 -20569 29568 -177201 -116151 45949 -189778 -160406 -11623 22945
9633c57810D0771b65766A91603B5686a45080e7415a1729k16320o7A84b07400j9479
$$ -357810 40771 -265766 191603 25686 -145080 -57415 -11729 -228049 -228116 184 -207400 -226879
9621b26879A36357a2203J018j87656f2992q0833j3849M7080k4895e273l956k04774
$$ -226879 136357 -12203 -11185 -198841 -62992 -143825 -157674 -110594 -135489 -5273 -9229 -214003
9609b14003d1237A3774J12683c8048B65056q3882c1878D6241a18848B48047B6955
$$ -214003 -41237 13774 126457 -38048 265056 181174 -31878 46241 -118848 248047 26955
9597b33571g4176B34270A00962C9281a74044f8182j60394G6987c02220A39637
$$ -233571 -74176 234270 100962 39281 -174044 -68182 -228576 76987 -302220 139637
9586H6167B1338d60143a17790K1083A07078a15761h792F340c10204Q3534a06304
$$ 86167 21338 -460143 -117790 -96707 107078 -115761 -8792 6340 -310204 -226670 -106304
9574A29536b27115G9701a68981L0241c0843C83071a92616f3081j66284C34112
$$ 129536 -227115 79701 -168981 -138740 -30843 383071 -192616 -63081 -229365 334112
9563a09785K6356G9737Q6508m5321a34423L8109A92418m0091b26590r0333a09418
$$ -109785 -83429 79737 166245 120924 -134423 -96314 192418 152327 -226590 -316923 -109418
9551a63414j06782b3362k74622B70639b20057B04915d7351b2762k85981B33754
$$ -163414 -270196 -23362 -297984 270639 -220057 204915 -47351 -22762 -308743 233754
9540d1391m23207A2768h7691b4784B20944r6280C2255a16635q2615a1113j90029
$$ -41391 -464598 12768 -87691 -24784 220944 124664 32255 -116635 -199250 -11113 -201142
9529b01142j38478M5839q4282J50594E7164d65338J34562J34906A42965a38198
$$ -201142 -339620 -293781 -378063 -227469 57164 -465338 -330776 -195870 142965 -138198
9518a9517N78l97246B59904a28130G3958j7251M6759j8731h0055D7710a22127
$$ -19517 -18939 -416185 259904 -128130 73958 56707 103466 84735 -80055 47710 -122127
9506b6068j6147E4228b09174R7343N104l1874I4654c15941A58959a75981k55412
$$ -26068 -42215 54228 -209174 -111831 -106727 -138601 94654 -315941 158959 -175981 -431393
9495d31393e1804j19493d7268H6699a6588A36751a13377A72932m7105a98516A008
$$ -431393 -51804 -171297 -47268 86699 -16588 136751 -113377 172932 125827 -198516 1008
9483B29551A8239O2136a34372B12163j03654J7554b57942A78288b13290i5939
$$ 229551 18239 80375 -134372 212163 108509 126063 -257942 178288 -213290 -95939
9472d1459D149a40313A79589i9853q5440A36387c7486m3607r3241f3227l9013
$$ -41459 4149 -140313 179589 -99853 -185293 136387 -37486 -81093 -174334 -63227 -102240
9461a02240F9783J7561l4486i3781c5089j58910j02950a23838m5349G512P6222
$$ -102240 69783 87344 52858 -93781 -35089 -193999 -296949 -123838 -169187 7512 83734
9450H3734a22375B44490M0090G8495A4167N3798a83949B14412C0166g9767q4575
$$ 83734 -122375 244490 284580 78495 14167 67965 -183949 214412 30166 -79767 -164342
9439a64342e9692I3803a95476j27096M1193a26875j47396A17193d5363p5575J8815
$$ -164342 -59692 93803 -195476 -322572 -281379 -126875 -274271 117193 -45363 -120938 -102123
9428a02123A99264a8308j65987K1169g5316k0294j66341A7444b02716A63000b8636
$$ -102123 199264 -18308 -184295 -163126 -75316 -95610 -261951 17444 -202716 163000 -28636
9416a9975j37757A6609a36870A69662B4486c15423C427f2251n1211G265J61103
$$ -19975 -157732 16609 -136870 169662 24486 -315423 3427 -62251 -113462 7265 168368
9405A68368k6773A8502P817f11074g4523G4806a7352k52109J29757r5841C7562
$$ 168368 141595 18502 26319 -611074 -74523 74806 -17352 -269461 -139704 -235545 37562
9393b02869O0527M1249a2663A60602a13844o1902l139L3437P1773B64552r602
$$ -202869 -142342 -101093 -12663 160602 -113844 -175746 -178885 -145448 -73675 264552 254950
9382B54950D2335a87897j1345l8762D5634b34777N6544K5451I1907c33965A5284
$$ 254950 42335 -187897 -199242 -238004 45634 -234777 -178233 -152782 91907 -333965 15284
9370c11855K1638J43961j37423m404J17878N8406I3018a80687A56766b87798Q3052
$$ -311855 -290217 -146256 -283679 -288083 -170205 -111799 93018 -180687 156766 -287798 -204746
9359b04746k5640H5031a04609M5352j34862j77481B5073c02630f7061b2529J1112
$$ -204746 -230386 85031 -104609 -59257 -194119 -371600 25073 -302630 -67061 -22529 -11417
9348a1417C57552L19797b95433C1817J15928b18889e2419j29566e0427B3035g0937
$$ -11417 357552 677349 -295433 31817 147745 -218889 -52419 -181985 -50427 23035 -70937
9336c9402E9194k2808J52115b42867p1858J43859f7114B2021J88680b85028e6553
$$ -39402 59194 36386 188501 -242867 -314725 -170866 -67114 22021 210701 -285028 -56553
9324D7111b32693a0696j97439j07123e7280J0738A64844b81249g5942j42780I72
$$ 47111 -232693 -10696 -208135 -315258 -57280 -46542 164844 -281249 -75942 -218722 972
9312D1017a30494B4735K10125r0570f871j76342j9136P4561k00866B56163a38824
$$ 41017 -130494 24735 234860 144290 -6871 -183213 -202349 -127788 -328654 256163 -138824
9300C35468b1100o1217A34718a22918l9316E7509C220J37107R3i0959j35298E5471
$$ 335468 -21100 -82317 134718 -122918 -162234 57509 3220 140327 140420 -90959 -226257 55471
9287a53914B14340d7114j0614n811k76351A26603N2089c34298C03283h8858B00559
$$ -153914 214340 -47114 -57728 -63539 -339890 126603 178692 -334298 303283 -88858 200559
9275B84599B3935P4726d01732a65680a9210B4258b88876B20858h9324a2542A06297
$$ 284599 23935 98661 -401732 -165680 -19210 24258 -288876 220858 -89324 -12542 106297
9263c54429K0403h6468A10829b98267b8475p6802A48590a29884F4569c5714A37552
$$ -354429 -334026 -86468 110829 -298267 -28475 -105277 148590 -129884 64569 -35714 137552
9251A15816P6794f3833A55658b67971e850n6760C2329c6233A95974h2854k50639
$$ 115816 192610 -63833 155658 -267971 -5850 -62610 32329 -36233 195974 -82854 -333493
9240c33493C4209a08545K7452l4856q8117b7683j08807j70667D5920a01034j46401
$$ -333493 34209 -108545 -81093 -115949 -204066 -27683 -136490 -307157 45920 -101034 -247435
9229b47435b9714o1315c5785A27584b87300g5096A78491F2014a54422j13835d4653
$$ -247435 -29714 -91029 -35785 127584 -287300 -75096 178491 62014 -154422 -268257 -44653
9217a22125A96474E4991K0538j8341A7449O0347d19385H6905j676B1899b76496
$$ -122125 196474 54991 75529 57188 17449 77796 -419385 86905 85229 21899 -276496
9205a66510j84243a48914E2995J7570j2328a20152C32814b79296a01906b042q9855
$$ -166510 -350753 -148914 52995 70565 58237 -120152 332814 -279296 -101906 -2042 -91897
9194i1897J4378C3265i9787E3863a15443m06525b01544A1007Q1399a07873b3153
$$ -91897 -77519 33265 -99787 53863 -115443 -521968 -201544 11007 92406 -107873 -23153
9182D91687a36883o2438A4003R5901p643g6065j0503o1752N5557n0774c3959m92574
$$ 491687 -136883 -199321 14003 109904 102261 -76065 -86568 -148320 -92763 -143537 -33959 -526533
9170e26533f4869A34160h5447r1813E6655K01161D7740J16107e0277I7502B0659
$$ -526533 -64869 134160 -85447 -177260 56655 257816 47740 163847 -50277 97502 20659
9158f5409p8765J7527f0636k23703c4131A83171a8276A21267f5716j11903G6406
$$ -65409 -144174 -126647 -60636 -284339 -34131 183171 -18276 121267 -65716 -177619 76406
9146H3094i3399k8123B03605c33733J42404k75826B299a59077B21785C1758b26018
$$ 83094 -93399 -121522 203605 -333733 -191329 -467155 2299 -159077 221785 31758 -226018
9134B5773K58470j26796J3431a39295L1477d6476j15902B3902a24727h761A11661
$$ 25773 284243 157447 170878 -139295 -107818 -46476 -162378 23902 -124727 -8761 111661
9122d11314F2866e6480l3061G5259d9990j28062B88871c41940B75461b09891C3719
$$ -411314 62866 -56480 -89541 75259 -49990 -178052 288871 -341940 275461 -209891 33719
9110E0046b72390R2727a9246n4692p0820A40379a40585N2091J8401I6045a2673
$$ 50046 -272390 -179663 -19246 -73938 -144758 140379 -140585 -88494 -70093 96045 -12673
9098A1584a94167I821a88376h0920b5570l84745B8973J65555j4126A0463f7610
$$ 11584 -194167 9821 -188376 -80920 -25570 -410315 28973 194528 180402 10463 -67610
9086C0989b09669J1348e0833a6496A9736c01815o628A78581b68474I7428K5754
$$ 30989 -209669 -198321 -50833 -16496 19736 -301815 -308443 178581 -268474 97428 123182
9075A23182m494i0883A32252i0115D5252J553a07456j45266B27696g2297j32826
$$ 123182 118688 -90883 132252 -90115 45252 46805 -107456 -252722 227696 -72297 -205123
9064b05123A93886a79928B10995b73609g6300K2313j78483h183k61811c0511o2986
$$ -205123 193886 -179928 210995 -273609 -76300 -53987 -232470 -8183 -269994 -30511 -93497
9053i3497D08694c33030G4323a11236l31012E7422a10164j77532A96359b85363
$$ -93497 408694 -333030 74323 -111236 -442248 57422 -110164 -287696 196359 -285363
9042a78487B06922G4624J4980c73768a20792E0885d57693B2671b50625A87650
$$ -178487 206922 74624 89604 -373768 -120792 50885 -457693 22671 -250625 187650
9031C8190K64043A09795l3936Q2865a10335n7905L2910A18276D5840a05704n882
$$ 38190 302233 109795 75859 158724 -110335 -168240 -135330 118276 45840 -105704 -111586
9020a11586H1050k3377K09307m2453m3102P4493h634l28331D5440j0661b88085
$$ -111586 81050 57673 266980 224527 181425 255918 -8634 -336965 45440 34779 -288085
9008b09420K4017r8755j77k2278b5894j96457J819A75545F4063J27382c918A46723
$$ -209420 -185403 -284158 -284335 -306613 -25894 -222351 -220532 175545 64063 191445 -3918 146723
8995F1841a70495C3194a76615H982K7521O711G430a37703e6406q8226B11798g2626
$$ 61841 -170495 33194 -176615 8982 36503 43214 7430 -137703 -56406 -144632 211798 -72626
8982A9500O3493c72867B06068a96691i4340c9107q6897A12707d5743B4701J69733
$$ 19500 82993 -372867 206068 -196691 -94340 -39107 -126004 112707 -45743 24701 194434
8971A94434f4420r1767l4658j2127j40111e6764j16011n7344l6695H1627c9660
$$ 194434 -64420 -156187 -190845 -202972 -343083 -56764 -172775 -230119 -266814 81627 -39660
8959E2627B2048j0028c97764E1363b41046A95528a80333A3140L5953d3405b965
$$ 52627 22048 12020 -397764 51363 -241046 195528 -180333 13140 49093 -43405 -2965
8947A9676P3897a8403B6073J4726J05131R4875c47281i9137q40j53146G2314r779
$$ 19676 93573 -18403 26073 40799 145930 240805 -347281 -99137 -99977 -253123 72314 62535
8935F2535M83030q3476b15768A31463F3762O5597b25622h0911H0937N9288Q2890
$$ 62535 545565 462089 -215768 131463 63762 129359 -225622 -80911 80937 140225 223115
8924B23115J371007J537992Q845765J2463537F183230A879284E37279M85781l72995
$$ 223115 1594122 3132114 11977879 24441416 6183230 1879284 537279 1023060 650065
8915F50065A25351E7628K09911d34751J00211A85418L5263N68528B330L81919
$$ 650065 125351 57628 267539 -434751 -334540 185418 220681 789209 2330 384249
8905C84249o0178a6711j73919B9119b33528D58b58769A93087g6037j78502I5615
$$ 384249 324071 -16711 -190630 29119 -233528 458 -258769 193087 -76037 -254539 95615
8893H8176c6064I9751a07210c4550B96400E2222c42709A30276f0076p6153c389
$$ 88176 -36064 99751 -107210 -34550 296400 52222 -342709 130276 -60076 -136229 -3389
8881E6684a93146c4390j88011A41055c05752f3692H4298c811A10187D6430J75619
$$ 56684 -193146 -34390 -222401 141055 -305752 -63692 84298 -3811 110187 46430 222049
8870B22049a57125A96454a1570C63716f7126K3971l23729h8191C9168i3301C4330
$$ 222049 -157125 196454 -11570 363716 -67126 -43155 -366884 -88191 39168 -93301 34330
8858e7304r0089Q985M7343B1194d8219j17005n4964B65438D8630R2937c3090j33285
$$ -57304 -147393 -138408 -91065 21194 -48219 -165224 -220188 265438 48630 141567 -33090 -166375
8846a66375I7177k1407c1260o7130k53884A93479h5391B3540c43079a48045B43324
$$ -166375 97177 75770 -31260 -98390 -352274 193479 -85391 23540 -343079 -148045 243324
$$ [...]
##END NTUPLES=NMR SPECTRUM
##END=
