##TITLE=AC1298_ECUAH12110_6666759_k2qTeoWIL1
##JCAMPDX= 6.0         $$ Bruker NMR JCAMP-DX V2.0
##DATA TYPE= NMR SPECTRUM
##DATA CLASS= NTUPLES
##ORIGIN= BRUKER
##OWNER= Administrator
$$ 1.72 TOPSPIN		Version 2.1
$$ 2013-07-18 15:51:57.608 -0700  Administrator@X
$$ Compression mode = diff/dup
##.OBSERVE FREQUENCY= 400.02188249412
##.OBSERVE NUCLEUS= ^1H
##.ACQUISITION MODE= SIMULTANEOUS (DQD)
##.ACQUISITION SCHEME= undefined
##.AVERAGES= 64
##.DIGITISER RES= 22
##SPECTROMETER/DATA SYSTEM= spect
##.PULSE SEQUENCE= noesygpps1d.comp
##.SOLVENT NAME= COFFEE_meoh
##.SHIFT REFERENCE= INTERNAL, COFFEE_meoh, 1, 14.96099
##AUDIT TRAIL= $$ (NUMBER, WHEN, WHO, WHERE, PROCESS, VERSION, WHAT)
$$ ##TITLE= Audit trail, TOPSPIN		Version 2.1
$$ ##JCAMPDX= 5.01
$$ ##ORIGIN= Bruker BioSpin GmbH
$$ ##OWNER= Administrator
$$ $$ E:\/data/COFFEE/nmr/AC1298_ECUAH12110_6666759_k2qTeoWIL1/12/pdata/1/auditp.txt
$$ ##AUDIT TRAIL=  $$ (NUMBER, WHEN, WHO, WHERE, PROCESS, VERSION, WHAT)
(   1,<2013-07-18 15:51:52.796 -0700>,<Administrator>,<X>,<go>,<TOPSPIN 2.1>,
      <created by zg
	started at 2013-07-18 15:40:22.874 -0700,
	POWCHK enabled, PULCHK disabled,
       configuration hash MD5:
       C8 4E 4E 5D D3 5C D8 9E 9F 52 82 E0 59 8A DE 15
       data hash MD5: 64K
       9D 86 D4 65 54 D8 B8 06 F8 E6 5E 05 01 62 17 06>)
(   2,<2013-07-18 15:51:55.749 -0700>,<Administrator>,<X>,<proc1d>,<TOPSPIN 2.1>,
      <Start of raw data processing
       efp LB = 0.3 FT_mod = 6 PKNL = 1 PHC0 = 0 PHC1 = 0 SI = 128K 
       data hash MD5: 128K
       F1 40 C4 63 AE E3 0F 7C 3D 9A 30 F2 E9 56 31 2B>)
(   3,<2013-07-18 15:51:56.655 -0700>,<Administrator>,<X>,<proc1d>,<TOPSPIN 2.1>,
      <pk PHC0 = -79.07959 PHC1 = 0 
       data hash MD5: 128K
       E7 83 90 FA BB AC 80 EB 87 11 30 29 24 68 9A D3>)
(   4,<2013-07-18 15:51:57.046 -0700>,<Administrator>,<X>,<proc1d>,<TOPSPIN 2.1>,
      <abs ABSG = 1 
       data hash MD5: 128K
       F1 E4 5A 28 D0 9A DF 1F C5 9F 42 42 D1 F1 E1 80>)
(   5,<2013-07-18 15:51:57.171 -0700>,<Administrator>,<X>,<proc1d>,<TOPSPIN 2.1>,
      <abs ABSG = 2 
       data hash MD5: 128K
       2F 00 A1 0C 4E 45 66 8E 41 81 FA BE 80 B8 7E DF>)
(   6,<2013-07-18 15:51:57.249 -0700>,<Administrator>,<X>,<proc1d>,<TOPSPIN 2.1>,
      <abs ABSG = 3 
       data hash MD5: 128K
       6B E6 ED 8A F7 D7 49 90 5B 3C 6E 77 73 37 AC 78>)
(   7,<2013-07-18 15:51:57.327 -0700>,<Administrator>,<X>,<proc1d>,<TOPSPIN 2.1>,
      <abs ABSG = 4 
       data hash MD5: 128K
       E4 EB 83 45 EE 32 14 9C EC 77 09 13 18 0A AA 83>)
(   8,<2013-07-18 15:51:57.405 -0700>,<Administrator>,<X>,<proc1d>,<TOPSPIN 2.1>,
      <abs ABSG = 5 
       data hash MD5: 128K
       13 36 A6 E3 67 E3 7B 81 AC A3 D6 DF B1 D1 F0 E7>)
$$ ##END=
$$ 
$$ $$ hash MD5
$$ $$ A3 89 4C FC 42 DE 82 47 B3 84 2E 28 DD DC 6A C6
##$RELAX= 
##$RELAX= 
##$RELAX= 
##$RELAX= 
##$RELAX= 
##$RELAX= 
##$RELAX= 
##$RELAX= 
$$ Bruker specific parameters
$$ --------------------------
##$DU= <E:\>
##$EXPNO= 12
$$ [...]
##$TP07= 0
##$TPNAME0= <>
##$TPNAME1= <>
##$TPNAME2= <>
##$TPNAME3= <>
##$TPNAME4= <>
##$TPNAME5= <>
##$TPNAME6= <>
##$TPNAME7= <>
##$TPOAL= (0..7)
0.5 0.5 0.5 0.5 0.5 0.5 0.5 0.5
##$TPOFFS= (0..7)
0 0 0 0 0 0 0 0
##$TUNHIN= 0
##$TUNHOUT= 0
##$TUNXOUT= 0
##$USERA1= <user>
##$USERA2= <user>
##$USERA3= <user>
##$USERA4= <user>
##$USERA5= <user>
##$V9= 5
##$VALIST= <valist>
##$VCLIST= <CCCCCCCCCCCCCCC>
##$VD= 0
##$VDLIST= <DDDDDDDDDDDDDDD>
##$VPLIST= <PPPPPPPPPPPPPPP>
##$VTLIST= <TTTTTTTTTTTTTTT>
##$WBST= 1024
##$WBSW= 4
##$XGAIN= (0..3)
0 0 0 0
##$XL= 0
##$YL= 0
##$YMAX_a= 5865208
##$YMIN_a= -12279119
##$ZGOPTNS= <>
##$ZL1= 120
##$ZL2= 120
##$ZL3= 120
##$ZL4= 120
##$ABSF1= 14.96099
##$ABSF2= -5.597192
##$ABSG= 5
##$ABSL= 3
##$ALPHA= 0
##$AQORDER= 0
##$ASSFAC= 0
##$ASSFACI= 0
##$ASSFACX= 0
##$ASSWID= 0
##$AUNMP= <proc_prof1d_extract.lims>
##$AXLEFT= 0
##$AXNAME= <>
##$AXNUC= <1H>
##$AXRIGHT= 0
##$AXTYPE= 0
##$AXUNIT= <>
##$AZFE= 0.1
##$AZFW= 0.1
##$BCFW= 0
##$BC_mod= 0
##$BYTORDP= 0
##$COROFFS= 0
##$CY= 15
##$DATMOD= 1
##$DC= 0
##$DFILT= <>
##$DTYPP= 0
##$F1P= 0
##$F2P= 0
##$FCOR= 0.5
##$FTSIZE= 131072
##$FT_mod= 6
##$GAMMA= 0
##$GB= 0
##$INTBC= 1
##$INTSCL= 1
##$ISEN= 128
##$LB= 0.3
##$LEV0= 0
##$LPBIN= 0
##$MAXI= 10000
##$MC2= 0
##$MEAN= 0
##$ME_mod= 0
##$MI= 0
##$NCOEF= 0
##$NC_proc= -2
##$NLEV= 6
##$NOISF1= 0
##$NOISF2= 0
##$NSP= 0
##$NTH_PI= 0
##$NZP= 0
##$OFFSET= 14.96099
##$PC= 1
##$PHC0= -79.07959
##$PHC1= 0
##$PH_mod= 1
##$PKNL= yes
##$PPARMOD= 0
##$PPDIAG= 0
##$PPIPTYP= 0
##$PPMPNUM= 2147483647
##$PPRESOL= 1
##$PSCAL= 4
##$PSIGN= 0
##$PYNMP= <proc.py>
##$REVERSE= no
##$SF= 400.020009641146
##$SI= 131072
##$SIGF1= 0
##$SIGF2= 0
##$SINO= 400
##$SIOLD= 131072
##$SPECTYP= <>
##$SREGLST= <1H.CDCl3>
##$SSB= 0
##$STSI= 131072
##$STSR= 0
##$SW_p= 8223.68421052631
##$SYMM= 0
##$S_DEV= 0
##$TDeff= 65536
##$TDoff= 0
##$TI= <>
##$TILT= no
##$TM1= 0
##$TM2= 0
##$TOPLEV= 0
##$USERP1= <user>
##$USERP2= <user>
##$USERP3= <user>
##$USERP4= <user>
##$USERP5= <user>
##$WDW= 1
##$XDIM= 131072
##$YMAX_p= 430217794
##$YMIN_p= -11007
##$CURPLOT= <Network HP LaserJet P1505>
##$CURPRIN= <$Network HP LaserJet P1505>
##$DFORMAT= <normdp>
##$LAYOUT= <+/1D_H.xwp>
##$LFORMAT= <normlp>
##$PFORMAT= <normpl>
##$SURQMSG= 1
$$ End of Bruker specific parameters
$$ ---------------------------------
##NTUPLES= NMR SPECTRUM
##VAR_NAME=  FREQUENCY,     SPECTRUM/REAL,   SPECTRUM/IMAG
##SYMBOL=    X,             R,               I
##VAR_TYPE=  INDEPENDENT,   DEPENDENT,       DEPENDENT
##VAR_FORM=  AFFN,          ASDF,            ASDF
##VAR_DIM=   131072,        131072,          131072
##UNITS=     HZ,            ARBITRARY UNITS, ARBITRARY UNITS
##FACTOR=    0.0627417313425164, 1,          1
##FIRST=     8223.62146879497, -2437,        -64484
##LAST=      0,             912,             -65411
##MIN=       0,             -11007,          0
##MAX=       8223.62146879497, 430217794,    0
$$ Real data points
##PAGE= N=1
##DATA TABLE= (X++(R..R)), XYDATA
$$ [...]
61741D74209n004o264o240n026l902l444k980k128j410j000k99O78R81M91M59
61726D39121J415K051J298J45K6O09P08M12P15J607K092J829J512J620J780J372
61710D58312J45j618l140l722l577l569l909l988l782m206n434o097n192l712
61696D06511l182l529l687l445l347l295k794k188k304k984l282l009k875l119
61682C63471l116k558j978j820j705j059l6N39O9j063j733j276l03J52O5J61M03
61665C48213Nq61q55L69J367J143P84J468K224J451k46p22O36K322L062L071K883
61648C66314K497K007J870K094K163K042K372L356M250M226L258J975J125J117
61634D00666J576J567P22k05m91o71j692l312m355m353l911l545l192k820k606
$$ y = [474209, 469205, 462941, 456701, 451675, 447773, 444329, 441349, 439221, 437811, 436811, 436512, 437190, 438171, 438662, 439121, 440536, 442587, 443885, 444030, 444056, 444665, 445373, 445785, 446500, 448107, 450199, 452028, 453540, 455160, 456940, 458312, 458457, 456839, 453699, 449977, 446400, 442831, 438922, 434934, 431152, 426946, 421512, 415415, 410223, 406511, 403329, 399800, 396113, 392668, 389321, 386026, 383232, 381044, 378740, 375756, 372474, 369465, 366590, 363471, 360355, 357797, 355819, 353999, 352294, 351235, 351199, 351738, 351807, 350744, 349011, 347735, 347432, 347584, 347649, 347810, 348213, 348218, 347357, 346502, 346871, 348238, 349381, 350165, 351633, 353857, 355308, 355062, 354340, 354976, 357298, 360360, 363431, 366314, 368811, 370818, 372688, 374782, 376945, 378987, 381359, 384715, 388965, 393191, 396449, 398424, 399549, 400666, 402242, 403809, 404531, 404326, 403835, 403164, 401472, 398160, 393805, 389452, 385541, 381996, 378804, 375984, 373378]
61619C73378k428k066j803j972k005r79Q21J923J430j07j684k818l342l229k959
61604C52160l245m013m394m002l467l377l394k963k244j813j883k273k852l502
61590C08738l889l682k972k190j688j502j450j385j287j145p85j24M51L79k73
61575B87196p30n28j32j47l97l54m1J18N8Q2K70M55N91O90O48N74R19J752K282
61556B93306J810P89K33M17Q46J243J647J799J423R54J093J597J491O10k7L18
61540C09549J117J437J154Q35R05J350J880K099J725R15K20N1K89M42P2q38j781
61523C21421k120j747j226j117j406j750j941j860j368o18j02l5j4K67M28K7o01
61506C06238p33k15N27J197J769K114K028J594J139R57J205J817K355K368K052
$$ y = [373378, 370950, 368884, 367081, 365109, 363104, 362125, 362946, 364869, 366299, 366192, 364508, 361690, 358348, 355119, 352160, 348915, 344902, 340508, 336506, 333039, 329662, 326268, 323305, 321061, 319248, 317365, 315092, 312240, 308738, 304849, 301167, 298195, 296005, 294317, 292815, 291365, 289980, 288693, 287548, 286763, 286639, 287090, 287469, 287196, 286466, 285938, 285806, 285659, 285262, 284908, 284867, 284985, 285043, 285125, 285395, 285850, 286441, 287131, 287779, 288353, 289272, 291024, 293306, 295116, 295905, 296138, 296555, 297401, 298644, 300291, 302090, 303513, 304467, 305560, 307157, 308648, 309258, 309231, 309549, 310666, 312103, 313257, 314092, 314997, 316347, 318227, 320326, 322051, 322966, 323186, 323237, 323526, 323968, 324040, 323202, 321421, 319301, 317554, 316328, 315211, 313805, 312055, 310114, 308254, 306886, 306268, 306166, 306131, 306117, 306384, 306812, 306839, 306238, 305505, 305290, 305817, 307014, 308783, 310897, 312925, 314519, 315658, 316615, 317820, 319637, 321992, 324360, 326412]
61491C26412J973J983J286j21j024o31K92O73O07O97P84M04j46k95j33O5N54J367
61473C34747J634Q40k2J42O79K69p94j159p75q41j583j953j580j324j556j598
61457C25126j227j175j653j806j152l11J67N12Q35P30K80K95J073J940K428K820
61441C28882L169L000K448K468L271L805L411K864L026L537L692L578L511L172
61427C73834K249J246Q26R77J433K268L299L702L007J934J505J807K245K420K094
61412D04846R75o77j791j663r87r69j767k536k667k252j552p60j26K14M67Q47
61396C89602J172J195J101J223J478J506J220Q79P01O83O49L46l84j353k214k862
61380C94942l327l315k309m03J419K158J703P64J87L41Q55R33K53n06n32n8r0
$$ y = [326412, 328385, 330368, 331654, 331533, 330509, 329878, 330170, 330843, 331450, 332147, 332931, 333335, 333189, 332894, 332761, 332826, 333380, 334747, 336381, 337221, 337199, 337341, 338020, 338289, 337495, 336336, 335561, 334720, 333137, 331184, 329604, 328280, 326724, 325126, 323899, 322724, 321071, 319265, 318113, 317802, 317969, 318481, 319316, 320046, 320326, 320621, 321694, 323634, 326062, 328882, 332051, 335051, 337499, 339967, 343238, 347043, 350454, 353318, 356344, 359881, 363573, 367151, 370662, 373834, 376083, 377329, 378155, 379132, 380565, 382833, 386132, 389834, 392841, 394775, 396280, 398087, 400332, 402752, 404846, 405821, 405144, 403353, 401690, 400703, 399734, 397967, 395431, 392764, 390512, 388960, 388200, 388074, 388288, 388755, 389602, 390774, 391969, 393070, 394293, 395771, 397277, 398497, 399376, 400077, 400760, 401409, 401755, 401371, 400018, 397804, 394942, 391615, 388300, 385991, 385588, 387007, 389165, 390868, 391632, 391819, 392160, 393015, 393948, 394201, 393695, 393163, 393105, 393015]
61363C93015r53j886k083j454k54J216K350K488J822J395J884L003M300N839P612
61348D18294Q954R083P905O014M179L038K777K949L006L003L330L807L837L469
61334D83645L349L529L238K207J207Q14N01l81j492k056j962j635j265p59j75
61319D88765L28P01Q64O86L55M04J070K045K961L780M522N183O064P569R486J1071
61303E45854J1977J2459J2461J1294Q595N057J793n64k055l132m396n993p258
61290E86092p536p230p243p522p282o572o313o573o289n167m450m946n601n011
61276D98357l360j789p29J43R20J493K037K629K859K508K072K023K145K252K799
61261E16359M064N432O306P018P993Q703Q383P252O038M841L477K371K046K044
$$ y = [393015, 392062, 390176, 388093, 386639, 386385, 387601, 389951, 392439, 394261, 395656, 397540, 400543, 404843, 410682, 418294, 427248, 436331, 444236, 450250, 454429, 457467, 460244, 463193, 466199, 469202, 472532, 476339, 480176, 483645, 486994, 490523, 493761, 495968, 497175, 497989, 498490, 498109, 496617, 494561, 492599, 490964, 489699, 488940, 488765, 489093, 489794, 490658, 491344, 491699, 492103, 493173, 495218, 498179, 501959, 506481, 511664, 517728, 525297, 534783, 545854, 557831, 570290, 582751, 594045, 602640, 607697, 609490, 608926, 606871, 603739, 599343, 593350, 586092, 578556, 571326, 564083, 556561, 549279, 542707, 536394, 529821, 523532, 518365, 513915, 508969, 503368, 498357, 494997, 493208, 492479, 492622, 493542, 495035, 497072, 499701, 502560, 505068, 507140, 509163, 511308, 513560, 516359, 520423, 525855, 532161, 539179, 547172, 555875, 564258, 571510, 577548, 582389, 585866, 588237, 590283, 592327]
61247E92327J457L26n29q90j373k312l343m107m588m718m355l779l552l751l893
61232E52920l689l356k986k110l22J913L470L744L415L718M941O129O450O254
61218E80491O205O058N309M573N015O394P075O145M388K842J589M90j55k90m44
61203F35685p45m92O92K241L631N094O821Q493J0119J2145J4188J4871J3697J1841
61189G38281J0231Q209N149K078L10m59j287k141k373k348l017m338n396n854
61175G37045o126o454o814p331p963q134p566o923o866p072p034p068p646q464
61161F35584r039r428r550q783p220o195o349o270m512j820J62J395K843M288
61147E75106M653L889K670P77k253n343o790o742o770p149o557m542k323q26L04
$$ y = [592327, 593784, 594110, 593581, 592691, 591318, 589006, 585663, 581556, 576968, 572250, 567895, 564116, 560564, 556813, 552920, 549231, 545875, 542889, 540779, 540457, 542370, 545840, 549584, 552999, 556717, 561658, 567787, 574237, 580491, 586696, 592754, 598063, 602636, 607651, 614045, 621120, 627265, 631653, 634495, 636084, 636574, 636419, 636129, 635685, 634940, 634448, 635140, 637381, 641012, 646106, 652927, 661420, 671539, 683684, 697872, 712743, 726440, 738281, 748512, 756721, 761870, 763948, 764258, 763799, 762512, 760371, 757998, 755650, 752633, 748295, 742899, 737045, 730919, 724465, 717651, 710320, 702357, 694223, 686657, 679734, 672868, 665796, 658762, 651694, 644048, 635584, 626545, 617117, 607567, 598784, 591564, 585369, 579020, 572750, 568238, 566418, 566580, 567975, 570818, 575106, 579759, 583648, 586318, 587095, 584842, 579499, 572709, 565967, 559197, 552048, 545491, 540949, 538626, 537800, 538104]
61132E38104J422K206K639L261M150M927N842P520R612J1121J2122J3635J5773
61119F32334J7632J9080K0934K3112K4414K4552K4728K5595K6335K6420K6656
61108H91792K7628K8491K8308K7413K6628K6059K5425K4667K3568K1614J8897
61097A170490J6359J4636J3418J2310J1498J1157J1025J0939J1042J1200J1008
61086A305082J0510J0037R289P607N215L028J087j588n366r437j3103j6500j9686
61073A286175k2222k3978k5254k5935k5715k5233k5558k6388k6230k4713k3099
61062A011850k2128k1033j9323j7753j6750j5498j3544j1804j0907r993q259o324
61050H38534m930l529j358J129L128M778O498P952Q753R341J0213J1112J1814
$$ y = [538104, 539526, 541732, 544371, 547632, 551782, 556709, 562551, 570071, 579683, 590804, 602926, 616561, 632334, 649966, 669046, 689980, 713092, 737506, 762058, 786786, 812381, 838716, 865136, 891792, 919420, 947911, 976219, 1003632, 1030260, 1056319, 1081744, 1106411, 1129979, 1151593, 1170490, 1186849, 1201485, 1214903, 1227213, 1238711, 1249868, 1260893, 1271832, 1282874, 1294074, 1305082, 1315592, 1325629, 1334918, 1342525, 1347740, 1350768, 1351855, 1350267, 1344901, 1335464, 1322361, 1305861, 1286175, 1263953, 1239975, 1214721, 1188786, 1163071, 1137838, 1112280, 1085892, 1059662, 1034949, 1011850, 989722, 968689, 949366, 931613, 914863, 899365, 885821, 874017, 863110, 853117, 844858, 838534, 833604, 830075, 828717, 829846, 832974, 837752, 844250, 852202, 860955, 870296, 880509, 891621, 903435]
61037I03435J2755J4120J5366J6399J8046K0552K2906K4592K6484K8993L0916
61026A134564L1415L1613L2692L3932L4367L4899L6969M0449M4847N1241O0712
61015A567700P1883Q2320R1549J00736J10839J23655J43302J73212K12484K58547
61005B936227L12497L78111M57062N50860O67231Q17942J009977J247294J539180
60996I916381J881978K207825K362723K182134J629196Q61510J41928l28017m93058
60987B0362600l96176j03224K92350O22700O78101L39620l15543j056291j651268
60978A8772869j989927k086497k010910j832647j605881j370712j151356r56922
60970E768017p88997o47654n31090m34953l55347k90870k40502k01531j70999
$$ y = [903435, 916190, 930310, 945676, 962075, 980121, 1000673, 1023579, 1048171, 1074655, 1103648, 1134564, 1165979, 1197592, 1230284, 1264216, 1298583, 1333482, 1370451, 1410900, 1455747, 1506988, 1567700, 1639583, 1721903, 1813452, 1914188, 2025027, 2148682, 2291984, 2465196, 2677680, 2936227, 3248724, 3626835, 4083897, 4634757, 5301988, 6119930, 7129907, 8377201, 9916381, 11798359, 14006184, 16368907, 18551041, 20180237, 21041747, 21183675, 20855658, 20362600, 19966424, 19863200, 20155550, 20778250, 21456351, 21795971, 21480428, 20424137, 18772869, 16782942, 14696445, 12685535, 10852888, 9247007, 7876295, 6724939, 5768017, 4979020, 4331366, 3800276, 3365323, 3009976, 2719106, 2478604, 2277073, 2106074]
60961B106074j47499j30058j16522j04511r3281q3284p4445o5918n7332m9138
60951A184086m1771l5269k9883k6369k5262k6046k7280k7548k6420k4551k2895
60940H70792k1799k0935k0011j9168j8548j7881j6869j5782j5160j4981j4539
60929F75119j3329j1703j0482j0098j0259j0317r830q872p871p100o348n335m364
60916E59211m106m616n075m807m172l927m071l981l481l087l128l322l421l665
60902E04352m209m617m376l667l178l259l611l773l652l607m052m940n593n287
60888D46531m096k884k267j953j441j034j552l051m425m563l553k391j737j430
60874D10154j130q75p45m14M81J674K498K748K839L064L291L522M174N375O433
$$ y = [2106074, 1958575, 1828517, 1711995, 1607484, 1514203, 1430919, 1356474, 1290556, 1233224, 1184086, 1142315, 1107046, 1077163, 1050794, 1025532, 999486, 972206, 944658, 918238, 893687, 870792, 848993, 828058, 808047, 788879, 770331, 752450, 735581, 719799, 704639, 689658, 675119, 661790, 650087, 639605, 629507, 619248, 608931, 599101, 590229, 582358, 575258, 568910, 563575, 559211, 555105, 550489, 545414, 540607, 536435, 532508, 528437, 524456, 520975, 517888, 514760, 511438, 508017, 504352, 500143, 495526, 491150, 487483, 484305, 481046, 477435, 473662, 470010, 466403, 462351, 457411, 451818, 446531, 442435, 439551, 437284, 435331, 433890, 432856, 431304, 428253, 423828, 419265, 415712, 413321, 411584, 410154, 409024, 408149, 407404, 406990, 407471, 409145, 411643, 414391, 417230, 420294, 423585, 427107, 431281, 436656, 443089]
60859D43089O570N877N020M237L234J946Q31K85K12K65K67K81L90M69J50p79j914
60842D70430k576k716l053l995n033n625o048o700p184o942o410o510p190p508
60828C92940p062o381n879n373m798m411m066l195j793o84m43q14j428k281l126
60813C41206l227k352j396j340j987k281j617m64K57J43k36P9J261K311K309J667
60797C34333J491J952K288K213K187K229J710P22M76J620L144L680L085K048R08
60782C64086k75j114j329j437k153l318m049l866l164k643k656k961k928k180
60768C30013j122m63k42J23O89P40l4r11j159r87q79o66j5P21Q82M39q1l85n23
60749C26140m97k41J19M92J075K086L289M068L834K346j6k285l625m045l959l301
$$ y = [443089, 449659, 455536, 460556, 464793, 468027, 469973, 470804, 471089, 471301, 471566, 471833, 472114, 472504, 472973, 473123, 472344, 470430, 467854, 465138, 462085, 458090, 453057, 447432, 441384, 434684, 427500, 420558, 414148, 407638, 400448, 392940, 385878, 379497, 373618, 368245, 363447, 359036, 354970, 351775, 349982, 349298, 348855, 348041, 346613, 344332, 341206, 337979, 335627, 334231, 332891, 330904, 328623, 327006, 326542, 326799, 326942, 326706, 326785, 328046, 330357, 332666, 334333, 335824, 337776, 340064, 342277, 344464, 346693, 348403, 349125, 349601, 351221, 354365, 358045, 361130, 363178, 364086, 363811, 362697, 361368, 359931, 357778, 354460, 350411, 346545, 343381, 340738, 338082, 335121, 332193, 330013, 328891, 328428, 328186, 328309, 328998, 329738, 329704, 328793, 327634, 326647, 325768, 325102, 325087, 325808, 326690, 327129, 327048, 326663, 326140, 325643, 325402, 325521, 326013, 327088, 329174, 332463, 336531, 340365, 342711, 342695, 340410, 336785, 332740, 328781, 325480]
60733C25480j835k90L1r72j869j609o81J02Q70J894K636K551K163K231K521K394
60717C35617K072K217K679K707K200J756J608J341O76j94r78j463j426r27n23
60702C47362p37j536k566l512l913l224j728p42j204k499l344l365l013k425j403
60687C12151k50L45K59L6O6K49M47O71Q94J100J481K189L042L715L968L570K482
60670C36415J375J181J741J725M59j041j638j692k096k498j970q42m00q74j129
60655C28716n27L00P21J073J754K367K372K010J994K488K954K832K132J222J82
60640C52590j310l215m565m351l008k107k353k763k319j471j232j541j570j083
60626C19702n68l05j95j95k31M6P55J354J355J016P47M38L5J20R78J741J448M56
$$ y = [325480, 323645, 323355, 323386, 322414, 320545, 318936, 318255, 318357, 319227, 321121, 323757, 326308, 328471, 330702, 333223, 335617, 337689, 339906, 342585, 345292, 347492, 349248, 350856, 352197, 352873, 352679, 351701, 350238, 348812, 347885, 347362, 346625, 345089, 342523, 339011, 335098, 331874, 330146, 329404, 328200, 325701, 322357, 318992, 315979, 313554, 312151, 311901, 312246, 312505, 312541, 312607, 312856, 313303, 313974, 314868, 315968, 317449, 319638, 322680, 326395, 330363, 333933, 336415, 337790, 338971, 340712, 342437, 342896, 341855, 340217, 338525, 336429, 333931, 331961, 331119, 330719, 329845, 328716, 328189, 328489, 329210, 330283, 332037, 334404, 336776, 338786, 340780, 343268, 346222, 349054, 351186, 352408, 352590, 351280, 348065, 343500, 339149, 336141, 334034, 331681, 328918, 326599, 325128, 323896, 322355, 320785, 319702, 319134, 318829, 318634, 318439, 318208, 318254, 319009, 320363, 321718, 322734, 323481, 323919, 323954, 324074, 325052, 326793, 328241, 328697]
60608C28697j94l14l92l70J69R29J178R25P50O68K89j27L2N05M16k45m84K35J394
60589C34061K288K621K283J400O52O49J000Q05j1o36n33J54J096J841J753Q05
60573C50228J48Q41K339L371L920M946O457P449P732Q268R345R921R218P794O500
60558D38477N376M072K474N22j757l812m883m897m358l403j900l36N37Q91J581
60543D28584K736L772M742O254P991Q929R261J0520J3260J6139J7954J9073K0094
60530E69309K0510J9678J7884J5379J1525O078L78l987p020r675j1947j2886j2273
60517F02953j1180j0722j0946j0964r861p512m754k610j259j32R99J707J867K198
60503E39784L467N704Q519J1683J5082J8588K2297K6421L0727L4534L7389L9277
$$ y = [328697, 328503, 328189, 327797, 327427, 327596, 328525, 329703, 330628, 331378, 332046, 332335, 332208, 332240, 332745, 333161, 332916, 332432, 332667, 334061, 336349, 338970, 341253, 342653, 343305, 343954, 344954, 345759, 345748, 345112, 344579, 344733, 345829, 347670, 349423, 350228, 350376, 351217, 353556, 356927, 360847, 365793, 372250, 379699, 387431, 395699, 405044, 414965, 424183, 431977, 438477, 443853, 447925, 450399, 450921, 449164, 445352, 440469, 435572, 431214, 427811, 425911, 425575, 426112, 427003, 428584, 431320, 435092, 439834, 446088, 454079, 463008, 472269, 482789, 496049, 512188, 530142, 549215, 569309, 589819, 609497, 627381, 642760, 654285, 660363, 660741, 656754, 649734, 640059, 628112, 615226, 602953, 591773, 581051, 570105, 559141, 549280, 541768, 537014, 534404, 533145, 533013, 534012, 535719, 537586, 539784, 543251, 548955, 557474, 569157, 584239, 602827, 625124, 651545, 682272, 716806, 754195, 793472]
60491G93472M0063L9381L7236L4124L0555K6869K3435K0255J6498J1253M786j960
60479A075967q896j6744k5423l3747m0801m6345m9691m9803m7073m3486m0299
60468F73659l6878l2573k8254k4877k1889j8456j5238j3465j2921j2269j0967
60457D45872r562q330o878n046l278k036j533j826k557k859k237j331j150j739
60443C95510k296k411k373k342j996j191l93j23l57o76q69j069j335j303o34K17
60427C76359K64o33j227m63Q64J056j29j197j059k57K88N66R14J132R22O40Q23
60410C78863J401J862J902J571J102Q47R88J219J164J092J566K372K653K184J705
60395D02491J743K043K335K866L704M357M472M181L624K806K139K119K387K057
$$ y = [793472, 833535, 872916, 910152, 944276, 974831, 1001700, 1025135, 1045390, 1061888, 1073141, 1077927, 1075967, 1067071, 1050327, 1024904, 991157, 950356, 904011, 854320, 804517, 757444, 713958, 673659, 636781, 604208, 575954, 551077, 529188, 510732, 495494, 482029, 469108, 456839, 445872, 436310, 427980, 421102, 416056, 412778, 410742, 409209, 407383, 404826, 401967, 399730, 398399, 397249, 395510, 393214, 390803, 388430, 386088, 384092, 382901, 382508, 382385, 382028, 381352, 380483, 379414, 378079, 376776, 376142, 376359, 376623, 375990, 374763, 374300, 375164, 376220, 376091, 374894, 373835, 373578, 373866, 374432, 375346, 376478, 377400, 378040, 378863, 380264, 382126, 384028, 385599, 386701, 387548, 388536, 389755, 390919, 392011, 393577, 395949, 398602, 400786, 402491, 404234, 406277, 408612, 411478, 415182, 419539, 424011, 428192, 431816, 434622, 436761, 438880, 441267, 443324]
60381D43324J211Q97J412J816J600J509K112K818L055L206L555L523K823K271
60367D75132K420K457J556L94J79R35J866K698L534M030L912L850M763O576Q531
60352E22833J0274J1825J2914J3177J2676J1550R631O991M258J750j057m471p756
60339F04595r991j1129j1451j0806r276p775p025o523n537m427m023m266m528
60326E07838m687m889m739l797k558j929k032k242k071j267M16K785N008O608
60312D92444Q083R851J1352J1943J1942J1866J1431J0261Q862P783O611M907L363
60299F10699K771K492J377m40k067l697o347j0069j3710j6273j7286j6271j3324
60286E17855j0004q099p511o672n012l563l079l044k818k511k332k140k013k366
$$ y = [443324, 444535, 445432, 446844, 448660, 450260, 451769, 453881, 456699, 459754, 462960, 466515, 470038, 472861, 475132, 477552, 480009, 481565, 481959, 482138, 483073, 484939, 487637, 491171, 495201, 499113, 502963, 507726, 514302, 522833, 533107, 544932, 557846, 571023, 583699, 595249, 604880, 611871, 616129, 617879, 616822, 612351, 604595, 594604, 583475, 572024, 561218, 551942, 544167, 537142, 530619, 525082, 520655, 516632, 512366, 507838, 503151, 498262, 493523, 489726, 487168, 485239, 483207, 480965, 478894, 477627, 478043, 480828, 485836, 492444, 500527, 510378, 521730, 533673, 545615, 557481, 568912, 579173, 588035, 595818, 602429, 607336, 610699, 613470, 615962, 617339, 616899, 614832, 611135, 604788, 594719, 581009, 564736, 547450, 531179, 517855, 507851, 499752, 492241, 485569, 480557, 476994, 473915, 470871, 468053, 465542, 463210, 461070, 459057, 456691]
60272D56691l169l821l998l947l844l547l070k606k154j666j445j680j815j227
60258D18702k78J04j93m28k02K04N38Q39J010R30Q24Q88Q36N11N63J516K598K571
60240D31533J444L16k57n97q15o35k55j79j97L50J263J622J378J593K756L913
60224D43233L939K908J770J243J375J820K368L277M879O623P265O496N623N788
60210D98607O348O091N280N073N526N714N554N796O448O734O612O698O666N413
60196E82560L164J681J843K462K156J089J32o06j499k516l415m209m978n580n862
60181E66422n714m975l826l115l445m144m048l167k472k207j716r53p42j301j832
60166E22765j915k129k773l199k867k112j387p25k95m81j067j270q96n12k84K17
$$ y = [456691, 453522, 449701, 445703, 441756, 437912, 434365, 431295, 428689, 426535, 424869, 423424, 421744, 419929, 418702, 418424, 418528, 418335, 417907, 417705, 417909, 418447, 419286, 420296, 421226, 422050, 422938, 423774, 424285, 424848, 426364, 428962, 431533, 432977, 433293, 433036, 432439, 431624, 430989, 430734, 430555, 430358, 430708, 431971, 433593, 434971, 436564, 439320, 443233, 447172, 450080, 451850, 453093, 454468, 456288, 458656, 461933, 466812, 473435, 480700, 487196, 492819, 498607, 504955, 511046, 516326, 521399, 526925, 532639, 538193, 543989, 550437, 557171, 563783, 570481, 577147, 582560, 585724, 587405, 589248, 591710, 593866, 594955, 595087, 594481, 592982, 590466, 587051, 582842, 577864, 572284, 566422, 560708, 555733, 551907, 548792, 545347, 541203, 537155, 533988, 531516, 529309, 527593, 526640, 525898, 524597, 522765, 520850, 518721, 515948, 512749, 509882, 507770, 506383, 505658, 505363, 504882, 503815, 502545, 501649, 501137, 500853, 501070]
60150E01070Q78J015P65J084J945K010Q30j33M11J732K441K509K782L378L818
60135E26535M103M480M716M546M433M906N567N586M856L887K931J949J127O54
60121E80276K98j65l37K58J276J852J763J650K079K827L237L014K524K284K199
60106F05035J553m0j893k934k892k332j724j230j214j979k967l068k031p85j30
60091E81369N2L2m12j424k499l012k804j972o63N97R63J67j131k142k687k981
60075E61453l211l608m361n218n639n572n532n789n966n667n020m348l811l447
60061D94264l237l028k803k855l264l443k887k101j950k262k052j039K0N90R69
60046D64922J548K328L312M513N499N767N504N217M776L823K885K778L082K578
$$ y = [501070, 501948, 502963, 503728, 504812, 506757, 508767, 509597, 509464, 509875, 511607, 514048, 516557, 519339, 522717, 526535, 530638, 535118, 539834, 544380, 548813, 553719, 559286, 564872, 569728, 573615, 576546, 578495, 579622, 580276, 580574, 580409, 580072, 580330, 581606, 583458, 585221, 586871, 588950, 591777, 595014, 598028, 600552, 602836, 605035, 606588, 606548, 604655, 601721, 598829, 596497, 594773, 593543, 592329, 590350, 587383, 584315, 582284, 581499, 581369, 581421, 581453, 581041, 579617, 577118, 574106, 571302, 569330, 568667, 569264, 570227, 570394, 569263, 567121, 564434, 561453, 558242, 554634, 550273, 545055, 539416, 533844, 528312, 522523, 516557, 510890, 505870, 501522, 497711, 494264, 491027, 487999, 485196, 482341, 479077, 475634, 472747, 470646, 468696, 466434, 464382, 463343, 463363, 463953, 464922, 466470, 468798, 472110, 476623, 482122, 487889, 493393, 498610, 503386, 507209, 510094, 512872, 515954, 518532]
60032E18532J245L10K07M7o47j247j570k473m257n928o832p582q602r117q550
60017D63536p642p195o803n895m906m347l702k392j005m26n03n83p06j223j836
60002D14372j995j826j820j977j971j713j148o8J356K432K845L042L278L108K425
59987D20340K133K927M126M545L934K959K211J899J915J715P08q54j979k309k479
59972D41791k851k914k439k095k244k212j524q82j017j489j419n74R25K944M655
59957D28655M729L079J380R02Q94J80q57j146p47m11j60L03N55J05n05n70n14
59940D35872j064j785j743j125p88o76q4R05J555J885K659M108N696O957P686
59925D60058P563O572N344M216K494l60l373n032n136m488l370j705j88L25L55
$$ y = [518532, 519777, 520087, 520294, 520341, 519694, 518447, 516877, 514404, 510147, 504219, 497387, 489805, 481203, 472086, 463536, 455894, 448699, 441896, 436001, 431095, 426748, 423046, 420654, 419649, 419223, 418720, 418137, 417431, 416208, 414372, 412377, 410551, 408731, 406754, 404783, 403070, 401922, 401854, 403210, 405642, 408487, 411529, 414807, 417915, 420340, 422473, 425400, 429526, 434071, 438005, 440964, 443175, 445074, 446989, 448704, 449412, 448558, 446579, 444270, 441791, 438940, 436026, 433587, 431492, 429248, 427036, 425512, 424630, 423613, 422124, 420705, 420131, 421056, 424000, 428655, 433384, 436463, 437843, 438745, 439639, 439819, 438962, 437816, 437069, 436658, 436498, 436801, 437356, 437461, 436956, 436386, 435872, 434808, 433023, 431280, 430155, 429367, 428691, 428607, 429512, 431067, 432952, 435611, 439719, 445415, 452372, 460058, 467621, 474193, 479537, 483753, 486247, 485887, 482514, 477482, 472346, 467858, 464488, 462783, 462595, 462920, 463275]
59910D63275J208K859L897L679L094K906K691J889Q35J15l20q76j690k557l157
59895D77848l199k668j864q64O51K539L703L226J788J054J800L294M441M798M627
59880E01174M576N229O438P286P181O598O240N952N122L691K013K40j412k214
59866E58114j813j059j060j665j886j470j009p35k89L20O41O78J018J898K908
59851E54591L686M326N010N853P060Q720J0329J0997J0088P533L847J28k402l287
59837F26479l003j984j89K026L412K884N47k748o122q453q590o717m704m068m318
59822E84452m275m126m907o534p710p544o223m367k647j662j319p19N16J437J085
59807E35457o9r84j534k008j972r46M22J121J205J228J010L20o4M68Q35l12k192
$$ y = [463275, 464483, 467342, 471239, 474918, 478012, 480918, 483609, 485498, 486333, 486448, 486128, 485252, 483562, 481005, 477848, 474649, 471981, 470117, 469253, 469904, 472443, 476146, 479372, 481160, 482214, 484014, 487308, 491749, 496547, 501174, 505750, 510979, 517417, 524703, 531884, 538482, 544722, 550674, 555796, 559487, 561500, 561740, 560328, 558114, 556301, 555242, 554182, 552517, 550631, 549161, 548152, 547417, 547128, 547448, 548089, 548767, 549785, 551683, 554591, 558277, 562603, 567613, 573466, 580526, 589246, 599575, 610572, 620660, 628193, 632040, 632168, 629766, 626479, 623476, 621492, 621303, 623329, 626741, 629625, 630172, 627424, 621302, 612849, 604259, 597542, 592838, 588770, 584452, 580177, 576051, 571144, 564610, 556900, 549356, 543133, 538766, 536119, 534457, 533138, 532419, 532935, 534372, 535457, 535388, 534404, 532870, 530862, 528890, 527944, 528366, 529487, 530692, 531920, 532930, 533250, 533186, 533654, 534489, 534177, 531985]
59790E31985k860k148j685k151k582k432k390k787k990k818k923l351l229k400
59776D95239j842k004k042j349n72l95m57r5P07J620K436K910K910K877L304L757
59760E07004L466K885L342M923O112N992N489N825O810P570P994Q585R375R827
59746E95199R582Q825P994P375O793N841M545L554L222K947K044Q62K00o7p75
59731F58141k113l334l825l609k979k328k186k616k881k409j663j293j110q06
59717F24989r99k193l418l386k503k132k197j333P03K529L216L221L111K869K738
59702F25215L293M340N012N198N583O167O179N628N456N859N852M899L561K294
59688F94536Q97m52j001p54p34j411k050k042j799j839k134k715l925n692p356
$$ y = [531985, 529125, 526977, 525292, 523141, 520559, 518127, 515737, 512950, 509960, 507142, 504219, 500868, 497639, 495239, 493397, 491393, 489351, 488002, 487430, 487035, 486578, 486483, 487190, 488810, 491246, 494156, 497066, 499943, 503247, 507004, 510470, 513355, 516697, 521620, 527732, 533724, 539213, 545038, 551848, 559418, 567412, 575997, 585372, 595199, 604781, 613606, 621600, 628975, 635768, 641609, 646154, 649708, 652930, 655877, 657921, 658783, 658983, 658916, 658141, 656028, 652694, 648869, 645260, 642281, 639953, 637767, 635151, 632270, 629861, 628198, 626905, 625795, 624989, 623990, 621797, 618379, 614993, 612490, 610358, 608161, 606828, 607531, 610060, 613276, 616497, 619608, 622477, 625215, 628508, 632848, 637860, 643058, 648641, 654808, 660987, 666615, 672071, 677930, 683782, 688681, 692242, 694536, 695433, 694981, 693980, 693226, 692492, 691081, 689031, 686989, 685190, 683351, 681217, 678502, 674577, 668885, 661529]
59673F61529q447q861q445p414o787p130p218n588l029j666j707j365p1O39N3
59658E94493l09P10K047K414K330K728L162K822K167K060K285K169J781J404N69
59643F22832j261l690n878p470q410q618q340q123p938p232o104n378n156m529
59629E34705l208k168k067k246k057j983k643l742m730n504n870n440m591m419
59615D84037n128n571m984l941l095k202j082k39J57O64J360J567J331J674K657
59600D67205K826J526J56R0Q13J321J821K727L351L019K397K333K446K140J865
59585D96036K096K131J304M25N31J056O51q70k636m048m820m560l528l023l771
59570D76974m677m360l109k084j437o54j9j56o09l83L60M81l80j378j709j332
$$ y = [661529, 653082, 644221, 635776, 628362, 621575, 614445, 607227, 601639, 598610, 596944, 595237, 593872, 593801, 594440, 594493, 594184, 594894, 596941, 599355, 601685, 604413, 607575, 610397, 612564, 614624, 616909, 619078, 620859, 622263, 622832, 621571, 617881, 612003, 604533, 596123, 587505, 579165, 571042, 563104, 555872, 549768, 544390, 539234, 534705, 531497, 529329, 527262, 525016, 522959, 520976, 518333, 514591, 509861, 504357, 498487, 493047, 488456, 484037, 478909, 473338, 468354, 464413, 461318, 459116, 458034, 457795, 457952, 458616, 459976, 461543, 462874, 464548, 467205, 470031, 471557, 471713, 471803, 472616, 473937, 475758, 478485, 481836, 484855, 487252, 489585, 492031, 494171, 496036, 498132, 500263, 501567, 501992, 502523, 503579, 504230, 503360, 500724, 496676, 491856, 487296, 483768, 480745, 476974, 472297, 467937, 464828, 462744, 461307, 460653, 460634, 460478, 459869, 459486, 459846, 460327, 459947, 458569, 456860, 455528]
59554D55528n51K71P77J017J520K423L002K651J775J140R44J136J991L677N687
59539D82988P431Q998J1086J4510J9510K4513K5801K0360R643j064p724j0514
59527F05538j1293j0416p602m002j238N39J927K539J694J9j245j997k926m018
59513E67519m721n065n377n496n307n435o247o975o842o283n930n414m365l579
59499D90483l779m154l546k272j332o79K14Q95O81J79M55J258J567J352J309J402
59483D84033J160R30J365K103K400K524L143L840L776L302L425M048M225L786
59469E24060L284K703J650M68j44l26o14p70l48J65J19R8J055K585L506L766M179
59452E45436M766M905M794N155N705N485M503L603K910J843M26q46k176l988n517
$$ y = [455528, 454977, 455248, 456025, 457042, 458562, 460985, 463987, 466638, 468413, 469553, 470497, 471633, 473624, 477301, 482988, 490419, 499417, 510503, 525013, 544523, 569036, 594837, 615197, 624840, 623776, 616052, 605538, 594245, 583829, 576227, 572225, 570987, 571526, 573453, 575992, 577686, 577705, 576460, 574463, 571537, 567519, 562798, 557733, 552356, 546860, 541553, 536118, 529871, 522896, 516054, 509771, 503841, 498427, 494062, 490483, 486704, 482550, 479004, 476732, 475400, 474721, 474935, 475830, 476511, 476690, 477145, 478403, 479970, 481322, 482631, 484033, 485193, 486123, 487488, 489591, 491991, 494515, 497658, 501498, 505274, 508576, 512001, 516049, 520274, 524060, 527344, 530047, 531697, 532165, 532021, 531695, 531081, 530311, 529963, 530128, 530247, 530345, 531400, 533985, 537491, 541257, 545436, 550202, 555107, 559901, 565056, 570761, 576246, 580749, 584352, 587262, 589105, 589531, 588685, 586509, 582521, 577004]
59437E77004n484m082k846k492k306j663q16m9P29J434J816K075K682L705M976
59422E74683O502Q033Q891R091R753J1524J3572J5104J6747J9252K2194K5306
59410G40652K9257L3085L2669K4712J1485j064r312j3530j4593j2523q228l318
59398H09292K314R638J6513J7756J0689j486j3172k1190k5177k5594k3406k0413
59386G35764j8051j6284j4440j2414j0373q264o233m805m082l601l206l165l247
59373F27599k745j653p22j87N13J510K175K232K156K240K265K277K641L208L506
59358F47015L721M415N342N776N961O920Q782J0617J2015J3420J4785J5323J4868
59345G68960J4187J3685J2974J1915J0855R708P932N617L425J410r42l551n766
$$ y = [577004, 571520, 567438, 564592, 562100, 559794, 558131, 557315, 557266, 557995, 559429, 561245, 563320, 566002, 569707, 574683, 581185, 589218, 598109, 607200, 616953, 628477, 642049, 657153, 673900, 693152, 715346, 740652, 769909, 802994, 835663, 860375, 871860, 870796, 861484, 847954, 833361, 820838, 812610, 809292, 811606, 821244, 837757, 855513, 866202, 864716, 851544, 830354, 805177, 779583, 756177, 735764, 717713, 701429, 686989, 674575, 664202, 655938, 649705, 644900, 640818, 637217, 634011, 630846, 627599, 624854, 623201, 622479, 622292, 622805, 624315, 626490, 628722, 630878, 633118, 635383, 637660, 640301, 643509, 647015, 650736, 655151, 660493, 666269, 672230, 679150, 687932, 698549, 710564, 723984, 738769, 754092, 768960, 783147, 796832, 809806, 821721, 832576, 842284, 850216, 855833, 859258, 860668, 859726, 856175, 850409]
59332H50409p585r638j1955j3902j5228j6038j6051j5117j4145j4078j4311j3641
59320F88720j2292j1392j0880r934q943q963r404q594o625n325n234n025m135
59307E81974l568l483k528k97J721K626L500N503Q507J2313J6922K0555J9736
59294F63481J3028L179n712j1747j5140j6438j6274j5462j4035j1274p539m604
59282E61463l241k041K85K874M344M936N726O778P536Q131R063J0255J1388J2491
59268F39988J3432J3647J3014J2167J1420J0349Q909P794P113N919L713J288n47
59255G48206j882k775k681j600o48p14j535k566l593m053l180j436n07j110k120
59240G17806k414k298k448k835l419m498n726o068n453n123n685o303o352o382
$$ y = [850409, 842824, 833186, 821231, 807329, 792101, 776063, 760012, 744895, 730750, 716672, 702361, 688720, 676428, 665036, 654156, 644222, 635279, 626316, 616912, 608318, 601693, 596368, 591134, 586109, 581974, 578406, 574923, 572395, 572098, 573819, 576445, 579945, 585448, 593955, 606268, 623190, 643745, 663481, 676509, 679688, 673976, 662229, 647089, 630651, 614377, 598915, 584880, 573606, 566067, 561463, 558222, 556181, 556466, 559340, 563684, 568620, 574346, 581124, 588660, 596791, 605854, 616109, 627497, 639988, 653420, 667067, 680081, 692248, 703668, 714017, 722926, 730720, 737833, 743752, 747465, 748753, 748206, 746324, 743549, 740868, 739268, 738620, 737906, 736371, 733805, 730212, 726159, 722979, 721543, 721036, 719926, 717806, 715392, 713094, 710646, 707811, 704392, 699894, 694168, 688100, 682647, 677524, 671839, 665536, 659184, 652802]
59226F52802o673o497n705n463o380p419p595p251o715n309k877q29l48q40j215
59211E81686j432j653j279n3J053J289J290J771K197J922J474J554J800J660J462
59196E94741J655J851J573J002L91k89o15K4R52O13r52j802j012mOj38M63R06
59178E99365J79r48j323j255j400j340q31r28k197l216k587j179n97o55j68Q19
59162E81739J404J515J538J129o9j324j945k535l760m863m900m517m867n637n715
59147E47193n068m470m076l671l562l979m310m158m222m990n565n053m039l444
59133D86586k983k108j323j160r77j54O22O95Q71J985L325M057M923O787Q689
59118E09835R248Q983R280J0038J0279J0252J0840J1605J1369J0313R624R405
$$ y = [652802, 646129, 639632, 633927, 628464, 622084, 614665, 607070, 599819, 593104, 587795, 584918, 584089, 583741, 582901, 581686, 580254, 578601, 577322, 577269, 578322, 579611, 580901, 582672, 584869, 586791, 588265, 589819, 591619, 593279, 594741, 596396, 598247, 599820, 600822, 601213, 600924, 600309, 600333, 601285, 601898, 600946, 599144, 598132, 598128, 598134, 597996, 598459, 599365, 599544, 598596, 597273, 596018, 594618, 593278, 592447, 591519, 589322, 586106, 583519, 582340, 581743, 581088, 580920, 581739, 583143, 584658, 586196, 587325, 587256, 585932, 583987, 581452, 577692, 572829, 567929, 563412, 558545, 552908, 547193, 542125, 537655, 533579, 529908, 526346, 522367, 518057, 513899, 509677, 504687, 499122, 494069, 490030, 486586, 483603, 481495, 480172, 479012, 478035, 477881, 478503, 479198, 480069, 482054, 485379, 489436, 494359, 501146, 509835, 519083, 528066, 537346, 547384, 557663, 567915, 578755, 590360, 601729, 612042, 621666, 631071]
59106F31071Q647O996N094L509K523K456K955K685R64j107k272k906l875m758
59092F51982m725m155l780l230k014r33q51j087o83k88r69k207k860l200m134
59077F16866n305n780n800o043o067n322m706n138n598m657l031k461k903l067
59063E50988k941l396l935l310j950j537k353l124l228l060k593j585q53j364
59049E15759k396k487j727j223r40j41O22J82r89j438j141j123j183l90O16L86
59033E02387n30j16J730K988K852K763L744M994N816O801Q415J0119J1513J2821
59019E76297J3904J4174J3688J2914J1452Q467M382O79j978m019n569o329o571
59006F31491o746o388m861k787j206R7J787L249L533L306L788M425L809K316J435
$$ y = [631071, 639718, 646714, 651808, 655317, 657840, 660296, 663251, 665936, 666900, 665793, 663521, 660615, 656740, 651982, 647257, 643102, 639322, 636092, 634078, 633145, 632294, 631207, 630524, 630236, 629267, 627060, 624200, 621000, 616866, 611561, 605781, 599981, 593938, 587871, 582549, 577843, 572705, 567107, 562450, 559419, 556958, 554055, 550988, 548047, 544651, 540716, 537406, 535456, 533919, 531566, 528442, 525214, 522154, 519561, 517976, 517123, 515759, 513363, 510876, 509149, 507926, 506986, 506845, 507467, 507649, 506660, 505222, 504081, 502958, 501775, 501385, 502001, 502387, 501857, 501741, 503471, 506459, 509311, 512074, 515818, 520812, 526628, 533429, 541844, 551963, 563476, 576297, 590201, 604375, 618063, 630977, 642429, 650896, 655278, 655957, 653979, 649960, 644391, 638062, 631491, 624745, 618357, 613496, 610709, 609503, 609600, 611387, 614636, 618169, 621475, 625263, 629688, 633497, 635813, 637248]
58991F37248J072N3j159j058j45n61k509l855l630l246l613l612k281k86J591
58976F14009L552N662P332Q522R915J1505J2501J2764J2862J2731J1887J0809
58964G34051J0370J0144R126P729P097O895N916M403L337J924j440n974r159j0517
58950G73902j1848j3656j4520j4314j4785j6113j6081j3711j0954r525q667p333
58938F22395o080n401m412k592r46k15K32Q38R76N05L23O37M67l68p49l93m23
58921F04794j225j755j684k008k822k792j678j048j519j583l42Q60Q16M13Q79
58906E89306J970L104M581O502Q101R161J0498J2201J3135J2929J2582J2448J1625
58893G08143J0147R580J0535J1657J2065J2687J4186J5637J6386J7012J7431J6236
$$ y = [637248, 638320, 638373, 637214, 636156, 636011, 635450, 632941, 629086, 625456, 622210, 618597, 614985, 612704, 612418, 614009, 617561, 623223, 630555, 639077, 648992, 660497, 672998, 685762, 698624, 711355, 723242, 734051, 744421, 754565, 763691, 771420, 778517, 785412, 791328, 795731, 799068, 800992, 799552, 793578, 784419, 773902, 762054, 748398, 733878, 719564, 704779, 688666, 672585, 658874, 647920, 638395, 629728, 622395, 616315, 610914, 606502, 603910, 602964, 602749, 602981, 603819, 604795, 605300, 605623, 606260, 606727, 606359, 605610, 605217, 604794, 603569, 601814, 600130, 598122, 595300, 592508, 590830, 589782, 588263, 586680, 586338, 587198, 588014, 588427, 589306, 591276, 594380, 598961, 605463, 613564, 622725, 633223, 645424, 658559, 671488, 684070, 696518, 708143, 718290, 727870, 738405, 750062, 762127, 774814, 789000, 804637, 821023, 838035, 855466, 871702]
58881H71702J3163J0031P920N606K150j151l040m365o210p815q142p816p831p848
58867H56354p371p136p715q174p540o430n820n590n460o019p520q926r306r052
58853G54295q794q436q044q215q709q360p125o523p165p709p218o662o971p519
58839F46845p698q111q982r232q428p789q008p873o436m712l816l178k033j036
58825E59513q70p90J2R79J447J899K802L620M039M638N426N352M208L260L048
58810E98583K483J089J01K25M23L4q7K75k77k162l567l423l284m469n645n229
58794E75070m183m209m958n101m648m253l620k416j387r61j90J464K851L052K965
58779E49476L550M257M521N016N944O041M743L400K781J528j239l926m918n027
$$ y = [871702, 884865, 894896, 902816, 908422, 910572, 909421, 906381, 902016, 895806, 887991, 879849, 872033, 864202, 856354, 848983, 841847, 834132, 825958, 818418, 811988, 806168, 800578, 795118, 789099, 781579, 772653, 763347, 754295, 745501, 737065, 729021, 720806, 712097, 703737, 696612, 690089, 682924, 675215, 667997, 661335, 654364, 646845, 639147, 631036, 622054, 612822, 604394, 596605, 588597, 580724, 574288, 569576, 565760, 562582, 560549, 559513, 558643, 557853, 557865, 558844, 560291, 562190, 564992, 568612, 572651, 577289, 582715, 588067, 592275, 595535, 598583, 601066, 602155, 602256, 602481, 602904, 602938, 602851, 603126, 602849, 600687, 597120, 593697, 590413, 585944, 580299, 575070, 570887, 566678, 561720, 556619, 551971, 547718, 544098, 541682, 540295, 539334, 539144, 540608, 543459, 546511, 549476, 553026, 557283, 561804, 566820, 572764, 578805, 583548, 586948, 589729, 591257, 590018, 586092, 581174, 576147]
58765E76147n612o311o470o832p769p831o065l935k966k441j274j33K65Q78K243
58750E21894K822J600K77N48J334J051N41J197K199K285K388L861N688O209N955
58735E59849O222O477N732M917N268N869N409M751N124N396L920J688Q22J231
58721F22675J346J010J030J204J166J919M062N969O072N452N733O103N067L391
58707F72199K487J508r89l961n551o470q699j1970j4392j5480j5877j5383j3951
58694E63471j3159j3931j4269j2116q882p190o735n613m161l962m453m027l329
58681D61644l946m928m162k270j500j692r38N10P39O8P58L061M932N526N922O577
58665D70301P048P873R943J2291J3166J2633J1552R110M389p20l507m488o093
$$ y = [576147, 570535, 564224, 557754, 550922, 543153, 535322, 529257, 525322, 522356, 519915, 518641, 518508, 518773, 519651, 521894, 524716, 526316, 526593, 527141, 528475, 529526, 530067, 531264, 533463, 535748, 538136, 541997, 547685, 553894, 559849, 566071, 572548, 578280, 583197, 588465, 594334, 599743, 604494, 609618, 615014, 618934, 620622, 621444, 622675, 624021, 625031, 626061, 627265, 628431, 630350, 634412, 640381, 646453, 651905, 657638, 663741, 668808, 672199, 674686, 676194, 675205, 671244, 665693, 659223, 650524, 638554, 624162, 608682, 592805, 577422, 563471, 550312, 536381, 522112, 509996, 501114, 493924, 487189, 481576, 477415, 473453, 469000, 464973, 461644, 457698, 452770, 448608, 446338, 444838, 443146, 442208, 442718, 443457, 443525, 444283, 447344, 452276, 457802, 463724, 470301, 477349, 485222, 495165, 507456, 520622, 533255, 544807, 553917, 558306, 557586, 554079, 549591, 543498]
58652E43498q221q698p497o827p318p560p178p062o811n151k718j389j193p84
58638D65091l22p98j272j04J663J704N37P14K339L037K137J240Q49q9j407j839
58622D73480j796k714l874l240j159J55M98J562L324M112M021M611N443M650K760
58607D91833K221L145L363K556K515L224K777J365J289K581K583N41j224j433
58593E17336j494k179k207j064j7M92J532L246M552N619P607R883J0591R997J0089
58578E73983J0895J0539Q922P828P476O440N058N184O588P152O763P314Q990J0369
58564F83501J2022J5876K1006K4281K5323K6538K8086K7424K4214K0993J8266
58553I27530J3672O945J168k123m717p471q640p750o980p190o686n275n534q584
$$ y = [543498, 535277, 526579, 519082, 512255, 504937, 497377, 490199, 483137, 476326, 471175, 468457, 467068, 465875, 465091, 464769, 463971, 462699, 462595, 464258, 465962, 466499, 467213, 469552, 472589, 474726, 475966, 476815, 476726, 475319, 473480, 471684, 468970, 465096, 461856, 460697, 460852, 461350, 462912, 466236, 470348, 474369, 478980, 484423, 489073, 491833, 494054, 497199, 500562, 503118, 505633, 508857, 511634, 512999, 514288, 516869, 519452, 519993, 518769, 517336, 515842, 513663, 511456, 510392, 510375, 510867, 512399, 515645, 520197, 525816, 533423, 543306, 553897, 563894, 573983, 584878, 595417, 604339, 612167, 619643, 626083, 631141, 636325, 642913, 650065, 656828, 664142, 673132, 683501, 695523, 711399, 732405, 756686, 782009, 808547, 836633, 864057, 888271, 909264, 927530, 941202, 948147, 949315, 947192, 942475, 935004, 926364, 918614, 911634, 904444, 897758, 892483, 886949, 878365]
58539H78365j2288j5023j7507j9809k0398j9424j9156j9959j9577j7402j5515
58528F82307j4504j2370q821o465o353o326n209m610n202n160l795k890l080k752
58514E94770j674j760k985k772o97L69p42j624q55k30q73j272p28p05j349p39
58498E76134J038J343k37q90L20J009L81Q08K930M101L485L729N734O782N943
58483F12610O258R172J1809J2239J2615J4439J5591J4810J4439J5719J5908J3001
58471G68610R018N805J915l453p782r362j0029j1134j0981q803o928o377m753
58458G05746j063J945K875M415Q159J1466J2334J2647J3520J2330P751K989N74
58445G95688j578n544r335j0822j1265j1727j0506p388n702o765o978l929n76
$$ y = [878365, 866077, 851054, 833547, 813738, 793340, 773916, 754760, 734801, 715224, 697822, 682307, 667803, 655433, 646612, 640147, 633794, 627468, 622259, 617649, 612447, 607287, 603492, 600602, 597522, 594770, 593096, 591336, 588351, 585579, 584882, 585251, 584509, 582885, 582030, 581800, 580927, 579655, 578927, 578222, 576873, 576134, 577172, 578515, 578278, 577388, 577708, 578717, 579098, 579906, 582836, 586937, 590422, 594151, 599885, 606667, 612610, 618868, 628040, 639849, 652088, 664703, 679142, 694733, 709543, 723982, 739701, 755609, 768610, 777628, 783433, 785348, 781895, 774113, 764751, 754722, 743588, 732607, 723804, 716876, 710499, 705746, 704683, 706628, 709503, 713918, 722077, 733543, 745877, 758524, 772044, 784374, 792125, 795114, 795688, 794110, 788566, 779231, 768409, 757144, 745417, 734911, 727523, 721821, 715056, 708078, 704149, 703573]
58432G03573J98L03J948L261K513K035L865N874O164O786R249J0762R083O560
58418G72174N443L729l30m191n580o533q852j0171q667o987p376p572n718m434
58404G04935n709o639m709k414k169j693J003L170K667K528N274P825P143N763
58390G16975O482O777M069J348J870L094J718r4P48K234J607J027L076N228M596
58375G60755L581N041O625N674M859O981R097P899O005O754P792O171M740O902
58361H48876R946J0141R600J1384J2979J1273Q984R294R272N639J792J878L173
58348I54231J652k19J262L378K381J143L490O369N703M606P419J1060J0945R979
58334A023399J2699J5985J4903J2494J4094J6999J5584J1821J0848J0852P419
$$ y = [703573, 703771, 704074, 706022, 709283, 711796, 713831, 717696, 723570, 729734, 736520, 745769, 756531, 765614, 772174, 777617, 781346, 781016, 776825, 771245, 764712, 755860, 745689, 737022, 730035, 722659, 715087, 709369, 704935, 699226, 692587, 687878, 685464, 683295, 681602, 682605, 685775, 688442, 690970, 696244, 704069, 711212, 716975, 723457, 730234, 734303, 735651, 737521, 740615, 742333, 742239, 742987, 745221, 746828, 747855, 750931, 756159, 760755, 764336, 769377, 776002, 781676, 786535, 793516, 802613, 810512, 816517, 823271, 831063, 837234, 841974, 848876, 858822, 868963, 878563, 889947, 902926, 914199, 923183, 932477, 941749, 947388, 949180, 951058, 954231, 955883, 955664, 956926, 960304, 962685, 963828, 967318, 973687, 979390, 983996, 991415, 1002475, 1013420, 1023399, 1036098, 1052083, 1066986, 1079480, 1093574, 1110573, 1126157, 1137978, 1148826, 1159678, 1167097]
58323A167097L222L195M582K065j706j075J666R62r11J636O158O521M590O392
58309A204394J0411J0888R170J0572J3528J2998J1091J3098J6647J5953J3093
58298A341843J3814J6130J4581J1661J3179J6467J5327J2407J4309J8679J8857
58287A507254J7016J9531K3680K2455J8580J9937K4981K6477K5707K8854L3402
58276A767874L2657K9817L2847L9357M1393M0991M5612N2523N3557N1133N3342
58265B241103N7493N5283M9870N0556N4923N3915N0238N3273O0040O0211N5873
58254B842778N6976O1355N9271N3640N5167O1441O1981N9778O5998P7519Q2275
58243C538179Q2659R0307J02090J05650J04422J11875J25171J30690J31321J40964
$$ y = [1167097, 1170319, 1173514, 1178096, 1180161, 1178455, 1177380, 1179046, 1180008, 1179097, 1180733, 1186891, 1193412, 1198002, 1204394, 1214805, 1225693, 1234863, 1245435, 1258963, 1271961, 1283052, 1296150, 1312797, 1328750, 1341843, 1355657, 1371787, 1386368, 1398029, 1411208, 1427675, 1443002, 1455409, 1469718, 1488397, 1507254, 1524270, 1543801, 1567481, 1589936, 1608516, 1628453, 1653434, 1679911, 1705618, 1734472, 1767874, 1800531, 1830348, 1863195, 1902552, 1943945, 1984936, 2030548, 2083071, 2136628, 2187761, 2241103, 2298596, 2353879, 2403749, 2454305, 2509228, 2563143, 2613381, 2666654, 2726694, 2786905, 2842778, 2899754, 2961109, 3020380, 3074020, 3129187, 3190628, 3252609, 3312387, 3378385, 3455904, 3538179, 3620838, 3711145, 3813235, 3918885, 4023307, 4135182, 4260353, 4391043, 4522364, 4663328]
58233D663328J56428J63353J65508J78306J97736K07259K11103K27537K53299
58224F423857K69677K79888L03653L38269L63823L83825M19898M69090N09330
58215I761310N44597N99429O71189P35954P99263Q89840J005376J119658J241372
58206A7367988J406856J616913J845191K107018K450445K882803L384017L988407
58198C7049638M765223N723062O834950Q154713R795886J1809580J4229570J7227716
58190A15590338K1042085K5755259L1339370L7753679M4332662M8753991M7331396
58183C71898780L7479513K0324162N15339j6841073k9076961l6228293l9424797
58176C08646670l9650815l7670418l4269963l0176257k5906838k1819854j8173256
$$ y = [4663328, 4819756, 4983109, 5148617, 5326923, 5524659, 5731918, 5943021, 6170558, 6423857, 6693534, 6973422, 7277075, 7615344, 7979167, 8362992, 8782890, 9251980, 9761310, 10305907, 10905336, 11576525, 12312479, 13111742, 14001582, 15006958, 16126616, 17367988, 18774844, 20391757, 22236948, 24343966, 26794411, 29677214, 33061231, 37049638, 41814861, 47537923, 54372873, 62527586, 72323472, 84133052, 98362622, 115590338, 136632423, 162387682, 193727052, 231480731, 275813393, 324567384, 371898780, 409378293, 429702455, 430217794, 413376721, 384299760, 348071467, 308646670, 268995855, 231325437, 197055474, 166879217, 140972379, 119152525, 100979269]
58169A00979269j5067176j2450816j0256739q465391p034284n869522m903474
58162C6931867m125658l514359l009083k572328k213835j933063j695034j480228
58154A6388279j303950j169201j049748r34388q41123p73509p07025o31904n67726
58145H409705n22715m78287m26263l83438l56536l28468k91972k63433k51074
58136E107519k40713k24380k13063k10346k02284j84180j70049j65500j57648
58127C339356j41291j29074j26219j20452j06679r7197r7716r6588q7493q0402
58117B256245q0655p8803p0410o4991o6269o3972n4091m7348m8866m8921m2584
58106A589335l9247m3659m6203m1299l7483l9848l9845l1973k4134k2147j9806
$$ y = [100979269, 85912093, 73461277, 63204538, 54739147, 47704863, 41835341, 36931867, 32806209, 29291850, 26282767, 23710439, 21496604, 19563541, 17868507, 16388279, 15084329, 13915128, 12865380, 11930992, 11089869, 10316360, 9609335, 8977431, 8409705, 7886990, 7408703, 6982440, 6599002, 6242466, 5913998, 5622026, 5358593, 5107519, 4866806, 4642426, 4429363, 4219017, 4016733, 3832553, 3662504, 3497004, 3339356, 3198065, 3068991, 2942772, 2822320, 2715641, 2618444, 2520728, 2424140, 2336647, 2256245, 2175590, 2096787, 2026377, 1961386, 1895117, 1831145, 1777054, 1729706, 1680840, 1631919, 1589335, 1550088, 1506429, 1460226, 1418927, 1381444, 1341596, 1301751, 1269778, 1245644, 1223497, 1203691]
58095A203691j3311j0093j4205j7740j5527j4077j7616j9454j5648j3213j6314
58084A036493j7907j3589j0427j3604j7027j5620j4503j7639j9625j6942j5530
58073H64080j9035k1114j7479j4194j5944j7286j3732j0544j2229j3757j0595
58062F98171p409q564r681o615l669m998o883n980o310j0620j3751j1889r789
58049E92013j1527j2743r350n513n601o366m316k811m767o191l996k472n033p340
58035E03987n482l304m627n881l625j827m391p642p447o850r373j1570r602o688
58021D15678o832p357m747j866k310l463j997m95j987l576k169p42k413l952j830
58006C69942Q67K30j278K4J922J002o70JR50m78j724LJ868O44j116k46P83j062
$$ y = [1203691, 1190380, 1180287, 1166082, 1148342, 1132815, 1118738, 1101122, 1081668, 1066020, 1052807, 1036493, 1018586, 1004997, 994570, 980966, 963939, 948319, 933816, 916177, 896552, 879610, 864080, 845045, 823931, 806452, 792258, 776314, 759028, 745296, 734752, 722523, 708766, 698171, 690762, 682198, 672517, 665902, 662233, 657235, 650352, 644372, 638062, 627442, 613691, 601802, 592013, 580486, 567743, 558393, 552880, 547279, 540913, 536597, 533786, 529019, 522828, 518832, 516360, 511327, 503987, 498505, 495201, 490574, 484693, 481068, 479241, 474850, 467208, 459761, 452911, 443538, 431968, 422366, 415678, 408846, 401489, 396742, 394876, 392566, 389103, 387106, 386611, 384624, 381048, 378879, 378137, 375724, 371772, 369942, 370809, 371039, 369761, 369785, 371707, 372709, 372039, 372040, 372990, 372512, 370788, 370791, 372659, 373303, 372187, 371941, 372724, 371662]
57988C71662l052j827M7r64k605j492J92r57k917k503j786l768n887m498j819
57973C37826j885l360k686p99l58q2K085L726K028n43n76J11j412k902j178J221
57957C31216L12j985j573Q1j114m077m667l166k986m022l599k147j888j857O6
57942B98594K248J968Q41K083M680N688N971P963J0231R945Q589R335J0896R682
57928C88714O198L582J782j281m596n688n666p271r586r936r149r737j0730r599
57914C17037p412o799o781m872k340j914k340p83J428J198k17N13K259J381j307
57899B89051j889n44r76l364m126k464j267j500j141J73O12K88J145K781K942
57884B79721J859J646K032J181j4P81K493J976m19j479q30r81k131j876p4Q62
$$ y = [371662, 368610, 366783, 366830, 365866, 363261, 361769, 361961, 361004, 358087, 355584, 353798, 350030, 344143, 339645, 337826, 335941, 332581, 329895, 329096, 328738, 328656, 330741, 334467, 336495, 335952, 335376, 335487, 334075, 331173, 329995, 331216, 331528, 329543, 327970, 328051, 326937, 322860, 318193, 315027, 312041, 308019, 304420, 302273, 300385, 298528, 298594, 300842, 302810, 303651, 305734, 310414, 316102, 322073, 330036, 340267, 350212, 358801, 368136, 379032, 388714, 394912, 398494, 400276, 398995, 394399, 388711, 383045, 375774, 366188, 356252, 347103, 337366, 326636, 317037, 309625, 302826, 296045, 291173, 288833, 286919, 284579, 283796, 285224, 286422, 286205, 286718, 288977, 290358, 289051, 287162, 286618, 285642, 282278, 278152, 275688, 274421, 272921, 271780, 271953, 272565, 272853, 273998, 276779, 279721, 281580, 283226, 285258, 286439, 286425, 287206, 289699, 291675, 291256, 289777, 288947, 287966, 285835, 283959, 283885, 284747]
57868B84747N20Q80K158K699K828M460O914P473O023N001M966M312L179L395M655
57853C44210M785L687L192L331K542J100M93Q4j720l822m036l348m327o328o627
57838C33216n414m932m733k705n0N7j722j751J93P22q44j443N1J309J396K148
57822C15498L862M353L291L021M143M525L535L051L516L095J454L44k12k174n389
57807C45913p327p519q078r361r321p779p012p374o648m528l423l903l684k118
57793B57838j442k396k827j870j416k126j976j89J242J254J258J813J530N02J021
57778B52216L490N292N074M587N014N070M080L382L293K169j83j666j679k300
57764B87839m385n987n987n836o300n953m285l016k858k291q43k23q72p95P89
$$ y = [284747, 285267, 286147, 288305, 291004, 293832, 298292, 305206, 312679, 318702, 323703, 328669, 332981, 336160, 339555, 344210, 348995, 352682, 355874, 359205, 361747, 362847, 363340, 363424, 361704, 357882, 353846, 350498, 346171, 339843, 333216, 327802, 322870, 318137, 315432, 315382, 315439, 313717, 311966, 312159, 312881, 312037, 310594, 310645, 311954, 313350, 315498, 319360, 323713, 327004, 330025, 334168, 338693, 342228, 345279, 348795, 351890, 353344, 353688, 353476, 351302, 345913, 338586, 331067, 322989, 313628, 304307, 296528, 289516, 282142, 275494, 270966, 267543, 263640, 259956, 257838, 256396, 254000, 251173, 249303, 247887, 245761, 243785, 243596, 244838, 246092, 247350, 249163, 250693, 251195, 252216, 255706, 260998, 266072, 270659, 275673, 280743, 284823, 288205, 291498, 293667, 293484, 291818, 290139, 287839, 283454, 277467, 271480, 265644, 259344, 253391, 249106, 246090, 243232, 240941, 240098, 239875, 239003, 238208, 238997]
57749B38997J985J797J830L025L992L992M302N187M906L081J791J921J827Q89
57735B79522Q72K220K687J351M18J223K021J561J328K186K312O94o87m30k27j505
57719B95546k713k353j747k350l096k742k243k480k325j155o31j769k834k406
57705B64702j861k598l395k865k013j983j727k62J081J049P96J546K186J491N78
57690B56725P80J186O30J09Q84K100K416K276K535K715K523L143N102O856P396
57675B97376Q180J0552J3395J5433J7777K2010K7723L4135M2250N2930O4084P1413
57663F77258P0626N8302L3606J408k8791m9693o0765o4962o3901n8424n0927m3794
57651D19943l7009k9827k3263j8571j5005j1476q776p851p499o123m337l538l355
$$ y = [238997, 240982, 242779, 244609, 247634, 251626, 255618, 259920, 265107, 270013, 273094, 274885, 276806, 278633, 279522, 280394, 282614, 285301, 286652, 287070, 288293, 290314, 291875, 293203, 295389, 297701, 298395, 297708, 297278, 297051, 295546, 292833, 290480, 288733, 286383, 283287, 280545, 278302, 275822, 273497, 272342, 271711, 269942, 267108, 264702, 262841, 260243, 256848, 253983, 251970, 249987, 248260, 247998, 249079, 250128, 250924, 252470, 254656, 256147, 256725, 257505, 258691, 259321, 259430, 260314, 262414, 264830, 267106, 269641, 272356, 274879, 278022, 283124, 289980, 297376, 305556, 316108, 329503, 344936, 362713, 384723, 412446, 446581, 488831, 541761, 605845, 677258, 747884, 806186, 839792, 841200, 812409, 762716, 701951, 636989, 573088, 514664, 463737, 419943, 382934, 353107, 329844, 311273, 296268, 284792, 276016, 268165, 260666, 254543, 250206, 246668, 243313]
57638B43313k699j908j812j932j600j430j859j821o64L03j0m99k8L78m48j467
57622B25817j309p76j142j692j211m05m77p93l01K18m54j603j842j403j152o86
57606B10789N04J344P11n92j316j699k201j993p17K0r83k328k370j879k210k698
57590A92382k306k022k960l814k912j267p84r90l84M05j43j270j089P1L65l09
57574A72973n96n44j325k653l064k410j767j359p79n57j347k260k117j565j784
57559A48846k088j157K88N11k75m46K11O17P18J260J857J548Q73J050J620J133
57543A56566k45r84o62j50K67R95J710J775J569J780J901J162J37k10k65q44j482
57526A63020j413j202j541j617o00N23O36O76J882L237L135K290K390K970K468
$$ y = [243313, 240614, 238706, 236894, 234962, 233362, 231932, 230073, 228252, 227588, 227891, 227881, 227382, 227354, 227732, 227284, 225817, 224508, 223732, 222590, 220898, 219687, 219282, 218805, 218012, 217711, 217929, 217475, 215872, 214030, 212627, 211475, 210789, 211293, 212637, 213348, 212756, 211440, 209741, 207540, 205547, 204830, 204850, 203867, 201539, 199169, 197290, 195080, 192382, 190076, 188054, 185094, 181280, 178368, 177101, 176317, 175327, 174943, 175348, 175205, 173935, 172846, 172917, 173282, 172973, 172377, 171833, 170508, 167855, 164791, 162381, 160614, 159255, 158476, 157919, 156572, 154312, 152195, 150630, 148846, 146758, 145601, 145889, 146400, 146125, 145679, 145890, 146507, 147225, 148485, 150342, 151890, 152763, 153813, 155433, 156566, 156321, 155337, 154675, 154525, 154792, 155787, 157497, 159272, 160841, 162621, 164522, 165684, 165821, 165611, 165346, 164502, 163020, 161607, 160405, 158864, 157247, 156647, 157170, 157806, 158482, 160364, 163601, 166736, 169026, 171416, 174386, 176854]
57511A76854J340J224J799J436L97M00J384J526L66p10r49q78o28L3L47n31j651
57494A81759j588j044j756l273l495k118r15p10o21k90m44j045j098m98j18q4
57478A62662K02M97P7o92r40j072k058l395l693k842j802q53P1J91r20j851j243
57461A42339k20n90j688j569m16J0m55n42k75o28j087m43N29J33r63o20R95J712
57443A36222J181J195K128K399J668J473K197K323J277L23J02j42n04j08P51O94
57427A53179j92l28N83J127Q27O92R48O62q5q6O41Q04K76J90N56K46n46l76P95
57408A59913J497J381J392J390L45j150j370n02l84j107r25L58J041P38Q26J345
57392A64788P95n79n79J124K293J900J430J659J428M97L47J099R27l79n82J050
$$ y = [176854, 178194, 179418, 181217, 182653, 183050, 183450, 184834, 186360, 186726, 186016, 185067, 184189, 183561, 183594, 183941, 183410, 181759, 180171, 179127, 177371, 174098, 170603, 168485, 167570, 166860, 166239, 165949, 165505, 164460, 163362, 162864, 162746, 162662, 162864, 163361, 163438, 162746, 161806, 160734, 158676, 155281, 151588, 148746, 146944, 146091, 146162, 146353, 145433, 143582, 142339, 142119, 141529, 139841, 138272, 137856, 137866, 137411, 136869, 136594, 135966, 134879, 134436, 134965, 135098, 134135, 133515, 134510, 136222, 137403, 138598, 140726, 143125, 144793, 146266, 148463, 150786, 152063, 152386, 152488, 152346, 151842, 151734, 152485, 153179, 152987, 152659, 153242, 154369, 155196, 155888, 156836, 157498, 157413, 157327, 157968, 158772, 159048, 159238, 159794, 160040, 159494, 159118, 159913, 161410, 162791, 164183, 165573, 165918, 164768, 163398, 162896, 162512, 161405, 160480, 160838, 161879, 162617, 163443, 164788, 165583, 165004, 164425, 165549, 167842, 169742, 171172, 172831, 174259, 174756, 175103, 176202, 177129, 176750, 176168, 177218]
57376A77218K244J621Q35J214J458M80m00r0J87n90j148l10Q04Q22K68j4m46j173
57358A82980j037K78J165O16j02K63J028J270J425J881J981J659J931K712K390
57343B00440P24k89L26R52M16p1N00R53L27k07L33Q54L93l6M01N59m34j393j316
57324B03432j257k033k391j413n43j077j735r96J05q1r37r03j49K97O07J243J371
57307A93540K63r76r91k13L25Q00J560J773R13J44N47J304J323J102J408J564
57291B04386Q54J17L10Q70J033J273J960K242J758J652K353K312P19n74J45J616
57275B23026J846J294J533K358K638K755L699M877N039M464M170L958L141K203
57261B67001J928J845J305R48J519K297K367K161K233J862O35j44O39J947K333
$$ y = [177218, 179462, 181083, 181918, 183132, 184590, 185070, 184670, 184580, 184767, 184177, 183029, 182719, 183523, 184345, 184613, 184599, 184153, 182980, 181943, 182221, 183386, 184002, 183900, 184163, 185191, 186461, 187886, 189767, 191748, 193407, 195338, 198050, 200440, 201164, 200875, 201201, 202153, 202569, 202498, 202998, 203951, 204278, 204071, 204404, 205258, 205651, 205615, 206016, 206575, 206141, 204748, 203432, 202175, 200142, 197751, 196338, 195795, 194718, 192983, 191987, 192092, 192011, 191074, 190171, 190022, 190319, 190926, 192169, 193540, 193803, 192827, 191836, 191623, 191948, 192748, 194308, 196081, 196994, 197138, 197685, 198989, 200312, 201414, 202822, 204386, 205240, 205357, 205667, 206537, 207570, 208843, 210803, 213045, 214803, 216455, 218808, 221120, 221839, 221265, 221410, 223026, 224872, 226166, 227699, 230057, 232695, 235450, 239149, 244026, 249065, 253529, 257699, 261657, 264798, 267001, 268929, 270774, 272079, 273027, 274546, 276843, 279210, 281371, 283604, 285466, 286101, 285957, 286596, 288543, 290876]
57246B90876K188K407K438J616J010J786L013L160K537K259K087J315O17R27J615
57231C19851J695J709K497L310L115K536K560K608J912J483K523M059M361L651
57217C57870L298L350K970K410K437K695K466K232K719L403L644M094N301O177
57203D05066N711M825M775N033M678M363M944N638N596N726O883P827P290O475
57189D84830P044Q205Q354Q154R177J0805J1288J0887J1193J2196J2722J2980
57177F07835J4012J5388J5910J5871J6340J6924J6609J5978J6294J7189J7461
57166G85811J7311J7526J7446J6001J3861J2267J0752Q221N265L197J863O38L38
57153I10497J794L887N441P656J2070J7462K1579K4693K8546L2948L6313L8590
$$ y = [290876, 293064, 295471, 297909, 299525, 300535, 302321, 305334, 308494, 311031, 313290, 315377, 316692, 317309, 318236, 319851, 321546, 323255, 325752, 329062, 332177, 334713, 337273, 339881, 341793, 343276, 345799, 349858, 354219, 357870, 361168, 364518, 367488, 369898, 372335, 375030, 377496, 379728, 382447, 385850, 389494, 393588, 398889, 405066, 410777, 415602, 420377, 425410, 430088, 434451, 439395, 445033, 450629, 456355, 463238, 471065, 478355, 484830, 491874, 500079, 508433, 516587, 525764, 536569, 547857, 558744, 569937, 582133, 594855, 607835, 621847, 637235, 653145, 669016, 685356, 702280, 718889, 734867, 751161, 768350, 785811, 803122, 820648, 838094, 854095, 867956, 880223, 890975, 899196, 904461, 907658, 909521, 910159, 910497, 912291, 916178, 921619, 929275, 941345, 958807, 980386, 1005079, 1033625, 1066573, 1102886, 1141476]
57141A141476M0726M2184M1887M0812M0875M2015M2925M3760M5448M7459M8746
57130A618313M9928N1937N3888N4868N6355N9989O4416O7300O9049P1563P4912
57119B292518P8346Q2953Q9965R8029J05603J14490J27606J44949J65140J88820
57109C488419K16503K45296K72470L01040L37393L84537M41889N10400N93751
57100F791698O95838Q21357R77700J172612J411679J701152K049572K461608K932839
57091B1016055L454521M018721M612993N214873N798102O338517O807054P165137
57083F4425973P374207P391356P131577O451687N228630L493453J479024m90764
57075A02485143k171788l480402m452316n163435n682342o052858o287771o377162
$$ y = [1141476, 1182202, 1224386, 1266273, 1307085, 1347960, 1389975, 1432900, 1476660, 1522108, 1569567, 1618313, 1668241, 1720178, 1774066, 1828934, 1885289, 1945278, 2009694, 2076994, 2146043, 2217606, 2292518, 2370864, 2453817, 2543782, 2641811, 2747414, 2861904, 2989510, 3134459, 3299599, 3488419, 3704922, 3950218, 4222688, 4523728, 4861121, 5245658, 5687547, 6197947, 6791698, 7487536, 8308893, 9286593, 10459205, 11870884, 13572036, 15621608, 18083216, 21016055, 24470576, 28489297, 33102290, 38317163, 44115265, 50453782, 57260836, 64425973, 71800180, 79191536, 86323113, 92774800, 98003430, 101496883, 102975907, 102485143, 100313355, 96832953, 92380637, 87217202, 81534860, 75482002, 69194231, 62817069]
57067F2817069o311473o099091n765065n341162m860062m352532l844190l354655
57059B2888839k899373k489289k128628j816043j548591j323039j134752r78615
57051H570509q50726p46809o60166n84113n15721m54695m00023l50542l07122
57042C700592k70853k40011k11983j87044j67056j51347j37101j22938j09239
57033B103020r5868q2464o9910n8535m6130l0501j2431O939K8862N1854O5387
57022A860223N5606J9606k9752p4674j05001j19982j22917j17691j08110r6998
57012A160310q5551p4348o4197n5499m7875m1039l5191l0360k6236k2767k0121
57001F57126j8033j6057j4284j2990j2009j1213j0982j1225j0666q452n741m389
$$ y = [62817069, 56505596, 50406505, 44641440, 39300278, 34440216, 30087684, 26243494, 22888839, 19989466, 17500177, 15371549, 13555506, 12006915, 10683876, 9549124, 8570509, 7719783, 6972974, 6312808, 5728695, 5212974, 4758279, 4358256, 4007714, 3700592, 3429739, 3189728, 2977745, 2790701, 2623645, 2472298, 2335197, 2212259, 2103020, 2007152, 1924688, 1854778, 1796243, 1750113, 1719612, 1707181, 1714120, 1742982, 1794836, 1860223, 1915829, 1935435, 1905683, 1831009, 1726008, 1606026, 1483109, 1365418, 1257308, 1160310, 1074759, 1000411, 936214, 880715, 832840, 791801, 756610, 726250, 700014, 677247, 657126, 639093, 623036, 608752, 595762, 583753, 572540, 561558, 550333, 539667, 531215, 525474, 521085]
56989E21085m543m786m142k565O4M039Q873J3079J4765J2203M890n222j4484k0533
56975E22723k3734k5329k5518k4263k2281j9988j6808j2816r525p688n801k402
56963C26570J548M338O264Q957J3067J8322K4623L1017L4435L1644K2333R079
56951E32197m991j7318k5939l0279l1471l0735k8145k3843j9181j5319j1830p977
56939B85169m133o87L086P686J2293J6423K1234K7641L4499L9944M2851M1473
56927E27479L2969J6761k956k0317l2350l9070m0998l9125l5741l2586k9069k4319
56915B80678j9653j6733j4736j2005r210q161q426p969o455n253m678l789k485
56902A61125j486o23O89J855K036K011K984M375M987N468P265R935J2039J3885
$$ y = [521085, 516542, 511756, 507614, 505049, 505113, 509152, 518025, 531104, 545869, 558072, 562962, 557740, 543256, 522723, 498989, 473660, 448142, 423879, 401598, 381610, 364802, 351986, 342461, 334773, 328972, 326570, 328118, 332456, 338720, 347677, 360744, 379066, 403689, 434706, 469141, 500785, 523118, 532197, 527206, 509888, 483949, 453670, 422199, 391464, 363319, 339476, 320295, 304976, 293146, 285169, 281036, 280349, 283435, 291121, 303414, 319837, 341071, 368712, 403211, 443155, 486006, 527479, 560448, 577209, 574253, 553936, 521586, 482516, 441518, 402393, 366652, 334066, 304997, 280678, 261025, 244292, 229556, 217551, 208341, 200180, 191754, 183785, 177330, 172077, 167399, 163610, 161125, 159639, 159016, 159705, 161560, 163596, 165607, 168591, 172966, 177953, 183421, 190686, 200621, 212660, 226545]
56888B26545J6865K0723K4093K6942K9683L0373K5995J6577N484m450j2573j8395
56876C87862k0851k0188j8187j5918j2997r281n347j171L787R053J3480J7250
56864C27492K1799K7800L4854M3091N3104O3952P2406P4236O5736M5544J7008
56853H47022j2036l4157m7109n2923n3753n0668m5090l8466l0822k1805j2595
56842D47598m614K870J1527K1205L0838M1204N4027O9082Q4939J01310J16735
56831I76721J24348J14558Q3810L8581r737n1573q1359r7397j01822r8792r1156
56820H06182p9871o6377n3095m1145k9808j8846r166o53Q427J9032L0309M1601
56808F06590N3715O7086P9755Q7380Q4469O6720L4809l790l8784o3638p7559q2413
$$ y = [226545, 243410, 264133, 288226, 315168, 344851, 375224, 401219, 417796, 423280, 418830, 406257, 387862, 367011, 346823, 328636, 312718, 299721, 290440, 285093, 283922, 287709, 296762, 310242, 327492, 349291, 377091, 411945, 455036, 508140, 572092, 644498, 718734, 784470, 830014, 847022, 834986, 800829, 753720, 700797, 647044, 596376, 551286, 512820, 481998, 460193, 447598, 442984, 445854, 457381, 478586, 509424, 550628, 604655, 673737, 758676, 859986, 976721, 1101069, 1215627, 1299437, 1338018, 1328281, 1276708, 1195349, 1097952, 996130, 897338, 806182, 726311, 659934, 606839, 565694, 535886, 517040, 507874, 507221, 515648, 534680, 564989, 606590, 660305, 727391, 807146, 894526, 978995, 1045715, 1080524, 1076734, 1037950, 974312, 896753, 814340]
56796H14340q0322p3887o5720n6826m7126l7505k9437k2718j5874q653j927M589
56784C78934J2003J9860K6805L3343M0738M6874M6476L6544J9220j102k0792l6730
56772F02173m6374m9789m9468m7123m2604l6444l0831k6899k3431j9380j5641
56761B14189j3138j1188q915o636m941l836l477m126n047n096m684n142o120n806
56747A26037l980k441k030j684r61q76j590j746r78o03j002p74N65J502J071K87
56731A10797L1k09o18l92L55L18n27n57N26Q97j54q70p2R66J044R69J528J867
56713A15899J360Q94R86P88J71L86J405J199p52j929n63J531J955J211R75J054
56697A26570N26J9M85J060M88n53n82L33J165J787K513K876K479K038K120J963
$$ y = [814340, 734018, 660131, 594411, 537585, 490459, 452954, 423517, 400799, 384925, 376272, 374345, 378934, 390937, 410797, 437602, 470945, 511683, 558557, 605033, 641577, 660797, 659695, 638903, 602173, 555799, 506010, 456542, 409419, 366815, 330371, 299540, 272641, 249210, 229830, 214189, 201051, 189863, 180948, 174312, 169371, 165535, 162058, 157932, 152885, 147789, 143105, 137963, 131843, 126037, 122057, 119616, 117586, 115902, 114941, 114065, 112475, 110729, 109751, 109148, 108146, 107372, 107937, 109439, 110510, 110797, 110828, 110619, 110001, 109609, 109964, 110282, 109755, 109198, 109724, 110621, 110467, 109597, 109525, 110491, 111535, 112504, 114032, 115899, 117259, 118153, 119139, 119927, 120098, 120484, 121889, 123088, 122336, 120407, 119844, 121375, 123330, 124541, 125516, 126570, 127096, 127115, 127600, 128660, 129148, 128595, 128013, 128346, 129511, 131298, 133811, 136687, 139166, 141204, 143324, 145287]
56681A45287R51O2L71J243J368O46k06q69j171p45N8J77m46m76N33J162M19o27
56663A47737p01k35j01r8J03o1p79j084n29j77p02j098n15J87R8j09L55Q29N46
56644A43666K04O41J299J391J464K348L583M098L541K073m7j904k303j488j034
56629A57532j428j449n99j71r08j663j518j275j604j643q50l33r08j579j375r53
56613A39276j035j014m60k66q60j021J27J566K126K060J712N64j145j818r53j73
56597A38686n06p42Q6Q54O21M59J225J652O56n88p30m80p75p89J98R44M07j68
56579A41010N57J586J461Q34R19J217R65J037K201L131K508J474J752K815L137
56564A66604K801K785L077L484M736O895Q372Q327Q146Q615P949M873J336l71
$$ y = [145287, 146238, 146300, 146671, 147914, 149282, 149928, 149722, 148853, 147682, 146937, 146995, 147172, 146726, 146250, 146783, 147945, 148364, 147737, 147036, 146801, 146700, 146602, 146705, 146644, 145865, 144781, 144252, 144075, 143373, 142275, 141760, 141947, 142045, 141936, 142291, 143120, 143666, 143870, 144511, 145810, 147201, 148665, 151013, 154596, 158694, 162235, 164308, 164261, 162357, 160054, 158566, 157532, 156104, 154655, 154056, 153885, 152977, 151314, 149796, 148521, 146917, 145274, 144424, 144091, 143183, 141604, 140229, 139276, 138241, 137227, 136767, 136501, 135641, 134620, 134747, 136313, 138439, 140499, 142211, 142775, 141630, 139812, 138859, 138686, 138180, 137438, 137524, 138378, 138999, 139458, 140683, 142335, 142991, 142403, 141673, 141193, 140418, 139629, 139827, 140771, 141178, 141010, 141567, 143153, 144614, 145448, 146367, 147584, 148549, 149586, 151787, 154918, 157426, 158900, 160652, 163467, 166604, 169405, 172190, 175267, 178751, 183487, 190382, 198754, 207081, 215227, 223842, 231791, 236664, 238000, 237629]
56550B37629r82j984k372q14R99O22j022j273j11L96j50n43p90j683k404j684
56534B23834o36j332l235m017l319k758k709k068q76l95o78n71K9J79j44k20k61
56517B00823r23j647j530j120j415j913j636j153j472j925j367m28l50o29q5P43
56501A83973O26N8K92R67R70O03O08L01r87j900j101Q3k81j385j281m65p25j564
56483A78792j122K13M20m70n68M02Q58L73O4K07M1l09j38J02k83l59R78K501K323
56464A84025J109R24J711J804J128R13R21lj233j113J11Q32R36J292J324L1j381
56447A93331j042K51L63l16K69J845K240J357J156J855J653K54p00p27r47j398
56431A99444r85q6k01j036r18J12M86J66M55J121P82q9K43J390J286j37q87m48
$$ y = [237629, 236647, 234663, 232291, 231477, 232476, 233098, 232076, 230803, 230692, 231088, 230938, 230395, 229605, 227922, 225518, 223834, 223198, 221866, 218631, 214614, 211295, 208537, 205828, 203760, 202884, 202489, 201811, 201240, 201269, 201448, 201304, 201084, 200823, 199900, 198253, 196723, 195603, 194188, 192275, 190639, 189486, 188014, 186089, 184722, 184294, 183944, 183315, 183230, 183973, 184599, 184657, 184949, 185916, 186886, 187489, 188097, 188398, 187411, 185511, 184410, 184493, 184212, 182827, 181546, 181081, 180356, 178792, 177670, 177883, 178303, 177833, 177265, 177667, 178525, 178898, 178962, 179169, 179210, 178901, 178763, 178865, 178582, 178223, 179201, 181702, 184025, 185134, 186058, 187769, 189573, 190701, 191614, 192535, 192532, 191299, 190186, 190297, 191129, 192065, 193357, 194681, 194712, 193331, 192289, 192540, 192903, 192587, 192856, 194701, 196941, 198298, 199454, 201309, 202962, 203216, 202516, 201789, 200842, 199444, 198459, 198373, 198172, 197136, 196218, 196330, 196816, 196982, 197437, 198558, 199340, 199251, 199494, 200884, 202170, 202033, 201146, 200698]
56413B00698j95m16n3O55M74r3N24J685J300m26j249p57n59p61J46J830K183J100
56395B06086P39J708K257J683J244J371J055L30L82J054J089P69J360K247J790
56380B25164N98N96J317P87m42n6J550J731L69PJ100J438N08K05P55K39j269j318
56362B33279M48J523R97P71J581J832J136J030J517Q82m33O1K175K811J229K08
56346B51047R42J268J72m08K55J73j157j273P25K278J789J105J741K388J993J769
56330B64807K381K509J798J830K822K800J361O61J480J956J365J377K358K365
56316B91870J072O91J680J765M53K48J821K493J243O79K050K816J461M06J580
56301C12328L186L379L351M224M590L591K984L817M474M073M355O070P107O220
$$ y = [200698, 200503, 200087, 200034, 200689, 201163, 201070, 201594, 203279, 204579, 204153, 202904, 202147, 201588, 200827, 200973, 202803, 204986, 206086, 206825, 208533, 210790, 212473, 213717, 215088, 216143, 216473, 216855, 217909, 218998, 219767, 221127, 223374, 225164, 225762, 226358, 227675, 228462, 228020, 227964, 229514, 231245, 231614, 231621, 232721, 234159, 234667, 234872, 235627, 235866, 234597, 233279, 233727, 235250, 236247, 237018, 238599, 240431, 241567, 242597, 244114, 244996, 244563, 244624, 246799, 249610, 250839, 251047, 251989, 253257, 253429, 253021, 253276, 253449, 252292, 251019, 251744, 254022, 255811, 256916, 258657, 261045, 263038, 264807, 267188, 269697, 271495, 273325, 276147, 278947, 280308, 280969, 282449, 284405, 285770, 287147, 289505, 291870, 292942, 293633, 295313, 297078, 297531, 297779, 299600, 302093, 303336, 304015, 306065, 308881, 310342, 310748, 312328, 315514, 318893, 322244, 326468, 331058, 334649, 337633, 341450, 345924, 349997, 354352, 360422, 367529, 373749]
56287C73749N173N257N287M810N465P351P961O695O330Q053R236Q295P540Q780
56273D69982J0272J0418J0571J1715J2338J1886J2442J4678J6227J6228J7267
56262F14024K0516K3418K4595K6525L0769L5100L8151M2383M9438N6998O3227
56251A025144P0030P8934Q8088R6268J05391J16061J25220J31245J36687J42799
56241B115867J46227J44514J39992J34498J25188J09610R0196O9696M6724K0171
56231C142683o513k9805n0695p0614q7205r8555j07309j16001j22358j23796j22473
56220B207359j21353j19220j14198j08207j03334r7695q9615q1914p7282p3332
56210A221209o7038o0231n5796n2272m7216m2200l9378l6799l2186k7670k5761
$$ y = [373749, 378922, 384179, 389466, 394276, 399741, 407092, 415053, 421748, 428078, 436131, 445367, 453662, 461202, 469982, 480254, 490672, 501243, 512958, 525296, 537182, 549624, 564302, 580529, 596757, 614024, 634540, 657958, 682553, 709078, 739847, 774947, 813098, 855481, 904919, 961917, 1025144, 1095174, 1174108, 1262196, 1358464, 1463855, 1579916, 1705136, 1836381, 1973068, 2115867, 2262094, 2406608, 2546600, 2681098, 2806286, 2915896, 3006092, 3075788, 3122512, 3142683, 3136170, 3106365, 3055670, 2985056, 2897851, 2799296, 2691987, 2575986, 2453628, 2329832, 2207359, 2086006, 1966786, 1852588, 1744381, 1641047, 1543352, 1453737, 1371823, 1294541, 1221209, 1154171, 1093940, 1038144, 985872, 938656, 896456, 857078, 820279, 788093, 760423, 734662]
56199G34662k4303k0596j6786j5812j5650j3138r989r393r896q367n939n404n671
56186E73718m227k406k738l842l165j969k525l296j993l86r36j811m14J344O33
56171E45987o95M82K641K656J661K442L949L823L375M781O388O030N731P893J0285
56156F07429J0206R897J2254J5013J5051J4574J6932K0077K0650K0865K4728L0938
56144H18614L6093M1537N0443O1392P1448Q2096R5349J07331J12540J11219J06116
56133A694178R5974P9485O1925N0104M3837L9237L6485L6594L4653K5039J0535
56122B208046j750j0444j8070k2968k2233k0033k3931l4782m8089o2647p9379
56111A863720r4325j01776j02518j00933r6420q5957p2460o1718n3365m3432l3284
$$ y = [734662, 710359, 689763, 672977, 657165, 641515, 628377, 618388, 608995, 599099, 590732, 584793, 579389, 573718, 569491, 567085, 564347, 560505, 557340, 555371, 552846, 549550, 547557, 547171, 546235, 544424, 544010, 545354, 545987, 545292, 545774, 548415, 551071, 552732, 555174, 559123, 562946, 566321, 571102, 577490, 583520, 589251, 597144, 607429, 617635, 627532, 639786, 654799, 669850, 684424, 701356, 721433, 742083, 762948, 787676, 818614, 854707, 896244, 946687, 1008079, 1079527, 1161623, 1256972, 1364303, 1476843, 1588062, 1694178, 1790152, 1869637, 1931562, 1981666, 2025503, 2064740, 2101225, 2137819, 2172472, 2197511, 2208046, 2206296, 2195852, 2177782, 2154814, 2132581, 2112548, 2088617, 2053835, 2005746, 1943099, 1863720, 1769395, 1667619, 1565101, 1464168, 1367748, 1281791, 1209331, 1147613, 1094248, 1050816, 1017532]
56100A017532k7197k3661j8176j2265j0526j1108q487l589j728k513j243J636
56088H98675J860K48J033L293L045J714L367O166N785M451O902J0504R634O616
56074I63293P621J0848J0099P115Q571J3284J4488J2611J3719J7224J7401J5294
56062A111568J6755K0291J9368J5218J4794J7420J6357J2158J1502J3949J3035
56051A282415R440R810J3539J3994J1791J3392J7759J8123J5708J7619K2497K2786
56039A468873J9846K1785K7517K8495K5241K6267L1442L2805L1208L5327M4376
56028A793182M8796M8026N0393N5463N4304M7598M5380M8317M7399M2725M3856
56017B325439N0773N3560N1778N4804O2262O4050O0606O2605O9792P1359O8026
$$ y = [1017532, 990335, 966674, 948498, 936233, 925707, 914599, 906112, 902523, 900795, 898282, 897039, 898675, 900535, 900783, 901816, 905109, 908154, 909868, 913235, 919401, 925186, 929637, 936539, 947043, 956677, 963293, 970914, 981762, 991861, 998976, 1007547, 1020831, 1035319, 1047930, 1061649, 1078873, 1096274, 1111568, 1128323, 1148614, 1167982, 1183200, 1197994, 1215414, 1231771, 1243929, 1255431, 1269380, 1282415, 1291855, 1301665, 1315204, 1329198, 1340989, 1354381, 1372140, 1390263, 1405971, 1423590, 1446087, 1468873, 1488719, 1510504, 1538021, 1566516, 1591757, 1618024, 1649466, 1682271, 1713479, 1748806, 1793182, 1841978, 1890004, 1940397, 1995860, 2050164, 2097762, 2143142, 2191459, 2238858, 2281583, 2325439, 2376212, 2429772, 2481550, 2536354, 2598616, 2662666, 2723272, 2785877, 2855669, 2927028, 2995054]
56006B995054P1721Q2179Q6855Q5340R0192J01940J07805J07124J12742J25047
55996C965999J30855J30386J38083J53950J62438J62838J71297J89275K00816
55987E405937K04953K18664K43253K61344K72071K94099L28410L55043L72807
55978G956581M03362M49258M88910N20658N68454O35525O98359P55925Q36096
55969A3313128R43211J051607J162449J310900J504957J718361J958208K273620
55961B5236441K683004L166107L743724M481640N397206O458037P697517R226415
55953F8090091J1111986J3383690J6189118J9772185K4247931K9590777L5792374
55946B18178152M2435205M7628877M7831150L9835333K3612652L065651j6312421
$$ y = [2995054, 3066775, 3148954, 3235809, 3321149, 3411341, 3513281, 3621086, 3728210, 3840952, 3965999, 4096854, 4227240, 4365323, 4519273, 4681711, 4844549, 5015846, 5205121, 5405937, 5610890, 5829554, 6072807, 6334151, 6606222, 6900321, 7228731, 7583774, 7956581, 8359943, 8809201, 9298111, 9818769, 10387223, 11022748, 11721107, 12477032, 13313128, 14256339, 15307946, 16470395, 17781295, 19286252, 21004613, 22962821, 25236441, 27919445, 31085552, 34829276, 39310916, 44708122, 51166159, 58863676, 68090091, 79202077, 92585767, 108774885, 128547070, 152795001, 182385778, 218178152, 260613357, 308242234, 356073384, 395908717, 419521369, 422587020, 406274599]
55939D06274599l0612535l8773236m1684458m0837053l7665784l3366683k8764316
55932A54570534k4302866k0226538j6703388j3779620j1368764r372406p751627
55925E1065325o462334n415310m542998l835877l280021k822139k424865k096921
55917B0184860j840384j621183j416845j243254j109682r92737q77153p79313
55909A0304309p08530o44828n75646n17125m79196m44747m02311l66105l45289
55900E820532l24821k94595k67980k54129k39948k16316j95526j86514j77889
55891C662814j61170j46906j42537j37163j23014j10251j06275j01217q7778p5561
55881B470942p2464p1053o5999o6011p5604q3213q0125p4234p3202p0923o2514
$$ y = [406274599, 375662064, 336888828, 295204370, 254367317, 216701533, 183334850, 154570534, 130267668, 110041130, 93337742, 79558122, 68189358, 58816952, 51065325, 44602991, 39187681, 34644683, 30808806, 27528785, 24706646, 22281781, 20184860, 18344476, 16723293, 15306448, 14063194, 12953512, 11960775, 11083622, 10304309, 9595779, 8950951, 8375305, 7858180, 7378984, 6934237, 6531926, 6165821, 5820532, 5495711, 5201116, 4933136, 4679007, 4439059, 4222743, 4027217, 3840703, 3662814, 3501644, 3354738, 3212201, 3075038, 2952024, 2841773, 2735498, 2634281, 2546503, 2470942, 2398478, 2327425, 2261426, 2195415, 2119811, 2036598, 1956473, 1882239, 1809037, 1738114, 1675600]
55870A675600n6116n7693n9483n5152n1418n3641n4625m8729m2910m2866m2094
55859A110873l5166k8333k6599k3638j4950q045r008j1409q947o968j1124j6148
55847I10538j6261j5678j8804k0783j7549j4872j7727k0706j8320j4992j5743
55836G19103j6684j3816j1644j3951j5399j1429p388q833j1506r921p307q094
55824E83131q852n722k986n330q950q871p865r919j1926j0112p808q852j0016
55811D75922p662n235o437p686m974j708k091l103o29K669L069L253O594R860
55797D61842Q943O313N703M977J140l134m706o116r869j2354j0181o922o704o838
55783D22094l783q30k491o391p930q170j0017j1363r120n643m345l030J758Q015
$$ y = [1675600, 1619484, 1561791, 1502308, 1447156, 1395738, 1342097, 1287472, 1238743, 1195833, 1152967, 1110873, 1075707, 1047374, 1020775, 997137, 982187, 974142, 965134, 953725, 944778, 937810, 926686, 910538, 894277, 878599, 859795, 839012, 821463, 806591, 788864, 768158, 749838, 734846, 719103, 702419, 688603, 676959, 663008, 647609, 636180, 628792, 619959, 608453, 598532, 591225, 583131, 574279, 568557, 565571, 560241, 551291, 542420, 534555, 524636, 512710, 502598, 494790, 485938, 475922, 468260, 463025, 456588, 448902, 443928, 442220, 440129, 437026, 436397, 439066, 442135, 445388, 451982, 461842, 470785, 477098, 482801, 487778, 488918, 485784, 481078, 474962, 465093, 452739, 442558, 435636, 428932, 422094, 418311, 417481, 414990, 408599, 400669, 392499, 382482, 371119, 361999, 356356, 352011, 348981, 350739, 358754]
55769C58754J2064J4569J6611J4566N834m623j0273j1714j3158j4438j3138j0825
55757C44229j0388j0423q438o249o420o886n011l285n009p936q101o516o230o300
55743B47037m496k497k658l111j609m81k102l485j428R46p70m381m873k728j838
55728B11526k241j578r91k924n503n427m119m895o426n293k647k087k979k046
55714A62370L31J345J470L143N550O309O393P804Q472N314M64j460o82j117l436
55699B02270n089n750p061q176p068n118n142o066m778j961q41j374r35L87M26
55684A43724j53J206L939N209M926N211N856M980L233K689K622R32j338j547l48
55669A81141m59j753k076j720k431l297k298n94o19j292j6J999J576m94p09R47
$$ y = [358754, 370818, 385387, 401998, 416564, 422398, 417775, 407502, 395788, 382630, 368192, 355054, 344229, 333841, 323418, 314980, 308731, 302311, 295425, 290414, 287129, 282120, 274184, 266083, 259567, 253337, 247037, 242541, 240044, 237386, 234275, 232666, 232185, 230083, 226598, 225170, 226116, 225346, 220965, 216092, 213364, 211526, 209285, 207707, 206716, 203792, 198289, 192862, 188743, 183848, 177422, 172129, 169482, 167395, 164416, 162370, 162701, 164046, 165516, 168659, 174209, 180518, 186911, 194715, 203187, 208501, 208965, 207505, 206823, 205706, 202270, 197181, 191431, 184370, 176194, 169126, 164008, 158866, 152800, 148022, 146061, 145220, 143846, 142911, 143298, 143724, 143571, 144777, 148716, 153925, 158851, 164062, 169918, 174898, 178131, 180820, 183442, 184374, 183036, 181489, 181141, 180682, 178929, 176853, 175133, 172702, 169405, 167107, 166513, 165894, 164602, 164586, 166585, 168161, 167667, 166958, 167905]
55653A67905J433N04P87K388K700J432Q75J236M46j449k255j904k352l485l455
55638A64806k790l766n977o849o240o164o416m949k306j184j758j766r72j162
55624A12507k004j417J34K58o84j35J594J474p89k173j584j217k139k784k455
55609I8586k275k208j009N16J33j648j972m78K44o60j206o27m58j069q87K19M99
55592H5700k63l83K91J18r07j042l56o96j923j883l84M37rj86J30l31j081k87
55574G6945J420J581M41O42K150K065o8j271l50M01j58j34J293K015R12j91j16
55557H7577k10j176j472m75P2p14j328r03o47j042o67Q64J876J676J579J955J384
55540H8349j57n41Q85K077J821J366J445R72j00l4J272J443l75j918j697j243
$$ y = [167905, 169338, 169842, 170629, 173017, 175717, 177149, 178024, 179260, 179706, 178257, 176002, 174098, 171746, 168261, 164806, 162016, 158250, 152273, 145424, 139184, 133020, 126604, 121655, 119349, 118165, 116407, 114641, 113669, 112507, 110503, 109086, 109220, 109478, 108794, 108659, 110253, 111727, 110938, 108765, 107181, 105964, 103825, 101041, 98586, 96311, 94103, 93094, 93610, 93743, 92095, 90123, 89645, 89889, 89229, 88023, 87396, 86938, 85869, 84982, 85201, 85700, 85437, 85054, 85345, 85463, 84556, 83514, 83158, 82462, 80539, 78656, 78272, 78709, 78700, 78514, 78644, 78313, 77232, 76945, 78365, 79946, 80387, 81029, 83179, 85244, 85176, 83905, 83555, 83956, 83798, 83664, 84957, 86972, 87884, 87693, 87577, 87367, 86191, 84719, 84244, 84316, 83602, 82274, 81371, 80724, 79682, 79015, 79879, 81755, 83431, 85010, 86965, 88349, 88192, 87651, 88536, 90613, 92434, 93800, 95245, 96217, 96117, 96083, 97355, 98798, 98423, 96505, 94808, 93565]
55524I3565j846k271j577j152j990k673k032j276j636k237k003j507j405j214
55510F8746r21j525k745k655p57R62J253J267J852J849N90n05l34J40l3k20Pj61
55492F6810r04j046l73k96j213j665j112r02j477j317J02J132R53J007K037K540
55476F4276J638P88J001J084K09m37j94m38j743k321j143l8o26j635j333l49N7
55459E8796L44J202J776J287O25N11R1j027j413l40N56k4q04l19N49N22L49J095
55441F3776J845J265k7o93q02r67q28j27K67n8l9P77J032j9q46j69P90N44r2K31
55421F5860Q44M28m96o32j71j3N2N37Q50M58J43N30O33m29j600j539p68n42p38
55402F3407n29n9J08J47L30L46K68P86J574J154m92j273j96R40O02p1L21Q31K21
$$ y = [93565, 91719, 89448, 87871, 86719, 84729, 82056, 80024, 78748, 77112, 74875, 72872, 71365, 69960, 68746, 67825, 66300, 63555, 60900, 60143, 61105, 62358, 63625, 65477, 67326, 67916, 67411, 67077, 67217, 67184, 66964, 66971, 66810, 65906, 64860, 64487, 64191, 62978, 61313, 60201, 59299, 57822, 56505, 56607, 57739, 58692, 59699, 61736, 64276, 65914, 66702, 67703, 68787, 68996, 68559, 68365, 67927, 66184, 63863, 62720, 62682, 62056, 60421, 59088, 58739, 58796, 59140, 60342, 62118, 63405, 64030, 64541, 64632, 63605, 62192, 61852, 62408, 62384, 61580, 61261, 61810, 62332, 62681, 63776, 65621, 66886, 66859, 66166, 65364, 64397, 63569, 63442, 63709, 63651, 63612, 64389, 65421, 65402, 64556, 64387, 65177, 65721, 65629, 65860, 66704, 67132, 66636, 66004, 65833, 65820, 65872, 66409, 67259, 67717, 67860, 68390, 69023, 68594, 66994, 65455, 64687, 64145, 63407, 62878, 62819, 62927, 63074, 63404, 63750, 64018, 64804, 66378, 67532, 67040, 65767, 65571, 66511, 67113, 67042, 67363, 68194, 68415]
55383F8415n19j33L36n33j650j170K65O63m0l83j29j10j49N05J242Q98m7j28O44
55364F7977Q90P1j092j967k321j859p82j71m71n04O69J970J893P91N2o2j00O0
55346F5044O76R87K39q34j022m25J27M99Q03N65k64n88J34O20k59j541j792j412
55328F1557j445j340K9J962K673J857P46Q9k61l13J3K83K49M93J236J498N83o59
55310F9250j247j516j859j443J88J605J345J23n03m94n99n33K09Q40N35J36O93
55293F6730J399R65K3L9P35P32m3n63o62q86j105r92j154j946k159p63J090J688
55275F3128J325J215J021j69j466j329l04j20o34k54J064J764J361P95L51m82
55259F7266j223p89L98Q44L82J13J68k89r53n49P99J516J006K36j61m80o23o9
$$ y = [68415, 67896, 67763, 68099, 67566, 65916, 64746, 65011, 65674, 65634, 65251, 65122, 65012, 64863, 65368, 66610, 67508, 67461, 67333, 67977, 68867, 68938, 67846, 65879, 63558, 61699, 60917, 60746, 60275, 59771, 60440, 62410, 64303, 65094, 65146, 65084, 64984, 65044, 65720, 66707, 66946, 66112, 65090, 64665, 64792, 65291, 66094, 66659, 66395, 65807, 65941, 66561, 66302, 64761, 62969, 61557, 60112, 58772, 58801, 60763, 63436, 65293, 66039, 66128, 65867, 65554, 65567, 65850, 66099, 66592, 67828, 69326, 69909, 69250, 68003, 66487, 64628, 63185, 63373, 64978, 66323, 66446, 65943, 65449, 64850, 64317, 64526, 65366, 65901, 66037, 66730, 68129, 69094, 69117, 69156, 69891, 70623, 70580, 70017, 69355, 68469, 67364, 66372, 65218, 63272, 61113, 60350, 61440, 63128, 64453, 65668, 66689, 66520, 65054, 63725, 63421, 63301, 62667, 62413, 63477, 65241, 66602, 67397, 67748, 67266, 66043, 65254, 65652, 66496, 66878, 66991, 67159, 66870, 65917, 65368, 66167, 67683, 68689, 68925, 68764, 68284, 67661, 67592]
55241F7592P13O50r9l70L9K85K65N73Q97L37p19r32k16K65K01L53O88L18o32j013
55221F9195o86o79j174j183m88l8j32N7P91J216Q80L19n1l10k29M35R48M43l73
55202F8941m9J162J537N98k79j69L22N64P18P37J93n86p44m91r38k113k758k288
55184F4357j409o13L48J295J529J192J163J490J385Q59P24R43O49p6k72m5n28
55167G2991j627j776m00J147J702J552J171M10l87k25Q70J522J025K65P4J33Q6
55150G8533K33M94J50p69j216q47n68q17p86o6M36O6m34k40K33K00k31m43j90
55131G3738M39J186J468R12J84K49P41L60r87j864j436n29j39j87k61l83m81j79
55113G2831M51Q47Q81Q36N03m01j131o35N75R83N62P84J965K590J878R87P60K86
$$ y = [67592, 68305, 68955, 68856, 68486, 68525, 68810, 69075, 69648, 70545, 70882, 70163, 69231, 69015, 69280, 69481, 69834, 70522, 70840, 70208, 69195, 68509, 67830, 66656, 65473, 64985, 64947, 64815, 64872, 65663, 66879, 67759, 68078, 68027, 67717, 67488, 67923, 68871, 69314, 68941, 68892, 70054, 71591, 72189, 71910, 71741, 72063, 72627, 73345, 74082, 74275, 73689, 72945, 72454, 71516, 69403, 66645, 64357, 62948, 62335, 62683, 63978, 65507, 66699, 67862, 69352, 70737, 71596, 72320, 73263, 73912, 73836, 73564, 73519, 72991, 71364, 69588, 69188, 70335, 72037, 73589, 74760, 75170, 74783, 74558, 75428, 76950, 77975, 78240, 78314, 78447, 78533, 78766, 79260, 79410, 78641, 77425, 76578, 76010, 75193, 74407, 74341, 74777, 74843, 74409, 74169, 74402, 74602, 74371, 73928, 73738, 74177, 75363, 76831, 77743, 77927, 78176, 78917, 79277, 78290, 76426, 74990, 74461, 74322, 74135, 73874, 73491, 73010, 72831, 73282, 74129, 75010, 75846, 76349, 75948, 74817, 74182, 74757, 75740, 76302, 77086, 79051, 81641, 83519, 84506, 85266, 85552]
55095H5552j174k460k119m76J100J961K182J736P27k34o92p79n61J44R54R98K39
55078H7098l05p6L67N75Q60J260J163M93O6J91J67l31o56m82l91n92l96L47O91
55059I0049J46m77n07l95n51n06p1L8m34o11k6M29O4l80j07L37J67k59k68r1j60
55038H6387j12L58N77m4q07o74J91Q71J030Q80M61j26l07J57N36P5q45j311j178
55019H6119j008j065j052o58R6Q77J201Q61K56j32m08q16r14j87P51P48j18n86
55001H3965p9P21J248J566J426M03p97p79L67R66L46j65M98J551J863J484Q00
54984I5384k88j419j569p40l83j102j485l59J271J863J547J328J261Q81M60M75
54968I7125O08M70M58Q49Q89n7j251j583j024j90O60J345J369P80M19N45K73p49
$$ y = [85552, 84378, 81918, 79799, 79323, 80423, 82384, 84566, 86302, 87029, 86795, 86103, 85324, 84763, 84907, 85861, 86859, 87098, 86793, 86717, 87084, 87659, 88519, 89779, 90942, 91435, 91501, 91692, 91859, 91528, 90872, 90390, 89999, 89407, 89011, 89358, 90049, 90195, 89718, 89211, 88816, 88265, 87759, 87688, 87726, 87292, 86681, 86655, 87084, 87148, 86768, 86661, 86998, 87165, 86906, 86638, 86547, 86387, 86275, 86633, 87210, 87166, 86359, 85685, 85876, 86747, 87777, 88657, 89118, 88992, 88685, 88842, 89378, 89453, 88608, 87297, 86119, 85111, 84046, 82994, 82336, 82432, 83309, 84510, 85371, 85627, 85495, 85087, 84271, 83357, 83170, 83921, 84669, 84551, 83965, 83886, 84607, 85855, 87421, 88847, 89250, 88453, 87674, 88041, 89007, 89353, 89188, 89686, 91237, 93100, 94584, 95384, 95096, 93677, 92108, 91368, 90985, 89883, 88398, 88039, 89310, 91173, 92720, 94048, 95309, 96190, 96650, 97125, 97733, 98203, 98661, 99510, 100399, 100342, 99091, 97508, 96484, 96294, 96954, 98299, 99668, 100448, 100867, 101412, 101685, 100936]
54950A00936j370o86M47Q12N62L95J73l47n34k8K09o72j806j863j040m43l12j70
54932I4263RJ01N36J516K241K098J763K034K456K363K323L118M284N033N764P166
54916A37068Q561Q646P287N283K985M96j592k954m274n949p016o701n996o088
54902A29756o278n295l689k981l076k637j451n16r7L76P91N71J82N35J259J276
54886A08726Q61J154J932J895J095R67J816K439K549L441N588P474P764P043O519
54871A61263O265N625M323K371k68l252n710p069p485p281o610n816n339n116
54857A25901m728m128l640l263k748k195j831j444q49n71j068j632j188m8M19
54842I6987k71j232j656j588j226n48J78N23O51J034J445J132K6j057j462j089
$$ y = [100936, 99566, 98880, 99327, 100139, 100701, 101096, 101269, 100922, 100388, 100360, 100569, 99897, 98091, 96228, 95188, 94745, 94433, 94263, 94272, 94373, 94909, 96425, 98666, 100764, 102527, 104561, 107017, 109380, 111703, 114821, 119105, 124138, 129902, 137068, 145629, 154275, 161562, 166845, 169830, 170326, 168734, 165780, 161506, 155557, 148541, 141840, 135844, 129756, 123478, 118183, 114494, 111513, 108437, 105800, 104349, 103833, 103736, 104112, 104903, 105474, 105656, 106191, 107450, 108726, 109587, 110741, 112673, 114568, 115663, 116630, 118446, 120885, 123434, 126875, 132463, 139937, 147701, 154744, 161263, 167528, 173153, 177476, 179847, 179579, 176327, 170617, 163548, 156063, 148782, 142172, 136356, 131017, 125901, 121173, 117045, 113405, 110142, 107394, 105199, 103368, 101924, 101075, 100504, 99436, 97804, 96616, 96568, 96987, 96716, 95484, 93828, 92240, 91014, 90466, 90644, 91167, 91818, 92852, 94297, 95429, 95455, 94398, 92936, 91847]
54826I1847p7J105J528Q09q3q2L54Q4o68o86R2M42qj99M78J203J117M87J0l1M31
54805I8153J274J782J283L37K28J069J610J201N92M50L03m01j205j372q81j64
54789A04259N10R54R80P41O33P28P95Q52R86Q19J0q50q38JR07J769K920L827L526
54770A23529K477K317L440M459M580M817O002P129O886N674M760M292L398J749
54756A85509j19j792l334m776n897o512o583o189n632n289n163m949m505l879
54742A20890k916j459L9P74O69M31M48L85L5k62k96k38rP56J767J999J128K74
54724A24415P38K498M516N999O860P324P481P109N774L418Q42r75k042l205m807
54709A65945o163o541n951m805l521k641k585l039l214k901k590k461k099j397
$$ y = [91847, 91770, 92875, 94403, 95212, 95129, 95047, 95401, 95485, 94817, 94131, 94223, 94665, 94657, 94458, 94936, 96139, 97256, 97743, 97753, 97722, 98153, 99427, 101209, 102492, 102829, 103057, 104126, 105736, 106937, 107529, 107979, 108282, 107881, 106676, 105304, 104423, 104259, 104769, 105723, 106703, 107444, 108077, 108805, 109600, 110452, 111438, 112257, 112267, 111417, 110579, 110580, 111487, 113256, 116176, 120003, 123529, 126006, 128323, 131763, 136222, 140802, 145619, 151621, 158750, 165636, 171310, 176070, 180362, 183760, 185509, 185390, 183598, 180264, 175488, 169591, 163079, 156496, 150307, 144675, 139386, 134223, 129274, 124769, 120890, 117974, 116515, 116554, 117328, 117997, 118428, 118876, 119261, 119296, 119034, 118738, 118500, 118491, 119247, 121014, 123013, 124141, 124415, 125153, 127651, 132167, 138166, 145026, 152350, 159831, 166940, 172714, 176132, 176974, 175999, 173957, 170752, 165945, 159782, 153241, 147290, 142485, 138964, 136323, 133738, 130699, 127485, 124584, 121994, 119533, 117434, 116037]
54695A16037r02q88r21o90n28o94q59p63p00r14j090r31o66n88n69m11k02m4J17
54676A03794J68j25n67n51N4O72Q33P07N32K04k59m43j16L54N12L18m8m24n91
54657A05024m18k30m40p46l56P92J728J636P49j91p87r69p02j12M47P54Q63P82
54639A07824L73k73p79q51n36j21m5n72j244j134p4Q18O34K4J14O72O37j0l39
54620A05118k31m51r41p04L08P81P5p88p97l30j06O6O24J304J647J733J708J349
54602A10365O68J94J79J96j6j17M9M5l52p36q45q97q63l66L75N73K06J55O27O65
54582A10105j70r06p09j12J35K49N36N05j68p74p58p10j179j511r58qN70J005
54564A05142J670J860R12l07n57k40n44j145o09J029J967J250R0QQ82J623J778
$$ y = [116037, 115135, 114247, 113326, 112636, 112108, 111414, 110555, 109792, 109092, 108178, 107088, 106157, 105491, 104903, 104334, 103923, 103721, 103677, 103794, 103962, 103837, 103270, 102719, 102773, 103445, 104278, 104985, 105517, 105721, 105462, 105019, 104903, 105257, 105769, 106087, 106039, 105615, 105024, 104606, 104376, 103936, 103190, 102834, 103626, 105354, 106990, 107739, 107548, 106761, 105792, 105090, 104978, 105425, 106179, 107042, 107824, 108197, 107924, 107145, 106294, 105758, 105637, 105592, 105020, 103776, 102642, 102568, 103386, 104020, 104044, 104158, 104830, 105467, 105457, 105118, 104887, 104436, 103495, 102791, 103099, 103880, 103955, 103167, 102370, 102040, 101934, 102000, 102624, 103928, 105575, 107308, 109016, 110365, 111033, 111227, 111406, 111602, 111586, 111469, 111518, 111563, 111211, 110475, 109630, 108733, 107870, 107504, 107879, 108452, 108658, 108813, 109440, 110105, 109935, 109029, 108320, 108208, 108343, 108592, 109128, 109633, 109465, 108691, 107933, 107223, 106044, 104533, 103575, 103567, 104137, 105142, 106812, 108672, 109584, 109277, 108720, 108480, 107936, 106791, 106182, 107211, 109178, 110428, 110518, 110526, 111408, 113031, 114809]
54547A14809J705J636J360P27J2k96k0M58N46J21l68m84j99L64J060J522J309
54530A24262N04l31r12j344j408o37O08J128N23j21J47P34N39l50j024j239j481
54513A19598j901k120j921j327l24Q87J611J384O97L91O03Q73R76R35O14p9q36
54496A20061j306j520j549j158l52K75K86K2p6j92n09n27J96J122J437J195R43
54479A18348P06K42r6K48J042J560J692J892K185K104J562J038Q75R75J143J163
54463A36679P67K7m87m16j64j97k50J39P39R54O93K15m53j210j464q92k40m71
54445A33969j351j836j570j105q00n00k40l49p71r89p90m49k22j35k00l23j25
54428A22214N37J131J072N64K24J77J53J76M41P91R67J112J349J213K78r74j727
$$ y = [114809, 116514, 118150, 119510, 120237, 120249, 119953, 119933, 120391, 120937, 121058, 120690, 120206, 120007, 120371, 121431, 122953, 124262, 124766, 124435, 123523, 122179, 120771, 120134, 120742, 121870, 122393, 122272, 122419, 123153, 123692, 123342, 122318, 121079, 119598, 117697, 115577, 113656, 112329, 112005, 112892, 114503, 115887, 116584, 116975, 117578, 118451, 119427, 120362, 120976, 120897, 120061, 118755, 117235, 115686, 114528, 114176, 114451, 114737, 114759, 114683, 114491, 113982, 113455, 113651, 114773, 116210, 117405, 118348, 119054, 119296, 119200, 119448, 120490, 122050, 123742, 125634, 127819, 129923, 131485, 132523, 133398, 134373, 135516, 136679, 137446, 137473, 136986, 136570, 136406, 136209, 135959, 136098, 136837, 137791, 138484, 138699, 138246, 137036, 135572, 134680, 134440, 133969, 132618, 130782, 129212, 128107, 127307, 126807, 126567, 126218, 125447, 124458, 123668, 123219, 122997, 122862, 122662, 122339, 122214, 122751, 123882, 124954, 125518, 125742, 125919, 126072, 126248, 126689, 127480, 128447, 129559, 130908, 132121, 132399, 131425, 129698]
54411A29698j911j913j596o52M08P12M01M67J180J752J628J120O14J9o37q79l84
54394A30027N57J440J938J904J408P92K93k66r76j386j076l50K60Q02J431J611
54378A38409Q21k81n27Q6N39N72J006K153L135L213K758K363J950J328Q06O63
54362A58994N76J43m91j005j388j646j498q52k92m70j214j649j201k24M53L63
54346A48599k43q29j135j173r81o91p31j324j830j338p0O75K70m28n18k77k69
54329A37707k38J14J42o94j523j120J50Q07L80l20p52j098j220o08M51R05M39
54312A33522j44k32r7k5J82N45O64M42K18mn79j297j374o16K27N51N48N06K79
54293A33316k01n47m04J80R47J500J305K72p31p38K5N05L27Jj85l95m68k8M96
$$ y = [129698, 127787, 125874, 124278, 123626, 124034, 124746, 125147, 125614, 126794, 128546, 130174, 131294, 131908, 131927, 131290, 130411, 130027, 130584, 132024, 133962, 135866, 137274, 138066, 138359, 138093, 137117, 135731, 134655, 134305, 134565, 135367, 136798, 138409, 139230, 138949, 138422, 138508, 139047, 139619, 140625, 142778, 145913, 149126, 151884, 154247, 156197, 157525, 158331, 158994, 159570, 159713, 159222, 158217, 156829, 155183, 153685, 152833, 152541, 152071, 150857, 149208, 148007, 147783, 148236, 148599, 148356, 147527, 146392, 145219, 144238, 143547, 142816, 141492, 139662, 138324, 138254, 138929, 139199, 138771, 138253, 137976, 137707, 137469, 137583, 137725, 137031, 135508, 134388, 134538, 135345, 135725, 135405, 134653, 133555, 132335, 131727, 132178, 133083, 133522, 133378, 133146, 133049, 133024, 133206, 133751, 134415, 134857, 135075, 135071, 134492, 133195, 131821, 131205, 131432, 131983, 132531, 133037, 133316, 133115, 132568, 132164, 132344, 133291, 134791, 136096, 136368, 135637, 134899, 134924, 135429, 135756, 135757, 135572, 135177, 134709, 134681, 135177]
54274A35177K04p51j142m20O59J305J512J282L47q33j047P5J436J957J783J474
54258A43018J058N73N21J115J742J807J394P18k00r67q79q0L87J32m1L52N50m5
54240A51155p60q40p09r53j086m80K95L64K6J17M23J22o59j028q73q96j182r59
54222A42077l2O71L59n44j021o53M8K52l43j166j318o36O2K9n00q59q78q27p24
54203A33997m07j8J65K16M03O43O63N13M06K31j95n31j85P53J415J196N00J81
54185A39946N28J020J010M66n8j15J41L09L43N11P91Q42N57K52J76J35j77q06
54167A45871j579k201k316j819j130p97p80n72oN34P42P31O65N42M73N83O40K51
54149A39832m63r47r80q00m84J00O80P27L30K09O78J285J613J658J280K59q45
$$ y = [135177, 135381, 134630, 133488, 133068, 133727, 135032, 136544, 137826, 138173, 137340, 136293, 136368, 137804, 139761, 141544, 143018, 144076, 144649, 145170, 146285, 148027, 149834, 151228, 151946, 151746, 150779, 149900, 149820, 150207, 150339, 150298, 150650, 151200, 151155, 150395, 149555, 148846, 147893, 146807, 146327, 146622, 146986, 147012, 147129, 147552, 147674, 147015, 145987, 145114, 144218, 143036, 142077, 142045, 142716, 143075, 142531, 141510, 140857, 140905, 141157, 140814, 139648, 138330, 137694, 137756, 137785, 137285, 136426, 135548, 134721, 133997, 133590, 133572, 133737, 133953, 134356, 134999, 135662, 136175, 136581, 136812, 136617, 136086, 135901, 136654, 138069, 139265, 139765, 139946, 140474, 141494, 142504, 142970, 142912, 142797, 142938, 143247, 143590, 144101, 144892, 145734, 146291, 146543, 146719, 146854, 146677, 145871, 144292, 142091, 139775, 137956, 136826, 136029, 135249, 134677, 134671, 135205, 135947, 136678, 137343, 137885, 138358, 138941, 139581, 139832, 139369, 138422, 137442, 136642, 136158, 136258, 136938, 137665, 137995, 138204, 138882, 140167, 141780, 143438, 144718, 144977, 144132]
54132A44132q95L00J524J611O47o11j583j782q62O70J655J732J691K024K178J878
54116A54309J962L035M296M843N125N980P001P105O162M782L031O57j756l248
54102B03284l937m842o198p063o698n445m066l004k425k247j984j190j91J79l11
54087A53862r30q55l3Q62J090N03k75m22J73Q43J059J040J147J261J040M46l03
54070A60508r24j007l52M95O60J92J2L90N00q5n49k59J35o5l16J32Q74J179J313
54051A62833J785K065J556J034J526K378K149J057P13J568K512L022L852N214
54037A93264O092N936N544N575N559N123M883N229N458M974M339M156L792K407
54023B62331O16j05N96J527J480M67o70j260j309j290j570k012k279k446k950
$$ y = [144132, 143237, 143537, 145061, 146672, 147319, 146708, 145125, 143343, 142481, 143151, 144806, 146538, 148229, 150253, 152431, 154309, 156271, 159306, 163602, 168445, 173570, 179550, 186551, 193656, 199818, 204600, 207631, 208288, 206532, 203284, 199347, 194505, 188307, 181244, 174546, 169101, 165035, 162031, 159606, 157359, 155375, 154185, 153994, 154173, 153862, 152932, 152077, 152044, 152906, 153996, 154499, 154224, 153802, 153975, 154818, 155877, 156917, 158064, 159325, 160365, 160811, 160508, 159584, 158577, 158225, 158720, 159380, 159572, 159584, 159974, 160474, 160389, 159840, 159581, 159716, 159651, 159335, 159467, 160341, 161520, 162833, 164618, 166683, 168239, 169273, 170799, 173177, 175326, 176383, 177096, 178664, 181176, 184198, 188050, 193264, 199356, 205292, 210836, 216411, 221970, 227093, 231976, 237205, 242663, 247637, 251976, 256132, 259924, 262331, 262947, 262842, 263438, 264965, 266445, 266912, 266242, 264982, 263673, 262383, 260813, 258801, 256522, 254076, 251126]
54008B51126l841m560m614m154l613l194k910k817k907k986k897k728k628k541
53994B04736k239j510m53L58J66j153k712l389k847j531K2J357J975J817J726
53979A96323K626M212N298N613O269Q028R843R817P165K779j817n442p546q212
53965B34956q011p518o886n978m806l646k751k136j691j345j079p97k80O10J691
53950A90333K561K916K711K109J516J580K627M070M817M547M083M252M887N365
53936B38374N597N904O240O245N823N162M247K938J482M39J43M80J076J486J458
53921B87094J317J753K865L789L758L165L061L891N229O466P186P164O559N900
53907C49197N486N001M108K986J892P10n19j208j084q47j222j899k318k798l918
$$ y = [251126, 247285, 242725, 238111, 233957, 230344, 227150, 224240, 221423, 218516, 215530, 212633, 209905, 207277, 204736, 202497, 200987, 200534, 200892, 201058, 199905, 197193, 193804, 190957, 189426, 189448, 190805, 192780, 194597, 196323, 198949, 203161, 208459, 214072, 220341, 228369, 238212, 248029, 255194, 257973, 256156, 250714, 243168, 234956, 226945, 219427, 212541, 206563, 201757, 198111, 195360, 193224, 191533, 190188, 189109, 188312, 188032, 188642, 190333, 192894, 195810, 198521, 200630, 202146, 203726, 206353, 210423, 215240, 219787, 223870, 228122, 233009, 238374, 243971, 249875, 256115, 262360, 268183, 273345, 277592, 280530, 282012, 282451, 282594, 283074, 284150, 285636, 287094, 288411, 290164, 293029, 296818, 300576, 303741, 306802, 310693, 315922, 322388, 329574, 336738, 343297, 349197, 354683, 359684, 363792, 366778, 368670, 369380, 368861, 367653, 366569, 365722, 364500, 362601, 360283, 357485, 353567]
53892C53567n272o037o361o973p705p778p275p056p233p091o501o073n788m890
53878B61534l400k386k340k524k347k209k458k673k572k655l296m073m536m771
53864B19294m764m105k877j951j783j781j384r33q36q22o72q58j623k234j966
53849A90705j220q39q66q20o49o34p11o35m82l42Q3Q69J279N94o61j144l03R84
53831A85208J482Q64j40o03l63j22m70j026r64k51L24M09N56J188J904K221K313
53814A92530K478K501K089J457J052J055J517K404L234L376L033L229M325N355
53800B29635N357M638M043L732L479L457L755L745K942K073K201L072L440K888
53786B78457K210J974J738J019K06p1L1l39j707l619n053n427n136m919m842m389
$$ y = [353567, 348295, 342258, 335897, 328924, 321219, 313441, 306166, 299110, 291877, 284786, 278285, 272212, 266424, 261534, 258134, 255748, 253408, 250884, 248537, 246328, 243870, 241197, 238625, 235970, 232674, 228601, 224065, 219294, 214530, 210425, 207548, 205597, 203814, 202033, 200649, 199716, 198880, 198058, 197386, 196528, 194905, 192671, 190705, 189485, 188646, 187780, 186960, 186311, 185677, 184966, 184331, 183849, 183507, 183590, 184459, 185738, 186332, 185671, 184527, 184224, 185208, 186690, 187554, 187414, 186811, 186448, 186326, 185856, 184830, 183866, 183615, 183939, 184348, 184904, 186092, 187996, 190217, 192530, 195008, 197509, 199598, 201055, 202107, 203162, 204679, 207083, 210317, 213693, 216726, 219955, 224280, 229635, 234992, 239630, 243673, 247405, 250884, 254341, 258096, 261841, 264783, 266856, 269057, 272129, 275569, 278457, 280667, 282641, 284379, 285398, 285604, 285533, 285564, 285225, 283518, 279899, 274846, 269419, 264283, 259364, 254522, 250133]
53770B50133l568l188l671m280m119l402k964k970k819k213j538j248j394j728
53756B11031j855j400m97P4k90j124j432r72m56m94q83j152j260j446j664j534
53740A94646r11k40j33n29o33J15J287K070K318K420K321J587M22l06k76m2J32
53723B04248P45J842K382J631L96p2K79O78R54J439J932J880J484J554K244K809
53707B26425K716K217J769J560J683K172K736K991L023L266L865M589N267N769
53693B70048N657M514K705J323J156J912K528K095O26r34j576j245p24m94k85
53678B87306R5K69Q1R1N68P49p7j285j741j367r22o06p2M82M85J63L49J028J225
53659B86821M78n84j352j842j971j331j16O75N72K91N56J019R77N08J97K61N57
$$ y = [250133, 246565, 243377, 239706, 235426, 231307, 227905, 224941, 221971, 219152, 216939, 215401, 214153, 212759, 211031, 209176, 207776, 207279, 207353, 207063, 205939, 204507, 203535, 203079, 202585, 201702, 200550, 199290, 197844, 196180, 194646, 193735, 193495, 193362, 192833, 192200, 192315, 193602, 195672, 197990, 200410, 202731, 204318, 204740, 204434, 204158, 204116, 204248, 204993, 206835, 209217, 210848, 211244, 211172, 211451, 212129, 213083, 214522, 216454, 218334, 219818, 221372, 223616, 226425, 229141, 231358, 233127, 234687, 236370, 238542, 241278, 244269, 247292, 250558, 254423, 259012, 264279, 270048, 275705, 280219, 282924, 284247, 285403, 287315, 289843, 291938, 292564, 291630, 290054, 288809, 288085, 287591, 287306, 287401, 287670, 287751, 287842, 288410, 289159, 289082, 287797, 286056, 284689, 283767, 283161, 283089, 283571, 284056, 284219, 284568, 285596, 286821, 287299, 286715, 285363, 283521, 281550, 280219, 280103, 280778, 281350, 281641, 282197, 283216, 284193, 284701, 284898, 285159, 285716]
53642B85716J128K046K943L259K912K388K171K327K574K596K353K084J955J842
53628C18294J612J366J164P96L08L42J276K320K370J662J542K513L529L599L052
53613C45745K716K737K853L133L642L943L637L099K948L187L406L504L595L448
53599C91593K755J763J016N69M0n84q17m49J13L54J32m39j166j737j916j910k192
53582C87125k748k894k136r59l62p28j526k053k120j881j425q76o14r72j656j954
53566C62221j548q83n35n95p84q77p31j78O99J382J378P56M1l40k48K62Q64R64
53548C61848K85o62r87l68P61J830K532K777K655K561K883L446L611L082K319
53533C88573K074K714M086N804P537R108J0435J1361J1722J1658J1607J1773J1868
$$ y = [285716, 286844, 288890, 291833, 295092, 298004, 300392, 302563, 304890, 307464, 310060, 312413, 314497, 316452, 318294, 319906, 321272, 322436, 323232, 323540, 323882, 325158, 327478, 329848, 331510, 333052, 335565, 339094, 342693, 345745, 348461, 351198, 354051, 357184, 360826, 364769, 368406, 371505, 374453, 377640, 381046, 384550, 388145, 391593, 394348, 396111, 397127, 397696, 397736, 397152, 396335, 395886, 395999, 396353, 396485, 396046, 394880, 393143, 391227, 389317, 387125, 384377, 381483, 379347, 378388, 378026, 377298, 375772, 373719, 371599, 369718, 368293, 367417, 366803, 365831, 364175, 362221, 360673, 359790, 359255, 358660, 357876, 356999, 356268, 356090, 356789, 358171, 359549, 360305, 360346, 360006, 359758, 360020, 360884, 361848, 362133, 361471, 360484, 360116, 360877, 362707, 365239, 368016, 370671, 373232, 376115, 379561, 383172, 386254, 388573, 390647, 393361, 397447, 403251, 410788, 419896, 430331, 441692, 453414, 465072, 476679, 488452, 500320]
53520E00320J1663J1508J1907J2836J3875J4901J6116J7568J9053K0460K1683
53509F71890K2432K2607K2732K3442K4532K5148K4892K4197K3637K3412K3468
53498I32389K3494K2813K1003J8734J7250J6889J6805J6320J5808J5881J6464
53487A133850J7073J7463J7538J7195J6679J6561J6938J7153J6728J6045J5657
53476A318880J5407J4795J3703J2240J0254P708N219L494K364R38j382m510q019
53463A391091j1304j3540j4229j3818j3346j3367j3741j4381j5637j7640j9763
53452A230325k1106k1344k0852k0200j9683j9314j8972j8560j8062j7539j7032
53441A017661j6452j5545j4006j1814r406p365n865m579l194j817p13J72J167
$$ y = [500320, 511983, 523491, 535398, 548234, 562109, 577010, 593126, 610694, 629747, 650207, 671890, 694322, 716929, 739661, 763103, 787635, 812783, 837675, 861872, 885509, 908921, 932389, 955883, 978696, 999699, 1018433, 1035683, 1052572, 1069377, 1085697, 1101505, 1117386, 1133850, 1150923, 1168386, 1185924, 1203119, 1219798, 1236359, 1253297, 1270450, 1287178, 1303223, 1318880, 1334287, 1349082, 1362785, 1375025, 1385279, 1392987, 1398206, 1401700, 1404064, 1405002, 1403620, 1399110, 1391091, 1379787, 1366247, 1352018, 1338200, 1324854, 1311487, 1297746, 1283365, 1267728, 1250088, 1230325, 1209219, 1187875, 1167023, 1146823, 1127140, 1107826, 1088854, 1070294, 1052232, 1034693, 1017661, 1001209, 985664, 971658, 959844, 950438, 943073, 937208, 932629, 929435, 927618, 926905, 927077, 928244]
53428I28244K397L622M601N403O269P203P996Q684R760J1669J4086J6183J7604
53415A043721J8860K0424K1903K2610K2732K3275K4816K6817K8349K9059K9370
53404A311936K9996L1450L3669L6069L8126L9996M2222M4829M7135M8578M9397
53393A753403N0270N1521N2891N3942N4522N4915N5436N5810N5111N2775M9518
53382B340114M6763M5113M3833M1905L9115L5909L2621K9172K5340K1177J7130
53371B718192J3608J0259O001J77o637j3543k0592k8240l5810m1731m5455m8034
53359B508195n0426n2302n3108n3293n3559n3740n3183n1784m9822m7386m4694
53348A944898m2475m1178m0265l9112l8194l8375l9316l9701l8934l7569l5987
$$ y = [928244, 930641, 934263, 938864, 944267, 950536, 957739, 965735, 974419, 984179, 995848, 1009934, 1026117, 1043721, 1062581, 1083005, 1104908, 1127518, 1150250, 1173525, 1198341, 1225158, 1253507, 1282566, 1311936, 1341932, 1373382, 1407051, 1443120, 1481246, 1521242, 1563464, 1608293, 1655428, 1704006, 1753403, 1803673, 1855194, 1908085, 1962027, 2016549, 2071464, 2126900, 2182710, 2237821, 2290596, 2340114, 2386877, 2431990, 2475823, 2517728, 2556843, 2592752, 2625373, 2654545, 2679885, 2701062, 2718192, 2731800, 2742059, 2748060, 2748237, 2741600, 2728057, 2707465, 2679225, 2643415, 2601684, 2556229, 2508195, 2457769, 2405467, 2352359, 2299066, 2245507, 2191767, 2138584, 2086800, 2036978, 1989592, 1944898, 1902423, 1861245, 1820980, 1781868, 1743674, 1705299, 1665983, 1626282, 1587348, 1549779, 1513792]
53337A513792l3719l0491k7072k4485k2811k1205j8849j5671j2334r740q372q063
53325A280980q450r472j1148j3011j4308j4691j4425j3839j3041j2141j1327j0610
53313A134517r776q687p322n548l268q99P32J206J021J058J759K951M343N882
53299A117969P624R453J1095J2496J3981J5803J7708J9329K0925K3159K5884K7821
53287A323247K7910K6540K4856K3317K1613J9707J8022J6602J4954J2910J0911
53276A540589R069O776L655L47k308m484p040j0158j3042j5095j6767j8907k1657
53263A450978k4397k6560k8025k8815k8909k8581k8451k8862k9392k9406k8861
53252A140719k8151k7347k6170k4751k3725k3355k3146k2727k2518k3015k3791
$$ y = [1513792, 1480073, 1449582, 1422510, 1398025, 1375214, 1354009, 1335160, 1319489, 1307155, 1297415, 1289043, 1280980, 1272530, 1263058, 1251910, 1238899, 1224591, 1209900, 1195475, 1181636, 1168595, 1156454, 1145127, 1134517, 1124741, 1116054, 1108732, 1103184, 1099916, 1099017, 1099749, 1100955, 1101976, 1103034, 1104793, 1107744, 1112087, 1117969, 1125593, 1135046, 1146141, 1158637, 1172618, 1188421, 1206129, 1225458, 1246383, 1269542, 1295426, 1323247, 1351157, 1377697, 1402553, 1425870, 1447483, 1467190, 1485212, 1501814, 1516768, 1529678, 1540589, 1549658, 1556434, 1560089, 1560436, 1558128, 1553644, 1546604, 1536446, 1523404, 1508309, 1491542, 1472635, 1450978, 1426581, 1400021, 1371996, 1343181, 1314272, 1285691, 1257240, 1228378, 1198986, 1169580, 1140719, 1112568, 1085221, 1059051, 1034300, 1010575, 987220, 964074, 941347, 918829, 895814, 872023]
53241H72023k3862k2904k1517k0287j9158j7821j6355j5162j4397j3686j2491
53230F74383j0787r183q188p516o557n468n186o148p637q771r534j0300j0917
53217E68191j1045j1055j1725j3094j4286j4528j3814j2551j1151r947r055q254
53205D27686p409o907p144p669p576o751o070o164o697p149p596q271q851q780
53191C24652q058p185o440n737n024m519m338m254m006l695l670l937l962l296
53177B56531k272j714j875k095j727r94n73o81j067j563k075k204j565m93J46
53162B35779K0l15k80J0N6l63j032j535j526j023m90l84o15p58o85o44p34p98
53144B24683q03q68q39m18K18N06L42K58N34P62O28N43R78J626J777J265N82K19
$$ y = [872023, 848161, 825257, 803740, 783453, 764295, 746474, 730119, 714957, 700560, 686874, 674383, 663596, 654413, 646225, 638709, 632152, 626684, 621498, 615350, 607713, 598942, 589408, 579108, 568191, 557146, 546091, 534366, 521272, 506986, 492458, 478644, 466093, 454942, 444995, 435940, 427686, 420277, 413370, 406226, 398557, 390981, 384230, 378160, 371996, 365299, 358150, 350554, 342283, 333432, 324652, 316594, 309409, 302969, 297232, 292208, 287689, 283351, 279097, 275091, 271396, 267726, 263789, 259827, 256531, 254259, 252545, 250670, 248575, 246848, 245854, 245281, 244600, 243533, 241970, 239895, 237691, 236126, 235633, 235779, 235799, 235484, 235204, 235214, 235270, 234907, 233875, 232340, 230814, 229791, 229301, 228917, 228302, 227544, 226859, 226215, 225481, 224683, 223880, 223012, 222173, 221755, 221973, 222479, 222821, 223079, 223613, 224375, 225003, 225546, 226524, 228150, 229927, 231192, 231774, 231993]
53126B31993L17P63J233J281Q09L39M93J197J780J812J532J418J545J563J158
53111B49233M32j91m46m45m16l51j97k40q68j896k556k341j608j109j197j644
53095B34160j962j738r35p9J34l95r73r25l63J01J07k55p56j217j397j106m09
53078B21992L78Q92Q35J50p65j211q21QN38M08j30n30l85K72Q68P05k72j331j789
53059B19812j753j757j869j638q60J03Q22J224J387J232P72L86N35J098J372Q75
53043B21741km33k16j1l24p44n77L1L03M1p7L27O25J49p29j148r87q16p79m02
53023B15972M51J129J082O92P25J267J637J319O11K17L38L79k93j395j844r92
53007B21295M50J161P69J09q5k15j001k094k224q67Q58J337K52j159j500n22R30
$$ y = [231993, 232310, 233073, 234306, 235587, 236396, 236735, 237228, 238425, 240205, 242017, 243549, 244967, 246512, 248075, 249233, 249665, 249474, 249028, 248583, 248167, 247816, 247619, 247379, 246511, 244615, 242059, 239718, 238110, 237001, 235804, 234160, 232198, 230460, 229525, 229446, 229580, 229185, 228212, 227287, 226924, 227025, 227132, 226877, 226121, 224904, 223507, 222401, 221992, 222370, 223262, 224097, 224247, 223482, 222271, 221450, 221458, 221996, 222404, 222274, 221744, 221359, 221631, 222499, 223204, 222932, 221601, 219812, 218059, 216302, 214433, 212795, 211935, 212038, 212860, 214084, 215471, 216703, 217475, 217861, 218396, 219494, 220866, 221741, 221739, 221306, 221090, 221079, 220755, 220011, 219434, 219465, 219768, 219809, 219732, 220059, 220684, 220833, 220104, 218956, 217969, 217153, 216374, 215972, 216423, 217552, 218634, 219326, 220051, 221318, 222955, 224274, 224885, 225102, 225440, 225819, 225526, 224131, 222287, 221295, 221745, 222906, 223675, 223784, 223699, 223484, 222483, 220389, 218165, 217298, 218156, 219493, 219745, 218586, 217086, 216564, 217494]
52990B17494J855J828J146N42O49J463K329K587K142J414Q82Q16J210J716J755
52975B39828J105K89O8N34J102J271J073O74O3o17r19n71L9K70%k43J08J011J752
52956B46837J513J64j440k221j969j435j307j537j787k006k198k030j245k60J85
52941B29264o9m27k89L34R09Q75J50n94m35O83J533R05p80j789j127L66J204R53
52923B31666L40O5Q8k1n06j198j643j391m36O97J385J449J137O97K00k76n42m50
52905B31261n0M22O12K08p33j631j763r37K97J153J224O63L0m9O43J534J627N85
52887B35096p08j016r3J127J624J205L35m66q29n74J02O41O28K59P3M00J102J765
52869B40671J922J356M68J14P76J966K635K161P44r09k094k548k642k940l364
$$ y = [217494, 219349, 221177, 222323, 222865, 223514, 224977, 227306, 229893, 232035, 233449, 234331, 235147, 236357, 238073, 239828, 240933, 241222, 241290, 241824, 242926, 244197, 245270, 245944, 246007, 245390, 244471, 243900, 243939, 244209, 244209, 243966, 244074, 245085, 246837, 248350, 248514, 247074, 244853, 242884, 241449, 240142, 238605, 236818, 234812, 232614, 230584, 229339, 229079, 229264, 229195, 228768, 228479, 228813, 229722, 230597, 230747, 230153, 229718, 230401, 231934, 232839, 232059, 230270, 229143, 229509, 230713, 231666, 232006, 232071, 232159, 232138, 231632, 230434, 228791, 227400, 226964, 227661, 229046, 230495, 231632, 232329, 232529, 232253, 231711, 231261, 231211, 231633, 232245, 232453, 231720, 230089, 228326, 227389, 227686, 228839, 230063, 230726, 230756, 230707, 231350, 232884, 234511, 235096, 234388, 233372, 233279, 234406, 236030, 237235, 237570, 237104, 236275, 235701, 235803, 236444, 237072, 237331, 237404, 237804, 238906, 240671, 242593, 243949, 244417, 244531, 245307, 247273, 249908, 252069, 252813, 251904, 249810, 247262, 244620, 241680, 238316]
52854B38316l156k078j164j575k996l945l601k509j476o79j78l47j246k117k148
52839B09101j354l35M46P32L25n73j155p47L97J406J761J620J410J387J446J109
52823B16976K0j356j966j397m42RN3K61O37Q79J159J746K134J624O74N02J260
52806B22773J652P29q24j772j838j562j324j226j477k088k452j964r54l92o77
52791B06604j257j507j480j522j614j343n10N65J333J577J571J700J968J979J422
52776B09486M77l41o53n04k97m10q50j237j221q67n04l12k43k94m93n95j69P73
52758B01746J563J618J213J118J545J854J457O38J77K92L63j63q92q53L53K054
52742B14083L234L469K985K177J365Q60Q17J019J053P81M04J34Q2L48Q89J285
$$ y = [238316, 235160, 233082, 231918, 230343, 227347, 223402, 219801, 217292, 215816, 215137, 214959, 214612, 213366, 211249, 209101, 207747, 207412, 207858, 208590, 208915, 208342, 207187, 206440, 206837, 208243, 210004, 211624, 213034, 214421, 215867, 216976, 216996, 215640, 213674, 212277, 211835, 211844, 211897, 212158, 212795, 213674, 214833, 216579, 218713, 220337, 221011, 221513, 222773, 224425, 225154, 224330, 222558, 220720, 219158, 217834, 216608, 215131, 213043, 210591, 208627, 207673, 207281, 206604, 205347, 203840, 202360, 200838, 199224, 197881, 197371, 197936, 199269, 200846, 202417, 204117, 206085, 208064, 209486, 209963, 209622, 208969, 208465, 208168, 207758, 206908, 205671, 204450, 203583, 203079, 202767, 202524, 202230, 201737, 201142, 200973, 201746, 203309, 204927, 206140, 207258, 208803, 210657, 212114, 212752, 212929, 213221, 213584, 213421, 212529, 211676, 212029, 214083, 217317, 220786, 223771, 225948, 227313, 228173, 228990, 230009, 231062, 231843, 232247, 232381, 232463, 232811, 233700, 234985]
52726B34985J004P8q20j148j113j283j824k305k172j275n1P85Q00K49k94n97q78
52709B24141j260j499j369j006n54O7Q47J341J118L83j65j03L22N17J18o35r67
52692B21296k58J096J803J062m45j315j005j49M92P45O36O6p77j258r51k01L78
52675B21215O66R36J257J397J182N96l14j285j805j614j090p01k59O69J735J958
52659B24543J166N05R62J979K247J516Q53J077J839K327K288J894J158L3j116
52644B43271j748j784j651j599j419r81o59q57j283j166k75O72Q98N84O00J316
52628B33919K156K436K165J733J237N06l57j035j449j739j786j282l15N52R85
52613B37726J234J565J734J339L86p64j727k150j783q19Q6M63M95M90L14k32p63
$$ y = [234985, 235989, 236067, 235247, 234099, 232986, 231703, 229879, 227574, 225402, 224127, 224076, 224861, 225661, 225910, 225616, 225019, 224141, 222881, 221382, 220013, 219007, 218453, 218520, 219367, 220708, 221826, 222209, 222044, 221941, 222263, 222780, 222898, 222263, 221296, 221038, 222134, 223937, 224999, 224554, 223239, 222234, 222085, 222577, 223322, 223958, 224024, 223247, 221989, 221038, 220837, 221215, 221881, 222817, 224074, 225471, 226653, 227249, 226935, 225650, 223845, 222231, 221141, 220440, 220181, 220850, 222585, 224543, 225709, 226214, 227176, 229155, 231402, 232918, 233771, 234848, 236687, 239014, 241302, 243196, 244354, 244387, 243271, 241523, 239739, 238088, 236489, 235070, 234089, 233430, 232573, 231290, 230124, 229849, 230521, 231419, 232003, 232603, 233919, 236075, 238511, 240676, 242409, 243646, 244152, 243795, 242760, 241311, 239572, 237786, 236504, 236189, 236741, 237726, 238960, 240525, 242259, 243598, 243984, 243220, 241493, 239343, 237560, 236741, 236827, 237290, 237785, 238275, 238589, 238357, 237594]
52596B37594o66RN39M62K4l09k66K75J230K102K316J947J685J881K122J920J389
52579B54254R11N39J05l43n85n33k05K90O22L65l52p83n28j96n22j162j108k62
52561B50507L37n0q36r98m41O6l6n97j206j563j463q82j67J47p1m02l94r4J13
52542B41970%l24o02o40m46k52k91m13r7Q39J761J830J090M66N63R67J022P82
52524B48225O79O73M16O8J55N08K89o69j269n50Q70J555J148P17J195K314L243
52507B59567L611L543L170K568J872J068j42j842l456m134l585k280j029m98r03
52492B57530j785k228j776j049r77j542j840j425q29n57k70M85J321J528J193
52477B47779J014J178J202Q37L97Q0k67n26k04O61J228J041Q70J597K761L096
$$ y = [237594, 236928, 236937, 237476, 237938, 237962, 237653, 237387, 237662, 238892, 240994, 243310, 245257, 246942, 248823, 250945, 252865, 254254, 255165, 255704, 255809, 255466, 254881, 254348, 254143, 254433, 255055, 255420, 255068, 254285, 253757, 253561, 253039, 251877, 250769, 250507, 250844, 250794, 249958, 248960, 248519, 248585, 248549, 247952, 246746, 245183, 243720, 242838, 242671, 242818, 242747, 242345, 241951, 241857, 241970, 241970, 241646, 241044, 240404, 239958, 239706, 239415, 239002, 238905, 239744, 241505, 243335, 244425, 244891, 245454, 246421, 247443, 248225, 248904, 249577, 249993, 250061, 250216, 250724, 251013, 250344, 249075, 248525, 249395, 250950, 252098, 252815, 254010, 256324, 259567, 263178, 266721, 269891, 272459, 274331, 275399, 275257, 273415, 269959, 265825, 262240, 259960, 258931, 258433, 257530, 255745, 253517, 251741, 250692, 249715, 248173, 246333, 244908, 244079, 243522, 243252, 243737, 245058, 246586, 247779, 248793, 249971, 251173, 252010, 252407, 252487, 252220, 251694, 251490, 252151, 253379, 254420, 255290, 256887, 259648, 262744]
52461B62744K389J827K274L031K785J318k97j029r92j089j877k926l339k810j949
52446B60060j517j545j508j162q24q22j017j091r88q62p68o08l49r1M8K2j45l58
52428B46475n30o38p34q57r81j017q02j78Q27J911K664K819K373J596J036J255
52412B55219K278L419L932L806L722M260N467P138R090J0995J2216J2076J0195
52399C43813O627J877l076p026r168r511q737p650o685n759m611l389k674k674
52385B81357k651j712j33Q07M57l26l32N42J483J949K093K177K236K349K696L250
52369B96242L741M007M096M029L703L106K332J376K36p74j157p99j87J07pj84
52353C19867m3N15J260J753J692J221Q13P68J037J424J812K092K218K411K974
$$ y = [262744, 265133, 266960, 269234, 272265, 275050, 276368, 276071, 275042, 274050, 272961, 271084, 268158, 264819, 262009, 260060, 258543, 256998, 255490, 254328, 253504, 252682, 251665, 250574, 249586, 248724, 247956, 247348, 246999, 246908, 246956, 246978, 246833, 246475, 245945, 245307, 244573, 243716, 242735, 241718, 240916, 240738, 241565, 243476, 246140, 248959, 251332, 252928, 253964, 255219, 257497, 260916, 264848, 268654, 272376, 276636, 282103, 289241, 298331, 309326, 321542, 333618, 343813, 350440, 352317, 349241, 342215, 333047, 323536, 314799, 307149, 300464, 294705, 290094, 286705, 284031, 281357, 278706, 276994, 276861, 277668, 278125, 277799, 277467, 278009, 279492, 281441, 283534, 285711, 287947, 290296, 292992, 296242, 299983, 303990, 308086, 312115, 315818, 318924, 321256, 322632, 322868, 322094, 320937, 320138, 319951, 320058, 320051, 319867, 319824, 320339, 321599, 323352, 325044, 326265, 327078, 327846, 328883, 330307, 332119, 334211, 336429, 338840, 341814]
52338C41814L765M159L835L367L634M758N996O687O938P397Q555J0372J2315J3715
52324D37307J4349J4699J5388J6398J7175J7528J7910J8559J8936J8436J7323
52313F24008J6407J6111J6337J7069J8259J9255J9170J8078J7125J7073J7414
52302H16306J7283J6687J6144J5620J4577J2878J0989R314P818O217M131J199
52290I49163k404n713p769q613r028r425r597r453r200q756p748o268m874l666
52276H46649k107r9J576K444L163M487O052P024P494Q242R398J0330J0784J1203
52262I26640J1766J2023J1866J2066J3261J4911J5838J5618J4872J4337J4091
52251A077289J3762J3031J1743R744O982L737N23k383n106p717r806j0981j1704
$$ y = [341814, 345579, 349738, 353573, 356940, 360574, 365332, 371328, 378015, 384953, 392350, 400905, 411277, 423592, 437307, 451656, 466355, 481743, 498141, 515316, 532844, 550754, 569313, 588249, 606685, 624008, 640415, 656526, 672863, 689932, 708191, 727446, 746616, 764694, 781819, 798892, 816306, 833589, 850276, 866420, 882040, 896617, 909495, 920484, 929798, 937616, 943833, 947964, 949163, 946759, 941046, 933277, 924664, 915636, 906211, 896614, 887161, 877961, 869205, 861457, 855189, 850315, 846649, 844542, 844443, 846019, 848463, 851626, 856113, 862165, 869189, 876683, 884925, 894323, 904653, 915437, 926640, 938406, 950429, 962295, 974361, 987622, 1002533, 1018371, 1033989, 1048861, 1063198, 1077289, 1091051, 1104082, 1115825, 1125569, 1132551, 1136288, 1136811, 1134428, 1129322, 1121605, 1111799, 1100818, 1089114]
52238A089114j3026j5209j7066j7266j6045j5075j5540j6914j7762j7323j6031
52227I11857j4660j3493j2319j1015r772q802q035p270o476n731m962m044l090
52214H02188k326j607n61P43J708K100K461L258M010L913L005K124J761J666J592
52199H26035J787K476L321L789L834L909M326M866N015M591L994L708L655L263
52185H78569K245Q68o09k317m262n965p053p820q597r030q637p725o918o077m674
52170H01998l048k189k137j793o25N21Q54Q96J538K679L560L909L967L844L567
52155H17541L351L143K409R89k43m12J16M20N08J110K165K714K364J857J896K259
52139H42187K412K250J877J277O56N41J221K468M040N906P842R498J1104J3458
$$ y = [1089114, 1076088, 1060879, 1043813, 1026547, 1010502, 995427, 979887, 962973, 945211, 927888, 911857, 897197, 883704, 871385, 860370, 850598, 841796, 833761, 826491, 820015, 814284, 809322, 805278, 802188, 799862, 798255, 797694, 798437, 800145, 802245, 804706, 807964, 811974, 815887, 818892, 821016, 822777, 824443, 826035, 827822, 830298, 833619, 837408, 841242, 845151, 849477, 854343, 859358, 863949, 867943, 871651, 875306, 878569, 880814, 881682, 881073, 878756, 874494, 868529, 861476, 853656, 845059, 836029, 827392, 819667, 812749, 806672, 801998, 798950, 796761, 794624, 792831, 792206, 792727, 793581, 794477, 796015, 798694, 802254, 806163, 810130, 813974, 817541, 820892, 824035, 826444, 827433, 827190, 826778, 826894, 827314, 827822, 828932, 831097, 833811, 836175, 838032, 839928, 842187, 844599, 846849, 848726, 850003, 850659, 851200, 852421, 854889, 858929, 864835, 872677, 882175, 893279, 906737]
52125I06737J6755K0069K2492K4170K5669K6923K7570K7847K8259K8627K8289
52114A183407K7165K5858K4703K3436K1785J9810J7539J4996J2610J0878R529
52103A391716P777N670M328M297M471L335Q68j685l542n181p387j0290j3469j6440
52089A364468j8803k0381k1347k1978k2188k1606k0155j8226j6178j4094j2018
52078A157494j0076q176o083l929k241j080L09K522N100P146Q589J0117J1910
52065A171602J3281J3771J3906J4432J5313J6013J6421J6849J7226J6923J5618
52054A341355J3842J2415J1510J0522Q728N843K139j739n105p659r719j1878j4337
52041A355917j6746j8670k0045k0953k1248k0702j9576j8652j8505j8883j8969
$$ y = [906737, 923492, 943561, 966053, 990223, 1015892, 1042815, 1070385, 1098232, 1126491, 1155118, 1183407, 1210572, 1236430, 1261133, 1284569, 1306354, 1326164, 1343703, 1358699, 1371309, 1382187, 1391716, 1399493, 1405163, 1409491, 1413788, 1418259, 1421594, 1422462, 1420777, 1417235, 1412054, 1404667, 1394377, 1380908, 1364468, 1345665, 1325284, 1303937, 1281959, 1259771, 1238165, 1218010, 1199784, 1183606, 1169512, 1157494, 1147418, 1139242, 1133159, 1129230, 1126989, 1125909, 1126218, 1128740, 1133840, 1140986, 1149575, 1159692, 1171602, 1184883, 1198654, 1212560, 1226992, 1242305, 1258318, 1274739, 1291588, 1308814, 1325737, 1341355, 1355197, 1367612, 1379122, 1389644, 1398372, 1404215, 1406354, 1404615, 1399510, 1391851, 1382132, 1370254, 1355917, 1339171, 1320501, 1300456, 1279503, 1258255, 1237553, 1217977, 1199325, 1180820, 1161937, 1142968]
52030A142968j8199j6797j5574j5213j5670j6179j5997j5212j4640j4800j5211
52019I69476j4918j3655j2144j1251j1039j0840j0129r135q479q388q494q488
52007H42516q691r593j0967j1954j2162j2177j2677j3431j3645j3017j1926j0766
51995G01510r607q514p581o663n614m924n485p357r284r950r479r161r853j1077
51981E86961j1781j1598j1121j1094j1560j1925j1737j1115j0356r412q061o389
51969D60812m631k693l53K052L801M736N423O160O484O075N434N072M588L356
51955E06316J638K54o47j528k340k390j506l77N52J870M406Q203J2643J7186K1633
51940E65913K5977L0202L3734L4876L1513K3109J1850J176o746j1926j5349j7630
$$ y = [1142968, 1124769, 1107972, 1092398, 1077185, 1061515, 1045336, 1029339, 1014127, 999487, 984687, 969476, 954558, 940903, 928759, 917508, 906469, 895629, 885500, 876365, 867886, 859498, 851004, 842516, 833825, 824232, 813265, 801311, 789149, 776972, 764295, 750864, 737219, 724202, 712276, 701510, 691903, 683389, 675808, 669145, 663531, 658607, 653122, 645765, 636481, 626531, 617052, 607891, 598038, 586961, 575180, 563582, 552461, 541367, 529807, 517882, 506145, 495030, 484674, 475262, 467201, 460812, 456181, 453488, 453135, 455187, 458988, 463724, 469147, 475307, 481791, 487866, 493300, 498372, 502960, 506316, 507954, 508208, 507561, 506033, 503693, 501303, 499797, 499420, 499972, 501842, 506248, 514451, 527094, 544280, 565913, 591890, 622092, 655826, 690702, 722215, 745324, 757174, 758350, 751604, 739678, 724329, 706699]
51928G06699j8860j9184j9078j9105j9549k0307k1042k1431k1138j9838j7584
51917D89583j5152j3526j2840j2235j0943r141p470o132m877l503j951k12J463
51904C93064K535K902L201L958M696M611L817L081K478J219j083l849o376q433
51890D05821r768r892q801p218n633l813j715j00M87O81J384K424L090L615M964
51875C75526P193R071R545Q725P267N527L677J930K79j457l064l964m109m173
51861D11973m483m432l514k242j295l16J434L591M936N046M653M153K891M56k219
51846D20632l901m608n265o196o848o877o615o391o140n874n779n542m382k238
51832C43976k76M74M98J025K226L067K886K142J405N57n90j607j965j794j575
$$ y = [706699, 687839, 668655, 649577, 630472, 610923, 590616, 569574, 548143, 527005, 507167, 489583, 474431, 460905, 448065, 435830, 424887, 415746, 408276, 402144, 397267, 393764, 391813, 391601, 393064, 395599, 398501, 401702, 405660, 410356, 414967, 418784, 421865, 424343, 425562, 424479, 420630, 414254, 405821, 396053, 386161, 377360, 370142, 364509, 360696, 358981, 358881, 359368, 360049, 361433, 363857, 366947, 370562, 375526, 382719, 391790, 401335, 410060, 417327, 422854, 426531, 428461, 428740, 427283, 424219, 420255, 416146, 411973, 407490, 403058, 399544, 397302, 396007, 395691, 397125, 400716, 405652, 410698, 415351, 419504, 422395, 422851, 420632, 416731, 412123, 406858, 400662, 393814, 386937, 380322, 373931, 367791, 361917, 356138, 350596, 346214, 343976, 343700, 344174, 344672, 345697, 347923, 350990, 353876, 356018, 357423, 357980, 357390, 355783, 353818, 352024, 350449]
51817C50449j418j203j033r93o71L90J807K565K215J386R49J061J170P38k39j242
51801C55931j691j450q07%J001J985K260J407j3j087j665k215k712k508j443j90
51785C46803O98J359J909J885R89k88j290j942k310k042r39L30R38J088J693K984
51769C51865M242M898N229N709O321O696O514N654M255K695J210m12k362m183
51755C98331n203n510n884o644p274p312o929o290n109l336j744j157j417j657
51741C32865j398q21j14Q41K109L569N111O619P694P775O674M719K394J01j625
51726C76513k136j203O83K674M150M747M119K049j070m119n833n697m281k707
51712C67889j710j262j036j043j602k651l432l063j339J191L773N768O528N530
$$ y = [350449, 349031, 347828, 346795, 345802, 345131, 345521, 347328, 349893, 352108, 353494, 354443, 355504, 356674, 357412, 357173, 355931, 354240, 352790, 351983, 351983, 352984, 354969, 357229, 358636, 358623, 357536, 355871, 353656, 350944, 348436, 346993, 346803, 347501, 348860, 350769, 352654, 353643, 353355, 352065, 350123, 347813, 345771, 344832, 345162, 346100, 347188, 348881, 351865, 356107, 361005, 366234, 371943, 378264, 384960, 391474, 397128, 401383, 404078, 405288, 404876, 402514, 398331, 393128, 387618, 381734, 375090, 367816, 360504, 353575, 347285, 342176, 338840, 337096, 335939, 334522, 332865, 331467, 330646, 330532, 331373, 333482, 337051, 342162, 348781, 356475, 364250, 370924, 375643, 378037, 378138, 376513, 374377, 373174, 373857, 376531, 380681, 385428, 389547, 391596, 390526, 386407, 380574, 374877, 370596, 367889, 366179, 364917, 363881, 362838, 361236, 358585, 355153, 352090, 350751, 351942, 355715, 361483, 368011, 373541]
51698C73541L001J83j524j798j483j423j589j433p71M7N61M86k88j618k956l662
51682C59274l546k954k287j677j088m33M49J618K723L144K672J830J207P62J96
51667C61890j74N61K760N548P562Q139P437N664K799p64l921n700o167n992n298
51652C74344l470k80L471O651Q740R638R060O793L504N58j221k215l188m195m688
51637D03502m545m503n356o939q212q397p746o950o156n073l904l324l299k729
51623C26369r68Q98J191j97j720k189j946j775j761j625j518j720k053k134j973
51608C06879j781j506j007m90k52j46K16Q97J721K759M237N999P564Q808J0117
51593C44015J1681J2903J2707J0372O098J005l407o113p050o849o183n412m581
$$ y = [373541, 376542, 376725, 375201, 373403, 371920, 370497, 368908, 367475, 366704, 366751, 367312, 367798, 367510, 365892, 362936, 359274, 355728, 352774, 350487, 348810, 347722, 347289, 347738, 349356, 352079, 355223, 357895, 359725, 360932, 361694, 361890, 361716, 362277, 365037, 370585, 378147, 386286, 393723, 399387, 402186, 401422, 397501, 391801, 385634, 379642, 374344, 370874, 370594, 374065, 380716, 389456, 399094, 408154, 414947, 418451, 419009, 417788, 415573, 412385, 408190, 403502, 398957, 394454, 389098, 382159, 373947, 365550, 357804, 350854, 344698, 339625, 335721, 332397, 329098, 326369, 325401, 326299, 327490, 327293, 325573, 323384, 321438, 319663, 317902, 316277, 314759, 313039, 310986, 308852, 306879, 305098, 303592, 302585, 302095, 301843, 301697, 301913, 302810, 304531, 307290, 311527, 317526, 325090, 333898, 344015, 355696, 368599, 381306, 391678, 397776, 398781, 395374, 389261, 382211, 375362, 369179, 363767, 359186]
51580C59186l467j760N06K812M779O684Q960J1179J2200J1482R937R077R598J0887
51566D52060J1724J1208R315O980N598O100Q360J1536J4986J8654K2523K5952
51554F04996K7750K6993K3711J8781J3245P799K705k051o647j1137j5078j7599
51542F73468j8182j7367j6434j6256j6631j6831j6619j6461j6799j7364j7440
51531D87084j6663j5386j4146j2998j1610r899q261p107o388n756n015m253l602
51518C66000l089k703k486k489k603k516k017j396j323j987k610k282j232o21
51504C36646r03j177n64M87J046J209J698K266J808K93o55J95J907K588J815Q57
51488C49516P57J186J372J206R85O63j8r46j743k331k949l635m079m105l929l815
$$ y = [359186, 355719, 353959, 354465, 357277, 362056, 368740, 377700, 388879, 401079, 412561, 422498, 431575, 441173, 452060, 463784, 474992, 484307, 491287, 496885, 502985, 511345, 522881, 537867, 556521, 579044, 604996, 632746, 659739, 683450, 702231, 715476, 723275, 725980, 723929, 717282, 706145, 691067, 673468, 655286, 637919, 621485, 605229, 588598, 571767, 555148, 538687, 521888, 504524, 487084, 470421, 455035, 440889, 427891, 416281, 406382, 398121, 391014, 384626, 378870, 373855, 369602, 366000, 362911, 360208, 357722, 355233, 352630, 350114, 348097, 346701, 345378, 343391, 340781, 338499, 337267, 336646, 335743, 334566, 334002, 334489, 335535, 336744, 338442, 340708, 342516, 342809, 342154, 342349, 344256, 346844, 348659, 349516, 350273, 351459, 352831, 354037, 355022, 355685, 355667, 354721, 352978, 350647, 347698, 344063, 339984, 335879, 331950, 328135]
51472C28135l738l576l407l325l095k398j363n83m65p68r15o22j28R4k60j044
51456C02542j707j700r70K6Q37J435K074K861L695M514N409O530P975R834J2149
51441C55504J4698J6752J7210J5237J1050N982J540j538l316l998l855l690m600
51428D16976o843r338j0785j0950j0495r836q829p410n957m809l906l016k053
51415C22749j065j97K81K29k3R2P20J413J713J630J435J301J348J786K679L674
51399C39765M226M136L736L541L705L889L688L186K933L242L782M064M252N049
51385C93194O819R133J1326J3303J5616J8819K2785K6591K9287L0909L2577L5131
51373F45490L7694L8066L4670K7871J9318J0551K377m923j1387j7240k2541k6934
$$ y = [328135, 324397, 320821, 317414, 314089, 310994, 308596, 307233, 306650, 306185, 305417, 304502, 303880, 303752, 303846, 303586, 302542, 300835, 299135, 298165, 298191, 299028, 300463, 302537, 305398, 309093, 313607, 319016, 325546, 333521, 343355, 355504, 370202, 386954, 404164, 419401, 430451, 436433, 437973, 436435, 433119, 429121, 425266, 421576, 416976, 410133, 400795, 390010, 379060, 368565, 358729, 349900, 342490, 336533, 331724, 327818, 324802, 322749, 321684, 321487, 321768, 321997, 321974, 322066, 322786, 324199, 325912, 327542, 328977, 330278, 331626, 333412, 336091, 339765, 343991, 348127, 351863, 355404, 359109, 362998, 366686, 369872, 372805, 376047, 379829, 383893, 388145, 393194, 400013, 409146, 420472, 433775, 449391, 468210, 490995, 517586, 546873, 577782, 610359, 645490, 683184, 721250, 755920, 783791, 803109, 813660, 816037, 811114, 799727, 782487, 759946, 733012]
51361G33012l0038l1955l3101l3634l3319l2046l0132k7949k5496k2545j9109
51350D13688j5560j2242r241o594m596l577l386l343k895k174j694j692j959k210
51336C42525k379k521k676k805k797k537k140j961k220k685k937k832k531k160
51322C07344j727j266p61j02N85P70J46o76o94K47J339J919K101K150J957J494
51306C14826J196J377J670J539J038N92L14ll65n76o84r63j486j951k000j498
51290C13026o10K73Q15J101J522K195K762K954L036L408M097M905N689O111N517
51275C56801L627J091j085k455l068k889j909o63K02P78J609K586K910K287J389
51260C61211Q16K87p40k170l382l876l485k403j316r97j451j872j802j783k335
$$ y = [733012, 702974, 671019, 637918, 604284, 570965, 538919, 508787, 480838, 455342, 432797, 413688, 398128, 385886, 376645, 370051, 365455, 361878, 358492, 355149, 352254, 350080, 348386, 346694, 344735, 342525, 340146, 337625, 334949, 332144, 329347, 326810, 324670, 322709, 320489, 317804, 314867, 312035, 309504, 307344, 305617, 304351, 303590, 303488, 304073, 304843, 304989, 304313, 303619, 303866, 305205, 307124, 309225, 311375, 313332, 314826, 316022, 317399, 319069, 320608, 321646, 322238, 322552, 322549, 322184, 321608, 320924, 319961, 318475, 316524, 314524, 313026, 312416, 312689, 313504, 314605, 316127, 318322, 321084, 324038, 327074, 330482, 334579, 339484, 345173, 351284, 356801, 360428, 361519, 360434, 357979, 354911, 352022, 350113, 349450, 349652, 350430, 352039, 354625, 357535, 359822, 361211, 362027, 362314, 361574, 359404, 356022, 352146, 348661, 346258, 344942, 343945, 342494, 340622, 338820, 337037, 334702]
51245C34702k855k315p29Q71J768K035J768P22q86k096k206j692j557k053k547
51230C22930k454j827j064m71j84j78k25r3J25J31j21l19k53n4K25R33K351L969
51212C23421M733M119K677J425R73J336K269L376M146M281M053L948L924L327
51198C68008J751k85j785k287k173j986j821j517j238j419k115k678k337j109
51184C47009J90Q69J044J235J546J580J069K26o39j459k158k400j948j174p81
51169C44209r89j311j211o64mN25R00J181J524K080K697K870K334J513J009Q11
51153C57474M20k81q37r87j050j273j307p81K3M96M93L01M7l22n96m22P2K56k00
51134C51526q74j101o92J3N20N45K19LK95J064J997K800L158K703J510M50L95
$$ y = [334702, 331847, 329532, 328803, 329674, 331442, 333477, 335245, 335967, 335081, 332985, 330779, 329087, 327530, 325477, 322930, 320476, 318649, 317585, 317114, 316930, 316752, 316527, 316434, 316559, 316690, 316569, 316250, 315997, 315943, 316168, 317101, 319452, 323421, 328154, 332273, 334950, 336375, 337348, 338684, 340953, 344329, 348475, 352756, 356809, 360757, 364681, 368008, 369759, 369474, 367689, 365402, 363229, 361243, 359422, 357905, 356667, 355248, 353133, 350455, 348118, 347009, 347199, 348068, 349112, 350347, 351893, 353473, 354542, 354768, 354129, 352670, 350512, 348112, 346164, 344990, 344209, 343220, 341909, 340698, 340034, 340030, 340555, 341455, 342636, 344160, 346240, 348937, 351807, 354141, 355654, 356663, 357474, 357894, 357613, 356776, 355789, 354739, 353466, 352159, 351378, 351401, 351897, 352390, 352691, 352738, 352416, 351820, 351398, 351470, 351726, 351526, 350652, 349551, 348859, 348872, 349392, 349937, 350156, 350159, 350454, 351518, 353515, 356315, 359473, 362176, 363686, 364136, 364531]
51117C64531J151J800J990K128K267J772N21n39o58l52m13m96L42J988L204L168
51101C82404K301J496J185J265J394J185N53p1j87R7K39N3j37m7L41R93J764K141
51083C96969J679P41K36M83Q63P53K34l10p04q13l73O19J691K388K688K786K811
51066D12741L027L826N280P034Q877J1028J3613J6348J8916K1064K1936K0160
51054E63850J5406R397M533J855J072J999M519P208P628M901J011j424k151l114
51040F16690n740r432j2629j4303j4071j1799p933l874j340j226l239o404r500
51027E15200j1323j1212r599p581n774l856j422J208L385N040O593Q165R403J0148
51013E08375J0709J1241J1288J0313Q538O853N921N598N260M497L395K191Q96
$$ y = [364531, 365682, 367482, 369472, 371600, 373867, 375639, 376160, 375621, 374963, 374611, 374198, 373702, 374044, 376032, 379236, 382404, 384705, 386201, 387386, 388651, 390045, 391230, 391783, 391712, 391525, 391622, 391861, 391914, 391777, 391730, 392071, 393064, 394828, 396969, 398648, 399389, 399625, 400108, 400971, 401724, 401958, 401648, 400944, 400131, 399758, 400377, 402068, 404456, 407144, 409930, 412741, 415768, 419594, 424874, 431908, 440785, 451813, 465426, 481774, 500690, 521754, 543690, 563850, 579256, 588653, 593186, 595041, 596113, 598112, 602631, 609839, 617467, 622368, 623379, 621955, 619804, 616690, 610950, 601518, 588889, 574586, 560515, 548716, 540783, 536909, 535569, 534343, 531104, 524700, 515200, 503877, 492665, 483066, 475485, 469711, 465855, 464433, 465641, 469026, 474066, 480659, 488824, 498227, 508375, 519084, 530325, 541613, 551926, 560464, 567317, 573238, 578836, 584096, 588593, 591988, 594179, 595075]
51000E95075n80k018k941l196l191l323l390k939k006j034r9J232L115N030O468
50985E86203P667R229J1293J3480J5557J7667J9791K1351K1545K0109J7660J5430
50973G76982J4648J6019J9544K4568L0057L5097L9403M3384M7567N2055N6569
50962A155893O0886O4933O8576P1583P3696P4510P3452P0299O5609O0157N3944
50951A893538M6313L7135K7336J8005R498J695n347j1342j6040j9182k0580k0586
50939A940443k0259k0663k2115k4249k6408k7829k8016k7312k6711k6782k7183
50928A662916k7609k8525l0383l2717l4805l6749l8986m1204m2699m3550m4336
50917A261353m4840m4157m2135l9558l6779l3357k9425k6180k4305k2955k1051
$$ y = [595075, 594495, 592477, 589536, 586340, 583149, 579826, 576436, 573497, 571491, 570457, 570358, 571590, 574705, 579735, 586203, 593870, 603099, 614392, 627872, 643429, 661096, 680887, 702238, 723783, 743892, 761552, 776982, 791630, 807649, 827193, 851761, 881818, 916915, 956318, 999702, 1047269, 1099324, 1155893, 1216779, 1281712, 1350288, 1421871, 1495567, 1570077, 1643529, 1713828, 1779437, 1839594, 1893538, 1939851, 1976986, 2004322, 2022327, 2031825, 2033520, 2028173, 2016831, 2000791, 1981609, 1961029, 1940443, 1920184, 1899521, 1877406, 1853157, 1826749, 1798920, 1770904, 1743592, 1716881, 1690099, 1662916, 1635307, 1606782, 1576399, 1543682, 1508877, 1472128, 1433142, 1391938, 1349239, 1305689, 1261353, 1216513, 1172356, 1130221, 1090663, 1053884, 1020527, 991102, 964922, 940617, 917662, 896611]
50906H96611j8837j7263j6489j5836j4833j3474j1888j0431r747r923r911q586
50894G39393o156l857k430j647j117p34l92K0K63Q9j01M05J658L083M420N834
50878G38731P112P681P699Q230R842J1768J2980J3532J4235J5504J7089J8574
50866H82977J9633K0114K0375K1275K3327K6096K8832L1435L4292L7605M1468
50855A187429M6438N3229O1774P1153Q0587R0044R9763J09656J19448J29020J38333
50844B186874J47052J54540J60249J64136J66520J67318J65398J58940J46691
50835C617718J28769J06255Q0517N3126K5863J80k3229m3953o1303p4664q4049
50824C725230q9603r0929q7659q0551p1165o0585m9390l8827l0941k7131k7379
$$ y = [896611, 877774, 860511, 844022, 828186, 813353, 799879, 787991, 777560, 767813, 757890, 747979, 739393, 733237, 729380, 726950, 725303, 724186, 723452, 723060, 723080, 723343, 723432, 723331, 723736, 725394, 728477, 732897, 738731, 745843, 753524, 761223, 769453, 779295, 791063, 804043, 817575, 831810, 847314, 864403, 882977, 902610, 922724, 943099, 964374, 987701, 1013797, 1042629, 1074064, 1108356, 1145961, 1187429, 1233867, 1287096, 1348870, 1420023, 1500610, 1590654, 1690417, 1800073, 1919521, 2048541, 2186874, 2333926, 2488466, 2648715, 2812851, 2979371, 3146689, 3312087, 3471027, 3617718, 3746487, 3852742, 3933259, 3986385, 4012248, 4012428, 3989199, 3945246, 3883943, 3809279, 3725230, 3635627, 3544698, 3457039, 3376488, 3305323, 3244738, 3195348, 3156521, 3125580, 3098449, 3071070]
50813C071070l1142l7993m7017n6652o5966p5328q5061r4193j01398j06465j09840
50802B260015j11279j10079j06318j00780r3782q5272p5920o6916n8506m9903
50792A401260m0973l2906k6653k1620j6598j1305o293k002J369L453M025L556
50780A255313K797J886M66j460l353m842o158p692r462j1102j2197j2560j2477
50767A179159j2706j4020j6502j9329k1333k1904k1455k0936k0793k0435j8963
50756I70783j6318j3366j0793q375n573k408P21L749O953J0300J3371J6011J8584
50743I83639K1369K4055K6199K8009L0266L3485L7459M1777M6476N1848N7700
50732A382282O3276O8061P2305P6478Q0445Q3577Q5528Q6426Q6336Q5055Q2594
$$ y = [3071070, 3039928, 3001935, 2954918, 2898266, 2832300, 2756972, 2671911, 2577718, 2476320, 2369855, 2260015, 2148736, 2038657, 1932339, 1831559, 1737777, 1652505, 1576585, 1509669, 1451163, 1401260, 1360287, 1327381, 1300728, 1279108, 1262510, 1251205, 1244912, 1242910, 1244279, 1247732, 1251757, 1255313, 1258110, 1259996, 1260462, 1259002, 1255649, 1250807, 1244649, 1236957, 1227495, 1216393, 1204196, 1191636, 1179159, 1166453, 1152433, 1135931, 1116602, 1095269, 1073365, 1051910, 1030974, 1010181, 989746, 970783, 954465, 941099, 930306, 921931, 916358, 913950, 914671, 918420, 925373, 935673, 949044, 965055, 983639, 1005008, 1029063, 1055262, 1083271, 1113537, 1147022, 1184481, 1226258, 1272734, 1324582, 1382282, 1445558, 1513619, 1585924, 1662402, 1742847, 1826424, 1911952, 1998378, 2084714, 2169769, 2252363]
50721B252363P9377P5541P0216O1876M9486L3330J4783m507k3283m0546n5057
50710B513579o5434p1076p2650p1143o6707n9071m9036l8658k9661k2291j6072
50699A951780j0997p498n931o684j0368j7072k5632l4360m2396m9807n6460o1443
50687A623132o3729o2974n9654n4773m9411m4063l8370l1784k4544j7567j1341
50676A164922n407R83P963J5009K1484K7105L1989L6277L9640M1236M0413L7459
50664A459073L3416K9238K5230K1314J7544J4342J2274J1502J1478J1429J1176
50653A658016J1116J1265J0938R792Q589Q335R057J0196J1785J4367J7812K1176
50641A802444K3910K6568L0076L4685L9723M3925M6129M6172M4993M3446M1339
$$ y = [2252363, 2331740, 2407281, 2477497, 2539373, 2588859, 2622189, 2636972, 2632465, 2609182, 2568636, 2513579, 2448145, 2377069, 2304419, 2233276, 2166569, 2107498, 2058462, 2019804, 1990143, 1967852, 1951780, 1940783, 1933285, 1927354, 1920670, 1910302, 1893230, 1867598, 1833238, 1790842, 1741035, 1684575, 1623132, 1559403, 1496429, 1436775, 1382002, 1332591, 1288528, 1250158, 1218374, 1193830, 1176263, 1164922, 1159515, 1160498, 1168461, 1183470, 1204954, 1232059, 1264048, 1300325, 1339965, 1381201, 1421614, 1459073, 1492489, 1521727, 1546957, 1568271, 1585815, 1600157, 1612431, 1623933, 1635411, 1646840, 1658016, 1669132, 1680397, 1691335, 1701127, 1709716, 1718051, 1727108, 1737304, 1749089, 1763456, 1781268, 1802444, 1826354, 1852922, 1882998, 1917683, 1957406, 2001331, 2047460, 2093632, 2138625, 2182071, 2223410]
50630B223410L8274L4909L2378L0869K9967K9956L0821K9794K2092N638j5946
50619B492162l6091n0156n6966n7222n2440m4819l6243k7190j7544q222p58M570
50607B109081Q845J2544J4543J3459R003J858p174j7447k8492l9930n0987o0263
50595A965040o6669p0501p2859p4132p3892p2156o9635o6575o2458n7201n1648
50584A227314m6392m1141l5832l1358k8312k5800k2507j8376j4340j0800p428
50573I45028m253j833j85J534L998O870R309J0958J2112J3253J4557J5912J7240
50560A044500J8789K0896K3411K5683K7352K8856L0818L3168L5274L6767L7770
50549A363284L8378L8366L7451L5619L3161L0569K8351K6780K5890K5901K7271
$$ y = [2223410, 2261684, 2296593, 2328971, 2359840, 2389807, 2419763, 2450584, 2480378, 2502470, 2508108, 2492162, 2456071, 2405915, 2348949, 2291727, 2239287, 2194468, 2158225, 2131035, 2113491, 2105269, 2104511, 2109081, 2117926, 2130470, 2145013, 2158472, 2167475, 2169333, 2162159, 2144712, 2116220, 2076290, 2025303, 1965040, 1898371, 1827870, 1755011, 1680879, 1606987, 1534831, 1465196, 1398621, 1336163, 1278962, 1227314, 1180922, 1139781, 1103949, 1072591, 1044279, 1018479, 995972, 977596, 963256, 952456, 945028, 940775, 938942, 938757, 940291, 944289, 951159, 960468, 971426, 983538, 996791, 1011348, 1027260, 1044500, 1063289, 1084185, 1107596, 1133279, 1160631, 1189487, 1220305, 1253473, 1288747, 1325514, 1363284, 1401662, 1440028, 1477479, 1513098, 1546259, 1576828, 1605179, 1631959, 1657849, 1683750, 1711021]
50538A711021L0103L3768L7651M1938M7103N2835N8197O2911O7726P3324P9511
50527B296088Q5871R2568R9957J07758J15073J21095J25365J27554J27317J24467
50517C423113J18923J10498R8896Q4029O6263M6350K5141L267j8890m0893o1933
50506C854764q1031r7468j10736j20089j24546j23565j17470j06996r2774p5489
50496B804600n6246l6340j6737K007J9489L5306M8868N8952O3653O1298N1476
50485C036326L4965J2989j2881m0254o6261q8716j06634j19495j26838j29009
50475B394192j27679j24798j21083j16048j09325j01387r2984q4532p6225o8288
50465A371843o0845n3818m7192m1110l5600l0398k5311k0484j6098j2035q067
$$ y = [1711021, 1741124, 1774892, 1812543, 1854481, 1901584, 1954419, 2012616, 2075527, 2143253, 2216577, 2296088, 2381959, 2474527, 2574484, 2682242, 2797315, 2918410, 3043775, 3171329, 3298646, 3423113, 3542036, 3652534, 3751430, 3835459, 3901722, 3948072, 3973213, 3976480, 3957590, 3916697, 3854764, 3773733, 3676265, 3565529, 3445440, 3320894, 3197329, 3079859, 2972863, 2880089, 2804600, 2748354, 2712014, 2695277, 2697284, 2716773, 2752079, 2800947, 2859899, 2923552, 2984850, 3036326, 3071291, 3084280, 3071399, 3031145, 2964884, 2876168, 2769534, 2650039, 2523201, 2394192, 2266513, 2141715, 2020632, 1904584, 1795259, 1693872, 1600888, 1516356, 1440131, 1371843, 1310998, 1257180, 1209988, 1168878, 1133278, 1102880, 1077569, 1057085, 1040987, 1028952, 1020885]
50454A020885m273r34J891M442O914R259J1367J3298J5265J7449J9840K2221K4391
50441A162015K6259K7576K7580K5261K0276J3440O140m84n626q587r090p779n800
50428A271181l827j895j20J123J860K824M639P137R804J2491J5312J8241K1273
50415A360043K4722K8872L3496L8229M3165M8573N4161N9198O3344O6748O9265
50404A889816P0194O9018O6003O1852N7121N2045M6497L9863L1361K0725Q305
50393B412800n553k0705l6443n1084o2993p1799p8046q1867q2657q0113p4859
50382A766681o7736n9005m8686l7366k5978j4904l887O908J6345K3267K7624K9938
50370A613201K9873K6196J8424P804l871j5760k7599l8379m6429n0776n1662m9673
$$ y = [1020885, 1016612, 1015678, 1017569, 1022011, 1028925, 1038184, 1049551, 1062849, 1078114, 1095563, 1115403, 1137624, 1162015, 1188274, 1215850, 1243430, 1268691, 1288967, 1302407, 1308547, 1308063, 1302437, 1293850, 1284760, 1276981, 1271181, 1267354, 1265459, 1265339, 1266462, 1268322, 1271146, 1275785, 1282922, 1292726, 1305217, 1320529, 1338770, 1360043, 1384765, 1413637, 1447133, 1485362, 1528527, 1577100, 1631261, 1690459, 1753803, 1820551, 1889816, 1960010, 2029028, 2095031, 2156883, 2214004, 2266049, 2312546, 2352409, 2383770, 2404495, 2412800, 2407247, 2386542, 2350099, 2299015, 2236022, 2164223, 2086177, 2004310, 1921653, 1841540, 1766681, 1698945, 1639940, 1591254, 1553888, 1527910, 1513006, 1509119, 1516027, 1532372, 1555639, 1583263, 1613201, 1643074, 1669270, 1687694, 1695498, 1691627, 1675867, 1648268, 1609889, 1563460, 1512684, 1461022, 1411349]
50358A411349m5294l9432l3549k8912k6372k6910l1257l8357m5158m8866m8983
50347I98259m6581m2464l7049l1364k6556k2492j8090j3201r023o377m610k761
50335G37691q50O64J970L612N447O590O342M796K711J135Q66J831L122L957M431
50320G84315N135O235P301P871P821P261O414N512M570L397K022R81Q15J411K163
50305H53224K774L464M389N260N754O001O362O897P396P892Q820J0455J2483J4410
50291I55581J6190J7943J8944J7387J1843K979o483j3696j7504j8566j8082j6669
50279I49867j4328j1210q068n788m434l173j206J424M199O837R348J1657J3741
50266I48866J5928J8477K1015K2998K4611K6427K8097K8245K6096K2630J9642
$$ y = [1411349, 1366055, 1326623, 1293074, 1264162, 1237790, 1210880, 1179623, 1141266, 1096108, 1047242, 998259, 951678, 909214, 872165, 840801, 814245, 791753, 773663, 760462, 751439, 745062, 740452, 737691, 736841, 737505, 739475, 743087, 748534, 755124, 761466, 766262, 768973, 770108, 770974, 772805, 775927, 779884, 784315, 789450, 795685, 802986, 810857, 818678, 825939, 832353, 837865, 842435, 845832, 847854, 848835, 849650, 851061, 853224, 855998, 859462, 863851, 869111, 874865, 880866, 887228, 894125, 901521, 909413, 918233, 928688, 941171, 955581, 971771, 989714, 1008658, 1026045, 1037888, 1040867, 1034384, 1020688, 1003184, 984618, 966536, 949867, 935539, 924329, 916261, 910473, 906039, 902866, 901660, 903084, 907283, 914120, 923468, 935125, 948866, 964794, 983271, 1004286, 1027284, 1051895, 1078322, 1106419, 1134664, 1160760, 1183390, 1203032]
50255A203032J8042J7458J7066J6420J5611J4966J4335J2673Q728K345n323j3009
50243A322344k0096k5957k9476k9904k7837k4565k0749j6339j1546p362n206o395
50231A096912j1429j9117k6672l1479l2898l2035l0116k7703k5111k2690k0538
50220H17124j8610j7077j6108j5299j3977j2086j0238q856p830p000o321n571
50208F78151m503l415k887k865k696k174j869k147k592k722k603k371j832j030
50194F42445o55j237k326l046l156l036k926k757k575k562k690k770k783k826
50180F07100k729k156j145j87L22M83P06J224J880K301K179J493N11k82l31O62
50164F12031K363L958M964N705O665P684Q345R005J0575J3237J6187J8990K2289
$$ y = [1203032, 1221074, 1238532, 1255598, 1272018, 1287629, 1302595, 1316930, 1329603, 1338331, 1340676, 1335353, 1322344, 1302248, 1276291, 1246815, 1216911, 1189074, 1164509, 1143760, 1127421, 1115875, 1108513, 1103307, 1096912, 1085483, 1066366, 1039694, 1008215, 975317, 943282, 913166, 885463, 860352, 837662, 817124, 798514, 781437, 765329, 750030, 736053, 723967, 713729, 704873, 697043, 690043, 683722, 678151, 673648, 670233, 667346, 664481, 661785, 659611, 657742, 655595, 653003, 650281, 647678, 645307, 643475, 642445, 641790, 640553, 638227, 635181, 632025, 628989, 626063, 623306, 620731, 618169, 615479, 612709, 609926, 607100, 604371, 602215, 601070, 600883, 601205, 601688, 602394, 603618, 605498, 607799, 609978, 611471, 611982, 611700, 611369, 612031, 614394, 618352, 623316, 629021, 635686, 643370, 651715, 660720, 671295, 684532, 700719, 719709, 741998]
50151G41998K6669L1576L6148M0518M5349N0352N4280N6329N6620N5295N2098
50140A247232M7293M2270L8647L7049L7122L8216L9589M0133L8491L3586K4985
50129A664613J2981j392j6510l0668m2644n1837n8107o1737o3352o3468o1981
50118A225898n8428n2847m6209l9779l4286k9839k6415k4034k2491k1348k0289
50107H49933j9228j8023j6410j4401j2446j0957r867q835p672o457n441n000n223
50094G09973n459m767l195k054k235k831k242k91J718K950L755M426M498L822
50080G08068L236L338L516L036K429K700L683M317M311M327M463L750J695n69
50066G52300j456q57k10p43k139l115k935k133j757k179k854l135l016k862k729
$$ y = [741998, 768667, 800243, 836391, 876909, 922258, 972610, 1026890, 1083219, 1139839, 1195134, 1247232, 1294525, 1336795, 1375442, 1412491, 1449613, 1487829, 1527418, 1567551, 1606042, 1639628, 1664613, 1677594, 1676202, 1659692, 1629024, 1586380, 1534543, 1476436, 1414699, 1351347, 1287879, 1225898, 1167470, 1114623, 1068414, 1028635, 994349, 964510, 938095, 914061, 891570, 870222, 849933, 830705, 812682, 796272, 781871, 769425, 758468, 748601, 739766, 732094, 725637, 720196, 715196, 709973, 704514, 699747, 696552, 694498, 692263, 689432, 687190, 686899, 688617, 691567, 695322, 699748, 704246, 708068, 711304, 714642, 718158, 721194, 723623, 726323, 730006, 734323, 738634, 742961, 747424, 751174, 752869, 752300, 750844, 749987, 749777, 749034, 746895, 743780, 740845, 738712, 736955, 734776, 731922, 728787, 725771, 722909, 720180]
50051G20180k285j319o7J080J963K724L582M619N808P133Q624J0107J1174J1644
50037G84967J1998J2965J4650J6467J8003J9464K1166K3090K5223K7806L0794
50026A006593L3498L5248L6101L6297L5342L2350K7361K1721J7033J4047J2552
50015A308143J1887J1389J0574R007O021P46p209j7213k7904l7961m6399n2422
50003A168659n5512n5620n3011m8071m1571l4769k8636k3135j7828j3105j0085
49992G87316r149r234q892p629n991m848m809n982p877r715j1047j1908j2356
49979F77879j2277j1760j1287j1188j1185j0727r596p964o119m390l141k512k261
49966E73472k120k178k687l588m437m793m437l365j810k89P88J631K913M903O974
$$ y = [720180, 717895, 716576, 716509, 717589, 719552, 722276, 725858, 730477, 736285, 743418, 752042, 762149, 773323, 784967, 796965, 809930, 824580, 841047, 859050, 878514, 899680, 922770, 947993, 975799, 1006593, 1040091, 1075339, 1111440, 1147737, 1183079, 1215429, 1242790, 1264511, 1281544, 1295591, 1308143, 1320030, 1331419, 1341993, 1351000, 1357021, 1357767, 1350558, 1333345, 1305441, 1267480, 1221081, 1168659, 1113147, 1057527, 1004516, 956445, 914874, 880105, 851469, 828334, 810506, 797401, 787316, 778167, 768933, 760041, 752412, 746421, 741573, 736764, 730782, 722905, 713190, 702143, 690235, 677879, 665602, 653842, 642555, 631367, 620182, 609455, 599859, 591895, 585776, 581386, 578245, 575733, 573472, 571352, 569174, 566487, 562899, 558462, 553669, 549232, 545867, 544057, 543768, 544556, 546187, 549100, 554003, 560977]
49951E60977Q286Q795R205R814R971Q952P070N399M509M025L398K546J593N17
49937F45057o22j574k338l368m996o982q912j0639j1962j2335j1462r865q304
49924E51698o936n567m314l379k494j399n33l28j14J143K988L662K523J012O67
49909E38629J188J410J294J821L361N216O690P746Q607R338R956J0383J0225R073
49895F24937P088M980L334K182J195l7j798l975n974p278q005q634r248r440r016
49880E80311q377q028q019p966p435o236m549k951k055j979k234k202j629o38
49866E16013N57J741K680L226L440L595L978M706N674O619P356P972Q769R868
49852E86194J0863J0954R616P139M528K780K185K229K112J419K77j043k580m492
$$ y = [560977, 569263, 578058, 587263, 597077, 607048, 616000, 623070, 628469, 632978, 637003, 640401, 642947, 644540, 645057, 644435, 642861, 640523, 637155, 632159, 625177, 616265, 605626, 593664, 581329, 569867, 560002, 551698, 544762, 539195, 534881, 531502, 529008, 527609, 527076, 526748, 526634, 527777, 530765, 534427, 536950, 537962, 538629, 539817, 541227, 542521, 544342, 547703, 552919, 559609, 567355, 575962, 585300, 595256, 605639, 615864, 624937, 632025, 637005, 640339, 642521, 643716, 643679, 641881, 637906, 631932, 624654, 616649, 608015, 598767, 589327, 580311, 571934, 563906, 555887, 547921, 540486, 534250, 529701, 526750, 524695, 522716, 520482, 518280, 516651, 516013, 516570, 518311, 520991, 524217, 527657, 531252, 535230, 539936, 545610, 552229, 559585, 567557, 576326, 586194, 597057, 608011, 617627, 624766, 629294, 632074, 634259, 636488, 638600, 640019, 640296, 639253, 636673, 632181]
49838F32181o540q058q637q558q226p526o125m293k802k007j550j071o64m45k73
$$ y = [632181, 625641, 617583, 608946, 600388, 592162, 584636, 578511, 574218, 571416, 569409, 567859, 566788, 566124, 565679, 565406]
$$ [...]
##END NTUPLES=NMR SPECTRUM
##END=
