
##TITLE=AC1298_ECUAH12110_6615958_p2pXCobptA
##JCAMPDX= 6.0         $$ Bruker NMR JCAMP-DX V2.0
##DATA TYPE= NMR SPECTRUM
##DATA CLASS= NTUPLES
##ORIGIN= BRUKER
##OWNER= Administrator
$$ 1.72 TOPSPIN		Version 2.1
$$ 2012-08-03 00:52:02.796 -0500  Administrator@TOPSPIN
$$ Compression mode = diff/dup
##.OBSERVE FREQUENCY= 400.02188249412
##.OBSERVE NUCLEUS= ^1H
##.ACQUISITION MODE= SIMULTANEOUS (DQD)
##.ACQUISITION SCHEME= undefined
##.AVERAGES= 64
##.DIGITISER RES= 22
##SPECTROMETER/DATA SYSTEM= spect
##.PULSE SEQUENCE= noesygpps1d.comp
##.SOLVENT NAME= COFFEE_meoh
##.SHIFT REFERENCE= INTERNAL, COFFEE_meoh, 1, 14.96269
##AUDIT TRAIL= $$ (NUMBER, WHEN, WHO, WHERE, PROCESS, VERSION, WHAT)
$$ ##TITLE= Audit trail, TOPSPIN		Version 2.1
$$ ##JCAMPDX= 5.01
$$ ##ORIGIN= Bruker BioSpin GmbH
$$ ##OWNER= Administrator
$$ $$ C:\Bruker\TOPSPIN/data/COFFEE/nmr/AC1298_ECUAH12110_6615958_p2pXCobptA/12/pdata/1/auditp.txt
$$ ##AUDIT TRAIL=  $$ (NUMBER, WHEN, WHO, WHERE, PROCESS, VERSION, WHAT)
(   1,<2012-08-03 00:51:58.218 -0500>,<Administrator>,<TOPSPIN>,<go>,<TOPSPIN 2.1>,
      <created by zg
	started at 2012-08-03 00:40:27.906 -0500,
	POWCHK enabled, PULCHK disabled,
       configuration hash MD5:
       6B 1B 68 BB D9 2E 58 E2 7F 35 AD 54 07 DF 0E 41
       data hash MD5: 64K
       B5 4C 0E DB 27 B9 6E D6 69 BD 03 EC 4B A3 47 5F>)
(   2,<2012-08-03 00:52:00.953 -0500>,<Administrator>,<TOPSPIN>,<proc1d>,<TOPSPIN 2.1>,
      <Start of raw data processing
       efp LB = 0.3 FT_mod = 6 PKNL = 1 PHC0 = 0 PHC1 = 0 SI = 128K 
       data hash MD5: 128K
       76 3A 23 89 57 4D 2A 3B 95 3F A2 19 FA AA 33 56>)
(   3,<2012-08-03 00:52:02.046 -0500>,<Administrator>,<TOPSPIN>,<proc1d>,<TOPSPIN 2.1>,
      <pk PHC0 = -1.18103 PHC1 = 0 
       data hash MD5: 128K
       6D EB 85 8B D8 B1 0C 29 47 9E 8D B0 EC 41 44 E8>)
(   4,<2012-08-03 00:52:02.281 -0500>,<Administrator>,<TOPSPIN>,<proc1d>,<TOPSPIN 2.1>,
      <abs ABSG = 1 
       data hash MD5: 128K
       3F 26 01 BC 4E B6 1A FA 17 D7 EC 2E 64 35 31 AA>)
(   5,<2012-08-03 00:52:02.359 -0500>,<Administrator>,<TOPSPIN>,<proc1d>,<TOPSPIN 2.1>,
      <abs ABSG = 2 
       data hash MD5: 128K
       09 18 7B FA 44 CC 95 4B 54 99 BC 97 85 3B 20 F5>)
(   6,<2012-08-03 00:52:02.453 -0500>,<Administrator>,<TOPSPIN>,<proc1d>,<TOPSPIN 2.1>,
      <abs ABSG = 3 
       data hash MD5: 128K
       07 A5 BA CA E2 95 20 27 42 BA 92 98 91 50 58 2C>)
(   7,<2012-08-03 00:52:02.656 -0500>,<Administrator>,<TOPSPIN>,<proc1d>,<TOPSPIN 2.1>,
      <abs ABSG = 4 
       data hash MD5: 128K
       1E C5 AB 4C 85 11 E4 7E E9 12 0C 0F BC 84 1A 7C>)
(   8,<2012-08-03 00:52:02.703 -0500>,<Administrator>,<TOPSPIN>,<proc1d>,<TOPSPIN 2.1>,
      <abs ABSG = 5 
       data hash MD5: 128K
       79 7E B1 2D 8A E5 C2 97 D6 A6 C5 AD 3D 6A B6 C4>)
$$ ##END=
$$ 
$$ $$ hash MD5
$$ $$ 82 82 D1 57 55 BE 13 1E 43 F7 64 CC 0B 2C 74 75
##$RELAX= 
##$RELAX= 
##$RELAX= 
##$RELAX= 
##$RELAX= 
##$RELAX= 
##$RELAX= 
##$RELAX= 
$$ Bruker specific parameters
$$ [...]
150 150 150 150 150 150 150 150
##$TP07= 0
##$TPNAME0= <>
##$TPNAME1= <>
##$TPNAME2= <>
##$TPNAME3= <>
##$TPNAME4= <>
##$TPNAME5= <>
##$TPNAME6= <>
##$TPNAME7= <>
##$TPOAL= (0..7)
0.5 0.5 0.5 0.5 0.5 0.5 0.5 0.5
##$TPOFFS= (0..7)
0 0 0 0 0 0 0 0
##$TUNHIN= 0
##$TUNHOUT= 0
##$TUNXOUT= 0
##$USERA1= <user>
##$USERA2= <user>
##$USERA3= <user>
##$USERA4= <user>
##$USERA5= <user>
##$V9= 5
##$VALIST= <valist>
##$VCLIST= <CCCCCCCCCCCCCCC>
##$VD= 0
##$VDLIST= <DDDDDDDDDDDDDDD>
##$VPLIST= <PPPPPPPPPPPPPPP>
##$VTLIST= <TTTTTTTTTTTTTTT>
##$WBST= 1024
##$WBSW= 4
##$XGAIN= (0..3)
0 0 0 0
##$XL= 0
##$YL= 0
##$YMAX_a= 16053469
##$YMIN_a= -9373278
##$ZGOPTNS= <>
##$ZL1= 120
##$ZL2= 120
##$ZL3= 120
##$ZL4= 120
##$ABSF1= 14.96269
##$ABSF2= -5.595491
##$ABSG= 5
##$ABSL= 3
##$ALPHA= 0
##$AQORDER= 0
##$ASSFAC= 0
##$ASSFACI= 0
##$ASSFACX= 0
##$ASSWID= 0
##$AUNMP= <proc_prof1d_extract.lims>
##$AXLEFT= 0
##$AXNAME= <>
##$AXNUC= <1H>
##$AXRIGHT= 0
##$AXTYPE= 0
##$AXUNIT= <>
##$AZFE= 0.1
##$AZFW= 0.1
##$BCFW= 0
##$BC_mod= 0
##$BYTORDP= 0
##$COROFFS= 0
##$CY= 15
##$DATMOD= 1
##$DC= 0
##$DFILT= <>
##$DTYPP= 0
##$F1P= 0
##$F2P= 0
##$FCOR= 0.5
##$FTSIZE= 131072
##$FT_mod= 6
##$GAMMA= 0
##$GB= 0
##$INTBC= 1
##$INTSCL= 1
##$ISEN= 128
##$LB= 0.3
##$LEV0= 0
##$LPBIN= 0
##$MAXI= 10000
##$MC2= 0
##$MEAN= 0
##$ME_mod= 0
##$MI= 0
##$NCOEF= 0
##$NC_proc= -2
##$NLEV= 6
##$NOISF1= 0
##$NOISF2= 0
##$NSP= 0
##$NTH_PI= 0
##$NZP= 0
##$OFFSET= 14.96269
##$PC= 1
##$PHC0= -1.18103
##$PHC1= 0
##$PH_mod= 1
##$PKNL= yes
##$PPARMOD= 0
##$PPDIAG= 0
##$PPIPTYP= 0
##$PPMPNUM= 2147483647
##$PPRESOL= 1
##$PSCAL= 4
##$PSIGN= 0
##$PYNMP= <proc.py>
##$REVERSE= no
##$SF= 400.0200089603
##$SI= 131072
##$SIGF1= 0
##$SIGF2= 0
##$SINO= 400
##$SIOLD= 131072
##$SPECTYP= <>
##$SREGLST= <1H.CDCl3>
##$SSB= 0
##$STSI= 131072
##$STSR= 0
##$SW_p= 8223.68421052631
##$SYMM= 0
##$S_DEV= 0
##$TDeff= 65536
##$TDoff= 0
##$TI= <>
##$TILT= no
##$TM1= 0
##$TM2= 0
##$TOPLEV= 0
##$USERP1= <user>
##$USERP2= <user>
##$USERP3= <user>
##$USERP4= <user>
##$USERP5= <user>
##$WDW= 1
##$XDIM= 131072
##$YMAX_p= 426923854
##$YMIN_p= -13584
##$CURPLOT= <Network HP LaserJet P1505>
##$CURPRIN= <$Network HP LaserJet P1505>
##$DFORMAT= <normdp>
##$LAYOUT= <+/1D_H.xwp>
##$LFORMAT= <normlp>
##$PFORMAT= <normpl>
##$SURQMSG= 1
$$ End of Bruker specific parameters
$$ ---------------------------------
##NTUPLES= NMR SPECTRUM
##VAR_NAME=  FREQUENCY,     SPECTRUM/REAL,   SPECTRUM/IMAG
##SYMBOL=    X,             R,               I
##VAR_TYPE=  INDEPENDENT,   DEPENDENT,       DEPENDENT
##VAR_FORM=  AFFN,          ASDF,            ASDF
##VAR_DIM=   131072,        131072,          131072
##UNITS=     HZ,            ARBITRARY UNITS, ARBITRARY UNITS
##FACTOR=    0.0627417313425164, 1,          1
##FIRST=     8223.62146879497, -1685,        -54171
##LAST=      0,             -569,            -55022
##MIN=       0,             -13584,          0
##MAX=       8223.62146879497, 426923854,    0
$$ Real data points
##PAGE= N=1
##DATA TABLE= (X++(R..R)), XYDATA
$$ [...]
$$ plain form
63216 981901 1002881 1023628 1044256 1065249 1087033 1109409 1131352 1151333 1167829 1179600 1185729 1185774
63204 1185774 1179872 1168365 1151139 1127674 1097998 1063384 1025777 986762 947368 908584 871398
63193 871398 836330 803492 773261 746409 723383 703908 687552 674266 664074 656689 651830 649630
63181 649630 650220 653144 657641 663383 670480 678873 688230 698436 709640 721653 733770 745436 756784
63168 756784 768260 779940 791449 802375 812514 821828 830318 837827 843803 847461 848410 846972 843641
63155 843641 838319 830374 819411 805684 789788 772323 754000 735686 717987 700919 684255 668090
63143 668090 652809 638642 625634 614040 604270 596287 589446 583164 577432 572401 567838 563463 559576
63130 559576 556774 555103 554075 553596 554270 556455 559461 562124 564002 565715 568189 571814 576238 580798 585152
$$ packed form
63216I81901K0980K0747K0628K0993K1784K2376K1943J9981J6496J1771O129M5
63204A185774n902j1507j7226k3465k9676l4614l7607l9015l9394l8784l7186
63193H71398l5068l2838l0231k6852k3026j9475j6356j3286j0192p385m859k200
63181F49630N90K924M497N742P097Q393R357J0206J1204J2013J2117J1666J1348
63168G56784J1476J1680J1509J0926J0139R314Q490P509N976L658R49j438l331
63155H43641n322p945j0963j3727j5896j7465j8323j8314j7699j7068j6664j6165
63143F68090j5281j4167j3008j1594r770p983o841o282n732n031m563m375l887
63130E59576k802j671j028m79O74K185L006K663J878J713K474L625M424M560M354
$$ plain form
63115 585152 589582 594613 600367 606463 612505 618356 623908 629046 634022 639483 645781 652529 659113 665327
63101 665327 671141 676203 680105 683058 685829 688900 691972 694256 695117 694567 693364 692440 691985 691320 689904
63086 689904 688179 687014 686652 686709 686951 687480 688327 689518 691423 694408 698260 702660 708121 715513 724538 733600
63070 733600 741612 749153 757436 766949 777732 790249 805040 821837 839910 859218 880514 904344
63058 904344 930484 958450 988103 1019650 1053480 1090083 1129855 1172824 1218710 1267238 1318336
63047 1318336 1372069 1428525 1487594 1548652 1610573 1672241 1733020 1792626 1850745 1907022 1961275
63036 1961275 2013529 2063895 2112605 2160082 2206830 2253283 2299695 2345891 2391035 2433871 2473208
63025 2473208 2507804 2535700 2554212 2560971 2554688 2534844 2501272 2454525 2396180 2328220 2252471 2171153
$$ packed form
63115E85152M430N031N754O096O042N851N552N138M976N461O298O748O584O214
63101F65327N814N062L902K953K771L071L072K284Q61n50j203r24m55o65j416
63086F89904j725j165l62N7K42N29Q47J191J905K985L852M400N461P392R025R062
63070G33600Q012P541Q283R513J0783J2517J4791J6797J8073J9308K1296K3830
63058I04344K6140K7966K9653L1547L3830L6603L9772M2969M5886M8528N1098
63047A318336N3733N6456N9069O1058O1921O1668O0779N9606N8119N6277N4253
63036A961275N2254N0366M8710M7477M6748M6453M6412M6196M5144M2836L9337
63025B473208L4596K7896J8512O759o283j9844l3572m6747n8345o7960p5749q1318
$$ plain form
63013 2171153 2087389 2004240 1923331 1845123 1770450 1700961 1638033 1581984 1532571 1489574 1452687
63002 1452687 1421476 1395869 1376295 1362993 1355486 1352929 1354675 1360270 1369168 1380730 1394312 1409226
62990 1409226 1424775 1440433 1455841 1470666 1484706 1498082 1510938 1522944 1533409 1541872 1548196 1552058
62978 1552058 1552856 1550165 1543786 1533200 1517547 1496445 1470315 1439622 1404313 1364533 1321515 1277203
62966 1277203 1233102 1189887 1147878 1107349 1068363 1030794 994764 960880 929951 902476 878412
62955 878412 857327 838817 822670 808600 795967 784182 773374 764258 757130 751363 746094 741052
62943 741052 736402 732073 727677 722960 717989 712961 708032 703274 698608 693914 689316 685138 681372 677474
62929 677474 672987 668122 663410 658972 654540 649998 645450 640821 635920 631047 627059 624530 622983 621205
$$ packed form
63013B171153q3764q3149q0909p8208p4673o9489o2928n6049m9413m2997l6887
63002A452687l1211k5607j9574j3302p507k557J746N595Q898J1562J3582J4914
62990A409226J5549J5658J5408J4825J4040J3376J2856J2006J0465Q463O324L862
62978A552058P98k691o379j0586j5653k1102k6130l0693l5309l9780m3018m4312
62966A277203m4101m3215m2009m0529l8986l7569l6030l3884l0929k7475k4064
62955H78412k1085j8510j6147j4070j2633j1785j0808r116p128n767n269n042
62943G41052m650m329m396m717m971n028m929m758m666m694m598m178l766l898
62929F77474m487m865m712m438m432m542m548m629m901m873l988k529j547j778
$$ plain form
62915 621205 618317 614499 610634 607284 604034 599935 594540 588334 582176 576700 572381 569662 568491 567963
62901 567963 567011 565472 564002 562950 561812 560041 557920 556182 554924 553323 550486 546384 541851 537752
62887 537752 534265 530966 527479 523899 520591 517769 515308 512884 510208 507277 504514 502530 501600 501475 501764
62872 501764 502315 503040 503588 503584 503179 503098 504062 506291 509543 513400 517443 521351 525012 528546 532167 535932 539547
62855 539547 542467 544379 545664 547102 549001 550834 551965 552521 553216 554383 555582 556194 556117 555795 555752 556253
62839 556253 557271 558660 560277 561894 563018 563115 562208 561070 560498 560511 560508 560139 559614 559206 558860 558430 557926 557279
62821 557279 556087 553919 550764 547031 543174 539506 536305 533861 532257 531167 530001 528378 526502 525070
62807 525070 524764 525823 528010 530870 534062 537548 541494 545861 550218 554298 558707 564665 572817 582675
$$ packed form
62915F21205k888l818l865l350l250m099n395o206o158n476m319k719j171n28
62901E67963r52j539j470j052j138j771k121j738j258j601k837m102m533m099
62887E37752l487l299l487l580l308k822k461k424k676k931k763j984r30j25K89
62872E01764N51P25N48mm05q1R64K229L252L857M043L908L661L534L621L765L615
62855E39547K920J912J285J438J899J833J131N56O95J167J199O12p7l22m3N01
62839E56253J018J389J617J617J124R7r07j138n72J3ll69n25m08l46m30n04o47
62821E57279j192k168l155l733l857l668l201k444j604j090j166j623j876j432
62807E25070l06J059K187K860L192L486L946M367M357M080M409N958Q152R858
$$ plain form
62793 582675 593493 605265 618422 632911 648269 664571 682682 703422 726892 752764 780876
62782 780876 811434 844995 882418 924502 971498 1023222 1079744 1141707 1209772 1284086 1364434
62771 1364434 1450607 1542219 1638284 1737286 1837644 1937906 2036467 2131213 2219531 2298669 2366152
62760 2366152 2419891 2457972 2478598 2480618 2464186 2430735 2382211 2320417 2247047 2164110 2074102
62749 2074102 1979736 1883409 1786822 1691148 1597561 1507430 1421844 1341207 1265559 1195018 1129548
62738 1129548 1068571 1011467 958444 910325 867385 828891 793850 761645 731805 703847 677740
62727 677740 654021 633017 614301 597217 581513 567103 553734 541391 530630 521853 514508 507584
62715 507584 500671 494049 488030 482887 479190 477375 476964 477035 477598 479762 484270 490552 497634 505403 514488
$$ packed form
62793E82675J0818J1772J3157J4489J5358J6302J8111K0740K3470K5872K8112
62782G80876L0558L3561L7423M2084M6996N1724N6522O1963O8065P4314Q0348
62771A364434Q6173R1612R6065R9002J00358J00262R8561R4746Q8318P9138O7483
62760B366152N3739L8081K0626K020j6432l3451m8524o1794p3370q2937r0008
62749B074102r4366r6327r6587r5674r3587r0131q5586q0637p5648p0541o5470
62738A129548o0977n7104n3023m8119m2940l8494l5041l2205k9840k7958k6107
62727F77740k3719k1004j8716j7084j5704j4410j3369j2343j0761q777p345o924
62715E07584o913o622o019n143l697j815m11P1N63K164M508O282P082P769R085
$$ plain form
62700 514488 525342 538092 553003 570466 590510 612764 636953 663158 691652 722785 756948
62689 756948 794188 833743 874292 914861 955269 995500 1034841 1071783 1104573 1131706 1152157
62678 1152157 1165519 1171900 1171383 1163567 1147959 1124852 1095455 1060981 1022035 979224 934100 888864
62666 888864 845135 803357 763481 725694 690311 657345 626602 598061 571874 548074 526478
62655 526478 506789 488659 471727 455797 440933 427273 414843 403598 393480 384274 375632 367456
62643 367456 360110 353968 348846 344129 339386 334594 329835 325154 320748 316909 313614 310389 306822 303086
62629 303086 299790 297409 296001 295351 295145 294955 294277 292837 290907 289170 288161 287877 287980 288254 288701 289386
62613 289386 290515 292592 296066 300690 305602 310263 315035 320581 327076 334311 342248 350973 360370 370409
$$ packed form
62700E14488J0854J2750J4911J7463K0044K2254K4189K6205K8494L1133L4163
62689G56948L7240L9555M0549M0569M0408M0231L9341L6942L2790K7133K0451
62678A152157J3362O381n17p816j5608k3107k9397l4474l8946m2811m5124m5236
62666H88864m3729m1778l9876l7787l5383l2966l0743k8541k6187k3800k1596
62655E26478j9689j8130j6932j5930j4864j3660j2430j1245j0118r206q642q176
62643C67456p346o142n122m717m743m792m759m681m406l839l295l225l567l736
62629C03086l296k381j408o50k06j90o78j440j930j737j009k84J03K74M47O85
62613B89386J129K077L474M624M912M661M772N546O495P235P937Q725R397J0039
$$ plain form
62599 370409 381693 395118 410968 428821 448403 470003 493918 520104 548659 580172 615225
62588 615225 653965 696525 743375 794583 848865 903998 958174 1010487 1060085 1105473 1144934
62577 1144934 1177246 1201605 1217139 1223001 1218970 1205691 1184241 1155684 1121130 1081984 1039834 996025
62565 996025 951479 906931 863161 820888 780570 742478 706869 673908 643455 615185 588987
62554 588987 565053 543481 523883 505512 487642 469846 452173 435216 419819 406420 394735
62543 394735 384200 374553 365767 357596 349650 341911 334884 329091 324658 321491 319543 318726 318738 319164 319642
62528 319642 319893 319854 319953 321002 323499 327166 331382 335891 340871 346521 352921 360194 368384 377275 386749
62513 386749 397309 409778 424406 440737 458430 477662 498511 520503 543213 566852 591702
$$ packed form
62599C70409J1284J3425J5850J7853J9582K1600K3915K6186K8555L1513L5053
62588F15225L8740M2560M6850N1208N4282N5133N4176N2313M9598M5388L9461
62577A144934L2312K4359J5534N862m031j3279k1450k8557l4554l9146m2150m3809
62565I96025m4546m4548m3770m2273m0318l8092l5609l2961l0453k8270k6198
62554E88987k3934k1572j9598j8371j7870j7796j7673j6957j5397j3399j1685
62543C94735j0535r647q786q171p946p739p027n793m433l167j948q17J2M26M78
62528C19642K51l9R9J049K497L667M216M509M980N650O400P273Q190Q891R474
62513C86749J0560J2469J4628J6331J7693J9232K0849K1992K2710K3639K4850
$$ plain form
62502 591702 617242 642348 666186 688382 708461 725670 739346 749000 754012 753795 748397 738614 725394
62489 725394 709422 691276 671542 650666 629060 607476 586946 568187 551312 536126 522363
62478 522363 509687 497948 487533 479016 472312 466600 461217 456133 451450 447071 443141 440221 438614
62465 438614 438041 438332 439815 442478 445367 447565 449396 451940 455655 460251 465625 472024 479299 486784 493988
62450 493988 500849 507320 513347 519192 525160 530930 535827 539667 542565 543866 542223 537092 529387 520240
62436 520240 509818 497859 484731 471298 458172 445663 434142 423883 414727 406385 398923 392550
62424 392550 387203 382728 379323 377359 376911 377733 379561 382138 385203 388845 393651 400061 407662 415529 423257
62409 423257 431380 440787 451900 464215 476436 487316 496708 505588 514688 523329 530009 533941 535539
$$ packed form
62502E91702K5540K5106K3838K2196K0079J7209J3676R654N012k17n398r783j3220
62489G25394j5972j8146j9734k0876k1606k1584k0530j8759j6875j5186j3763
62478E22363j2676j1739j0415q517o704n712n383n084m683m379l930k920j607
62465D38614n73K91J483K663K889K198J831K544L715M596N374O399P275P485P204
62450D93988O861O471O027N845N968N770M897L840K898J301j643n131p705r147
62436E20240j0422j1959j3128j3433j3126j2509j1521j0259r156q342p462o373
62424C92550n347m475l405j964m48Q22J828K577L065L642M806O410P601P867P728
62409D23257Q123R407J1113J2315J2221J0880R392Q880R100Q641O680L932J598
$$ plain form
62396 535539 535592 534512 532413 529321 525221 520258 514900 509507 503769 497128 489855 483197 478286 475360 474150
62381 474150 474463 476046 478448 481599 486276 493566 503972 517318 533270 551512 571654 593569 617893
62368 617893 645776 677911 714028 753388 795561 840621 888784 939959 993451 1047944 1101888
62357 1101888 1154025 1203430 1248907 1288535 1320078 1341950 1353718 1355748 1348684 1333412 1311307 1284087
62345 1284087 1253254 1219752 1184125 1146806 1108116 1068258 1027611 987053 947803 910863 876664
62334 876664 845262 816718 791197 768693 748736 730468 713157 696682 681384 667394 654365
62323 654365 642058 630959 621898 615101 609997 606026 603187 601545 600610 599652 598425 597108 595507 592826
62309 592826 588474 582817 576804 570987 565135 558764 551702 544089 536132 528194 520962 515197 511164 508486
$$ packed form
62396E35539N3j080k099l092m100m963n358n393n738o641p273o658m911k926j210
62381D74150L13J583K402L151M677P290J0406J3346J5952J8242K0142K1915K4324
62368F17893K7883L2135L6117L9360M2173M5060M8163N1175N3492N4493N3944
62357A101888N2137M9405M5477L9628L1543K1872J1768K030p064j5272k2105k7220
62345A284087l0833l3502l5627l7319l8690l9858m0647m0558l9250l6940l4199
62334H76664l1402k8544k5521k2504j9957j8268j7311j6475j5298j3990j3029
62323F54365j2307j1099r061o797n104l971k839j642r35r58j227j317j601k681
62309E92826m352n657o013n817n852o371p062p613p957p938p232n765m033k678
$$ plain form
62295 508486 506611 505253 504303 503627 503270 503686 505412 508470 512413 517006 522557 529428 537503 546270 555172
62280 555172 563678 571395 578506 585961 594768 605099 616376 628149 640437 653193 666040 678884
62268 678884 692391 707411 724163 742435 762461 785114 811210 841011 874489 911648 952310
62257 952310 995847 1041292 1087421 1132479 1174102 1209987 1238730 1259877 1273351 1279158 1277646 1269609
62245 1269609 1255889 1236983 1213178 1184892 1152724 1117290 1079220 1039413 999201 960169 923686
62234 923686 890463 860488 833346 808594 785962 765489 747640 733046 721746 712676 704260 695634
62222 695634 687086 679307 672564 666732 661704 657398 653617 650269 647564 645669 644324 643225 642676 643344 645223
62207 645223 647331 648742 649644 651150 654268 659258 665747 673115 680805 688544 696365 704364 712601 721366
$$ packed form
62295E08486j875j358r50o76l57M16J726L058L943M593N551O871Q075Q767Q902
62280E55172Q506P717P111P455Q807J0331J1277J1773J2288J2756J2847J2844
62268F78884J3507J5020J6752J8272K0026K2653K6096K9801L3478L7159M0662
62257I52310M3537M5445M6129M5058M1623L5885K8743K1147J3474N807j512q037
62245A269609j3720j8906k3805k8286l2168l5434l8070l9807m0212l9032l6483
62234I23686l3223k9975k7142k4752k2632k0473j7849j4594j1300r070q416q626
62222F95634q548p779o743n832n028m306l781l348k705j895j345j099n49O68J879
62207F45223K108J411R02J506L118M990O489P368P690P739P821P999Q237Q765
$$ plain form
62193 721366 731353 743222 756956 771876 787319 803078 819230 835850 853013 870747 888721 906170
62181 906170 922405 937319 951240 964538 977761 992029 1008664 1028102 1049503 1071827 1095215
62170 1095215 1121009 1150404 1183328 1218683 1255369 1292873 1330850 1368234 1402872 1432217 1454554
62159 1454554 1469643 1478312 1481673 1480839 1476965 1470968 1463025 1452730 1439905 1425076 1409019 1392173 1374768
62146 1374768 1357321 1340671 1325531 1312253 1300973 1291711 1284315 1278527 1274205 1271378 1270040 1270023 1271030
62133 1271030 1272672 1274553 1276590 1279322 1283621 1289909 1297776 1306503 1315828 1326022 1337440 1350284 1364801
62120 1364801 1381346 1399947 1420001 1440672 1461703 1483630 1507127 1532280 1558671 1586006 1614275
62109 1614275 1643294 1672514 1701612 1731082 1761787 1793988 1827166 1860838 1895114 1930206 1965779
$$ packed form
62193G21366R987J1869J3734J4920J5443J5759J6152J6620J7163J7734J7974J7449
62181I06170J6235J4914J3921J3298J3223J4268J6635J9438K1401K2324K3388
62170A095215K5794K9395L2924L5355L6686L7504L7977L7384L4638K9345K2337
62159A454554J5089Q669L361q34l874n997p943j0295j2825j4829j6057j6846j7405
62146A374768j7447j6650j5140j3278j1280r262p396n788m322k827j338j7J007
62133A271030J642J881K037K732M299O288P867Q727R325J0194J1418J2844J4517
62120A364801J6545J8601K0054K0671K1031K1927K3497K5153K6391K7335K8269
62109A614275K9019K9220K9098K9470L0705L2201L3178L3672L4276L5092L5573
$$ plain form
62098 1965779 2001274 2036787 2073213 2111345 2151045 2191455 2231933 2272734 2314928 2359722 2407749
62087 2407749 2458746 2511683 2565017 2616925 2665823 2711197 2754029 2796063 2838615 2882314 2927784
62076 2927784 2975724 3025752 3075631 3122473 3164971 3204216 3242547 3282101 3324398 3370447 3420608
62065 3420608 3474478 3531132 3589292 3647222 3702945 3754979 3802750 3846170 3885213 3920251 3952277
62054 3952277 3982101 4009478 4033586 4054205 4071747 4086142 4096500 4102220 4103901 4102874 4100183 4096236
62042 4096236 4090936 4083760 4074154 4062291 4049160 4035550 4021240 4005572 3988499 3970604 3952446 3934467
62030 3934467 3917305 3901360 3886037 3870089 3852961 3835311 3818141 3801972 3787065 3773776 3762207
62019 3762207 3751926 3742553 3734452 3728399 3724701 3722956 3722534 3722962 3724021 3725926 3729334 3734811 3742247 3751077
$$ packed form
62098A965779L5495L5513L6426L8132L9700M0410M0478M0801M2194M4794M8027
62087B407749N0997N2937N3334N1908M8898M5374M2832M2034M2552M3699M5470
62076B927784M7940N0028M9879M6842M2498L9245L8331L9554M2297M6049N0161
62065C420608N3870N6654N8160N7930N5723N2034M7771M3420L9043L5038L2026
62054C952277K9824K7377K4108K0619J7542J4395J0358N720J681j027k691l947
62042D096236n300p176r606j1863j3131j3610j4310j5668j7073j7895j8158j7979
62030C934467j7162j5945j5323j5948j7128j7650j7170j6169j4907j3289j1569
62019C762207j0281r373q101o053l698j745m22M28J059J905L408N477P436Q830
$$ plain form
62005 3751077 3760923 3771597 3782552 3792936 3802372 3811203 3819712 3827494 3833889 3838544 3841059 3840363 3835117
61992 3835117 3824751 3809702 3790613 3767726 3741108 3711080 3678228 3643283 3606996 3569795 3531405
61981 3531405 3491232 3449376 3406953 3365154 3324233 3283714 3243308 3203231 3163834 3125310 3087756
61970 3087756 3051139 3015223 2979801 2944979 2911043 2878139 2846359 2816046 2787604 2760986 2735669
61959 2735669 2711205 2687581 2665085 2644109 2625019 2607853 2592084 2576937 2561952 2547051 2532285
61948 2532285 2518030 2505280 2494985 2486882 2479570 2472094 2464929 2459073 2454714 2451360 2448929 2448025 2449155
61935 2449155 2452202 2456727 2462505 2469739 2478949 2490682 2505254 2522813 2543668 2568326 2597173 2630497
61923 2630497 2668970 2713713 2765624 2825129 2893037 2971266 3062145 3167211 3287331 3423966 3579785
$$ packed form
62005C751077R846J0674J0955J0384R436Q831Q509P782O395M655K515o96n246
61992C835117j0366j5049j9089k2887k6618l0028l2852l4945l6287l7201l8390
61981C531405m0173m1856m2423m1799m0921m0519m0406m0077l9397l8524l7554
61970C087756l6617l5916l5422l4822l3936l2904l1780l0313k8442k6618k5317
61959B735669k4464k3624k2496k0976j9090j7166j5769j5147j4985j4901j4766
61948B532285j4255j2750j0295q103p312p476p165n856m359l354k431r04J130
61935B449155L047M525N778P234R210J1733J4572J7559K0855K4658K8847L3324
61923B630497L8473M4743N1911N9505O7908P8229R0879J05066J20120J36635J55819
$$ plain form
61912 3579785 3757950 3961289 4192358 4454071 4750188 5085407 5465010 5894194 6377561
61903 6377561 6918998 7521300 8184802 8905098 9670417 10458925 11236733 11958650 12573220
61894 12573220 13031042 13293529 13339766 13170063 12805030 12280103 11637770 10920702 10167355
61885 10167355 9409607 8671905 7971611 7319703 6721229 6176306 5682459 5237006 4837469
61876 4837469 4480418 4161123 3874781 3617644 3386889 3180026 2994683 2828496 2678970
61867 2678970 2543831 2421573 2311293 2211965 2122345 2041436 1968373 1901912 1840847 1785041 1735153
61856 1735153 1691113 1651750 1616199 1584692 1557390 1533412 1511850 1492907 1477106 1463949 1452354
61845 1452354 1442066 1433614 1427082 1421828 1417360 1413607 1410324 1407011 1403580 1400552 1398430 1397376 1397484 1398797
$$ packed form
61912C579785J78165K03339K31069K61713K96117L35219L79603M29184M83367
61903F377561N41437O02302O63502P20296P65319P88508P77808P21917O14570
61894A2573220M57822K62487M6237j69703l65033n24927o42333p17068p53347
61885A0167355p57748p37702p00294o51908n98474n44923m93847m45453l99537
61876D837469l57051l19295k86342k57137k30755k06863j85343j66187j49526
61867B678970j35139j22258j10280r9328q9620q0909p3063o6461o1065n5806m9888
61856A735153m4040l9363l5551l1507k7302k3978k1562j8943j5801j3157j1595
61845A452354j0288q452o532n254m468l753l283l313l431l028k122j054J08J313
$$ plain form
61831 1398797 1401013 1403677 1406819 1410888 1415914 1421170 1425903 1430102 1434396 1439397 1445312 1452004 1459274 1467127
61817 1467127 1475791 1485553 1496732 1509812 1525238 1542977 1562647 1584338 1608879 1637042 1668890 1704274
61805 1704274 1743424 1786596 1833660 1884785 1941078 2003703 2072635 2147149 2227339 2314261 2408741
61794 2408741 2511082 2622053 2743146 2875620 3020221 3178230 3352048 3544438 3758003
61785 3758003 3995710 4261053 4557153 4886550 5252632 5660702 6117034 6627577 7198438
61776 7198438 7837102 8552212 9352280 10245206 11238390 12337349 13542359 14844517 16221961
61767 16221961 17635954 19027978 20320953 21426770 22259278 22749327 22857592 22581263 21952672
61758 21952672 21031035 19890795 18609898 17260245 15901552 14578951 13323371 12153383
$$ packed form
61831A398797K216K664L142M069N026N256M733M199M294N001N915O692P270P853
61817A467127Q664R762J1179J3080J5426J7739J9670K1691K4541K8163L1848L5384
61805A704274L9150M3172M7064N1125N6293O2625O8932P4514Q0190Q6922R4480
61794B408741J02341J10971J21093J32474J44601J58009J73818J92390K13565
61785C758003K37707K65343K96100L29397L66082M08070M56332N10543N70861
61776G198438O38664P15110Q00068Q92926R93184J098959J205010J302158J377444
61767A6221961J413993J392024J292975J105817Q32508M90049J08265k76329o28591
61758B1952672r21637j140240j280897j349653j358693j322601j255580j169988
$$ plain form
61750 12153383 11077831 10098898 9214661 8420351 7708962 7072356 6502787 5993545 5538451
61741 5538451 5131301 4766105 4437663 4141753 3874967 3634511 3417947 3222880 3046937
61732 3046937 2888093 2744849 2615895 2499662 2394350 2298403 2210839 2131096 2058610 1992571
61722 1992571 1932019 1876050 1823932 1775160 1729563 1687256 1648271 1612280 1578855 1547941 1519708
61711 1519708 1493849 1469402 1445485 1421947 1399064 1376944 1355609 1335363 1316453 1298406 1280234
61700 1280234 1261472 1242634 1224428 1206827 1189197 1171149 1153027 1135583 1119353 1104359 1090299
61689 1090299 1076899 1064040 1051648 1039724 1028524 1018454 1009565 1001359 993346 985664 978874 973244
61677 973244 968546 964440 960662 956907 952937 948909 945203 941947 939044 936657 935038 933699 931304 926860
$$ packed form
61750A2153383j075552r78933q84237p94310p11389o36606n69569n09242m55094
61741E538451m07150l65196l28442k95910k66786k40456k16564j95067j75943
61732C046937j58844j43244j28954j16233j05312r5947q7564p9743p2486o6039
61722A992571o0552n5969n2118m8772m5597m2307l8985l5991l3425l0914k8233
61711A519708k5859k4447k3917k3538k2883k2120k1335k0246j8910j8047j8172
61700A280234j8762j8838j8206j7601j7630j8048j8122j7444j6230j4994j4060
61689A090299j3400j2859j2392j1924j1200j0070q889q206q013p682o790n630
61677I73244m698m106l778l755l970m028l706l256k903k387j619j339k395m444
$$ plain form
61663 926860 920660 913761 906863 900095 893420 886700 879581 871972 864616 858561 853987 850026 845828 841357
61649 841357 837040 833086 829441 826070 823033 820427 818373 816850 815532 814186 813326 814014 816654 820396 824106
61634 824106 827658 831772 836865 842646 848746 855138 861769 868297 874422 880093 885211 889489 892899 895878
61620 895878 898709 900881 901539 900496 898454 896206 893951 891425 888359 884582 879945 874427 868285 861868
61606 861868 855246 848100 840075 831234 822223 813916 806760 800433 794208 787723 781308 775517 770591 766537
61592 766537 763532 761807 761125 760879 760966 762221 765543 770765 776876 783341 790633 799312 809125 819513 830647
61577 830647 843379 858211 874844 892839 912207 933145 955602 979484 1004993 1032373 1061382
61566 1061382 1091389 1121945 1152930 1184070 1214686 1244136 1272343 1299644 1326149 1351423 1374796
$$ packed form
61663I26860o200o899o898o768o675o720p119p609p356o055m574l961m198m471
61649H41357m317l954l645l371l037k606k054j523j318j346q60O88K640L742L710
61634H24106L552M114N093N781O100O392O631O528O125N671N118M278L410K979
61620H95878K831K172O58j043k042k248k255k526l066l777m637n518o142o417
61606H61868o622p146q025q841r011q307p156o327o225o485o415n791m926m054
61592G66537l005j725o82k46Q7J255L322N222O111O465P292Q679R813J0388J1134
61577H30647J2732J4832J6633J7995J9368K0938K2457K3882K5509K7380K9009
61566A061382L0007L0556L0985L1140L0616K9450K8207K7301K6505K5274K3373
$$ plain form
61555 1374796 1395874 1414795 1432175 1448864 1465548 1482285 1498327 1512535 1524065 1532689 1538467 1541267
61543 1541267 1540774 1536882 1529906 1520287 1508241 1493843 1477460 1459986 1442546 1425903 1410223 1395438
61531 1395438 1381763 1369695 1359498 1350958 1343833 1338441 1335630 1336159 1340202 1347397 1357339 1370152 1386728
61518 1386728 1408206 1435081 1467021 1503868 1546578 1596775 1655494 1722802 1798612 1883333 1977726
61507 1977726 2082764 2199907 2330983 2477418 2639961 2819460 3017371 3234857 3471467
61498 3471467 3724845 3991137 4264754 4537660 4799458 5038501 5243191 5403192 5510967
61489 5510967 5563175 5560837 5508205 5411564 5278618 5117989 4938427 4748082 4554080 4362219
61479 4362219 4176799 4000827 3836483 3685360 3548495 3426509 3319739 3228115 3151082 3087951
$$ packed form
61555A374796K1078J8921J7380J6689J6684J6737J6042J4208J1530Q624N778K800
61543A541267m93l892o976r619j2046j4398j6383j7474j7440j6643j5680j4785
61531A395438j3675j2068j0197q540p125n392k811N29M043P195R942J2813J6576
61518A386728K1478K6875L1940L6847M2710N0197N8719O7308P5810Q4721R4393
61507A977726J05038J17143J31076J46435J62543J79499J97911K17486K36610
61498C471467K53378K66292K73617K72906K61798K39043K04690J60001J07775
61489E510967N2208k338n2632r6641j32946j60629j79562j90345j94002j91861
61479D362219j85420j75972j64344j51123j36865j21986j06770r1624p7033o3131
$$ plain form
61469 3087951 3038220 3001267 2976016 2961403 2956997 2962609 2977366 2999865 3029244 3065371 3107715 3154687
61457 3154687 3204400 3255471 3306733 3356823 3404673 3450040 3493025 3533429 3571142 3606826 3641605
61446 3641605 3676293 3711592 3748848 3789737 3834940 3883654 3934685 3987538 4042134 4097796 4152917
61435 4152917 4205526 4253839 4296323 4331554 4358286 4375743 4383772 4382616 4372493 4353528 4326124 4291282
61423 4291282 4250423 4205002 4156419 4106200 4056000 4007332 3961286 3918529 3879604 3845238 3816285
61412 3816285 3793280 3776195 3764879 3759529 3760235 3765957 3774477 3783640 3792302 3799783 3804957 3806465 3803580
61399 3803580 3796322 3784979 3770150 3753222 3736145 3720572 3707684 3698966 3696616 3702952 3719841 3748955
61387 3748955 3792187 3851417 3928039 4022940 4136789 4270290 4424392 4600389 4799410 5021396
$$ packed form
61469C087951m9731l6953k5251j4613m406N612J4757K2499K9379L6127M2344M6972
61457C154687M9713N1071N1262N0090M7850M5367M2985M0404L7713L5684L4779
61446C641605L4688L5299L7256M0889M5203M8714N1031N2853N4596N5662N5121
61435D152917N2609M8313M2484L5231K6732J7457Q029j156j0123j8965k7404l4842
61423D291282m0859m5421m8583n0219n0200m8668m6046m2757l8925l4366k8953
61412C816285k3005j7085j1316n350P06N722Q520R163Q662P481N174J508k885
61399C803580p258j1343j4829j6928j7077j5573j2888q718k350O336J6889K9114
61387C748955M3232N9230P6622R4901J13849J33501J54102J75997J99021K21986
$$ plain form
61377 5021396 5264725 5526939 5805276 6095807 6391954 6684149 6960860 7209839 7419166
61368 7419166 7578730 7682115 7727662 7717887 7658008 7554555 7414233 7242960 7045570 6826393
61358 6826393 6589912 6340660 6082863 5820632 5558304 5299927 5048254 4804726 4570684
61349 4570684 4348156 4139252 3945289 3766949 3604777 3458822 3328073 3211131 3107567
61340 3107567 3017999 2942694 2880727 2830805 2792231 2764608 2747162 2739054 2739975 2749717 2767351 2791570
61328 2791570 2821886 2858695 2901827 2949508 2999162 3048966 3098378 3147421 3195841 3242847 3287412
61317 3287412 3328774 3366757 3401645 3433799 3463532 3491255 3517381 3541899 3564284 3583945 3600487
61306 3600487 3613281 3621143 3622940 3618433 3608110 3592258 3570684 3543527 3511736 3476309 3437313 3394139
$$ packed form
61377E021396K43329K62214K78337K90531K96147K92195K76711K48979K09327
61368G419166J59564J03385M5547r775n9879j03453j40322j71273j97390k19177
61358F826393k36481k49252k57797k62231k62328k58377k51673k43528k34042
61349D570684k22528k08904j93963j78340j62172j45955j30749j16942j03564
61340C107567q9568p5305o1967m9922l8574k7623j7446q108R21R742J7634K4219
61328B791570L0316L6809M3132M7681M9654M9804M9412M9043M8420M7006M4565
61317C287412M1362L7983L4888L2154K9733K7723K6126K4518K2385J9661J6542
61306C600487J2794P862J797m507j0323j5852k1574k7157l1791l5427l8996m3174
$$ plain form
61294 3394139 3346606 3295398 3241458 3185481 3128157 3070524 3013755 2958839 2906714 2858413 2814706
61283 2814706 2775710 2741319 2712007 2688748 2671929 2660651 2653371 2649000 2647004 2646488 2645587 2642148 2635061
61270 2635061 2624832 2612805 2599936 2586442 2572365 2558006 2543585 2528905 2513843 2499063 2485899
61259 2485899 2475633 2469361 2468509 2474883 2489911 2514266 2548514 2593762 2651304 2721849 2805399 2901692
61247 2901692 3010315 3130408 3260433 3398035 3539669 3680235 3813186 3931050 4025940 4090254
61237 4090254 4117844 4105326 4052735 3963326 3842898 3698854 3539049 3370780 3200301 3032672
61227 3032672 2871627 2719596 2578135 2448353 2330779 2224959 2129676 2043765 1966667 1898074
61217 1898074 1837280 1783057 1734222 1690212 1651046 1616795 1587283 1562382 1542278 1527077 1516281
$$ packed form
61294C394139m7533n1208n3940n5977n7324n7633n6769n4916n2125m8301m3707
61283B814706l8996l4391k9312k3259j6819j1278p280m371j996n16r01l439p087
61270B635061j0229j2027j2869j3494j4077j4359j4421j4680j5062j4780j3164
61259B485899j0266o272q52O374J5028K4355L4248M5248N7542P0545Q3550R6293
61247B901692J08623J20093J30025J37602J41634J40566J32951J17864R4890O4314
61237D090254K7590j2518n2591q9409j20428j44044j59805j68269j70479j67629
61227C032672j61045j52031j41461j29782j17574j05820r5283q5911p7098o8593
61217A898074o0794n4223m8835m4010l9166l4251k9512k4901k0104j5201j0796
$$ plain form
61206 1516281 1509150 1505663 1506587 1512391 1522550 1536210 1552972 1572442 1593356 1613771 1631990 1646868
61194 1646868 1657566 1663798 1666333 1666503 1665007 1661657 1656362 1649702 1642238 1633783 1623745 1611781 1597701
61181 1597701 1581086 1561542 1539314 1515273 1490309 1464941 1439496 1414351 1389878 1366227 1343216
61170 1343216 1320422 1297413 1274047 1250558 1227324 1204447 1181587 1158254 1134397 1110638 1087887
61159 1087887 1066824 1047857 1031320 1017215 1004735 992565 979828 966329 951726 935104 915867
61148 915867 894547 872186 849327 826264 803841 783133 764461 747504 732317 719432 708963
61137 708963 700474 693824 689290 686641 684955 683794 683823 685829 689709 694786 700534 706524 712304 717927 724128
61122 724128 731451 739670 748497 758362 769877 782963 797111 812049 827486 842713 857315 872010
$$ packed form
61206A516281p131l487R24N804J0159J3660J6762J9470K0914K0415J8219J4878
61194A646868J0698O232K535J70j496l350n295o660p464q455j0038j1964j4080
61181A597701j6615j9544k2228k4041k4964k5368k5445k5145k4473k3651k3011
61170A343216k2794k3009k3366k3489k3234k2877k2860k3333k3857k3759k2751
61159A087887k1063j8967j6537j4105j2480j2170j2737j3499j4603j6622j9237
61148I15867k1320k2361k2859k3063k2423k0708j8672j6957j5187j2885j0469
61137G08963q489o650m534k649j686j161K9K006L880N077N748N990N780N623O201
61122G24128P323Q219Q827R865J1515J3086J4148J4938J5437J5227J4602J4695
$$ plain form
61110 872010 887804 904438 920444 934595 946378 955051 959380 958854 954449 947697 939501 930200 920152
61097 920152 909632 898542 886861 875216 864430 854573 844942 835027 825052 815419 806061 796646 787154
61084 787154 777843 768696 759370 749854 740830 732996 726220 719759 713230 706939 701245 696165 691836 688813
61070 688813 687449 687278 687433 687460 687332 686971 686330 685840 686060 686810 687168 686585 685645 685473 686621 688710 690903 692541
61052 692541 693491 694136 694959 696098 697434 699054 701360 704643 708799 713626 719159 725553 732837 740965 749907
61037 749907 759443 769048 778287 787315 796736 806976 817999 829558 841400 853140 864269 874558
61025 874558 884311 893998 903753 913482 923369 933933 945492 957855 970642 983709 997136 1011101
61013 1011101 1025934 1042071 1059659 1078419 1098113 1118931 1141151 1164709 1189578 1216492 1246818
$$ packed form
61110H72010J5794J6634J6006J4151J1783Q673M329n26m405o752q196r301j0048
61097I20152j0520j1090j1681j1645j0786r857r631r915r975r633r358r415r492
61084G87154r311r147r326r516r024p834o776o461o529o291n694n080m329l023
61070F88813j364j71J55K7j28l61o41m90K20P50L58n83r40j72J148K089K193J638
61052F92541R50O45Q23J139J336J620K306L283M156M827N533O394P284Q128Q942
61037G49907R536R605R239R028R421J0240J1023J1559J1842J1740J1129J0289
61025H74558R753R687R755R729R887J0564J1559J2363J2787J3067J3427J3965
61013A011101J4833J6137J7588J8760J9694K0818K2220K3558K4869K6914L0326
$$ plain form
61002 1246818 1281726 1321830 1367473 1418792 1475485 1537035 1603200 1673777 1747962 1824869 1905090
60991 1905090 1991215 2086431 2193160 2313308 2448925 2601632 2771626 2958089 3160907 3382196
60981 3382196 3626760 3901616 4215002 4575937 4995173 5486258 6064746 6747184 7553995
60972 7553995 8515328 9673770 11083896 12816034 14957726 17580429 20650443 23931822
60964 23931822 26986500 29329439 30659016 30996532 30641415 30008837 29486576 29364155 29779190
60955 29779190 30641011 31597468 32141396 31839194 30531971 28369899 25683373 22813435 20011655
60946 20011655 17425955 15126377 13131779 11429339 9990226 8780635 7766851 6917060
60938 6917060 6202787 5599750 5087388 4647944 4266267 3930154 3630491 3360900 3117003
$$ packed form
61002A246818L4908M0104M5643N1319N6693O1550O6165P0577P4185P6907Q0221
60991A905090Q6125R5216J06729J20148J35617J52707J69994J86463K02818K21289
60981C382196K44564K74856L13386L60935M19236M91085N78488O82438Q06811
60972G553995R61333J158442J410126J732138K141692K622703L070014L281379
60964B3931822L054678K342939J329577L37516l55117o32578n22261j22421M15035
60955B9779190Q61821R56457N43928l02202j307223k162072k686526k869938k801780
60946B0011655k585700k299578j994598j702440j439113j209591j013784q49791
60938F917060p14273o03037n12362m39444l81677l36113k99663k69591k43897
$$ plain form
60929 3117003 2895656 2694501 2511805 2346284 2196997 2063457 1945427 1841933 1750415 1667457
60919 1667457 1590461 1518124 1449333 1382592 1317116 1253849 1194682 1140809 1092231 1048481 1009207
60908 1009207 974102 942740 914603 889210 866298 845962 828347 813097 799429 786893 775698
60897 775698 766104 757865 750613 744464 739869 737039 735838 736062 737556 740152 743686 747973 752719 757636
60883 757636 762608 767386 771131 772851 772452 770761 768268 764465 758862 751958 744526 736448 727054 716404
60869 716404 705479 695097 685271 675681 666324 657562 649815 643228 637492 632201 627559 624346 622851 622322
60855 622322 621993 622256 624123 627823 632692 638304 644847 652385 660601 669543 679958 692552 707374 724080
60841 724080 742231 761109 779776 797799 815530 833327 850671 866403 879633 890237 898645 905417
$$ packed form
60929C117003k21347k01155j82696j65521j49287j33540j18030j03494r1518q2958
60919A667457p6996p2337o8791o6741o5476o3267n9167n3873m8578m3750l9274
60908A009207l5105l1362k8137k5393k2912k0336j7615j5250j3668j2536j1195
60897G75698r594q239p252o149m595k830j201K24J494K596L534M287M746M917
60883G57636M972M778L745J720l99j691k493l803n603o904p432q078r394j0650
60869G16404j0925j0382r826r590r357q762p747o587n736n291m642l213j495n29
60855F22322l29K63J867L700M869N612O543P538Q216Q942J0415J2594J4822J6706
60841G24080J8151J8878J8667J8023J7731J7797J7344J5732J3230J0604Q408O772
$$ plain form
60829 905417 910964 915531 919451 923263 927305 931206 934074 935243 934651 932562 929342 925499 921470 917176
60815 917176 912132 906069 899049 890911 881181 869817 857529 844898 831647 817327 802451 788265
60803 788265 775463 763729 752634 742425 733675 726509 720521 715263 710614 706797 704313 703762 705395
60790 705395 708723 712835 717247 722276 728405 735493 743042 751110 760416 771289 782966 794304 804887
60777 804887 815017 824885 834247 842847 850654 857630 863660 868823 873425 877765 882096 886710 891709 896758
60763 896758 901555 906488 912267 918865 925403 931222 936475 941392 945584 948503 950161 950980 951378 951917 953317
60748 953317 955651 957866 958835 958802 959115 960529 962312 963122 962223 959717 956030 951539 946487 941026 935290 929348
60732 929348 923013 915872 907794 899333 891338 884199 877737 871723 866146 861008 856220 851777 847729 843931
$$ packed form
60829I05417N547M567L920L812M042L901K868J169n92k089l220l843m029m294
60815I17176n044o063p020q138r730j1364j2288j2631j3251j4320j4876j4186
60803G88265j2802j1734j1095j0209q750p166n988n258m649l817k484n51J633
60790G05395L328M112M412N029O129P088P549Q068R306J0873J1677J1338J0583
60777H04887J0130R868R362Q600P807O976O030N163M602M340M331M614M999N049
60763H96758M797M933N779O598O538N819N253M917M192K919J658Q19L98N39J400
60748I53317K334K215R69l3L13J414J783Q10q99k506l687m491n052n461n736n942
60732I29348o335p141q078q461p995p139o462o014n577n138m788m443m048l798
$$ plain form
60718 843931 840094 836086 831927 827483 822485 816885 810859 804426 797454 790116 782953 776356 770338 764956
60704 764956 760586 757555 755868 755491 756537 758887 761967 765270 768820 772752 776659 779746 781453 781610 780150
60689 780150 777010 772129 765210 755745 743830 730734 718029 706084 693998 681024 667442 653901
60677 653901 640678 628111 617229 609186 604127 601020 598589 596190 593995 592794 593535 596552 601040 605506
60663 605506 608983 611688 614503 617912 621542 624588 626521 627338 627249 626399 625153 624531 625876 629730 635249
60648 635249 641075 646688 652630 659442 666789 673701 679400 683788 687377 690934 694997 699540 704231 709138
60634 709138 715112 723268 734032 746755 760288 773902 787670 802094 817479 833717 850494 867397
60622 867397 883794 898928 912306 923816 933249 939994 943540 944054 942001 937353 929766 919616 908273
$$ packed form
60718H43931l837m008m159m444m998n600o026o433o972p338p163o597o018n382
60704G64956m370l031j687l77J046K350L080L303L550L932L907L087J707J57j460
60689G80150l140m881o919r465j1915j3096j2705j1945j2086j2974j3582j3541
60677F53901j3223j2567j0882q043n059l107k431k399k195j201P41L017M488M466
60663F05506L477K705K815L409L630L046J933Q17q9q50j246o22J345L854N519
60648F35249N826N613N942O812P347O912N699M388L589L557M063M543M691M907
60634G09138N974Q156J0764J2723J3533J3614J3768J4424J5385J6238J6777J6903
60622H67397J6397J5134J3378J1510R433O745L546N14k053m648p587j0150j1343
$$ plain form
60609 908273 897061 886340 875875 865627 855851 846776 838682 832054 827175 823663 820888 818741 817469
60596 817469 816697 815153 811624 806006 799291 792778 787384 783401 780601 778654 777557 777651 779196 782084 785954
60581 785954 790325 794445 797298 798172 797318 795850 794909 794963 795896 797544 799868 802666 805402 807584 809195 810527
60565 810527 811613 812088 811634 810253 807911 804288 799223 793219 787025 780787 774108 767041 760490 755336 751547
60550 751547 748608 746581 746222 748031 751655 756444 762254 769390 777934 787497 797736 808972 822199 838570
60536 838570 858840 883218 911630 944079 980586 1020515 1061862 1101386 1135634 1161917 1178493
60525 1178493 1184385 1179577 1165412 1144381 1119250 1092387 1065784 1041275 1020448 1004453 993971 989188
60513 989188 989656 994388 1002331 1012638 1024429 1036571 1048115 1058894 1069368 1079832 1090064 1099893
$$ packed form
60609I08273j1212j0721j0465j0248r776r075q094o628m879l512k775k147j272
60596H17469p72j544l529n618o715o513n394l983k800j947j097R4J545K888L870
60581G85954M371M120K853Q74q54j468r41N4R33J648K324K798K736K182J611J332
60565H10527J086M75m54j381k342l623n065o004o194o238o679p067o551n154l789
60550G51547k939k027l59J809L624M789N810P136Q544R563J0239J1236J3227J6371
60536H38570K0270K4378K8412L2449L6507L9929M1347L9524L4248K6283J6576
60525A178493N892m808j4165k1031k5131k6863k6603k4509k0827j5995j0482m783
60513I89188M68M732P943J0307J1791J2142J1544J0779J0474J0464J0232R829
$$ plain form
60501 1099893 1109920 1121492 1136032 1154551 1177858 1207114 1243858 1289369 1344168 1408504 1483214
60490 1483214 1569624 1668376 1778790 1899831 2031632 2175901 2335206 2512500 2711414 2936450
60480 2936450 3192055 3480494 3799053 4137569 4477606 4794231 5060032 5249876 5345064 5336047
60470 5336047 5223461 5017698 4737503 4407446 4053716 3699051 3359414 3044119 2757938
60461 2757938 2502492 2276646 2077556 1902581 1750079 1618288 1504171 1404054 1315230 1236485
60451 1236485 1167221 1106508 1053009 1005472 963043 925124 891091 860371 832826 808729 788011
60440 788011 769673 752389 735608 719670 704874 690974 677702 665251 654017 644298 636411 630607
60428 630607 626581 623502 620835 618737 617344 616175 614727 613203 612066 611226 610374 609888 610672 613021 616276
$$ packed form
60501A099893J0027J1572J4540J8519K3307K9256L6744M5511N4799O4336P4710
60490A483214Q6410R8752J10414J21041J31801J44269J59305J77294J98914K25036
60480B936450K55605K88439L18559L38516L40037L16625K65801J89844R5188r017
60470E336047j12586k05763k80195l30057l53730l54665l39637l15295k86181
60461B757938k55446k25846j99090j74975j52502j31791j14117j00117q8824p8745
60451A236485o9264o0713n3499m7537m2429l7919l4033l0720k7545k4097k0718
60440G88011j8338j7284j6781j5938j4796j3900j3272j2451j1234r719p887n804
60428F30607m026l079k667k098j393j169j448j524j137q40q52m86P84K349L255
$$ plain form
60413 616276 619659 622932 626087 628976 631557 634157 637104 640310 643428 646400 649637 653667 658686 664435
60399 664435 670467 676453 682166 687311 691705 695724 700211 705640 711613 717427 722831 727792 731814 734177
60385 734177 734899 734942 735258 735959 736526 736394 735171 732672 729120 725244 721942 719794 718875 718852 719268 719936 721122
60368 721122 723157 725862 728564 730737 732462 734232 736480 739341 742602 745814 748612 751057 753590 756672
60354 756672 760630 765746 772160 779649 787732 796070 804526 812928 821124 829354 838171 847834 858054 868387
60340 868387 878510 887962 896095 902597 907785 912087 915555 918166 920281 922378 924610 926992 929813 933419
60326 933419 937773 942682 948327 955048 962635 970261 977062 982315 985135 984721 981105 975118 967412 958054
60312 958054 947367 936534 926775 918261 910423 903077 896628 891297 886819 882951 879668 876725 873646 870486
$$ packed form
60413F16276L383L273L155K889K581K600K947L206L118K972L237M030N019N749
60399F64435O032N986N713N145M394M019M487N429N973N814N404M961M022K363
60385G34177P22M3L16P01N67j32j223k499l552l876l302k148r19k3M16O68J186
60368G21122K035K705K702K173J725J770K248K861L261L212K798K445K533L082
60354G56672L958N116O414P489Q083Q338Q456Q402Q196Q230Q817R663J0220J0333
60340H68387J0123R452Q133O502N188M302L468K611K115K097K232K382K821L606
60326I33419M354M909N645O721P587P626O801N253K820m14l616n987p706r358
60312I58054j0687j0833r759q514p838p346o449n331m478l868l283k943l079l160
$$ plain form
60298 870486 868118 867337 868042 869668 872077 875453 879529 883568 887154 890471 893673 896397 898081 898372 897118
60283 897118 894400 890892 887764 885791 884767 884098 883755 884217 885673 887807 890340 893329 896947 901390 907087
60268 907087 914539 923778 934358 946046 959139 973859 989899 1007013 1025794 1047317 1072085 1099757
60256 1099757 1129976 1163052 1199646 1240083 1284256 1332105 1384018 1440772 1503195 1571917 1647364
60245 1647364 1729933 1820053 1918001 2023612 2136195 2254679 2377818 2504196 2632038 2758974
60235 2758974 2882091 2998514 3106162 3203954 3291139 3366486 3428248 3474910 3505780 3520836 3520301
60224 3520301 3504709 3475432 3434923 3386301 3332715 3277136 3222464 3171444 3126197 3088004 3057745
60213 3057745 3036591 3026123 3027768 3042263 3069763 3110398 3164592 3232844 3315201 3410902 3518449
$$ packed form
60298H70486k368p81P05J626K409L376M076M039L586L317L202K724J684K91j254
60283H97118k718l508l128j973j024o69l43M62J456K134K533K989L618M443N697
60268I07087P452R239J0580J1688J3093J4720J6040J7114J8781K1523K4768K7672
60256A099757L0219L3076L6594M0437M4173M7849N1913N6754O2423O8722P5447
60245A647364Q2569R0120R7948J05611J12583J18484J23139J26378J27842J26936
60235B758974J23117J16423J07648R7792Q7185P5347O1762M6662L0870J5056n35
60224C520301j5592k9277m0509m8622n3586n5579n4672n1020m5247l8193l0259
60213C057745k1154j0468J645J4495K7500M0635N4194O8252Q2357R5701J07547
$$ plain form
60202 3518449 3635991 3761610 3893210 4028128 4162941 4293680 4416276 4526920 4622297 4699842
60192 4699842 4758034 4796395 4814940 4813355 4790788 4746768 4682525 4601270 4507044 4403425 4293487
60181 4293487 4180674 4069177 3963264 3866374 3780839 3708187 3649577 3606085 3578733 3568193 3574519
60170 3574519 3597330 3636179 3690518 3759198 3840156 3930504 4026665 4124497 4219732 4308581 4387826
60159 4387826 4454449 4505735 4540033 4557134 4557646 4542283 4512101 4469259 4417264 4360529 4303665 4250714
60147 4250714 4204693 4168091 4143916 4135667 4145813 4174781 4222111 4288260 4374579 4481969 4610689
60136 4610689 4761626 4936677 5137451 5364291 5617060 5896125 6201782 6532932 6886817
60127 6886817 7259838 7648141 8047437 8452452 8856385 9250837 9626826 9976420 10293382
$$ packed form
60202C518449J17542J25619J31600J34918J34813J30739J22596J10644R5377P7545
60192D699842N8192L8361J8545j585k2567m4020o4243q1255r4226j03619j09938
60181D293487j12813j11497j05913r6890q5535p2652n8610m3492k7352j0540O326
60170C574519K2811L8849N4339O8680Q0958R0348R6161R7832R5235Q8849P9245
60159D387826O6623N1286L4298J7101N12j5363l0182m2842n1995n6735n6864n2951
60147D250714m6021l6602k4175q249J0146K8968M7330O6149Q6319J07390J28720
60136D610689J50937J75051K00774K26840K52769K79065L05657L31150L53885
60127F886817L73021L88303L99296M05015M03933L94452L75989L49594L16962
$$ plain form
60118 10293382 10572236 10807397 10993845 11128272 11208875 11234188 11202834 11114498 10970622 10774200
60108 10774200 10529548 10242601 9921109 9574378 9212912 8847893 8489944 8147634 7827116
60099 7827116 7533148 7270016 7041282 6849103 6694278 6576874 6496575 6452650 6443946 6468929
60089 6468929 6525531 6610799 6720674 6849981 6992601 7141681 7289784 7428954 7551142 7649249
60079 7649249 7718169 7755063 7759084 7731265 7674388 7591980 7486866 7360880 7216010 7055233 6881854
60068 6881854 6698522 6507446 6311308 6113479 5917550 5727042 5545280 5374890 5217431
60059 5217431 5074061 4946498 4836794 4746204 4674920 4623116 4591638 4581332 4592135 4623284 4674176
60048 4674176 4744581 4834036 4941176 5063421 5197052 5337605 5480381 5620606 5753247 5873084
$$ packed form
60118A0293382K78854K35161J86448J34427Q0603K5313l1354q8336j43876j96422
60108A0774200k44652k86947l21492l46731l61466l65019l57949l42310l20518
60099G827116k93968k63132k28734j92179j54825j17404q0299m3925q704K4983
60089F468929N6602Q5268J09875J29307J42620J49080J48103J39170J22188R8107
60079G649249O8920L6894M021k7819n6877q2408j05114j25986j44870j60777j73379
60068F881854j83332j91076j96138j97829j95929j90508j81762j70390j57459
60059E217431j43370j27563j09704r0590p1284n1804l1478j0306J0803L1149N0892
60048D674176P0405Q9455J07140J22245J33631J40553J42776J40225J32641J19837
$$ plain form
60038 5873084 5975348 6056246 6112950 6143477 6146813 6122874 6072059 5995147 5893943 5771785 5632889
60027 5632889 5481377 5321379 5157814 4996159 4841022 4695311 4560983 4440075 4334558
60018 4334558 4245540 4173207 4117493 4078518 4056584 4052228 4066264 4099320 4151391 4222334 4312791
60007 4312791 4423927 4555920 4707235 4875788 5060070 5258015 5464715 5672152 5871703
59998 5871703 6056603 6222012 6363693 6477710 6561420 6613995 6635636 6626498 6586509 6516070 6416885
59987 6416885 6292452 6147960 5989484 5822911 5653395 5485603 5324135 5173375 5036874
59978 5036874 4916946 4814948 4731914 4668896 4626682 4605371 4604431 4623197 4661061 4717085 4789597
59967 4789597 4876333 4974855 5082671 5197174 5315737 5435707 5554037 5667068 5771182 5863841
$$ packed form
60038E873084J02264Q0898N6704L0527L336k3939n0815p6912j01204j22158j38896
60027E632889j51512j59998j63565j61655j55137j45711j34328j20908j05517
60018D334558q9018p2333n5714l8975k1934m356J4036L3056N2071P0943R0457
60007D312791J11136J31993J51315J68553J84282J97945K06700K07437J99551
59998E871703J84900J65409J41681J14017Q3710N2575K1641r138l9989p0439r9185
59987F416885j24433j44492j58476j66573j69516j67792j61468j50760j36501
59978E036874j19928j01998q3034o3018m2214k1311r40J8766L7864N6024P2512
59967D789597Q6736R8522J07816J14503J18563J19970J18330J13031J04114R2659
$$ plain form
59957 5863841 5943824 6010527 6063408 6102173 6127043 6138731 6138613 6129293 6114673 6098981 6085811 6078443
59945 6078443 6080913 6098211 6135206 6195664 6282507 6398706 6547525 6731884 6953821 7214681
59935 7214681 7515504 7856779 8237739 8655935 9107124 9584641 10078219 10573533 11053177
59926 11053177 11498117 11888554 12204907 12430048 12552006 12565226 12470309 12273743 11987875 11629622
59916 11629622 11217761 10770725 10306014 9839710 9385053 8951536 8545933 8173783 7839228
59907 7839228 7544058 7288233 7071660 6894848 6757845 6659488 6598140 6572649 6582224 6625823
59897 6625823 6702058 6809465 6946410 7110637 7298775 7505876 7725083 7947655 8163254 8360261
59887 8360261 8526414 8650097 8721765 8734638 8684944 8572501 8401257 8178642 7913852 7616672
$$ packed form
59957E863841P9983O6703N2881L8765K4870J1688j18r320j4620j5692j3170p368
59945F078443K470J7298L6995O0458Q6843J16199J48819J84359K21937K60860
59935G214681L00823L41275L80960M18196M51189M77517M93578M95314M79644
59926A1053177M44940L90437L16353K25141J21958J3220r4917j96566k85868l58253
59916A1629622m11861m47036m64711m66304m54657m33517m05603l72150l34555
59907G839228k95170k55825k16573j76812j37003r8357o1348k5491R575M3599
59897F625823P6235J07407J36945J64227J88138K07101K19207K22572K15599J97007
59887H360261J66153J23683P1668J2873m9694j12443j71244k22615k64790k97180
$$ plain form
59877 7616672 7297349 6966300 6632974 6304926 5988156 5687860 5408408 5152678 4921772
59868 4921772 4715452 4532867 4373114 4235275 4117804 4017934 3932064 3856814 3789437 3727253
59858 3727253 3667405 3607626 3546922 3485221 3422858 3360904 3301636 3247979 3202395 3166412 3140702
59847 3140702 3124957 3117771 3117130 3120931 3126575 3130412 3128486 3118058 3097979 3067717 3026984 2976765 2920042
59834 2920042 2860732 2801982 2745698 2693210 2645690 2603974 2568551 2539902 2518493 2504381 2497236
59823 2497236 2497024 2504419 2520195 2544332 2576161 2615537 2663446 2720910 2787166 2859202 2933294 3006920
59811 3006920 3079183 3149755 3217840 3282080 3340974 3393003 3436418 3469150 3489279 3495976 3490361 3475457
59799 3475457 3455138 3432995 3412109 3395502 3386219 3386787 3398845 3423502 3461828 3514897 3583731 3669580
$$ packed form
59877G616672l19323l31049l33326l28048l16770l00296k79452k55730k30906
59868D921772k06320j82585j59753j37839j17471r9870q5870p5250o7377o2184
59858C727253n9848n9779o0704o1701o2363o1954n9268n3657m5584l5983k5710
59847C140702j5745p186o41L801N644L837j926j0428k0079l0262m0733n0219n6723
59834B920042n9310n8750n6284n2488m7520m1716l5423k8649k1409j4112p145
59823B497236k12P395J5776K4137L1829L9376M7909N7464O6256P2036P4092P3626
59811C006920P2263P0572O8085O4240N8894N2029M3415L2732K0129O697n615j4904
59799C475457k0319k2143k0886j6607r283N68J2058K4657L8326N3069O8834Q5849
$$ plain form
59787 3669580 3774178 3899467 4047276 4219808 4420520 4654068 4924957 5236281 5589564
59778 5589564 5984622 6417668 6877668 7343305 7783017 8159066 8434976 8584234 8596968 8481420
59768 8481420 8259789 7961341 7616312 7251958 6890273 6546983 6231918 5950265 5703725
59759 5703725 5491490 5311522 5161802 5040548 4945509 4873767 4822577 4790183 4775697 4778580 4798495
59748 4798495 4835232 4888442 4957685 5042991 5145060 5264641 5402145 5558275 5734526 5932370
59738 5932370 6152230 6394107 6659303 6950865 7272197 7625809 8013583 8437627 8900377
59729 8900377 9403995 9949647 10536763 11162478 11821657 12507116 13209072 13914222 14606426
59720 14606426 15269695 15891495 16464216 16985270 17457413 17889135 18293803 18687511 19087010
$$ packed form
59787C669580J04598J25289J47809J72532K00712K33548K70889L11324L53283
59778E589564L95058M33046M60000M65637M39712L76049K75910J49258J2734j15548
59768H481420k21631k98448l45029l64354l61685l43290l15065k81653k46540
59759E703725k12235j79968j49720j21254r5039p1742n1190l2394j4486K883J9915
59748D798495L6737N3210O9243Q5306J02069J19581J37504J56130J76251J97844
59738E932370K19860K41877K65196K91562L21332L53612L87774M24044M62750
59729H900377N03618N45652N87116O25715O59179O85459P01956P05150O92204
59720A4606426O63269O21800N72721N21054M72143M31722M04668L93708L99499
$$ plain form
59711 19087010 19508308 19965236 20467788 21021094 21625285 22275392 22960809 23665170 24367338
59702 24367338 25043014 25666270 26211451 26655975 26983240 27184371 27258668 27213565 27064089 26831071
59692 26831071 26538317 26210367 25871614 25545653 25253647 25012625 24835526 24732805 24713620
59683 24713620 24785704 24955069 25226666 25605286 26095529 26701019 27423559 28262141 29211381
59674 29211381 30259718 31387808 32566781 33756299 34904044 35948409 36824017 37468385
59666 37468385 37829083 37871483 37585151 36985582 36110359 35012527 33753997 32399228 31009001
59657 31009001 29635776 28321826 27098692 25985847 24988973 24099679 23296733 22547893 21813380
59648 21813380 21053163 20236969 19351915 18403606 17411351 16401145 15399281 14427877 13502979
$$ packed form
59711A9087010M21298M56928N02552N53306O04191O50107O85417P04361P02168
59702B4367338O75676O23256N45181M44524L27265K01131P4297m5103j49476k33018
59692B6831071k92754l27950l38753l25961k92006k41022j77099j02721j9185
59683B4713620P2084J69365K71597L78620M90243O05490P22540Q38582R49240
59674B9211381J048337J128090J178973J189518J147745J044365Q75608O44368
59666C7468385L60698M2400k86332n99569q75223j097832j258530j354769j390227
59657C1009001j373225j313950j223134j112845r96874q89294q02946p48840p34513
59648B1813380p60217q16194q85054r48309r92255j010206j001864r71404r24898
$$ plain form
59639 13502979 12635030 11830214 11091196 10417383 9805644 9251584 8750540 8297957 7889520
59630 7889520 7521236 7189383 6890460 6621410 6379897 6164137 5972380 5802580 5652599
59621 5652599 5520584 5405135 5305078 5219006 5144999 5080851 5024517 4974087 4927160 4880524 4830765
59610 4830765 4775188 4712067 4640365 4559742 4470822 4374949 4273542 4167991 4060342 3953521
59600 3953521 3850393 3752663 3660910 3575610 3497743 3428379 3367885 3315688 3270783 3232556 3201214
59589 3201214 3177514 3162035 3154683 3154791 3161456 3173684 3190408 3210667 3233754 3259024 3285566 3312212
59577 3312212 3337939 3362234 3385164 3407330 3429792 3453904 3481050 3512487 3549312 3592407 3642335
59566 3642335 3699425 3764164 3837523 3920812 4015115 4120933 4238529 4368701 4513055 4673342
$$ packed form
59639A3502979q67949q04816p39018o73813o11739n54060n01044m52583m08437
59630G889520l68284l31853k98923k69050k41513k15760j91757j69800j49981
59621E652599j32015j15449j00057q6072p4007o4148n6334n0430m6927m6636m9759
59610D830765n5577o3121p1702q0623q8920r5873j01407j05551j07649j06821
59600C953521j03128r7730r1753q5300p7867o9364o0494n2197m4905l8227l1342
59589C201214k3700j5479p352J08O665J2228J6724K0259K3087K5270K6542K6646
59577C312212K5727K4295K2930K2166K2462K4112K7146L1437L6825M3095M9928
59566C642335N7090O4739P3359Q3289R4303J05818J17596J30172J44354J60287
$$ plain form
59556 4673342 4850631 5045363 5258138 5489932 5741347 6011871 6300096 6604236 6922015
59547 6922015 7250223 7584822 7921513 8255914 8583380 8899246 9199538 9481421 9743337
59538 9743337 9985275 10208729 10415336 10604816 10774520 10921572 11045629 11149904 11240387 11324605
59528 11324605 11410359 11504192 11610187 11729841 11862434 12004582 12149225 12285579 12400674 12481338
59518 12481338 12515536 12493181 12406852 12252322 12028788 11738992 11389141 10988261 10547168 10077713
59508 10077713 9592272 9102788 8619366 8149609 7699224 7272886 6874237 6505443 6167326
59499 6167326 5859934 5582722 5334393 5113205 4917699 4746821 4599168 4472540 4364666
59490 4364666 4274257 4200928 4144168 4102977 4076689 4065721 4070928 4092383 4129346 4181509 4249710
$$ packed form
59556D673342J77289J94732K12775K31794K51415K70524K88225L04140L17779
59547F922015L28208L34599L36691L34401L27466L15866L00292K81883K61916
59538I743337K41938K23454K06607J89480J69704J47052J24057J04275R0483Q4218
59528A1324605Q5754R3833J05995J19654J32593J42148J44643J36354J15095Q0664
59518A2481338L4198k2355q6329j54530k23534k89796l49851m00880m41093m69455
59508A0077713m85441m89484m83422m69757m50385m26338l98649l68794l38117
59499F167326l07392k77212k48329k21188j95506j70878j47653j26628j07874
59490D364666r0409p3329n6760m1191k6288j0968N207K1455L6963N2163O8201
$$ plain form
59479 4249710 4335110 4438163 4558899 4697902 4856271 5034593 5232593 5450001 5687069 5943571
59469 5943571 6217370 6504214 6798536 7093769 7381760 7652390 7894295 8096298 8248731
59460 8248731 8344242 8378102 8348230 8255305 8103114 7898610 7650975 7370099 7065575 6746669
59450 6746669 6422330 6100432 5786752 5484858 5197065 4925442 4671950 4437870 4223331
59441 4223331 4027465 3849016 3686871 3540195 3408208 3289986 3184465 3090589 3007439 2934296
59431 2934296 2870625 2816010 2770073 2732523 2703148 2681562 2666810 2657424 2652173 2650776 2653671 2661033
59419 2661033 2672231 2686404 2703338 2723446 2747024 2774051 2805051 2841677 2885475 2935446 2987077
59408 2987077 3034534 3074478 3108144 3140165 3175756 3218861 3272091 3337656 3418143 3516449 3634459
$$ packed form
59479D249710Q5400J03053J20736J39003J58369J78322J98000K17408K37068K56502
59469E943571K73799K86844K94322K95233K87991K70630K41905K02003J52433
59460H248731R5511L3860k9872r2925j52191k04504k47635k80876l04524l18906
59450F746669l24339l21898l13680l01894k87793k71623k53492k34080k14539
59441D223331j95866j78449j62145j46676j31987j18222j05521r3876q3150p3143
59431B934296o3671n4615m5937l7550k9375k1586j4752r386n251j397K895P362
59419B661033J1198J4173J6934K0108K3578K7027L1000L6626M3798M9971N1631
59408B987077M7457L9944L3666L2021L5591M3105N3230O5565Q0487R8306J18010
$$ plain form
59397 3634459 3771180 3922306 4082638 4249860 4426367 4617819 4830457 5069731 5340359
59388 5340359 5646497 5991632 6378747 6810567 7289049 7814193 8383091 8989686 9624803
59379 9624803 10276293 10929739 11569799 12181651 12752246 13271634 13734141 14138578 14487178
59370 14487178 14784039 15033975 15241763 15411402 15545394 15644322 15706805 15729644 15708038 15636080
59360 15636080 15507905 15319636 15071363 14767855 14417784 14032716 13626703 13215319 12812899
59351 12812899 12429269 12068640 11730975 11413396 11110302 10813706 10515165 10208053 9888305
59342 9888305 9553905 9204600 8842111 8470054 8093534 7718832 7352779 7001399 6668752
59333 6668752 6357102 6067977 5802576 5561405 5344152 5150117 4978412 4827736 4696462
$$ packed form
59397C634459J36721J51126J60332J67222J76507J91452K12638K39274K70628
59388E340359L06138L45135L87115M31820M78482N25144N68898O06595O35117
59379I624803O51490O53446O40060O11852N70595N19388M62507M04437L48600
59370A4487178K96861K49936K07788J69639J33992R8928O2483K2839k1606p1958
59360A5636080j28175j88269k48273l03508l50071l85068m06013m11384m02420
59351A2812899l83630l60629l37665l17579l03094k96596k98541l07112l19748
59342I888305l34400l49305l62489l72057l76520l74702l66053l51380l32647
59333F668752l11650k89125k65401k41171k17253j94035j71705j50676j31274
$$ plain form
59324 4696462 4583169 4486937 4407066 4342766 4293116 4257135 4233942 4223078 4224552 4238297 4263781
59313 4263781 4300533 4348817 4409022 4480257 4560085 4645834 4735650 4828053 4920962 5011566 5096839
59302 5096839 5173869 5239989 5293016 5331414 5354277 5361572 5354589 5335728 5307526 5272213 5232436 5191829
59290 5191829 5154098 5121756 5096369 5080038 5075928 5087129 5115365 5160985 5223759 5303384 5399550
59279 5399550 5511939 5640056 5782723 5937600 6101189 6269099 6436103 6596220 6743369
59270 6743369 6872363 6979371 7061696 7117820 7148128 7155232 7142591 7112321 7064601 6999598 6919887
59259 6919887 6830824 6738744 6649032 6565446 6490301 6424610 6368066 6319240 6276038 6236194 6197625
59248 6197625 6158568 6117632 6074021 6027955 5980821 5934747 5892138 5855773 5829073 5815733 5819008
$$ packed form
59324D696462j13293r6232p9871o4300m9650l5981k3193j0864J474J3745K5484
59313D263781L6752M8284O0205P1235P9828Q5749Q9816R2403R2909R0604Q5273
59302E096839P7030O6120N3027L8398K2863P295o983j8861k8202l5313l9777m0607
59290E191829l7731l2342k5387j6331m110J1201K8236M5620O2774P9625R6166
59279E399550J12389J28117J42667J54877J63589J67910J67004J60117J47149
59270F743369J28994J07008Q2325N6124L0308P104j2641l0270m7720o5003p9711
59259F919887q9063r2080q9712q3586p5145o5691n6544m8826m3202l9844l8569
59248F197625l9057m0936m3611m6066m7134m6074m2609l6365k6700j3340L275
$$ plain form
59237 5819008 5841690 5886907 5958558 6060709 6196732 6369112 6579720 6829898 7120294 7450623
59227 7450623 7818945 8220313 8645556 9081330 9511396 9918065 10283142 10588708 10818312
59218 10818312 10958501 11000067 10938589 10774511 10513276 10165454 9746147 9273285 8765541 8240911
59208 8240911 7715844 7204142 6715760 6256610 5829792 5437046 5079117 4755369 4463799
59199 4463799 4201779 3966773 3756467 3568582 3400795 3250855 3116761 2996858 2889804
59190 2889804 2794431 2709584 2634110 2566931 2507103 2453768 2406122 2363561 2325930 2293514 2266569
59179 2266569 2244814 2227601 2214622 2206162 2202499 2203336 2208121 2216745 2229555 2246796 2268428 2294411
59167 2294411 2324773 2359356 2397919 2440641 2488164 2540972 2599004 2662052 2730285 2804139 2883881
$$ packed form
59237E819008K2682M5217P1651J02151J36023J72380K10608K50178K90396L30329
59227G450623L68322M01368M25243M35774M30066M06669L65077L05566K29604
59218A0818312J40189M1566o1478j64078k61235l47822m19307m72862n07744n24630
59208H240911n25067n11702m88382m59150m26818l92746l57929l23748k91570
59199D463799k62020k35006k10306j87885j67787j49940j34094j19903j07054
59190B889804r5373q4847p5474o7179n9828n3335m7646m2561l7631l2416k6945
59179B266569k1755j7213j2979q460l663Q37M785Q624J2810J7241K1632K5983
59167B294411L0362L4583L8563M2722M7523N2808N8032O3048O8233P3854P9742
$$ plain form
59156 2883881 2969498 3060863 3157744 3259652 3365797 3475175 3586567 3698402 3808603 3914611
59146 3914611 4013713 4103450 4181655 4246082 4294444 4325289 4338760 4336195 4319064 4288738 4247198
59135 4247198 4197422 4142810 4086445 4030935 3978550 3931308 3891125 3859984 3839776 3831989 3837795 3858294
59123 3858294 3894289 3945948 4013323 4097328 4199588 4321080 4461348 4619304 4794387 4986694
59113 4986694 5196429 5423563 5667632 5927444 6200892 6484757 6773925 7060461 7333954
59104 7333954 7583239 7797757 7967879 8085532 8145897 8148586 8096984 7996902 7855904 7682627
59094 7682627 7485136 7269529 7040249 6801107 6555339 6305153 6052226 5798639 5546639
59085 5546639 5297646 5052338 4811791 4577926 4352761 4137693 3933444 3740095 3557181
$$ packed form
59156B883881Q5617R1365R6881J01908J06145J09378J11392J11835J10201J06008
59146C914611R9102Q9737P8205O4427M8362L0845J3471k565j7131l0326m1540
59135D247198m9776n4612n6365n5510n2385m7242m0183l1141k0208p787N806K0499
59123C858294L5995N1659O7375Q4005J02260J21492J40268J57956J75083J92307
59113D986694K09735K27134K44069K59812K73448K83865K89168K86536K73493
59104G333954K49285K14518J70122J17653O0365K689n1602j00082j40998j73277
59094G682627j97491k15607k29280k39142k45768k50186k52927k53587k52000
59085E546639k48993k45308k40547k33865k25165k15068k04249j93349j82914
$$ plain form
59076 3557181 3384299 3221693 3069745 2927993 2795343 2671233 2555880 2449245 2350528 2258976
59066 2258976 2174520 2097181 2026339 1961188 1901536 1847601 1799072 1754846 1713786 1675519 1640386
59055 1640386 1608692 1580104 1553776 1528931 1505061 1481527 1457354 1431822 1405098 1378001 1351321
59044 1351321 1325729 1302105 1281275 1263258 1247242 1232540 1219273 1207924 1198530 1190598 1183716 1178065
59032 1178065 1174396 1173553 1175913 1181128 1188333 1196617 1205380 1214463 1223926 1233517 1242296 1249056 1253241 1255213
59018 1255213 1255557 1254540 1252474 1250144 1248456 1247860 1248431 1250207 1253111 1256878 1261505 1267473 1275078 1283842 1293032
59003 1293032 1302388 1311812 1320690 1328240 1334357 1339528 1344092 1348258 1352605 1357821 1363978 1370725 1378096 1386419
58989 1386419 1395579 1405151 1415185 1426049 1437518 1448949 1460436 1472829 1486407 1500475 1514559 1529056
$$ packed form
59076C557181j72882j62606j51948j41752j32650j24110j15353j06635r8717r1552
59066B258976q4456p7339p0842o5151n9652n3935m8529m4226m1060l8267l5133
59055A640386l1694k8588k6328k4845k3870k3534k4173k5532k6724k7097k6680
59044A351321k5592k3624k0830j8017j6016j4702j3267j1349r394p932o882n651
59032A178065l669q43K360N215P205Q284Q763R083R463R591Q779O760M185J972
59018A255213L44j017k066k330j688n96N71J776K904L767M627N968P605Q764R190
59003A293032R356R424Q878P550O117N171M564M166M347N216O157O747P371Q323
58989A386419R160R572J0034J0864J1469J1431J1487J2393J3578J4068J4084J4497
$$ plain form
58977 1529056 1544292 1559844 1575476 1592017 1610588 1631448 1654230 1678918 1705991 1735857 1768739
58966 1768739 1804843 1844149 1886111 1929894 1974807 2020335 2065908 2110821 2154249 2195491 2234662
58955 2234662 2273208 2313164 2355672 2400642 2447938 2498241 2552559 2611599 2676034 2746791 2824571
58944 2824571 2909559 3002009 3102706 3212434 3331469 3460024 3598745 3748372 3909465 4083069
58934 4083069 4271214 4476109 4699084 4940909 5202938 5487417 5796929 6134067 6501462
58925 6501462 6901572 7336527 7808649 8320933 8876460 9477289 10124259 10817552 11556635
58916 11556635 12339100 13159411 14008369 14872992 15736256 16576760 17368806 18083592 18691743
58907 18691743 19166483 19486319 19636825 19611921 19414618 19056693 18557281 17940925 17235067
$$ packed form
58977A529056J5236J5552J5632J6541J8571K0860K2782K4688K7073K9866L2882
58966A768739L6104L9306M1962M3783M4913M5528M5573M4913M3428M1242L9171
58955B234662L8546L9956M2508M4970M7296N0303N4318N9040O4435P0757P7780
58944B824571Q4988R2450J00697J09728J19035J28555J38721J49627J61093J73604
58934D083069J88145K04895K22975K41825K62029K84479L09512L37138L67395
58925F501462M00110M34955M72122N12284N55527O00829O46970O93293P39083
58916A1556635P82465Q20311Q48958Q64623Q63264Q40504P92046P14786O08151
58907A8691743M74740L19836J50506k4904j97303l57925m99412o16356p05858
$$ plain form
58898 17235067 16466912 15660867 14837970 14016522 13211821 12435047 11693538 10992636 10336588
58889 10336588 9727530 9164926 8646932 8171727 7737044 7339532 6975650 6642644 6337764
58880 6337764 6057259 5797251 5555250 5329909 5119779 4923333 4739798 4568876 4409832
58871 4409832 4261874 4125131 4000089 3886049 3781257 3684571 3596027 3515665 3442884 3377130
58861 3377130 3318227 3265694 3218680 3176989 3141316 3112070 3088723 3070881 3059274 3054960 3057908 3066983
58849 3066983 3081156 3100361 3125331 3156939 3195648 3241366 3293822 3353022 3419213 3492598 3573419
58838 3573419 3662216 3759650 3866214 3982579 4110085 4250310 4404109 4571641 4753419 4950840
58828 4950840 5165618 5399258 5653311 5929760 6231006 6559807 6919216 7312092 7740600
$$ packed form
58898A7235067p68155q06045q22897q21448q04701p76774p41509p00902o56048
58889A0336588o09058n62604n17994m75205m34683l97512l63882l33006l04880
58880F337764k80505k60008k42001k25341k10130j96446j83535j70922j59044
58871D409832j47958j36743j25042j14040j04792r6686q8544q0362p2781o5754
58861C377130n8903n2533m7014m1691l5673k9246k3347j7842j1607m314K948R075
58849C066983J4173J9205K4970L1608L8709M5718N2456N9200O6191P3385Q0821
58838C573419Q8797R7434J06564J16365J27506J40225J53799J67532J81778J97421
58828D950840K14778K33640K54053K76449L01246L28801L59409L92876M28508
$$ plain form
58819 7740600 8206705 8713178 9263415 9859918 10503236 11192322 11924990 12697174 13501608
58810 13501608 14326992 15157590 15972983 16748432 17456268 18067844 18555640 18895708 19070455
58801 19070455 19070882 18897641 18560915 18079098 17476191 16778705 16013329 15205573 14378498 13551367
58791 13551367 12739145 11953062 11201314 10489282 9819868 9194261 8612553 8073877 7576501
58782 7576501 7118104 6696024 6307559 5950533 5623484 5324768 5051531 4800103 4567418
58773 4567418 4351529 4150822 3963523 3788103 3623448 3468339 3321560 3182780 3052587
58764 3052587 2931212 2817912 2712108 2614360 2525483 2445230 2372577 2306924 2248255 2196345 2150512
58753 2150512 2110034 2074231 2042247 2013313 1987096 1963356 1941451 1920775 1901500 1884166 1868482
$$ packed form
58819G740600M66105N06473N50237N96503O43318O89086P32668P72184Q04434
58810A3501608Q25384Q30598Q15393P75449P07836O11576M87796L40068J74747
58801A9070455M27j73241l36726m81817o02907o97486p65376q07756q27075q27131
58791A3551367q12222p86083p51748p12032o69414o25607n81708n38676m97376
58782G576501m58397m22080l88465l57026l27049k98716k73237k51428k32685
58773D567418k15889k00707j87299j75420j64655j55109j46779j38780j30193
58764C052587j21375j13300j05804r7748q8877q0253p2653o5653n8669n1910m5833
58753B150512m0478l5803l1984k8934k6217k3740k1905k0676j9275j7334j5684
$$ plain form
58742 1868482 1853201 1837375 1821121 1804861 1788271 1770454 1751001 1730367 1709189 1687500 1664862
58731 1664862 1641148 1616906 1592771 1568748 1544349 1519278 1493549 1466964 1439116 1410136 1380884
58720 1380884 1351928 1322842 1293128 1263601 1236007 1211282 1188789 1167497 1147248 1128470 1111103
58709 1111103 1094476 1078154 1062452 1047910 1034557 1021900 1009558 997718 987012 977943 970429 963762
58697 963762 957087 950047 942951 936156 929406 922090 914140 906207 898703 891101 882581 873005 862701 851593
58683 851593 839370 826565 814734 805147 797797 791934 787097 783264 780510 779065 779451 781904 785637 789106
58669 789106 791166 791821 791916 792380 793820 796551 800737 806321 812807 819231 824652 828777 831969 834590 836577
58654 836577 837842 838902 840810 844489 850242 857827 866774 876650 887303 899068 912698 928886 947724
$$ packed form
58742A868482j5281j5826j6254j6260j6590j7817j9453k0634k1178k1689k2638
58731A664862k3714k4242k4135k4023k4399k5071k5729k6585k7848k8980k9252
58720A380884k8956k9086k9714k9527k7594k4725k2493k1292k0249j8778j7367
58709A111103j6627j6322j5702j4542j3353j2657j2342j1840j0706r069p514o667
58697I63762o675p040p096o795o750p316p950p933p504p602q520r576j0304j1108
58683H51593j2223j2805j1831r587p350n863m837l833k754j445L86K453L733L469
58669G89106K060O55R5M64J440K731M186N584O486O424N421M125L192K621J987
58654H36577J265J060J908L679N753P585Q947R876J0653J1765J3630J6188J8838
$$ plain form
58641 947724 968664 991145 1015236 1041543 1070532 1102202 1136567 1174179 1215979 1262758 1314982
58630 1314982 1372892 1436503 1505736 1580973 1663513 1755184 1857594 1971991 2099670 2242041
58620 2242041 2400393 2575976 2770172 2983969 3217025 3467419 3731993 4006003 4282029
58611 4282029 4549667 4796697 5010521 5178961 5291277 5340238 5324123 5246910 5116661 4943593
58601 4943593 4738869 4513881 4279422 4044603 3815917 3597075 3389777 3194826 3012721
58592 3012721 2843629 2687302 2543255 2411041 2290397 2181159 2082927 1994813 1915839 1845729
58582 1845729 1784896 1733278 1689534 1651765 1618667 1589468 1563073 1537994 1513004 1487286 1460234
58571 1460234 1431822 1402955 1374649 1347008 1319858 1294162 1271567 1252364 1235031 1218117 1201471
$$ packed form
58641I47724K0940K2481K4091K6307K8989L1670L4365L7612M1800M6779N2224
58630A314982N7910O3611O9233P5237Q2540R1671J02410J14397J27679J42371
58620B242041J58352J75583J94196K13797K33056K50394K64574K74010K76026
58611D282029K67638K47030K13824J68440J12316M8961j6115p7213j30249j73068
58601D943593k04724k24988k34459k34819k28686k18842k07298j94951j82105
58592C012721j69092j56327j44047j32214j20644j09238r8232q8114p8974p0110
58582A845729o0833n1618m3744l7769l3098k9199k6395k5079k4990k5718k7052
58571A460234k8412k8867k8306k7641k7150k5696k2595j9203j7333j6914j6646
$$ plain form
58560 1201471 1185192 1168570 1150925 1132602 1114319 1096309 1078938 1063414 1050772 1040612 1031847
58549 1031847 1024388 1019092 1016182 1014741 1013791 1012973 1011987 1010174 1006978 1002290 996024 987793 977327 964984
58535 964984 951587 937823 923933 909902 895822 882014 868767 856048 843652 831562 819914
58524 819914 808624 797382 786099 775001 764226 753716 743644 734477 726378 718911 711648 704765
58512 704765 698814 694173 690847 688489 686458 684298 682366 681555 682175 683524 684786 685865 687094 688676 690819
58497 690819 693865 697787 701953 705934 710199 715511 721840 728321 734086 738813 742720 746449 750793 756147
58483 756147 762327 769063 776438 784629 793459 802396 810727 817614 822329 824593 824432 821755 816510 809161
58469 809161 800280 789707 776972 762721 748721 736052 724218 712531 701399 691606 683155 675594
$$ packed form
58560A201471j6279j6622j7645j8323j8283j8010j7371j5524j2642j0160q765
58549A031847p459n296k910j441r50q18r86j813l196m688o266q231j0466j2343
58535I64984j3397j3764j3890j4031j4080j3808j3247j2719j2396j2090j1648
58524H19914j1290j1242j1283j1098j0775j0510j0072r167q099p467p263o883
58512G04765n951m641l326k358k031k160j932q11O20J349J262J079J229J582K143
58497F90819L046L922M166L981M265N312O329O481N765M727L907L729M344N354
58483G56147O180O736P375Q191Q830Q937Q331O887M715K264j61k677n245p349
58469H09161q881j0573j2735j4251j4000j2669j1834j1687j1132r793q451p561
$$ plain form
58457 675594 668738 662378 656071 649994 645161 641871 638676 634027 628367 623543 620592 619128 618479 618251 618066
58442 618066 617846 618270 620046 622901 626141 629841 634484 639681 644403 648435 652498 656901 661077 664629 667955
58427 667955 671691 676268 682095 689463 698129 707537 717455 727812 738075 747430 755491 762216 767345 770676
58413 770676 772618 773648 773364 771010 766869 762306 758407 755397 753280 752089 751392 750479 749263 748309 747882
58398 747882 747663 747503 747692 748265 748705 748495 747546 746072 744577 743886 744606 746584 749332 752692 756460 759781
58382 759781 761889 763345 765532 768908 772566 775590 778026 780482 783559 787796 793467 800254 807599 815308
58368 815308 823306 831155 838514 845798 853499 861124 867680 872977 877581 881783 885661 889811 894796 899980
58354 899980 904202 907530 911093 915167 918873 921945 925385 929909 934956 939769 944359 948917 953223 957193
$$ packed form
58457F75594o856o360o307o077m833l290l195m649n660m824k951j464o49k28j85
58442F18066k20M24J776K855L240L700M643N197M722M032M063M403M176L552L326
58427F67955L736M577N827P368Q666R408R918J0357J0263R355Q061O725N129L331
58413G70676J942J030k84k354m141m563l899l010k117j191o97r13j216r54m27
58398G47882k19j60J89N73M40k10r49j474j495o91P20J978K748L360L768L321
58382G59781K108J456K187L376L658L024K436K456L077M237N671O787P345P709
58368H15308P998P849P359P284P701P625O556N297M604M202L878M150M985N184
58354H99980M222L328L563M074L706L072L440M524N047M813M590M558M306L970
$$ plain form
58340 957193 961260 965813 970957 977067 984768 994118 1004544 1015699 1027553 1039659 1051272 1062422 1073916
58327 1073916 1086123 1098649 1111193 1123703 1135680 1146525 1156699 1167351 1178560 1189167 1198652
58316 1198652 1208022 1218496 1230412 1243708 1258295 1273560 1288557 1303061 1317499 1331792 1345445
58305 1345445 1358846 1373032 1387973 1402569 1416779 1432101 1449362 1467498 1485301 1503083 1521792
58294 1521792 1541698 1562773 1585250 1609022 1633390 1657973 1682989 1708319 1733415 1758437 1784162
58283 1784162 1810461 1836348 1862008 1889162 1918813 1950205 1982748 2017303 2054668 2094287 2135446
58272 2135446 2178317 2222792 2267659 2311957 2355923 2399803 2443164 2486313 2530870 2577857 2626657
58261 2626657 2676842 2729551 2785869 2845339 2907293 2972260 3040780 3112197 3185921 3262629 3343040
$$ packed form
58340I57193M067M553N144O110P701R350J0426J1155J1854J2106J1613J1150J1494
58327A073916J2207J2526J2544J2510J1977J0845J0174J0652J1209J0607R485
58316A198652R370J0474J1916J3296J4587J5265J4997J4504J4438J4293J3653
58305A345445J3401J4186J4941J4596J4210J5322J7261J8136J7803J7782J8709
58294A521792J9906K1075K2477K3772K4368K4583K5016K5330K5096K5022K5725
58283A784162K6299K5887K5660K7154K9651L1392L2543L4555L7365L9619M1159
58272B135446M2871M4475M4867M4298M3966M3880M3361M3149M4557M6987M8800
58261B626657N0185N2709N6318N9470O1954O4967O8520P1417P3724P6708Q0411
$$ plain form
58250 3343040 3426836 3513967 3605648 3702816 3804860 3910985 4021451 4136498 4255645 4379219
58240 4379219 4508907 4645638 4788691 4938042 5095633 5263016 5439823 5626066 5823693
58231 5823693 6034196 6256939 6491800 6741206 7007666 7291771 7594767 7920429 8271874
58222 8271874 8649276 9053606 9489874 9963537 10476651 11031360 11634334 12293558 13013645
58213 13013645 13799554 14662946 15619908 16684825 17872552 19205208 20711184 22420118
58205 22420118 24367124 26601834 29185782 32180616 35645582 39645441 44253868 49556025
58197 49556025 55667753 62759607 71054959 80816773 92375787 106194743 122896585 143257924
58189 143257924 168268148 199182362 237130109 281900164 330372095 375992660 410435267
$$ packed form
58250C343040Q3796Q7131R1681R7168J02044J06125J10466J15047J19147J23574
58240D379219J29688J36731J43053J49351J57591J67383J76807J86243J97627
58231E823693K10503K22743K34861K49406K66460K84105L02996L25662L51445
58222H271874L77402M04330M36268M73663N13114N54709O02974O59224P20087
58213A3013645P85909Q63392R56962J064917J187727J332656J505976J708934
58205B2420118J947006K234710K583948K994834L464966L999859M608427N302157
58197D9556025O111728P091854Q295352R761814J1559014J3818956J6701842K0361339
58189A43257924K5010224L0914214L7947747M4770055M8471931M5620565L4442607
$$ plain form
58182 410435267 426923854 423122248 401666282 368269412 329045040 288748262 250391041
58175 250391041 215613798 185126315 159013544 136981147 118561687 103235922 90483163
58168 90483163 79819775 70839445 63227293 56744167 51206747 46475541 42443025 39020983
58160 39020983 36135634 33730505 31767692 30223657 29084651 28348013 28029078 28165622
58152 28165622 28816448 30069458 32065927 34983528 38885414 43461153 47888461 51055380
58144 51055380 52080161 50744819 47508909 43155586 38405829 33746540 29450085 25644063
58136 25644063 22361139 19576946 17241582 15294830 13671076 12307854 11154548 10171804
58128 10171804 9327271 8596561 7964133 7417285 6940578 6518804 6141830 5802512 5492410
$$ packed form
58182D10435267J6488587l801606k1455966l3396870l9224372m0296778l8357221
58175B50391041l4777243l0487483k6112771k2032397j8419460j5325765j2752759
58168I0483163j0663388q980330p612152o483126n537420m731206m032516l422042
58160C9020983k885349k405129j962813j544035j139006p36638l18935J36544
58152B8165622O50826J253010J996469K917601L901886M575739M427308L166919
58144E1055380J024781j335342l235910m353323m749757m659289m296455l806022
58136B5644063l282924k784193k335364j946752j623754j363222j153306r82744
58128A0171804q44533p30710o32428n46848m76707m21774l76974l39318l10102
$$ plain form
58119 5492410 5203195 4930209 4671618 4426096 4193936 3978063 3780901 3601583 3438201
58110 3438201 3290786 3160051 3045073 2943998 2854781 2773231 2692706 2608351 2520363 2431501
58100 2431501 2343355 2256825 2173999 2096911 2025588 1959109 1897239 1839494 1784291 1730832 1680379
58089 1680379 1634045 1590845 1549491 1510403 1474193 1439839 1406263 1374150 1344152 1314762 1284209
58078 1284209 1253387 1224721 1198909 1174772 1151609 1129726 1109164 1089687 1071720 1055735 1040956
58067 1040956 1025991 1010499 995264 981122 968709 958552 950368 942922 935449 928413 922026 915059
58055 915059 906213 895678 884178 871562 857692 843799 831432 820725 810972 802167 794609 787733
58043 787733 780848 774490 769632 765988 762538 759357 757527 757387 758174 759255 760613 762211 763904 765768 767631
$$ packed form
58119E492410k89215k72986k58591k45522k32160k15873j97162j79318j63382
58110C438201j47415j30735j14978j01075q9217q1550q0525q4355q7988q8862
58100B431501q8146q6530q2826p7088p1323o6479o1870n7745n5203n3459n0453
58089A680379m6334m3200m1354l9088l6210l4354l3576l2113k9998k9390l0553
58078A284209l0822k8666k5812k4137k3163k1883k0562j9477j7967j5985j4779
58067A040956j4965j5492j5235j4142j2413j0157q184p446p473p036o387o967
58055I15059q846j0535j1500j2616j3870j3893j2367j0707r753q805p558o876
58043G87733o885o358m858l644l450l181j830j40P87J081J358J598J693J864J863
$$ plain form
58028 767631 768558 767767 765818 763943 762442 760695 758442 756039 753592 750825 747790 744864 742040 738955 735577
58013 735577 732210 728872 725197 720898 715899 710235 704225 698497 693416 688759 684242 679965 676022 672146
57999 672146 668005 663287 657365 649735 641140 633239 626663 620425 613870 608075 604363 602480 601296 600467
57985 600467 600323 600898 602229 604827 608697 612585 615453 617987 621347 625078 627740 629143 630387 631882 632842
57970 632842 632757 632022 630932 629192 626587 623246 619250 614825 610808 607969 606026 604288 603039 603181 604548
57955 604548 605766 605894 605188 604122 602690 601031 599884 600021 601662 604484 607799 610943 614008 617783 622342
57940 622342 626165 627670 627120 625795 623693 619543 613083 605760 598814 591947 584312 575627 565749 554275
57926 554275 541387 528373 516594 506452 497782 490649 485229 481364 478725 477156 476599 477035 478653 481707
$$ packed form
58028G67631R27p91j949j875j501j747k253k403k447k767l035k926k824l085l378
58013G35577l367l338l675m299m999n664o010n728n081m657m517m277l943l876
57999F72146m141m718n922p630q595p901o576o238o555n795l712j883j184q29
57985F00467j44N75J331K598L870L888K868K534L360L731K662J403J244J495R60
57970F32842q5p35j090j740k605l341l996m425m017k839j943j738j249J42J367
57955F04548J218J28p06j066j432j659j147J37J641K822L315L144L065L775M559
57940F22342L823J505n50j325k102m150o460p323o946o867p635q685r878j1474
57926E54275j2888j3014j1779j0142q670p133n420l865k639j569n57M36J618L054
$$ plain form
57912 481707 486045 491145 496722 502923 509915 517740 526545 536394 546763 556659 565302 572330 577518 580914
57898 580914 583143 584908 586135 586195 584885 582570 579399 575151 569861 563866 557171 549526 541190 532911 525080
57883 525080 517547 510323 503703 497697 492176 487689 485181 484682 485096 485574 486303 487750 490045 493464 498599
57868 498599 505494 513331 521440 529927 538801 547264 554529 560784 566696 572359 577295 581105 583605 584592
57854 584592 583958 581874 578636 574561 570098 565541 560482 554186 546823 539670 533713 528645 523752 519165
57840 519165 515554 513001 510881 508683 506363 503975 501407 498496 495166 491473 487587 483505 478737 472635
57826 472635 465100 456636 447729 438666 429907 421869 414194 406038 397394 389296 382323 375815 369278 363636
57812 363636 360122 358456 357205 355574 353837 352182 350304 348316 347159 347674 349814 353068 357212 362338
$$ packed form
57912D81707M338N100N577O201O992P825Q805R849J0369R896Q643P028N188L396
57898E80914K229J765J227O0j310k315l171m248n290n995o695p645q336q279p831
57883E25080p533p224o620o006n521m487k508m99M14M78P29J447K295L419N135
57868D98599O895P837Q109Q487Q874Q463P265O255N912N663M936L810K500R87
57854E84592o34k084l238m075m463m557n059o296p363p153n957n068m893m587
57840E19165l611k553k120k198k320k388k568k911l330l693l886m082m768o102
57826D72635p535q464q907r063q759q038p675q156q644q098o973o508o537n642
57812C63636l514j666j251j631j737j655j878j988j157N15K140L254M144N126
$$ plain form
57798 362338 368438 375291 382719 390937 400643 412598 426908 442823 459386 476008 492108 506492
57786 506492 517655 524791 528279 529305 529245 529192 529475 529475 528103 524508 518286 509367 498204 486038 474460
57771 474460 464454 455982 448441 441364 434780 429256 425597 424157 424300 424789 424830 424623 424896 426181 428603
57756 428603 432048 436193 440497 444466 447990 451282 454430 457250 459662 461973 464463 466869 468712 470143
57742 470143 471868 473993 475581 475995 476265 478275 482616 488031 493116 497797 502812 508500 514690 521344 528586
57727 528586 536246 543957 551756 560226 569921 580847 592616 604994 618267 633009 649523 667576
57715 667576 686853 707520 730063 754620 780796 808117 836452 866060 897614 932131 970409
57704 970409 1012497 1058122 1107700 1162468 1223628 1291862 1367815 1452433 1546723 1651757 1769084
$$ packed form
57798C62338O100O853P428Q218R706J1955J4310J5915J6563J6622J6100J4384
57786E06492J1163P136L488J026o0n3K83%j372l595o222q919j1163j2166j1578
57771D74460j0006q472p541p077o584n524l659j440J43M89M1k07K73J285K422
57756D28603L445M145M304L969L524L292L148K820K412K311K490K406J843J431
57742D70143J725K125J588M14K70K010M341N415N085M681N015N688O190O654P242
57727E28586P660P711P799Q470R695J0926J1769J2378J3273J4742J6514J8053
57715F67576J9277K0667K2543K4557K6176K7321K8335K9608L1554L4517L8278
57704I70409M2088M5625M9578N4768O1160O8234P5953Q4618R4290J05034J17327
$$ plain form
57693 1769084 1900469 2047006 2209247 2388581 2587556 2808029 3049335 3308605 3581891
57684 3581891 3863779 4146034 4417432 4664930 4874962 5034910 5135517 5173288 5151022 5076658
57674 5076658 4962043 4821734 4670933 4523267 4390416 4283297 4211829 4181388 4187613 4213198
57664 4213198 4229859 4206535 4121072 3968863 3762639 3524299 3275572 3033093 2807802 2605727
57654 2605727 2428883 2276726 2147787 2040466 1952930 1882961 1828169 1786253 1755199 1733547
57644 1733547 1720587 1716255 1720793 1734454 1757255 1788891 1829095 1878313 1937949 2009652 2094377 2192286
57632 2192286 2303628 2429460 2571285 2730037 2905620 3097392 3304615 3525825 3757466
57623 3757466 3993041 4223315 4437038 4621791 4765289 4857256 4891121 4864899 4781388 4647749
$$ packed form
57693A769084J31385J46537J62241J79334J98975K20473K41306K59270K73286
57684C581891K81888K82255K71398K47498K10032J59948J00607L7771k2266p4364
57674E076658j14615j40309j50801j47666j32851j07119p1468l0441O225K5585
57664D213198J6661k3324q5463j52209k06224k38340k48727k42479k25291k02075
57654B605727j76844j52157j28939j07321q7536o9969n4792m1916l1054k1652
57644A733547j2960m332M538J3661K2801L1636M0204M9218N9636P1703Q4725R7909
57632B192286J11342J25832J41825J58752J75583J91772K07223K21210K31641
57623C757466K35575K30274K13723J84753J43498R1967L3865k6222q3511j33639
$$ plain form
57613 4647749 4474036 4271012 4048647 3816094 3581915 3353237 3134546 2927836 2734001
57604 2734001 2553821 2387886 2236335 2098962 1975138 1863474 1762074 1669562 1585637 1510334
57594 1510334 1442972 1382194 1326884 1276605 1231152 1190098 1152988 1119621 1089782 1062790 1037778
57583 1037778 1014472 993309 974501 957348 940914 925148 910784 898185 886939 876727 867932
57572 867932 860955 855399 850467 845968 842472 840561 840254 841153 842921 845694 850119 856779 865491 875444 886259
57557 886259 898506 912902 929349 947214 966293 987033 1009977 1035409 1063424 1094035 1127388
57546 1127388 1164253 1206026 1253847 1307945 1368270 1435462 1510674 1594751 1688297 1792382 1908367
57535 1908367 2036911 2177803 2330807 2495993 2672890 2859534 3052184 3245163 3430650
$$ packed form
57613D647749j73713k03024k22365k32553k34179k28678k18691k06710j93835
57604B734001j80180j65935j51551j37373j23824j11664j01400r2512q3925p5303
57594A510334o7362o0778n5310n0279m5453m1054l7110l3367k9839k6992k5012
57583A037778k3306k1163j8808j7153j6434j5766j4364j2599j1246j0212q795
57572H67932o977n556m932m499l496j911l07Q99J768K773M425O660Q712R953J0815
57557H86259J2247J4396J6447J7865J9079K0740K2944K5432K8015L0611L3353
57546A127388L6865M1773M7821N4098O0325O7192P5212Q4077R3546J04085J15985
57535A908367J28544J40892J53004J65186J76897J86644J92650J92979J85487
$$ plain form
57526 3430650 3599211 3741116 3847563 3911463 3928381 3897585 3822290 3708897 3565970 3403026
57516 3403026 3228867 3050346 2872834 2701425 2540605 2392581 2256954 2132668 2019671
57507 2019671 1918288 1827929 1747307 1675513 1612105 1556423 1507604 1465195 1429185 1399413 1375339
57496 1375339 1356345 1341864 1331257 1323948 1319850 1319516 1323816 1333367 1348007 1366891 1389449 1416335
57484 1416335 1449021 1488416 1534449 1587113 1647152 1715290 1791510 1875803 1969158 2073136 2188858
57473 2188858 2317064 2458666 2614090 2782015 2959285 3141704 3323816 3497778 3653493
57464 3653493 3780489 3869650 3913890 3909023 3855268 3757536 3623594 3461972 3281509 3091473
57454 3091473 2900405 2714367 2536674 2369240 2213618 2070772 1940614 1822288 1714801
$$ packed form
57526C430650J68561J41905J06447O3900J6918l0796p5295j13393j42927j62944
57516C403026j74159j78521j77512j71409j60820j48024j35627j24286j12997
57507B019671j01383r0359q0622p1794o3408n5682m8819m2409l6010k9772k4074
57496A375339j8994j4481j0607p309m098l34M300R551J4640J8884K2558K6886
57484A416335L2686L9395M6033N2664O0039O8138P6220Q4293R3355J03978J15722
57473B188858J28206J41602J55424J67925J77270J82419J82112J73962J55715
57464C653493J26996Q9161M4240m867n3755r7732j33942j61622j80463j90036
57454C091473j91068j86038j77693j67434j55622j42846j30158j18326j07487
$$ plain form
57445 1714801 1617285 1528986 1449263 1377582 1313425 1256282 1205691 1161039 1121278 1085183 1052123
57434 1052123 1022350 996221 973238 952179 932139 913132 895620 879823 865685 853151 842093
57423 842093 832113 822798 814178 806527 799712 793105 786353 779913 774555 770538 767581 765439 764090 763344
57409 763344 762730 761995 761479 761659 762468 763337 763936 764567 765747 767705 770434 773963 778177 782446 785912 788338
57393 788338 790430 793127 796782 801157 805953 810953 815783 819912 823072 825553 828058 831269 835403 840035
57379 840035 844416 848133 851456 855046 859470 864960 871234 877354 882221 885646 888701 892565 897280 902062
57365 902062 906539 910971 915447 919698 923796 928293 933407 938743 944084 949810 956204 962926 969597 976326
57351 976326 983194 989769 995725 1001506 1007738 1014392 1021244 1028833 1038020 1048618 1059274 1068934 1077778 1086498
$$ packed form
57445A714801r7516q8299p9723p1681o4157n7143n0591m4652l9761l6095l3060
57434A052123k9773k6129k2983k1059k0040j9007j7512j5797j4138j2534j1058
57423H42093r980r315q620p651o815o607o752o440n358m017k957k142j349p46
57409G63344o14p35n16J80Q09Q69N99O31J180J958K729L529M214M269L466K426
57393G88338K092K697L655M375M796N000M830M129L160K481K505L211M134M632
57379H40035M381L717L323L590M424N490O274O120M867L425L055L864M715M782
57365I02062M477M432M476M251M098M497N114N336N341N726O394O722O671O729
57351I76326O868O575N956N781O232O654O852P589R187J0598J0656R660Q844Q720
$$ plain form
57337 1086498 1095249 1103738 1111893 1119882 1127647 1134923 1141858 1149255 1157960 1168029 1178750 1189498 1200343
57324 1200343 1211685 1223534 1235517 1247468 1259594 1272022 1284629 1297424 1310654 1324345 1338185
57313 1338185 1352068 1366357 1381377 1397169 1413996 1432398 1452176 1471955 1490619 1508855 1528408
57302 1528408 1549925 1572462 1595067 1617910 1641645 1666478 1692422 1719844 1749137 1780090 1812054
57291 1812054 1844720 1878488 1914051 1951604 1990380 2029134 2067293 2105507 2144666 2184479 2223425
57280 2223425 2259982 2293328 2322884 2347936 2367996 2382995 2392731 2396645 2394551 2387246 2375982 2361693
57268 2361693 2345153 2327621 2310764 2295946 2283828 2274487 2267589 2262664 2259655 2259179 2261893 2267585 2275199
57255 2275199 2283825 2293349 2304078 2316007 2328742 2342036 2356128 2371354 2387440 2403426 2418476 2432702
$$ packed form
57337A086498Q751Q489Q155P989P765P276O935P397Q705J0069J0721J0748J0845
57324A200343J1342J1849J1983J1951J2126J2428J2607J2795J3230J3691J3840
57313A338185J3883J4289J5020J5792J6827J8402J9778J9779J8664J8236J9553
57302A528408K1517K2537K2605K2843K3735K4833K5944K7422K9293L0953L1964
57291A812054L2666L3768L5563L7553L8776L8754L8159L8214L9159L9813L8946
57280B223425L6557L3346K9556K5052K0060J4999R736L914k094p305j1264j4289
57268B361693j6540j7532j6857j4818j2118r341o898m925l009m76K714N692P614
57255B275199Q626R524J0729J1929J2735J3294J4092J5226J6086J5986J5050J4226
$$ plain form
57243 2432702 2447070 2462530 2479448 2497770 2517340 2537913 2559183 2581065 2603774 2627453 2651863
57232 2651863 2676610 2701496 2726451 2751312 2776020 2800992 2826954 2854181 2882081 2909725 2936852
57221 2936852 2964266 2993094 3023635 3055059 3086252 3116748 3146663 3175991 3204474 3232196 3259889
57210 3259889 3288365 3317870 3348154 3378940 3410120 3441554 3472914 3503780 3533963 3563778 3593837
57199 3593837 3624331 3654627 3683950 3712400 3740842 3769684 3798246 3825612 3851693 3877075 3902135
57188 3902135 3926755 3950776 3974273 3997316 4019682 4040874 4060408 4078188 4094678 4110520 4126020
57177 4126020 4141212 4156409 4172189 4188676 4205283 4221490 4237455 4253464 4269230 4284290 4298798
57166 4298798 4313327 4328014 4342526 4356816 4371289 4386171 4401241 4416396 4431997 4448390 4465447
$$ packed form
57243B432702J4368J5460J6918J8322J9570K0573K1270K1882K2709K3679K4410
57232B651863K4747K4886K4955K4861K4708K4972K5962K7227K7900K7644K7127
57221B936852K7414K8828L0541L1424L1193L0496K9915K9328K8483K7722K7693
57210C259889K8476K9505L0284L0786L1180L1434L1360L0866L0183K9815L0059
57199C593837L0494L0296K9323K8450K8442K8842K8562K7366K6081K5382K5060
57188C902135K4620K4021K3497K3043K2366K1192J9534J7780J6490J5842J5500
57177D126020J5192J5197J5780J6487J6607J6207J5965J6009J5766J5060J4508
57166D298798J4529J4687J4512J4290J4473J4882J5070J5155J5601J6393J7057
$$ plain form
57155 4465447 4482812 4500400 4518392 4536865 4555597 4574192 4592258 4609403 4625140 4638953 4650614
57144 4650614 4660341 4668263 4673728 4675655 4673783 4669071 4662511 4654023 4643048 4629644 4614271 4596901 4577396
57131 4577396 4556666 4536426 4517609 4499888 4483025 4467915 4455980 4448251 4445437 4448066 4455910 4467759
57119 4467759 4482347 4499214 4518278 4539115 4561210 4584677 4610282 4639203 4673272 4715328 4768958
57108 4768958 4838139 4927376 5041763 5186671 5368001 5593377 5872826 6218044 6641824 7158937
57098 7158937 7787187 8547116 9461718 10557987 11868956 13433459 15293533 17491337 20066059
57089 20066059 23050215 26465626 30318816 34593623 39241686 44177243 49280062 54399088
57081 54399088 59347635 63897689 67794676 70800337 72741772 73536337 73185137 71753320
$$ packed form
57155D465447J7365J7588J7992J8473J8732J8595J8066J7145J5737J3813J1661
57144D650614R727P922N465J927j872m712o560q488j0975j3404j5373j7370j9505
57131D577396k0730k0240j8817j7721j6863j5110j1935p729k814K629P844J1849
57119D467759J4588J6867J9064K0837K2095K3467K5605K8921L4069M2056N3630
57108D768958O9181Q9237J14387J44908J81330K25376K79449L45218M23780N17113
57098G158937O28250P59929R14602J096269J310969J564503J860074K197804K574722
57089B0066059K984156L415411L853190M274807M648063M935557N102819N119026
57081E4399088M948547M550054L896987L005661J941435P94565l51200j431817
$$ plain form
57073 71753320 69355295 66146114 62310998 58049304 53555870 49004319 44536402 40259448
57065 40259448 36249694 32556248 29203371 26193676 23514304 21143692 19055719 17221648
57057 17221648 15612031 14198664 12955456 11858624 10887392 10024701 9256697 8571497 7958662
57048 7958662 7409341 6915969 6471567 6069698 5704954 5372813 5068748 4787886 4525832
57039 4525832 4279770 4048690 3832570 3631293 3444124 3270032 3108331 2958778 2821049
57030 2821049 2694388 2577862 2470690 2372177 2281567 2198180 2121476 2050859 1985676 1925599 1870727
57019 1870727 1821083 1776151 1735109 1697263 1662120 1629361 1598995 1571292 1546382 1524109 1504407
57008 1504407 1487410 1473045 1461068 1451850 1446696 1446962 1453210 1465587 1484772 1512407 1551168 1604905
$$ packed form
57073G1753320k398025l209181l835116m261694m493434m551551m467917m276954
57065D0259448m009754l693446l352877l009695k679372k370612k087973j834071
57057A7221648j609617j413367j243208j096832r71232q62691p68004o85200o12835
57048G958662n49321m93372m44402m01869l64744l32141l04065k80862k62054
57039D525832k46062k31080k16120k01277j87169j74092j61701j49553j37729
57030B821049j26661j16526j07172r8513r0610q3387p6704p0617o5183o0077n4872
57019A870727m9644m4932m1042l7846l5143l2759l0366k7703k4910k2273j9702
57008A504407j6997j4365j1977r218n154K66O248J2377J9185K7635L8761N3737
$$ plain form
56996 1604905 1678615 1778775 1914370 2095256 2322930 2576969 2811426 2971631 3022064 2962712
56986 2962712 2822164 2637712 2440054 2249084 2075548 1923122 1790330 1672967 1566468
56977 1566468 1467722 1376126 1293126 1220229 1157483 1104057 1059573 1024045 996840 976566 961898
56966 961898 951779 944986 940323 937353 936354 937591 941294 948353 960229 977729 999905 1023924 1045489
56953 1045489 1059701 1062726 1053535 1034085 1007791 977968 947369 918216 892005 869423 850669 835684
56941 835684 824074 815261 809003 805573 805384 808677 815670 826707 842237 863055 890475 925304 965562
56928 965562 1005133 1035461 1049522 1045030 1024563 993168 955826 916475 878211 843286 812644 786003
56916 786003 762836 743031 726314 711589 697683 684624 673395 664345 656605 649310 642680 637426
$$ packed form
56996A604905P3710J00160J35595J80886K27674K54039K34457J60205N0433n9352
56986B962712j40548j84452j97658j90970j73536j52426j32792j17363j06499
56977A566468r8746r1596q3000p2897o2746n3426m4484l5528k7205k0274j4668
56966I61898j0119o793m663k970r99J237L703P059J1876J7500K2176K4019K1565
56953A045489J4212L025r191j9450k6294k9823l0599k9153k6211k2582j8754j4985
56941H35684j1610q813o258l430j89L293O993J1037J5530K0818K7420L4829M0258
56928I65562L9571L0328J4061m492k0467l1395l7342l9351l8264l4925l0642k6641
56916G86003k3167j9805j6717j4725j3906j3059j1229r050p740p295o630n254
$$ plain form
56904 637426 633686 631127 629650 629276 629518 629608 629423 629744 631408 634590 638987 644393 650865 658572 667766 678836
56888 678836 692328 708957 729585 754742 783544 812715 836962 851098 852652 842927 825694 804876
56876 804876 783203 762412 743849 728476 716510 707529 701111 697389 697066 700938 709450 722723 741079
56863 741079 765494 797523 838937 891381 955558 1029187 1104866 1170569 1214040 1228401 1214642
56852 1214642 1179506 1131438 1077939 1024995 977003 936355 903449 877771 859204 848274 845327
56841 845327 849998 861773 880952 908949 947762 999467 1066305 1150739 1254078 1373190 1497194
56830 1497194 1607763 1684812 1714807 1696021 1637426 1553070 1456481 1357861 1263833 1178367 1103764
56819 1103764 1041173 990618 951144 921483 900771 888644 884994 890033 904542 929806 967356 1018873
$$ packed form
56904F37426l740k559j477l74K42R0j85L21J664L182M397N406O472P707R194J1070
56888F78836J3492J6629K0628K5157K8802K9171K4247J4136J554r725j7233k0818
56876H04876k1673k0791j8563j5373j1966q981o418l722l23L872Q512J3273J8356
56863G41079K4415L2029M1414N2444O4177P3629P5679O5703M3471J4361j3759
56852A214642l5136m8068n3499n2944m7992m0648l2906k5678j8567j0930k947
56841H45327M671J1775J9179K7997L8813N1705O6838Q4434J03339J19112J24004
56830A497194J10569P7049K9995j8786n8595q4356r6589r8620r4028q5466p4603
56819A103764o2591n0555l9474k9661k0712j2127l650N039J4509K5264L7550N1517
$$ plain form
56807 1018873 1085582 1166169 1253980 1336232 1397167 1423979 1412034 1366163 1297452 1217937 1136764
56796 1136764 1059525 989447 928253 876295 832925 797283 768646 746252 729470 718437 714070
56785 714070 717139 727563 744881 769218 801351 841401 886921 931771 967189 985097 981620 958199
56773 958199 919926 873019 823137 774528 729625 689245 653414 622019 594892 571793 552520
56762 552520 536712 523451 511532 500433 490624 482623 476071 470085 464207 458624 453704 449650 446450
56749 446450 443817 441288 438589 435740 432688 429143 425045 420873 417173 414058 411424 409289 407484 405391
56735 405391 402517 399192 396192 393797 391642 389372 386949 384390 381690 379043 376755 374894 373352 372139
56721 372139 371244 370280 368773 366842 365123 364016 363416 363230 363600 364400 365003 364842 363949 362679 361211 359545
$$ packed form
56807A018873O6709Q0587Q7811Q2252O0935K6812j1945m5871o8711p9515q1173
56796A136764p7239p0078o1194n1958m3370l5642k8637k2394j6782j1033m367
56785G14070L069J0424J7318K4337L2133M0050M5520M4850L5418J7908l477k3421
56773I58199l8273m6907m9882m8609m4903m0380l5831l1395k7127k3099j9273
56762E52520j5808j3261j1919j1099r809q001o552n986n878n583m920m054l200
56749D46450k633k529k699k849l052l545m098m172l700l115k634k135j805k093
56735D05391k874l325l000k395k155k270k423k559k700k647k288j861j542j213
56721C72139q95r64j507j931j719j107o00j86L70Q00O03j61q93j270j468j666
$$ plain form
56705 359545 357758 356004 354406 353113 352202 351381 350074 348130 346234 345159 344749 344044 342547 340967 340477
56690 340477 341472 343368 345494 347744 350223 352624 354339 355111 355261 355224 355150 355028 354947 355062 355399 355803 355930 355347
56672 355347 353919 352179 351030 350848 351116 351121 350739 350268 349770 348935 347523 345586 343325 340950 338618 336278
56656 336278 333671 330623 327172 323259 318601 313255 308090 304215 301976 300861 300309 300187 300482 300976 301393
56641 301393 301599 301558 301264 300744 299996 299043 298249 298362 299810 302025 303841 304572 304306 303273 301547 299453 297625
56624 297625 296272 294861 292926 290886 289608 289270 289124 288374 286967 285423 284182 283364 283029 283355 284420 285972
56608 285972 287642 289325 291062 292646 293730 294411 295211 296227 296804 296509 296003 296329 297522 298577 298723 298108
56592 298108 297230 296340 295581 295148 294974 294630 293776 292500 291104 289866 289123 289239 290337 292212 294575 297129
$$ packed form
56705C59545j787j754j598j293r11q21j307j944j896j075m10p05j497j580m90
56690C40477R95J896K126K250K479K401J715P72J50l7p4j22q1J15L37M04J27n83
56672C55347j428j740j149j82K68Nl82m71m98q35j412j937k261k375k332k340
56656C36278k607l048l451l913m658n346n165l875k239j115n52j22K95M94M17
56641C01393K06m1k94n20p48r53p94J13J448K215J816P31k66j033j726k094j828
56624B97625j353j411j935k040j278l38j46p50j407j544j241q18l35L26J065J552
56608B85972J670J683J737J584J084O81Q00J016N77k95n06L26J193J055J46o15
56592B98108q78q90p59m33j74l44q54j276j396j238p43J16J098J875K363K554
$$ plain form
56576 297129 299496 301461 303306 305519 308098 310532 312505 314220 316015 318179 321186 325475 330693 335719
56562 335719 339846 343544 347746 352795 358440 364404 370429 376036 380824 384955 388924 392840 396228 398577
56548 398577 399871 400531 400954 401112 400610 399152 396831 393849 390127 385514 380238 374702 368903 362611 356191
56533 356191 350636 346540 343508 340787 338041 335294 332664 330493 329224 328738 328128 326448 323345 318816 312984
56518 312984 306516 300594 295824 291619 287248 283073 280027 278253 277115 276311 276087 276359 276496 276225 276000 276217
56502 276217 276590 276681 276575 276586 276551 275947 274702 273598 273651 275137 277339 279283 280550 281248 281489 281355 281290 281906
56484 281906 283215 284621 285935 287769 290529 293575 296018 297848 299571 301198 302431 303625 305593 308358
56470 308358 310979 312792 314119 315509 316983 318430 320219 322886 326448 330444 334456 338315 341897 345011
$$ packed form
56576B97129K367J965J845K213K579K434J973J715J795K164L007M289N218N026
56562C35719M127L698M202N049N645N964O025N607M788M131L969L916L388K349
56548C98577J294O60M23J58n02j458k321k982l722m613n276n536n799o292o420
56533C56191n555m096l032k721k746k747k630k171j269m86o10j680l103m529n832
56518C12984o468n922m770m205m371m175l046j774j138q04k24K72J37k71k25K17
56502B76217L73R1j06J1l5o04j245j104N3J486K202J944J267O98K41j34o5O16
56484B81906J309J406J314J834K760L046K443J830J723J627J233J194J968K765
56470C08358K621J813J327J390J474J447J789K667L562L996M012L859L582L114
$$ plain form
56456 345011 347532 349500 351007 352004 352348 352169 352093 352698 353709 354219 354029 354200 355744 358175 360125 361163
56440 361163 362153 363822 365835 367491 368586 369184 369053 367757 365038 360868 355502 349673 344280 339548 334822
56425 334822 329489 323814 318573 314158 310407 307096 304220 301834 299900 298282 296852 295676 295111 295503 296625
56410 296625 297685 298075 297943 297893 298245 298740 298744 297631 295164 291722 288062 284773 282120 280394 279976 280798 282105
56393 282105 283132 283872 284771 285820 286422 286249 285825 285986 286976 288312 289465 290380 291276 292247 293301 294721 297039
56376 297039 300531 304930 309742 314652 319440 323718 327083 329481 331148 332226 332709 332767 332858 333416 334569 336143
56360 336143 337721 338786 339138 339249 339854 341005 341841 341578 340485 339567 339385 339615 339809 340243 341681 344379 347632
56343 347632 350384 352187 353439 354839 356810 359431 362652 366456 370883 375953 381525 387296 393143 399409
$$ packed form
56456C45011K521J968J507R97L44j79p6O05J011N10j90J71J544K431J950J038
56440C61163R90J669K013J656J095N98j31j296k719m170n366n829n393m732m726
56425C34822n333n675n241m415l751l311k876k386j934j618j430j176n65L92J122
56410B96625J060L90j32n0L52M95Mj113k467l442l660l289k653j726m18Q22J307
56393B82105J027P40Q99J049O02j73m24J61R90J336J153R15Q96R71J054J420K318
56376B97039L492M399M812M910M788M278L365K398J667J078M83N8R1N58J153J574
56360C36143J578J065L52J11O05J151Q36k63j093r18j82K30J94M34J438K698L253
56343C47632K752J803J252J400J971K621L221L804M427N070N572N771N847O266
$$ plain form
56329 399409 406572 414543 422594 430163 437463 445106 453286 461511 468968 474965 479311 482532 485574 488985
56315 488985 492429 495185 496931 497893 498386 498461 497894 496378 493895 491050 488743 487294 486155 484743 483270
56300 483270 482436 482584 483547 485075 486987 489082 491302 493897 497111 500856 505079 510259 517162 526134 536888
56285 536888 548784 561064 573117 584974 597380 611091 626346 643299 662434 683998 707523
56274 707523 732645 760067 790867 825104 862037 901676 945197 993664 1047195 1105668 1169568
56263 1169568 1239887 1317759 1404431 1501006 1607866 1724677 1851067 1986792 2131073 2282290
56253 2282290 2438517 2597921 2758344 2916786 3069471 3212218 3340819 3451639 3542152 3610845
56243 3610845 3656807 3679899 3681289 3663311 3628790 3580807 3522866 3458493 3390339 3319923 3248129
$$ packed form
56329C99409P163P971Q051P569P300P643Q180Q225P457N997M346L221L042L411
56315D88985L444K756J746R62M93P5n67j516k483k845k307j449j139j412j473
56300D83270q34J48R63J528J912K095K220K595L214L745M223N180O903Q972J0754
56285E36888J1896J2280J2053J1857J2406J3711J5255J6953J9135K1564K3525
56274G07523K5122K7422L0800L4237L6933L9639M3521M8467N3531N8473O3900
56263A169568P0319P7872Q6672R6575J06860J16811J26390J35725J44281J51217
56253B282290J56227J59404J60423J58442J52685J42747J28601J10820R0513O8693
56243C610845M5962K3092J390j7978l4521m7983n7941o4373o8154p0416p1794
$$ plain form
56232 3248129 3175582 3102634 3029423 2955834 2881060 2803672 2722759 2638699 2552109 2462496 2368956
56221 2368956 2271919 2173151 2074106 1975417 1877842 1782450 1689747 1599887 1513911 1433476 1359000
56210 1359000 1289357 1223885 1163447 1108923 1059918 1015704 976269 941500 910276 881385 854648
56199 854648 830358 808339 788375 770790 755748 742570 730590 720144 711891 705682 700875 697204
56187 697204 694607 692701 691223 690581 691278 693197 696028 699883 704828 710394 716202 722504 729462 736557 743461
56172 743461 750790 759049 767380 774383 779767 784253 788206 791306 793347 794510 795076 795576 796902 799515 802834
56157 802834 806162 809864 814915 821622 829659 839041 850233 863510 878983 897011 917925 941632 968278
56144 968278 998970 1035086 1077157 1125243 1180177 1243696 1317649 1403998 1505328 1624198 1761517
$$ packed form
56232C248129p2547p2948p3211p3589p4774p7388q0913q4060q6590q9613r3540
56221B368956r7037r8768r9045r8689r7575r5392r2703q9860q5976q0435p4476
56210A359000o9643o5472o0438n4524m9005m4214l9435l4769l1224k8891k6737
56199H54648k4290k2019j9964j7585j5042j3178j1980j0446q253o209m807l671
56187F97204k597j906j478o42O97J919K831L855M945N566N808O302O958P095O904
56172G43461P329Q259Q331P003N384M486L953L100K041J163N66N00J326K613L319
56157H02834L328L702N051O707Q037R382J1192J3277J5473J8028K0914K3707K6646
56144I68278L0692L6116M2071M8086N4934O3519P3953Q6349J01330J18870J37319
$$ plain form
56133 1761517 1915543 2081787 2252996 2419750 2572734 2705713 2817093 2909628 2989098 3062045
56123 3062045 3132712 3201003 3263015 3313090 3345652 3357097 3348064 3323982 3292126 3257368 3220366
56112 3220366 3178400 3126587 3058972 2970681 2860396 2731034 2588556 2440519 2294638 2156910
56102 2156910 2030311 1915482 1812240 1720001 1637545 1563653 1497934 1440304 1389985 1345833 1307301
56091 1307301 1274192 1245821 1221323 1200490 1183463 1169861 1158949 1150165 1142759 1135597 1128371 1122380
56079 1122380 1119026 1118053 1118356 1119818 1123014 1127653 1132771 1138137 1144181 1150913 1158175 1166516 1176428 1187157
56065 1187157 1197712 1208629 1221121 1234863 1248293 1260899 1273550 1286740 1300164 1313952 1328648
56054 1328648 1343942 1358995 1374036 1390125 1407432 1425292 1443846 1463962 1485658 1508237 1531840
$$ packed form
56133A761517J54026J66244J71209J66754J52984J32979J11380R2535P9470P2947
56123C062045P0667O8291O2012N0075L2562J1445r033k4082l1856l4758l7002
56112C220366m1966n1813o7615q8291j10285j29362j42478j48037j45881j37728
56102B156910j26599j14829j03242r2239q2456p3892o5719n7630n0319m4152l8532
56091A307301l3109k8371k4498k0833j7027j3602j0912q784p406p162p226n991
56079A122380l354r73L03J462L196M639N118N366O044O732P262Q341R912J0729
56065A187157J0555J0917J2492J3742J3430J2606J2651J3190J3424J3788J4696
56054A328648J5294J5053J5041J6089J7307J7860J8554K0116K1696K2579K3603
$$ plain form
56043 1531840 1557039 1583052 1608333 1633013 1658781 1686264 1714598 1743761 1775164 1809411 1845503
56032 1845503 1882812 1922016 1963540 2006854 2051820 2099001 2148191 2198312 2249060 2300803 2352733
56021 2352733 2403322 2453063 2504557 2559242 2616111 2674237 2734381 2797290 2862531 2929973 3000606
56010 3000606 3075113 3153401 3236067 3324359 3418204 3516222 3618110 3724837 3836296 3951300
56000 3951300 4070341 4195655 4328055 4466556 4611686 4766053 4930813 5104733 5287675
55991 5287675 5481620 5687169 5902654 6128172 6366967 6621331 6890862 7176406 7481936
55982 7481936 7810727 8163778 8543996 8957624 9409244 9900018 10433427 11017836 11660446
55973 11660446 12364340 13135596 13988199 14937774 15996425 17179251 18510697 20019511 21734504
$$ packed form
56043A531840K5199K6013K5281K4680K5768K7483K8334K9163L1403L4247L6092
56032A845503L7309L9204M1524M3314M4966M7181M9190N0121N0748N1743N1930
56021B352733N0589M9741N1494N4685N6869N8126O0144O2909O5241O7442P0633
56010C000606P4507P8288Q2666Q8292R3845R8018J01888J06727J11459J15004
56000C951300J19041J25314J32400J38501J45130J54367J64760J73920J82942
55991E287675J93945K05549K15485K25518K38795K54364K69531K85544L05530
55982G481936L28791L53051L80218M13628M51620M90774N33409N84409O42610
55973A1660446P03894P71256Q52603R49575J058651J182826J331446J508814J714993
$$ plain form
55964 21734504 23693371 25950551 28568577 31606515 35123803 39188973 43878905 49284698
55956 49284698 55537600 62825964 71380330 81469257 93450559 107830770 125270528
55949 125270528 146601519 172923987 205530685 245148734 290449983 336812552 376768774
55942 376768774 402558659 409415254 397407856 370751674 335416407 296821101 258759579
55935 258759579 223448586 191980453 164703833 141487969 121944527 105592456 91936714
55928 91936714 80500760 70861013 62674495 55675024 49651918 44438374 39906955 35957155
55920 35957155 32501482 29464127 26785718 24419751 22324550 20462859 18805641 17329487
55912 17329487 16010910 14827355 13761605 12800205 11928945 11134412 10408368 9745793 9139585
$$ packed form
55964B1734504J958867K257180K618026L037938L517288M065170M689932N405793
55956D9284698O252902P288364Q554366J0088927J1981302J4380211J7439758
55949A25270528K1330991K6322468L2606698L9618049M5301249M6362569L9956222
55942C76768774K5789885O856595j2007398k6656182l5335267l8595306l8061522
55935B58759579l5310993l1468133k7276620k3215864j9543442j6352071j3655742
55928I1936714j1435954r639747q186518o999471o023106n213544m531419l949800
55920C5957155l455673l037355k678409k365967k095201j861691j657218j476154
55912A7329487j318577j183555j065750r61400q71260p94533p26044o62575o06208
$$ plain form
55903 9139585 8581576 8067625 7596841 7166038 6769244 6402462 6064630 5753607 5465126
55894 5465126 5196255 4946507 4714903 4498992 4297241 4109561 3934985 3771396 3617841
55885 3617841 3474625 3340898 3214650 3095323 2983951 2880513 2783525 2692365 2607554 2528494
55875 2528494 2453391 2381750 2314626 2252115 2192914 2136630 2084081 2034853 1986894 1939074 1892066
55864 1892066 1846242 1800994 1756665 1714913 1676465 1640565 1607204 1577664 1552185 1529407 1509036
55853 1509036 1492933 1482489 1477043 1475928 1479735 1487580 1494697 1494737 1483989 1462554 1432736 1397629 1360233
55840 1360233 1322329 1284228 1246049 1208628 1172820 1138816 1106611 1076262 1047367 1019342 992535
55829 992535 967993 945817 924976 905141 887317 872133 858806 846358 834550 822950 810491
$$ packed form
55903I139585n58009n13951m70784m30803l96794l66782l37832l11023k88481
55894E465126k68871k49748k31604k15911k01751j87680j74576j63589j53555
55885C617841j43216j33727j26248j19327j11372j03438r6988r1160q4811p9060
55875B528494p5103p1641o7124o2511n9201n6284n2549m9228m7959m7820m7008
55864A892066m5824m5248m4329m1752l8448l5900l3361k9540k5479k2778k0371
55853A509036j6103j0444n446j115L807P845P117M0j0748k1435k9818l5107l7396
55840A360233l7904l8101l8179l7421l5808l4004l2205l0349k8895k8025k6807
55829I92535k4542k2176k0841j9835j7824j5184j3327j2448j1808j1600j2459
$$ plain form
55818 810491 796890 783406 771398 761180 752921 747362 744629 743455 742662 742544 743789 745900 747660 748436
55804 748436 748084 746211 742498 737281 731086 724108 716665 709385 702221 693936 683362 670648 656734 642328
55790 642328 628048 614721 602600 590844 578648 566512 555644 546488 538595 531677 526098 522460
55778 522460 521104 521752 523209 523636 521404 515611 506026 493206 478750 464536 451344 438852 427089
55765 427089 417002 409297 403662 399601 397064 395615 393835 390330 384844 377920 370150 362259 355154 349161
55751 349161 343695 338196 332878 328156 324001 320271 317024 314035 310762 307229 304161 301782 299367 296532
55737 296532 293958 292081 290068 287084 283781 281410 280071 278919 277653 276698 276130 275420 274169 272308 269611
55722 269611 265674 260392 254133 247672 242189 238779 237374 236660 235531 234200 233357 232929 232423 231994 232407 234269
$$ packed form
55818H10491j3601j3484j2008j0218q259n559k733j174p93j18J245K111J760P76
55804G48436l52j873l713n217o195o978p443p280p164q285j0574j2714j3914j4406
55790F42328j4280j3327j2121j1756j2196j2136j0868r156p893o918n579l638
55778E22460j356O48J457M27k232n793r585j2820j4456j4214j3192j2492j1763
55765D27089j0087p705n635m061k537j449j780l505n486o924p770p891p105n993
55751C49161n466n499n318m722m155l730l247k989l273l533l068k379k415k835
55737B96532k574j877k013k984l303k371j339j152j266r55n68p10j251j861k697
55722B69611l937n282o259o461n483l410j405p14j129j331q43m28n06m29M13J862
$$ plain form
55706 234269 237913 243624 251307 260257 269827 279839 289762 298106 303459 305713 305589 303515 299824 295527
55692 295527 291739 288490 284923 280548 275576 270361 265356 261408 259146 258132 257363 256545 256210 256821 258542
55677 258542 261672 266319 271556 275727 277814 277978 276844 274919 272754 270960 269860 269494 269937 271145 272564
55662 272564 273461 273671 273616 273662 273870 274236 274674 274818 274335 273357 272260 271177 270041 268763 266884 263480 258083
55645 258083 251481 244932 238804 232613 226120 219580 213054 206308 199475 193184 187890 183588 180056 176876
55631 176876 173341 169044 164477 160444 156990 153623 150483 148396 147614 147261 146297 144522 142395 140411 138835
55616 138835 137686 136778 135988 135367 134749 133504 131263 128643 126647 125487 124621 123764 123053 122274 120810 118518
55600 118518 115970 113623 111444 109518 108357 108319 109219 110684 112385 113826 114508 114520 114467 114667 114862 114831 114684
$$ packed form
55706B34269L644N711P683Q950R570J0012R923Q344N353K254j24k074l691m297
55692B95527l788l249l567m375m972n215n005l948k262j014p69q18l35O11J721
55677B58542L130M647N237M171K087J64j134j925k165j794j100l66M43J208J419
55662B72564Q97K10n5M6K08L66M38J44m83r78j097j083j136j278j879l404n397
55645B58083o602o549o128o191o493o540o526o746o833o291n294m302l532l180
55631A76876l535m297m567m033l454l367l140k087p82l53r64j775k127j984j576
55616A38835j149r08p90o21o18j245k241k620j996j160q66q57p11p79j464k292
55600A18518k548k347k179j926j161l8R00J465J701J441O82J2n3K00J95l1j47
$$ plain form
55583 114684 114468 114043 113519 113223 113065 112518 111443 110330 109476 108451 106703 104235 101467 98872 96933 95962
55567 95962 95725 95666 95645 95943 96485 96783 96864 97495 99053 100874 102216 103243 104461 105695 106357 106378 106198 106046
55549 106046 105833 105674 105967 106916 108332 109840 111008 111439 111153 110851 111494 113520 116578 119905 122793 124843
55533 124843 126058 126748 127234 127745 128518 129783 131527 133496 135482 137308 138496 138376 136784 134348 131801
55518 131801 129334 126938 125033 124186 124256 124296 123467 121773 119757 117681 115274 112289 109056 106230 104010 101928
55502 101928 99544 97030 94695 92226 88989 85092 81626 79628 79144 79509 80183 81023 81880 82212 81218 78498
55486 78498 74710 71320 69380 68652 68233 67733 67318 66833 65838 64588 64109 64891 66189 67102 67657 68308 68938
55469 68938 69109 68870 68536 67951 66730 65147 63994 63498 63079 62345 61730 61844 62630 63556 64281 64768 64941 64681
$$ packed form
55583A14684k16m25n24k96j58n47j075j113q54j025j748k468k768k595j939r71
55567I5962k37n9k1K98N42K98Q1O31J558J821J342J027J218J234O62K1j80j52
55549A06046k13j59K93R49J416J508J168M31k86l02O43K026L058L327K888K050
55533A24843J215O90M86N11P73J265J744J969J986J826J188j20j592k436k547
55518A31801k467k396j905q47P0M0q29j694k016k076k407k985l233k826k220k082
55502A01928k384k514k335k469l237l897l466j998m84L65O74Q40Q57L32r94k720
55486G8498l788l390j940p28m19n00m15m85r95j250m79P82J298R13N55O51O30
55469F8938J71k39l34n85j221j583j153m96m19p34o15J14P86R26P25M87J73k60
$$ plain form
55451 64681 64154 63819 64010 64616 65264 65738 66106 66524 67008 67447 67745 67885 67896 67780 67477 66888 66027 65153 64640
55432 64640 64588 64618 64180 63082 61751 60970 61279 62462 63649 64180 64309 64736 65496 65830 65350 64662 64422 64326 63742
55413 63742 62890 62554 62803 62891 62430 61878 61704 61836 62170 62891 63918 64645 64701 64492 64547 64701 64450 63910 63929 65216
55393 65216 67551 69877 71174 71356 71281 71702 72387 72595 72170 71596 71048 70149 68749 67231 65786 64126 62321
55376 62321 61202 61400 62457 63462 64075 64390 64178 62938 60583 57576 54480 51664 49233 46938 44410
55361 44410 41830 39990 39364 39456 39546 39663 40288 41354 42167 42236 41623 40646 39732 39444 40074 41182 42023 42441 42934
55342 42934 43823 44804 45430 45716 46102 46956 48138 48972 48810 47727 46461 45548 44896 44443 44677 45879 47258
55325 47258 47589 46649 45401 44739 44677 44792 44841 44781 44630 44520 44545 44521 44292 44286 45208 47039 48878 50019 50718 51585
$$ packed form
55451F4681n27l35J91O06O48M74L68M18M84M39K98J40J1j16l03n89q61q74n13
55432F4640n2L0m38j098j331p81L09J183J187N31J29M27P60L34m80o88k40r6n84
55413F3742q52l36K49Q8m61n52j74J32L34P21J027P27N6k09N5J54k51n40J9J287
55393F5216K335K326J297J82p5M21O85K08m25n74n48q99j400j518j445j660j805
55376F2321j119J98J057J005O13L15k12j240k355l007l096k816k431k295k528
55361D4410k580j840o26R2R0J17O25J066Q13O9o13r77r14k88O30J108Q41M18M93
55342D2934Q89R81O26K86L86Q54J182Q34j62j083j266r13o52m53K34J202J379
55325D7258L31r40j248o62o2J15M9o0j51j10K5k4k29oR22J831J839J141O99Q67
$$ plain form
55305 51585 52631 53356 53545 53525 53663 53934 54015 53706 53216 53075 53684 54903 56203 57169 57690 57658 56828 55237 53551
55286 53551 52710 53075 54060 54647 54239 53030 51612 50386 49397 48595 47984 47516 47072 46690 46622 47029 47753 48480
55268 48480 48945 49013 48781 48710 49254 50158 50508 49781 48479 47340 46353 45083 43662 42703 42393 42346 42397 42801 43539
55249 43539 44064 44035 43714 43377 42875 42213 41996 42745 44070 45109 45582 45873 46210 46395 46398 46623 47381 48498 49671
55230 49671 50802 51719 52000 51534 51021 51334 52489 53745 54666 55409 55891 55515 54229 53112 53130 53809 54068 54050
55212 54050 54965 57035 58823 59051 58169 57429 57241 57213 57226 57519 57992 58253 58229 58070 57624 56613 55227 53906
55194 53906 52630 51033 49161 47504 46280 45323 44625 44402 44595 44914 45407 46344 47488 48199 48410 48790 49619
55177 49619 50241 50085 49674 50034 51396 53000 53935 53835 52940 51853 51109 50697 50112 49047 47878 47266 47467
$$ packed form
55305E1585J046P25J89k0J38K71Q1l09m90j41O09J219J300R66N21l2q30j591j686
55286E3551q41L65R85N87m08j209j418j226r89q02o11m68m44l82o8M07P24P27
55268D8480M65O8k32p1N44R04L50p27j302j139r87j270j421r59l10m7N1M04P38
55249D3539N25k9l21l37n02o62k17P49J325J039M73K91L37J85LK25P58J117J173
55230D9671J131R17K81m66n13L13J155J256R21P43M82l76j286j117J8O79K59j8
55212E4050R15K070J788K28q82p40j88k8J3K93M73K61k4j59m46j011j386j321
55194E3906j276j597j872j657j224r57o98k23J93L19M93R37J144P11K11L80Q29
55177D9619O22j56m11L60J362J604R35j00q95j087p44m12n85j065j169o12K01
$$ plain form
55160 47467 48203 49002 49469 49461 49224 49221 49635 50133 50270 49964 49465 48997 48636 48373 48157 47945 47771 47712 47809 48162 48956
55139 48956 50110 50981 50890 50049 49573 50383 52379 54790 56962 58637 59817 60722 61649 62706 63807 64964
55123 64964 66246 67359 67726 67183 66164 64983 63393 61223 58940 57121 55714 54369 53222 52754 52986
55108 52986 53398 53624 53784 54130 54758 55712 56971 58243 59060 59162 58698 58111 57946 58475 59250 59298 58246 57081
55090 57081 57255 59096 61612 63813 65560 66975 67789 67750 67218 66768 66467 66104 65976 66844 68938 71442 73225
55073 73225 73851 73631 72922 71777 70305 69032 68606 69237 70600 72254 73987 75750 77460 78947 79984 80388
55057 80388 80242 80004 80179 80759 81204 81036 80278 79168 77710 75767 73494 71428 70173 70063 71000 72432 73657
55040 73657 74324 74555 74487 73915 72680 71190 70217 70221 71078 72338 73420 73751 73213 72478 72452 73287 74325 75067 75693
$$ packed form
55160D7467P36P99M67qk37lM14M98J37l06m99m68l61k63k16k12j74n9R7L53P94
55139D8956J154Q71r1q41m76Q10J996K411K172J675J180R05R27J057J101J157
55123F4964J282J113L67n43j019j181j590k170k283j819j407j345j147m68K32
55108E2986M12K26J60L46O28R54J259J272Q17J02m64n87j65N29P75M8j052j165
55090E7081J74J841K516K201J747J415Q14l9n32m50l01l63j28Q68K094K504J783
55073G3225O26k20p09j145j472j273m26O31J363J654J733J763J710J487J037M04
55057H0388j46k38J75N80M45j68p58j110j458j943k273k066j255j10R37J432J225
55040G3657O67K31o8n72j235j490r73MQ57J260J082L31n38p35k6Q35J038P42O26
$$ plain form
55021 75693 76459 77076 77096 76513 75595 74406 72976 71722 71126 71065 70984 70783 70957 71657 72209 71911 70978 70156 69646
55002 69646 68944 67670 66088 64715 63857 63698 64405 65895 67738 69571 71330 72828 73464 72842 71496 70441
54986 70441 70021 69696 69056 68452 68399 68841 69445 70297 71791 73959 76361 78658 80987 83688 86899 90428 93878
54969 93878 96911 99567 102277 105371 108635 111615 114341 117433 121436 126355 131964 138318 145731 154406
54955 154406 164316 175427 187853 201765 217141 233504 249848 264961 277841 287703 293550 294181
54943 294181 289010 278818 265375 250327 234648 219034 204183 190440 177600 165495 154610 145693
54931 145693 138828 133380 128880 125469 123276 121775 120175 118236 116404 115250 115106 116107 118172 120903
54917 120903 123849 127000 130822 135731 141813 149138 158010 168624 180676 193671 207527 222484 238215
$$ packed form
55021G5693P66O17K0n83r18j189j430j254n96o1q1k01J74P00N52k98r33q22n10
55002F9646p02j274j582j373q58j59P07J490J843J833J759J498O36o22j346j055
54986G0441m20l25o40o04n3M42O04Q52J494K168K402K297K329K701L211L529L450
54969I3878L033K656K710L094L264K980K726L092M003M919N609O354P413Q675
54955A54406R910J1111J2426J3912J5376J6363J6344J5113J2880R862N847O31
54943B94181n171j0192j3443j5048j5679j5614j4851j3743j2840j2105j0885q917
54931A45693o865n448m500l411k193j501j600j939j832j154j44J001K065K731
54917A20903K946L151L822M909O082P325Q872J0614J2052J2995J3856J4957J5731
$$ plain form
54904 238215 253197 265160 272181 273389 268883 259354 245990 230495 214708 199838 186049 172900
54892 172900 160238 148635 139026 131874 126613 121855 116397 110224 104484 100336 97899 96422 95190 93927
54878 93927 92530 90932 89350 88262 87836 87594 86855 85391 83507 81638 80045 78755 77563 76147 74352
54863 74352 72393 70684 69491 68800 68421 68148 67837 67430 66915 66300 65673 65280 65433 66249 67459 68458 68603 67680
54845 67680 66150 64766 63768 62708 61303 60182 60273 61549 62910 63381 62945 62168 61572 61626 62708 64569 66231
54828 66231 66931 66988 67314 68276 69527 70740 71988 73373 74760 75987 77029 77862 78490 79188 80474 82661
54812 82661 85532 88532 91216 93583 96105 99430 103900 109396 115659 122666 130557 139468 149637 161478
54798 161478 175167 190238 205892 221600 237087 251717 264292 273519 278449 278553 273864 265212 254017
$$ packed form
54904B38215J4982J1963P021J208m506r529j3364j5495j5787j4870j3789j3149
54892A72900j2662j1603r609p152n261m758n458o173n740m148k437j477j232j263
54878I3927j397j598j582j088m26k42p39j464j884j869j593j290j192j416j795
54863G4352j959j709j193o91l79k73l11m07n15o15o27l93J53Q16J210R99J45r23
54845F7680j530j384r98j060j405j121R1J276J361M71m36p77n96N4J082J861J662
54828F6231P00N7L26R62J251J213J248J385J387J227J042Q33O28O98J286K187
54812H2661K871L000K684K367K522L325M470N496O263P007P891Q911J0169J1841
54798A61478J3689J5071J5654J5708J5487J4630J2575R227M930J04m689q652j1195
$$ plain form
54785 254017 241548 228568 215655 203530 192756 183334 174833 166880 159383 152484 146469 141639 138039
54772 138039 135388 133403 132086 131594 131922 132925 134590 136994 140025 143389 147047 151430 157021 163836 171580
54757 171580 180365 191020 204445 220747 239104 258425 277837 296455 313013 326039 334448 337792
54745 337792 336045 329373 318211 303426 286289 268232 250479 233682 217854 202832 188889 176723
54733 176723 166740 158511 151213 144489 138558 133456 128635 123654 118990 115630 113793 112508 110623 107896
54719 107896 104879 102109 99814 98144 97157 96623 96189 95779 95490 95208 94747 94362 94628 95661 96905 97846 98512
54702 98512 99049 99226 98793 98068 97771 98364 99713 101277 102427 102758 102318 101521 100757 100227 100119 100564 101323 101865
54684 101865 101954 101797 101472 100724 99628 98962 99428 100782 102301 103783 105566 107698 109764 111526 113241 115206
$$ packed form
54785B54017j2469j2980j2913j2125j0774r422q501p953p497o899o015m830l600
54772A38039k651j985j317m92L28J003J665K404L031L364L658M383N591O815P744
54757A71580Q785J0655J3425J6302J8357J9321J9412J8618J6558J3026Q409L344
54745C37792j747o672j1162j4785j7137j8057j7753j6797j5828j5022j3943j2166
54733A76723r983q229p298o724n931n102m821m981m664l360j837j285j885k727
54719A07896l017k770k295j670r87n34m34m10k89k82m61l85K66J033J244R41O66
54702I8512N37J77m33p25k97N93J349J564J150L31m40p97p64n30j08M45P59N42
54684A01865Q9j57l25p48j096o66M66J354J519J482J783K132K066J762J715J965
$$ plain form
54668 115206 117357 119435 121332 123215 125433 128286 131753 135592 139705 144093 148328 151568 153484 154726
54654 154726 156046 157377 158387 159496 161525 164530 167792 170936 174355 178525 183568 189564 196609 204469
54640 204469 212777 221564 230961 240293 248225 253913 257274 257949 254955 247882 237752 226132 213892 201291
54626 201291 188699 176574 165157 154802 146306 140238 136060 132506 128816 125177 122044 119492 117402
54613 117402 115893 115358 116045 117669 119500 120949 122068 123306 124837 126356 127509 128198 128415 128071 127062
54598 127062 125290 122642 119281 115888 113128 110873 108457 105731 103287 101465 99784 97643 95104 92681
54584 92681 90814 89804 89703 89983 89831 89106 88430 88004 87015 84767 81770 79061 76962 75185 73725 72864
54568 72864 72595 72762 73586 75319 77528 79330 80281 80545 80414 80210 80427 81314 82432 83238 83889 84849 85896
$$ packed form
54668A15206K151K078J897J883K218K853L467L839M113M388M235L240J916J242
54654A54726J320J331J010J109K029L005L262L144L419M170N043N996P045P860
54640B04469Q308Q787R397R332P932N688L361O75k994p073j0130j1620j2240j2601
54626B01291j2592j2125j1417j0355q496o068m178l554l690l639l133k552k090
54613A17402j509n35O87J624J831J449J119J238J531J519J153O89K17l44j009
54598A27062j772k648l361l393k760k255k416k726k444j822j681k141k539k423
54584I2681j867j010j01K80j52p25o76m26r89k248k997k709k099j777j460q61
54568G2864k69J67Q24J733K209J802R51K64j31k04K17Q87J118Q06O51R60J047
$$ plain form
54551 85896 86302 85964 85630 85922 86734 87601 88121 88052 87625 87739 89182 91612 94007 96095 98563 101784 105294
54534 105294 108826 112950 118120 123710 128724 132972 136934 140729 143813 145586 145873 144811 142598 139350
54520 139350 135064 129809 124014 118367 113351 109000 105151 101673 98437 95353 92543 90183 88151 86111
54506 86111 84046 82376 81510 81558 82422 83745 84726 84497 82857 80377 77824 75914 75421 76686 78829 80277
54490 80277 80428 80158 80353 80754 80787 80725 81149 81843 82141 82091 82392 83311 84465 85646 87090 88833 90408 91346
54472 91346 91534 91054 90137 89286 88968 89080 89143 89039 89149 89684 90391 91017 91618 92205 92417 91800 90245 88105 86097
54453 86097 84974 84834 84785 83756 81786 80061 79530 79911 80297 80238 79896 79519 79194 78893 78418 77491 76212 75262
54435 75262 75243 75972 76793 77449 78219 79197 79893 79804 79061 78279 77877 77812 77920 78274 79012 79943 80567 80665 80711 81445 83034
$$ packed form
54551H5896M06l38l34K92Q12Q67N20o9m27J14J443K430K395K088K468L221L510
54534A05294L532M124N170N590N014M248L962L795L084J773K87j062k213l248
54520A39350m286n255n795n647n016m351l849l478l236l084k810k360k032k040
54506H6111k065j670q66M8Q64J323R81k29j640k480k553j910m93J265K143J448
54490H0277J51k70J95M01L3o2M24O94K98n0L01R19J154J181J444J743J575R38
54472I1346J88m80r17q51l18J12O3j04J10N35P07O26O01N87K12o17j555k140k008
54453H6097j123j40m9j029j970j725n31L81L86n9l42l77l25l01m75r27j279r50
54435G5262j9P29Q21O56P70R78O96q9p43p82m02o5J08L54P38R31O24R8M6P34J589
$$ plain form
54414 83034 84828 86060 86556 86685 86840 87193 87828 88842 90257 92014 94065 96421 99105 102122 105421 108776
54398 108776 111767 114023 115519 116605 117837 119741 122520 125802 128837 131145 132879 134365 135479 135863
54384 135863 135627 135307 135046 134267 132441 129778 126872 123991 121141 118571 116654 115248 113626 111217 108139
54369 108139 104892 101849 99245 97378 96457 96286 96351 96282 96080 95860 95526 94884 94024 93365 93191 93272 93165 92887
54351 92887 92990 93896 95434 97188 99013 100927 102746 104256 105607 107092 108622 109887 111071 112858 115581
54336 115581 118799 121923 124717 126977 128278 128569 128525 128701 128632 127420 124989 122033 118861 115115 110826 106887
54320 106887 103980 101606 98737 95147 91553 88548 85957 83310 80577 78231 76712 76005 75657 75142 74185
54305 74185 72817 71237 69737 68678 68300 68463 68695 68560 67964 67068 66102 65354 65227 66111 68056 70567 72728
$$ packed form
54414H3034J794J232M96J29J55L53O35J014J415J757K051K356K684L017L299L355
54398A08776K991K256J496J086J232J904K779L282L035K308J734J486J114L84
54384A35863k36l20k61p79j826k663k906k881k850k570j917j406j622k409l078
54369A08139l247l043k604j867r21j71O5o9k02k20l34o42q60o59j74Q1j07k78
54351I2887J03R06J538J754J825J914J819J510J351J485J530J265J184J787K723
54336A15581L218L124K794K260J301K91m4J76o9j212k431k956l172l746m289l939
54320A06887k907k374k869l590l594l005k591k647k733k346j519p07l48n15r57
54305G4185j368j580j500j059l78J63K32j35n96q96r66p48j27Q84J945K511K161
$$ plain form
54288 72728 73694 73259 71928 70373 68859 67345 66010 65342 65623 66530 67366 67601 67166 66425 65899 65857 66050 65969
54270 65969 65418 64699 64219 64134 64456 65203 66283 67414 68407 69438 70798 72473 74143 75492 76317 76396 75554
54253 75554 74011 72478 71691 71769 72119 72072 71587 71215 71376 71901 72465 73192 74426 75942 76861 76584 75498 74504
54235 74504 74078 74030 74027 74026 74182 74548 74918 74904 74215 72967 71675 70858 70692 70982 71329 71303 70683 69719 69023 69039 69603
54214 69603 70116 70139 69851 69996 71269 73473 75359 75645 74309 72570 71593 71559 72049 72729 73342 73592 73594 74142 75936
54195 75936 78674 81369 83352 84531 84903 84452 83511 82587 81767 80833 80011 79956 80756 81529 81426 80699 80369 81019
54177 81019 82225 83057 82926 82022 81079 80638 80523 80191 79597 79332 79846 80882 81859 82436 82436 81630 80049 78335
54159 78335 77292 77101 77255 77253 77098 77172 77881 79320 80998 81916 81367 79798 78573 78643 79692 80718 81251 81667
$$ packed form
54288G2728R66m35j331j555j514j514j335o68K81R07Q36K35m35p41n26m2J93q1
54270F5969n51p19m80q5L22P47J080J131R93J031J360J675J670J349Q25P9q42
54253G5554j543j533p87P8L50m7m85l72J61N25N64P27J234J516R19k77j086r94
54235G4504m26m8ljJ56L66L70j4o89j248j292q17j66K90L47k6o20r64o96J6N64
54214F9603N13K3k88J45J273K204J886K86j336j739r77l4M90O80O13K50KN48J794
54195G5936K738K695J983J179L72m51r41r24q20r34q22n5Q00P73j03p27l30O50
54177H1019J206Q32j31r04r43m41j15l32n94k65N14J036R77N77%q06j581j714
54159G8335j043j91J54kj55P4P09J439J678R18n49j569j225P0J049J026N33M16
$$ plain form
54141 81667 82427 83425 84161 84307 83947 83412 83012 82813 82600 82150 81703 81893 82950 84158 84551 84074 83567 83518 83417
54122 83417 82601 81194 79738 78356 76904 75643 75045 75040 75090 75004 74993 74975 74546 73775 73232 72952 72200 70685 69300
54103 69300 69050 69810 70804 71736 72678 73299 73220 72952 73469 74783 75771 75650 74882 74339 74210 74077 73489 72068 69596
54084 69596 66555 64242 63739 64834 66305 67159 67286 67056 66757 66535 66528 66837 67401 68020 68554 69094 69872 70916
54066 70916 71859 72278 72182 71967 71930 72085 72389 72760 72800 72034 70678 69768 70108 71420 72912 74381 76178 78218
54048 78218 79724 80135 79821 79671 80252 81572 83386 85435 87463 89242 90678 91899 93187 94740 96489
54033 96489 98273 100256 102897 106317 110018 113546 117272 121994 127861 134191 140328 146074 151191 155209
54019 155209 158185 161104 164900 169330 173377 176547 179159 181453 183132 184038 184697 185711 186901 187512 187264
$$ packed form
54141H1667P60R98P36J46l60n35m00j99k13m50m47J90J057J208L93m77n07m9j01
54122H3417q16j407j456j382j452j261n98nN0q6j1j8m29p71n43k80p52j515j385
54103F9300k50P60R94R32R42O21p9k68N17J314R88j21p68n43j29j33n88j421k472
54084F9596l041k313n03J095J471Q54J27k30k99k22pL09N64O19N34N40P78J044
54066G0916R43M19r6k15l7J55L04L71M0p66j356r10L40J312J492J469J797K040
54048G8218J506M11l14j50N81J320J814K049K028J779J436J221J288J553J749
54033I6489J784J983K641L420L701L528L726M722N867O330O137N746N117M018
54019A55209K976K919L796M430M047L170K612K294J679R06O59J014J190O11k48
$$ plain form
54004 187264 186863 187240 188471 189609 189668 188551 186943 185466 184184 182861 181273 179134 176154 172500 168997
53989 168997 166448 164842 163500 161883 159957 157920 155988 154406 153251 152191 150828 149302 148178 147687
53975 147687 147489 147227 146839 146208 145089 143670 142718 142661 142945 142721 141926 141192 140916 140923 140886 140608 140013 139344 139302 140481
53955 140481 142615 144836 146689 148412 150251 152079 153904 156200 159341 163088 166949 170786 174763 178998
53941 178998 183601 188784 194607 200751 206874 213012 219315 225550 231249 236216 240444 243564 244801 243672
53927 243672 240489 236054 231095 226027 220997 215962 210922 206218 202525 200383 199768 200229 201367 203137 205699
53912 205699 209013 212584 215699 218063 220201 223055 227116 232035 237103 241945 246672 251510 256449 261155
53898 261155 265083 267735 268970 269132 268834 268557 268409 268114 267233 265521 263224 260900 258793 256420 252967 248118
$$ packed form
54004A87264m01L77J231J138N9j117j608j477j282j323j588k139k980l654l503
53989A68997k549j606j342j617j926k037j932j582j155j060j363j526j124m91
53975A47687j98k62l88o31j119j419r52n7K84k24p95p34k76Pl7k78n95o69m2J179
53955A40481K134K221J853J723J839J828J825K296L141L747L861L837L977M235
53941A78998M603N183N823O144O123O138O303O235N699M967M228L120J237j129
53927B43672l183m435m959n068n030n035n040m704l693k142o15M61J138J770K562
53912B05699L314L571L115K364K138K854M061M919N068M842M727M838M939M706
53898B61155L928K652J235J62k98k77j48k95q81j712k297k324k107k373l453m849
$$ plain form
53882 248118 242372 236520 230977 225739 220773 216180 211944 207731 203121 198012 192773 188005 184160 181229
53868 181229 178604 175373 171064 166241 162162 159630 158225 156825 154751 152245 149897 147912 146006 143770
53854 143770 140990 137759 134423 131373 128760 126454 124279 122202 120327 118862 118085 118053 118258 117923 116852
53839 116852 115753 115375 115541 115401 114473 113002 111392 109764 108149 106617 105016 103019 100732 98883 98085
53824 98085 98144 98413 98573 98727 98930 99088 99266 99686 100367 101091 101755 102474 103290 104082 104848 105788 106971 108196 109285
53805 109285 110342 111540 112900 114455 116474 119240 122669 126365 130070 133878 137901 141873 145279 147911
53791 147911 150146 152512 155073 157483 159657 162028 164930 167997 170537 172340 173751 175145 176763 178953
53777 178953 181911 185027 187104 187610 187259 187042 187012 186483 185090 183185 181313 179774 178587 177552 176324 174759
$$ packed form
53882B48118n746n852n543n238m966m593m236m213m610n109n239m768l845k931
53868A81229k625l231m309m823m079k532j405j400k074k506k348j985j906k236
53854A43770k780l231l336l050k613k306k175k077j875j465p77l2K05l35j071
53839A16852j099l78J66j40r28j471j610j628j615j532j601j997k287j849p98
53824I8085N9K69J60J54K03J58J78M20O81P24O64P19Q16P92P66R40J183J225J089
53805A09285J057J198J360J555K019K766L429L696L705L808M023L972L406K632
53791A47911K235K366K561K410K174K371K902L067K540J803J411J394J618K190
53777A78953K958L116K077N06l51k17l0n29j393j905j872j539j187j035j228j565
$$ plain form
53761 174759 173087 171536 170020 168481 167203 166217 164651 161528 157248 153532 151542 150695 149689 148070 146215
53746 146215 144249 141850 139026 136359 134296 132687 131230 130007 129269 128980 128872 128850 129058 129538 130037 130251
53730 130251 130175 130144 130547 131533 132903 134174 134813 134614 133917 133340 133169 133128 132834 132307 131797 131241 130241 128617
53712 128617 126678 124884 123486 122603 122301 122424 122602 122709 123101 124091 125374 126325 126835 127492 128907 131153 133910
53695 133910 136862 139760 142391 144702 146880 149081 151161 152867 154257 155741 157634 159802 161805 163390
53681 163390 164778 166515 168989 172025 174979 177402 179628 182486 186236 189967 192418 193350 193718 194351 194946
53666 194946 194742 193844 193207 193297 193388 192448 190305 187636 185167 183270 182104 181615 181378 180803 179634 178044 176322
53649 176322 174719 173524 172894 172536 171906 170919 170126 169960 170156 170255 170392 171045 172142 172997 173252 173365 173823 174409
$$ packed form
53761A74759j672j551j516j539j278r86j566l123m280l716j990q47j006j619j855
53746A46215j966k399k824k667k063j609j457j223p38k89j08k2K08M80M99K14
53730A30251p6l1M03R86J370J271O39j99o97n77j71m1k94n27n10n56j000j624
53712A28617j939j794j398q83l02J23J78J07L92R90J283R51N10O57J415K246K757
53695A33910K952K898K631K311K178K201K080J706J390J484J893K168K003J585
53681A63390J388J737K474L036K954K423K226K858L750L731K451R32L68O33N95
53666A94946k04q98o37R0R1r40k143k669k469j897j166m89k37n75j169j590j722
53649A76322j603j195o30l58o30r87p93j66J96R9J37O53J097Q55K55J13M58N86
$$ plain form
53631 174409 174696 174963 175953 177733 179433 180347 180840 181789 183444 185185 186316 186785 187200 188296 190269 192441
53615 192441 193813 194223 194724 196472 199434 202634 205528 208490 211858 215179 217768 219644 221493 223983 227382
53600 227382 231592 236229 240836 245296 249876 254627 259030 262592 265514 268360 271228 273780 276015 278431
53586 278431 281303 284310 287093 289761 292559 295362 297885 300220 302834 305988 309408 312493 314736 315977
53572 315977 316514 317010 318093 319887 321971 323920 325853 328263 331318 334566 337516 340282 343302 346471 349068
53557 349068 350709 351968 353696 356026 358455 360721 363154 366163 369787 373789 377863 381727 385297 388842
53543 388842 392699 396797 400626 403706 405859 407158 408001 409221 411556 414802 417907 420181 422058 424384
53529 424384 427309 430296 433008 435709 438843 442582 446837 451430 456158 460859 465566 470570 476302 483081
$$ packed form
53631A74409K87K67R90J780J700R14M93R49J655J741J131M69M15J096J973K172
53615A92441J372M10N01J748K962L200K894K962L368L321K589J876J849K490L399
53600B27382M210M637M607M460M580M751M403L562K922K846K868K552K235K416
53586B78431K872L007K783K668K798K803K523K335K614L154L420L085K243J241
53572C15977N37M96J083J794K084J949J933K410L055L248K950K766L020L169K597
53557C49068J641J259J728K330K429K266K433L009L624M002M074L864L570L545
53543C88842L857M098L829L080K153J299Q43J220K335L246L105K274J877K326
53529D24384K925K987K712K701L134L739M255M593M728M701M707N004N732O779
$$ plain form
53515 483081 490843 499124 507493 516065 525421 535981 547641 560103 573238 586949 600961 615067
53503 615067 629427 644393 660161 676759 694234 712586 731661 751369 771901 793494 815950
53492 815950 838626 860845 882305 903237 924228 945643 967108 987912 1008091 1028631 1050173
53481 1050173 1071957 1092630 1111789 1130073 1148023 1165721 1183507 1202057 1221423 1240727 1259181
53470 1259181 1276847 1294014 1310449 1325750 1339968 1353311 1365552 1376311 1385669 1394024 1401479 1407821
53458 1407821 1412942 1416832 1419295 1420128 1419512 1417790 1414877 1410245 1403467 1394482 1383407 1370556 1356597 1342240
53444 1342240 1327636 1312412 1296332 1279634 1262622 1245288 1227433 1208879 1189490 1169294 1148716
53433 1148716 1128426 1108789 1089657 1070802 1052233 1033996 1015995 998316 981572 966622 953954
$$ packed form
53515D83081P762Q281Q369Q572R356J0560J1660J2462J3135J3711J4012J4106
53503F15067J4360J4966J5768J6598J7475J8352J9075J9708K0532K1593K2456
53492H15950K2676K2219K1460K0932K0991K1415K1465K0804K0179K0540K1542
53481A050173K1784K0673J9159J8284J7950J7698J7786J8550J9366J9304J8454
53470A259181J7666J7167J6435J5301J4218J3343J2241J0759R358Q355P455O342
53458A407821N121L890K463Q33o16j722k913m632o778q985j1075j2851j3959j4357
53444A342240j4604j5224j6080j6698j7012j7334j7855j8554j9389k0196k0578
53433A148716k0290j9637j9132j8855j8569j8237j8001j7679j6744j4950j2668
$$ plain form
53422 953954 943456 934708 927317 921006 915537 910642 906095 901920 898457 896056 894800 894706 896082 899325
53408 899325 904323 910392 916887 923638 930711 938175 946341 955897 967398 980762 995438 1010926 1026963
53395 1026963 1043530 1061012 1080123 1101287 1124212 1148378 1173787 1200844 1229643 1259857 1291331
53384 1291331 1324279 1358713 1394120 1429960 1466227 1503275 1541336 1580433 1620546 1661590 1703280
53373 1703280 1745222 1787122 1828689 1869428 1908724 1946228 1981990 2016133 2048476 2078628 2106412
53362 2106412 2131950 2155138 2175197 2191126 2202746 2211004 2216975 2220723 2221333 2217880 2210034 2197914 2181864
53349 2181864 2162475 2140468 2116322 2090216 2062360 2033172 2003017 1972003 1940061 1906943 1872157
53338 1872157 1835423 1797487 1760083 1724665 1691328 1659304 1628230 1598494 1570413 1543616 1517344
$$ packed form
53422I53954j0498q748p391o311n469m895m547m175l463k401j256r4J376L243
53408H99325M998O069O495O751P073P464Q166R556J1501J3364J4676J5488J6037
53395A026963J6567J7482J9111K1164K2925K4166K5409K7057K8799L0214L1474
53384A291331L2948L4434L5407L5840L6267L7048L8061L9097M0113M1044M1690
53373A703280M1942M1900M1567M0739L9296L7504L5762L4143L2343L0152K7784
53362B106412K5538K3188K0059J5929J1620Q258N971L748O10l453p846j2120j6050
53349B181864j9389k2007k4146k6106k7856k9188l0155l1014l1942l3118l4786
53338A872157l6734l7936l7404l5418l3337l2024l1074k9736k8081k6797k6272
$$ plain form
53327 1517344 1491067 1464711 1438606 1413353 1389559 1367577 1347535 1329533 1313504 1298888 1284852
53316 1284852 1271120 1258391 1247703 1239453 1233191 1228174 1223777 1219360 1214156 1207631 1199967 1191929 1184166
53303 1184166 1176739 1169461 1162572 1156796 1152667 1150006 1148288 1147326 1147355 1148478 1150419 1152900 1155987 1159852 1164365
53288 1164365 1169195 1174280 1179970 1186691 1194644 1203867 1214407 1226296 1239414 1253467 1268128 1283196
53276 1283196 1298702 1314897 1331954 1349550 1366853 1383108 1398281 1412846 1426918 1439821 1450731
53265 1450731 1459495 1466589 1472390 1476899 1480170 1482568 1484318 1485088 1484277 1481633 1477370 1471783 1464993 1457029
53251 1457029 1447954 1437876 1426954 1415363 1403122 1389989 1375719 1360451 1344652 1328624 1312174
53240 1312174 1294874 1276673 1258283 1240941 1225601 1212235 1199976 1188054 1176418 1165309 1154570
$$ packed form
53327A517344k6277k6356k6105k5253k3794k1982k0042j8002j6029j4616j4036
53316A284852j3732j2729j0688q250o262n017m397m417n204o525p664q038p763
53303A184166p427p278o889n776m129k661j718r62K9J123J941K481L087L865M513
53288A164365M830N085N690O721P953R223J0540J1889J3118J4053J4661J5068
53276A283196J5506J6195J7057J7596J7303J6255J5173J4565J4072J2903J0910
53265A450731Q764P094N801M509L271K398J750P70q11k644m263n587o790p964
53251A457029r075j0078j0922j1591j2241j3133j4270j5268j5799j6028j6450
53240A312174j7300j8201j8390j7342j5340j3366j2259j1922j1636j1109j0739
$$ plain form
53229 1154570 1143810 1133102 1122946 1113418 1103932 1094146 1084666 1076341 1069076 1061906 1054285 1046894 1040926
53216 1040926 1036754 1033493 1029818 1025153 1020055 1015480 1011742 1008267 1004297 999528 993890 987032 978401 967834
53202 967834 955747 942668 928785 914042 898519 882608 866925 852026 838068 824651 811097
53191 811097 796952 782201 767112 752014 737092 722153 706578 689738 671540 652384 632678
53180 632678 612675 592777 573531 555145 537375 520128 503778 488543 473930 459314 444892
53169 444892 431501 419576 408752 398498 388661 379307 370482 362305 354862 347821 340494 332540 324315
53156 324315 316388 309076 302615 297304 293004 288832 283844 277958 271862 266191 261187 256980 253665 251064
53142 251064 248827 246833 245180 243725 242006 239724 237082 234540 232484 231100 230322 229864 229610 229961 231459
$$ packed form
53229A154570j0760j0708j0156r528r486r786r480q325p265p170p621p391n968
53216A040926m172l261l675m665n098m575l738l475l970m769n638o858q631j0567
53202I67834j2087j3079j3883j4743j5523j5911j5683j4899j3958j3417j3554
53191H11097j4145j4751j5089j5098j4922j4939j5575j6840j8198j9156j9706
53180F32678k0003j9898j9246j8386j7770j7247j6350j5235j4613j4616j4422
53169D44892j3391j1925j0824j0254r837r354q825q177p443p041p327p954q225
53156C24315p927p312o461n311m300m172m988n886o096n671n004m207l315k601
53142B51064k237j994j653j455j719k282k642k542k056j384p78m58k54L51J498
$$ plain form
53127 231459 234037 237028 240019 243167 246442 249033 250016 249422 248146 246889 245522 243497 240554 236902 232862
53112 232862 228489 223609 218268 213060 208745 205464 202521 199131 195234 191392 188091 185335 182813 180221
53098 180221 177464 174719 172332 170528 169251 168251 167262 166096 164798 163683 162961 162292 161072 159305 157778
53083 157778 157088 156846 156231 155007 153593 152385 151466 150813 150288 149540 148413 147384 147103 147529 147995 148142 148227
53066 148227 148394 148242 147428 146289 145479 145223 145195 145036 144764 144730 145228 146110 146801 146862 146443 146024 145849 145876 146036 146122
53046 146122 145617 144241 142646 141882 142049 142158 141573 140884 140930 141566 142005 141951 141740 141591 141374 141063 140912 141127 141621
53027 141621 142059 141949 140907 139146 137502 136633 136328 135911 135146 134371 133918 133779 133812 133907 134009 134223 134750 135502
53009 135502 136010 136061 136169 136964 138298 139447 140082 140515 141093 141868 142809 143749 144162 143600 142436 141625 141632 142182 143135
$$ packed form
53127B31459K578K991K991L148L275K591R83n94j276j257j367k025k943l652m040
53112B32862m373m880n341n208m315l281k943l390l897l842l301k756k522k592
53098A80221k757k745k387j804j277j000r89j166j298j115p22o69j220j767j527
53083A57778o90k42o15j224j414j208r19o53n25p48j127j029k81M26M66J47Q5
53066A48227J67j52q14j139q10k56k8j59k72l4M98Q82O91O1m19m19j75K7J60Q6
53046A46122n05j376j595p64J67J09n85o89M6O36M39n4k11j49k17l11j51K15M94
53027A41621M38j10j042j761j644q69l05m17p65p75m53j39L3R5J02K14N27P52
53009A35502N08N1J08P95J334J149O35M33N78P75R41R40M13n62j164q11PN50R53
$$ plain form
52990 143135 144869 147490 150300 152507 154049 155341 156625 157994 159668 161826 164456 167662 171705 176326
52976 176326 180479 183294 185010 186410 187707 188592 189121 189670 190018 189293 187137 184313 181852 180006 178364
52961 178364 176617 174876 173456 172639 172468 172559 172280 171337 170105 169238 169055 169320 169435 168773 167134 165081 163604
52944 163604 163176 163243 162855 161687 160260 159248 158797 158519 157954 156979 155885 155075 154688 154593 154725 155259 156305 157634
52926 157634 158925 160212 161825 163856 165856 167153 167453 167109 166878 167348 168539 169995 171228 172029 172470 172855
52910 172855 173663 175159 176859 177695 177072 175564 174249 173542 173086 172619 172316 172276 172240 172053 171974 172240 172686 173096
52892 173096 173635 174649 176229 178214 180369 182252 183249 183179 182723 182846 183834 185174 186275 186985 187524 188234 189353
52875 189353 190716 191724 191932 191643 191576 192044 192856 193950 195589 197814 200222 202494 204755 207180 209637 212000
$$ packed form
52990A43135J734K621K810K207J542J292J284J369J674K158K630L206M043M621
52976A76326M153K815J716J400J297Q85N29N49L48p25k156k824k461j846j642
52961A78364j747j741j420q17j71R1k79r43j232q67j83K65J15o62j639k053j477
52944A63604m28O7l88j168j427j012m51k78n65r75j094q10l87r5J32N34J046J329
52926A57634J291J287J613K031K000J297L00l44k31M70J191J456J233Q01M41L85
52910A72855Q08J496J700Q36o23j508j315p07m56m67l03m0l6j87p9K66M46M10
52892A73096N39J014J580J985K155J883R97p0m56J23R88J340J101P10N39P10J119
52875A89353J363J008K08k89o7M68Q12J094J639K225K408K272K261K425K457K363
$$ plain form
52859 212000 214458 217183 219954 222423 224568 226580 228477 230159 231672 233105 234327 235139 235648 236187 236898
52844 236898 237636 238235 238649 238829 238695 238250 237514 236381 234705 232586 230340 228174 226010 223698 221271 218961
52828 218961 217013 215522 214293 212900 211010 208746 206678 205371 204866 204570 203699 201933 199679 197649 196174
52813 196174 194980 193566 191651 189284 186743 184356 182266 180382 178745 177823 178059 179117 180043 180316 180280 180302
52797 180302 180073 179184 177897 176775 175798 174505 172858 171303 170021 168733 167340 166169 165418 164858 164247 163591
52781 163591 162759 161286 158946 156307 154373 153717 154076 154631 154663 154125 153647 153795 154349 154557 154017 152911 151375
52764 151375 149240 146648 144383 143115 142586 141967 140837 139393 137883 136285 134590 133003 131661 130345 128631
52749 128631 126384 124095 122611 122335 122691 122562 121367 119457 117489 115698 114003 112480 111440 111129 111554
$$ packed form
52859B12000K458K725K771K469K145K012J897J682J513J433J222Q12N09N39P11
52844B36898P38N99M14J80j34m45p36j133j676k119k246k166k164k312k427k310
52828B18961j948j491j229j393j890k264k068j307n05k96q71j766k254k030j475
52813A96174j194j414j915k367k541k387k090j884j637r22K36J058R26K73l6K2
52797A80302k29q89j287j122r77j293j647j555j282j288j393j171p51n60o11o56
52781A63591q32j473k340k639j934o56L59N55L2n38m78J48N54K08n40j106j536
52764A51375k135k592k265j268n29o19j130j444j510j598j695j587j342j316j714
52749A28631k247k289j484k76L56j29j195j910j968j791j695j523j040l11M25
$$ plain form
52734 111554 112404 113040 112867 111994 111205 111010 111012 110611 110007 109941 110589 111373 111843 112159 112526 112797 112873 112987 113234 113242 112804
52713 112804 112529 113324 115323 117828 120220 122461 124606 126373 127467 128005 128309 128474 128423 128183 127778 126951 125369
52696 125369 123083 120478 117721 114703 111575 108917 107044 105482 103470 100839 98111 95875 94417 93791
52682 93791 93824 94073 94138 93980 93659 92889 91362 89476 88117 87505 86831 85414 83760 83008 83509 84374 84351 82887
52664 82887 80511 78483 77869 78657 79772 80220 79991 79659 79359 78678 77535 76608 76680 77811 79371 80713 81644
52647 81644 82279 82675 82760 82635 82698 83261 84127 84907 85661 86776 88111 88859 88619 88050 87946 88127 87916 87366 87164
52628 87164 87418 87479 87112 86939 87275 87266 85883 83404 81274 80560 80986 81424 81004 79764 78467 77834 77853 77926 77672
52609 77672 77335 77281 77484 77763 78182 78799 79251 79132 78682 78605 79154 79924 80679 81832 83695 85676 86755 86696 86326
$$ packed form
52734A11554Q50O36j73q73p89j95Km01o04o6O48P84M70L16L67K71P6J14K47Qm38
52713A12804k75P95J999K505K392K241K145J767J094N38L04J65n1k40m05q27j582
52696A25369k286k605k757l018l128k658j873j562k012k631k728k236j458o26
52682I3791L3K49O5j58l21p70j527j886j359o12o74j417j654p52N01Q65k3j464
52664H2887k376k028o14P88J115M48k29l32l00o81j143r27P2J131J560J342R31
52647H1644O35L96Q5j25O3N63Q66P80P54J115J335P48k40n69j04J81k11n50k02
52628H7164K54O1l67j73L36rj383k479k130p14M26M38m20j240j297o33J9P3k54
52609G7672l37n4K03K79M19O17M52j19m50p7N49P70P55J153J863J981J079n9l70
$$ plain form
52590 86326 86526 87321 88042 88084 87274 85826 84310 83551 84106 85686 87294 88134 88310 88561 89441 90828 92167
52573 92167 93119 93993 95521 98021 100820 102782 103466 103512 103756 104319 104815 105076 105280 105586 106120 107194 109058
52556 109058 111464 113840 115851 117332 117837 116977 115367 114519 115423 117699 120402 123096 125655 127590 128376
52541 128376 128256 128042 128137 128288 128257 128162 128088 127916 127748 128066 129218 131008 132986 134821 136273 137054 137028 136411 135578
52522 135578 134771 134100 133667 133501 133478 133394 133102 132605 132191 132410 133577 135203 136286 136368 135966 135726 135509 134784 133639
52503 133639 132816 132746 133079 133244 133076 132720 132358 132188 132331 132469 131944 130595 129225 128813 129392 130130 130447 130567
52485 130567 130945 131685 132733 134226 136177 138031 138982 138743 137814 136970 136763 137466 139097 141274 143263 144418
52469 144418 144577 143968 142919 141878 141550 142581 144926 147726 150016 151464 152310 152812 153030 153091 153323 154023 155230
$$ packed form
52590H6326K00P95P21M2q10j448j516p59N55J580J608Q40J76K51Q80J387J339
52573I2167R52Q74J528K500K799J962O84M6K44N63M96K61K04L06N34J074J864
52556A09058K406K376K011J481N05q60j610q48R04K276K703K694K559J935P86
52541A28376j20k14R5J51l1r5p4j72j68L18J152J790J978J835J452P81k6o17q33
52522A35578q07o71m33j66k3q4k92m97m14K19J167J626J083Q2m02k40k17p25j145
52503A33639q23p0L33J65j68l56l62j70J43J38n25j349j370m12N79P38L17J20
52485A30567L78P40J048J493J951J854R51k39r29q44k07P03J631K177J989J155
52469A44418J59o09j049j041l28J031K345K800K290J448Q46N02K18O1K32P00J207
$$ plain form
52452 155230 156767 158327 159523 160158 160619 161716 163801 166202 167835 168286 168069 167953 168374 169424 170945 172469
52436 172469 173470 173941 174457 175498 176886 178082 178685 178385 176755 173663 169811 166422 164235 163087 162459
52421 162459 162043 161648 160959 159696 157849 155559 152956 150407 148644 148177 148560 148677 147969 147055 146910 147664 148598
52404 148598 149161 149512 150015 150685 151366 152115 153030 153895 154361 154443 154496 154759 155191 155713 156311 156853 157122 157112 157034 156998
52384 156998 156936 156917 157209 157948 158980 160147 161414 162655 163658 164461 165340 166274 166866 167064 167520 168839 170784
52367 170784 172708 174520 176693 179406 182182 184461 186168 187611 189026 190350 191400 192347 193948 196915
52353 196915 200992 205075 208496 211682 215194 218757 221835 224618 227546 230289 232228 233767 236002 239016
52339 239016 241615 243070 244073 245498 247165 248520 249744 251364 253255 254824 255901 256837 257977 259547
$$ packed form
52452A55230J537J560J196O35M61J097K085K401J633M51k17j16M21J050J521J524
52436A72469J001M71N16J041J388J196O03l00j630l092l852l389k187j148o28
52421A62459m16l95o89j263j847k290k603k549j763m67L83J17p08r14j45P54R34
52404A48598N63L51N03O70O81P49R15Q65M66Q2N3K63M32N22N98N42K69j0p8l6
52384A56998o2j9K92P39J032J167J267J241J003Q03Q79R34N92J98M56J319J945
52367A70784J924J812K173K713K776K279J707J443J415J324J050R47J601K967
52353A96915M077M083L421L186L512L563L078K783K928K743J939J539K235L014
52339B39016K599J455J003J425J667J355J224J620J891J569J077R36J140J570
$$ plain form
52325 259547 261727 264287 266490 267971 269465 272033 275736 279645 283019 285859 288412 290850 293448 296507
52311 296507 299938 303367 306705 310207 313888 317362 320444 323594 327572 332867 339433 346763 354217 361559
52297 361559 369176 377557 386689 396287 406432 417462 429351 441747 454673 468523 483231 498069
52285 498069 512598 527266 542699 558928 575784 593539 612458 631945 650957 669328 688040
52274 688040 707893 728328 747890 765621 781737 797107 812388 827612 842314 855928 868196
52263 868196 879327 889710 899430 908110 915348 921190 926014 929938 932611 933689 933377 932242 930627 928437
52249 928437 925499 921885 917896 913889 910147 906692 903156 899028 894187 889151 884691 881301 879102 878104
52235 878104 878327 879714 882147 885750 891035 898560 908330 919655 931632 943696 955673 967525 979332
$$ packed form
52325B59547K180K560K203J481J494K568L703L909L374K840K553K438K598L059
52311B96507L431L429L338L502L681L474L082L150L978N295O566P330P454P342
52297C61559P617Q381R132R598J0145J1030J1889J2396J2926J3850J4708J4838
52285D98069J4529J4668J5433J6229J6856J7755J8919J9487J9012J8371J8712
52274F88040J9853K0435J9562J7731J6116J5370J5281J5224J4702J3614J2268
52263H68196J1131J0383R720Q680P238N842M824L924K673J078l12j135j615k190
52249I28437k938l614l989m007l742l455l536m128m841n036m460l390k199r98
52235H78104K23J387K433L603N285P525R770J1325J1977J2064J1977J1852J1807
$$ plain form
52222 979332 991465 1004378 1018014 1031532 1043782 1054023 1062165 1068550 1073610 1077599 1080514 1082307 1083167
52209 1083167 1083329 1082555 1080075 1075313 1068475 1060243 1051104 1041200 1030506 1018749 1005326 989877 973004
52196 973004 956002 939729 924017 908285 892419 876865 862122 848388 835595 823525 811877
52185 811877 800391 789088 778409 768969 760918 753547 745799 737290 728620 720647 713746 707920 703134
52172 703134 699148 695376 691424 687605 684449 681845 679219 676393 673708 671386 669355 667665 666438 665305
52158 665305 663556 661004 658121 655242 652311 649561 647636 646609 645611 643961 642002 640238 638271 635417
52144 635417 631958 628881 626560 624473 622165 619742 617390 615086 612892 610917 608884 606311 603294 600555
52130 600555 598488 596624 594320 591537 588613 585651 582602 579728 577526 576128 575048 573571 571333 568540
$$ packed form
52222I79332J2133J2913J3636J3518J2250J0241Q142O385N060L989K915J793Q60
52209A083167J62p74k480m762o838q232r139r904j0694j1757j3423j5449j6873
52196I73004j7002j6273j5712j5732j5866j5554j4743j3734j2793j2070j1648
52185H11877j1486j1303j0679r440q051p371p748q509q670p973o901n826m786
52172G03134l986l772l952l819l156k604k626k826k685k322k031j690j227j133
52158F65305j749k552k883k879k931k750j925j027r98j650j959j764j967k854
52144F35417l459l077k321k087k308k423k352k304k194j975k033k573l017k739
52130F00555k067j864k304k783k924k962l049k874k202j398j080j477k238k793
$$ plain form
52116 568540 565699 563171 560953 558908 557106 555774 555017 554751 554907 555504 556539 558067 560376 563814 568358
52101 568358 573592 579173 585110 591516 598394 605873 614373 624242 635339 647262 659899 673507 688271
$$ packed form
52116E68540k841k528k218k045j802j332p57k66J56N97J035J528K309L438M544
52101E68358N234N581N937O406O878P479Q500R869J1097J1923J2637J3608J4764
$$ [...]
##END NTUPLES=NMR SPECTRUM
##END=
