
##TITLE=AC1299_CHIAH12111_6534668_LnVXKvkR13
##JCAMPDX= 6.0         $$ Bruker NMR JCAMP-DX V2.0
##DATA TYPE= NMR SPECTRUM
##DATA CLASS= NTUPLES
##ORIGIN= BRUKER
##OWNER= Administrator
$$ 1.72 TOPSPIN		Version 2.1
$$ 2012-07-17 15:58:45.312 -0500  Administrator@TOPSPIN
$$ Compression mode = diff/dup
##.OBSERVE FREQUENCY= 400.02188249412
##.OBSERVE NUCLEUS= ^1H
##.ACQUISITION MODE= SIMULTANEOUS (DQD)
##.ACQUISITION SCHEME= undefined
##.AVERAGES= 8
##.DIGITISER RES= 22
##SPECTROMETER/DATA SYSTEM= spect
##.PULSE SEQUENCE= zg30
##.SOLVENT NAME= COFFEE_meoh
##.SHIFT REFERENCE= INTERNAL, COFFEE_meoh, 1, 14.98509
##AUDIT TRAIL= $$ (NUMBER, WHEN, WHO, WHERE, PROCESS, VERSION, WHAT)
$$ ##TITLE= Audit trail, TOPSPIN		Version 2.1
$$ ##JCAMPDX= 5.01
$$ ##ORIGIN= Bruker BioSpin GmbH
$$ ##OWNER= Administrator
$$ $$ C:\Bruker\TOPSPIN/data/COFFEE/nmr/AC1299_CHIAH12111_6534668_LnVXKvkR13/10/pdata/1/auditp.txt
$$ ##AUDIT TRAIL=  $$ (NUMBER, WHEN, WHO, WHERE, PROCESS, VERSION, WHAT)
(   1,<2012-07-17 15:58:37.750 -0500>,<Administrator>,<TOPSPIN>,<go>,<TOPSPIN 2.1>,
      <created by zg
	started at 2012-07-17 15:57:24.062 -0500,
	POWCHK enabled, PULCHK disabled,
       configuration hash MD5:
       6B 1B 68 BB D9 2E 58 E2 7F 35 AD 54 07 DF 0E 41
       data hash MD5: 64K
       63 AD FC E3 70 7E A1 88 03 2A 25 30 2E F8 E3 9C>)
(   2,<2012-07-17 15:58:41.031 -0500>,<Administrator>,<TOPSPIN>,<proc1d>,<TOPSPIN 2.1>,
      <Start of raw data processing
       efp LB = 0 FT_mod = 6 PKNL = 1 PHC0 = 0 PHC1 = 0 SI = 32K 
       data hash MD5: 32K
       24 8E 80 F3 73 15 34 49 62 13 B1 3A 6C 61 4A 67>)
(   3,<2012-07-17 15:58:41.406 -0500>,<Administrator>,<TOPSPIN>,<proc1d>,<TOPSPIN 2.1>,
      <pk PHC0 = 176.3855 PHC1 = 0 
       data hash MD5: 32K
       74 AA 13 AB 6A 5D 7E 83 C8 16 09 44 96 0A 67 1B>)
(   4,<2012-07-17 15:58:41.468 -0500>,<Administrator>,<TOPSPIN>,<proc1d>,<TOPSPIN 2.1>,
      <abs ABSG = 1 
       data hash MD5: 32K
       C4 6D 37 0D C1 5F 7A 14 B7 25 D3 21 19 C8 06 D1>)
(   5,<2012-07-17 15:58:41.500 -0500>,<Administrator>,<TOPSPIN>,<proc1d>,<TOPSPIN 2.1>,
      <abs ABSG = 2 
       data hash MD5: 32K
       66 78 27 AF 0C 33 E1 65 0D CC 24 87 F6 03 64 7A>)
(   6,<2012-07-17 15:58:41.531 -0500>,<Administrator>,<TOPSPIN>,<proc1d>,<TOPSPIN 2.1>,
      <abs ABSG = 3 
       data hash MD5: 32K
       E4 56 64 D7 B9 CE AB 28 6C F5 E9 B9 25 06 0C 0B>)
(   7,<2012-07-17 15:58:41.562 -0500>,<Administrator>,<TOPSPIN>,<proc1d>,<TOPSPIN 2.1>,
      <abs ABSG = 4 
       data hash MD5: 32K
       1B CF 32 4C 79 F4 3F 0C 64 8B 34 CA 85 46 55 ED>)
(   8,<2012-07-17 15:58:41.593 -0500>,<Administrator>,<TOPSPIN>,<proc1d>,<TOPSPIN 2.1>,
      <abs ABSG = 5 
       data hash MD5: 32K
       D9 1B 13 35 D7 3B 2E 57 68 80 D6 51 4E 19 2D 07>)
$$ ##END=
$$ 
$$ $$ hash MD5
$$ $$ EB 2F A7 26 3E AE 22 8F 28 4C CD 7F 63 CB 61 33
##$RELAX= 
##$RELAX= 
##$RELAX= 
##$RELAX= 
##$RELAX= 
##$RELAX= 
##$RELAX= 
$$ Bruker specific parameters
$$ --------------------------
$$ [...]
##$TP= (0..7)
150 150 150 150 150 150 150 150
##$TP07= 0
##$TPNAME0= <>
##$TPNAME1= <>
##$TPNAME2= <>
##$TPNAME3= <>
##$TPNAME4= <>
##$TPNAME5= <>
##$TPNAME6= <>
##$TPNAME7= <>
##$TPOAL= (0..7)
0.5 0.5 0.5 0.5 0.5 0.5 0.5 0.5
##$TPOFFS= (0..7)
0 0 0 0 0 0 0 0
##$TUNHIN= 0
##$TUNHOUT= 0
##$TUNXOUT= 0
##$USERA1= <user>
##$USERA2= <user>
##$USERA3= <user>
##$USERA4= <user>
##$USERA5= <user>
##$V9= 5
##$VALIST= <valist>
##$VCLIST= <CCCCCCCCCCCCCCC>
##$VD= 0
##$VDLIST= <DDDDDDDDDDDDDDD>
##$VPLIST= <PPPPPPPPPPPPPPP>
##$VTLIST= <TTTTTTTTTTTTTTT>
##$WBST= 2048
##$WBSW= 25
##$XGAIN= (0..3)
0 0 0 0
##$XL= 0
##$YL= 0
##$YMAX_a= 514355
##$YMIN_a= -657950
##$ZGOPTNS= <>
##$ZL1= 120
##$ZL2= 120
##$ZL3= 120
##$ZL4= 120
##$ABSF1= 14.98509
##$ABSF2= -5.573092
##$ABSG= 5
##$ABSL= 3
##$ALPHA= 0
##$AQORDER= 0
##$ASSFAC= 0
##$ASSFACI= 0
##$ASSFACX= 0
##$ASSWID= 0
##$AUNMP= <proc_prof1d_extract_pilot.lims>
##$AXLEFT= 0
##$AXNAME= <>
##$AXNUC= <1H>
##$AXRIGHT= 0
##$AXTYPE= 0
##$AXUNIT= <>
##$AZFE= 0.1
##$AZFW= 0.1
##$BCFW= 0
##$BC_mod= 0
##$BYTORDP= 0
##$COROFFS= 0
##$CY= 15
##$DATMOD= 1
##$DC= 0
##$DFILT= <>
##$DTYPP= 0
##$F1P= 0
##$F2P= 0
##$FCOR= 0.5
##$FTSIZE= 32768
##$FT_mod= 6
##$GAMMA= 0
##$GB= 0
##$INTBC= 1
##$INTSCL= 1
##$ISEN= 128
##$LB= 0
##$LEV0= 0
##$LPBIN= 0
##$MAXI= 10000
##$MC2= 0
##$MEAN= 0
##$ME_mod= 0
##$MI= 0
##$NCOEF= 0
##$NC_proc= -8
##$NLEV= 6
##$NOISF1= 0
##$NOISF2= 0
##$NSP= 0
##$NTH_PI= 0
##$NZP= 0
##$OFFSET= 14.98509
##$PC= 1
##$PHC0= 176.3855
##$PHC1= 0
##$PH_mod= 1
##$PKNL= yes
##$PPARMOD= 0
##$PPDIAG= 0
##$PPIPTYP= 0
##$PPMPNUM= 2147483647
##$PPRESOL= 1
##$PSCAL= 4
##$PSIGN= 0
##$PYNMP= <proc.py>
##$REVERSE= no
##$SF= 400.02
##$SI= 32768
##$SIGF1= 0
##$SIGF2= 0
##$SINO= 400
##$SIOLD= 32768
##$SPECTYP= <>
##$SREGLST= <1H.CDCl3>
##$SSB= 0
##$STSI= 32768
##$STSR= 0
##$SW_p= 8223.68421052631
##$SYMM= 0
##$S_DEV= 0
##$TDeff= 65536
##$TDoff= 0
##$TI= <>
##$TILT= no
##$TM1= 0
##$TM2= 0
##$TOPLEV= 0
##$USERP1= <user>
##$USERP2= <user>
##$USERP3= <user>
##$USERP4= <user>
##$USERP5= <user>
##$WDW= 1
##$XDIM= 32768
##$YMAX_p= 477348515
##$YMIN_p= -714978
##$CURPLOT= <Network HP LaserJet P1505>
##$CURPRIN= <$Network HP LaserJet P1505>
##$DFORMAT= <normdp>
##$LAYOUT= <+/1D_H.xwp>
##$LFORMAT= <normlp>
##$PFORMAT= <normpl>
##$SURQMSG= 1
$$ End of Bruker specific parameters
$$ ---------------------------------
##NTUPLES= NMR SPECTRUM
##VAR_NAME=  FREQUENCY,     SPECTRUM/REAL,   SPECTRUM/IMAG
##SYMBOL=    X,             R,               I
##VAR_TYPE=  INDEPENDENT,   DEPENDENT,       DEPENDENT
##VAR_FORM=  AFFN,          ASDF,            ASDF
##VAR_DIM=   32768,         32768,           32768
##UNITS=     HZ,            ARBITRARY UNITS, ARBITRARY UNITS
##FACTOR=    0.250966925370066, 1,           1
##FIRST=     8223.43324360094, -30757,       20893
##LAST=      0,             -121241,         -42926
##MIN=       0,             -714978,         0
##MAX=       8223.43324360094, 477348515,    0
$$ Real data points
##PAGE= N=1
##DATA TABLE= (X++(R..R)), XYDATA
$$ [...]
$$ plain form
19490 -145918 -8245 -162566 -109821 -283542 11514 -395840 -24954 -220145 132823 35272 -143811
19478 37619 74550 156785 118859 160585 76877 97341 200927 -70121 -77285 152457 -272638
19466 43053 -153830 31782 -23992 -9309 -142718 -17592 -180045 -312878 -51888 -223798 10548
19454 109631 -77760 -15754 -14703 -401832 67166 157597 273155 -145457 82059 -514782 192395
19442 134233 -357346 -174379 -113049 -432035 302444 -341686 -29780 80327 -43338 -406080
19432 -406080 168527 157239 -161580 12183 160894 355522 -63944 -338660 44360 84645
19422 84645 112458 152887 -5386 -248980 -58406 -112724 -299362 -22406 18171 128073 -145395
19410 -74428 -262730 -28048 -78166 -75032 54670 -308906 -58570 -45821 -175820 -287356 163379
$$ packed form
19490a45918h245j54321N2745j73721A1514c95840b4954j95191A32823C5272a43811
19478C7619L6931Q2235l7926M1726G6877K0464J03586g0121p164A52457b72638
19466D3053a53830C1782b3992i309j33409a7592j62453j32833e1888j71910A0548
19454A09631g7760a5754J051l87129F7166R0431J15558a45457H2059e14782A92395
19442A34233c57346a74379O1330l18986C02444c41686b9780H0327d3338l62742
19432d06080A68527j1288a61580A2183J48711J94628f3944k74716D4360M0285
19422H4645K7813M0429e386k43594e8406n4318j86638b2406A8171J09902a45395
19410g4428j88302b8048n0118L134E4670c08906e8570J2749j29999j11536A63379
$$ plain form
19398 -71412 -32257 -55995 224353 -11251 -191906 30142 -45398 -63486 -52292 357472 -173524
19386 -249904 -149334 34087 -144690 -201369 120080 -149177 138561 -407890 56672 -340497
19375 -156483 -15050 -214903 10418 -59199 316878 -287504 -370180 -110894 4835 -191459 -140268
19364 -140268 -340397 -164106 248205 36794 -92872 -133527 37031 -128019 -97867 252911
19353 178589 -158834 56126 -162938 -227434 56578 123728 -2462 201293 266004 -88212 81194
19341 166519 -8565 -183139 203248 -171271 -112296 -19245 -143629 -138147 -174898 -366691 36779
19329 -255286 -225622 -392590 108836 -182761 109798 -202530 187015 -73328 50549 -127401
19318 -161847 120196 -129045 -274085 -94448 -270103 247542 -255432 41055 232695 180356
$$ packed form
19398g1412c2257k3738B24353a1251j80655C0142d5398j8088J1194C57472a73524
19386b49904J00570C4087a44690n6679A20080a49177A38561d07890E6672c40497
19375a56483a5050j99853A0418e9199C16878b87504q2676a10894D835a91459N1191
19364a40268k00129a64106B48205C6794i2872m0655C7031a28019L0152B52911
19353A78589a58834E6126a62938o4496E6578O7150b462B01293O4711h8212H1194
19341A66519h565j74574B03248a71271N8975a9245j24384N482l6751j91793C6779
19329b55286K9664j66968A08836a82761A09798b02530A87015g3328E0549a27401
19318a61847A20196a29045j45040i4448j75655B47542b55432D1055J91640n2339
$$ plain form
19308 180356 82534 -282528 -301856 180415 -125571 290370 -303086 2164 -237829 -295329
19298 -295329 -98531 -184003 215279 -74605 -141020 -172363 122041 -298567 -151389 34364 -71923
19286 17460 -35167 -19912 -368422 -51326 -119044 -5372 -201370 -215484 100452 -377 106941
19274 -183455 -377275 -55029 22965 176901 -97862 164222 282218 49686 -242714 -399734
19264 -399734 -323848 210971 -77969 -104901 214373 -188514 -105911 -266659 -110560 175131
19253 154619 -160058 -334422 100173 89146 -17837 186949 11053 -31069 -171480 -38733
19242 231786 -87350 78106 251385 -26767 29171 -31588 -18538 -88045 -213463 -159828 -59153
19230 -234092 -175166 -229902 -146864 -173728 110321 -161208 -338722 -234612 -77510 -298023
$$ packed form
19308A80356H2534b82528j9328A80415a25571B90370c03086B164b37829n7500
19298b95329i8531q5472B15279g4605o6415l1343A22041b98567J47178C4364g1923
19286A7460c5167J5255l48510e1326o7718e372j95998j4114A00452c77A06941
19274a83455j93820e5029B2965J53936i7862A64222J17996D9686b42714j57020
19264c99734P5886B10971g7969k6932B14373a88514Q2603j60748a10560A75131
19253A54619a60058j74364A00173j1027a7837A86949A1053c1069j40411c8733
19242B31786h7350G8106J73279b6767B9171c1588J3050o9507j25418N3635e9153
19230b34092N8926n4736Q3038k6864A10321a61208j77514J04110g7510k20513
$$ plain form
19220 -298023 -166528 4841 375219 -251464 -165985 -173417 -25253 -252317 12154 56557 55127
19209 55127 -260716 69013 -129832 -112890 -73143 -72628 223971 -67806 -352201 223827 -21128
19197 -96443 -3435 -79667 38848 -316485 -95660 -55932 146012 -60489 137594 -30442 -61479
19186 -61479 -109141 -21638 58369 -267156 40089 -124520 -247085 -314098 147475 -23957 -268948
19175 -268948 -504645 -100198 -321720 271941 -63122 -26388 -152456 11494 14445 170799
19165 170799 -348035 186854 112922 23135 -282073 95233 -162782 -67121 -202842 -178975
19155 -178975 -212458 -243858 105788 217898 95759 -139964 278463 256994 -42164 -239326
19145 -239326 44816 94575 141505 -222123 8399 308616 148607 -98105 -6793 -64949 29555
$$ packed form
19220b98023J31495D841L70378b51464Q5479p432b5253k27064A2154M4403j430
19209E5127b60716F9013a29832J6942L9747N15B23971f7806k84395B23827b1128
19197i6443c435p6232C8848c16485i5660L9728A46012f0489A37594c0442l1037
19186f1479m7662b1638E8369b67156D0089a24520j22565o7013A47475b3957k44991
19175b68948k35697a00198k21522B71941f3122b6388j26068A1494K951J56354
19165A70799c48035A86854p3932B3135b82073I5233a62782f7121j35721K3867
19155a78975l3483l1400A05788J12110I5759a39964B78463k1469d2164j97162
19145b39326D4816M9759M6930b22123H399L00217A48607i8105f793n8156B9555
$$ plain form
19133 63769 262398 -294013 -32422 197884 182244 288405 -266281 37991 -171262 50731
19122 385175 -110645 126743 -45240 -162319 147370 -345797 260053 -63984 -219820 -16808
19111 30087 -209502 80533 -189484 -115261 53913 87812 -308990 -78539 53643 -357193 -324755
19100 -324755 -18937 -214518 52424 -271514 -51219 26961 -171367 -207445 -33093 -143391 113646
19088 53526 -449027 -212880 12482 -17082 215868 104021 -160173 14422 59376 237239
19078 237239 137436 -223914 -138009 -322864 -10569 -436466 135227 -391250 -52968 38162
19067 -32283 169147 30389 -7218 21811 28701 109891 -22398 -88359 166282 101826 -109435
19055 15245 -179562 97883 -144700 109518 128954 -300195 -196992 -274575 212957 -247572
$$ packed form
19133F3769J98629b94013c2422A97884j5640J06161b66281C7991a71262E0731
19122C85175a10645A26743d5240j17079A47370c45797B60053f3984j55836a6808
19111C0087b09502H0533a89484P4223E3913L3899c08990g8539E3643c57193L2438
19100c24755a8937j95581E2424b71514e1219B6961a71367l6078c3093j10298A13646
19088E3526d49027b12880A2482a7082B15868A04021a60173A4422M4954J77863
19078B37239r9803b23914Q5905j84855a0569m25897A35227c91250e2968C8162
19067c2283A69147C0389g218B1811O890Q1190b2398o5961A66282o4456a09435
19055A5245a79562I7883a44700A09518J9436c00195J03203p7583B12957b47572
$$ plain form
19044 119709 208434 -83361 15682 -161470 -65418 -30495 -317266 -4137 -52482 101824 -75568
19032 -247026 126474 120416 372745 -165425 61845 159138 151627 -10327 -30329 53410 30586
19021 30586 272937 -127245 -189444 47630 282754 -35784 193495 -18661 -463809 133089
19010 -115247 -138879 41546 -186556 -119119 -17570 -75832 -198703 16133 215010 -452028 -146702
18998 285053 -192522 78764 316431 -59249 4323 -93400 52913 -110335 231409 -252539 -150927
18987 -150927 126343 -33938 237647 129911 -159493 -24414 -25916 -6691 -115389 -12487 25204
18975 127973 -182645 9800 -15315 -262213 201395 108173 117181 -43214 -63576 -61611 61923
18963 -20194 -383610 -261930 36270 -219020 -51228 -109090 -150004 258322 -4101 -324838 -421741
$$ packed form
19044A19709Q8725h3361A5682a61470f5418c0495k86771d137m8345A01824g5568
19032b47026A26474o058K52329a65425F1845R7293p511a0327k0002E3410k2824
19021C0586K42351a27245o2199D7630K35124c5784A93495a8661m45148A33089
19010a15247k3632D1546a86556O7437a7570n8262j22871A6133J98877d52028a46702
18998B85053a92522G8764K37667e9249D323i3400E2913a10335B31409b52539J01612
18987a50927A26343c3938B37647j07736a59493b4414j502f691j08698a2487B5204
18975A27973a82645I800a5315k46898B01395r3222R008d3214k0362J965F1923
18963b0194l63416J21680C6270b19020e1228n7862m0914B58322d101l20737r6903
$$ plain form
18952 -421741 43279 28824 -210006 115155 -17078 -11096 25361 -261074 -141694 -117534 -116053
18941 -116053 203508 -14912 -428157 161723 -149241 -215733 -45057 219953 -94020 -324625
18931 -324625 -317848 -234411 -37162 5774 340134 80789 343236 -21872 -150024 -98142 -154376
18920 -154376 425601 -201414 66817 -204973 32516 252303 73483 -191635 -119126 -73784
18910 -73784 44076 12929 77458 67023 -101789 -20912 -36089 -83489 78622 110186 -43831
18898 360799 -64350 140784 145315 -149630 28333 -13538 144059 -157288 -56879 36433 -175713
18886 306606 -380550 -268448 -8330 -151654 -205296 -196055 252204 -354162 -289767 580 -264456
18874 262438 86713 -193790 149247 -119374 -140594 -25870 -74480 -95838 -460639 141513
$$ packed form
18952d21741D3279j4455b10006A15155a7078N982B5361b61074J19380K4160J481
18941a16053B03508a4912m13245A61723a49241o6492d5057B19953i4020k30605
18931c24625O777Q3437c7162E774L34360H0789K62447b1872j28152N1882n6234
18920a54376D25601b01414F6817b04973C2516K19787G3483a91635P2509M5342
18910g3784D4076A2929O4529j0435a01789b0912j5177m7400G8622L1564d3831
18898C60799f4350A40784M531a49630B8333a3538A44059a57288e6879C6433a75713
18886C06606c80550J12102h330j43324n3642R241B52204c54162O4395E80b64456
18874B62438H6713a93790A49247a19374k1220b5870m8610k1358l64801A41513
$$ plain form
18863 126272 -120443 -326447 -143346 -119632 292775 332287 -148277 -25414 260104 151936
18853 151936 -90324 -181077 -104594 107550 -61298 -33319 16122 57566 76633 -86490 -140702
18842 -140702 -431412 -81549 50531 185256 -109844 -32343 -137823 -294692 290403 -16194
18831 -284560 250956 52315 -26602 -146115 -81496 -43077 -143304 78184 -156594 -307872
18821 -307872 -95873 65519 189545 -206949 -68117 32637 181359 14799 -198040 172890
18810 -151965 397693 151875 91900 248082 316469 -120446 66302 -141608 -62458 -134503
18800 -134503 14070 -187833 60883 -40223 253720 -150124 -271755 -258263 -100041 -114931
18790 -114931 -90008 145190 -152620 54334 -226741 -76255 -110498 2207 90315 79976 24622
$$ packed form
18863A26272a20443k06004a43346K3714B92775L9512a48277b5414B60104j08168
18853A51936i0324r0753P6483A07550f1298K7979A6122M1444J9067h6490n4212
18842a40702k90710h1549E0531J34725a09844c2343j05480j56869B90403a6194
18831b84560B50956E2315b6602j19513O4619L8419j00227G8184a56594j51278
18821c07872i5873F5519J24026b06949f8117C2637J48722A4799a98040A72890
18810a51965C97693A51875n9975J56182O8387a20446F6302a41608f2458p2045
18800a34503A4070a87833F0883d0223B53720a50124j21631J3492a00041j4890
18790a14931K4923A45190a52620E4334b26741g6255l4243B207Q8108j0339B4622
$$ plain form
18778 10743 3878 124820 160764 -128761 80668 -32300 -815 -36979 -165295 -77373 56020 29650
18766 29650 107942 -36633 -136853 -25915 -61328 -378030 -115514 183527 201531 -45385 -93966
18755 -93966 13747 -27468 158803 -227855 -68462 -82432 245494 43629 -110140 114137 -235599
18743 -1264 -15316 90020 285080 -373563 97301 8703 -129058 230750 152025 88488 -117927
18731 102582 -66204 -39164 -198110 -155762 -204532 90684 -3413 4623 -1201 -29931 -45526 -52146
18719 -52146 -412374 -208690 177906 -30240 -169660 -191845 -152302 -47517 88316 -240484 -29639
18707 -75353 -194574 -220157 70305 142840 -177039 -68092 -91517 -156834 -315949 29396 -362237
18695 -64033 -177400 276071 294949 -31734 -426002 72814 255283 59355 167450 -224278
$$ packed form
18778A0743C878J20942L5944a28761H0668c2300h15l6164j28316g7373E6020k6370
18766B9650P8292c6633j00220b5915l5413l16702a15514A83527J8004d5385m8581
18755i3966A3747b7468A58803b27855f8462j3970B45494D3629a10140A14137b35599
18743a264j4052I0020J95060c73563I7301H703a29058B30750p8725o3537a17927
18731A02582f6204K7040j58946M2348m8770I0684c413D623a201k8730j5595o620
18719e2146l60228K03684A77906c0240j39420k2185L9543d7517H8316b40484b9639
18707g5353j19221k5583G0305P2535a77039f8092k3425o5317j59115B9396c62237
18695f4033j13367B76071J8878c1734l94268G2814J82469E9355J08095b24278
$$ plain form
18684 138351 -128514 169927 -326604 -143839 15420 11690 -109370 167419 -247413 -186672
18674 -186672 -336074 -23617 -73596 -240389 -297198 -77210 65192 -263409 -55516 152357 -161625
18662 -340620 122855 -83382 82533 -215565 -271088 -140516 -369499 37870 -184123 -46062
18651 -23603 -287574 138757 195847 52657 -279094 183507 63604 -337055 -197815 -119640
18641 -119640 -41379 -256467 -487254 -277480 271044 -198475 382923 -95576 -105311 -133371
18631 -133371 114479 60688 86644 -6551 -103003 -123942 -38685 -94997 -140927 158943 -48760
18619 -333 -315995 -24435 -265573 92386 -286532 -1078 417483 -55508 -199028 -38091 -69264
18608 -69264 225554 -166321 -77290 -198691 -29028 -158107 -211866 -56009 -331124 -226787
$$ packed form
18684A38351a28514A69927c26604a43839A5420l730a09370A67419b47413O0741
18674a86672j49402b3617m9979j66793n6809g7210F5192b63409e5516A52357a61625
18662c40620A22855h3382H2533b15565n5523J30572k28983C7870a84123d6062
18651b3603k63971A38757N7090E2657b79094A83507F3604c37055J39240P8175
18641a19640d1379k15088k30787K09774B71044a98475C82923i5576r735k8060
18631a33371A14479n3791K5956f551r6452k0939c8685n6312m5930A58943d8760
18619c33l15662b4435k41138I2386b86532a078D17483e5508j43520c8091l1173
18608f9264B25554a66321g7290j21401b9028j29079n3759e6009k75115J04337
$$ plain form
18598 -226787 9744 166501 -120432 -237335 -243255 -41577 -102206 162336 -40114 106420 86686
18587 86686 41759 266643 70199 -224822 -84354 108293 55548 -171827 -322349 129121
18576 281276 32779 -52016 104103 -61708 -9855 260562 36735 3278 -165484 -42860 -233772
18565 -233772 -159559 -38007 61701 -140724 250315 -121321 -88092 -155259 -296369 -394983 21497
18553 -257994 -414146 -16626 -471578 54121 229824 -100269 18207 -115212 -78442 -257170
18543 -257170 94348 3290 -139031 230630 -458703 -84899 -110565 8735 -54234 62330 177461
18532 177461 35358 35940 -59199 -15470 101873 -512008 260520 -33605 -29 -110562 -29491 -129617
18520 -129617 -17993 20741 -120497 -124643 230172 -16919 -199905 86843 -42787 -143189 111027
$$ packed form
18598b26787I744J56757a20432j16903n920d1577o0629A62336d0114A06420j9734
18587H6686D1759K24884G0199b24822h4354A08293n2745a71827j50522A29121
18576B81276C2779e2016A04103f1708i855B60562C6735C278a65484d2860j90912
18565b33772P4213c8007F1701a40724B50315a21321L3229o7167j41110r8614B1497
18553b57994j56152a6626m54952E4121J75703a00269A8207a15212L6770j78728
18543b57170I4348C290a39031B30630d58703h4899k5666H735e4234F2330J15131
18532A77461C5358N82e9199a5470A01873e12008B60520c3605b9j10533b9491j00126
18520a29617a7993B0741a20497m146B30172a6919j82986H6843d2787j00402A11027
$$ plain form
18508 -97817 -154166 -125689 29139 -163705 -69003 -46439 -117962 117201 -378458 86299 -430789
18496 -113276 -44819 -8601 319286 -152111 138723 -85410 57509 96773 -3208 81993 376457
18485 376457 199691 -145624 -353906 79397 -124384 -231879 122164 -205849 197982 -229958
18474 31111 294354 24598 -149684 -114909 154123 -59372 -129242 67478 -36319 -77005 48384
18462 47300 -32860 -11995 -123191 -408297 -16096 -355239 210295 -175575 -310145 68602
18451 -48065 -42828 -8106 -149864 -235096 300688 -110184 -2752 -122763 -396475 124245 20616
18439 -128343 -184326 -169204 46539 224860 -55043 95250 242759 -202904 -345993 73000 -140797
18427 -148051 76870 -295639 101206 -69742 -23302 -37022 323799 -128147 305447 -20989
$$ packed form
18508i7817n6349K8477B9139a63705f9003K2564p1523A17201c78458H6299d30789
18496a13276d4819h601C19286a52111A38723h5410E7509L9264c208H1993K94464
18485C76457j76766a45624k08282G9397a24384j07495A22164b05849A97982b29958
18474C1111K63243B4598a49684L4775A54123e9372o9870F7478c6319m0686D8384
18462D7300c2860a1995j11196k85106a6096l39143B10295a75575j34570F8602
18451d8065N237h106j41758q5232C00688a10184b752j20011k73712A24245B0616
18439a28343n5983J5122D6539J78321e5043I5250J47509b02904j43089G3000a40797
18427a48051G6870b95639A01206f9742b3302j3720C23799a28147C05447b0989
$$ plain form
18416 167689 102669 -163940 -108833 48653 -198648 24786 -35282 -7135 -155355 41917 -105185
18404 173505 80082 -49986 149431 3206 80893 148364 245218 187755 398690 -114817 -119464
18393 -119464 -166396 284855 -185075 -108075 163949 17461 -129863 -32441 -21220 157062
18382 185399 -153400 245454 19754 -205758 330916 260279 -18906 -108371 -75936 -199117
18372 -199117 120831 13403 67802 -257209 2339 -73741 -303025 147444 -21417 122851 91775
18361 91775 493585 -28235 191202 -21536 -445644 33219 -9691 157003 249177 -96603 155859
18349 86494 -88294 -15246 97577 -464811 -295362 203487 -188074 -86583 36942 -108727 -167940
18338 -167940 -123625 -75370 -121924 82818 -270321 -457253 -278085 -300810 158716 -32060 -243875
$$ packed form
18416A67689o5020a63940N5107D8653a98648B4786c5282g135j48220D1917a05185
18404A73505H0082d9986A49431C206P7687O7471R6854n7463K10935a14817m647
18393a19464m6932B84855a85075P7000A63949A7461a29863c2441J1221A57062
18382A85399a53400B45454A9754b05758C30916p0637a8906q9465L2435j23181
18372a99117A20831A3403N4399b57209B339g3741k29284A47444b1417A22851l1076
18361I1775M01810b8235A91202b1536m24108C3219i691A57003R2174i6603A55859
18349H6494h8294a5246I7577d64811J69449B03487a88074h6583C6942a08727n9213
18338a67940M4315M8255m6554H2818b70321j86932J79168k2725A58716c2060k11815
$$ plain form
18327 -243875 -165986 180206 -200404 -554336 15792 -72665 -104961 14855 -281650 215168
18316 40599 62987 -355832 130580 -132909 -7619 -161458 71061 -291840 4251 186557 -175686
18304 227742 -198487 -196029 5510 27261 -11704 -323101 64181 119341 248430 103503 -64586
18292 -250386 -76434 -226085 69741 -172895 -166222 -293764 -4556 81641 -79134 41173 148108
18281 148108 -285952 -229004 -28686 62321 -97346 -501524 -16344 11338 -340625 -145857 -36476
18269 83992 -82612 -103839 9503 -58922 154960 -144918 -220817 -159866 308416 -4427 -166600
18258 -166600 108748 -135428 -191577 169466 -147797 -240187 63013 -457644 129134 -97330
18247 -212884 -47801 132495 -166277 -54146 -308641 -29564 1613 -297505 -159867 -21802 -67663
$$ packed form
18327b43875P7889A80206b00404l53932A5792g2665l2296A4855b81650B15168
18316D0599K2388c55832A30580a32909g619j53839G1061b91840D251J82306a75686
18304B27742a98487K458E510K1751a1704l11397F4181N5160J29089A03503f4586
18292b50386g6434j49651F9741a72895O673j27542d556H1641g9134D1173J06935
18281A48108b85952N6948b8686F2321i7346m04178a6344A1338c40625a45857c6476
18269H3992h2612k1227I503e8922A54960a44918p5899O0951C08416d427j62173
18258a66600A08748a35428n6149A69466a47797r2390F3013d57644A29134i7330
18247b12884d7801A32495a66277e4146k54495b9564A613b97505J37638b1802m5861
$$ plain form
18236 -67663 144221 106785 -264918 93163 97623 -147314 77043 332 226479 -211537 67720
18224 5256 -102147 62061 397464 -90057 -90096 -55673 175257 -36187 6114 -289694 -7150 -127417
18212 -127417 46197 -20078 -75833 318320 -116062 -56413 -166644 242008 24856 384331
18202 384331 123539 -165210 176140 -46090 294524 -152958 -379380 -81851 194118 -124756
18191 -87423 -108098 -441714 190104 -26838 164968 -30743 75896 -363564 130323 -18293 85679
18179 -39907 -172821 -425250 -349383 -283182 198022 -74318 -227154 -243875 285848 134687
18168 137773 458182 -179112 -115170 -21671 -303005 -8684 90302 248454 108382 -217447
18157 -83259 132384 80584 10866 186138 123025 23786 283898 -134996 -124212 123522 -90203
$$ packed form
18236f7663A44221l7436b64918I3163M460a47314G7043C32K26147b11537F7720
18224E256a02147F2061L35403i0057l9L4423A75257c6187F114b89694g150j20267
18212a27417D6197b0078n5755C18320a16062e6413j10231B42008B4856L59475
18202C84331A23539a65210A76140d6090B94524a52958k26422h1851A94118a24756
18191h7423k0675l33616A90104b6838A64968c0743G5896c63564A30323a8293H5679
18179c9907j32914k52429P5867O6201A98022g4318j52836j6721B85848A34687
18168A37773L20409a79112O3942b1671k81334h684I0302J58152A08382b17447
18157h3259A32384n1800A0866J75272o3113B3786K60112a34996J0784A23522i0203
$$ plain form
18145 -275 238682 -118619 21152 -64233 5442 -192717 29819 -197256 -102765 -132044 -227940
18134 -227940 222175 276464 -11998 288473 -444317 -80410 175649 284282 -247745 -127187
18124 -127187 143826 -133189 -147587 -71274 -202985 293837 -109772 -7623 22906 -58137 52141
18112 -306357 248387 -367857 -255462 -109437 -113991 -292280 82013 -91886 -122875 -55202 -75496
18101 -75496 135202 22468 -249950 133788 292894 87305 143060 124733 13046 -77215 -13116
18089 -58258 247898 -30668 -477942 -196075 -323761 -166113 92362 -361510 59327 26468
18078 -183245 410012 16239 -166619 30961 -65995 76526 14391 -315234 -90167 147975 310591
18067 310591 -193503 428582 85145 262600 -61885 23692 80889 123951 -264121 -64799 -100515
$$ packed form
18145b75B38682a18619B1152f4233E442a92717B9819a97256R4491k9279r5896
18134b27940B22175N4289a1998B88473d44317h0410A75649J08633b47745J20558
18124a27187A43826a33189j4398g1274j31711B93837a09772g623B2906e8137E2141
18112c06357B48387c67857J12395a09437m554j78289H2013i1886l0989e5202k0294
18101g5496A35202B2468b49950A33788J59106H7305N5755j8327A3046g7215a3116
18089e8258B47898c0668m47274a96075j27686J57648I2362c61510E9327B6468
18078a83245D10012A6239a66619C0961f5995G6526A4391c15234i0167A47975J62616
18067C10591a93503D28582H5145J77455f1885B3692N7197M3062b64121f4799l5716
$$ plain form
18056 -100515 139659 1116 -114049 177279 12382 171948 -57825 190550 -204961 20050
18045 -443281 -136893 -66548 -129861 178112 -132638 7743 -126399 -250995 119697 111294 -90155
18033 -175092 182403 -470095 -291006 242363 103485 -107387 87664 -98119 118027 115392
18023 115392 -74940 -139989 172828 -40515 -75211 124356 73570 -222547 11000 -50391 60117
18011 136804 -59960 -21663 -83518 198149 -72666 104043 -103982 152213 20834 110256 -173023
17999 163078 -108912 -302451 138639 -197850 -87555 -175585 203042 -170087 21583 91880
17989 91880 -173007 -111636 -31301 25844 -213538 79040 -7613 -421693 89318 124908 227812
17978 227812 -78944 -95607 -167889 -30184 344938 14224 35089 -89177 242365 310628 -263571
$$ packed form
18056a00515A39659A116a14049A77279A2382J59566e7825A90550b04961B0050
18045d43281a36893f6548o3313A78112a32638G743a26399j24596A19697q403i0155
18033a75092A82403d70095J79089B42363A03485a07387H7664i8119A18027k635
18023A15392g4940o5049A72828d0515l4696A24356n0786b22547A1000e0391F0117
18011A36804e9960b1663o1855A98149g2666A04043a03982A52213B0834Q9422a73023
17999A63078a08912j93539A38639a97850h7555q8030B03042a70087B1583P0297
17989I1880a73007O1371c1301B5844b13538G9040g613m14080H9318L5590J02904
17978B27812g8944j6663p2282c0184C44938A4224K0865h9177B42365O8263b63571
$$ plain form
17966 36520 -2285 86811 -84374 61012 -296907 -110583 -69326 317611 -17195 -132999 -80988
17955 -80988 57959 -66574 127391 450 65550 86926 51288 313393 427506 85537 47356
17944 47356 265292 111319 -35754 -352015 -225724 22945 6830 148076 147874 101534 120221
17933 120221 -108107 89678 -61826 -67 112372 204542 43590 -46155 43273 -96891 19021 -148214
17920 -40528 -533584 116921 -177008 4129 82556 -325145 72436 -199516 -55920 -358119 -123406
17908 -404028 193743 184150 -131243 -173770 5315 -375367 149622 -47769 318007 56977 -96843
17896 86075 -67408 20709 -8424 61628 -181322 -76315 97172 -230106 17123 -106237 7431
17884 -11793 46357 31446 115816 18060 -162109 21605 -9320 13175 -118801 -323044 -117024
$$ packed form
17966C6520b285H6811h4374F1012b96907a10583M1257C17611a7195j15804N2011
17955h0988E7959f6574A27391D50O5100K1376l5638K62105J14113H5537l8181
17944D7356K17936A11319c5754l16261J26291B2945F830J41246k02m6340J8687
17933A20221a08107H9678f1826f7A12372R2170D3590d6155D3273i6891A9021a48214
17920d0528m93056A16921a77008D129P8427c25145G2436a99516e5920l02199a23406
17908d04028A93743r593a31243m2527E315c75367A49622d7769C18007E6977i6843
17896H6075f7408B0709h424F1628a81322g6315I7172b30106A7123a06237G431
17884a1793D6357j4911Q4370A8060a62109B1605i320A3175a18801k04243a17024
$$ plain form
17872 331588 63253 -105646 -242276 35986 -147419 152924 -115403 85860 147128 122152
17862 122152 1827 -364078 -60499 122655 -184903 -76963 128028 -19475 172489 129408 196712
17851 196712 -169728 -123550 76533 75690 -261812 -144837 69565 332786 -284999 260278 120649
17839 39360 -110656 -203144 -30791 -112070 126965 -65789 24406 -63481 150095 216667 153544
17828 153544 72208 -232220 26078 -23103 269023 169460 -267639 141828 76270 -8180 -382089
17817 -382089 -66417 132219 42000 -148978 -67850 25073 1098 11949 -29140 -204076 -142317
17806 -142317 52635 -216797 238256 -175756 357309 116373 -17929 -23707 54061 90188 -143087
17794 135898 163324 -150516 143630 -256344 15136 90494 -472247 -32930 80625 -63491 -138254
$$ packed form
17872C31588F3253a05646j36630C5986a47419A52924a15403H5860O1268k4976
17862A22152A827c64078f0499A22655a84903g6963A28028a9475A72489m3081O7304
17851A96712a69728M6178G6533q43b61812J16975F9565K63221b84999B60278A20649
17839C9360a10656r2488c0791q1279A26965f5789B4406f3481A50095O6572o3123
17828A53544G2208b32220B6078b3103B69023r9563b67639A41828o5558h180l73909
17817c82089f6417A32219D2000a48978f7850B5073A098J0851b9140j74936O1759
17806a42317E2635b16797B38256a75756C57309A16373a7929n778E4061L6127a43087
17794A35898K7426a50516A43630b56344A5136P5358d72247c2930H0625f3491p4763
$$ plain form
17783 -138254 255663 357378 -202257 -197899 -422363 -41652 -53252 -116895 -256890 -182555 -123759
17772 -123759 18192 129063 -225392 -79675 -260743 -24676 22309 284616 -265537 341072
17761 -10175 -6830 -97785 -92216 11701 157052 121147 6473 106808 230189 -38225 51601 184885
17749 184885 -105878 -282129 190439 15633 133391 232921 -122273 -161294 23473 130548
17739 130548 128476 74815 -128099 33405 51405 286947 -97696 -422208 109003 -111228 -74119
17728 -74119 96459 -266100 -196787 243152 189498 -279860 126813 92 73135 -92970 272532
17716 -117005 32395 191932 145641 345676 -3811 -115183 179635 -69544 135044 343730
17706 343730 99846 197945 -45474 -73258 -246855 1860 -87698 -116383 27645 -192501 -235158
$$ packed form
17783a38254B55663J01715b02257M358k24464d1652j1600o3643j39995P4335N8796
17772a23759A8192J10871b25392g9675j81068b4676B2309K62307b65537C41072
17761a0175L345r0955N569A1701J45351l5905F473J00335J23381c8225E1601J33284
17749A84885a05878j76251A90439A5633J17758R9530a22273l9021B3473J07075
17739A30548k072n3661a28099C3405J8000K35542i7696l24512A09003a11228L7109
17728g4119I6459b66100O9313B43152n3654b79860A26813I2P3043i2970B72532
17716a17005C2395J59537m6291K00035c811j11372A79635f9544A35044K08686
17706C43730I9846R8099d5474k7784j73597A860h7698k8685B7645a92501m2657
$$ plain form
17695 -235158 64495 -106093 -244052 -200662 -26752 116614 -33088 -141494 -283913 57003
17684 -43096 56335 65179 -126596 12325 -23078 -123461 224154 89327 221854 -33925 80600
17672 136861 21608 2675 209664 -133563 226732 -79677 37852 -7720 321389 84648 -169861
17660 -63799 -34739 -260995 63764 223710 -38790 -90663 193656 -47445 -96604 201088 118042
17649 118042 -121270 -27266 -178838 62605 201363 162019 -76932 -160489 -210218 15108 -57263
17637 -194251 20187 -103741 -26533 54438 -188839 -62698 -129473 23445 -106437 -43895 -386093
17626 -386093 5314 272615 251211 -36148 162800 -30714 -77384 82072 83016 235786 159769
17615 159769 -130672 159704 62908 -78455 -225920 -41969 9054 178297 308102 15293 -113121
$$ packed form
17695b35158F4495a06093j37959M3390b6752A16614c3088j08406j42419E7003
17684d3096E6335Q844a26596A2325b3078j00383B24154H9327J32527c3925H0600
17672A36861B1608B675K06989a33563B26732g9677C7852g720C21389H4648a69861
17660f3799K9060k26256F3764J59946c8790n1873A93656d7445m9159B01088q3046
17649A18042a21270b7266j51572F2605J38758l9344g6932q3557m9729A5108e7263
17637a94251B0187a03741b6533E4438a88839f2698o6775B3445a06437d3895l42198
17626c86093E314K67301k1404c6148A62800c0714m6670H2072R44J52770p6017
17615A59769a30672A59704F2908g8455j47465d1969I054J69243J29805A5293a13121
$$ plain form
17603 87034 117664 -61013 73500 -159904 204815 630851 44785 -202604 160145 319881
17593 319881 -385698 24088 13050 116868 123018 -215217 96037 -121811 -67466 -7725 -234680
17582 -234680 -144833 -62220 8230 97429 -141684 61576 67336 250222 -229965 -17977 -292714
17571 -292714 312823 69262 -210496 -2014 251888 27303 74532 54633 122339 -68581 -152091
17560 -152091 206043 26395 -112103 34942 242028 -139159 -16760 366125 -84101 236449
17549 194438 39860 140820 -7488 51550 -62913 33106 -84741 146391 373919 -73596 262561
17537 16089 115873 553540 -91717 32136 -154592 379309 304200 -67351 78536 168350 -6251
17525 209592 70530 344953 199327 -154552 375512 228302 387226 198539 121297 251881
$$ packed form
17603H7034L0630f1013G3500a59904B04815M26036D4785b02604A60145J59736
17593C19881c85698B4088j1038J03818O150b15217I6037a21811N4345g725k26955
17582b34680Q9847f2220H230Q9199a41684F1576N760J82886b29965a7977k74737
17571b92714C12823F9262b10496b014B51888B7303M7229j9899O7706f8581q3510
17560a52091B06043B6395a12103C4942K07086a39159a6760C66125h4101B36449
17549A94438C9860J00960g488E1550f2913C3106h4741A46391K27528g3596B62561
17537A6089R9784M37667i1717C2136a54592C79309p5109f7351G8536Q9814f251
17525B09592G0530K74423j45626a54552C75512j47210J58924j88687p7242J30584
$$ plain form
17515 251881 339193 111778 112981 167287 69371 5152 103791 335987 234682 283607 -57637
17503 -186623 -245117 294107 334784 151297 305894 -115570 104652 80218 299267 24712
17492 -102937 -48041 -61844 32560 242998 301498 -49141 233070 -133959 47336 -5012 44177
17480 -136496 248029 91481 216982 48980 30949 195359 130106 58106 -32962 186051 21452
17468 377789 3868 61423 -11030 185046 -329153 289958 -222752 25345 -75105 264492 392002
17457 392002 159298 340353 83419 -40759 10730 368958 71357 381985 184797 467274
17447 467274 74721 208045 173307 285749 402238 -102573 -7476 264503 47732 119660 363246
17436 363246 364284 142794 474784 179225 213220 271369 229657 417926 -74003 -104180 467272
$$ packed form
17515B51881Q7312A11778J203N4306F9371E152R8639K32196j01305M8925e7637
17503a86623n8494B94107M0677A51297J54597a15570A04652k4434K19049B4712
17492a02937d8041j3803C2560K10438N8500d9141B33070a33959D7336e012D4177
17480a36496B48029I1481J25501D8980j8031J64410o5253E8106c2962A86051B1452
17468C77789C868N7555a1030A85046c29153B89958b22752B5345g5105B64492J27510
17457C92002A59298J81055H3419d0759A0730L58228G1357L10628A84797K82477
17447D67274G4721J33324l4738J12442J16489a02573g476B64503D7732P1928K43586
17436C63246J038A42794L31990A79225L3995N8149m1712J88269g4003l0177D67272
$$ plain form
17424 321342 -84175 328078 347704 443899 382359 555296 255948 131630 224036 265345 209778
17413 209778 296347 253730 403760 16193 52131 143847 -175017 190273 208273 -84863 94329
17401 466714 241985 193541 290225 37233 190956 -100420 244277 84489 -65711 607148
17390 4680 -95631 307817 354691 325404 266471 -160209 342016 294058 379539 107246 147769
17379 147769 -22744 -206028 121507 -261821 -121342 185037 -264694 223667 -86928 35634
17368 -4994 352950 338533 314177 18029 149737 483475 243278 168456 92836 284053 412783
17357 412783 238183 -80006 -90400 225511 187063 -67325 231745 79152 176786 132960 177644
17346 177644 157409 267980 232215 224592 186757 36010 94079 357417 164174 241540 153414
$$ packed form
17424C21342h4175C28078J9626R6195o1540J72937B55948j24318R2406M1309n5567
17413B09778Q6569m2617J50030A6193L5938R1716a75017A90273J8000h4863I4329
17401D66714k24729m8444R6684C7233J53723a00420B44277H4489f5711F07148
17390D680i5631C07817M6874k9287n8933a60209C42016m7958Q5481A07246M0523
17379A47769b2744j83284A21507b61821a21342A85037b64694B23667h6928C5634
17368d994C52950j4417k4356A8029J31708L33738k40197p4822p5620J91217J28730
17357D12783j74600h0006j0394B25511l8448f7325B31745G9152R7634m3826M4684
17346A77644k0235J10571l5765p623l7835C6010N8069K63338A64174P7366q8126
$$ plain form
17335 153414 220013 247697 100699 78340 181392 435995 12517 68791 64470 32766 141126
17324 141126 104226 580383 23851 155895 -53671 157792 340290 -56428 109935 341495
17314 341495 -157107 202493 365930 98685 407333 69632 222770 8556 186380 103037
17304 103037 457809 29185 72990 -22269 234899 4156 249570 171679 376301 161756 286433
17293 286433 268410 98668 231550 346412 277801 445678 318767 76653 228803 158700
17283 158700 10066 547352 59021 179915 363859 74732 -19518 360557 162822 43922
17272 -22976 98301 305087 276053 -78773 439432 153151 133839 -137591 199303 173468 -556
17260 232952 -223129 85299 75246 350512 168504 306595 111975 122115 249917 350168
$$ packed form
17335A53414O6599K7684A00699k2359J03052K54603A2517N6274m321l1704J08360
17324A41126l6900M76157B3851J32044e3671A57792J82498e6428A09935K31560
17314C41495a57107B02493J63437I8685L08648F9632J53138H556J77824q3343
17304A03037L54772B9185M3805b2269B34899D156K45414p7891K04622A61756J24677
17293B86433j8023I8668J32882J14862o8611J67877j26911G6653J52150p0103
17283A58700A0066N37286E9021J20894J83944G4732a9518C60557A62822D3922
17272b2976I8301K06786k9034g8773D39432A53151j9312a37591A99303k5835e56
17260B32952b23129H5299j0053K75266A68504J38091A11975J0140J27802J00251
$$ plain form
17250 350168 144662 58437 256966 146011 404358 378686 214281 375381 89768 174173
17240 174173 37992 -13852 81568 370468 223156 337549 -33495 135916 172473 266972 -56827
17228 310190 116017 47479 428449 -74269 36504 333235 522579 327244 217281 94329
17217 184513 -73831 607410 359326 204676 138940 256133 589174 358066 238173 207611
17207 207611 634911 346890 236464 343254 -43445 175346 132066 213481 373962 188802
17197 188802 297435 355300 385284 446253 191881 200316 204517 346392 465810 84947 569607
17186 569607 463890 117196 482911 195472 245193 82620 344148 308702 285866 434187
17176 434187 244141 421227 346383 103842 109765 314982 87047 339347 612484 579749
$$ packed form
17250C50168A44662E8437J98529j10955K58347k5672j64405J61100H9768Q4405
17240A74173C7992a3852H1568K88900j47312J14393c3495A35916L6557R4499e6827
17228C10190A16017D7479L80970g4269C6504K96731J89344j95335j09963I4329
17217A84513g3831F07410k48084j54650o5736J17193L33041k31108j19893l0562
17207B07611M27300k88021j10426J06790d3445A75346m3280Q1415J60481j85160
17197A88802J08633N7865K9984O0969A91881Q435M201J41875J19418H4947M84660
17186E69607j05717A17196L65715A95472M9721H2620K61528l5446k2836J48321
17176D34187j90046J77086p4844A03842N923K05217H7047K52300K73137l2735
$$ plain form
17166 579749 311015 415065 103979 367638 170377 337356 521394 68166 201733 313393
17156 313393 108034 205014 424228 383103 158153 482791 234854 342239 473186 345080
17146 345080 490345 440340 503622 326070 102727 373679 326497 86270 101450 276499
17136 276499 414597 377252 258788 359254 367780 314775 663351 558018 578063 421552
17126 421552 473072 15250 473076 140035 476591 415267 352042 573835 564982 325819 340626
17115 340626 120576 192848 347622 667907 259630 322921 211611 512165 460322 250809
17105 250809 276172 574729 475352 660868 449376 300255 219944 351674 523903 467495
17095 467495 365078 154630 260984 731173 617683 199377 399812 722829 248579 457701
$$ packed form
17166E79749k68734J04050A03979K63659A70377J66979J84038F8166J33567J11660
17156C13393A08034R6980K19214m1125A58153L24638B34854J07385J30947j28106
17146C45080J45265n0005O3282j77552A02727K70952m7182H6270J5180J75049
17136B76499J38098l7345j18464J00466Q526n3005L48576j05333K0045j56511
17126D21552N1520A5250M57826A40035L36556o1324o3225K21793q853k39163J4807
17115C40626A20576P2272J54774L20285B59630O3291j11310L00554n1843k09513
17105B50809K5363K98557r9377J85516k11492j49121q0311J31730J72229n6408
17095D67495j02417A54630J06354M70189j13490A99377K00435L23017B48579K09122
$$ plain form
17085 457701 566922 394920 578651 390987 373698 515659 682446 295923 624741 392724
17075 392724 724583 587331 379548 425341 474168 690186 610916 473293 532897 565257
17065 565257 330279 847886 771037 243752 620578 578961 435405 514296 406646 706881
17055 706881 792240 282041 838812 892825 635689 341141 695039 658091 442246 669407
17045 669407 752305 481439 774562 609227 321989 568204 453548 192310 654688 795245
17035 795245 411961 724445 751713 667929 782777 468136 642235 473620 508819 539257
17025 539257 754773 702472 644205 803444 831292 808685 636030 629072 553571 859393 634917
17014 634917 520131 986072 786006 583019 589474 713454 602478 559447 681110 860710
$$ packed form
17085D57701J09221j72002J83731j87664j7289J41961J66787B95923L28818k32017
17075C92724L31859j37252k07783M5793M8827K16018p9270j37623N9604L2360
17065E65257k34978N17607p6849B43752L76826m1617j43556P8891j07650L00235
17055G06881Q5359B82041N56771N4013k57136k94548L53898l6948k15845K27161
17045F69407Q2898k70866K93123j65335k87238K46215j14656A92310M62378J40557
17035G95245l83284L12484K7268q3784J14848l14641J74099j68615L5199L0438
17025E39257K15516n2301n8267J59239K7848k2607j72655o958p5501L05822k24476
17014F34917j14786M65941k00066k02987O455J23980j10976m3031J21663J79600
$$ plain form
17004 860710 891761 887223 591813 706678 814079 529024 1107661 934864 585626 876074
16994 876074 1006603 852379 939682 774679 1135491 1020348 859673 692660 1274348 1255359
16984 1255359 1055537 1023442 857725 994857 829558 1072805 1010035 1121610 911741 743312
16974 743312 1023544 849870 802080 1064975 829664 1164480 1060726 1301854 995168 956559
16964 956559 1074796 837247 1199484 1091556 1022994 1291345 1231399 1290678 920031 1381077
16954 1381077 1049950 1095400 1171540 1455362 1106513 1253283 1375045 1077322 890124 1291556
16944 1291556 1118413 1484201 1392560 1131607 1203561 1257630 1571841 1456226 1849125 1040623
16934 1040623 1454607 1081307 1151690 1316110 1618289 1366657 1281518 1628143 1173138 1802610
$$ packed form
17004H60710L1051m538k95410J14865J07401k85055N78637j72797l49238K90448
16994H76074J30529j54224Q7303j65003L60812j15143j60675j67013N81688j8989
16984A255359j99822l2095j65717J37132j65299K43247o2770J11575k09869j68429
16974G43312K80232j73674m7790K62895k35311L34816j03754K41128l06686l8609
16964I56559J18237k37549L62237j07928o8562K68351n9946N9279l70647M61046
16954A381077l31127M5450P6140K83822l48849J46770J21762k97723j87198M01432
16944A291556j73143L65788r1641k60953P1954N4069L14211j15615L92899q08502
16934A040623M13984l73300P0383J64420L02179k51632q5139L46625m55005O29472
$$ plain form
16924 1802610 1494465 1250654 1442390 1693579 1331744 1676764 1910534 1498927 1457262 1550958
16914 1550958 1570329 1223022 1758375 1575232 1754515 1427415 1948904 1812537 1992234 1948035
16904 1948035 1884974 2087034 1878052 1982844 1859321 1985499 2209684 2095557 2313573 2109221
16894 2109221 2434496 2296965 1959350 2324813 2179040 2158335 2170649 2377337 2316281 2436142
16884 2436142 2312098 2269533 2661705 2129216 2653092 2482376 2544019 2562101 2330316 2800419
16874 2800419 2291214 2824200 2989575 2909297 2756238 2759593 3247132 2899418 3332352 2889269
16864 2889269 3201855 3675298 2977829 3138177 3107353 3062321 3348687 3348898 3338716 3666958
16854 3666958 3606714 3554834 3683358 3728862 3833896 3815598 3926543 4068064 4034524 4312749
$$ packed form
16924A802610l08145k43811J91736K51189l61835L45020K33770m11607m1665R3696
16914A550958J9371l47307N35353j83143J79283l27100N21489j36367J79697m4199
16904A948035o3061K02060k08982J04792j23523J26178K24185j14127K18016k04352
16894B109221L25275j37531l37615L65463j45773k0705J2314K06688o1056J19861
16884B436142j24044m2565L92172n32489N23876j70716O1643J8082k31785M70103
16874B800419n09205N32986J65375q0278j53059L355M87539l47714M32934m43083
16864B889269L12586M73443o97469J60348l0824m5032K86366K11j0182L28242
16854C666958o0244n1880J28524M5504J05034j8298J10945J41521l3540K78225
$$ plain form
16844 4312749 4132754 4540739 4295327 4258304 4611978 4383099 4392128 4442410 4765119 4895015
16834 4895015 4679395 5129517 5320543 5027492 4800327 5352700 5120806 5275959 5504117
16825 5504117 5656703 5447349 5638626 6063876 5863424 6243009 6217572 6461916 6566482 6544874
16815 6544874 6874641 6664832 7032341 7360260 7127459 7299232 7582170 7754705 8060385
16806 8060385 7928744 8047677 8628129 8572410 8904030 8803570 9380318 9696287 9452560 9829803
16796 9829803 10403862 10480879 10511491 10700021 10975508 11376483 11454533 11699390 12284555 12340726
16786 12340726 12964012 13272946 13708335 14039649 14549095 14609416 15474983 15587273 16287870
16777 16287870 16626220 17664756 17762112 18594432 18870999 19384292 20030128 20667232 21324840
$$ packed form
16844D312749j79995M07985k45412l7023L53674k28879R029N0282L22709J29896
16834D895015k15620M50122J91026k93051k27165N52373k31894J55153K28158
16825E504117J52586k09354J91277M25250k00452L79585k5437K44344J04566k1608
16815F544874L29767k09809L67509L27919k32801J71773K82938J72535L05680
16806H060385j31641J18933N80452n5719L31620j00460N76748L15969k43727L77243
16796I829803N74059P7017L0612J88530K75487M00975P8050K44857N85165N6171
16786A2340726O23286L08934M35389L31314N09446O0321Q65567J12290P00597
16777A6287870L38350J038536R7356Q32320K76567N13293O45836O37104O57608
$$ plain form
16768 21324840 22464000 23036567 23994125 24759521 25839595 26836640 28046015 29422632 30336800
16759 30336800 31301407 32512811 34072326 35374787 36915267 38687689 40283716 42370586
16751 42370586 44162041 46626512 48666893 51337827 53266177 56349667 59223094 62534219
16743 62534219 65980833 69766709 73338220 77685417 82505204 86707586 92056784 97245414
16735 97245414 103146982 109493581 116048474 122733526 129542837 137451279 145091190 152901010
16727 152901010 161008091 168308172 175921181 183327164 189238676 194843268 198863341 202438345
16719 202438345 204317164 204750699 203845703 201476571 197812045 193144771 187706396 181312850
16711 181312850 174082683 166749801 158870452 151368285 143435739 135470912 127928403 120616859
$$ packed form
16768B1324840J139160N72567R57558P65396J080074R97045J209375J376617R14168
16759C0336800R64607J211404J559515J302461J540480J772422J596027K086870
16751D2370586J791455K464471K040381K670934J928350L083490K873427L311125
16743F2534219L446614L785876L571511M347197M819787M202382N349198N188630
16735I7245414N901568O346599O554893O685052O809311P908442P639911P809820
16727A52901010Q107081P300081P613009P405983N911512N604592M020073L575004
16719B02438345J878819M33535r04996k369132l664526m667274n438375o393546
16711A81312850p230167p332882p879349p502167p932546p964827p542509p311544
$$ plain form
16703 120616859 114178596 107241937 100756653 94970033 89330381 84166903 79381428 74936009
16695 74936009 70259635 66653126 62872081 59417491 56259659 53120831 50330397 47715663
16687 47715663 45101419 43222105 41314684 38974066 37083737 35288993 33983493 32620909
16679 32620909 30438646 29709226 28178062 27038604 26097883 24987963 24116504 22981731
16671 22981731 21983061 21123136 20513421 19649839 18850853 18287120 18186442 16888383 16484754
16662 16484754 15989967 15421853 14894294 14426636 13943007 13627435 12973186 12754018 12231016
16653 12231016 11952658 11397168 11120530 10904048 10613502 10394226 9680919 9799044 9937251
16644 9937251 9004974 9189009 8666961 8939462 8456194 8190622 8013844 7554862 7678754
$$ packed form
16703A20616859o438263o936659o485284n786620n639652n163478m785475m445419
16695G4936009m676374l606509l781045l454590l157832l138828k790434k614734
16687D7715663k614244j879314j907421k340618j890329j794744j305500j362584
16679C2620909k182263p29420j531164j139458r40721j109920q71459j134773
16671B2981731r98670q59925o09715q63582p98986n63733j00678j298059m03629
16662A6484754m94787n68114n27559m67658m83629l15572o54249k19168n23002
16653A2231016k78358n55490k76638k16482k90546k19276p13307J18125J38207
16644I937251r32277J84035n22048K72501m83268k65572j76778m58982J23892
$$ plain form
16635 7678754 7305823 7055053 6950392 7121514 6629389 6469151 6190871 6510979 6209708
16626 6209708 5739345 5861775 5596780 5402646 5585992 5691558 5222864 4993093 5074849 5221151
16616 5221151 4684931 4432306 4334624 4443076 4349459 4524890 4245648 3993863 4046235 4147815
16606 4147815 4152152 3523686 3277784 3435823 3945075 3193185 3541218 3514478 3132564 3414798
16596 3414798 3342681 3207712 2822508 3079263 2897828 2971492 3110386 2936711 2848902 2961028
16586 2961028 2530726 3054498 2590485 2602586 2738416 2325235 2746780 2563331 2449131 2522134
16576 2522134 2409034 2343616 2316018 2404835 2361938 2312216 2308244 2029365 2036969 2130983 1994220
16565 1994220 1878164 2623582 2222794 2225020 1848659 2059784 1861678 1989317 1720407 1745225
$$ packed form
16635G678754l72931k50770j04661J71122m92125j60238k78280L20108l01271
16626F209708m70363J22430k64995j94134J83346J05566m68694k29771Q1756J46302
16616E221151n36220k52625r7682J08452r3617J75431k79242k51785N2372J01580
16606D147815M337o28466k45902J58039N09252p51890L48033k6740l81914K82234
16596C414798p2117j34969l85204K56755j81435P3664J38894j73675q7809J12126
16586B961028m30302N23772m64013J2101J35830m13181M21545j83449j14200P3003
16576B522134j13100o5418k7598Q8817m2897m9722l972k78879P604R4014j36763
16565A994220j16056P45418m00788K226l76361K11125j98106J27639k68910K4818
$$ plain form
16555 1745225 1729819 1877369 1812647 1709087 1572761 1637477 1798934 1483635 1534395 1372224
16545 1372224 1849612 1593489 1393692 1583628 1457813 1370545 1569218 1406960 1424380 1149341
16535 1149341 1321578 1843407 959035 1405412 1324850 1118716 1407364 1417357 992665 1067770
16525 1067770 1006456 1102262 1119149 1208126 1145696 819614 1230614 1041147 1106303 976024
16515 976024 1104457 1043272 1204426 1182151 1067394 1371924 1120343 1058728 952497 1119864
16505 1119864 863168 983779 1171543 985504 813738 977563 1130881 1364821 922363
16496 922363 1073063 824776 1019686 751836 750789 794756 785261 1039597 873418 741017
16486 741017 797937 794446 699781 661734 751593 1050507 440763 936194 986395 817797 1016110
$$ packed form
16555A745225j5406J47550o4722j03560j36326O4716J61457l15299N0760j62171
16545A372224M77388k56123j99797J89936j25815q7268J98673j62258J7420k75039
16535A149341J72237N21829q84372M46377q0562k06134K88648R993m24692P5105
16525A067770o1314R5806J6887Q8977o2430l26082M11000j89467O5156j30279
16515I76024J28433o1185J61154k2275j14757L04530k51581o1615j06231J67367
16505A119864k56696J20611J87764j86039j71766J63825J53318K33940m42458
16496I22363J50700k48287J94910k67850j047M3967r495K54336j66179j32401
16486G41017N6920l491r4665l8047Q9859K98914D40763M95431N0201j68598J98313
$$ plain form
16475 1016110 404698 666972 635536 1107663 576787 744932 901467 737289 504807 622872
16465 622872 626384 657736 705392 766070 893007 561503 561749 926414 508192 747181 238896
16453 485102 668233 377254 596604 438870 555613 381762 811362 346261 313999 551674
16443 551674 766598 516793 727846 527007 420798 386712 607308 464194 495302 366739
16433 366739 419712 300110 496913 395385 188431 573843 625851 296140 -114287 274456
16422 647252 520378 647977 476936 173493 567899 501579 871054 -11258 446083 571601
16412 571601 345237 399833 537084 564942 520183 493855 703859 353479 182643 251283
16402 251283 251744 437988 514170 385973 354965 233073 479533 580999 115809 422536
$$ packed form
16475A016110D04698K62274l1436M72127n30876J68145J56535j64178k32482J18065
16465F22872L512L1352M7656O0678J26937l31504K46L64665m18222K38989B38896
16453D85102J83131k90979K19350j57734J16743j73851M29600C46261l2262K37675
16443E51674K14924k49805K11053k00839j06209l4086K20596j43114L1108j28563
16433C66739N2973j19602J96803j01528A88431L85412N2008B96140a14287B74456
16422F47252j26874J27599j71041A73493L94406o6320L69475a1258D46083J25518
16412E71601k26364N4596J37251K7858m4759k6328K10004l50380j70836O8640
16402B51283M61J86244P6182j28197l1008j21892K46460J01466A15809L06727
$$ plain form
16392 422536 496912 220624 494959 392453 188279 52555 340677 545807 414784 214471
16382 214471 395467 347880 577559 -33013 220045 207998 294021 60041 335068 27856 -4455
16370 218475 260270 85235 618423 294899 414416 306986 165765 97942 194619 211753
16360 211753 467287 319560 -9188 347814 300012 297963 519613 96987 36448 312773 244986
16349 244986 98898 218813 627879 583854 311327 -190295 544326 368716 500665 476815
16339 476815 413990 283834 -197646 420617 -52203 17095 395011 -47151 422111 339129
16329 339129 359691 -102750 -14019 80472 -123931 299503 216979 435938 140565 632894
16319 632894 -70534 170628 168834 155232 259669 46477 69812 425810 90854 126701 -7435
$$ packed form
16392D22536P4376B20624K74335j02506A88279E2555K88122K05130j31023k00313
16382B14471J80996m7587K29679c3013B20045j2047Q6023F0041K75027B7856d455
16370B18475M1795H5235N33188B94899J19517j07430j41221o7823R6677J7134
16360B11753K55534j47727i188C47814m7802k049K21650I6987C6448K76325o7787
16349B44986I8898J19915M09066m4025k72527a90295E44326j75610J31949k3850
16339D76815o2825j30156a97646D20617e2203A7095L77916d7151D22111q2982
16329C39129K0562a02750a4019H0472a23931B99503q2524K18959A40565M92329
16319F32894g0534A70628j794j3602J04437D6477K3335L55998I0854L5847g435
$$ plain form
16307 15231 -9510 335835 167378 190022 266083 475822 133155 408228 245083 155343 102343
16296 102343 500729 37936 -18110 11106 177316 311535 -22059 115105 10969 366505
16286 366505 387354 -35463 517398 442196 217137 -171674 150492 -53283 136280 242185
16276 242185 -25560 -3085 271613 34636 -117819 -67538 142050 85494 340532 209491 210513
16265 210513 358538 -55051 230038 -131621 103908 289280 11763 -41375 47134 100381
16255 100381 57755 215582 -167469 408726 4194 168004 9984 -117535 -182767 171302 519734
16244 519734 -125257 4761 468598 261468 184387 -10340 -28111 -17438 179443 31121 228385
16233 228385 285282 -92351 83273 302902 20306 340985 79694 12959 -15927 131540 79533
$$ packed form
16307A5231i510C35835A67378K2644P6061K09739A33155K75073j63145q9740n3000
16296A02343L98386C7936a8110A1106J66210J34219b2059A15105A0969L55536
16286C66505K0849c5463E17398p5202B17137a71674A50492e3283A36280J05905
16276B42185b5560c085B71613C4636a17819N0281A42050n6556K55038j31041J022
16265B10513J48025e5051B30038a31621A03908J85372A1763d1375D7134N3247
16255A00381m2626J57827a67469D08726D194J63810I984a17535o5232A71302L48432
16244E19734a25257D761M63837k07130p7081a0340j7771J0673A79443C1121J97264
16233B28385N6897i2351H3273K19629B0306L20679G9694A2959a5927A31540n2007
$$ plain form
16222 79533 299893 285724 66178 15803 -97247 31762 219277 -29115 43007 263562 114278
16210 329921 359048 85928 -166658 -62964 -88281 92864 120664 -36269 372215 53710 86625
16199 86625 140758 -43595 522997 170141 60870 -58659 -220579 -120339 98181 -33632 13917
16187 82683 88012 -274716 -105524 -228746 -290255 -333643 17574 -82536 268241 223940 134839
16176 134839 99243 69003 -275391 175207 -186027 231587 -246030 -120247 -141192 239796
16165 -28057 -28632 -149103 -34176 -230964 190742 -33250 74577 -158824 -146638 -159757 59579
16153 148115 141729 234322 179322 129058 -191969 91462 61799 -140650 150242 313152 -256781
16141 -12614 -5275 127724 177884 25794 -30569 319364 20472 -110988 234944 366468 379005
$$ packed form
16222G9533K20360j4169F6178A5803i7247C1762J87515b9115D3007K20555A14278
16210C29921K9127H5928a66658f2964k5317I2864K7800c6269C72215E3710L2915
16199H6625N4133d3595E22997A70141F0870e8659j61920J00240I8181c3632A3917
16187H2683N329b74716a05524j23222o1509m3388A7574h2536B68241m4301q9101
16176A34839l5596l0240b75391A75207a86027B31587b46030a20247k0945B39796
16165b8057n75j20471c4176j96788A90742c3250G4577a58824J2186j3119E9579
16153A48115o386R2593n5000n0264a91969I1462k9663a40650A50242J62910b56781
16141a2614e275A27724N0160B5794c0569C19364B0472a10988B34944J31524J2537
$$ plain form
16130 379005 -8247 49391 181539 -37338 11582 -161923 34783 53742 201019 22738 53446
16119 53446 -218744 -96863 -62442 281375 349275 33793 214388 251618 -183745 259173 -129895
16107 -112984 323202 24640 8951 202934 -151153 -103541 40975 343356 262374 27266 -3361
16095 -86840 -79786 -162941 41636 334429 128419 -118976 -11719 99346 263970 474519 31735
16083 -49554 -74245 157211 -156376 -24574 167072 21436 55643 33308 -91580 199340 23934
16071 63682 85393 25292 -180814 145339 161863 38787 74621 -156748 -21491 47859 338299
16060 338299 -198788 12907 241640 -121751 220561 -19123 65164 -69443 -113835 346644
16049 -287763 211568 122067 63025 135816 78111 -250762 94406 270673 -13163 5036 -29207
$$ packed form
16130C79005h247D9391J32148c7338A1582a61923C4783J8959J47277B2738L0708
16119E3446b18744i6863L4421B81375O7900C3793J80595L7230a83745B59173a29895
16107a12984C23202B4640H951J93983a51153M7612D0975L02381q0982B7266c361
16095h6840P054q3155D1636K92793A28419a18976a1719I9346J64624K10549C1735
16083d9554k4691A57211a56376b4574A67072B1436L4207k2335i1580A99340B3934
16071F3682K1711B5292a80814A45339J6524C8787L5834a56748b1491D7859K90440
16060C38299a98788A2907K28733a21751B20561a9123F5164f9443m4392C46644
16049b87763B11568q9501n9042P2791n7705b50762I4406J76267a3163E036b9207
$$ plain form
16037 304589 78256 -79114 -340662 -43555 -102585 -308998 -66919 -165008 -246570 -84192 12894
16025 -323450 -49557 -19150 -87123 -65821 -88077 -27084 -237654 -264670 -245656 -152016 94720
16013 -447552 -242575 -73247 -34214 -291449 109682 140795 5303 -95039 -81596 92929 -120449
16001 -371124 -29945 104862 -66570 20217 -19064 70098 -102234 76643 11208 -236582 156756
15989 45214 -75164 139386 -170123 -493145 60114 78874 104483 115224 -359934 194635 404380
15978 404380 555370 -158752 -15798 -48443 169069 33588 130341 -204820 -179984 -7789 192226
15966 123934 92979 -210170 37455 -84263 144741 -110731 -122311 -57848 -60480 124359 -417209
15954 -137294 -79253 104636 66373 1116 11178 -276510 120213 -141483 -135609 48298 -80501
$$ packed form
16037C04589G8256g9114k61548d3555n9030k06413f6919r8089q1562h4192A2894
16025c23450d9557a9150o7973K1302k2256b7084k10570k7016J9014R3640I4720
16013d47552K04977g3247c4214k57235A09682L1113E303i5039J3443I2929a20449
16001c71124b9945A04862f6570B0217a9064G0098a02234G6643A1208b36582A56756
15989D5214g5164A39386a70123l23022F0114J8760K5609J0741c59934A94635K09745
15978D04380J50990a58752a5798l2645A69069C3588R6753b04820K4836g789A92226
15966A23934l0955b10170C7455h4263A44741a10731j1580e7848k632A24359d17209
15954a37294N8041A04636l8263A116J0062b76510A20213a41483N874D8298h0501
$$ plain form
15942 -372799 -418170 -378965 -337761 221906 246601 -437593 -401475 -190087 -63973 68189 -66909
15930 205011 -81067 -3385 -375569 74719 3982 -95401 -206087 69982 -432441 -39543 -3583
15918 -229127 248528 -226292 99273 -61374 -256523 -48764 139482 79473 7936 -121535 31065
15906 -337279 -8967 103965 -141697 -261109 6709 -188850 -387998 -8254 -35623 190921 -90951
15894 123289 -264348 -7937 97566 124657 24171 -7120 -90978 -110196 -183978 -50997 -2852 -227805
15882 -227805 81280 86941 -218319 -264300 15002 -129926 -16516 -55545 144518 -338063 -69857
15870 -15344 312302 1927 68160 82665 -61625 -18210 -173549 224506 135997 147523 318769
15859 318769 18373 -87130 -230850 196588 119061 -216297 -113852 -226011 -198282 -115144
$$ packed form
15942c72799m5371L9205M1204B21906K4695d37593L6118a90087f3973F8189f6909
15930B05011h1067c385l72184G4719C982i5401j10686F9982d32441c9543c583
15918b29127B48528b26292I9273f1374j95149d8764A39482o0009G936a21535C1065
15906c37279h967A03965a41697j19412F709a88850j99148h254k7369A90921i0951
15894A23289b64348g937I7566K7091B4171g120q3858j9218p3782e0997b852k24953
15882b27805H1280N661b18319m5981A5002a29926a6516l9029A44518c38063f9857
15870a5344C12302A927O6233J4505f1625a8210j55339B24506q8509J1526J71246
15859C18769A8373h7130j43720A96588p7527b16297J02445j12159K7729Q3138
$$ plain form
15849 -115144 508792 140411 -84932 -4387 260563 115616 448958 -243107 2384 -51924 -109984
15838 -109984 79154 -73464 194443 -9802 -171108 231257 -130976 -558247 -73808 11667 -312048
15826 206057 -387127 90791 -265670 2554 -232625 -269806 -58909 -26877 -288979 -815 26116
15814 79670 275189 66275 -2506 -388065 -245199 162566 133417 140118 -158889 47507 49549
15803 49549 -80203 -226879 -183055 86105 -266856 111091 -154286 150395 20084 4033 46454
15792 46454 -217693 419977 -120072 -251081 81868 -86483 47141 11840 -30171 146557 -130455
15780 -70327 -13731 52779 272607 141741 -20813 11891 -285006 -217800 109269 -30613 -202787
15769 -202787 -46220 -224378 -46485 117039 -38496 -86851 -132522 58195 120816 340816 198915
$$ packed form
15849a15144E08792A40411h4932d387B60563A15616L33342b43107B384e1924n8060
15838a09984G9154g3464A94443i802j61306B31257a30976m27271g3808A1667c12048
15826B06057c87127I0791b65670B554b32625l7181e8909b6877k62102h15B6116
15814G9670J95519F6275b506l85559J42866A62566k9149O701a58889D7507K042
15803D9549h0203j46676M3824H6105b66856A11091a54286A50395B0084D033M2421
15792D6454b17693D19977a20072j31009H1868h6483D7141A1840c0171A46557a30455
15780g0327a3731E2779K19828j30866b0813A1891b85006O7206A09269c0613j72174
15769b02787d6220j78158d6485A17039c8496m8355m5671E8195O2621K20000j41901
$$ plain form
15758 198915 -166556 -56464 -95449 657 -112253 -367794 -80197 -129803 -57189 -99213 66294
15746 102192 30648 2104 33662 186932 -131989 50399 159025 167189 -234210 -247330 -54583
15734 -276678 121924 -64334 -382477 2310 -232883 157513 -186303 -102986 270091 10063
15723 204706 -280229 -161993 -334294 -217114 20071 443758 197272 215320 -92825 -207498
15713 -207498 27975 -229659 131269 114622 59970 -351475 -30930 -171609 -147172 -175264 -80718
15701 28449 -78276 78408 -5569 81091 108693 -173326 -68322 -49405 -164192 -10349 63878
15689 44338 119759 -35121 -149334 28366 -251096 143959 -237619 -39379 35207 9183 -83540
15677 -35050 147373 -88353 109005 196175 231018 -38153 -9388 -79832 36664 -184648 59197
$$ packed form
15758A98915a66556e6464l8985F57a12253k55541h0197m9606e7189m2024F6294
15746A02192C0648B104L1558J53270a31989E0399J08626Q164b34210j3120e4583
15734b76678A21924f4334l18143B310b32883A57513a86303Q3317B70091A0063
15723B04706b80229J18236j72301J17180B0071M23687A97272J8048i2825j14673
15713b07498B7975b29659A31269j6647n4652c51475c0930j40679K4437k8092h0718
15701B8449g8276G8408e569H1091K7602a73326f8322J8917j14787a0349F3878
15689D4338P5421c5121j14213B8366b51096A43959b37619c9379C5207I183h3540
15677c5050A47373h8353A09005Q7170L4843c8153i388p0444C6664a84648E9197
$$ plain form
15665 44588 108793 89395 54694 -192431 -183391 47543 -206759 -90358 -95686 279337 26692
15653 -175096 177993 -144706 -93758 33652 -231798 -87546 160554 -126871 -279423 311886
15642 -232127 -58967 -179597 78292 -41814 -42566 54083 -192516 -181058 98948 -96011 -284930
15631 -284930 -275896 306027 -162107 188670 131774 74299 36469 -128896 -225265 94172 155090
15620 155090 -86316 -268 80623 -57403 -96984 -152355 114062 -218246 308637 -337212 -439307
15609 -439307 -203837 248172 31518 -84769 59263 -63813 -172799 -102142 97002 -3636 84378
15597 12509 -109493 -78932 -207934 22340 23113 81301 225948 -413807 -34039 -240585 -36337
15585 -286589 45722 -69286 219128 -148694 101324 91667 -189059 -21077 -257747 -3985 -18934
$$ packed form
15665D4588O4205j9398l4701a92431R040D7543b06759i0358n328B79337B6692
15653a75096A77993a44706N0948C3652b31798h7546A60554a26871j52552C11886
15642b32127e8967j20630G8292d1814p52E4083a92516J1458I8948i6011j88919
15631b84930R034C06027a62107A88670n6896n7475C6469a28896r6369I4172O0918
15620A55090h6316b68H0623e7403l9581n5371A14062b18246C08637c37212j02095
15609d39307b03837B48172C1518h4769E9263f3813j08986P0657I7002c636H4378
15597A2509a09493L0561j29002B2340P73N8188J44647d13807c4039k06546c6337
15585b86589D5722f9286B19128a48694A01324r657a89059b1077k36670c985j4949
$$ plain form
15574 -18934 141553 -528019 118941 -395789 -36985 95267 159840 414760 -55329 285979
15563 164408 -118156 62661 188977 132599 2783 127876 123464 54104 66915 -24266 -239779
15552 -239779 -120427 12750 341921 -96626 140338 106715 74553 -192019 138004 5509 253008
15541 253008 -153834 -208613 198197 61772 83443 174099 345260 -79374 -156015 -261725 218293
15529 -418757 -63360 182683 -130149 70500 -71994 -98827 337213 -458415 112518 88473
15519 88473 184594 20507 -239710 82779 93897 -376260 94071 -180983 -12766 259122 87841
15507 -108146 -170359 -41653 128257 -237943 366810 -7393 -357935 -205786 -257858 -248090 -152146
15496 -152146 -233840 -2892 3955 -211961 182510 153522 -125470 -134620 75529 155035 -85005
$$ packed form
15574a8934A41553e28019A18941c95789c6985I5267O4573K54920e5329B85979
15563A64408a18156F2661J26316n6378B783J25093m412E4104J2811b4266k15513
15552b39779J19352A2750L29171i6626A40338l3623l2162a92019A38004E509K47499
15541B53008a53834n4779A98197F1772K1671R0656J71161g9374p6641j05710B18293
15529d18757f3360A82683a30149G0500g1994k6833C37213d58415A12518k4045
15519H8473R6121B0507b39710H2779J1118c76260I4071a80983a2766B59122H7841
15507a08146o2213d1653A28257b37943C66810g393l50542J52149n2072R768R5944
15496a52146q1694b892C955b11961A82510k8988a25470r150G5529P9506h5005
$$ plain form
15484 203267 166268 41299 26634 -61748 17153 -3444 -160843 -64307 -417405 -162964 219414
15472 409695 -36633 3073 179996 -231334 60871 -133347 15206 23891 -57482 149737 -39582
15460 -397578 233202 75370 -90715 -16272 249804 -43005 111237 -25725 -149676 203222
15449 -193889 -78196 90924 -302332 99586 -131277 -147414 -202573 92514 205576 297516 -113995
15437 1655 -84282 290600 271471 -9774 146613 30223 187882 -245333 15907 -100178 -78773
15426 -78773 -14121 39832 113581 -102524 -191110 -96681 -344457 -597 -288344 7569 -18140 -30438
15414 -30438 -210305 -84646 153839 199446 53327 -12812 53519 -105053 -212061 150111 -73799
15402 -112511 -62124 93590 -33556 2191 87916 -243956 -80022 300427 19904 -264853 -115539
$$ packed form
15484B03267l6999D1299j4665f1748A7153c444j57399f4307l53098a62964B19414
15472D09695c6633C073J76923b31334F0871a33347A5206Q685e7482A49737c9582
15460c97578B33202G5370i0715a6272B49804d3005A11237b5725j23951B03222
15449a93889g8196I0924c02332I9586a31277j6137n5159I2514J13062R1940a13995
15437A655h4282B90600j9129i774A46613C0223J57659b45333A5907a00178K1405
15426g8773a4121C9832P3749a02524q8586R4429k47776e97k87747G569a8140j2298
15414c0438j79867h4646A53839M5607E3327a2812E3519a05053j07008A50111g3799
15402a12511N0387I3590c3556B191Q5725b43956h0022C00427A9904b64853a15539
$$ plain form
15390 53971 3276 100516 110462 76514 82887 75982 -58226 -64939 65045 -205745 41638 -187605
15377 -114471 -165082 -277061 -92674 -42306 14369 -452537 31232 -21631 82070 -267242 275231
15365 175378 146814 236976 132493 94898 492751 115495 365369 53008 -39052 -144481
15355 -144481 45461 76779 148668 -24056 207183 167530 187797 -278547 138329 125637 52617
15343 80643 168792 -37252 -23699 -189791 -85271 -184688 -28054 28832 20974 -138336 42700
15331 -289312 -193365 -240211 -147263 251761 189869 156321 -55982 144410 154864 243294 187092
15320 187092 145845 -214861 148805 -63297 -14374 79488 -92273 109956 120506 137012 78056
15309 78056 385096 -210600 -839 82511 95045 157121 -111416 213063 107538 132545 311308
$$ packed form
15390E3971C276R7240R946l3948O373o905e8226o713F5045b05745D1638a87605
15377a14471n0611j11979i2674d2306A4369d52537C1232b1631H2070b67242B75231
15365A75378k8564R0162j04483l7595L97853A15495K49874E3008c9052j05429
15355a44481D5461L1318P1889b4056B07183l9653K0267b78547A38329j2692E2617
15343H0643Q8149c7252J3553j66092h5271r9417b8054B8832p858a38336D2700
15331b89312R5947m6846R2948B51761o1892l3548e5982A44410J0454Q8430n6202
15320A87092m1247b14861A48805f3297a4374G9488i2273A09956J0550J6506n8956
15309G8056L07040b10600h39H2511J2534O2076a11416B13063j05525K5007J78763
$$ plain form
15298 311308 -95792 -34889 -110383 129098 67522 -39709 -228341 -122100 155314 -64455 256
15286 499570 -126174 363996 42215 -151466 -217982 100613 -39776 83749 286341 -236480
15275 22132 398799 291947 35325 22229 14579 -61677 386031 67305 45893 374586 -12861
15263 174473 -190656 101255 339516 159833 38262 225733 63951 86026 85164 79995 30211
15251 356229 -34368 382803 210104 785908 1469379 1545828 1401713 1491758 708904 -1128
15240 255632 263297 332087 -74095 -22147 408426 -1990 15596 33788 42793 -212554 -245681 63337
15227 63013 225425 181905 176620 159242 79441 129122 21210 225583 238882 -17152 -17593 111071
15214 464996 250849 63766 299207 433535 33878 -135951 187119 -181417 48225 96457
$$ packed form
15298C11308i5792c4889p5494A29098o1576c9709j88632J06241A55314f4455B56
15286D99570a26174C63996D2215a51466o6516A00613c9776H3749K02592b36480
15275B2132L76667j06852C5325j3096p650f1677C86031F7305k1412L28693a2861
15263A74473a90656A01255K38261A59833C8262J87471F3951K2075q62n169C0211
15251C56229c4368C82803j72699N75804O83471P6449j44115R0045G08904a128
15240B55632P665O8790g4095b2147D08426a990A5596J8192R005b12554l3127F3337
15227F3013J62412m3520n285j7378G9441M9681B1210K04373J3299a7152m41A11071
15214D64996k14147F3766K35441J34328C3878a35951A87119a81417D8225M8232
$$ plain form
15204 96457 125586 88215 -106306 -179899 174742 -158181 123528 7072 56963 -35198 3971
15192 -245475 253774 180843 40923 80691 325899 -118072 40125 75176 104836 103296 340243
15181 340243 26346 334365 -110685 55266 230409 191097 -69825 37024 -320275 -372757 255048
15169 115917 -155955 -31310 253357 -105254 -84209 158357 246757 -67661 -79710 325254
15158 181225 -33878 169601 343355 -447276 25164 15149 230854 14132 -289461 -132159
15147 86714 92761 169617 -15538 126483 73238 312681 180940 159649 239633 29910 190655
15136 190655 103684 49434 81904 -27429 218313 390562 139698 60370 261049 460537
15126 460537 209414 295245 192080 131927 428796 156938 179381 216705 308971 410295
$$ packed form
15204I6457K9129l7371a06306p3593A74742a58181A23528G072M9891c5198C971
15192b45475B53774p2931D0923L9768K45208a18072D0125L5051K9660j540K36947
15181C40243B6346L08019a10685E5266J75143l9312f9825C7024c20275n2482B55048
15169A15917a55955c1310B53357a05254K1045A58357Q8400f7661j2049C25254
15158A81225c3878A69601J73754d47276B5164j0015K15705A4132b89461a32159
15147H6714O047P6856a5538A26483n3245K39443j31741k1291P9984B9910J60745
15136A90655q6971D9434L2470b7429B18313J72249A39698F0370K00679J99488
15126D60537B09414Q5831j03165o0153K96869A56938K2443L7324R2266J01324
$$ plain form
15116 410295 157504 88306 81845 272729 69235 -73123 435058 311298 52039 405938 18017
15104 390723 115190 341097 213316 -113733 288928 174566 -79533 -133853 383374 396349
15094 396349 -123964 408674 90838 -16358 91925 250282 373545 280485 68996 -101700
15083 105041 -122153 240928 43838 350921 26709 197621 247757 13237 267024 217144
15073 217144 5041 42505 224515 398091 135437 52294 -175486 83213 198883 183793 81120
15061 279216 83094 138033 239993 238572 19400 85942 -121484 375876 15841 278112 -114498
15049 320523 113016 135623 -110818 440192 233931 -6568 23600 120016 -183395 151125
15038 -81268 407839 157175 350709 222104 -13563 390186 23045 497438 288562 -178803
$$ packed form
15116D10295A57504o9198o461J90884F9235g3123D35058j23760E2039L53899A8017
15104C90723A15190K25907j27781a13733B88928j14362g9533n4320C83374J2975
15094C96349a23964D08674I0838a6358I1925J58357J23263r3060F8996a01700
15083A05041a22153B40928D3838L07083B6709J70912N0136A3237K53787m9880
15073B17144E041L7464J82010J73576A35437E2294a75486H3213J15670j5090H1120
15061B79216H3094N4939J01960j421A9400O6542a21484C75876A5841K62271a14498
15049C20523A13016K2607a10818D40192k06261f568B3600R6416a83395A51125
15038h1268D07839A57175J93534j28605a3563C90186B3045M74393k08876a78803
$$ plain form
15027 154295 297511 383571 358775 171044 152575 37101 670965 201817 13901 276252
15017 276252 45982 181933 169281 128862 162627 148126 202396 105775 261447 217615 354826
15006 354826 463343 273934 265567 477215 -52339 201462 65958 292211 284584 111084 151855
14995 151855 133303 46723 192132 462972 213762 170739 -6254 74853 89916 518392 420810
14984 420810 299274 289167 393113 75332 608424 419043 328642 302484 125221 252804
14974 252804 320848 -109674 208421 215156 374676 238359 59669 199069 349589 339110
14964 339110 443679 211831 389778 525933 -70088 433443 158031 323579 380031 180340
14953 235069 314052 230956 86282 532573 642293 592998 54751 240203 466358 283669
$$ packed form
15027A54295J43216Q6060k4796A71044j8469C7101O33864B01817A3901K62351
15017B76252D5982J35951j2652m0419L3765j4501N4270r6621J55672m3832J37211
15006C54826J08517j89409q367K11648e2339B01462F5958K26253p627A11084M0771
14995A51855j8552D6723J45409K70840B13762m3023f254G4853J5063M28476r7582
14984D20810j21536j0107J03946G5332N33092j89381r0401k6158A25221J27583
14974B52804O8044a09674B08421O735J59520j36317E9669J39400J50520j0479
14964C39110J04569B11831J77947J36155g0088D33443A58031J65548N6452A80340
14953B35069P8983q3096H6282M46291J09720m9295E4751J85452K26155j82689
$$ plain form
14943 283669 530502 67172 309141 146049 209981 24232 402239 369842 584901 584818 301206
14932 301206 287446 742082 113354 263965 -111202 521588 359675 4578 253589 446523
14922 446523 451973 443127 56381 286241 439144 114519 82724 2102 198912 338679 226697
14911 226697 339108 450336 461868 130530 247276 412251 581904 336968 451474 370575
14901 370575 506963 540508 564612 378656 32244 486274 475424 63777 682551 265783
14890 235735 520448 213701 268892 140355 351429 651849 327774 435599 418867 338745
14880 338745 582999 595663 508770 338693 436509 417693 325525 243491 292650 450330 380791
14869 380791 213948 237394 404680 151452 498310 922031 520316 419947 237649 302508
$$ packed form
14943B83669K46833F7172K41969A46049O3932B4232L78007l2397K15059q3k83612
14932C01206j3760M54636A13354J50611a11202E21588j61913D578K49011J92934
14922D46523N450q846E6381K29860J52903A14519l1795B102J96810J39767j11982
14911B26697J12411J11228J1532A30530J16746J64975J69653k44936J14506q0899
14901C70575J36388L3545K4104j85956C2244M54030j0850F3777O18774B65783
14890B35735K84713B13701N5191j28537K11074L00420l24075J07825j6732q0122
14880C38745K44254J2664q6893j70077R7816j8816r2168q2034M9159J57680o9539
14869C80791j66843K3446J67286A51452L46858M23721m01715j00369j82298O4859
$$ plain form
14859 302508 420878 525662 319282 350315 808797 554433 281158 435162 738514 250961
14848 499483 869695 815363 453253 494225 679727 428796 358587 386715 572003 386780
14838 386780 542369 380105 419034 556641 600490 783372 583968 610574 330277 646998
14828 646998 531262 737346 428509 392457 377579 429408 540687 310691 285006 372384
14818 372384 404186 448866 221057 463511 515623 617476 450776 729662 529858 819625
14808 819625 243806 607353 300324 684178 290112 540875 467137 537959 643593 829856
14798 829856 866863 346310 279416 618337 634405 618665 590107 470295 738001 550136
14788 550136 534502 408878 720629 465399 616112 1049717 596005 634045 689009 344220
$$ packed form
14859C02508J18370J04784k06380L1033M58482k54364k73275J54004L03352B50961
14848D99483L70212n4332l62110M0972J85502k50931p0209K8128J85288j85223
14838C86780J55589j62264L8929J37607M3849J82882j99404K6606k80297L16721
14828F46998j15736K06084l08837l6052j4878N1829J11279k29996k5685Q7378
14818C72384L1802M4680B21057K42454N2112J01853j66700K78886j99804K89767
14808H19625B43806L63547C00324L83854B90112K50763p3738P0822J05634J86263
14798H29856L7007C46310o6894L38921J6068j5740k8558j19812K67706j87865
14788E50136j5634j25624L11751k55230J50713M33605m53712L8040N4964C44220
$$ plain form
14777 831479 395809 938693 661113 716662 829163 544545 642404 562674 871651 630745
14767 630745 1000813 343915 831740 424924 685355 961685 787000 393286 1031134 725340
14757 725340 515588 704096 816153 1004695 888454 1033547 852619 750562 381178 576130
14747 576130 1145640 810503 706340 1063879 756025 1019481 679366 930778 783468 690406
14737 690406 812001 961431 763671 886219 723049 351854 818399 1025044 668881 695842
14727 695842 708193 783240 744860 750848 943875 1288625 824909 836253 1019722 742921 665833
14716 665833 1135633 668082 905844 1062083 1215624 1036527 1037129 777893 798506 881867
14706 881867 1008024 1150155 978780 1035812 1119820 955655 1144885 933406 970118 1190906
$$ packed form
14777H31479C95809N42884k77580N5549J12501k84618R7859p9730L08977k40906
14767F30745L70068C43915M87825m06816K60431K76330j74685C93286O37848l05794
14757G25340k09752J88508J12057J88542j16241J45093j80928j02057l69384J94952
14747E76130N69510l35137j04163L57539l07854K63456l40115K51412j47310r3062
14737F90406J21595J49430j97760J22548j63170C51854M66545K06645l56163K6961
14727F95842J2351P5047l8380N988J93027L44750m63716J1344J83469k76801p7088
14716F65833M69800m67551K37762J56239J53541j79097O02k59236K0613Q3361
14706H81867J26157J42131j71375N7032Q4008j64165J89230k11479L6712K20788
$$ plain form
14696 1190906 1235205 886360 954019 1059621 983968 1133934 799646 1021611 895883 1229066
14686 1229066 931133 1236005 1111917 1155887 839421 1169088 1187005 1232288 1626279 1398467
14676 1398467 1035809 1079787 1182558 1249752 971796 922659 1385039 864175 1075065 1160131
14666 1160131 1135960 1203206 876013 1225318 1466183 1475288 1289434 1161448 1248753 1299157
14656 1299157 1069832 1606336 1506134 1180573 1595382 1194968 1206257 1188868 1217098 1391410
14646 1391410 1238717 1561185 1794559 1268879 1278009 1526363 1174397 1221017 1798224 1726547
14636 1726547 1429305 1602244 1423132 1342007 1468109 1515847 1569022 1824244 1918565 1325902
14626 1325902 1763738 1579714 1515526 1539651 1749257 1696107 1425790 1526930 1664853 1696566
$$ packed form
14696A190906M4299l48845O7659J05602p5653J49966l34288K21965j25728L33183
14686A229066k97933L04872j24088M3970l16466L29667J7917M5283L93991k27812
14676A398467l62658M3978J02771O7194k77956m9137M62380n20864K10890Q5066
14666A160131k4171O7246l27193L49305K40865R105j85854j27986Q7305N0404
14656A299157k29325N36504j00202l25561M14809m00414J1289j7389K8230J74312
14646A391410j52693L22468K33374n25680R130K48354l51966M6620N77207p1677
14636A726547k97242J72939j79112q1125J26102M7738N3175K55222R4321n92663
14626A325902M37836j84024o4188K4125K09606n3150k70317J01140J37923L1713
$$ plain form
14616 1696566 1750740 1518940 1953455 1525415 1659253 2027212 1794667 1825215 1511868 1827092
14606 1827092 1804828 2011624 1776065 2046719 2009608 1690458 1834436 2100318 1971529 2117429
14596 2117429 1592839 1769753 1759716 2079215 2075389 2063768 1930279 1803225 2134643 2063455
14586 2063455 1977193 1905188 2222554 2628059 2223147 1909688 2257958 2230228 2508691 2166734
14576 2166734 2136774 2226542 2406221 2606675 2335724 2543045 2825118 2576944 2575916 2833187
14566 2833187 2591225 2912895 2697216 2842418 2831897 2904717 2977358 2929204 3021450 3428400
14556 3428400 3393367 3277780 4021397 4233066 4414583 5214423 5909614 8010441 11475861
14547 11475861 21556995 41883790 43867903 22727429 11932404 6668087 4483271
$$ packed form
14616A696566N4174k31800M34515m28040J33838L67959k32545L0548l13347L15224
14606A827092k2264K06796k35559K70654l7111l19150J43978K65882j28789J45900
14596B117429n24590J76914j0037L19499l826j1621j33489j27054L31418p1188
14586B063455q6262p2005L17366M05505m04912l13459L48270k7730K78463l41957
14576B166734k9960Q9768J79679K00454k70951K07321K82073k48174j028K57271
14566B833187k41962L21670k15679J45202j0521P2820P2641m8154R2246M06950
14556C428400l5033j15587P43617K11669J81517P99840O95191K100827L465420
14547A1475861J0081134K0326795J984113k1140474j0795025n264317k184816
$$ plain form
14540 4483271 3936837 2948375 3151505 2954679 2711025 3017110 2676869 2472892 2796054
14531 2796054 2499045 2637450 2836888 2825141 2710306 2550309 3085080 2999221 3086217 2833907
14521 2833907 2962100 2873208 2711674 2901689 3196223 3160702 3215904 3126409 2987067 3472797
14511 3472797 3117621 3160406 3179879 3310694 3287692 3458035 3393157 3520720 3536008 3477934
14501 3477934 3638983 3488718 3765157 3549933 3972000 3686929 3579358 4011686 3934787 3779187
14491 3779187 4454892 4011729 4294515 4415026 3938443 4492988 4030960 4144576 4316175
14482 4316175 4588021 4485906 4696590 4403059 4580147 4626452 4577282 4670190 4743766 4899160
14472 4899160 4907668 5073491 5324622 5054482 5209101 5139903 5256584 5563164 5376551 5432196
$$ packed form
14540D483271n46434r88462K03130j96826k43654L06085l40241k03977L23162
14531B796054k97009J38405J99438j1747j14835j59997N34771q5859Q6996k52310
14521B833907J28193q8892j61534J90015K94534l5521N5202q9495j39342M85730
14511C472797l55176M2785J9473J30815k3002J70343o4878J27563J5288n8074
14501C477934J61049j50265K76439k15224M22067k85071j07571M32328p6899j55600
14491C779187O75705m43163K82786J20511m76583N54545m62028J13616J71599
14482D316175K71846j02115K10684k93531J77088M6305m9170R2908P3576J55394
14472D899160Q508J65823K51131k70140J54619o9198J16681L06580j86613N5645
$$ plain form
14462 5432196 5142053 5795672 5882094 5848088 6090293 5674514 5619641 5904512 6326738 6332669
14452 6332669 6354113 6303796 6407660 6508702 6709012 6802694 6478999 6651129 6529455 7084928
14442 7084928 6633119 7318838 7183950 7440699 7408353 7274150 7721112 7937039 7340535 8101935
14432 8101935 7890637 8405279 8453625 8377607 8367417 8469934 8628465 8946366 8830163 8786359
14422 8786359 9013392 9238749 9120497 9664566 9602860 9970988 9867665 9977806 10142807 10248856
14412 10248856 10391187 10593707 11068607 10896516 11437649 10952100 11552835 11709185 12032271
14403 12032271 11587041 12390651 12425707 12736875 12531028 12658106 13521023 13296111 13796751
14394 13796751 13992313 13930801 14535178 14551957 15043550 15166826 15268143 15264391 15709434 15985968
$$ packed form
14462E432196k90143O53619Q6422l4006K42205m15779n4873K84871M22226N931
14452F332669K1444n0317J03864J01042K00310R3682l23695J72130j21674N55473
14442G084928m51809O85719j34888K56749l2346j34203M46962K15927n96504P61400
14432H101935k11298N14642M8346p6018j0190J02517J58531L17901j16203m3804
14422H786359K27033K25357j18252N44069o1706L68128j03323J10141J65001J06049
14412A0248856J42331K02520M74900j72091N41133m85549O00735J56350L23086
14403A2032271m45230Q03610L5056L11168k05847J27078Q62917k24912N00640
14394A3796751J95562o1512O04377J6779M91593J23276J01317l752M45043K76534
$$ plain form
14384 15985968 16773063 16732668 17022737 17361244 17623428 18010675 18037072 18576131 18971253 19142806
14374 19142806 19613468 19957362 20395247 20930552 20886834 21428528 21792901 22311558 23011279
14365 23011279 23258834 23785956 24487903 24913189 25183423 25946796 26192166 26821434 27634331
14356 27634331 28321004 28545008 29547526 30198390 30957733 31966772 32286895 32920159 33734808
14347 33734808 34821329 35499574 36248420 37503133 38672580 39462503 40740781 41171481 42491710
14338 42491710 43915478 45100868 45941334 47474470 48767832 50139600 51625730 53294742
14330 53294742 54790408 56348356 58121892 60105473 61859910 63818069 66300574 68110982
14322 68110982 70830954 72897342 75374973 77611073 80660173 83393746 86168653 89473279
$$ packed form
14384A5985968P87095m0395K90069L38507K62184L87247K6397N39059L95122J71553
14374A9142806M70662L43894M37885N35305m3718N41694L64373N18657O99721
14365B3011279K47555N27122P01947M25286K70234P63373K45370O29268Q12897
14356B7634331O86673K24004J002518O50864P59343J009039L20123O33264Q14649
14347C3734808J086521O78245P48846J254713J169447P89923J278278M30700J320229
14338D2491710J423768J185390Q40466J533136J293362J371768J486130J669012
14330E3294742J495666J557948J773536J983581J754437J958159K482505J810408
14322F8110982K719972K066388K477631K236100L049100K733573K774907L304626
$$ plain form
14314 89473279 92623438 96314729 99922004 104032585 108067766 112283299 116900980 121577602
14306 121577602 126599750 131788988 137953424 143621794 149870376 156755266 163893522 170767690
14298 170767690 178734592 187184407 196128062 204986793 214887975 225057107 235925341 247303490
14290 247303490 258925093 271341866 284361542 297832855 311962851 326094984 340966161
14283 340966161 355510522 370833823 385694535 400444360 414508268 427958221 440754222
14276 440754222 452154876 461847960 469579216 474902495 477348515 474913717 469571003 465469678
14268 465469678 460195789 455337804 445285111 433612482 421744052 408917956 395002767
14261 395002767 380610099 366699096 353960583 344160876 330772212 316730986 302057069
$$ packed form
14314H9473279L150159L691291L607275M110581M035181M215533M617681M676622
14306A21577602N022148N189238O164436N668370O248582O884890P138256O874168
14298A70767690P966902Q449815Q943655Q858731R901182J0169132J0868234J1378149
14290B47303490J1621603J2416773J3019676J3471313J4129996J4132133J4871177
14283C40966161J4544361J5323301J4860712J4749825J4063908J3449953J2796001
14276D40754222J1400654R693084P731256N323279K446020k434798n342714m101325
14268D65469678n273889m857985j0052693j1672629j1868430j2826096j3915189
14261C95002767j4392668j3911003j2738513r799707j3388664j4041226j4673917
$$ plain form
14254 302057069 289054483 275401385 262392244 249646635 237445594 226388008 215662106
14247 215662106 204743361 195189473 185968927 177586039 169697929 161614446 153862750 147044235
14239 147044235 140756046 134718933 128991068 123630759 118170489 113515912 108692524 104460263
14231 104460263 100668210 96576882 92728285 89459724 85900970 82541375 79548711 77046592
14223 77046592 74332056 71500989 69070463 67015096 64809079 62365791 60612960 58347149
14215 58347149 56628964 55199223 53663888 51904156 49849743 48620971 47284000 46112635
14207 46112635 45231256 43920635 42823354 41170462 39966179 39044355 38055220 37280356 36128374
14198 36128374 35272937 34456510 33676867 32683819 31991175 31484375 30665383 29513038 28910776
$$ packed form
14254C02057069j3002586j3653098j3009141j2745609j2201041j1057586j0725902
14247B15662106j0918745r553888r220546q382888p888110q083483p751696o818515
14239A47044235o288189o037113n727865n360309n460270m654577m823388m232261
14231A04460263l792053m091328l848597l268561l558754l359595k992664k502119
14223G7046592k714536k831067k430526k055367k206017k443288j752831k265811
14215E8347149j718185j429741j535335j759732k054413j228772j336971j171365
14207D6112635q81379j310621j097281j652892j204283r21824r89135p74864j151982
14198C6128374q55437q16427p79643r93048o92644n06800q18992j152345o02262
$$ plain form
14189 28910776 27867730 27387025 26669790 26385222 25736741 25072618 24963571 24116066 23816711
14180 23816711 22948588 22704695 22098196 22032543 21267357 20716888 20524481 19896091 19575581
14171 19575581 19214735 19086943 18560599 18023862 17629414 17580485 17001753 16889612 16046852
14162 16046852 16236024 16024070 15448230 15096029 15143485 14870704 14604922 14228004 13804647
14153 13804647 13811179 13731034 13581206 13022308 13112224 12589953 12105224 12403360 12272210 11797501
14143 11797501 11632128 11337670 11690136 11190739 10857722 10991285 10716491 10513459 10620443
14134 10620443 10455667 10084144 10100714 9998292 9725887 9711795 9740247 9454073 9067086 8868619
14124 8868619 9564357 8885869 8662795 8860584 8737262 8294861 8205224 8205066 8061082 7945305
$$ packed form
14189B8910776j043046m80705p17235k84568o48481o64123j09047q47505k99355
14180B3816711q68123k43893o06499o5653p65186n50469j92407o28390l20510
14171A9575581l60846j27792n26344n36737l94448m8929n78732j12141q42760
14162A6046852J89172k11954n75840l52201M7456k72781k65782l76918m23357
14153A3804647O532q0145j49828n58898Q9916n22271m84729K98136j31150m74709
14143A1797501j65373k94458L52466m99397l33017J33563k74794k03032J06984
14134A0620443j64776l71523J6570j02422k72405j4092K8452k86174l86987j98467
14124H868619O95738o78488k23074J97789j23322m42401q9637j58j43984j15777
$$ plain form
14114 7945305 7991491 7974135 7852280 7366927 7369483 7333912 7518202 7169125 7024933 7039146
14104 7039146 7172899 6952996 7083233 6451486 6963599 6350471 6748495 6610998 6100662
14095 6100662 6232605 6049589 6466225 5723511 5920141 5832872 5954042 6226458 5985744 5779905
14085 5779905 5474701 5660555 5502855 5138849 5342988 5521595 5281016 5232473 5211836 4885742
14075 4885742 5229418 5147391 4809570 4935002 4839337 4703365 4725408 4648025 4952081 4716661
14065 4716661 4692397 4490437 4595286 4401876 4349637 4571603 4399180 4499663 4581341 4395400
14055 4395400 4298802 4423703 4257414 4022713 3979472 4185585 4196735 4364069 3822819 3947227
14045 3947227 3810986 3624274 3606479 3580593 3748949 3756863 3728792 3513229 3585290 3380916
$$ packed form
14114G945305M6186j7356j21855m85353K556l5571J84290l49077j44192J4213
14104G039146J33753k19903J30237o31747N12113o13128L98024j37497n10336
14095F100662J31943j83016M16636p42714J96630q7269J21170K72416k40714k05839
14085E779905l05204J85854j57700l64006K04139J78607k40579m8543k0637l26094
14075D885742L43676q2027l37821J25432r5665j35972K2043p7383L04056k35420
14065D716661k4264k01960J04849j93410n2239K21966j72423J00483Q1678j85941
14055D395400r6598J24901j66289k34701m3241K06113J1150J67334n41250J24408
14045C947227j36241j86712j7795k5886J68356P914k8071k15563P2061k04374
$$ plain form
14035 3380916 3484366 3513153 3200409 3582309 3341891 3198073 3342791 3058171 3061754 3423384
14025 3423384 3101726 2973980 3277807 3291256 3391885 3417716 3051665 2880663 2939864 2787936
14015 2787936 2994872 2705017 2922528 2473766 2902790 2557212 2522496 2566369 2713580 2657536
14005 2657536 2783491 2864580 2682712 2777445 2298694 2335568 2640110 2296862 2085395 2077874
13995 2077874 2458567 2106753 2289875 1987754 2536200 2480684 3541864 5676574 13854709
13986 13854709 34607530 45275489 26320582 14529075 9534112 6675166 5547221
13979 5547221 4925009 4261085 4174553 4066829 3708908 3717529 3163922 3101882 2996864 2971199
13969 2971199 2709209 2720066 2683320 2634004 2683744 2617772 2456262 2291922 2418177 2293762
$$ packed form
14035C380916J03450K8787l12744L81900k40418j43818J44718k84620L583L61630
14025C423384l21658j27746L03827J3449J00629K5831l66051j71002N9201j51928
14015B787936K06936k89855K17511m48762M29024l45578l4716M3873J47211n6044
14005B657536J25955Q1089j81868R4733m78751L6874L04542l43248k11467p521
13995B077874L80693l51814J83122l02121N48446n5516J061180K134710Q178135
13986A3854709K0752821J0667959j8954907j1791507m994963k858946j127945
13979E547221o22212o63924q6532j07724l57921Q621n53607o2040j05018k5665
13969B971199k61990J0857l6746m9316M9740o5972j61510j64340J26255j24415
$$ plain form
13959 2293762 2477581 2341948 2402633 2544411 2323042 2118791 2223574 2247297 2514259 2145843
13949 2145843 2232238 2194005 2028923 2013626 2363895 2069227 2491908 2026674 2192880 1902664
13939 1902664 2236350 1836130 1942298 1846740 1853341 1812853 2065531 1850267 2101959 2027999
13929 2027999 1553164 2038261 1771986 1576823 1588868 2019522 1773757 1764209 1983143 1459411
13919 1459411 1880744 1836959 1502944 1508023 1504393 1992707 1616992 1319193 1661356 1353454
13909 1353454 1482758 1679036 1868643 1422066 1424879 1268462 1554392 1673681 1670735 1517550
13899 1517550 1563044 1208659 1334000 1387880 1520695 1180301 1286762 1223791 1440549 1399282
13889 1399282 1297604 1556443 1533425 1312962 1353287 1332904 1085705 1249950 1296413 1428822
$$ packed form
13959B293762J83819j35633O0685J41778k21369k04251J04783K3723K66962l68416
13949B145843Q6395l8233j65082j5297L50269k94668M22681m65234J66206k90216
13939A902664L33686m00220J06168r5558O601m0488K52678k15264K51692p3960
13929B027999m74835M85097k66275j95163J2045M30654k45765r548K18934n23732
13919A459411M21333m3785l34015N079l630M88314l75715k97799L42163l07902
13909A353454J29304J96278J89607m46577K813j56417K85930J19289k946j53185
13899A517550M5494l54385J25341N3880J32815l40394J06461o2971K16758m1267
13889A399282j01678K58839k3018k20463M0325k0383k47199J64245M6463J32409
$$ plain form
13879 1428822 1368415 1058636 1192494 1434655 1336280 1320341 1324190 1257443 1206705 1150096 1266197
13868 1266197 1040665 1099416 1117833 1129457 1212546 970504 1190045 1344667 1317797 992273
13858 992273 980383 1421839 1463267 1320651 1022071 999085 1183908 1086069 1254351 1043509
13848 1043509 1366211 1193507 1262743 1038163 1253939 1025794 813038 1048924 1465873 1014925
13838 1014925 1296154 1206423 723245 1252127 655258 1235905 849656 1035593 1118335 877020
13828 877020 1166050 1148729 1374638 1267408 982373 870801 934949 975738 1027024 952107
13818 952107 711102 1081616 1208038 998630 796560 990840 1050466 773913 563666 961308
13808 961308 817958 870278 947985 1318130 1017248 1023310 1046323 941325 1114361 915405
$$ packed form
13879A428822o0407l09779J33858K42161r8375j5939L849o6747n0738n6609J16101
13868A266197k25532N8751J8417J1624Q3089k42042K19541J54622k6870l25524
13858I92273j1890M41456M1428j42616k98580k2986J84823r7839J68282k10842
13848A043509L22702j72704O9236k24580K15776k28145k12756K35886M16949m50948
13838A014925K81229q9731m83178N28882n96869N80647l86249J85937Q2742k41315
13828H77020K89030j7321K25909j07230k85035j11572O4148M0789N1286p4917
13818I52107k41005L70514J26422k09408k02070J94280N9626k76553k10247L97642
13808I61308j43350N2320P7707L70145l00882O062K3013j04998J73036j98956
$$ plain form
13798 915405 1160866 358675 831112 972071 873412 1188323 679343 913344 1055447 872772
13788 872772 654818 899932 850016 658056 900176 473889 966097 613620 693891 835603
13778 835603 906903 721522 719134 754161 879468 696127 774230 736121 700089 686384 1000415
13767 1000415 845783 658441 567002 789866 894182 913104 848126 703362 800377 835495
13757 835495 780145 559879 847091 996918 701837 408624 947462 765626 639509 638593
13747 638593 647639 724930 923476 806336 576298 1000439 644455 782792 701673 722412
13737 722412 582276 588434 777411 745240 159395 812955 746390 999563 1015257 536579
13727 536579 474704 909942 610990 719551 416434 900967 945308 607431 634087 625470
$$ packed form
13798I15405K45461C58675M72437J40959r8659L14911n08980K34001J42103j82675
13788H72772k17954K45114m9916j91960K42120m26287M92208l52477Q0271J41712
13778H35603P1300j85381k388L5027J25307j83341P8103l8109l6032j3705L14031
13767A000415j54632j87342r1439K22864J04316J8922o4978j44764R7015L5118
13757H35495n5350k20266K87212J49827k95081k93213N38838j81836j26117r16
13747F38593R046P7291J98546j17140k30038M24141l55984J38337q1119K0739
13737G22412j40136O158J88977l2171A59395O53560o6565K53173J5694m78678
13727E36579o1875M35238k98952J08561l03117M84533M4341l37877K6656q617
$$ plain form
13717 625470 255592 794983 487015 803809 527572 652423 541386 481319 770590 453751
13707 453751 176093 636975 579315 746318 324886 692424 716753 413579 364578 593884
13697 593884 374616 630911 678763 523398 792553 753788 779807 417007 799014 763361
13687 763361 748525 439187 303724 493218 592549 548683 577645 210250 582748 311173
13677 311173 474962 444850 255688 710238 286626 364097 465214 380637 509016 539747
13667 539747 473402 546031 396570 476954 803866 733659 179665 578540 420357 551344
13657 551344 463116 512853 404109 275592 465632 267342 315307 451615 460283 336256
13647 336256 143625 467492 230401 686038 392863 489009 278465 382590 303026 323484
$$ packed form
13717F25470B55592N39391l07968L16794k76237J24851j11037o0067K89271l16839
13707D53751A76093M60882n7660J67003C24886L67538K4329l03174m9001K29306
13697E93884k19268K56295M7852j55365K69155l8765K6019l62800L82007l5653
13687G63361j4836l09338j35463J89494R9331m3866K8962B10250L72498k71575
13677C11173J63789l0112j89162M54550B86626P7471J01117q4577J28379L0731
13667E39747o6345P2629j49461Q0384L26912p0207A79665L98875j58183J30987
13657E51344q8228M9737j08744j28517J90040j98290M7965J36308Q668j24027
13647C36256A43625L23867B30401M55637k93175R6146k10544J04125p9564K0458
$$ plain form
13637 323484 329916 434333 192657 337381 342887 258522 369831 89653 415284 343403 447075
13626 447075 496972 243955 90537 332741 600767 476582 199783 112529 314309 228416
13616 228416 474421 727547 457790 409999 592942 -34428 762396 572665 644934 639515
13606 639515 206334 303413 521792 124974 433463 732326 344982 477965 73077 354078
13596 354078 249873 415655 224198 766847 299737 310658 858864 286968 665395 295549
13585 217238 587730 688342 166196 416305 257652 280639 516560 450943 446707 596317
13575 596317 395426 417668 430149 277832 291504 508359 863714 302634 651852 492188
13565 492188 269746 208619 291230 486620 167759 313082 364340 280852 168799 673815
$$ packed form
13637C23484O432J04417A92657J44724N506q4365J11309H9653L25631p1881J03672
13626D47075M9897B43955I0537K42204K68026j24185A99783q7254K01780q5893
13616B28416K46005K53126k69757m7791J82943c4428G62396j89731P2269n419
13606F39515B06334R7079K18379A24974L08489K98863C44982J32983G3077K81001
13596C54078j04205J65782j91457N42649B99737J0921N48206B86968L78427B95549
13585B17238L70492J00612A66196K50109j58653K2987K35921o5617m236J49610
13575E96317k00891K2242J2481j52317J3672K16855L55355C02634L49218j59664
13565D92188k22442o1127Q2611J95390A67759J45323N1258q3488j12053N05016
$$ plain form
13555 673815 364497 321163 453946 359556 360076 143696 267111 249986 542685 39398 328455
13544 328455 367642 349746 295001 683846 265189 383026 331092 284451 318736 403553 152519
13532 679029 314670 241735 370900 440321 231342 592557 448264 -2408 637717 78317
13521 418215 333912 238175 435623 198742 283382 147945 550789 525351 304868 181569
13511 181569 138663 415985 481829 521096 289676 317836 350075 645048 -111494 9347 112855
13500 112855 306835 381660 534116 470760 142136 690324 155182 144755 315029 583889
13490 583889 375059 298349 431811 315132 384111 498944 286799 211810 220859 628644
13480 628644 307110 36343 349691 130997 227316 289852 316907 -172561 252653 193119
$$ packed form
13555F73815l09318m3334J32783r4390N20A43696J23415j7125K92699C9398K89057
13544C28455L9187j7896n4745L88845B65189J17837n1934m6641L4285Q4817A52519
13532F79029C14670p2935J29165O9421k08979L61215j44293b408F37717G8317
13521D18215q4303r5737J97448A98742Q4640j35437M02844k5438k20483j23299
13511A81569m2906K77322O5844L9267k31420K8160L2239K94973a11494I347J03508
13500A12855J93980P4825J52456o3356A42136N48188A55182j0427J70274K68860
13490E83889k08830p6710J33462j16679O8979J14833k12145p4989R049M07785
13480F28644C07110C6343L13348A30997R6319O2536K7055a72561B52653n9534
$$ plain form
13470 193119 172959 626607 298208 58492 293140 -14672 34871 388181 168298 9759 221890
13459 221890 -19054 266382 -53132 103194 160639 353641 349164 290420 176523 171462 374578
13448 374578 429081 236259 323524 141867 169960 331341 112019 111601 211508 239363 351843
13437 351843 156226 177078 281907 76705 599055 338811 121291 259621 331227 298164
13427 298164 212691 147394 208449 171951 394964 166392 270419 491493 614236 277487
13416 384443 493 334202 61066 282185 -110710 310159 91283 316160 257555 511711 476709
13405 476709 302097 -48834 -58770 233968 308574 133109 165358 413785 440386 274185 -8241
13393 247001 491391 -20622 102074 -138835 -96177 477959 50026 484796 75265 173774
$$ packed form
13470A93119k0160M53648B98208E8492K34648a4672C4871L53310A68298I759K12131
13459B21890a9054B66382e3132A03194N7445J93002m477n8744j13897n061K03116
13448C74578N4503j92822Q7265A41867K8093J61381A12019m18R9907K7855J12480
13437C51843A56226K0852J04829G6705N22350k60244A21291J38330P1606l3063
13427B98164q5473o5297O1055l6498K23013A66392J04027K21074J22743B77487
13416C84443D93L33709F1066K21119a10710C10159I1283K24877n8605K54156l5002
13405D76709j74612d8834r936B33968P4606A33109L2249K48427K6601j66201h241
13393B47001K44390b0622A02074a38835M2658D77959E0026M34770G5265R8509
$$ plain form
13383 173774 -1209 233536 564003 442875 23837 973 495410 66698 99307 288565 575829
13372 575829 357141 451769 475783 478963 142301 95905 654266 457971 187076 214512 80352
13360 315800 239804 405215 96661 332310 357593 -32046 251724 424786 184721 22995
13349 240635 127928 420340 292273 525905 196664 144169 1664 55595 149514 395754
13339 395754 400488 155336 649226 327388 148395 344447 60052 180980 479527 -50523
13328 225363 -2022 316793 35916 -38586 130125 198992 345006 165152 158988 462746 237347
13317 237347 450397 188917 -45655 266133 10298 362891 233356 223636 171148 168711 85499
13306 85499 160846 -143094 352227 -18586 331830 41856 282634 47657 23270 137348 112577
$$ packed form
13383A73774a209B33536L30467j21128B3837I73M94437F6698L2609J89258K87264
13372E75829k18688R4628K4014L180A42301m6396N58361j96295A87076K7436H0352
13360C15800p5996J65411I6661K35649K5283c2046B51724J73062A84721B2995
13349B40635j12707K92412j28067K33632A96664n2495A664N3931R3919K46240
13339C95754M734A55336M93890l21838A48395J96052F0052J20928K98547e0523
13328B25363b022C16793C5916c8586A30125O8867J46014A65152o164L03758k25399
13317B37347K13050A88917d5655B66133A0298L52593j29535r720n2488k437q3212
13306H5499P5347a43094C52227a8586C31830D1856K40778D7657B3270J14078k4771
$$ plain form
13295 112577 244923 351274 541684 172987 -32319 -58438 359184 295486 208813 50550
13284 185193 -29102 25063 382531 -102683 76624 -93356 565283 327800 68850 418806
13274 418806 164023 293762 -120999 279904 422685 239011 179832 128350 -37402 106285
13263 99513 234949 332796 255181 335296 264953 181877 120866 244196 514549 -65928 35640
13251 248637 235724 -98042 21095 263191 43811 198643 290774 164972 -12728 299394 312740
13240 312740 481230 -13479 190303 -47765 91089 -171860 135390 -22075 -95245 510760
13229 98956 192701 113589 -144156 222003 156537 96827 113156 266338 -180722 -17878 216698
13217 246454 -1188 80630 -30510 223875 115939 -324032 -10795 23264 11255 -49674 44938
$$ packed form
13295A12577J32346J06351J90410A72987c2319k6119C59184o3698q6673E0550
13284A85193b9102B5063L57468a02683G6624i3356E65283k37483F8850L49956
13274D18806A64023J29739a20999B79904J42781j83674n9179n1482c7402A06285
13263I9513J35436R7847p7615Q0115p0343q3076o1011J23330K70353f5928C5640
13251B48637j2913i8042B1095K42096D3811J54832R2131j25802a2728B99394J3346
13240C12740J68490a3479A90303d7765I1089a71860A35390b2075p3170E10760
13229I8956R3745p9112a44156B22003o5466n9710J6329J53182a80722a7878B16698
13217B46454a188H0630c0510B23875j07936c24032a0795B3264A1255d9674D4938
$$ plain form
13205 -72733 -238311 141109 -34628 -162208 -9488 -106874 -179146 341176 75757 180567 87936
13193 -104296 402635 108035 336917 299316 830 69941 183244 211117 1358 393285 224739
13182 224739 7657 313098 171166 59469 37033 48578 155814 224743 260468 -153402 -85286
13171 -85286 238545 -61746 41740 -202910 33275 -162053 119666 68133 340358 242562 -103912
13159 26851 330941 66090 134307 195772 357389 107216 255014 14153 61378 131686 128694
13148 128694 96740 310800 43838 -68607 141169 -151870 369140 314712 130923 -9495 7202
13136 246417 292427 -130545 -125573 270462 369837 -96720 178907 -80539 -72357 72741 73578 393388
13124 393388 539152 21415 189654 382086 20374 199140 14861 -11520 118458 -128415
$$ packed form
13205g2733j65578A41109c4628j27580i488r7386p2272C41176G5757J04810H7936
13193a04296D02635A08035K28882l7601H30O9111J13303K7873A358L91927j68546
13182B24739G657L05441j41932E9469k2436J1545J07236O8929L5725a53402O8116
13171h5286B38545f1746D1740b02910C3275a62053A19666n1533K72225r7796a03912
13159B6851L04090F6090O8217O1465J61617A07216J47798A4153M7225P0308k992
13148A28694l1954K14060D3838f8607A41169a51870C69140n4428A30923i495G202
13136B46417M6010a30545M972B70462R9375i6720A78907h0539Q182G2741Q37L19810
13124C93388J45764B1415J68239J92432B0374J78766A4861a1520A18458a28415
$$ plain form
13113 -158564 324340 434378 -143977 363038 13397 25265 87209 -234234 114668 -352828
13102 123562 30721 -171789 168540 -151203 -65126 -51495 33509 141391 66257 -41720 228971
13090 -98438 519325 479889 206942 135662 -2910 -65901 -92020 -5835 -67445 -256400 131016
13078 167646 -59182 239262 -23200 210567 278051 148332 180987 -38948 -39212 270218 108157
13066 319213 18373 77138 -80863 -18466 -149503 153196 14671 168544 223142 -47738 27398
13054 490050 -193284 214359 111505 89208 37281 154268 -15516 242044 73241 134238
13044 134238 206691 121042 58610 246759 457736 -59634 181787 -129339 288750 328851
13034 328851 -108823 247067 332232 -23780 108803 577794 54228 -32295 226540 8122 337880
$$ packed form
13113a58564C24340J10038a43977C63038A3397J1868O1944b34234A14668c52828
13102A23562C0721a71789A68540a51203f5126J3631C3509J07882F6257d1720B28971
13090i8438E19325l9436B06942p1280b910o2991k6119e835o1610j88955A31016
13078A67646e9182B39262b3200B10567O7484j29719L2655c8948k64B70218A08157
13066C19213A8373N8765h0863a8466j31037A53196A4671J53873N4598d7738B7398
13054D90050a93284B14359j02854k2297C7281J16987a5516B42044G3241O0997
13044A34238P2453q5649E8610J88149K10977e9634A81787a29339B88750M0101
13034C28851a08823B47067Q5165b3780A08803M68991E4228c2295B26540H122L29758
$$ plain form
13023 337880 104027 133620 103538 396631 291671 164414 384522 331188 -194001 20959
13012 360233 57364 110135 -226365 271644 182580 -60300 -139990 106124 217103 285375 39274
13000 6086 -102758 37917 -247193 19837 38735 161928 -59561 360989 -28822 197226 23490
12988 189792 89085 30436 -9700 108276 121119 -71096 -170022 -68737 16860 -2807 -199578
12977 -199578 -203115 56022 -98485 330499 245073 290921 67098 450863 -102914 203143 -182537
12965 113063 -73234 -167422 25381 136707 58833 24899 137770 -149802 100187 176334 164359
12954 164359 85642 216755 -25931 95234 202721 161019 -14763 36341 191978 111465 -375048
12942 230594 -52341 -149801 -69316 -154806 243060 -127149 -29239 225196 -5466 -141013 474073
$$ packed form
13023C37880A04027K9593l0082K93093j04960j27257K20108n3334a94001B0959
13012C60233E7364N2771b26365B71644q9064f0300p9690A06124J10979O8272C9274
13000F086a02758C7917b47193A9837J8898J23193e9561C60989b8822A97226B3490
12988A89792H9085C0436i700A08276J2843g1096r8926f8737A6860b807j96771
12977a99578l537E6022i8485C30499q5426M5848F7098L83765a02914B03143a82537
12965A13063g3234r4188B5381J11326E8833B4899J12871a49802A00187P6147j1975
12954A64359p8717J31113b5931I5234J07487m1702a4763C6341J55637q0513c75048
12942B30594e2341r7460f9316q5490B43060a27149b9239B25196e466j35547D74073
$$ plain form
12930 -174029 422161 172514 -106924 -72039 240473 102866 233095 107358 -21948 -161194
12920 -161194 125121 125686 194189 -109940 7975 345386 22998 218566 -32415 147462 10006
12908 -75246 161523 313845 -14734 -175554 -267660 -40202 201229 57147 47146 74579 186047
12897 186047 -34609 -49027 55387 -150822 48088 26832 -13982 269600 -276270 658658 -219074
12885 194277 328244 216697 41642 -3845 325783 -201538 -178984 319696 -121249 284717
12874 179273 -108866 329066 -284593 159884 210556 -121505 -189641 134406 71917 -84153
12863 -123506 15552 -2464 166974 -178671 -150202 358765 141150 -153232 -254633 -95803
12852 197433 -231855 -3660 -190716 289763 -95803 -242105 113024 197203 48644 208965
$$ packed form
12930a74029D22161A72514a06924L4885B40473A02866J30229A07358b1948j39246
12920a61194A25121N65O8503a09940G975L37411B2998J95568c2415A47462A0006
12908g5246A61523J52322a4734j60820r2106d0202B01229E7147j0001K7433J11468
12897A86047c4609j4418E5387a50822D8088k1256a3982B69600b76270F58658b19074
12885A94277J33967j11547D1642c845C25783b01538K2554C19696a21249B84717
12874A79273a08866C29066b84593A59884N0672a21505o8136A34406o2489h4153
12863a23506A5552b464A66974a78671K8469C58765A41150a53232j01401i5803
12852A97433b31855c660j87056B89763i5803j46302A13024Q4179D8644J60321
$$ plain form
12842 208965 -116186 -170351 233254 -86972 -19968 314916 140753 307528 -196953 226032
12831 156824 55104 26643 127339 68503 78828 68237 -100876 85692 -216873 -2676 94866
12819 -26608 138872 109077 114441 -144976 -299893 -49160 236941 -171035 181409 102682 20856
12807 107616 63201 435006 75961 -15621 172950 111547 19346 191071 -115638 57342 -153557
12795 239517 -11079 187635 197619 119900 -79861 151392 48151 312658 265275 -200612 375220
12783 -92122 -132356 -114415 191598 -180794 -103542 -162718 141276 413308 43805 -28530 -65498
12772 -65498 435311 -9471 58984 -117499 27851 83287 -6521 68607 385479 259008 182021
12761 182021 30976 107110 8101 -202974 211331 119216 -58876 -389285 150954 -31297 -59835
$$ packed form
12842B08965a16186n4165B33254h6972a9968C14916A40753J66775a96953B26032
12831A56824E5104B6643J00696n8836J0325j0591a00876H5692b16873b676I4866
12819b6608A38872k9795N364a44976j54917d9160B36941a71035A81409p8727B0856
12807A07616m4415L71805G5961a5621A72950o1403A9346J71725a15638E7342a53557
12795B39517a1079A87635R984p7719g9861A51392D8151K64507m7383b00612C75220
12783i2122m0234J7941A91598a80794P7252n9176A41276K72032D3805b8530l6968
12772f5498D35311i471E8984a17499B7851N5436f521F8607L16872j26471p6987
12761A82021C0976P6134H101b02974B11331r2115e8876l30409A50954c1297k8538
$$ plain form
12750 -59835 -2510 72553 -168555 -108595 -35865 43422 351110 -220811 -186239 8597 -78682
12738 72128 -136838 -272267 -36510 113914 102461 131189 -18047 29309 154861 65916 -255232
12726 -353550 233040 -44775 32733 -6828 90023 -90878 -222285 19288 -165059 -31227 128165
12714 47277 -80085 -60512 9372 -102042 291310 122922 143864 534828 77544 375644 532249
12703 532249 -42674 368659 -72809 64405 -130957 52778 -165007 273168 109023 -37293
12692 10106 -66976 -3137 520100 113451 -162368 41806 106610 -214902 87166 -226875 476222
12680 236292 136241 420373 126795 90502 291170 -56866 19016 53142 -124883 202106
12669 288341 179485 -202339 -87420 -57167 182607 162420 37310 354844 444853 251893
$$ packed form
12750e9835b510G2553a68555N9960c5865D3422L07688b20811L4572H597g8682
12738G2128a36838j35429c6510A13914j1453K8728a8047B9309J25552F5916b55232
12726c53550B33040d4775C2733f828I0023i0878j31407A9288a65059c1227A28165
12714D7277h0085J9573I372a02042B91310A22922K0942L90964G7544K98100J56605
12703E32249d2674C68659g2809F4405a30957E2778a65007B73168A09023c7293
12692A0106f6976c137E20100A13451a62368D1806O4804b14902H7166b26875D76222
12680B36292j00051K84132A26795l6293K00668e6866A9016L4126a24883B02106
12669B88341j08856b02339h7420L0253A82607k0187C7310L17534R0009j92960
$$ plain form
12659 251893 188025 15347 296405 -90798 78689 -34455 165202 255420 152981 253877 181384
12648 181384 -157269 178848 267152 208022 116252 148500 -87486 -377948 124140 70139 87162
12637 87162 -41233 132747 -31272 -211353 -117905 39297 397670 413487 406188 227304 165788
12626 165788 330323 28060 -80864 178000 -3030 -14178 -70040 -77574 25724 56942 -10562
12614 296963 -100290 198262 -3857 -10595 -99292 -74825 -52241 65601 175317 78138 -80474
12602 209936 -256624 181965 -37968 -3149 184315 92812 -19228 39615 -267277 5185 -242512
12590 293912 155015 142925 -276502 218557 1920 24484 -21504 -230259 93675 152955 229059
12579 229059 -199601 509010 -97416 193261 -187156 21241 -146909 -162477 111160 -94541
$$ packed form
12659B51893o3868A5347K81058i0798G8689c4455A65202R0218j02439J00896p2493
12648A81384a57269A78848Q8304n9130r1770L2248h7486k90462A24140n4001J7023
12637H7162d1233A32747c1272j80081R3448C9297L58373J5817p299j78884o1516
12626A65788J64535B8060h0864A78000c030j1148n5862p534B5724L1218a0562
12614B96963a00290A98262c857o738q8697K4467K2584F5601J09716G8138h0474
12602B09936b56624A81965c7968c149A84315r1503a9228C9615b67277E185b42512
12590B93912j38897j2090b76502B18557A920K2564b1504k08755I3675N9280P6104
12579B29059a99601E09010i7416A93261a87156B1241a46909j5568A11160i4541
$$ plain form
12568 19614 255374 117050 317924 558665 45985 157698 -122392 -184926 46541 350221
12558 350221 -311781 142318 -175927 -34325 -99794 124148 -62194 -264376 228800 163227
12548 163227 -41575 78669 153005 69064 108711 -167627 -183349 -244552 -129243 83887 247300
12537 247300 -56399 221084 -9473 -121162 243767 82015 -231446 305753 -247854 -90788
12526 62482 -113477 70619 -148920 494487 289141 248343 -122342 278297 32461 -83515
12515 138865 -175873 -95140 -106103 272479 -23575 229320 -103997 73765 62474 44914 -21070
12503 247677 119953 128983 -181474 -254050 92299 18386 150493 -270968 229357 -153244
12492 266712 141466 158862 -3236 -135383 5395 201104 142553 48921 84300 206682 -94477
$$ packed form
12568A9614K35760A17050K00874K40741D5985J11713a22392o2534D6541L03680
12558C50221c11781A42318a75927c4325o5469A24148f2194k02182B28800o5573
12548A63227d1575G8669P4336F9064L9647a67627j5722o1203J15309H3887J63413
12537B47300e6399B21084i473j11689B43767H2015b31446C05753b47854i0788
12526F2482a13477G0619a48920D94487k05346m0798a22342B78297C2461h3515
12515A38865a75873Q0733j0963B72479b3575B29320a03997G3765j1291j7560b1070
12503B47677A19953R030a81474p2576I2299A8386J32107b70968B29357a53244
12492B66712j25246J7396c236j32147E395J95709n8551D8921L5379J22382i4477
$$ plain form
12480 141588 212374 335803 82210 -211819 184628 -223032 80134 -15164 -173429 314268
12469 396380 -179209 -105705 352033 -210751 -129671 -289460 109994 124311 17576 -186062
12458 169451 -439271 303655 -116377 -168966 117953 -177827 434218 -48273 113902 72020
12448 72020 355559 131152 88651 -462699 100812 292307 -12229 178110 -111064 -181112
12438 -181112 260210 -158524 -43580 30556 40289 298119 506227 -164448 -165455 -165040 108166
12426 19182 93904 -51462 -58316 -19865 -91788 -47363 28284 -276489 -31067 54609 -55640 112875
12413 17184 -238161 -9076 -52989 -405923 -206380 138469 6981 -155514 115761 45286 -36362
12401 59471 158727 281125 19192 -68040 -283785 232817 -195459 77286 -14205 -157575 -115672
$$ packed form
12480A41588P0786J23429H2210b11819A84628b23032H0134a5164j58265C14268
12469C96380a79209P3504C52033b10751Q1080j59789A09994J4317A7576a86062
12458A69451d39271C03655a16377n2589A17953a77827D34218d8273A13902m1882
12448G2020K83539A31152m2501d62699A00812J91495a2229A78110a11064p0048
12438a81112B60210a58524d3580C0556R733K57830K08108a64448j007M15A08166
12426A9182P4722e1462o854a9865p1923M4425B8284b76489c1067E4609e5640A12875
12413A7184b38161i076m3913l52934J99543A38469F981a55514A15761D5286c6362
12401E9471R9256J22398A9192f8040k15745B32817a95459G7286a4205j43370M1903
$$ plain form
12390 -115672 -564789 -509047 29971 449963 -727 78007 -41215 39627 151237 -429392 117232
12378 -61640 85407 323616 -338369 -13255 -150973 41558 181496 73276 -360513 124782
12367 197336 197788 264047 -161128 -192234 57486 57461 -380299 113497 -160054 74602 260672
12356 260672 36469 300154 -186772 -74490 -302305 -92152 -90567 -75014 2176 -115581 21442
12344 -101776 -86101 16356 -144283 -168172 195316 294655 -526719 175242 270256 -167997
12333 81774 -101299 -183020 285024 -284476 30307 -177116 143354 4428 -147014 94475 -169178
12321 -101030 33777 120406 -148402 123612 -197938 196592 -101575 -403001 -228828 102134
12310 39435 -89674 114143 -191526 -81873 243534 -38565 202872 -80967 3923 495950 -51670
$$ packed form
12390a15672m49117N5742B9971M19992g27G8007d1215C9627J11610d29392A17232
12378f1640H5407K38209c38369a3255j37718D1558J39938G3276c60513A24782
12367A97336M52O6259a61128l1106E7486k5c80299A13497a60054G4602J86070
12356B60672C6469K63685a86772g4490k27815i2152J585J5553B176a15581B1442
12344a01776J5675A6356a44283k3889A95316R9339e26719A75242R5014a67997
12333H1774a01299q1721B85024b84476C0307a77116A43354D428a47014I4475a69178
12321a01030C3777Q6629a48402A23612a97938A96592a01575l01426J74173A02134
12310C9435h9674A14143a91526h1873B43534c8565B02872h0967C923M92027e1670
$$ plain form
12298 -43781 65177 193563 273164 -288733 -105621 -300397 -51472 -5712 42240 219871 300300
12287 300300 39855 -53966 -175943 -16636 151293 79153 -17484 255652 259788 243556 176129
12276 176129 117376 -139188 187337 160158 339355 96931 -40799 155399 61460 435540
12266 435540 -135717 -96 -198680 -79591 -52803 -51232 -258458 55581 106677 364814 131457
12254 79885 147406 -19840 -35137 59684 139462 93287 -48832 268130 527623 124157 19064
12242 -8021 442279 45172 2337 -47397 -90237 -176576 52803 393347 -62965 114794 225524
12231 225524 81080 296769 110328 -132805 102216 83801 119845 53251 150428 303808
12221 303808 212267 50904 353987 306190 -36442 83227 -281675 188727 299933 -1593 195624
$$ packed form
12298d3781F5177J28386P9601b88733a05621j94776e1472e712D2240J77631Q0429
12287C00300C9855e3966j21977a6636A51293p2140a7484B55652M136j6232o7427
12276A76129n8753a39188A87337k7179J79197I6931d0799A55399F1460L74080
12266D35540a35717i6j98584g9591K6788J571k07226E5581N1096K58137A31457
12254G9885O7521a9840j5297E9684P9778m6175d8832B68130K59493A24157A9064
12242h021D42279D5172B337d7397m2840q6339E2803L40544f2965A14794J10730
12231B25524H1080K15689A10328a32805A02216j8415L6044E3251R7177J53380
12221C03808r1541E0904L03083m7797c6442H3227b81675A88727J11206a593A95624
$$ plain form
12209 64060 199448 127735 39018 -150048 261203 67185 -198902 314010 111109 -21513
12198 85275 98001 367827 -39128 211736 199339 178016 300330 544291 376064 338415 70421
12186 -15983 170378 234346 275243 199438 191016 42341 34860 -30056 30522 -2979 214060 -47756
12173 186243 -128452 5190 331663 53247 370292 -118451 -42171 399791 -220987 54012
12162 394860 409212 -48172 163261 -204371 -167992 235599 -8112 47648 13935 -70864 145231
12150 66451 -125143 25288 271124 376813 267531 -11051 45482 111795 -12857 -37365 -26807
12139 -26807 200741 -65624 -309682 -126288 -54417 24346 88481 37636 195006 75545 -300358
12127 -69471 -296701 44152 99449 166888 177848 356427 -117973 -76 11472 -17895 41981 -111538
$$ packed form
12209F4060J35388p1713C9018a50048B61203F7185a98902C14010A11109b1513
12198H5275J2726K69826c9128B11736j2397k1323J22314K43961j68227l7649G0421
12186a5983A70378O3968M0897p5805q422D2341p481c0056C0522b979B14060d7756
12173A86243a28452E190L26473E3247L17045a18451d2171C99791b20987E4012
12162C94860J4352d8172A63261b04371L6379B35599h112D7648A3935g0864A45231
12150F6451a25143B5288K45836J05689j09282a1051D5482O6313a2857k4508J0558
12139b6807B00741f5624k44058a26288e4417B4346O4135C7636J57370G5545c00358
12127f9471k27230D4152N5297O7439J0960J78579a17973g6A1472a7895D1981a11538
$$ plain form
12114 208229 165336 315847 22423 231254 -149719 127660 58148 374090 -13776 -100401
12104 -100401 199391 -100018 87845 -173199 -33752 -30279 47766 79594 -203180 139914 -45816
12092 184297 251759 2689 -377406 -77707 131359 225059 21429 6762 -200988 423026 22172
12080 -373064 -289167 -16091 -218004 52372 14057 176374 -321818 76439 -30859 207126 76559
12068 802657 1423161 1221558 407359 22285 174992 146507 101016 118297 -39253 -331977
12058 -331977 62927 121936 -238039 -70961 158214 -58604 228366 84050 -50711 -107886 -331909
12047 -331909 -159195 -180320 -106808 -116229 157494 100562 -2298 -7156 95361 -108355 -318589
12036 -318589 29101 -138116 -257386 -116462 -148624 -223610 56805 -44485 -394855 138548
$$ packed form
12114B08229m2893J50511B2423K08831a49719A27660E8148L15942a3776q6625
12104a00401A99391a00018H7845a73199c3752L473D7766L1828b03180A39914d5816
12092A84297O7462B689c77406g7707A31359R3700B1429F762b00988D23026B2172
12080c73064Q3897a6091k01913E2372A4057J62317c21818G6439c0859B07126G6559
12068H02657O20504k01603D07359B2285J52707k8485m5491J7281c9253k92724
12058c31977F2927N9009b38039g0961A58214e8604B28366H4050e0711n7175k24023
12047c31909a59195k1125P3512r421A57494n6932b298m858I5361a08355k10234
12036c18589B9101a38116j19270a16462l2162p4986E6805d4485l50370A38548
$$ plain form
12025 300298 -47201 101521 -92309 84827 -196936 -13548 103438 98348 141639 -208361 69242
12013 122022 -39775 22112 118465 -253611 85983 -280961 196477 16283 -129327 -13000 67700
12001 304753 -258972 -171079 155835 1133 17495 49809 152925 -115463 -232892 -229894 55981
11989 266647 135819 38446 -387336 80527 81873 137341 -373607 414552 -177497 -208943 4476
11977 -142350 -118889 -452655 -279750 13337 -267375 -38541 160204 -274581 -64016 11867
11966 87631 27120 312955 -223437 15048 -158737 38126 -145792 74464 -200524 29394 160151
11955 160151 68920 155673 -140257 -185105 59116 260885 -79114 472247 -111994 -21751 193087
11943 -94349 -275487 229474 145208 169105 41964 35633 -204750 152418 136784 -419157 115933
$$ packed form
12025C00298d7201A01521i2309H4827a96936a3548A03438n090M3291b08361F9242
12013A22022c9775B2112R6353b53611H5983b80961A96477A6283a29327a3000F7700
12001C04753b58972Q7893A55835A133J6362L2314J03116a15463j17429K998E5981
11989B66647j30828C8446c87336H0527J346N5468c73607D14552a77497l1446D476
11977a42350K3461l33766J72905A3337b67375c8541A60204b74581f4016A1867
11966H7631B7120K85835b23437A5048a58737C8126a45792G4464b00524B9394J30757
11955A60151F8920Q6753a40257m4848E9116K01769g9114D72247a11994b1751A93087
11943i4349j81138B29474q4266K3897D1964o331b04750A52418j5634d19157A15933
$$ plain form
11931 -35455 59850 72686 24381 23916 -185615 -44257 -48815 -357850 -591 92259 104698 -2337
11918 -340499 -18018 162572 -119288 7643 -68172 -218060 215284 -158807 73597 -60834 -113561
11907 -113561 113813 -219735 -283418 43189 -42724 -165366 -135691 156912 95002 -125120
11896 143751 -69754 91749 13120 102652 94934 -22925 38191 -35238 14979 59179 61367 -341186
11883 108544 -168870 16089 108923 10678 -171052 112821 -61405 274964 -393003 145486
11872 47806 -178195 105265 -89811 -160373 -108831 193805 -75795 13696 -275558 166022 168489
11861 168489 -113614 256825 -273188 -191722 -44468 -208265 90228 75946 -116867 -170881
11851 -170881 431368 210620 -16881 -90370 52603 -519736 218737 6501 52487 188782 4570
$$ packed form
11931c5455E9850J2836B4381m65a85615d4257m558l09035e91I2259J2439b337
11918c40499a8018A62572a19288G643f8172j49888B15284a58807G3597f0834n2727
11907a13561A13813b19735o3683D3189d2724j22642K9675A56912o1910a25120
11896A43751f9754I1749A3120Q9532p718b2925C8191c5238A4979M4200K188c41186
11883A08544a68870A6089R2834A0678a71052A12821f1405B74964c93003A45486
11872D7806a78195A05265h9811p0562N1542A93805g5795A3696b75558A66022K467
11861A68489a13614B56825b73188Q1466d4468j63797I0228j4282a16867n4014
11851a70881D31368B10620a6881p3489E2603e19736B18737F501M5986J36295D570
$$ plain form
11839 151288 172000 -265293 -163953 -296665 -119591 -7194 -40200 272985 -172083 -249580
11829 -249580 196057 -219818 -234754 177531 11982 -138401 35726 -143085 -120546 47191
11818 -212075 -169497 -5387 -232530 71020 -347740 -130202 125820 145177 -258876 -129457
11808 -129457 -281212 78945 21839 54995 56378 77754 -152750 316541 -259978 -341295 -26053
11796 123063 328627 334555 -190209 -178033 185655 371172 215288 -189439 182660 -148609
11785 86902 249688 128183 138367 -112918 154686 92885 -107905 29394 -194451 57922
11774 33962 41408 99328 14077 -7878 -118119 257618 31082 23975 -224351 37192 -139834
11762 -1287 147343 75051 191345 -76710 128548 -20952 -380053 -214377 219498 86774 -76189
$$ packed form
11839A51288K0712b65293J01340j32712a19591g194l3006B72985a72083p7497
11829b49580A96057b19818j4936A77531A1982a38401C5726a43085K2539D7191
11818b12075M2578e387k27143G1020c47740a30202A25820J9357b58876J29419
11808a29457j51755G8945B1839L3156J383K1376a52750C16541b59978q1317b6053
11796A23063K05564N928a90209J2176A85655J85517j55884a89439A82660a48609
11785H6902J62786j21505J0184a12918A54686o1801a07905B9394a94451E7922
11774C3962P446N7920A4077g878j10241B57618C1082p107b24351C7192a39834
11762a287A47343p2292J16294g6710A28548b0952l59101J65676B19498H6774g6189
$$ plain form
11750 121854 21374 274609 -89162 -357121 165442 -270779 -331201 -341380 -61501 29356 152128
11739 152128 -199770 175315 81783 53287 120820 -38332 197048 -94024 107932 114501 -11638
11727 130880 112588 -234565 -7885 269709 -203444 191118 -68823 460554 -170885 73991
11716 -78053 -39489 -4879 -74505 -70289 -2842 -142151 98282 -85183 42934 28513 -129845 263195
11703 -201795 150552 164089 170490 194999 132783 4749 -132520 -145713 118634 73847 53539
11692 53539 -7542 386224 155873 -186646 -129326 276963 -61052 240133 -195189 96032 -322967
11680 98725 -7224 117449 -79837 40601 -219807 -124983 -13678 -123256 -16129 -429466 -25249
11668 -89716 129613 -168378 -80377 120624 -4632 -57019 126433 176330 106529 65570 187266
$$ packed form
11750A21854B1374K53235h9162k67959A65442b70779o0422j0179f1501B9356J22772
11739A52128a99770A75315H1783k8496O7533c8332A97048i4024A07932O569a1638
11727A30880j8292b34565g885B69709b03444A91118f8823D60554a70885G3991
11716g8053L8564d879o9626M216b842j39309I8282h5183D2934j4421a29845B63195
11703b01795A50552J3537O401K4509o2216D749a32520j3193A18634m4787k0308
11692E3539g542C86224A55873a86646N7320B76963f1052B40133a95189I6032c22967
11680I8725g224A17449g9837D0601b19807R4824a3678j09578a6129m13337b5249
11668h9716A29613a68378h0377A20624d632n2387A26433M9897o9801m0959J21696
$$ plain form
11657 187266 4731 16470 -95470 -175527 201856 166524 -98123 -12626 185274 33037 11007
11645 130967 -206393 146865 -184121 -53463 120945 -34368 171187 199796 226329 334936
11635 334936 43252 17382 264508 -93927 -17220 239035 217432 72011 141109 187763 -178331
11623 31493 135128 185907 91756 -140402 -30220 -137326 -97869 27615 179367 72916 -29829
11611 77259 224545 -162441 -33512 10272 38837 -200679 1985 -363 42104 20316 -114458
11599 -148590 -37920 -187704 -196278 -59599 179193 -199651 148368 164440 -64525 70270 352101
11588 352101 320246 73996 286449 76843 16613 69019 310113 -50227 -48017 75204 163328
11577 163328 77336 223918 220425 139646 266673 118590 162545 274413 36018 -121332 -360270
$$ packed form
11657A87266D731J1739i5470q0057B01856l5332i8123a2626A85274C3037A1007
11645A30967b06393A46865a84121e3463A20945c4368A71187K8609K6533J08607
11635C34936D3252A7382K47126i3927a7220B39035k1603G2011O9098M6654a78331
11623C1493J03635N0779I1756a40402c0220j07106L9457B7615J51752G2916b9829
11611G7259J47286a62441c3512A0272K8565b00679A985c63D2104B0316a14458
11599a48590c7920j49784q574e9599A79193a99651A48368J6072f4525G0270K81831
11588C52101l1855G3996K12453G6843A6613N2406K41094e0227K210G5204Q8124
11577A63328G7336J46582l493q0779J27027A18590M3955J11868C6018a21332k38938
$$ plain form
11566 -360270 49509 180086 -178965 56310 -214905 -9462 433874 174682 -204518 -611 194104
11554 194335 191532 110412 79733 212309 248062 -2819 3775 262438 257254 40850 120358 122851
11542 122851 112978 -418299 80427 -58657 20225 319800 -85955 18704 -386294 289392 -71198
11530 141449 102951 114659 160283 22555 -107130 8448 181176 -5817 -230061 -24630 -7940
11518 205041 121577 84316 197976 -15871 97911 2056 178416 -59206 -63112 57135 205449
11507 205449 84584 153641 104673 109230 -5922 35813 -56645 433769 23533 6597 -114695 113978
11494 96138 230043 178088 123045 73985 296281 238541 141102 94592 -54088 136259 198032
11483 198032 288966 -40444 -138033 -239233 714385 50361 299135 111179 -51140 158570
$$ packed form
11566c60270D9509J30577a78965E6310b14905i462D33874A74682b04518f11A94104
11554A94335k803q1120l0679J32576L5753b819C775K58663n184D0850P9508K493
11542A22851r873d18299H0427e8657B0225K99575h5955A8704c86294B89392g1198
11530A41449l8498J1708M5624B2555a07130H448J72728e817k24244b4630g940
11518B05041q3464l7261J13660a5871I7911B056J76360e9206l906E7135J48314
11507B05449H4584O9057m8968M557e922C5813e6645D33769B3533F597a14695A13978
11494I6138J33905n1955n5043m9060K22296n7740r7439m6510e4088A36259O1773
11483A98032R0934d0444r7589j01200G14385E0361K48774A11179e1140A58570
$$ plain form
11472 245901 82828 306735 -126 241860 101537 1986 245686 -78208 38877 226620 232088
11461 232088 459382 -166509 -370246 97321 -112214 280408 -273500 390499 264970 -467848
11450 -124374 225874 95774 244209 202682 -135301 -371101 15769 -13298 322325 15214
11439 208925 34906 195034 139171 -78089 2655 347081 -32799 -63987 54115 79039 193676
11428 193676 -308265 -187998 -276110 141087 103348 242804 -179634 121652 -81196 43717
11417 -128172 330359 -153630 205198 8378 -62641 113582 -101713 171543 -78181 -23780
11406 89588 285298 -59874 -33198 -77553 75491 -344422 -44051 106983 216586 49974 295670
11395 295670 49157 -14069 14064 23525 -186034 81481 75515 -50140 -93662 -152077 -161898 376999
$$ packed form
11472B45901H2828K23907a26B41860A01537A986K43700g8208C8877J87743N468
11461B32088K27294a66509k03737I7321a12214B80408b73500C90499j25529d67848
11450a24374B25874I5774J48435m1527a35301k35800A5769a3298C22325A5214
11439B08925C4906J60128n5863g8089B655L44426c2799l1188E4115K4924J14637
11428A93676c08265J20267q8112A41087l7739J39456a79634A21652h1196D3717
11417a28172C30359a53630B05198H378f2641A13582a01713A71543g8181b3780
11406H9588J95710e9874K6676m4355G5491c44422d4051A06983J09603D9974K45696
11395B95670D9157a4069A4064R461a86034H1481n966e0140m3522n8415r821C76999
$$ plain form
11382 -211371 -147536 408569 -124059 152211 -115900 -177936 -183938 -253162 55064 -105353 -206000
11371 -206000 135365 100719 39905 72704 99710 -192705 82649 10590 201075 -186266 133492
11359 -13872 132930 19813 -68835 77290 -319243 103143 -106184 -81672 -240785 -163984 65456
11347 -35400 25644 176052 124475 -100870 -183948 63834 -186974 73031 53230 191903 -111463
11335 86574 -122718 -247855 118042 35863 -258519 -107168 -159871 -421452 -188831 49148
11324 -245367 -4721 -211882 237439 -59122 -364566 -268405 -96408 312393 -88552 362430 -5538
11312 243698 -34680 160565 76774 245 -10492 -153772 -120667 -249517 -226399 -16449 -131247
11301 -131247 -505970 -128888 -172603 -11525 -146045 -226271 -384322 94214 -2082 33108 94961
$$ packed form
11382b11371O3835D08569a24059A52211a15900o2036o002o9224E5064a05353j00647
11371b06000A35365l4646C9905L2799K7006a92705H2649A0590J90485a86266A33492
11359a3872A32930A9813f8835G7290c19243A03143a06184K4512j59113P6801F5456
11347c5400B5644J50408n1577a00870q3078F3834a86974G3031j9801J38673a11463
11335H6574a22718j25137A18042C5863b58519a07168n2703k61581a88831D9148
11324b45367d721k07161B37439e9122l05444R6161i6408C12393h8552C62430e538
11312B43698c4680A60565G6774B45a0492j43280L3105j28850K3118a6449j14798
11301a31247l74723a28888m3715a1525j34520q0226j58051I4214b082C3108O1853
$$ plain form
11290 94961 211392 -76618 7189 -144273 -9425 127114 442347 177520 -130370 -72381 7772
11278 -305340 -59736 -365377 76070 -71322 8269 -84725 178924 -219766 -9303 -316462 -426740
11267 -426740 77608 -106524 -87116 134258 -69215 -273129 -109922 4283 219887 -75460 -22974
11255 123855 -91496 -335729 -142296 -278231 -314543 236228 30437 -30567 -103380 -68782 -12001
11243 141414 -41386 101292 -81725 -34645 -126152 93407 -376074 115245 -110076 71373 -53769
11231 -160119 -6479 25697 -114534 -59776 385459 -107607 46268 10910 103109 -157179 95737
11219 96947 -82530 128810 -35919 -22216 -310299 162564 241222 -127291 -371249 -316431 -38937
11207 43702 25980 198722 146574 -215974 132725 -312002 27513 44855 -413195 -199765
$$ packed form
11290I4961J16431g6618G189a44273i425A27114L15233A77520a30370N7989G772
11278c05340e9736l05641G6070g1322H269h4725A78924b19766i303l07159j10278
11267d26740G7608a06524J9408A34258f9215k03914a09922D283K15604g5460b2974
11255A23855i1496k44233a42296j35935l6312B36228C0437c0567p2813L4598a2001
11243A41414d1386A01292h1725c4645r1507I3407c76074A15245a10076G1373e3769
11231a60119f479B5697a14534N4758C85459a07607D6268A0910R2199a57179I5737
11219I6947h2530A28810c5919J3703k88083A62564P8658a27291k43958N4818c8937
11207D3702j7722J72742n2148b15974A32725c12002B7513J7342d13195a99765
$$ plain form
11196 -13442 78745 237468 123542 335742 -222194 -41976 -261809 -1045 -127719 -36247 266183
11184 -3471 -201780 128209 128282 114713 264705 92162 -209677 88763 -94786 -373306 9920 335432
11172 335432 147029 -27244 -49083 279241 -263365 11627 -318300 -329761 -252661 111137
11161 35810 -184870 -65282 -322911 56025 -233938 -166252 -209065 -53148 -231329 121045 -5579
11149 -313840 -202414 -368497 -58882 -103760 -229389 224140 197655 -24808 257274 -298772
11138 54281 -65425 -323128 111135 -48784 215249 -42523 -36834 17953 265104 -112404 136041
11126 267964 -113415 -15361 -114275 224388 -42196 7975 -136288 286782 53823 135767 50713
11114 89787 42112 155605 -114051 64988 -77311 40392 59691 145416 327642 -61685 11353
$$ packed form
11196a3442G8745J58723j13926K12200b22194d1976k19833a045j26674c6247B66183
11184c471j98309A28209P3j3569J49992I2162b09677H8763i4786k78520I920L25512
11172C35432A47029b7244k1839B79241b63365A1627c18300j1461P7100A11137
11161C5810a84870f5282k57629E6025b33938O7686m2813e3148j78181A21045e579
11149c13840J11426j66083e8882m4878j25629B24140k6485b4808B57274b98772
11138E4281f5425k57703A11135d8784B15249d2523N689A7953K47151a12404A36041
11126B67964a13415a5361r8914B24388d2196G975a36288B86782E3823Q1944E0713
11114H9787D2112J13493a14051F4988g7311D0392J9299Q5725J82226f1685A1353
$$ plain form
11102 324403 320095 290595 -86976 49997 209821 403359 234856 -13642 52955 331934 207035
11091 207035 312305 110767 61566 -310856 34059 48233 240762 134729 24544 233535
11081 233535 358413 -77560 407684 221014 272185 152168 262801 291513 299939 278519 449023
11070 449023 159392 85966 213887 222247 140942 233673 545361 456485 703609 296589 248189
11059 248189 249042 597704 677405 397227 844920 569761 686843 579909 621630 637546 674892
11048 674892 607155 945250 999889 949835 760072 941774 708369 585032 310551 728588
11038 728588 765381 616931 907239 622988 749160 660524 260264 404399 798457 877352
11028 877352 566715 676384 540573 731627 958253 829640 661427 614805 570054 365697
$$ packed form
11102C24403m308k9500h6976D9997J59824J93538j68503a3642E2955K78979j24899
11091B07035J05270A10767m9201c10856C4059J4174J92529j06033B4544K08991
11081B33535J24878g7560D07684j86670N1171j20017J10633K8712Q426k1420J70504
11070D49023A59392p3426J27921Q360q1305R2731L11688q8876K47124B96589m8400
11059B48189Q53L48662P9701k80178M47693k75159J17082j06934M1721J5916L7346
11048F74892o7737L38095N4639n0054j89763J81702k33405j23337k74481M18037
11038G28588L6793j48450K90308k84251J26172q8636B60264J44135L94058P8895
11028H77352l10637J09669j35811J91054K26626j28613j68213m6622m4751k04357
$$ plain form
11018 365697 420429 835893 660939 336159 665874 616514 571199 373613 851666 670087
11008 670087 343142 461587 607863 527056 418074 724716 594861 756909 932608 627603
10998 627603 886801 492839 983833 657093 722703 777776 614737 806897 743213 917044
10988 917044 836325 832130 962470 950699 1043797 960629 1159305 904298 1178879 1133533 1464135
10977 1464135 1377489 1859040 1816439 2004518 2284107 2770551 2786945 2712343 2566016 2605135
10967 2605135 2648597 1906889 2034966 1691248 1596137 1885317 1651934 1511057 1628216 1443801
10957 1443801 1973848 1829079 2058877 1980073 1503002 1368350 1112010 1209182 1032323 988257
10947 988257 835170 510754 570264 540185 82684 312651 282813 250098 148596 413464
$$ packed form
11018C65697N4732M15464j74954l24780L29715m9360m5315j97586M78053j81579
11008F70087l26945J18445J46276q0807j08982L06642j29855J62048J75699l05005
10998F27603K59198l93962M90994l26740O5610N5073j63039J92160o3684J73831
10988I17044q0719m195J30340j1771R3098q3168J98676k55007K74581m5346L30602
10977A464135q6646M81551m2601J88079K79589M86444J6394p4602j46327L9119
10967B605135M3462p41708J28077l43718r5111K89180k33383j40877J17159j84415
10957A443801N30047j44769K29798p8804m77071j34652k56340R7172j76859m4066
10947I88257j53087l24416N9510l0079H2684K29967k9838l2715j01502K64868
$$ plain form
10937 413464 -26143 -204553 277384 311645 332700 424992 162822 -230536 450800 -139816
10926 243225 -358939 87535 -239764 65407 130829 -168659 225599 91649 -57627 -20203 -197651
10915 -197651 452394 259245 64502 142223 -121709 142059 18258 106227 109958 105183 22542
10903 81418 -1489 -6606 -291520 -150748 -89301 -50486 -430408 -19570 219103 -43883 -309401
10892 -309401 -14432 94750 86475 160447 -94995 -42176 11594 250666 -161798 122685 125119
10881 125119 -62347 138816 110354 -364961 -296658 -21177 41694 -132929 38740 341956 -17869
10869 14118 14673 -269123 -24902 -263172 112623 -194953 -48529 150961 98529 -14944 210950
10857 132091 139702 55188 31590 66519 229451 190519 -26291 -7564 306799 204276 242359
$$ packed form
10937D13464b6143j78410B77384L4261K1055R2292A62822b30536D50800a39816
10926B43225c58939H7535b39764F5407O5422a68659B25599I1649e7627b0203j77448
10915a97651D52394j93149F4502P7721a21709A42059A8258Q7969L731m775B2542
10903H1418a489n117k84914J40772O1447L8815l79922a9570B19103d3883k65518
10892c09401a4432I4750q275P3972i4995d2176A1594K39072a61798A22685K434
10881A25119f2347A38816k8462c64961O8303b1177D1694a32929C8740L03216a7869
10869A4118N55b69123b4902k38270A12623a94953d8529A50961n2432a4944B10950
10857A32091P611E5188k3598L4929J62932l8932b6291g564C06799j02523L8083
$$ plain form
10846 242359 234328 -110936 -32372 -81748 67173 33178 -30111 223168 -278876 142336 -79572
10834 -30347 -166595 -137756 122412 47539 52207 111205 212997 4447 -356052 -1091 310053
10822 74889 -92117 107311 -89198 -215462 52586 51688 -260613 -70889 56080 -59229 -287633
10811 -287633 227158 -53063 537 21499 131899 -24420 -186806 -39827 343529 -163451 -157937
10800 -157937 -168015 -168919 32898 244304 -84316 -164888 -250764 -66906 83692 5376 -410846 -93741
10787 -65625 87291 -213384 -340816 -71386 -164570 -148592 -122968 37273 86561 -60517 36576
10775 23804 137225 -156712 -18624 -156434 -209938 -238377 -39176 -184903 -42967 -302393 136812
10763 -325708 15461 -107806 18424 119975 -11546 -305660 -209553 -9038 31550 -272702 86429
$$ packed form
10846B42359q031a10936c2372m9376F7173C3178c0111B23168b78876A42336g9572
10834c0347j36248K8839A22412D7539M668N8998J01792D447c56052a091C10053
10822G4889i2117A07311h9198j26264E2586q98b60613g0889E6080e9229k28404
10811b87633B27158e3063E37K0962J10400b4420j62386c9827C43529a63451N514
10800a57937j0078r04C2898K11406h4316q0572q5876f6906H3692E376d10846i3741
10787f5625H7291b13384j27432g1386r3184J5978K5624C7273M9288f0517C6576
10775B3804J13421a56712a8624j37810n3504k8439c9176j45727d2967k59426A36812
10763c25708A5461a07806A8424J01551a1546k94114R6107i038C1550b72702H6429
$$ plain form
10751 27176 -203858 -100302 -48850 -71158 158171 19273 204951 -321806 -63610 -146351 -42489
10739 -319947 -189294 -240143 91583 -77735 -325957 -140526 -338415 -203489 -58987 -157556
10729 -157556 31748 -127876 -293230 16235 42057 -181726 55991 -7455 -103439 77848 -235751
10717 -213751 -105557 -119470 73709 -227588 -83273 109585 162164 54086 80221 -14579 98310
10705 -191490 131571 124139 -637 -190942 -149418 44097 -77771 232743 -112052 -130436 -45272
10693 -90964 -156371 -335866 13476 -132332 53836 -230469 111594 360528 86535 -86910 -219795
10682 -219795 308616 -100560 26700 134413 110753 -240571 365470 -243212 -412122 -99280
10671 -183449 -58035 53932 -34218 95478 -180408 40054 -249273 301225 -262380 -112864
$$ packed form
10751B7176b03858a00302d8850k2308A58171A9273J85678c21806f3610q2741d2489
10739c19947J30653n0849I1583g7735k48222a40526j97889J34926e8987r8569
10729a57556C1748a27876j65354A6235K5822a81726E5991g455r5984G7848b35751
10717b13751a05557j3913G3709b27588h3273A09585N2579E4086K6135a4579I8310
10705a91490A31571p432f37j90305M1524D4097g7771B32743a12052j8384d5272
10693i0964o5407j79495A3476a32332E3836b30469A11594K48934H6535h6910j32885
10682b19795C08616a00560B6700J07713k3660b40571C65470b43212j68910i9280
10671a83449e8035E3932c4218I5478a80408D0054b49273C01225b62380a12864
$$ plain form
10660 -192004 -127937 -51228 -47972 -179741 -187904 -295190 -19590 -50443 415145 -146921 188565
10648 -16207 44847 -209498 -24789 225607 -106121 -217917 -48577 -110075 -185924 49941 -241398
10636 121307 -92397 124221 -165403 -56884 200111 -53833 -84110 157013 -234092 -41047
10625 -29123 169637 260215 88118 -16386 31498 71265 -59295 2835 -9124 -357896 -9935 -178730
10613 -178730 -94710 -345044 -131290 84704 -182916 4750 211559 -14945 -366988 133746
10602 -181404 -194392 -352779 -169417 -16251 -36417 126522 70034 143506 -23160 -138066 139057
10590 242310 18514 88432 224677 103443 -300024 58498 -181211 -166545 -197972 73758 -246008
10578 151283 -96079 -204892 -69464 -334953 -18619 -68475 -36873 -305416 -208858 -96823 157812
$$ packed form
10660a92004O4067e1228L256j31769q163j07286a9590l0853D15145a46921A88565
10648a6207D4847b09498b4789B25607a06121j11796d8577o1498p5849D9941b41398
10636A21307i2397A24221a65403e6884B00111e3833l0277A57013b34092d1047
10625b9123A69637R0578H8118a6386C1498L9767e9295B835i124l48772i935j68795
10613a78730Q4020k50334a31290H4704a82916D750K06809a4945l52043A33746
10602a81404j2988j58387a69417a6251k0166A26522n6488P3472b3160j14906A39057
10590B42310A8514O9918J36245A03443c00024E8498a81211J4666l1427G3758b46008
10578A51283i6079j08813f9464k65489a8619m9856L1602k68543R6558i6823A57812
$$ plain form
10566 130896 -32398 191574 144090 103554 -22976 262975 54296 -105902 -392547 284614
10555 -56203 -182938 -91047 -43411 -11081 55767 -225085 51280 -56688 -130211 -192454 37771
10543 368153 -69378 289466 -273776 51916 -295399 -190833 -5438 11162 -111590 13437 51731
10532 51731 -293284 65780 -6252 92203 40296 284262 -10364 88158 -208453 -373215 -75966
10520 -286172 57806 74446 -238881 42854 203252 53464 -18517 138841 -40248 133813 -300252
10508 -221770 -79022 2424 32389 -253595 290142 79441 162878 -160337 -7804 18433 -232106
10496 61059 -216753 -391755 -78897 -224387 -244704 31136 -149815 29649 165469 236334 86154
10484 -82534 -2297 26287 285019 180148 312917 478481 554770 200144 146361 17110 -36199
$$ packed form
10566A30896c2398A91574m7484m0536b2976B62975E4296a05902k86645B84614
10555e6203j26735i1047d3411a1081E5767b25085E1280e6688p3523o2243C7771
10543C68153f9378B89466b73776E1916b95399J04566e438A1162a11590A3437L8294
10532E1731b93284F5780f252I2203D0296K43966a0364H8158b08453j64762g5966
10520b86172E7806J6640b38881D2854J60398E3464a8517A38841d0248A33813c00252
10508b21770g9022B424K9965b53595B90142G9441Q3437a60337g804A8433b32106
10496F1059b16753j75002g8897j45490k0317C1136a49815B9649J35820P0865H6154
10484h2534b297B6287K58732j04871J32769J65564P6289B00144n3783A7110c6199
$$ plain form
10472 10275 197109 -51694 365469 -300190 231444 -169057 212738 -7467 -100690 -34286 5372
10460 -29830 -150720 -222602 -72014 -93379 -306487 314505 -357400 -384285 -149786 -223779 153996
10448 -201755 -267857 -79906 -258574 -120026 -168512 36135 -138648 -89926 302828 -273442
10437 162570 20257 -63529 -40974 200147 432710 -7870 102826 -121470 -145180 172544 -73221
10425 242748 -126599 18253 -241114 163967 238323 -21038 49658 178448 -3180 -432337 -156650
10413 -26670 7597 165388 -72326 36343 -38166 -60534 -181236 48959 -164172 196629 -83393
10401 -28274 124433 -242198 35399 239843 134561 -270546 -135121 32625 239713 -44118
10390 268423 -4352 194600 160263 307289 344010 223686 314039 141024 307423 -98054 -24297
$$ packed form
10472A0275J86834e1694C65469c00190B31444a69057B12738g467r3223c4286E372
10460b9830j20890p1882g2014k1365k13108C14505c57400k6885a49786p3993A53996
10448b01755o6102g9906j78668a20026m8486C6135a38648M8722C02828b73442
10437A62570B0257f3529K2555B00147K32563g870A02826a21470k3710A72544g3221
10425B42748a26599A8253b41114A63967P4356b1038D9658J28790c180m29157a56650
10413b6670G597J57791g2326C6343c8166k2368j20702D8959a64172A96629h3393
10401b8274A24433b42198C5399K04444j05282b70546a35121C2625K07088d4118
10390B68423d352A94600l4337J47026L6721j20324R0353A41024J66399i8054b4297
$$ plain form
10378 5328 278958 270251 261092 173332 19015 12372 -57006 9951 244560 320275 277187 157359
10366 157359 570868 257969 384484 236173 224702 115686 35511 -50708 12292 36997
10356 36997 -49866 -243394 291748 197853 -78046 488466 485163 666329 67858 139599 163227
10345 163227 197026 333403 183085 434122 467250 320162 420476 211611 30181 253845
10335 253845 -80040 270290 245521 360641 283258 -144116 159254 158114 -24408 262480 198759
10324 198759 485237 315026 272830 -62293 184348 417458 293026 467946 206248 40273
10313 308011 365834 -297288 -252161 -25798 -201838 67227 -152935 -141809 -310235 -214516 21771
10301 -67588 -49419 469195 229451 203977 145181 18381 26112 -76883 10805 -377384 -65614
$$ packed form
10378E328K73630q707r159q7760A9015o643e7006I951K34609P5715m3088j19828
10366A57359M13509B57969J26515j48311j1471j09016C5511e0708A2292K4705
10356C6997d9866j93528B91748r3895g8046D88466l303J81166F7858P1741K3628
10345A63227L3799J36377j50318K51037L3128j47088J00314k08865C0181K23664
10335B53845h0040B70290k4769J15120p7383a44116A59254j140b4408B62480o3721
10324A98759K86478j70211m2196f2293A84348K33110j24432J74920B06248D0273
10313C08011N7823b97288M5127b5798j76040F7227a52935J1126j68426R5719B1771
10301f7588J8169D69195B29451k5474n8796A8381P731g6883A0805c77384f5614
$$ plain form
10289 -210976 -115876 -188906 139961 -334545 -175060 -86033 -48458 -324997 167609 -133203
10278 -337777 49592 -114107 256915 150668 36448 62504 -75464 256681 -128762 -4535 7369
10266 -138718 67179 -10013 -17016 182714 37607 -9304 81265 522820 -168537 473278 -210290
10254 125551 -8914 227943 127335 134877 -237752 -137480 -409154 -30690 -168910 -58132 480523
10242 -398729 -276334 -85741 -2738 -87520 -97959 -324521 -70183 90377 -54772 149244 15894
10230 88682 315420 -26165 -127184 -74759 -159854 123657 -101788 103729 -198269 32059
10219 354835 -217924 -303768 -167007 -13213 138291 12487 77456 293275 167372 -94731
10208 -132276 -134294 -5196 6935 -161795 272743 -29445 -10219 -167448 26419 -59726 215702
$$ packed form
10289b10976R5100p3030A39961c34545J59485h6033L7575k76539A67609a33203
10278c37777D9592a14107B56915j06247C6448K6056g5464B56681a28762d535G369
10266a38718F7179a0013p003A82714C7607i304H1265M41555a68537D73278b10290
10254A25551h914B27943j00608P542b37752J00272k71674c0690j38220e8132D80523
10242c98729J22395h5741b738q4782j0439k26562g0183I0377e4772A49244A5894
10230H8682K26738b6165j01019N2425q5095A23657a01788A03729a98269C2059
10219C54835b17924q5844J36761a3213A38291A2487O4969K15819j25903i4731
10208a32276k018e196F935a61795B72743b9445a0219j57229B6419e9726B15702
$$ plain form
10196 -107771 -155497 -124465 -226365 -63801 355311 -364564 -345079 56121 -145735 -80401 238829
10184 -356667 14267 -71637 -149572 10974 -130552 -487129 -287436 -214834 -230750 103456 264916
10173 264916 -396124 -157630 -17442 18192 -732 184301 30806 -102235 102968 -94729 54404
10161 -319292 182901 -144515 206494 -67061 101426 -190480 -111592 25649 33128 -68206 11536
10149 -106124 191897 12767 65141 -282421 10289 -5363 200185 -87443 -295628 -163577 258885
10137 42076 101102 -105939 -27524 -176958 68535 -26858 -186783 -145026 142328 -28936 -199247
10126 -199247 -114943 -297955 -60523 19827 147367 -149484 -40651 33486 -211816 105544
10115 -304603 234919 62948 -168138 -379689 51312 21129 144642 108745 -320196 109143
$$ packed form
10196a07771m7726L1032j01900f3801C55311c64564J9485E6121a45735O5334B38829
10184c56667A4267g1637p7935A0974a30552l56577J99693P2602j5916A03456J61460
10173B64916c96124a57630a7442A8192g32A84301C0806a02235A02968i4729E4404
10161c19292A82901a44515B06494f7061A01426a90480P8888B5649P479f8206A1536
10149a06124A91897A2767N2374b82421A0289e363B00185h7443k08185J32051B58885
10137D2076N9026a05939b7524j49434F8535b6858j59925M1757A42328b8936j70311
10126a99247Q4304j83012f0523A9827J27540a49484d0651C3486b11816A05544
10115c04603B34919F2948a68138k11551E1312B1129J23513l5897c20196A09143
$$ plain form
10104 196540 154728 -297087 -76876 185816 -149150 -80001 148067 -57995 38076 6115 20966
10093 20966 -228099 -194651 -321950 -182348 -234584 -246739 -22263 -40227 89112 -93388 231335
10081 126433 106123 194828 104730 107636 25012 -155472 -38641 -339180 -33101 -35044 23645
10069 219911 51938 -166619 163026 -309516 -250406 -52866 -24866 -220279 221475 -216590
10058 -205233 -33969 -287891 -299706 155776 85491 -60266 -22754 136304 124440 19419 -135110
10046 -266349 -77271 -101636 61767 -294340 -77842 171880 40179 -119293 -124755 78360 127634
10035 127634 -240655 -197771 76045 -126372 -51623 45501 21589 -128699 125847 -146777
10024 -324842 119044 -192831 97335 112674 -123175 -134462 -272469 -142344 -69517 36546
$$ packed form
10104A96540m1812b97087g6876A85816a49150O9149A48067e7995C8076F115J4851
10093B0966b28099L3448j27299J39602n2236j2155b2263j7964H9112i3388B31335
10081A26433k0310Q8705r0098K906B5012a55472c8641l00539c3101j943B3645
10069B19911E1938a66619A63026c09516N9110e2866b4866j95413B21475b16590
10058b05233c3969k53922j1815A55776p0285f0266b2754A36304j1864A9419a35110
10046b66349g7271k4365F1767b94340g7842A71880D0179a19293n462G8360M9274
10035A27634b40655M2884G6045a26372e1623D5501B1589a28699A25847a46777
10024c24842A19044a92831I7335J5339a23175j1287j38007J30125f9517C6546
$$ plain form
10013 -292285 -109670 49549 196314 124444 77002 -95538 240816 -114760 152 -171621 -62027
10001 -36034 -73287 -170651 -102071 -154808 -100435 -12615 -83474 -38810 -76820 -176821 -122027
9990 -122027 25848 -30843 -244453 -186141 -161797 -177031 -91345 21326 -3962 -106376 321069
9978 -54701 35068 138918 -53010 205229 95239 -211451 -199706 98822 -380597 -346848 -81892
9966 -149097 -255774 -56673 -352953 31959 -289044 31002 -63749 -270444 -118383 186948
9955 -437964 -12761 -247495 189373 -263274 -292921 -62337 103544 -167263 138121 13903
9944 -202711 73856 -126816 -44719 195972 -139273 40627 -4532 -43480 -12109 -215522 -350172
9933 -350172 -32139 328581 203612 -243789 -196018 -139489 -32447 -173771 66523 37892 -306764
$$ packed form
10013b92285a09670D9549J46765p1870m7442i5538B40816a14760A52a71621f2027
10001c6034l7253r7364O8580n2737N4373a2615p0859c8810l8010j00001N4794
9990a22027B5848c0843k13610N8312K4344j5234Q5686B1326c962j02414C21069
9978e4701C5068J03850e3010B05229I5239b11451J1745I8822c80597L3749h1892
9966a49097j06677e6673k96280C1959b89044C1002f3749k06695a18383A86948
9955d37964a2761k34734A89373b63274k9647f2337A03544a67263A38121A3903
9944b02711G3856a26816d4719A95972a39273D0627d532l8948a2109k03413j34650
9933c50172c2139C28581j24969b43789M7771N6529c2447j41324F6523k8631c06764
$$ plain form
9921 27057 26805 31774 11593 -185013 -100522 -287390 -92696 37355 95610 -74266 -85278 -245275
9909 -245275 2608 2430 -178044 -504536 -412041 -38915 237255 -40678 -78037 -21934 -111807 -406379
9897 -406379 -84616 97587 -182476 -236356 -69577 -151485 104622 -160783 109357 -346950 209029
9885 205137 -170754 -146923 -171887 -268137 21407 -93934 50642 -32159 -109974 -106631 -169951 -171268
9873 -171268 295790 -293477 194437 -161808 37578 -61457 -464306 -195418 201335 233862
9863 233862 -192816 -256825 -40091 -202221 92337 335265 20588 78763 -94576 -172902 -596537
9852 -596537 -314571 -74825 422788 35334 -166733 107685 158695 -4522 224302 224890 40006
9840 -123651 59926 118594 -246711 21182 -259548 108473 12358 221639 40650 118739 -4811
$$ packed form
9921B7057k52M969A1593a85013Q4491j86868i2696C7355N8255g4266j1012j59997
9909b45275B608j78a78044l26492R2495c8915B37255d0678l7359b1934q9873k94572
9897d06379h4616I7587a82476n3880f9577q1908A04622a60783A09357c46950B09029
9885B05137a70754K3831k4964r6250B1407i3934E0642c2159p7815L343o3320j317
9873a71268B95790b93477A94437a61808C7578f1457m02849a95418B01335L2527
9863B33862a92816o4009d0091j62130I2337K42928B0588N8175i4576p8326m23635
9852e96537K81966g4825D22788C5334a66733A07685N1010d522B24302N88D0006
9840a23651E9926N8668b46711B1182b59548A08473A2358K09281D0650P8089d811
$$ plain form
9828 -293589 -56940 -61085 -446477 142099 -252041 -432457 -55758 -119104 19957 -244364 -151745
9817 -151745 -452932 -195784 171551 -28826 -258614 -63619 43423 -179758 126048 -6785 -176927
9806 -176927 25913 59395 12181 -91903 407829 -119508 2692 72319 100913 -134430 44677
9794 -234795 -30711 -427183 -8287 -225299 -332247 -243915 188836 -109701 30155 47605 -170843
9782 -173762 28248 -256818 110601 202001 3845 -88656 -20654 -12608 -301180 -253825 -314938
9771 -314938 8603 51963 -124264 -305821 78337 -93410 127223 5863 -93725 -274749 -44650
9759 -251507 -226247 -154544 -352886 -159708 -162820 -128210 -381635 -57164 -258402 98016 -305403
9747 -323241 18549 -83425 42492 -115114 48690 -299712 -220431 -463673 267336 -425234 218619
$$ packed form
9828b93589e6940m145l85392A42099b52041j80416e5758o3346A9957b44364R2619
9817a51745l01187a95784A71551b8826k29788f3619D3423a79758A26048f785j70142
9806a76927B5913L3482A2181i1903D07829a19508B692O9627K8594a34430D4677
9794b34795c0711l96472h287k17012j06948Q8332A88836a09701C0155J7450a70843
9782a73762B8248b56818A10601R1400C845h8656b0654Q046k88572M7355o1113
9771c14938H603M3360a24264j81557G8337i3410A27223E863i3725j81024d4650
9759b51507K5260P1703j98342a59708l112L4610k53425e7164k01238I8016c05403
9747c23241A8549h3425D2492a15114D8690b99712P9281k43242B67336d25234B18619
$$ plain form
9735 -268343 114084 -89210 64563 -46211 -312750 -223102 -172418 -200951 -160815 345153 46890
9723 -94559 -41920 -256943 104510 -148104 201880 -537665 -346750 -233628 -218063 53815
9712 -206457 -26542 -337118 -33255 42434 283947 -348831 -21339 -298879 -24466 162928 23875
9700 -21730 102512 -77098 18366 -243218 172639 -102907 157171 95587 -165107 -110429 -202144
9689 -202144 28305 137443 41184 -178914 80445 23558 212387 126095 -213627 -35982 -497601
9678 -497601 -126633 214493 -115657 -869 -174212 -67969 -53496 -151285 -24392 -71898 -341874
9667 -341874 -98250 -75342 150916 -92687 -248417 -96552 97201 28570 -57310 -15176 -125248
9656 -125248 -103302 -148706 -262164 102101 265153 -159227 -70857 112870 -85334 8032 104097
$$ packed form
9735b68343A14084h9210F4563d6211k66539Q9648N0684k8533M0136C45153D6890
9723i4559d1920k15023A04510a48104B01880e37665J90915J13122J5565E3815
9712b06457b6542l10576c3255D2434K41513c48831b1339k77540b4466A62928B3875
9700b1730A02512g7098A8366b43218A72639a02907A57171o1584a65107N4678r1715
9689b02144B8305J09138D1184a78914H0445B3558J88829q6292b13627c5982m61619
9678d97601a26633B14493a15657h69j73343f7969J4473r7789b4392m7506k69976
9667c41874i8250K2908A50916i2687j55730i6552I7201B8570e7310a5176j10072
9656a25248K1946m5404j13458A02101J63052a59227g0857A12870h5334H032R6065
$$ plain form
9645 104097 27787 -97551 -309743 -192721 -185928 75940 -111733 41373 59025 48052 54838
9634 54838 346304 -103402 116426 82304 -41861 19589 44587 -43748 144757 -140595 72121
9622 -300223 -580359 -83129 95098 -285260 57418 118829 13525 -103439 -135777 246494 -182104
9610 149522 -29986 -43335 9740 -370651 -59712 -188812 147992 -91687 119350 -157806 4959
9598 -147559 -213908 -134515 124782 -459004 2870 -99843 53244 -321261 -260959 128472 -40527
9586 -60161 -114757 -118012 -306363 34518 29956 -152284 -166221 -210880 -15959 86235 -74092 177835
9573 258343 -195276 -189894 -216308 -416172 76103 -337769 -260729 -110901 -315984 -256392 -28103
9561 -197615 205887 -54064 -6980 178139 -163973 -111135 -92700 -139479 1879 -240567 243273
$$ packed form
9645A04097B7787i7551k12192J17022O793G5940a11733D1373J7652j0973O786
9634E4838K91466a03402A16426l4122d1861A9589K4998d3748A44757a40595G2121
9622c00223k80136h3129I5098b85260E7418O1411A3525a03439l2338B46494a82104
9610A49522b9986j3349I740c70651e9712j29100A47992i1687A19350a57806D959
9598a47559o6349P9393A24782d59004B870i9843E3244c21261O0302A28472d0527
9586f0161n4596l255j88351C4518m562a52284j3937m4659a5959H6235g4092A77835
9573B58343a95276N382k6414j99864G6103c37769P7040a10901k05083N9592b8103
9561a97615B05887e4064f980A78139a63973N2838J8435m6779A879b40567B43273
$$ plain form
9549 -310064 38287 70063 -119004 -210033 -58994 -188109 -279158 -85220 -333631 -13494 174058
9537 -131123 -125422 39524 3978 181650 -122831 -158680 -184804 40149 23380 -52280 201778
9525 -120502 -17402 -104678 -295331 -128878 2399 -151168 231308 -212842 -266686 -119528 -112003
9514 -112003 -61964 -411265 -53870 -420116 158622 233187 -526092 -31322 130639 -500532
9503 -258714 122481 -244685 24381 33399 -91195 -66788 41449 185212 -295193 272241 -288055
9491 164534 -114622 -174382 17518 -438103 -138336 -250259 -205541 -316117 -311908 5186 -15083
9479 84911 -86334 -125017 -51521 -156445 157011 -63616 -29830 -55364 94006 -116302 -121650
9468 -121650 -24398 -300820 -99573 -56207 49191 -125603 -147550 -62914 -413379 107755 38076
$$ packed form
9549c10064C8287L1776a19004r1029e8994j29115r1049h5220k48411a3494A74058
9537a31123N701C9524C978J77672a22831l5849k6124D0149j6769e2280B01778
9525a20502a7402q7276j90653a28878B399a51168B31308b12842n3844a19528P525
9514a12003N0039l49301e3870l66246A58622P4565e26092c1322A30639e00532
9503b58714A22481b44685B4381R018i1195K4407D1449J43763b95193B72241b88055
9491A64534a14622n9760A7518d38103a38336j11923M4718j10576M209E186a5083
9479H4911h6334l8683e1521j04924A57011f3616b9830k5534I4006a16302n348
9468a21650b4398k76422i9573M3366D9191a25603k1947f2914l50465A07755C8076
$$ plain form
9456 32260 -215746 122785 -167614 -184931 67914 -113853 -1801 -34633 38568 -139444 -209749
9445 -209749 247694 -298365 -40817 -71031 9768 -326217 153011 27234 12633 -89348 11619
9433 -32161 73418 -101273 -194939 202895 -167101 176901 -268430 -25947 -26658 -206962 -150703
9422 -150703 246918 -44022 46463 -195233 89502 -235134 324469 -51923 117951 -153067
9411 184185 -263449 47878 -155568 -115345 112461 -47652 -4416 104745 -9157 -44799 209179
9399 215354 137415 -122044 -216202 67850 -35601 -85717 201048 -280675 -299218 -380435 -201495
9388 -201495 183136 108570 234341 -205561 -53110 20346 60297 -155621 -445073 -458959 -156422
9376 -330436 98670 49678 104339 -48885 -43800 206500 -173771 -249515 -6398 -306066 72228
$$ packed form
9456C2260b15746A22785a67614j7317F7914a13853a801l2832C8568a39444p0305
9445b09749B47694b98365d0817l0214I768c26217A53011B7234A2633h9348A1619
9433c2161G3418a01273r3666B02895a67101A76901b68430b5947p11j80304N6259
9422a50703B46918d4022D6463a95233H9502b35134C24469e1923A17951a53067
9411A84185b63449D7878a55568M0223A12461d7652d416A04745i157l5642B09179
9399B15354p7939a22044r4158F7850c5601n0116B01048b80675j8543q1217J78940
9388b01495A83136p4566J25771b05561e3110B0346L9951a55621k89452j3886a56422
9376c30436I8670m8992N4661d8885N085B06500a73771p5744f398k99668G2228
$$ plain form
9364 -17510 -79849 -117936 17718 -251104 61288 -52522 86763 -156339 -145398 -40780 91216
9352 -174922 282873 -207016 -227131 -332471 -61717 241428 341572 160880 82636 -404112
9341 -149355 222756 39199 -208766 -76876 -59003 -87367 -192729 -63675 233067 -79019 124092
9329 202774 61782 -12202 -229153 -206817 -228782 -37796 -13632 -274532 -130987 -22454 130452
9317 -79625 5841 135003 -202233 -454522 -62828 -135586 69612 53555 69104 -198253 322975
9305 -140646 104041 -179830 49064 -12809 -395208 -74531 -140098 22271 238715 -20920 -281761
9294 -281761 54589 -405237 112956 216439 81205 28642 -89203 21088 -210152 -185284 -138008
9283 -138008 -41201 -67202 205188 -79968 -105534 14208 -492304 -209972 -64285 -55568 -85229
$$ packed form
9364a7510o2339l8087A7718b51104F1288e2522H6763a56339J0941d0780I1216
9352a74922B82873b07016k0115j05340f1717B41428J00144A60880p8244d04112
9341a49355B22756C9199b08766g6876J7873k8364j05362f3675B33067g9019A24092
9329B02774F1782a2202k16951K2336k1965c7796a3632k60900a30987b2454A30452
9317g9625E841J29162b02233k52289f2828p2758F9612j6057J5549a98253C22975
9305a40646A04041a79830D9064a2809l82399g4531o5567B2271K16444b0920k60841
9294b81761E4589d05237A12956J03483H1205B8642h9203B1088b10152K4868M7276
9283a38008d1201k6001B05188g9968k5566A4208d92304b09972f4285Q717k9661
$$ plain form
9272 -85229 322367 -99174 -152895 21450 -77497 -164393 -266129 -46992 169611 30726 -312472
9260 -32957 -343561 165401 -133353 -166484 -66198 187713 121854 -326485 13750 -163566 -28584
9248 -151246 -262084 52568 143173 -252516 87091 47147 103326 24850 51329 -212464 -108937
9237 -108937 -65990 302721 401461 52994 -59253 9898 261387 -240170 351442 -535255 413129
9225 -226803 -5630 -276755 -140773 -80207 -84640 -98247 -218198 263672 83675 -109415 56155
9213 4646 -202759 11947 -79074 -269889 -173227 -592071 -72789 52497 -1153 -106346 42053
9201 -124905 -51751 -175520 -165626 22786 78348 -146287 -11991 -182509 19348 64993 -50880
9189 -110211 262681 -206538 -91619 -80308 188120 -138070 -42808 -41591 -183420 -441069 -188880
$$ packed form
9272h5229C22367i9174n3721B1450g7497q6896j01736d6992A69611C0726c12472
9260c2957l10604A65401a33353l3131f6198A87713o5859c26485A3750a63566b8584
9248a51246j10838E2568R0605b52516H7091l9944N6179B4850K6479b12464J03527
9237a08937M2947C02721R8740E2994e9253I898K51489b40170C51442e35255D13129
9225b26803e630k71125J35982O0566m433j3607j19951B63672H3675a09415E6155
9213D646b02759A1947g9074j90815R6662m18844g2789E2497a153j05193D2053
9201a24905e1751j23769R894B2786N5562a46287a1991j70518A9348M5645e0880
9189a10211B62681b06538i1619J1311A88120a38070d2808J217j41829k57649a88880
$$ plain form
9177 -265254 -178819 117447 -73305 -60434 243613 307925 9890 46595 1406 -164299 -176434
9166 -176434 -135759 -9191 -82432 -104416 -61694 -73744 -37714 -85160 35968 -110561 -199795 -229458
9154 -229458 71630 -252477 -301662 -155157 -11022 31602 -119257 21869 -67161 -206019 88335
9142 104475 -39602 321080 93128 -39047 -131217 23921 -321144 -571187 30991 -81405 -36603
9130 -140402 9392 -107595 -279953 -138161 -75442 -174430 -79617 183145 -346179 143588 -278403
9118 176350 -286688 67616 -233910 -136352 192813 126635 125351 -172508 182356 49910 -142414
9106 -476336 -30154 -143884 -76780 -168955 -105223 169849 187497 -41486 -56408 -149475 -91932
9095 -91932 -22523 -146249 22640 2628 -49497 -143656 -21387 133589 -175835 -41943 212822
$$ packed form
9177b65254Q6435A17447g3305J2871B43613O4312I890L6705A406a64299j2135
9166a76434M0675i191p3241k1984M2722j2050L6030m7446C5968a10561q9234k9663
9154b29458G1630b52477m9185J46505a1022C1602a19257B1869f7161j38858H8335
9142A04475c9602C21080I3128c9047r2170B3921c21144k50043C0991h1405c6603
9130a40402I392a07595j72358a38161O2719r8988g9617A83145c46179A43588b78403
9118A76350b86688F7616b33910R7558A92813o6178j284a72508A82356D9910a42414
9106d76336c0154j13730O7104r2175O3732A69849J7648d1486j4922r3067N7543
9095i1932b2523j23726B2640B628d9497r4159b1387A33589a75835d1943B12822
$$ plain form
9083 142438 95571 -225674 -97814 -6407 -201895 -250985 82517 35582 -42720 -278666 284242
9071 -97934 -126020 -107276 5143 53770 50936 -88974 -18906 -30541 -417768 205033 137485 270130
9059 270130 48320 -43152 -256377 -130422 118624 -210632 -170322 113299 -36105 105363
9048 277443 370850 -120045 217212 -106013 -176076 -88462 -21326 -153573 289535 -127899
9037 208366 -269113 -69987 -379647 -23157 13922 -219753 101514 -45748 116400 33791 -10812
9025 -158358 182521 -402050 -130571 100261 42359 -374970 28450 -80717 -406598 127819
9014 -210299 -213048 9700 -217751 -270282 132682 -22529 -117213 337499 -120480 -260911 -144157
9003 -144157 -322884 -7910 -153644 -352128 -462921 -141838 142686 -68501 -218971 -6494 162199
$$ packed form
9083A42438m6867b25674i7814f407j95488m9090H2517C5582d2720k35946B84242
9071i7934k8086J8744E143M8627k834h8974a8906j1635l87227B05033o7548J32645
9059B70130D8320d3152k13225J25955A18624b10632M0310A13299c6105A05363
9048B77443R3407a20045B17212a06013p0063Q7614b1326j32247B89535a27899
9037B08366b69113f9987l09660b3157A3922b19753A01514d5748A16400C3791a0812
9025a58358A82521d02050a30571A00261D2359c74970B8450h0717l25881A27819
9014b10299k749I700b17751n2531A32682b2529r4684C37499a20480j40431J16754
9003a44157j78727g910j45734j98484j10793a41838A42686f8501j50470f494A62199
$$ plain form
8991 176184 121694 -121576 -71416 58785 58935 -286863 -183454 -115732 73733 101633 -189404
8979 123729 -287504 -28883 131852 -118571 -35129 -72011 97756 -120472 -203988 25699 336730
8968 336730 -447265 147230 60160 -20264 36599 50282 -78650 -166904 396631 -49635 -120809
8957 -120809 -10222 -188089 27406 257206 2148 -190883 -102327 -148634 53912 97939 1087
8945 -298347 212303 -182389 204612 117447 9054 164836 -319909 -71020 -84700 -21367 261203
8933 57346 -54594 -44364 -224758 278463 -79006 275320 290938 182263 -83343 223632 410405
8922 410405 2925353 5555327 1792482 502666 394941 91680 54233 82484 97607 -19203
8911 107038 76328 95638 -187729 -49325 -2731 -176950 4251 132935 -136941 85712 -296715
$$ packed form
8991A76184n4490a21576N0160E8785J50b86863J03409O7722G3733K7900a89404
8979A23729b87504b8883A31852a18571c5129l6882I7756a20472q3516B5699L11031
8968C36730d47265A47230F0160b0264C6599J3683g8650q8254C96631d9635p1174
8957a20809a0222j77867B7406K29800B148a90883Q8556m6307E3912M4027A087
8945b98347B12303a82389B04612q7165I054J55782c19909g1020j3680b1367B61203
8933E7346e4594J0230j80394B78463g9006B75320J5618j08675h3343B23632J86773
8922D10405K514948K629974A792482E02666j07725I1680l7447K8251J5123a9203
8911A07038l0710J9310a87729d9325b731j74219D251J28684a36941H5712b96715
$$ plain form
8899 -139943 -19892 25606 -84200 -292130 230414 -189029 -47584 50188 -44462 92571 123036
8888 123036 -279540 -299274 -69608 -42859 275221 -132860 28004 -108158 -30790 -118505 224733
8876 -10483 -255623 -199146 -126869 -46562 123544 43744 142498 73358 158997 -264426 -296126
8865 -296126 -27031 -309254 218391 203288 -13100 23139 -160044 -172686 26167 -137903 122241
8853 164790 -132163 -141321 2657 3156 -36212 15716 49090 -248989 -405291 210483 124866 246055
8841 246055 -98865 126282 323586 6129 -48634 1748 -29812 -61679 -74529 -289196 -25591
$$ packed form
8899a39943a9892B5606h4200k07930B30414a89029d7584E0188d4462I2571L0465
8888A23036b79540j9734f9608K6749B75221a32860B8004a08158c0790q7715B24733
8876a0483k45140N6477P2277d6562A23544D3744R8754o9140Q5639b64426l1700
8865b96126b7031k82223B18391j5103a3100B3139a60044j2642B6167a37903A22241
8853A64790a32163r158B657M99c6212A5716L3374b48989j56302B10483q5617J21189
8841B46055i8865A26282J97304F129d8634A748b9812l1867j2850k14667b5591
$$ [...]
##END NTUPLES=NMR SPECTRUM
##END=
