
##TITLE=AC1299_CHIAH12111_6615475_XISgBI63Ux
##JCAMPDX= 6.0         $$ Bruker NMR JCAMP-DX V2.0
##DATA TYPE= NMR SPECTRUM
##DATA CLASS= NTUPLES
##ORIGIN= BRUKER
##OWNER= Administrator
$$ 1.72 TOPSPIN		Version 2.1
$$ 2012-08-02 21:00:24.921 -0500  Administrator@TOPSPIN
$$ Compression mode = diff/dup
##.OBSERVE FREQUENCY= 400.02188249412
##.OBSERVE NUCLEUS= ^1H
##.ACQUISITION MODE= SIMULTANEOUS (DQD)
##.ACQUISITION SCHEME= undefined
##.AVERAGES= 8
##.DIGITISER RES= 22
##SPECTROMETER/DATA SYSTEM= spect
##.PULSE SEQUENCE= zg30
##.SOLVENT NAME= COFFEE_meoh
##.SHIFT REFERENCE= INTERNAL, COFFEE_meoh, 1, 14.98509
##AUDIT TRAIL= $$ (NUMBER, WHEN, WHO, WHERE, PROCESS, VERSION, WHAT)
$$ ##TITLE= Audit trail, TOPSPIN		Version 2.1
$$ ##JCAMPDX= 5.01
$$ ##ORIGIN= Bruker BioSpin GmbH
$$ ##OWNER= Administrator
$$ $$ C:\Bruker\TOPSPIN/data/COFFEE/nmr/AC1299_CHIAH12111_6615475_XISgBI63Ux/10/pdata/1/auditp.txt
$$ ##AUDIT TRAIL=  $$ (NUMBER, WHEN, WHO, WHERE, PROCESS, VERSION, WHAT)
(   1,<2012-08-02 21:00:17.343 -0500>,<Administrator>,<TOPSPIN>,<go>,<TOPSPIN 2.1>,
      <created by zg
	started at 2012-08-02 20:59:10.875 -0500,
	POWCHK enabled, PULCHK disabled,
       configuration hash MD5:
       6B 1B 68 BB D9 2E 58 E2 7F 35 AD 54 07 DF 0E 41
       data hash MD5: 64K
       17 2F 51 D4 1B 44 15 62 F2 50 3E 07 DE 51 6D 30>)
(   2,<2012-08-02 21:00:20.531 -0500>,<Administrator>,<TOPSPIN>,<proc1d>,<TOPSPIN 2.1>,
      <Start of raw data processing
       efp LB = 0 FT_mod = 6 PKNL = 1 PHC0 = 0 PHC1 = 0 SI = 32K 
       data hash MD5: 32K
       3A 53 91 14 BE 83 EC BC 3C 29 F6 12 90 C3 20 7E>)
(   3,<2012-08-02 21:00:20.984 -0500>,<Administrator>,<TOPSPIN>,<proc1d>,<TOPSPIN 2.1>,
      <pk PHC0 = 181.6864 PHC1 = 0 
       data hash MD5: 32K
       7F 92 C7 E9 3A 55 C4 9F A6 78 E1 48 30 07 B6 81>)
(   4,<2012-08-02 21:00:21.078 -0500>,<Administrator>,<TOPSPIN>,<proc1d>,<TOPSPIN 2.1>,
      <abs ABSG = 1 
       data hash MD5: 32K
       41 C8 D1 51 42 D4 C7 D2 53 AF C3 DD FE 0E 42 57>)
(   5,<2012-08-02 21:00:21.265 -0500>,<Administrator>,<TOPSPIN>,<proc1d>,<TOPSPIN 2.1>,
      <abs ABSG = 2 
       data hash MD5: 32K
       E1 61 96 52 84 88 13 D4 B8 15 29 56 C2 54 20 ED>)
(   6,<2012-08-02 21:00:21.312 -0500>,<Administrator>,<TOPSPIN>,<proc1d>,<TOPSPIN 2.1>,
      <abs ABSG = 3 
       data hash MD5: 32K
       20 A9 28 37 2F 90 39 FB 36 8D 6B 2C 80 FA C8 2D>)
(   7,<2012-08-02 21:00:21.343 -0500>,<Administrator>,<TOPSPIN>,<proc1d>,<TOPSPIN 2.1>,
      <abs ABSG = 4 
       data hash MD5: 32K
       99 8B D6 ED 73 71 51 43 33 73 BF 51 5A E4 95 22>)
(   8,<2012-08-02 21:00:21.375 -0500>,<Administrator>,<TOPSPIN>,<proc1d>,<TOPSPIN 2.1>,
      <abs ABSG = 5 
       data hash MD5: 32K
       20 6E 43 B0 54 3D 28 3C 8D 8D 48 68 50 C4 5E 02>)
$$ ##END=
$$ 
$$ $$ hash MD5
$$ $$ AB E6 2B E4 5F 88 49 13 04 BF 4D 5A 48 0B 12 B3
##$RELAX= 
##$RELAX= 
##$RELAX= 
##$RELAX= 
##$RELAX= 
##$RELAX= 
##$RELAX= 
$$ Bruker specific parameters
$$ --------------------------
$$ [...]
150 150 150 150 150 150 150 150
##$TP07= 0
##$TPNAME0= <>
##$TPNAME1= <>
##$TPNAME2= <>
##$TPNAME3= <>
##$TPNAME4= <>
##$TPNAME5= <>
##$TPNAME6= <>
##$TPNAME7= <>
##$TPOAL= (0..7)
0.5 0.5 0.5 0.5 0.5 0.5 0.5 0.5
##$TPOFFS= (0..7)
0 0 0 0 0 0 0 0
##$TUNHIN= 0
##$TUNHOUT= 0
##$TUNXOUT= 0
##$USERA1= <user>
##$USERA2= <user>
##$USERA3= <user>
##$USERA4= <user>
##$USERA5= <user>
##$V9= 5
##$VALIST= <valist>
##$VCLIST= <CCCCCCCCCCCCCCC>
##$VD= 0
##$VDLIST= <DDDDDDDDDDDDDDD>
##$VPLIST= <PPPPPPPPPPPPPPP>
##$VTLIST= <TTTTTTTTTTTTTTT>
##$WBST= 1024
##$WBSW= 4
##$XGAIN= (0..3)
0 0 0 0
##$XL= 0
##$YL= 0
##$YMAX_a= 497197
##$YMIN_a= -653231
##$ZGOPTNS= <>
##$ZL1= 120
##$ZL2= 120
##$ZL3= 120
##$ZL4= 120
##$ABSF1= 14.98509
##$ABSF2= -5.573092
##$ABSG= 5
##$ABSL= 3
##$ALPHA= 0
##$AQORDER= 0
##$ASSFAC= 0
##$ASSFACI= 0
##$ASSFACX= 0
##$ASSWID= 0
##$AUNMP= <proc_prof1d_extract_pilot.lims>
##$AXLEFT= 0
##$AXNAME= <>
##$AXNUC= <1H>
##$AXRIGHT= 0
##$AXTYPE= 0
##$AXUNIT= <>
##$AZFE= 0.1
##$AZFW= 0.1
##$BCFW= 0
##$BC_mod= 0
##$BYTORDP= 0
##$COROFFS= 0
##$CY= 15
##$DATMOD= 1
##$DC= 0
##$DFILT= <>
##$DTYPP= 0
##$F1P= 0
##$F2P= 0
##$FCOR= 0.5
##$FTSIZE= 32768
##$FT_mod= 6
##$GAMMA= 0
##$GB= 0
##$INTBC= 1
##$INTSCL= 1
##$ISEN= 128
##$LB= 0
##$LEV0= 0
##$LPBIN= 0
##$MAXI= 10000
##$MC2= 0
##$MEAN= 0
##$ME_mod= 0
##$MI= 0
##$NCOEF= 0
##$NC_proc= -8
##$NLEV= 6
##$NOISF1= 0
##$NOISF2= 0
##$NSP= 0
##$NTH_PI= 0
##$NZP= 0
##$OFFSET= 14.98509
##$PC= 1
##$PHC0= 181.6864
##$PHC1= 0
##$PH_mod= 1
##$PKNL= yes
##$PPARMOD= 0
##$PPDIAG= 0
##$PPIPTYP= 0
##$PPMPNUM= 2147483647
##$PPRESOL= 1
##$PSCAL= 4
##$PSIGN= 0
##$PYNMP= <proc.py>
##$REVERSE= no
##$SF= 400.02
##$SI= 32768
##$SIGF1= 0
##$SIGF2= 0
##$SINO= 400
##$SIOLD= 32768
##$SPECTYP= <>
##$SREGLST= <1H.CDCl3>
##$SSB= 0
##$STSI= 32768
##$STSR= 0
##$SW_p= 8223.68421052631
##$SYMM= 0
##$S_DEV= 0
##$TDeff= 65536
##$TDoff= 0
##$TI= <>
##$TILT= no
##$TM1= 0
##$TM2= 0
##$TOPLEV= 0
##$USERP1= <user>
##$USERP2= <user>
##$USERP3= <user>
##$USERP4= <user>
##$USERP5= <user>
##$WDW= 1
##$XDIM= 32768
##$YMAX_p= 461851859
##$YMIN_p= -742207
##$CURPLOT= <Network HP LaserJet P1505>
##$CURPRIN= <$Network HP LaserJet P1505>
##$DFORMAT= <normdp>
##$LAYOUT= <+/1D_H.xwp>
##$LFORMAT= <normlp>
##$PFORMAT= <normpl>
##$SURQMSG= 1
$$ End of Bruker specific parameters
$$ ---------------------------------
##NTUPLES= NMR SPECTRUM
##VAR_NAME=  FREQUENCY,     SPECTRUM/REAL,   SPECTRUM/IMAG
##SYMBOL=    X,             R,               I
##VAR_TYPE=  INDEPENDENT,   DEPENDENT,       DEPENDENT
##VAR_FORM=  AFFN,          ASDF,            ASDF
##VAR_DIM=   32768,         32768,           32768
##UNITS=     HZ,            ARBITRARY UNITS, ARBITRARY UNITS
##FACTOR=    0.250966925370066, 1,           1
##FIRST=     8223.43324360094, -105026,      -148777
##LAST=      0,             -121248,         -134568
##MIN=       0,             -742207,         0
##MAX=       8223.43324360094, 461851859,    0
$$ Real data points
##PAGE= N=1
##DATA TABLE= (X++(R..R)), XYDATA
$$ [...]
19471g1968l92457A2872f0962j73922E7407B6826a06351k94629a62342g5060H9425
19459D887a39803K8918j60815j27190A9356J6041a04894e193j00295M3047b4560
19447b03206A71620p5591D4331a11795j64285c2764k13722G5871a03011m37177
19437e40188F2865N5405K3245J13896d0047k15110j80248J72154J09130j1038
19427a65159j56097J0737A59040g9204K5004b4656r7930l4945j54572e8998l82944
19416d41942g5148A8779a80585r530D1791N1866h4827C6045n840a73035A1865
19404b23229A1849b7325j71989A02280c27469a58825O1585A26915J29108I2324
19393b35754L6442g2884P954A16402J19244i9619G9143L181b28680R7027J0479
$$ plain form
19471 -71968 -464425 12872 -60962 -234884 57407 26826 -106351 -400980 -162342 -75060 89425
19459 4887 -139803 -110885 -271700 -398890 19356 35397 -104894 -5193 -105488 -62441 -24560
19447 -203206 171620 96029 44331 -111795 -276080 -32764 -246486 75871 -103011 -540188
19437 -540188 62865 118270 141515 255411 -40047 -255157 -435405 -263251 -154121 -165159
19427 -165159 -321256 -310519 159040 -79204 -54200 -24656 -122586 -157531 -312103 -58998 -441942
19416 -441942 -75148 18779 -180585 -190115 41791 93657 -84827 36045 30205 -173035 11865
19404 -223229 11849 -27325 -199314 102280 -327469 -158825 -97240 126915 256023 92324
19393 -235754 -199312 -72884 -64930 116402 235646 -99619 79143 82324 -228680 -131653 -121174
19382a21174N4581a7626j01089A27886P9005a05390l07269a55830D1913j2003
19372B9910a31709L3514E8851d33554C78417a6990C1696K8563a79848f838j62526
19361a69364A17815h3609A35030c2698J2141j63086B80918a1498j4815r8169b6314
19349i5978d6081n0601c2676k22137a13662A64491c49961a44270G810g9038A68738
19337a72216C2091f2671j09740d6237m61441A11918b21675B21143J01261b99463
19326a04077k37024a41918E3988j9288b17295J00507C64045c56297a40311c8465
19315c34012a15244j30384A03548c54942D3401h5073r4887l5426a1095p1094A46957
19303a47870H3028C3438a09783j00215O0295n4475j679I5336b20052E932h2454
$$ plain form
19382 -121174 -66593 -17626 -118715 127886 206891 -105390 -412659 -155830 41913 29910
19372 29910 -131709 -98195 58851 -433554 378417 -16990 31696 60259 -179848 -6838 -169364
19361 -169364 117815 -83609 135030 -32698 -20557 -183643 280918 -11498 -26313 -124482 -26314
19349 -95978 -46081 -96682 -32676 -254813 -113662 164491 -349961 -144270 7810 -79038 168738
19337 -172216 32091 -62671 -172411 -46237 -507678 111918 -221675 221143 322404 -299463
19326 -104077 -341101 -141918 53988 34700 -217295 -116788 364045 -356297 -140311 -38465
19315 -334012 -115244 -245628 103548 -354942 43401 -85073 -179960 -215386 -11095 -82189 146957
19303 -147870 83028 33438 -109783 -209998 -149703 -204178 -205857 95336 -220052 5932 -82454
19291e5617b5900A16643a73072B96467a04478n1985c2845a5489A2982K8778O7815
19280A09575a45870n7351O228A33619d46817K4753b07860A28246D597c5894A31115
19268a52057I6775m5389Q5309d1471j68348I4817g411j71373P3739k33791B8362
19256a13077F7877a51546F0346b90113a03919l6186I726a63204b4957k79284a03951
19244a58267D930a9684j9557j36391E5383d3229j2326a800k9675l00301I1139
19232A0556a56131A09610c1481l55138l2456K05253B7772b21496Q0728c0871C4452
19220F9444i6110k19265h8571b6621k42040R6607M4238j16772j15040b4954M416
19209b0538A57333M5193D0868b41985J17642m6639n4878B68268H930d14950B08998
$$ plain form
19291 -55617 -25900 116643 -173072 296467 -104478 -156463 -32845 -15489 12982 41760 109575
19280 109575 -145870 -203221 -196993 133619 -446817 -422064 -207860 128246 4597 -35894 131115
19268 -152057 96775 51386 136695 -41471 -209819 94817 -7411 -178784 -105045 -338836 28362
19256 -113077 67877 -151546 60346 -290113 -103919 -140105 9726 -163204 -24957 -304241 -103951
19244 -158267 4930 -19684 -39241 -175632 55383 -43229 -55555 -1800 -31475 -331776 91139
19232 10556 -156131 109610 -31481 -386619 -419075 -213822 27772 -221496 -140768 -30871 34452
19220 69444 -96110 -315375 -88571 -26621 -268661 -172054 -127816 -244588 -359628 -24954 -20538
19209 -20538 157333 202526 40868 -241985 -124343 -170982 -225860 268268 8930 -414950 208998
19197c8209o1229d6010j4767k77431i9734K847e183A89927d31330A9893a1267
19185c110a477p7765j37775d5918j12867g772j35954l9543b0880p4790J2515E8810
19172a52174k1099E6530h6666G2030j091k1495A0199a40041M8710O876F8406Q7997
19160A56403d9705c484l05383b6142k5576l00673E3492g9688q722j81104B08148
19148B5751n47P4537a8539r9365G2684c27174A33610A4838g6748A83310a34172
19136c58334A27420c00851a30743n915c3565B955a62183p717n1926D2786b74014
19124c15482c5636m60G0261J19970d64906P9553A13390M1342k9108m8095a06854
19112C0954L8695B4763a23250E7823c18239h9795M2234k76859C1983a3755G8533
$$ plain form
19197 -38209 -99438 -46010 -60777 -338208 -99734 -96887 -5183 189927 -431330 19893 -11267
19185 -3110 -1477 -79242 -217017 -45918 -158785 -7772 -143726 -183269 -20880 -95670 -83155 58810
19172 -152174 -173273 56530 -86666 72030 70939 49444 10199 -140041 -91331 -84455 68406 156403
19160 156403 -49705 -3484 -308867 -26142 -51718 -352391 53492 -79688 -88410 -269514 208148
19148 25751 25204 99741 -18539 -117904 72684 -327174 133610 14838 -76748 183310 -134172
19136 -358334 127420 -300851 -130743 -136658 -33565 2955 -162183 -169900 -221826 42786 -274014
19124 -315482 -35636 -36096 70261 190231 -464906 -385353 113390 154732 125624 77529 -106854
19112 30954 69649 24763 -123250 57823 -318239 -89795 -47561 -324420 31983 -13755 78533
19100b11027f3435B2053c9889C61970h8482l8226N7776A71865D2512c64034e5442
19088d3072A97762c9189k14213B7817K1792b90007p1735J70323g100A02725A9007
19076A20049n1091b73292d7973H3687C4869b05823B91029D7744b48782J17839
19066a30943J6329K9158k10668C2903f5671b2017k65027l4007a41734I7870b4303
19054F9234g8382I6328a24722j9181D6710g4388j17945k10447e4051o4089M1040
19043g7100m17l39787D0925a2165g41A11678c38360Q8940C0710b7714j12213f014
19030C69219C6242L7613a73961l2463j2568D10606A13894b66481H6301i0117A07339
19018a3134G5799l0502b36039F2412M6722f5246k37392m4566d7230A9099h8574
$$ plain form
19100 -211027 -63435 22053 -39889 361970 -88482 -126708 -68932 171865 42512 -364034 -55442
19088 -43072 197762 -39189 -253402 27817 49609 -290007 -361742 -191419 -7100 102725 19007
19076 120049 68958 -273292 -47973 83687 34869 -205823 291029 47744 -248782 -130943
19066 -130943 -114614 -85456 -296124 32903 -65671 -22017 -287044 -321051 -141734 97870 -24303
19054 69234 -78382 96328 -124722 -143903 46710 -74388 -192333 -402780 -54051 -118140 -77100
19043 -77100 -77517 -417304 40925 -12165 -741 111678 -338360 -249420 30710 -27714 -139927 -6014
19030 369219 36242 73855 -173961 -206424 -218992 410606 113894 -266481 86301 -90117 107339
19018 -13134 75799 45297 -236039 62412 109134 -65246 -302638 -347204 -47230 19099 -88574
19006B37402j00806f9495K1167j79760P2162d0706A09721O3911a14486q1672A30301
18994f4654C7264a94509D725J2584d9222F081P638M3819g2094p4770a077A33632
18981B53391e1213F6653K40617E3919e5620A01257c1233q12l91420a79884F21627
18969D79344A51955M66068C9975K7086j0704A0108c15755k4310J38328N1061B51518
18957b29653N7204B18758I4227b08634b8082A26318g1620A06254a42728O6333
18947g6395R868A2268b19021a6357A82755a79303A95515a20558K7031k06592B12689
18935B6387J91570i3327B61404b20006d2537A9169d3525B0538a10994B2797J00619
18924A23416R0478F4066j7122a64848I7444a983D5445h4345l0200G6356l5574
$$ plain form
19006 237402 136596 -69495 -48328 -228088 -155926 -40706 109721 173632 -114486 -196158 130301
18994 -64654 37264 -194509 4725 17309 -49222 6081 13719 57538 -72094 -146864 -1077 133632
18981 253391 -51213 66653 307270 53919 -55620 101257 -31233 -32045 -423465 -179884 621627
18969 479344 151955 618023 39975 67061 56357 10108 -315755 -340065 -201737 -150676 251518
18957 -229653 -172449 218758 94227 -208634 -28082 126318 -71620 106254 -142728 -76395
18947 -76395 -66527 12268 -219021 -16357 182755 -179303 195515 -120558 -93527 -300119 212689
18935 26387 217957 -93327 261404 -220006 -42537 19169 -43525 20538 -110994 22797 123416
18924 123416 213894 64066 46944 -164848 97444 -1983 45445 -84345 -114545 76356 40782
18913D0782k108P9963k0665f7588k03913C69146J14820p0336A61243Q0669j00359
18902A41553a15635A84430b20533a5601B12681h6413j84674h0926I964c1130C3462
18890a82808M4927d1424k05506B88954c9663q0752B68583a94820p6066q6889A5137
18878b92908a30137C19582A1084a42727p0754h7476j97757N2502a16249I3632
18867a84007j01173a04715A14402g0858c3860p0847n4610A6162a26513l5704F9480
18855e234k10060c3938p2073C2017n7R9190o0450d2876E6287a32300A23086a43673
18842A34321c38147R3797J00238A52903n5369c813m93018b8886E03888a35547
18831E5949h55k52381p449H6957c94474E8623J53450b6494D2911a69312E4175
$$ plain form
18913 40782 38674 118637 97972 -67588 -271501 369146 483966 413630 161243 241912 141553
18902 141553 -115635 184430 -220533 -15601 212681 -86413 -271087 -80926 9964 -31130 33462
18890 -182808 -137881 -41424 -246930 288954 -39663 -120415 268583 -194820 -270886 -357775 15137
18878 -292908 -130137 319582 11084 -142727 -213481 -87476 -285233 -232731 -116249 93632
18867 -184007 -285180 -104715 114402 -70858 -33860 -104707 -159317 16162 -126513 -162217 69480
18855 -5234 -215294 -33938 -106011 32017 31960 131150 70700 -42876 56287 -132300 123086 -143673
18842 134321 -338147 -244350 -144112 152903 97534 -3813 -496831 -28886 503888 -135547
18831 55949 -855 -253236 -260685 86957 -394474 58623 212073 -26494 42911 -169312 54175
18819F3170c30527k0745B0445P5439c4754k7937A3765c4522k38967a06988A34828
18807G7745N01161B75338I8878a5810A93285b37293A43969L22600A52b23618C60650
18795c01523a37972m8874L1416H9095a01898k07220a3708A1822b60617C3602H51
18783D2759a84992D22950E5778J17518c8983n5642A97438a26740r29A89752c86981
18771a51208L3806j24077A6130K8664c27527A31216M8813a08993e4367A8474J72992
18760A91466c40819F7518J34545b89014a17846q9594A57991g6992j04712j81171
18750c62875L7867A04924C7643h0522j16244O1428B45977r2033b58825B93374
18739A73037a98874D1356a64740A87940a32857J6101K7746p184l30605E299g0092
$$ plain form
18819 63170 -330527 -351272 20445 95884 -34754 -62691 13765 -34522 -273489 -106988 134828
18807 77745 578906 275338 98878 -15810 193285 -237293 143969 466569 152 -223618 360650
18795 -301523 -137972 -186846 -155430 89095 -101898 -309118 -13708 11822 -260617 33602 851
18783 42759 -184992 422950 55778 173296 -38983 -94625 197438 -126740 -127669 189752 -386981
18771 -151208 -117402 -241479 16130 44794 -327527 131216 180029 -108993 -54367 18474 191466
18760 191466 -340819 67518 202063 -289014 -117846 -207440 157991 -76992 -181704 -362875
18750 -362875 -325008 104924 37643 -80522 -196766 -135338 245977 153944 -258825 293374
18739 173037 -198874 41356 -164740 187940 -132857 -116756 -89010 -96194 -426799 5299 -70092
18727a90521B35725a5812B86830b38301R9510a688k33878A7430e8759A3185c53917
18715e8252A06793a93263E086P2731a85079B10708a88435G0148a7066A61600d10825
18703g6051B6873J80142a75834j55407h3469B66469a58958k18n0375n0930D8543
18691B48986b84002N4288A52479b8323k6495o059j26247F7483A873b27994A33410
18679a81633J9236A68241K4822J7069b00936M6648N8467j57000D2627K3382b05099
18667b92311i4202a6967D2720c81744a81068j7915l4925H429a1642B5948K30062
18656B56010d0249m6748k06086A7260J4800b09647Q7440j0580p9434A48290c0267
18644G9358N5273b8825j25968g3208n9057j35822J00353C760J44297b66708q3052
$$ plain form
18727 -190521 235725 -15812 286830 -238301 -138791 -1688 -235566 17430 -58759 13185 -353917
18715 -58252 106793 -193263 5086 77817 -185079 210708 -188435 70148 -17066 161600 -410825
18703 -76051 26873 207015 -175834 -331241 -83469 266469 -158958 -159176 -209551 -260481 48543
18691 248986 -284002 -229714 152479 -28323 -54818 -60877 -187124 67483 1873 -227994 133410
18679 -181633 -162397 168241 193063 210132 -200936 -154288 -95821 -252821 42627 66009 -205099
18667 -292311 -94202 -16967 42720 -381744 -181068 -198983 -233908 8429 -11642 25948 256010
18656 256010 -40249 -86997 -293083 17260 32060 -209647 -122207 -132787 -212221 148290 -30267
18644 79358 134631 -28825 -154793 -73208 -132265 -268087 -167734 3760 148057 -266708 -349760
18633c49760a15642k02203A06075L6929c16482A78668q829e5169G2951b15408
18622b63334B88a11846k4254l6228Q2745K1335A61293a36864d6091A32880k363
18611A30517a7642C2464c8545j97865O4816h4617k18609a18696a4350H8211a48407
18599a65072e3443J0083q8561B90628l3342d2733B2671a13850l8402H4535c27186
18587a44459H7752b1643B00104G4751C0038J59915M4227a43650D9b33153h5090
18575b79221K2308k0454e5180C37301A49104C7202b91535B1338J31796b1738A45290
18563A84260a47207j07631A2577M90502c5313A9318i9503m4844A98565G8585J43828
18552B22413a4977B2803L0851c24808P0122C66867E806J04658b1339l68183B7026
$$ plain form
18633 -349760 -115642 -317845 106075 143004 -316482 178668 169839 -55169 72951 -215408
18622 -263334 288 -111846 -136100 -172328 -89583 -68248 161293 -136864 -46091 132880 130517
18611 130517 -17642 32464 -38545 -236410 -171594 -84617 -303226 -118696 -14350 88211 -148407
18599 -165072 -53443 -43360 -131921 290628 257286 -42733 22671 -113850 -152252 84535 -327186
18587 -144459 87752 -21643 200104 74751 30038 189953 234180 -143650 49 -233153 -85090
18575 -279221 -256913 -277367 -55180 337301 149104 37202 -291535 21338 153134 -21738 145290
18563 184260 -147207 -254838 12577 503079 -35313 19318 -99503 -144347 198565 78585 222413
18552 222413 -14977 22803 53654 -324808 -254686 366867 5806 110464 -21339 -389522 27026
18540a21332G3631b89594J30366B78976r0520a19699j42632b7862l20440F9868
18529a0895l19655J42795N4655j05727G8101d11649B4109K50037d32629J85106
18519b47523C7080K11728a27608o5601A26643g5312b8979k22949f4421k78577
18509c42998a6614k23902N8473A17272h4543H7766J18157A1119Q5748a20519J5141
18498a05378k19948D0389K10099g8394A34308d40008Q9371a57103b7912G5544
18487B329J09412i375M344A43940o7872b08101N0181G6770a01301A2674b63705
18475c807j75879B6458R2341h7714j5043A79293e7004B84158a33330j08511d8274
18463D0161k279L19005a10458m796p8070n2705g9590A10058L3221J30316b21705
$$ plain form
18540 -121332 73631 -289594 -159228 278976 188456 -119699 -262331 -27862 -348302 69868
18529 -10895 -330550 -187755 -133100 -238827 78101 -411649 24109 274146 -432629 -247523
18519 -247523 37080 248808 -127608 -193209 126643 -75312 -28979 -251928 -64421 -342998
18509 -342998 -16614 -240516 -182043 117272 -84543 87766 205923 11119 96867 -120519 -105378
18498 -105378 -325326 40389 250488 -78394 134308 -440008 -350637 -157103 -27912 75544
18487 2329 111741 -9375 -5031 143940 76068 -208101 -157920 76770 -101301 12674 -263705
18475 -3807 -179686 26458 118799 -87714 -102757 179293 -57004 284158 -133330 -241841 -48274
18463 40161 37882 356887 -110458 -115254 -193324 -246029 -79590 110058 143279 273595 -221705
18451b36534A36508a39309B784a67751q7933K5350j8610a2194C0647A2034i2002
18439F9526L2264b40552g3656A4200a08028A30267h4905m9881B22130g0279A12955
18427e0950C7438a27528A26051b70367c8934j14553O4985A73902c00147d8472
18416d02660b3579A41138N293k6429a93421j02920O7868A87311C4636a60819g9279
18404h0100k96323b6969l3562j3281J0204o959A41823K11759B9997a07037I199
18392G1898P5228c26052b3384A16615a29226B44126a25534A55575F1100j0323
18382E0777J15258b02407m7258F4337J34479h6377k10251A30780C2724a63490
18371A22177a51232B3887a24591E9417K07713h3313B76368a00377j48523R7296
$$ plain form
18451 -236534 136508 -139309 2784 -167751 -255684 -230334 -248944 -12194 30647 12034 -92002
18439 69526 101790 -240552 -73656 14200 -108028 130267 -84905 -134786 222130 -70279 112955
18427 -50950 37438 -127528 126051 -270367 -38934 -153487 -88502 173902 -300147 -48472
18416 -402660 -23579 141138 146431 120002 -193421 -296341 -228473 187311 34636 -160819 -79279
18404 -80100 -376423 -26969 -60531 -73812 -63608 -70567 141823 353582 29997 -107037 9199
18392 71898 147126 -326052 -23384 116615 -129226 244126 -125534 155575 61100 50777
18382 50777 166035 -202407 -249665 64337 198816 -86377 -296628 130780 32724 -163490
18371 122177 -151232 23887 -124591 59417 267130 -83313 276368 -100377 -248900 -151604
18361a51604A72582A1201N7402L5219J37669k1266f867I5016b660H4991K9878
18350A14869j9343a71174H3227a50436F5025a47942q503A94298c84249a75106
18339a67648E208J69910M431a12394J0750a0888k6313A86819J9479N928e457A65028
18326A17597a72857O022b2927B6586J05152m1496i1376l39552h1796l3922i084
18314a20520j6958j0729O6642B67832j26709P5902a79224j99654D8073d29477
18303A05556l5498K7718N6207a0028l1940p3870a0307H6104c7613A5985a52159
18291A48255n2840b06248e8220p7512R684a3127l42305O711a19770A42654a58916
18279e57182a18337H946h6249j06743A91944j2842e4365A90039J01775b02904
$$ plain form
18361 -151604 172582 11201 68603 103822 241491 220225 -6867 95016 -2660 84991 114869
18350 114869 95526 -171174 83227 -150436 65025 -147942 -156445 194298 -384249 -175106
18339 -167648 5208 175118 179549 -112394 -101644 -10888 -37201 186819 206298 212226 -5457 165028
18326 117597 -172857 -166835 -22927 26586 131738 90242 -91376 -430928 -81796 -115718 -9084
18314 -120520 -137478 -148207 -81565 267832 141123 217025 -179224 -378878 48073 -429477
18303 105556 70058 97776 153983 -10028 -41968 -115838 -10307 86104 -37613 15985 -152159
18291 148255 95415 -206248 -58220 -135732 -126048 -13127 -355432 -348721 -119770 142654 -158916
18279 -557182 -118337 8946 -86249 -192992 191944 179102 -54365 190039 291814 -202904
18268b1749k15378J04779b1606k12673C00892b18530d6935C6682Q2863g9799B55969
18256h3353K6326C7968F351c7692A21913h8940K7679a0372l40096a55020j0803
18245a65823N4937A37527i8396p5758n2361R2490E6155a804k82732C10227a71214
18233i4521B1066b26180M2800h6302F7229a18704B00928b6643d990A53880e4418
18221H786N1522L4070f4151A1019a39076O0916K6316o8399e5946B38773J8530
18210B57303E7439c12728f5187B38925b7813j70349b462l2250C326M3753m20g7896
18197B62902b13373e4852C7447a75206A81430R7476i7657A75276h5893B43295
18186A74979E1101J55275g8859j36946E4050O7980A049c2844j20052j52004B28074
$$ plain form
18268 -21749 -237127 -132348 -21606 -234279 300892 -218530 -46935 36682 119545 -79799 255969
18256 -83353 -57027 37968 6351 -37692 121913 -88940 -61261 -10372 -350468 -155020 -165823
18245 -165823 -110886 137527 -98396 -174154 -226515 -134025 56155 -1804 -284536 310227 -171214
18233 -94521 21066 -226180 -183380 -86302 67229 -118704 200928 -26643 -4990 153880 -54418
18221 8786 60308 94378 -64151 11019 -139076 -78160 -51844 -120243 -55946 238773 257303
18210 257303 57439 -312728 -65187 238925 -27813 -198162 -2462 -34712 3326 47079 46659 -77896
18197 262902 -213373 -54852 37447 -175206 181430 278906 -97657 175276 -85893 243295
18186 174979 51101 206376 -78859 -215805 54050 122030 1049 -32844 -152896 -304900 228074
18174I2051i8401K7774q7888B43746A6925K54017j01495K29552j84878a20162
18163A20574A2028K65222A15595n5573f6107A21477h1023j01598j92609A75661
18152c50213C1028a7363A81227F993L0657b57230i3315J1742B83071b48280g2553
18140A20357K62106m9155b60618c854C151J68220b92261p9105G4046c48323a16622
18128C1694P4710C9412a1953m9861H7756B7703J77661d45575A43738a48195D9569
18116C3092a34688O967o8843a7090l7350H0681e9588A73071a17853A92160H0325
18104A52973O730a5165k7930j8308A4183c2078j39451l22401H0291E201g669j65764
18092a73433d0344A86948a32558B31903m7729a82245h6333c399D03693a04230
$$ plain form
18174 92051 -98401 -70627 -158515 243746 16925 270942 169447 398999 214121 -120162
18163 120574 12028 277250 115595 60022 -66107 121477 -81023 -182621 -375230 175661
18152 -350213 31028 -17363 181227 6993 37650 -257230 -93315 -81573 283071 -248280 -72553
18140 120357 382463 333308 -260618 -3854 3151 171371 -292261 -371366 74046 -348323 -116622
18128 31694 106404 39412 -11953 -61814 87756 27703 205364 -445575 143738 -148195 49569
18116 33092 -134688 -127721 -196564 -17090 -54440 80681 -59588 173071 -117853 192160 80325
18104 152973 159703 -15165 -43095 -61403 14183 -32078 -171529 -493930 80291 5201 -7669 -173433
18092 -173433 -40344 186948 -132558 231903 184174 -182245 -86333 -3399 403693 -104230
18081a16168K9274k18791g9854j15153B41530b30812f3706A4404a69285M9739
18071a19546A08018J08127I7899j2411c05036D2092Q6090J08519a2283B6871b90449
18059i3749B9002b03288D7713j0787L6951I120a99438A91900e2900B41278o7912
18048A73366a39745A12629a63022H1516d8807m0972B7184b53335C2860J21451
18038A54311a49000A82031G8621a87091J775K215c1748l10028C14479A06311a8177
18026a13233j98781L5957J27446D7934c1186j40965B41549E3681L58295a0322
18015A88954a20653A90907m7275b31445B27061L6910e5959j19594k9003B45741
18004A20139a37010B9873a31500G4717a65540B74555l0637k0719E7497J39564
$$ plain form
18081 -116168 -86894 -305685 -79854 -195007 241530 -230812 -63706 14404 -169285 -119546
18071 -119546 108018 216145 97899 85488 -305036 42092 128182 236701 -12283 26871 -290449
18059 -93749 29002 -203288 47713 36926 73877 9120 -199438 191900 -52900 241278 173366
18048 173366 -139745 112629 -163022 81516 -48807 -89779 27184 -253335 32860 154311
18038 154311 -149000 182031 78621 -187091 -185316 -183101 -31748 -341776 314479 106311 -18177
18026 -113233 -312014 -276057 -148611 47934 -31186 -172151 241549 53681 411976 -10322
18015 188954 -120653 190907 143632 -231445 227061 263971 -55959 -175553 -204556 245741
18004 120139 -137010 29873 -131500 74717 -165540 274555 243918 223199 57497 197061
17994A97061i0666d2647n54607g0114r9086j6714A43753M5554J95010A16955r362
17983A07593f452K3A84239m0382O1890G5860K10662g5194E7787a73461B85596
17971d0286m4134e492o0688B2480b78614a38972M1605A94681L5991A10429b06078
17959B72394c76457A82894r0847J23664B0349c02282C86601G3250b96296e5933
17948b08288Q5710d7034j3207D1818c2242C11287f980H3182M1526b1716q9422
17937a11138A46225c43699F1596f0828A82548P2671c00963l0257E5150A3337O6643
17926G9980Q5645P1200c87602i4206o6898g0166j703A41972h05C095b41545B75469
17913e6756n2845C9240e364o4119A04757a4039j25188j07117a00456r000A07012
$$ plain form
17994 197061 -90666 -42647 -597254 -70114 -169200 -185914 143753 189307 384317 116955 107593
17983 107593 -6452 -6429 184239 143857 205747 75860 286522 -75194 57787 -173461 285596
17971 -40286 -84420 -5492 -66180 22480 -278614 -138972 -97367 194681 230672 110429 -206078
17959 272394 -376457 182894 92047 215711 20349 -302282 386601 73250 -296296 -55933
17948 -208288 -122578 -47034 -60241 41818 -32242 311287 -6980 83182 124708 -21716 -111138
17937 -111138 146225 -343699 61596 -60828 182548 255219 -300963 -331220 55150 13337 79980
17926 79980 165625 236825 -387602 -94206 -161104 -70166 -71869 141972 -805 3095 -241545 275469
17913 -56756 -109601 39240 -5364 -69483 104757 -14039 -139227 -246344 -100456 -109456 107012
17901A26776J55637O575j35321k1706a90316E7449c09447i2782j14036A84785
17890A06476K69042F0278L68340I7747h1797B8885K01950a53993b0970D0410A9729
17878C3130a91379I9131C0871h4805J4062c3248m17086A14909a66907B44716A17266
17866a89309e1313j80123c4203k1690j04982a406k1528l7728i384B45984i6859
17854a43930I8953e4507B2195f7855B6434K47374j20538a45572A00158a35835
17843a95640A5722d7061B13752q8133a29701A57309C6446K59240j00436g6836
17832a69061G7330a14355N2775E8391D305J42639a03552A77525L8048J55929p6704
17821B94798j43030J5106J8013J0264a58932b8251m063A8871J16965a02656H9970
$$ plain form
17901 126776 282413 288988 153667 131961 -190316 57449 -309447 -92782 -206818 184785
17890 106476 375518 60278 428618 97747 -81797 28885 230835 -153993 -20970 40410 19729
17878 33130 -191379 99131 30871 -84805 -70743 -33248 -450334 114909 -166907 244716 117266
17866 -189309 -51313 -231436 -34203 -55893 -160875 -1406 -22934 -60662 -9384 245984 -96859
17854 -143930 98953 -54507 22195 -67855 26434 273808 153270 -145572 100158 -135835
17843 -195640 15722 -47061 213752 125619 -129701 157309 36446 295686 195250 -76836
17832 -169061 77330 -114355 -61580 58391 4305 146944 -103552 177525 215573 371502 294798
17821 294798 151768 166874 184887 195151 -158932 -28251 -32314 18871 135836 -102656 89970
17809a36651N2976B40237E8460a57853R723A37484F6539K95086a88469H6356J45821
17798B32177C4077i4098B32468b1059A07595M0527M9799L2374N7616i7978B6681
17786C21170a21431c8355B66898b83192A17069K59877a71243C04733j12601c0511
17775H2627j827a36133B31066N7917c8088a6801C52632K97138A18780b9653A72001
17763h6796j86301k3314i5546b0476D2355J45658M1905d2797A15731a74468k7682
17752b02150g88D04690a34967A17954b1016I2292J1749i413C00483E173R795P9913
17740I4881a02862A84432n3781M2878b30713d4559B83718a46521b4648D51391
17729E2251K57196A25043a98529B88551a79768A9575c70239I2332a71955C88704
$$ plain form
17809 -136651 -83675 240237 58460 -157853 -148130 137484 66539 361625 -188469 86356 232177
17798 232177 34077 -94098 232468 -21059 107595 148122 197921 230295 287911 -97978 26681
17786 321170 -121431 -38355 266898 -283192 117069 376946 -171243 304733 192132 -30511
17775 82627 80800 -136133 231066 288983 -38088 -16801 352632 649770 118780 -29653 172001
17763 -86796 -273097 -296411 -95546 -20476 42355 188013 229918 -42797 115731 -174468 -202150
17752 -202150 -788 404690 -134967 117954 -21016 92292 104041 -9413 300483 5173 14968 94881
17740 94881 -102862 184432 130651 173529 -230713 -44559 283718 -146521 -24648 451391
17729 52251 309447 125043 -198529 288551 -179768 19575 -370239 92332 -171955 388704
17718C25935h335B54478j2418E3825K94266a58119C83896A30879m0871P9843O3996
17707B33847o0274R5438I1854a35548A36029J42477c2484D74K50789r0655J12819
17696B73427a27040A67792M5968l8399G3258c1392j44512B37563J3942a44450
17685C25314a48793B20574g8082A18178m6571i1618B25862o7450b37995E4817
17674A29688g6763j26996A40662K14043A35770o2467b57310E1217a0743B09990
17663c15046A35102m1411K07828a67525B44266b48680A58440a36607A78600H5113
17652H1421J8925a15675B98221j40920p3051f5290I6952J17251j04402E0384a23414
17640a84619C72349b1918c164C03333j43034a14087c4491C76b2338g024A69975
$$ plain form
17718 325935 -8335 254478 242060 53825 348091 -158119 383896 130879 90008 169851 233847
17707 233847 173573 269011 91854 -135548 136029 278506 -32484 474 251263 160608 273427
17696 273427 -127040 167792 213760 175361 73258 -31392 -175904 237563 251505 -144450
17685 325314 -148793 220574 -78082 118178 71607 -91618 225862 158412 -237995 54817
17674 129688 -76763 -203759 140662 354705 135770 73303 -257310 51217 -10743 209990
17663 -315046 135102 93691 301519 -167525 244266 -248680 158440 -136607 178600 85113
17652 81421 100346 -115675 298221 157301 84250 -65290 96952 214203 109801 50384 -123414
17640 -184619 372349 -21918 -3164 303333 160299 -114087 -34491 376 -22338 -7024 169975
17628I5635L19861A56696a97042C5450O9949j2839J28855j06938L8207g880B31804
17616c3587J364A80058B2236L55634K0969c14360A27779B3074h3270A29107J95163
17605C24270j04216G2360K5463A4818L64961E5393d3205F8130e8178G4889b06607
17593B77359L1600G3758L90219A89197q1864J59953j13393l1110M1257L0619J1365
17582B06024A4441L1901K9535N9619N3867m5194c7699a4560A176J83485O3461
17571B48122q7013k5530K1986l5178R6178q7520J03391c5540l27642C14237j09054
17560B05183a6301A54753h0356A05461K40489d0597B07655J82186I586K76737
17550B86323j10888K11732A45569M5579K50141j01101K6423F6435K91077j50763
$$ plain form
17628 95635 415496 156696 -197042 35450 105399 92560 221415 114477 152684 -7880 231804
17616 -33587 -32223 180058 22236 377870 398839 -314360 127779 23074 -83270 129107 324270
17605 324270 220054 72360 97823 14818 379779 55393 -43205 68130 -58178 74889 -206607
17593 277359 308959 73758 463977 189197 107333 267286 153893 122783 164040 194659 206024
17582 206024 14441 46342 75877 135496 189363 144169 -37699 -14560 1176 184661 248122
17571 248122 161109 135579 157565 122387 218565 131045 234436 -35540 -363182 314237 205183
17560 205183 -16301 154753 -80356 105461 345950 -40597 207655 389841 9586 286323
17550 286323 175435 387167 145569 191148 441289 340188 366611 66435 357512 206749
17540B06749K63910o05p8017r2349d7735C06511j28672B9409J77821J19210L2150
17529C58590n1704a84084E81094J70575K61377K35814L1946n9619k68769k91689
17519F60729l17976L79286B61818J78759j85338K45236k35715J38363L53557P26131
17509A482811k96499j7983O4408m42759l57669o3711O7785j78811A164L77117
17499C78281P5322J05610k28714A2448J16322K71596N6983A47612K88664j38075
17489B98201J4150J09528j12362A03244L31145A43234J93902K28118A21938J27542
17479B49480j1818P6863L28903C00368Q25K95682k90597R9329N0874b7447B44262
17467A74710E0198J09748J69500D6145K03010q660A7549K21304L0747N3235M3697
$$ plain form
17540 206749 470659 470054 392037 299688 -47735 306511 177839 29409 207230 326440 358590
17529 358590 306886 -184084 581094 751669 1013046 1248860 1280806 1221187 952418 660729
17519 660729 342753 722039 261818 440577 255239 500475 264760 403123 756680 1482811
17509 1482811 1186312 1168329 1232737 789978 432309 368598 436383 257572 1164 378281
17499 378281 453603 559213 330499 12448 128770 400366 457349 147612 436276 298201
17489 298201 312351 421879 309517 103244 434389 143234 337136 565254 121938 249480
17479 249480 237662 314525 643428 300368 301193 596875 306278 405607 456481 -27447 244262
17467 174710 50198 159946 329446 46145 249155 240495 17549 238853 269600 322835 366532
17456C66532j8243G5712R4047J91959J0074j5933A49942K523M7420J46786A72606
17444A61163M80229j51453m1113A91064K26938M9534G6381L31908M96252l86208
17434E18333J18492r2226k16829L1124K05694k402b1175D94747n2118J68606j49538
17423D61697r6884J10726A50516J07671M4353F8927O45700A44610K61394J6632
17413D22636M1877q9465R3020K0360J23851l00985N8438A51336K45827r9054R5194
17402C93303A78864K04731I7593L81886n9022h3363B28487P6229P2685J7686M1063
17391D36150A27517R6103N6869m5787H4819c6112E54487A99847o8105L6350B0430
17379B25576G6678L33916O6842J25697f2266C2335K18237j23739P8145K39884
$$ plain form
17456 366532 348289 75712 169759 361718 371792 355859 149942 152465 199885 346671 172606
17444 161163 641392 489939 448826 191064 418002 467536 76381 408289 904541 518333
17434 518333 636825 544599 327770 358894 564588 562186 -21175 494747 442629 611235 461697
17423 461697 364813 475539 150516 258187 302540 68927 714627 144610 406004 422636
17413 422636 464513 375048 468068 488428 612279 311294 369732 151336 397163 298109 393303
17402 393303 178864 383595 97593 479479 420457 -83363 228487 304716 377401 395087 436150
17391 436150 127517 223620 280489 234702 84819 -36112 554487 199847 131742 168092 20430
17379 225576 76678 410594 477436 603133 -62266 32335 250572 126833 204978 444862
17369D44862r6989J68385B18284n3055J95080K25093k72317D8061K01963H0489
17358I6877a07184D86025m3992j57863L72762B60726m4153O4032I1458M74406
17348E65864B52274J85496l3189A64001J90017M6090j00922a27478C44277M2649
17338C86926q6569j14599J81255J24032j40768j7258j53196M03136k02322j31651
17328B48986K21827J23985j07787j3411N7122A41431J36730A20038J50405Q0209
17318C50652m7244m0767L97888B9944J41654L60355A21810n6156K67244R4909
17308D27807j59244j16241K21684j62474L14682j75252j04315l6344L582O5084
17298B78969R1360J1632j10270J40119L9171n5799q2907J58462R0319A79465J35130
$$ plain form
17369 444862 347873 516258 218284 165229 360309 585402 313085 48061 250024 80489
17358 96877 -107184 486025 442033 284170 656932 260726 216573 280605 91458 565864
17348 565864 252274 437770 404581 164001 354018 400108 299186 -127478 344277 386926
17338 386926 300357 185758 367013 491045 350277 333019 179823 582959 380637 248986
17328 248986 470813 594798 487011 473600 530722 141431 278161 120038 270443 350652
17318 350652 303408 262641 660529 29944 171598 531953 121810 65654 332898 427807
17308 427807 268563 152322 374006 211532 526214 350962 246647 210303 213885 278969
17298 278969 370329 381961 271691 411810 450981 395182 312275 470737 561056 179465 314595
17287C14595F3395a45218D59321J3203B27211K19420K2921r9229P9046r0143N6564
17276D15790o1116p41K0329j0508B983N26539j58047i7245F36272k10934j32123
17265B93215M29510B18895K04633l9815M0849J95060B42318E1696J29557L36438
17255E17691J32840j20275a37322C78475N1813j5743J65895k34412F4935N46085
17245F11020j41246J27714k63296O0715j37184O3917J16388J2348j77040L6012
17235C09348O7477K27153k38137K9543J31499J02866k22570j46880J56184l7593
17225C78890r7213P5225J45836j44896J29670K2485j40933J88630j96769m3168
17215C17757M5414O2797q738j78060L23730j01514r1519J42085k1481J05942B23185
$$ plain form
17287 314595 63395 -145218 459321 472524 227211 446631 469552 370323 449369 359226 415790
17276 415790 354674 353933 374262 363754 2983 529522 371475 -97245 636272 425338 293215
17265 293215 722725 218895 423528 383713 424562 619622 242318 51696 181253 517691
17255 517691 650531 530256 -137322 378475 430288 414545 580440 346028 64935 611020
17245 611020 469774 597488 334192 394907 257723 321640 438028 450376 273336 309348
17235 309348 376825 603978 365841 395384 526883 629749 407179 260299 416483 378890
17225 378890 281677 356902 502738 357842 487512 509997 369064 557694 360925 317757
17215 317757 363171 425968 417230 239170 562900 461386 369867 511952 490471 596413 223185
17203E40961N6559B41707K64902K47207l18524Q6163P7819m8701K1353C9752O44968
17192F84720j72127o69K13699k75650n8939L56421j40713j07647j75811L01691
17182F24975B31651J83705J35150j79360Q0693K91663p9304k98119K09597j13409
17172D62267j48909r8441N43645k73130L0020M7369j50747P0645J82478k52627
17162D12570A43622K60486j80825O11191k87083K89387m05157M2426p3740N01588
17152I01895l73146L11139l16870j04906j37241J72283q8440P8694K6278k14944
17142B54742L19942O4073N0220j63236N3109j19315M71388D14397K10088j59232
17132D65253Q5463J56757k43078O32434j13788j95319k64389K65206j05813o5957
$$ plain form
17203 540961 597520 241707 506609 753816 435292 521455 599274 550573 571926 39752 684720
17192 684720 512593 511924 725623 449973 391034 747455 606742 499095 323284 624975
17182 624975 231651 415356 550506 371146 451839 743502 664198 366079 575676 462267
17172 462267 313358 214917 758562 485432 515452 562821 412074 482719 665197 412570
17162 412570 143622 404108 223283 834474 547391 836778 431621 474047 400307 901895
17152 901895 528749 839888 523018 418112 280871 453154 364714 443408 469686 254742
17142 254742 574684 638757 688977 525741 578850 459535 930923 414397 624485 465253
17132 465253 550716 707473 464395 1096829 983041 787722 523333 788539 682726 616769
17122F16769k45385L48921k20148J33156l03922L45484J6427J04984j06352J4014
17112G03948j42045P7660j00654L68803l62811M2132J01592N7303K24199m24935
17102E45192Q2041n123o1535L28670j76187k02144K13898L03180k39138K09527
17092I98381j04615k91139J07302J24406J31764M2375r3885q8901j40307n6290
17082F29091J28701k20031N52626m19639K98385j66526j61314K33421l10837L47706
17072I11583j71283m540K36652l03216P74680m51234O5324m17407L70544l68018
17062F43085J09584J46140J07693D64895M46787J34473l55211M97026o1208J22129
17052A248891l58305j57543J14129k33777M07217K0251P5722o6361K26010m83613
$$ plain form
17122 616769 371384 720305 500157 633313 329391 674875 691302 796286 689934 703948
17112 703948 561903 639563 538909 907712 544901 587033 688625 745928 970127 545192
17102 545192 627233 622110 560575 889245 713058 510914 724812 1027992 788854 998381
17092 998381 893766 602627 709929 834335 966099 1008474 914589 825688 685381 629091
17082 629091 757792 537761 1090387 670748 969133 802607 641293 874714 563877 911583
17072 911583 740300 735760 972412 669196 1443876 992642 1057966 640559 1011103 643085
17062 643085 752669 898809 1006502 464895 911682 1046155 690944 1187970 1126762 1248891
17052 1248891 890586 733043 847172 613395 1020612 1040863 1116585 1050224 1276234 792621
17042G92621O5345K58977m6894p9835k51973K97268L8567P6473k13683K21522
17032A158388O1311L0866j21001J54447L4095j62364l6296j8447L5784J30431
17022A267214l09579K71783j14176n5799o8719J33030J51545J61194k17891N5867
17012A274469m3018P7798N0711q5769j42775K15993J8648J41867k8505M8868o0511
17001A467776k75648J04766j42350K46682q0575K7268R4427j54798k06939N16096
16991A596705k56339l1889M77847k35156m37292O00276k50760K54092j80987L40726
16981A877223m17864K95780k84264M934L00451k76432J15794j58283J92065J22102
16971A771506J29131j34152M1667k11141J97980j84494R4404M38J20979m7967
$$ plain form
17042 792621 857966 1116943 1070049 990214 738241 1035509 1074076 1150549 936866 1158388
17032 1158388 1219699 1250565 1129564 1284011 1318106 1155742 1119446 1100999 1136783 1267214
17022 1267214 957635 1229418 1115242 1059443 990724 1123754 1275299 1436493 1218602 1274469
17012 1274469 1231451 1309249 1359960 1274191 1131416 1347409 1366057 1507924 1479419 1528287 1467776
17001 1467776 1192128 1296894 1154544 1401226 1320651 1347919 1442346 1287548 1080609 1596705
16991 1596705 1340366 1308477 1786324 1551168 1113876 1714152 1463392 1717484 1536497 1877223
16981 1877223 1459359 1755139 1470875 1475809 1776260 1499828 1615622 1457339 1649404 1771506
16971 1771506 1900637 1766485 1808152 1597011 1794991 1610497 1704901 1705339 1826318 1778351
16961A778351q8021J84318k77100J03644Q0179P9102j50319L86455j91049j05076
16951A800484J19788K32906j03916J09371j26641j96519K33490m7673J47661j82274
16941A986677L88650k77115J26104j45627J07357l6378K38831J10851l5826p761
16931B455763p4626j75625J33558O0384k92575N93652m74908J29876J25251K71195
16921B751945k83706Q7717J66763k59195K81921j47552q94J88336j21687K48857
16911B912505K62335p07901N20121R2859j00702M2270r3294K52771J02843Q905
16901C292712l03085J08057k5589K79772O0536P4994Q8552k96902K39997m7356
16891C471688j15506p0170L06629r650J49970K7423K72688k96522M97050l89736
$$ plain form
16961 1778351 1690330 1874648 1597548 1701192 1781371 1860473 1710154 2096609 1905560 1800484
16951 1800484 1920272 2153178 2049262 2158633 2031992 1835473 2068963 2021290 2168951 1986677
16941 1986677 2375327 2098212 2224316 2078689 2186046 2149668 2388499 2499350 2463524 2455763
16931 2455763 2381137 2205512 2339070 2399454 2106879 2700531 2225623 2355499 2480750 2751945
16921 2751945 2468239 2555956 2722719 2463524 2745445 2597893 2596999 2785335 2663648 2912505
16911 2912505 3174840 2466939 2987060 3079919 2979217 3021487 2928193 3180964 3283807 3292712
16901 3292712 2989627 3097684 3072095 3351867 3412403 3487397 3575949 3279047 3519044 3471688
16891 3471688 3356182 3286012 3592641 3582991 3732961 3760384 4033072 3736550 4233600 3843864
16881C843864J85354M51842m25282J88314j53173L50171j63288M253n9528P1728
16871D294255K3822J39605K56611l27281J37151J93806m3334L82876j21117k189
16861D934205J26183J72915L14812k76939R1219P9378J61196Q9185n7283J96855
16851E831726k56105M19212K21031k04168J91900M80107m85445M36591j08527
16842F526322K27263M07479j07227j052J60606K2472N23269j54360N411K90660
16832G900843K97526M5774j25093k9157K46629K64945N0795M91032K93827j29652
16822I307469K07445r2985N10639O590M88035j9937J75808M84495J37614L8340
16812A1243513M38198j74123O91627R4572K18112L67370L80335J50415O4335L77600
$$ plain form
16881 3843864 4029218 4481060 4055778 4244092 4090919 4441090 4277802 4282055 4222527 4294255
16871 4294255 4318077 4457682 4714293 4387012 4524163 4717969 4674635 5057511 4936394 4934205
16861 4934205 5060388 5233303 5548115 5271176 5362395 5441773 5602969 5692154 5634871 5831726
16851 5831726 5575621 5994833 6215864 6011696 6203596 6683703 6198258 6634849 6526322
16842 6526322 6753585 7161064 7053837 7052785 7213391 7235863 7759132 7604772 7610183 7900843
16832 7900843 8198369 8244143 8119050 8089893 8336522 8601467 8652262 9143294 9437121 9307469
16822 9307469 9514914 9421929 9932568 9939158 10427193 10407256 10583064 11067559 11205173 11243513
16812 11243513 11681711 11507588 12199215 12293787 12511899 12879269 13259604 13410019 13474354 13851954
16802A3851954M34190J02003M36441N68156Q052K48159N15835P47282J52295N10066
16792A7574433J48024O06716O89255L25934L87781O71936M83672K97825J156916
16783B2342492M26550K70697N67777Q81273N31420O13200P93136J051550P03831
16774B8181926M05272R89730P52984Q94304J042452J195090J115358R13590J527606
16765C7018312N45441J224786J222973J486364J461923J474088J158591J920195
16757D7512673J356197J356737J963444J757361J815161J605270K351304J940075
16749F1658222K017859K071929K750632K002349K032873K825344K422327K382075
16741H0163610K440184K429981K554797K738182K249933K631952K379106J929922
$$ plain form
16802 13851954 14286144 14388147 14824588 15392744 15400796 15648955 16164790 16912072 17064367 17574433
16792 17574433 17722457 18329173 19018428 19344362 19732143 20404079 20887751 21185576 22342492
16783 22342492 22769042 23039739 23607516 24488789 25020209 25633409 26426545 27478095 28181926
16774 28181926 28587198 29576928 30329912 31224216 32266668 33461758 34577116 35490706 37018312
16765 37018312 37563753 38788539 40011512 41497876 42959799 44433887 45592478 47512673
16757 47512673 48868870 50225607 52189051 53946412 55761573 57366843 59718147 61658222
16749 61658222 63676081 65748010 68498642 70500991 72533864 75359208 77781535 80163610
16741 80163610 82603794 85033775 87588572 90326754 92576687 95208639 97587745 99517667
16733I9517667K641071K332494K096554J700810J637316J530662J323545J047015
16725A13827134J228211K09417L79522P6110l0089o97984o39387j193986q29712
16716A12329236j925140j385423j586635k381722j911976j983217k564744k651716
16708I5938663k750518k158598k856865k376116k665031k720812k428739k916582
16700G5065402k050454k828789k125254j975737k478220k374458j840878j993109
16692E7398503k337591j511387j872183j960151j734742j601683j226712j871117
16684D3282937j086936j507693j186551j657401r59502j467017n35240j507845
16676C3374752j042922j104101q80394o28437j168021p52389q62486p47653n09269
$$ plain form
16733 99517667 102158738 104491232 106587786 108288596 109925912 111456574 112780119 113827134
16725 113827134 115055345 115264762 115644284 115720394 115690305 114992321 114352934 113158948 112329236
16716 112329236 110404096 109018673 107432038 105050316 103138340 101155123 98590379 95938663
16708 95938663 93188145 91029547 88172682 85796566 83131535 80410723 77981984 75065402
16700 75065402 73014948 70186159 68060905 66085168 63606948 61232490 59391612 57398503
16692 57398503 55060912 53549525 51677342 49717191 47982449 46380766 45154054 43282937
16684 43282937 42196001 40688308 39501757 37844356 36884854 35417837 34882597 33374752
16676 33374752 32331830 31227729 30347335 29718898 28550877 27798488 26936002 26188349 25679080
16667B5679080q78357m16073q60034p42552j108263n51939k45512o55464k48694
16658A9972192o49189l35947q15357k69155p22943m3449q75680k51957m17781
16649A5590734k68327m37371l52714l79609k77404o738l92810l78160l88257P2621
16639A2781965o08099k77483n0363k39860l97304p6625k51399l74582j00641m18304
16629I987305k29334J82213p9609o63834j7715j20570n81023J57719n9620o5927
16619H509605l51818J8913n32288K00548l9013l09347k86420n4795r200J57029
16609G303214m19472k75186n9286K37233n15634O9051K40810k35137k49572l7864
16599F058157j25443Q6493k63128K32663k92967k44149k90457m5657J26659j29936
$$ plain form
16667 25679080 24800723 24384650 23524616 22782064 21673801 21121862 20876350 20220886 19972192
16658 19972192 19323003 18987056 18171699 17902544 17179601 17136152 16260472 16008515 15590734
16649 15590734 15322407 14885036 14532322 14152713 13875309 13868571 13475761 13097601 12709344 12781965
16639 12781965 12173866 11896383 11846020 11606160 11208856 11132231 10880832 10506250 10405609 9987305
16629 9987305 9757971 9940184 9860575 9196741 9179026 9058456 8477433 8635152 8575532 8509605
16619 8509605 8157787 8176700 7644412 7844960 7805947 7496600 7210180 7155385 7146185 7303214
16609 7303214 6883742 6608556 6549270 6786503 6270869 6339920 6580730 6345593 6096021 6058157
16599 6058157 5932714 6019207 5756079 5988742 5695775 5451626 5161169 5115512 5242171 5112235
16589E112235k97941J7631K18637k13681M1490o14789M12380r7699J66842k35203
16579D509902l13926L49581m9125j93683m14178J70963L18632m92216P0085j16984
16569C839051K60797o78232R6288k0622K17097L43576k99524l86655J52900p1902
16559C452774J1333l67955K04062j34449k00937J21615K79607l34778k5971q5120
16549B920181K96892l64255J09554J48181l22444K01246j58527M0706k86501J38624
16539B723657j93763r0666K31325j05812j27034J48766P9385k26487K83199n3972
16529B668598k13006r8176M3682k62583k18050N07079n23324K00107L63546j38037
16519B329836k40240L24731m21403n4044K54128j43372N4614o3684p5583K16696
$$ plain form
16589 5112235 4814294 4831925 5050562 4836881 4878371 4263582 4675962 4578263 4745105 4509902
16579 4509902 4195976 4545557 4496432 4302749 3888571 4059534 4378166 3885950 3956035 3839051
16569 3839051 4099848 3421616 3517904 3497282 3714379 4057955 3758431 3371776 3524676 3452774
16559 3452774 3464107 3096152 3300214 3165765 2964828 3086443 3366050 3031272 3005301 2920181
16549 2920181 3217073 2852818 2962372 3110553 2788109 2989355 2830828 2871534 2585033 2723657
16539 2723657 2529894 2439228 2670553 2564741 2437707 2586473 2665858 2439371 2722570 2668598
16529 2668598 2455592 2357416 2401098 2138515 1920465 2427544 1904220 2104327 2467873 2329836
16519 2329836 2089596 2414327 1992924 1938880 2193008 2049636 2104250 2040566 1964983 2181679
16509B181679q1129m35687K08010q3773K8963m4724j52967K51557K32756j24373
16499A980312Q7173n27422K60717m31241J69617j47401K96710k01394J1889j03108
16489A395852N36671l15604j09905J0372L97785j90938j99212j90777q7970J48895
16479A395169O5946K35519J5796j78921k76803K02484l83232J81429J70881p8170
16469A350098M0741j2726J02069j68516P19k28225K62111m9588r2342j68366K64713
16458A300688Q6753q8738l90411J35505J24302K29599k37478K54203k96800P1369
16448A188992J406K85399G30120N31542l78414L34058l00198L3546j11454N07449
16438A346649k51109j36179K43818l06895J62708N3602j89983n1463n2163L08397
$$ plain form
16509 2181679 2100550 1664863 1872873 1789100 1818063 1773339 1620372 1871929 2104685 1980312
16499 1980312 2067485 1540063 1800780 1369539 1539156 1391755 1688465 1487071 1498960 1395852
16489 1395852 1932523 1616919 1507014 1517386 1915171 1724233 1525021 1334244 1246274 1395169
16479 1395169 1461115 1696634 1712430 1533509 1256706 1459190 1075958 1257387 1428268 1350098
16469 1350098 1390839 1378113 1480182 1311666 1312385 1084160 1346271 1296683 1204341 1035975 1300688
16458 1300688 1387441 1298703 908292 1043797 1168099 1397698 1160220 1414423 1117623 1188992
16448 1188992 1190398 1475797 730120 1261662 883248 1217306 917108 950654 839200 1346649
16438 1346649 1095540 959361 1203179 896284 1058992 1112594 922611 871148 818985 1127382
16428A127382J63693m63905L8150J2685J53085J00581L6779p5429j70210Q8439
16418A011250j23636J50368o1334J28649j86973J99714k88409J43518J30540E29896
16407A201915k54756j47047j61321K29275l36981M80992j13643P576k08654L76062
16397A073418m95984L24482K53017j70335j08320q5429L85193j01656l90590P4605
16387G58401K11569l41575J71293J46470k37322j48301Q6187N7991M9344k83305
16377D70752K92357K76757C61336L92741N5223j86865J9088j24818K798L49003
16367H68506j1108j33454k66067Q9979P6669J64141k11448k44288N09976k22935
16357F19971J51926l15945J26617J6985j01129K85538k09832q4807J15020k10965
$$ plain form
16428 1127382 1291075 827170 865320 878005 1031090 1131671 1168450 1093021 922811 1011250
16418 1011250 887614 1037982 976648 1105297 918324 1118038 829629 973147 1103687 529896
16407 1201915 947159 800112 638791 868066 531085 1012077 898434 906010 697356 1073418
16397 1073418 577434 901916 1154933 984598 876278 790849 1176042 1074386 683796 758401
16387 758401 969970 628395 799688 946158 708836 560535 646722 704713 754057 470752
16377 470752 763109 1039866 361336 754077 809300 622435 641523 516705 519503 868506
16367 868506 857398 723944 457877 547856 624525 788666 577218 332930 842906 619971
16357 619971 771897 455952 582569 599554 498425 783963 574131 489324 604344 393379
16347C93379J44997M4061B71666L61999j46990J4949R457L91888k55190m3361
16337F04418J89776B46330K26588L36909k46542L46567l66554J86766B19134K29146
16327D48280q4990N7889K35618q6319k80521K86863J21495k53531l0992o4494
16317C49298L09499j28367j50362j06146J56468J47576k33124j40358N79233B17
16306A85494M87428j92459M937J57130m2218A73919N78852C69979G4607L22024
16296C96631A05945K84265K25688B85013J45554j19752L69591l12915o4021L44162
16286F47632j76296J50346B61939J06668P8287j04043L50186l09537A50872K32661
16276C83533L01637j92756n7340A80013J59138l5048A18920M77886B90356J23951
$$ plain form
16347 393379 538376 582437 271666 633665 486675 501624 511081 902969 647779 604418
16337 604418 794194 246330 472918 809827 563285 909852 543298 730064 219134 448280
16327 448280 363290 421179 656797 570478 289957 576820 698315 444784 413792 349298
16317 349298 658797 530430 380068 273922 430390 577966 344842 204484 783717 217
16306 185494 672922 480463 485400 642530 600312 173919 752771 369979 74607 396631
16296 396631 105945 390210 615898 285013 430567 310815 680406 367491 303470 647632
16286 647632 471336 621682 261939 368607 446894 342851 693037 383500 150872 383533
16276 383533 685170 492414 435074 180013 339151 304103 118920 596806 290356 414307
16266D14307j01526J43527J69057o6920A70101L87J47661L0333A51683J17493
16256B69176J29607q1478J75501K8303B06045j1993K79805k22640M8802M371p231
16245B97159L1040A30731K95918j57393L36669k54495A15397M03512A15676N60763
16235F76439A37370K25915Q4520m3389r0694J5975r5722O2412J39144B03470f268
16223C66162J66144B30052R0405K25144A36627P9475p9566K9231L60595b7649
16212C6052K95373P8934B1231M53419B29237Q2881J4901A57779K7477H0552J89608
16201B70160j13980J01493J9202e4822B08700A5740K45159j22962o1336J02022
16191A78623b73730D8929M36243f2758E1443J90765k1122n5578D9262J62701M2389
$$ plain form
16266 414307 312781 456308 625365 558445 170101 170488 318149 348482 151683 269176
16256 269176 398783 317305 492806 521109 206045 194052 473857 251217 300019 304390 297159
16245 297159 328199 130731 426649 269256 605925 351430 115397 518909 115676 676439
16235 676439 137370 363285 447805 404416 313722 329697 233975 296387 435531 203470 -6268
16223 366162 532306 230052 320457 545601 136627 216102 136536 165767 526362 -27649
16212 36052 331425 410359 21231 474650 229237 312118 327019 157779 185256 80552 270160
16201 270160 156180 257673 276875 -54822 208700 15740 260899 137937 76601 178623
16191 178623 -273730 48929 485172 -62758 51443 242208 221086 165508 49262 211963 254352
16180B54352K22452k25836l9989J6147G0814K56112b1695B36202B4481R2279K34416
16169C51176b1713E82947A04338J01897A02174K04126m6942h9195B18384i472
16158C52889a14889A76460c5377D03331b08186F8054J29697J05471f4427C59555
16147b76166B1150h9158B32005J8051a18188B16926H8209l6662A8929a97046B31248
16135b8729B09264a3007o2716j0694F5683J11543J47119A17803O6531N8307g8955
16123b03982D9821J39936n1547J11576b8407B4562P6406A5901b2392D52098A98041
16111B08375o7260O4960a2745r2680m8949M5448A88909F8256C2498K0748r771
16100D3475M9072a23373C20705A31430N4210p0195J78876k1836C6878h9061G610
$$ plain form
16180 254352 476804 250968 210979 227126 70814 326926 -21695 236202 24481 116760 351176
16169 351176 -21713 582947 104338 206235 102174 306300 259358 -89195 218384 -9472
16158 352889 -114889 176460 -35377 403331 -208186 68054 197751 303222 -64427 359555
16147 -276166 21150 -89158 232005 250056 -118188 216926 88209 51547 18929 -197046 231248
16135 -28729 209264 -13007 -75723 -86417 65683 177226 324345 117803 184334 242641 -78955
16123 -203982 49821 189757 138210 249786 -28407 24562 100968 15901 -22392 452098 198041
16111 208375 141115 206075 -12745 -105425 -154374 -108926 188909 68256 32498 53246 43475
16100 43475 92547 -123373 320705 131430 185640 115445 294321 272485 36878 -89061 7610
16088d0573G1639L95508F9352a00145B54638n9911C8369J07762o6885G806L56784
16077C64590a26563D27425j15037a6202j91192M3982A02031a42527M4954B49324
16066e9081A34737P4242c9177B04728Q2517C4969c0477A129c08386B92315d4014
16054a21727E50341A94695J59626i6554l323B4051J01659f7538C6074J93248i7475
16042B98263b35186e4546B0441a95534R3607A25960J67705j32535J1419K69998
16032D42547A24933J042F0890g7264A0430K65587j12110a2197C02304a62926C54689
16020a33488L2018B82724B4833c060A85326i6322B78261b5418k96562H2821K9681
16009A12502K02222K15512a23945A57236p1572C7554K34894j8450a52756r218
$$ plain form
16088 -40573 71639 467147 69352 -100145 254638 194727 38369 146131 79246 7806 364590
16077 364590 -126563 427425 312388 -16202 -207394 -163412 102031 -142527 -97573 249324
16066 -59081 134737 208979 -39177 204728 287245 34969 -30477 1129 -308386 292315 -44014
16054 -121727 550341 194695 354321 -96554 -99877 24051 125710 -67538 36074 229322 -97475
16042 298263 -235186 -54546 20441 -195534 -101927 125960 293665 161130 172549 442547
16032 442547 124933 125975 60890 -77264 10430 276017 163907 -12197 302304 -162926 354689
16020 -133488 -101470 282724 24833 -3060 185326 -96322 278261 -25418 -321980 82821 112502
16009 112502 314724 530236 -123945 157236 85664 37554 272448 253998 -152756 -161974
15999a61974L5722J2815j7554A38998K09378j15233b7571D3140J58086K09868
15989D11094L67025j73582B71462O89959M72092l9646k7984k46068l55779N5926
15979H19962A93959C2516L51930A52992E2519a26594o2622A66936C4347g8850
15968b96779f2719k63464C4876a11530F5717a95725m9984h786r4171c766G5545
15956a95482a5122A85867K2703D2399P5653J482J80556d58224B1831J18580Q3614
15945B24025a34288k2076A34993a87161D9126h0775j12244B7705L3116K11416
15935B72237C9255a06341A0737c1198j62353c8849B17798a64432e0264C4800e913
15923D114J84510c9390m7192A37510a99820M6954q6414C95861o1185a1835A67336
$$ plain form
15999 -161974 -126252 -113437 -130991 138998 348376 233143 -27571 43140 201226 411094
15989 411094 778119 604537 271462 961421 1433513 1393867 1365883 1119815 764036 819962
15979 819962 193959 32516 384446 152992 52519 -126594 -189216 166936 34347 -78850
15968 -296779 -62719 -326183 34876 -111530 65717 -195725 -245709 -8786 -102957 -3766 75545
15956 -195482 -15122 185867 208570 42399 118052 119534 300090 -458224 21831 140411 224025
15945 224025 -134288 -156364 134993 -187161 49126 -80775 -193019 27705 60821 272237
15935 272237 39255 -106341 10737 -31198 -193551 -38849 217798 -164432 -50264 34800 -5913
15923 4114 188624 -39390 -86582 137510 -199820 -152866 -239280 395861 334676 -11835 167336
15911G1584a33119B497a8072m5550k3689c2208A37943R0223J28361j57708D664
15899A14265J28105b40163B4468K81817a34276B2422G954b41817b334A4091a36360
15887b64673A30172c55768A15323J30022a52029A80954L0067a00009j56277J14363
15877a41923D2924c9094B20566I3262D0174d6949B61152a55250N9116K6568o7877
15866a37443l6445M1271j0337k4925B78455e1642a8428j1775A39194k2664a75073
15854g5199m0128H8966J67225h4691q8847B29359l0367B1998M863K33083i8757
15842C3532b5446E8278b79814b3417A29869O7012K3186F8651B1709a4699K150
15831a2549H693J18262g1523A45656B8609q06h3632j2099k8574d7965A1970b1157
$$ plain form
15911 71584 -133119 2497 -18072 -63622 -87311 -32208 137943 228166 356527 198819 4664
15899 114265 242370 -240163 24468 306285 -134276 22422 7954 -241817 -2334 14091 -136360
15887 -264673 130172 -355768 115323 245345 -152029 180954 211021 -100009 -256286 -141923
15877 -141923 42924 -39094 220566 93262 40174 -46949 261152 -155250 -96134 -69566 -137443
15866 -137443 -173888 -132617 -142954 -167879 278455 -51642 -18428 -30203 139194 116530 -175073
15854 -75199 -115327 88966 256191 -84691 -173538 229359 198992 21998 26861 259944 -98757
15842 33532 -25446 58278 -279814 -23417 129869 196881 220067 68651 21709 -14699 -12549
15831 -12549 8693 126955 -71523 145656 28609 27803 -83632 -95731 -124305 -47965 11970 -21157
15818e57157b07026G6819b41258A62989b56698c6218B0364b17011N5090c5615
15807a40165I305a04015B24534b5860k60418D69150A80527N6247j1024p0587B8840
15795I0066a41712A78666A2783J7577j1732J0693b1693j99718H6049c12094J18190
15784a93904f560j65690B03525b69147c2409A31353A1533g9420b7811p1765D04567
15772a7741A58824h5290r4820I4672B2485J06235Q7034J1109g9402A2213J14013
15761A26226a65930n1341c6991A55692b13148B74635b34013A22461J877J26492
15751B50830a03642A5377K59624h8158E5070c53661M5931A59927F7862d74021
15740C8709a81217N9027k04125e1905n2979C17680a34882B07418J582E3023R0788
$$ plain form
15818 -557157 -207026 76819 -241258 162989 -256698 -36218 20364 -217011 -161921 -35615
15807 -140165 9305 -104015 224534 -25860 -286278 469150 180527 236774 225750 155163 28840
15795 90066 -141712 178666 12783 30360 18628 29321 -21693 -221411 86049 -312094 -193904
15784 -193904 -6560 -172250 203525 -269147 -32409 131353 11533 -79420 -27811 -99576 404567
15772 -17741 158824 -85290 -180110 94672 22485 128720 215754 226863 -79402 12213 126226
15761 126226 -165930 -217271 -36991 155692 -213148 274635 -234013 122461 124338 250830
15751 250830 -103642 15377 275001 -88158 55070 -353661 -307730 159927 67862 -474021
15740 38709 -181217 -122190 -326315 -51905 -104884 317680 -134882 207418 209000 53023 143811
15729A43811g1837k56341D859N3662L4647B5995K4686K03816a57627B12871a4489
15717B86715b1138q7993K6183D1698h9956r026j2437l28038a35341l9467F6942
15705c63456J78556A10814b47339G4537g7600C9379b68300N8100c2102j17551
15695a49653A35014h8260r8825D14824a55598N4763D68808A05468N6202R190E643
15683D2079a51100A12486K50439F3275d9845G7652C1309O8265b5778E3449K24170
15672B77619n3602o8929O9852A4148m519N8330a27490q4557c9335m87000A27583
15660a5874j19005B10918a93540A9675J21386i3803A7974B53a46806A41811i3482
15648g2805j44802A96667e13114e3475k14519C15378c78614A63236d68505D517
$$ plain form
15729 143811 -71837 -328178 4859 58521 93168 25995 50681 254497 -157627 212871 -14489
15717 286715 -21138 -109131 -82948 41698 -89956 -98982 -111419 -439457 -135341 -174808 66942
15705 -363456 -184900 110814 -247339 74537 -77600 39379 -268300 -210200 -32102 -149653
15695 -149653 135014 -88260 -187085 414824 -155598 -100835 468808 105468 161670 170860 5643
15683 42079 -151100 112486 362925 63275 -49845 77652 31309 99574 -25778 53449 277619
15672 277619 224017 155088 224940 14148 9629 67959 -127490 -212047 -39335 -526335 127583
15660 -15874 -134879 210918 -193540 19675 141061 -93803 17974 253 -146806 141811 -93482
15648 -72805 -217607 196667 -513114 -53475 -267994 315378 -378614 163236 -468505 4517
15637a11399C4055L21192a0194k39910i9503A36789j8546l4235c08184a30944
15626c4171j65505i2766A0203R8409J06787b55965L1525G1622a61154C8352J41245
15615A79597d4924B58370k1284c86835H8905J23807e7083H3564f0872k1553K5527
15604e6898A89523g885q3895j061m2161k01261C7292J3580a14789A58330O9855
15593B28185g3115A82973d290B2432J66397a1612A63538f5347A50165G0194d5316
15581B33717a05111r0115D9208h8448D5760J46557c83838a01608A69920a63556
15570B0950L45415F1483a71133f7220E5918d3658A50486b16041B83247e2169p9306
15559a31475B06846m9609O9946a22117C03274c6752l37906B66125b63593G4527
$$ plain form
15637 -111399 34055 355247 -10194 -250104 -99503 136789 118243 84008 -308184 -130944
15626 -34171 -199676 -92766 10203 108612 215399 -255965 -224440 71622 -161154 38352 179597
15615 179597 -44924 258370 237086 -386835 88905 212712 -57083 83564 -60872 -82425 -56898
15604 -56898 189523 -7885 -91780 -92841 -135002 -336263 37292 50872 -114789 158330 228185
15593 228185 -73115 182973 -4290 22432 188829 -11612 163538 -65347 150165 70194 -45316
15581 233717 -105111 -195226 49208 -88448 45760 192317 -383838 -101608 169920 -163556
15570 20950 366365 61483 -171133 -67220 55918 -43658 150486 -216041 283247 -52169 -131475
15559 -131475 206846 157237 227183 -122117 303274 -36752 -374658 266125 -263593 74527
15548c77710E0733B5258J54850n3645g8485k6989J5818d4206B44204I2993m4046
15537D8947J60019b74733A38085C8170a27351A1191M32663f3262A5971a67323
15526b05318k3891A4927K93790d87569c8717D14245a80284f4950A58197P050J62761
15515C28008b97528A19757L74681d520F4189K28006p95q1419n6689L12505a10476
15503A13359m2001O3247f5835B70988A08843J39721K2356c77556C85171j60755
15493B24416l9676O5981a54994a3670C47242a1202j09924E7924e0144E7768K01856
15482B59624H9193J67272q8004P2404b14580D3095b1292C81050J5086L06659J50041
15471H52836k37007k82238j03629B8232b2712I9499b48292C17773A53709f5648
$$ plain form
15548 -377710 50733 25258 180108 126463 -78485 -105474 -89656 -44206 244204 92993 48947
15537 48947 208966 -274733 138085 38170 -127351 11191 443854 -63262 15971 -167323
15526 -205318 -229209 14927 308717 -487569 -38717 414245 -180284 -64950 158197 165247 328008
15515 328008 -297528 119757 494438 -4520 64189 292195 291400 209981 153292 465797 -110476
15503 113359 71358 134605 -65835 270988 108843 248564 270920 -377556 385171 224416
15493 224416 184740 250721 -154994 -13670 347242 -11202 -121126 57924 -50144 57768 259624
15482 259624 89193 256465 168461 240865 -214580 43095 -21292 381050 396136 702795 852836
15471 852836 615829 333591 229962 28232 -22712 99499 -248292 317773 153709 -65648
15460F1366M2337a19034l9499k12131h6225A85749b92801M5101L1493m3284F6247
15448B9691f5056F9036L20488f4441B88460j8338L66198J63089P11856k39510
15438A271755m13558J27766k97784f9387p010A08003g4355C9342O00J95847J5213
15427B51002I3094m3621c5158B98811P6614H9028J58681m3080a39738n239G3621
15415B3817b325G9153c43144F7914a26745A86654D5706L7317g8482k04638E3376
15403b18424D9208J86757g4183m827B03809c47398B44351c3317B205a24389R905
15392a14484A92574g4631A9834a15561A77738a63269H5369C9704J77487E2484
15381A27745F3351i9381K1765B50756b73733a8903C38829j29312M31735k88950
$$ plain form
15460 61366 103703 -119034 -158533 -370664 -86225 185749 -292801 -247700 -216207 -259491 66247
15448 29691 -65056 69036 389524 -64441 288460 270122 636320 799409 1511265 1271755
15438 1271755 858197 985963 688179 -69387 -76397 108003 -74355 39342 39942 235789 251002
15427 251002 93094 49473 -35158 298811 375425 89028 247709 204629 -139738 -144977 73621
15415 23817 -2325 79153 -343144 67914 -126745 186654 45706 83023 -78482 -283120 53376
15403 -218424 49208 235965 -74183 -79010 203809 -347398 244351 -33317 2205 -124389 -114484
15392 -114484 192574 -74631 19834 -115561 177738 -163269 85369 39704 217191 52484
15381 127745 63351 -99381 -77616 250756 -273733 -18903 338829 209517 641252 352302
15371C52302q225A26890J17084I0167a17140A07812O524P2596L7824Q6286H5000
15359B29781J09590p444J01104j03154M4108D8079K12764C7402g5233B35877F7263
15347A87787e1597B45706I7584L65846j23569p4089j01064K40131j55376r1214
15337A58249E324L40464I2028K77606A59461J00190K66078g6780D14176b72798
15326a74820D37051G4233J87255J63058F3375K98188r7690h5122B30057p6213
15316A53844K0573b01912F3411a42746A8500J10187J75826n5350J57200j94935
15306B11428C9179K53000C5586b7497j75885f7733A15488l1910p989J653J00903
15295A78145R358r2878a47487N7565A69160a81903A94674d7963j1164l5453C96327
$$ plain form
15371 352302 344077 126890 243974 90167 -117140 107812 114336 186932 224756 311042 85000
15359 229781 339371 331927 433031 329877 373985 48079 260843 37402 -75233 235877 67263
15347 187787 -51597 245706 97584 463430 339861 265772 164708 404839 249463 158249
15337 158249 5324 345788 92028 369634 159461 259651 525729 -76780 414176 -272798
15326 -174820 437051 74233 261488 424546 63375 361563 263873 -85122 230057 153844
15316 153844 174417 -201912 63411 -142746 18500 128687 304513 249163 406363 211428
15306 211428 39179 292179 35586 -27497 -203382 -67733 115488 83578 75589 77242 178145
15295 178145 187503 94625 -147487 -89922 169160 -181903 194674 -47963 -59127 -94580 396327
15283g8473A28727k4039j9074a09426L207A71931K8486o3420f1940A72777J92813
15272C65590D3478a2214A55395R5104h085A73388p3541k1567n183a50020j60764
15261c10784h6572n6338C22437H5927b18991F5877f9657I2352K9845A2759P7862
15250I0621J59043d8082A56043F7315J06672M6958O1466K75348K63921K78396
15240A100076J319481q81856N4605N56611F93790C21008J7069a51832m1407B79325
15229C18283A54359j8531a20002J2354C50608G7280l6835o405a66761B17430H1815
15217B37519B8917K41212c9602B68841j19677o8841K06673c238B71501F3045M61910
15206E24955A60038g5096b7967k2397A69723J68470a93466e5981A40896a37285
$$ plain form
15283 -78473 128727 104688 85614 -109426 -106219 171931 200417 136997 -61940 172777 365590
15272 365590 43478 -12214 155395 250499 -8085 173388 99847 78280 73097 -150020 -310784
15261 -310784 -86572 -142910 322437 85927 -218991 65877 -69657 92352 122197 12759 90621
15250 90621 249664 -48082 156043 67315 173987 220945 282411 557759 821680 1100076
15240 1100076 2419557 1537701 1592306 2148917 693790 321008 338077 -151832 -193239 279325
15229 318283 154359 135828 -120002 -107648 350608 77280 40445 34040 -166761 217430 81815
15217 237519 28917 270129 -39602 268841 149164 80323 286996 -3238 271501 63045 524955
15206 524955 160038 -75096 -27967 -50364 169723 338193 -193466 -55981 140896 -137285
15195A92152f0440A81009P7864B1433K14737b3097a0561A77822c3879B60924K38311
15184D99235g4735A24514e2190A48915L0374b82324B44600a67229A86637r1092
15174I5545D0221J91424a35257d9673A02345l1993k2503K07092C1998K34827j07976
15163A58849o4612M977g6963A37943J9568a02308B77373O635m3401E4398d6804
15151D35166A66320F5083L5938D2758c7708A6623J73163A3843K92941B3893K14543
15140B38436A09650k6217a18138E1585K970i8204H0953b58605d180C12565b09978
15128A03583J67155G3038N6335a54186C6944b0048D96955j64026l9393K57862
15118E51398M8179M284A89082n7003P4933I1492a78158B69276D8987P7201D1434
$$ plain form
15195 192152 -60440 181009 258873 21433 236170 -23097 -10561 177822 -33879 260924 499235
15184 499235 -74735 124514 -52190 148915 179289 -282324 244600 -167229 186637 95545
15174 95545 40221 231645 -135257 -49673 102345 70352 47849 254941 31998 266825 158849
15163 158849 94237 99214 -76963 137943 157511 -102308 277373 284008 240607 54398 -46804
15151 435166 166320 65083 101021 42758 -37708 16623 189786 13843 306784 23893 238436
15140 238436 109650 83433 -118138 51585 54555 -98204 80953 -258605 -4180 312565 -209978
15128 103583 270738 73038 129373 -154186 36944 -20048 496955 332929 293536 551398
15118 551398 599577 603861 189082 132079 207012 91492 -178158 269276 48987 126188 41434
15106a02191L5066C08116J33568F4047E114K54576I2772J30039p4120G0766R0534
15095A61300p6364L035K98198r3862A18943a16665A37416P8947J30316q4672n3372
15084B08635c0249l10194i6768C67368A22685J5512M30011A5793f657A50281J25180
15073B75461f7338A43496K87491J80605A27388a15125l4429B33252j04969o3586
15063F4697L96841A43509J92598a49767A75911J81945K09393k52389F3348P2351
15053A35699j6320M08312A05551q634L56862J8118m6374J16475p9676j16835j07796
15042B37691n4569K54535q1225K15504Q1332O5398B09812e0297D74660j96716
15032B77944K84442j12105L49966j02729j6337k92746N8632j1675J07665o5351
$$ plain form
15106 -102191 -67125 308116 441684 64047 5114 259690 92772 222811 148691 70766 161300
15095 161300 84936 87971 386169 292307 118943 -116665 137416 216363 346679 262007 208635
15084 208635 -30249 -340443 -96768 367368 122685 138197 568208 15793 -6657 150281 275461
15073 275461 -67338 143496 430987 611592 127388 -115125 -149554 233252 128283 64697
15063 64697 461538 143509 336107 -149767 175911 357856 567249 314860 63348 135699
15053 135699 119379 527691 105551 96917 453779 471897 425523 541998 462322 345487 237691
15042 237691 183122 437657 356432 571936 653268 718666 209812 -50297 474660 277944
15032 277944 562386 450281 800247 697518 681181 388435 447067 435392 543057 477706
15022D77706r0783L50516j69009J37344P8344r9687J6207l14963k5490j3053K10468
15011E57600M3796J16434l04232j05864L1311L46207C7457M61704r4630q6007
15001C18524J522J67714K4915m4751L56459k24379k20092M00205B34736M94087
14991G28823j81002M588B35801N00354m5596J3152n1323K46494m1399J20897j82785
14980G95595K78167l51352j20532J33047l3221B52265N36730j97561K15699q4561
14970G22572R1191o7653P8576f5932C83916j35488L46905j74897A62601J43086
14960C05687j50303I640J28117J83265O028j17987p3485J79557L3438A57275L46508
14949E03783j92445A32374K31076M66990k51892B12425N08144K0499J20915k50825
$$ plain form
15022 477706 386923 737439 568430 705774 784118 684431 700638 385675 360185 347132 557600
15011 557600 601396 717830 413598 307734 339045 685252 37457 499161 404531 318524
15001 318524 320046 487760 512675 467924 824383 600004 379912 780117 234736 728823
14991 728823 547821 552409 235801 736155 690559 703711 652388 898882 857483 978380 795595
14980 795595 1073762 722410 601878 734925 701704 252265 788995 591434 807133 722572
14970 722572 813763 746110 824686 -65932 383916 248428 595333 420436 162601 305687
14960 305687 155384 9640 137757 321022 327050 209063 135578 315135 348573 157275 503783
14949 503783 311338 132374 363450 830440 578548 212425 720569 741068 861983 611158
14939F11158m2449R7817C12058m6100K57983K42819o5874L43145j48205L8137
14929I33963K86724N71460o57646L88871M0280N91417l47126K4767K290L2545
14919A867545m76453O99695O71262P8966l91552o01674j98438l63861K03655l33860
14909A155285n38855j11835K10581C47008m2929L04711J1973J05164l15026R8631
14899E09532j32026L5491K12138j70676H5680L70869m526R573j73787J73812k27354
14888B34267M9148J13553L65963l540L5865J06631K47638j54432J50561k60549
14878H85105K1425J3428l60645J17782K04263j91641k26023B00978L90104p9758
14868E11324P7509k3919K08680J94206j27000l92436N81353C42544M77105k42682
$$ plain form
14939 611158 568709 666526 312058 265958 523941 766760 700886 1044031 895826 933963
14929 933963 1220687 1792147 1134501 1523372 1563652 2155069 1807943 1832710 1835000 1867545
14919 1867545 1391092 2090787 2762049 2841015 2449463 1847789 1649351 1285490 1489145 1155285
14909 1155285 616430 504595 715176 347008 304079 608790 620763 725927 410901 509532
14899 509532 377506 412997 625135 454459 85680 456549 452023 461596 287809 461621 234267
14888 234267 283415 396968 762931 759391 795256 901887 1149525 995093 1145654 885105
14878 885105 906530 919958 559313 677095 881358 689717 463694 200978 591082 511324
14868 511324 588833 564914 773594 967800 840800 448364 1029717 342544 819649 576967
14858E76967n7856A23272L08594m1706J9856j06824L21069J22309k82484L3045
14848D97131K41094p5536L14795o4732p6615N30462p3155l8698j13831l04274
14838H36641j38295m4288N85484l16449j91276j06528P1138k46567r82j9945j47105
14827B81828J31907L87807A61798M82721K90102l49398j34880N64053k62641j84107
14817E67648K64404J74145j73904j63465n6041j53159J77477l0484J12949J10711
14807H30281J77320J92701M6836j85488n4679k37458k00111N4810J77072k53271
14797E48013L52336k10547j19904K26810j59374j17233k45166M23218p5188j5569
14787F07396Q9853C00026K17479K38282n4091J28894r9343r0820M8213N60783
$$ plain form
14858 576967 519111 123272 431866 390160 410016 303192 624261 746570 464086 497131
14848 497131 738225 662689 977484 912752 836137 1366599 1293444 1254746 1140915 836641
14838 836641 698346 654058 1239542 923093 731817 625289 696427 449860 448878 428933 281828
14827 281828 413735 801542 161798 644519 934621 585223 450343 1014396 751755 567648
14817 567648 832052 1006197 832293 668828 612787 459628 637105 606621 719570 830281
14807 830281 1007601 1200302 1247138 1061650 1006971 769513 569402 624212 801284 548013
14797 548013 900349 689802 569898 796708 637334 520101 274935 698153 622965 607396
14787 607396 697249 300026 517505 755787 701696 830590 731247 640427 688640 1249423
14777A249423m22283M27287n1498k04574l1967m18393J83907j74056J00487P094
14767F65427L3282C30760O91908C66294M65408k72017L44402l71256J64828j89395
14757E08264P2705K33730j6024C42188N2162L66942K10243D42748K57109m8126
14747F51731J16828j11681j26918o2516Q10261n00305P9091L1709p0859l86018
14737D31323L79932O7928Q2947k56805M28419k0022L6648L57511J76352M32853
14727B117086J65715q9174m80401k92933l2493k85791P4217j35642K18595l81341
14717H77838M78797n27438j4242J06402N1390k99592M23239r3097K49709n04379
14707G48627L93960J67239l6152J00486K53562J71774N67899k01348l99458l45153
$$ plain form
14777 1249423 827140 1254427 1202929 998355 966388 547995 731902 557846 658333 665427
14767 665427 698709 330760 1022668 366294 831702 559685 904087 532831 697659 508264
14757 508264 580969 814699 798675 342188 394350 761292 971535 442748 699857 651731
14747 651731 768559 656878 529960 467444 1277705 777400 856491 888200 817341 431323
14737 431323 811255 879183 962130 705325 1133744 1113722 1150370 1507881 1684233 2117086
14727 2117086 2282801 2193627 1713226 1420293 1387800 1102009 1176226 1040584 1259179 877838
14717 877838 1356635 829197 814955 921357 972747 673155 1096394 1003297 1253006 748627
14707 748627 1142587 1309826 1273674 1374160 1627722 1799496 2367395 2166047 1766589 1421436
14697A421436k13093N0031l11498j26644L51970l4934j51838k7770j98552L22792
14687A081900q6264m77903L53218J71522n14042O90835l76710m4519Q3634Q6602
14677I68273m1381M371m3543J82370J53176m19662k2454L11009j46641K40763
14667A186281k16972N4969Q0110j3798J90942k40766J46356k83837L4000L90568
14657A327853k42800J06282K63974j5676K46547m69058k9042K5649J83571o1431
14647A335869P7930k6729m44016O07075l91787K62259l63961K30269n8226q622
14637A220061M6298J47334j84872m27480K65201L71063q6325K5062m98358N66674
14627A444658q5077K05803j47092j11466O9757p7177K29270L00628n06730J84067
$$ plain form
14697 1421436 1208343 1258374 946876 820232 1172202 1137268 985430 957660 759108 1081900
14687 1081900 995636 517733 870951 1042473 528431 1219266 842556 798037 881671 968273
14677 968273 926892 931263 887720 1070090 1223266 803604 781150 1092159 945518 1186281
14667 1186281 969309 1024278 1104388 1090590 1281532 1040766 1187122 903285 937285 1327853
14657 1327853 1085053 1191335 1455309 1439633 1686180 1217122 1188080 1213729 1397300 1335869
14647 1335869 1413799 1387070 943054 1550129 1158342 1420601 1056640 1286909 1228683 1220061
14637 1220061 1266359 1413693 1228821 801341 1066542 1437605 1351280 1376342 877984 1444658
14627 1444658 1359581 1565384 1418292 1306826 1376583 1299406 1528676 1829304 1322574 1506641
14617A506641q3967N8707j14064L37592j21107J66394m75989K38945j44238k4195
14607A344719L01647l69499L25819K3035n4958o4337P6984N0903K31848k51972
14597A614189P2690j46571k379K39568Q1678p0177l69480M13250j22396j0512
14587A699860K39888m2377k86468K22567J80529l29804M58504k11584j36142j14238
14577A680735L69457J24153j13006j0387k24445O27401m65514K15670K02753M8895
14567B455712o1224K3928j00662K31324R8398n6722J36455J73579k75322K2561
14557B648027K06686L60634K01169R9041K36790o766O69633Q42554J606921K760515
14547I625204O427187J7714680J9609571B4837740I375601D547213j604554k29278
$$ plain form
14617 1506641 1422674 1481381 1367317 1704909 1583802 1750196 1274207 1513152 1368914 1344719
14607 1344719 1646366 1276867 1602686 1625721 1570763 1506426 1583410 1634313 1866161 1614189
14597 1614189 1686879 1540308 1537929 1777497 1859175 1788998 1419518 1832768 1710372 1699860
14587 1699860 1939748 1897371 1610903 1833470 2013999 1684195 2142699 1931115 1794973 1680735
14577 1680735 2050192 2174345 2061339 2050952 1826507 2453908 1988394 2204064 2406817 2455712
14567 2455712 2394488 2418416 2317754 2549078 2647476 2590754 2727209 2900788 2625466 2648027
14557 2648027 2854713 3215347 3416516 3515557 3752347 3745581 4415214 5257768 6864689 9625204
14547 9625204 16052391 33767071 53376642 24837740 9375601 4547213 2942659 2713381
14539B713381l05096L19972J30582J834699R17590k536124p52645q1289L19409
14530B560479j61105m1697l02902M8628J94873L0844L13707l13159l1186M47292
14520B745774m35846O18370m55590R8456J67270k4492J71344j11668j06883K71597
14510B938332l55677K33889N00114n15271K22291R4005N4145k76078j53371N43343
14500C285722K22176n80352M38947j90959J27136q3314P5892K69487n51267L62095
14490C375563K45808l29953K33887R6233K64737k61509k85865L89376J11167p5413
14480C764031J66861j13295P5267K13758J17928j59709K30819m07576L91978J7378
14470D297440j30812J69373J45926L71688k64540j97817L02725J31245m6204M29349
$$ plain form
14539 2713381 2408285 2728257 2858839 4693538 5611128 3075004 2322359 2241070 2560479
14530 2560479 2399374 2357677 2054775 2103403 2298276 2329120 2642827 2329668 2298482 2745774
14520 2745774 2309928 2928298 2472708 2571164 2738434 2713942 2885286 2773618 2666735 2938332
14510 2938332 2582655 2816544 3316658 2801387 3023678 3117683 3171828 2895750 2742379 3285722
14500 3285722 3507898 2927546 3366493 3175534 3302670 3219356 3295248 3564735 3013468 3375563
14490 3375563 3621371 3291418 3525305 3621538 3886275 3624766 3338901 3728277 3839444 3764031
14480 3764031 3930892 3817597 3892864 4106622 4224550 4064841 4295660 3888084 4280062 4297440
14470 4297440 4166628 4336001 4481927 4853615 4589075 4391258 4693983 4825228 4779024 5208373
14460E208373n59800Q08651n20708J27060J98869k74903N08767M6608l88507M42688
14450E597098m58931N75861M8446j8524M1637o8979M47104n7843m9655j62134
14440E894080M28556M0344j27954K72280J9714J54497J66336K9151l1583k16117
14430F629304N12969M5825K20707J30264J99200J6621J1421J0322L02244K47510
14420H326387M43985k14856J90356L30318j83710R6462k59538L55913J07639L61862
14410I554818O8242k97080P18663j977P5041M42037k83565O59181k48330J00606
14400A0787636N5924J56905K2032K0186L03771L05215K93910R8984N02704L4349
14390A2581616K33694q9511L96218J72977M26515j48184P50631K01506O76562
$$ plain form
14460 5208373 4648573 5457224 4936516 5063576 5262445 4987542 5496309 5542917 5154410 5597098
14450 5597098 5138167 5714028 5762474 5743950 5785587 5716608 6163712 6105869 6056214 5894080
14440 5894080 6322636 6362980 6235026 6507306 6527020 6681517 6847853 6877004 6845421 6629304
14430 6629304 7142273 7188098 7408805 7539069 7738269 7754890 7766311 7776633 8078877 8326387
14420 8326387 8770372 8555516 8745872 9076190 8892480 8988942 8729404 9085317 9192956 9554818
14410 9554818 9623060 9325980 10044643 10042666 10117707 10559744 10276179 10935360 10687030 10787636
14400 10787636 10843560 11000465 11022497 11042683 11346454 11651669 11945579 12044563 12547267 12581616
14390 12581616 12815310 12725799 13122017 13294994 13721509 13573325 14323956 14525462 15202024
14381A5202024r895L92013k64709Q32302j83296O37872K67363Q3799M77206L48939
14371A7783618M79358K51636N27698M33597L55147N04257N27879M71952L83352
14362B1718494j66018L62364Q87340M29321L33356O19706P24368L04759Q20418
14353B6034108K41383Q72090M83697J147576M76380K09594Q91676J125066M68894
14344C1950464J119117O89396R19127R44249J028533R23274R92551J136220J033471
14335D0736402J277751J073607J372776J482847J260076J306628J658223J550016
14327E1718326J740643J767993J486733K176815J819557K287482J955209K225865
14319F7178623K240119K606227K710078K383290K727564L148697L260820L359516
$$ plain form
14381 15202024 15192129 15584142 15319433 16151735 15968439 16606311 16873674 16957473 17434679 17783618
14371 17783618 18262976 18514612 19042310 19475907 19831054 20335311 20863190 21335142 21718494
14362 21718494 21552476 21914840 22802180 23231501 23564857 24184563 24908931 25213690 26034108
14353 26034108 26275491 27147581 27631278 28778854 29255234 29464828 30356504 31481570 31950464
14344 31950464 33069581 33758977 34678104 35622353 36650886 37574160 38566711 39702931 40736402
14335 40736402 42014153 43087760 44460536 45943383 47203459 48510087 50168310 51718326
14327 51718326 53458969 55226962 56713695 58890510 60710067 62997549 64952758 67178623
14319 67178623 69418742 72024969 74735047 77118337 79845901 82994598 86255418 89614934
14311H9614934L636806L735166M096116L962455M618923M259298M971165N369098
14303A24263961N192385N844869O177956O445719O781778P475530P340067Q161240
14295A77683505Q574138Q894334R254141J0225436J0557734J0922152J1539767
14288B47651207J2269861J2311382J3205874J3625902J3943787J4394310J4235506
14281C41637829J4562159J4488759J4258180J4051332J3523292J2836565J1475817
14274D36833933R544280O529061L863305K973592K027755P9933k840965j613693
14266D57397201m421523q096884r769285j1225371j3171606j3725290j4653916
14259C82333326j5387766j5526689j5606561j5136419j4824028j4716027j4205393
$$ plain form
14311 89614934 93251740 96986906 101083022 105045477 109664400 113923698 118894863 124263961
14303 124263961 129456346 135301215 141479171 147924890 154706668 162182198 169522265 177683505
14295 177683505 186257643 195151977 204406118 214631554 225189288 236111440 247651207
14288 247651207 259921068 272232450 285438324 299064226 313008013 327402323 341637829
14281 341637829 356199988 370688747 384946927 398998259 412521551 425358116 436833933
14274 436833933 446378213 452907274 456770579 459744171 461771926 461851859 459010894 457397201
14266 457397201 452975678 444878794 435109509 423884138 410712532 396987242 382333326
14259 382333326 366945560 351418871 335812310 320675891 305851863 291135836 276930443
14252B76930443j3673167j2876992j2529167j1950343j1474098j0250004p840455
14245A96336217r928680q427983q572218q016108p742903p130060o540211o034468
14237A33943586n515322n639907n696082m725090m815124m677204l369573m150770
14229I5354514l613712l500511l573584l035659l219676k789361k843612k282295
14221G0496104k617428k409452j821577k416927j873561k053909k176697j490211
14213E3636342p74595j868112k043890j459886j313922j669841o21643p21050
14205D3163403j675943j487163j100697p91562q19160n44472j434502j032761
14197C4277143q56433q49454r67831p14763m91012r77759r16284l44253q22943
$$ plain form
14252 276930443 263257276 250380284 237851117 225900774 214426676 204176672 196336217
14245 196336217 186407537 177979554 169407336 161391228 153648325 146518265 139978054 133943586
14237 133943586 128428264 122788357 117092275 112367185 107552061 102874857 99505284 95354514
14229 95354514 91740802 88240291 84666707 81631048 78411372 75622011 72778399 70496104
14221 70496104 67878676 65469224 63647647 61230720 59357159 57303250 55126553 53636342
14213 53636342 52861747 50993635 48949745 47489859 46175937 44506096 43884453 43163403
14205 43163403 41487460 40000297 38899600 38108038 37288878 36744406 35309904 34277143
14197 34277143 33420710 32571256 31603425 30888662 30397650 29419891 28503607 28159354 27336411
14188B7336411m65887r14135k20728o85458q36665l08431o43824o26861p1048
14179B2563374p92269k67930n29551l00717o17165l16423l29897l89115k86558
14170A8733749p29955K20502l80501k95819o57393j39216l79352o5694p75704
14161A5530617p5156j99832n84937J89654l48966k35293m56961J02494l10471
14152A3611149m08577j58512n07557P8546j75132j3098k31148l60057j91723k74918
14142A1368973J0685k53923k27009r7587L1264o25052K2626j93759N00292q95810
14132I640700K84311j54625k88027m8277m69942M42283k93447l40146J63291l97123
14122H538998m9618l71705J35743K64032n13411l7147O1058J11673l63205l37489
$$ plain form
14188 27336411 26870524 25956389 25735661 25050203 24213538 23905107 23261283 22634422 22563374
14179 22563374 21771105 21503175 20973624 20672907 20055742 19739319 19409422 19020307 18733749
14170 18733749 18003794 18224296 17843795 17547976 16890583 16751367 16372015 16306321 15530617
14161 15530617 15455461 15255629 14670692 14860346 14511380 14276087 13819126 13921620 13611149
14152 13611149 13202572 13044060 12536503 12615049 12439917 12426819 12195671 11835614 11643891 11368973
14142 11368973 11379658 11125735 10898726 10801139 10832403 10207351 10229977 10036218 10536510 9640700
14132 9640700 9925011 9770386 9482359 9434082 8964140 9406423 9112976 8772830 8936121 8538998
14122 8538998 8489380 8117675 8253418 8517450 8004039 7966892 8027950 8139623 7776418 7438929
14112G438929J67481o3809j22967l76609J48725M041J9102l75954R0345l37937
14102F591347l3068k50211K70293l06427k3685o4059m6781J72708m76717L0120
14092E863520j98177O8199M1896j50062l02911n3122J97939K01923m43352J20167
14082E346020r9481j51810K82965j50198k45990J5406m2455L1612J83569M5892
14072E215530n36485j1249l3731j38885K4494l69700L38976J72604n18279J16791
14062D260066O0770J29618J61665j19394j63930k56157J15482j73907L6300L57265
14052D407778m09674J6108l22292M16799p4933l39897J40634j34628R1912l8063
14042C753744R3252n01496O04423m63356N086j24207O0392r5708k12938J11745
$$ plain form
14112 7438929 7606410 7542601 7419634 7043025 7191750 7195791 7214893 6838939 6929284 6591347
14102 6591347 6558279 6308068 6578361 6271934 6248249 6184190 6137409 6310117 5833400 5863520
14092 5863520 5665343 5733542 5775438 5625376 5322465 5269343 5467282 5669205 5225853 5346020
14082 5346020 5246539 5094729 5377694 5227496 4981506 4996912 4954457 4986069 5169638 5215530
14072 5215530 4679045 4667796 4634065 4495180 4519674 4149974 4488950 4661554 4143275 4260066
14062 4260066 4320836 4450454 4612119 4492725 4328795 4072638 4188120 4014213 4050513 4407778
14052 4407778 3998104 4014212 3691920 4108719 4033786 3693889 3834523 3699895 3791807 3753744
14042 3753744 3846996 3345500 3949923 3486567 3491653 3367446 3427838 3332130 3119192 3230937
14032C230937O52631n04529j32032J44170j56412l8321j60324M4298P307j34990
14022B952735K41332j0926l14868l15571M20316m17041J56086j4210o3502L43309
14012B977660p82606N15094K09776l63786k46665L41398k25280k60536K17942
14003B382997l4738j8542L11056l60742K39642m10104J99858K7658k8138j44949
13993B163998L10361p0899R6360L87060K75100J625994M534882J3719173L0745145
13984E3787174j9963116A6501924p687158k690679r82541q94131m12733j75327
13976C659355m42971k443k71408k10003P71l82960K33521k3668k42154L8804J318
13965B358162L29997l99277J74321j09605j50035K46339m74504n348j3075K80678
$$ plain form
14032 3230937 3883568 3379039 3247007 3391177 3234765 3196444 3036120 3080418 3087725 2952735
14022 2952735 3194067 3183141 2868273 2552702 2973018 2555977 2712063 2697853 2634351 2977660
14012 2977660 2195054 2710148 2919924 2556138 2309473 2650871 2425591 2165055 2382997
14003 2382997 2348259 2329717 2640773 2280031 2519673 2109569 2309427 2337085 2308947 2163998
13993 2163998 2474359 2403460 2499820 2886880 3161980 4787974 9322856 23042029 53787174
13984 53787174 33824058 16501924 8814766 6124087 5141546 4247415 3834682 3659355
13976 3659355 3216384 3213941 2942533 2732530 2733301 2350341 2583862 2560194 2318040 2356844 2358162
13965 2358162 2688159 2288882 2463203 2353598 2203563 2449902 1975398 1970050 1956975 2237653
13955B237653k349J69984k36919q9027J12853j94568k98726J51515L09028m3392
13945B116052k05904M6146J15947N5821m18957M5471L7412L20497Q4472q3300
13935B113657l11279j48782M1188K08784l21793K63761k01849K6581K01841j06383
13925A765726j29059K34655m26240m0158J41262l5699J13833j07323J74965k11267
13915A480695K24907k20587p88M4874j14934J10292k78032L7636L48968k49014
13905A384017J5593M22240l23462J45307k09806q8794M03466l34068P388R2923
13895A514804k21969K5924j27708Q753L62665k36917O8052J76045k76179j27450
13885A166020N1574N62875l61282k48768J67495j22543n2694K35505o910j8706
$$ plain form
13955 2237653 2235304 2405288 2168369 2079342 2192195 1997627 1698901 1850416 2159444 2116052
13945 2116052 1910148 1956294 2072241 2128062 1709105 1754576 1791988 2112485 2196957 2113657
13935 2113657 1802378 1653596 1694784 1903568 1581775 1845536 1643687 1670268 1872109 1765726
13925 1765726 1636667 1871322 1445082 1404924 1546186 1510487 1624320 1516997 1691962 1480695
13915 1480695 1705602 1485015 1484227 1529101 1414167 1524459 1246427 1284063 1633031 1384017
13905 1384017 1399610 1821850 1498388 1643695 1433889 1345095 1748561 1414493 1421881 1514804
13895 1514804 1292835 1318759 1191051 1199804 1562469 1325552 1393604 1569649 1293470 1166020
13885 1166020 1217594 1780469 1419187 1170419 1337914 1215371 1162677 1398182 1391272 1372566
13875A372566j05433k04553K26162J98170J3957k76139j37829K3427N4988l2778
13865A132538p2136J9853L55268k52382L273o5529J13481k69560m5249L40710
13855A260267J666Q9660k0224j04302K7711K15350n64234P0258O6898K4317n9641
13844A007726j7788J09900k9929l56205J59907K51304j58424J32893o1023J08585
13834A146946k43816L20908k97803j2408O6940J95567n8196l28203L68908k49351
13824I09492J97761l58457n2163M22909j44241l79188M52147l59030L85818j7059
13814A057989k11778K43624l97587J15556L58095k95411j81211J44291J42415
13805I75983r4663j00526J11483j61896J00705j55023K96267j61308O4165k34118
$$ plain form
13875 1372566 1267133 1062580 1288742 1486912 1500869 1224730 1086901 1110328 1165316 1132538
13865 1132538 1060402 1080255 1435523 1183141 1186414 1120885 1234366 964806 919557 1260267
13855 1260267 1261933 1351593 1331369 1227067 1254778 1470128 905894 976152 1043050 1067367 1007726
13844 1007726 989938 1099838 1069909 713704 873611 1124915 966491 1099384 1038361 1146946
13834 1146946 903130 1224038 926235 913827 980767 1176334 1118138 789935 1158843 909492
13824 909492 1107253 748796 696633 1119542 975301 596113 1048260 689230 1075048 1057989
13814 1057989 846211 1089835 692248 807804 1165899 870488 689277 833568 975983
13805 975983 881320 780794 892277 730381 831086 676063 972330 811022 875187 641069
13795F41069J95513J30161k61978J93232l28577K05334j16122O970L19663q8861
13785H96404k92489M58490j96492r4703j04370p6131L85621l30966k5280K27091
13775H47175J2849j47768n4790O187J41001J41775J45111k43437Q246n7066l22469
13764D76814K68586j20024k4767L01053m05769M79315l61061J54309O5784J85556
13754A019796l60232J50453j13995J0255j57397N3950K23672m5676B90348K03307
13744D93655J37539Q4287J25165j40335k57103K93893J54863j0826k63845K24829
13734H42122D08905J62760M63051C60024J71263k44231L73560j22315j50368J92644
13724E80577L8214O7070p8937m01k30588J61294K60406B59270J80442K84932o8547
$$ plain form
13795 641069 836582 966743 704765 897997 569420 774754 658632 665602 985265 896404
13785 896404 603915 1062405 865913 771210 666840 590709 976330 645364 620084 847175
13775 847175 860024 712256 657466 663653 804654 946429 1091540 848103 856349 799283 476814
13764 476814 745400 625376 600609 901662 495893 975208 614147 768456 834240 1019796
13754 1019796 659564 810017 696022 706277 548880 602830 826502 780826 290348 493655
13744 493655 631194 715481 840646 700311 443208 737101 891964 881138 617293 842122
13734 842122 408905 571665 1034716 360024 531287 287056 660616 538301 387933 580577
13724 580577 618791 685861 606924 606523 375935 537229 797635 259270 439712 724644 656097
13713F56097N4304K4687m3710k33430l0535Q9154J6J10123M7241q3879n8058K2019
13701E54029j03064j31678M56834k39636p5336q3326L45241r4426k65635J35166
13691D98169p0292L8266A28373K30177J92776l9539k26726K84871k57481J30425
13681D42876K82168k74425O6884J86941j27719J731l4459L05822k15425B14804
13670H34281j10134j15075k89772L06467j90122m2417J91162q6721j60962M75172
13660H11879C04551J89432k25875Q7224J86778j33273A90085N70439k84058m48
13650D76018K36148C13891L32579k03432L4358P2346J46491l10078j34219L10142
13640E62078q1783K02355j89706r1166j64423J35849q2354m6516J46662j25855
$$ plain form
13713 656097 710401 735088 691378 457948 427413 516567 516583 626706 673947 590068 532010 554029
13701 554029 450965 319287 776121 536485 461149 377823 723064 628638 363003 498169
13691 498169 427877 466143 128373 358550 551326 511787 285061 569932 312451 442876
13681 442876 725044 450619 517503 704444 576725 578456 543997 849819 634394 214804
13670 834281 724147 609072 319300 625767 435645 393228 584390 497669 336707 811879
13660 811879 304551 493983 268108 355332 542110 408837 190085 760524 476466 476018
13650 476018 712166 313891 646470 443038 477396 549742 696233 386155 251936 562078
13640 562078 480295 682650 492944 401778 237355 373204 290850 244334 390996 265141
13630B65141K40296K07190j69751k11280K97516k49749Q3120k02854J12615o4094
13620C08150R1252K11249k82540L31674k84182J33659n4967J17688l5060L9548
13610E76471N0949B30063K29947j73999l5271J20217M4729k4650j45010H6486
13599F03803j71977J5798k12482M4682J30378j16325p9268L65776B67750Q1174
13589C48924q6601f2680C53781A01643J83922L5108o0894P2234J31038j40245
13579C22806F6335M99185j39829K54873j53784A49287K51732J44978k6454j33472
13569C86071R3113M8684j80569k0775K80101B51263e9336A47334K14427j58105
13559B03656K64011A92665m3878K54160B00143J01144P0354L5348r9641M4906
$$ plain form
13630 265141 505437 712627 542876 331596 629112 379363 462483 259629 372244 308150
13620 308150 399402 610651 328111 659785 375603 509262 454295 571983 536923 576471
13610 576471 627420 230063 460010 286011 250740 370957 415686 391036 246026 86486
13599 603803 431826 447624 235142 279824 410202 293877 214609 580385 267750 348924
13589 348924 262323 -62680 353781 101643 285565 320673 259779 332013 463051 322806
13579 322806 66335 565520 425691 680564 526780 149287 401019 545997 519543 386071
13569 386071 479184 527868 347299 326524 606625 251263 -59336 147334 361761 203656
13559 203656 467667 192665 148787 402947 200143 301287 371641 406989 307348 352254
13549C52254M6342j57486Q5714D7277K64932K1994L7710J22862j42744M7019j36483
13538B62567J36277j65009N1058c9378B49491k0657K19426G4929L11930P6287
13528D63146A34447J25042K2871e6325B66537J90677J46215B87234J46300C1355
13517I6957J25538J43221H2784M21654A94791M025K21821A33507K81377r7345
13507C17539J7939I7031J5172K18629B4788P6430J18376q585a15299B93841i1855
13495B36172h6475A33691M91982j09130D0784L01071j32795m635M65111a07771
13484C20513n4921K73096B62183K02516A54021R7457J7958k8758K24349L0334
13474D95361k28823g175A42268K0131a83066D76173k22660M0263A24251K57390
$$ plain form
13549 352254 398596 241110 326824 47277 312209 334203 371913 494775 352031 399050 262567
13538 262567 398844 233835 284893 -39378 249491 228834 448260 74929 386859 463146
13528 463146 134447 259489 282360 -56325 266537 457214 603429 287234 433534 31355
13517 96957 222495 365716 82784 504438 194791 198816 420637 133507 414884 317539
13507 317539 335478 97031 112203 330832 24788 101218 219594 211009 -115299 293841 -91855
13495 236172 -86475 133691 625673 516543 40784 341855 209060 204425 669536 -107771
13484 320513 265592 538688 262183 464699 154021 251478 269436 240678 465027 495361
13474 495361 266538 -7175 142268 162399 -183066 476173 253513 293776 124251 381641
13464C81641r5165I3895J1822J35999G529M99650I7794L7225i5283d3616B69374
13452B11670J14184J83902o5850b6129A98222M86457C38854J50166A41126J56458
13442B97584j44684l1884K36159A55123k4427R9388J41497A58603L17810A75419
13431A60431J51402O006j24279i1565A329d5113E6079K7133A3211f187D12275
13419I3565J94130M77667B98620K00666e8291E9492M0774J33996A06618J9915
13409A26533n0522K65153l6970D9344J41657M44161B42838k2716l5789P5084l0815
13398B28602p4755n510K86807A29371J08698K86897B47676P2220j383j12752F7954
13386B83339b904D52891A68444E6097N9841A4857O9878F029J30692J5597K92583
$$ plain form
13464 381641 286476 93895 105717 241716 7529 507179 97794 135019 -95283 -43616 269374
13452 211670 325854 509756 443906 -26129 198222 684679 338854 489020 141126 297584
13442 297584 152900 121016 357175 155123 130696 230084 371581 158603 476413 175419
13431 160431 311833 317839 193560 -91565 1329 -45113 56079 83212 13211 -6187 412275
13419 93565 287695 765362 298620 499286 -58291 59492 100266 234262 106618 126533
13409 126533 76011 341164 304194 49344 191001 635162 242838 220122 184333 259417 228602
13398 228602 153847 148337 435144 129371 238069 524966 247676 319896 318513 205761 67954
13386 283339 -2904 452891 168444 56097 115938 14857 84735 6029 136721 152318 444901
13375D44901g5858D4549P2929C1317M7373J5900M8731Q3250b38704B67268R6169
13364C63437p8491r1092M800P1429J05414g2119G9446K40150J63758A11950J0456
13353A22406K96035i3568C28464M7196a51187B45852p2668Q272A238Q3550O64271
13342G49059C39008J92184a29334D0503N24339k77913I2730d6282B4220N61943
13332E86163B18274J76107C2096L49876A75652K18486j8336j83205k2221J46964
13322C17340K9572e2464A95091r793K3806A0591a95559j0089A31024J72989K12181
13311E16194a03900j81851D74972O36j19774j52737N3422A02265K65674k3957
13301C43982A16254a36029I0002b9030j25160A94154N4927D1406J27140K0284
$$ plain form
13375 444901 -75858 44549 117478 31317 78690 94590 143321 226571 -238704 267268 363437
13364 363437 284946 193854 198654 270083 375497 -72119 79446 319596 483354 111950 122406
13353 122406 418441 -93568 328464 375660 -151187 245852 173184 181456 1238 84788 749059
13342 749059 339008 531192 -129334 40503 564842 286929 92730 -46282 24220 586163
13332 586163 218274 394381 32096 381972 175652 394138 375802 192597 170376 317340
13322 317340 346912 -52464 195091 185298 209104 10591 -195559 -205648 131024 304013 516194
13311 516194 -103900 -285751 474972 475608 355834 203097 256519 102265 367939 343982
13301 343982 116254 -136029 90002 -29030 -154190 194154 249081 41406 168546 188830
13291A88830p9612E1863K57383l2681A9649b63586A70354g713A8015f4923A43583
13279B33230H3496L99688a48405D24864j84775a10865B75389M2721j50596K23208
13269C90722A54356J11318B6479K82305j05576K12817j56940m9565p5508l8794
13259I5218Q7672M9461N1486j20574a8714k611I5897k5406N9108k825K51332a8605
13246B70038q3327L31167b2979B31948d7404m5898B11951a3767B92828b5108B14630
13234A76877m1150m4882J07884C3059J7133a60279r847P2846B21894M3655p9568
13223A85981N5184j13761O3286H7842K0389J5622e596j94025D27716B02515F9191
13211F8998i9044d4150F1719A6070K43465b6462a1883k502B71356d3457j18642
$$ plain form
13291 188830 109218 51863 309246 276565 19649 -263586 170354 -7713 18015 -64923 143583
13279 233230 83496 483184 -148405 424864 240089 -110865 275389 318110 167514 390722
13269 390722 154356 265674 26479 308784 203208 416025 259085 209520 134012 95218
13259 95218 182890 232351 283837 163263 -18714 -21325 95897 70491 129599 126774 378106 -18605
13246 270038 186711 517878 -22979 231948 -47404 -93302 211951 -13767 292828 -25108 214630
13234 176877 135727 90845 198729 33059 50192 -160279 -170126 -97280 221894 265549 185981
13223 185981 241165 127404 190690 87842 108231 123853 -5596 -199621 427716 202515 69191
13211 68998 -99044 -44150 61719 16070 259535 -26462 -11883 -14385 271356 -43457 -162099
13200a62099A44947E7944a5795j70507I014J7079K37061A9412L02644c7255H0636
13188G5150P768b42764H5909J31920A7734K07041j8349a05552C27672a47032A55770
13176A01170l0639b6785C41692G7933a17315A99797h9943L4144B33359a2104D55469
13164A18298M0786g9064B04151d2795i418k45725i6148G8994l8312h4979A20667
13152b1725A57993D216J76170f0148C25009r4549K18098C2446L76945A56766P2712
13141B29478K36516B22185a51320c4131B81039f8394J5307g987I7543a04399b9268
13129D34154A12395K71989e2950A29325m9908A7496c9111a197B49198a30459A60346
13117A69804h2589C16200e0051l2516B55938K2715b06618C23525m227c22161f4194
$$ plain form
13200 -162099 144947 57944 -15795 -186302 9014 26093 263154 19412 322056 -37255 80636
13188 75150 82918 -242764 85909 217829 17734 224775 206426 -105552 327672 -147032 155770
13176 101170 70531 -26785 341692 77933 -117315 199797 -89943 -55799 233359 -12104 455469
13164 118298 159084 -79064 204151 -42795 -9418 -255143 -96148 78994 40682 -84979 120667
13152 -21725 157993 4216 180386 -60148 325009 230460 448558 32446 409391 156766 229478
13141 229478 465994 222185 -151320 -34131 281039 -68394 -53087 -7987 97543 -104399 -29268
13129 434154 112395 384384 -52950 129325 79417 17496 -39111 -1197 249198 -130459 160346
13117 169804 -82589 316200 -50051 -82567 255938 278653 -206618 323525 319298 -322161 -64194
13105a13260A11180J79813D6292R259j9553K55004d09A04881J57801j14231m5603
13094A02848J58469H9575L54112D2219J50407c83114A92351I2941J13603K1373
13084B27917B7725P1272C0494J88347b2114n3910k34471a50659J6277d4145A3428
13072c725m9115A60070b9433A19484C9825c8997r0186j50865e2998B00076B5359
13060H6667J42056m8195D0448J48319m5867O9323b2221q7202j0600d494m8788
13049e3282A47306J57966e5762I3354b2867E0111b7374C3216O0590J73703e226
13037A39284j8814A2463K34725G9925j5197J32763F2047N2491O6203L15295o9509
13026D26527B2018f3879B19380I339J61672a93141C05977F1014a14222A64319
$$ plain form
13105 -113260 111180 290993 46292 55551 35998 291002 -409 104881 262682 148451 102848
13094 102848 261317 89575 443687 42219 192626 -383114 192351 92941 206544 227917
13084 227917 27725 98997 30494 218841 -22114 -76024 -310495 -150659 -134382 -44145 13428
13072 -3725 -52840 160070 -29433 119484 39825 -38997 -129183 -280048 -52998 200076 25359
13060 86667 228723 180528 40448 188767 142900 212223 -22221 -109423 -120023 -4494 -53282
13049 -53282 147306 305272 -55762 93354 -22867 50111 -27374 33216 93806 267509 -5226
13037 139284 120470 12463 247188 79925 64728 197491 62047 114538 180741 496036 426527
13026 426527 22018 -63879 219380 9339 171011 -193141 305977 61014 -114222 164319
13015a47249A57014a20816A1979P1668a67426J6170C0843P6613N1568a44483B55739
13003C7311i3889K7628A56184d9808j81297H0595J59631q1759b4210k40356J24452
12992a40114j98334E8666J18490o9845K65797a38396A48911h1008j23739B20908
12981a18887A62560l8743J94763f7699L2826C83872d9204k8539A02352K52554
12971C54906A22722b0985j66443A26537L2659a40379C2455c6111D9603K21500
12961B71103p4683G016d79566I2275K93114h6771I4409b30603D8877J95307b00425
12949E6449J8687a19872F0130a53156j52433f8782b9736C21012A6439a4374C03756
12937a27882m21854D23218a19081c2635A23253h3777A99391L85066A46366F8162
$$ plain form
13015 -147249 157014 -120816 11979 83647 -167426 -151256 30843 107456 159024 -144483 255739
13003 37311 -93889 -66261 156184 -49808 -231105 80595 240226 158467 -24210 -264566 -140114
12992 -140114 -338448 58666 177156 107311 373108 -138396 148911 -81008 -204747 220908
12981 -118887 162560 123817 318580 -67699 -34873 383872 -49204 -77743 102352 354906
12971 354906 122722 -20985 -187428 126537 159196 -140379 32455 -36111 49603 271103
12961 271103 196420 7016 -479566 92275 385389 -86771 94409 -230603 48877 244184 -200425
12949 56449 75136 -119872 60130 -153156 -305589 -68782 -29736 321012 16439 -14374 303756
12937 -127882 -549736 423218 -119081 -32635 123253 -83777 199391 584457 146366 68162
12926b43405B53271j19106K4141i2470A15420k4929K929R8263a35206B17005H9059
12914i1809j4666I9214M0784b60111N1509C7723a857q9677m5123k8232A50777
12902A94917F2802J27153R0392b35014I7373K619K02418j44232O0902H055L39360
12891C47415j08544J80910I698L90916b54762A36506O6019a60016f7631G7029
12880a31092d4478D0436O1636g5765A3080a14004B15401b7118j45484b3173p0404
12869i3577j71721C931P5218J79709g5925K0489B10770d4828o1788B0135E489
12857a87114A27321J96769H2664b11294C1089K40773l7746G1078b66190m3331
12847c09521a30737A13072n2339L02793A80069F1291a3115k35290A19495c24160
$$ plain form
12926 -243405 253271 134165 158306 -92470 115420 90491 93420 191683 -135206 217005 89059
12914 -91809 -106475 99214 139998 -260111 -208602 37723 -1857 -91534 -136657 -164889 150777
12902 194917 62802 189955 280347 -235014 97373 99992 302410 158178 219080 8055 347415
12891 347415 238871 419781 9698 400614 -254762 136506 202525 -160016 -67631 77029
12880 -131092 -44478 40436 102072 -75765 13080 -114004 215401 -27118 -172602 -23173 -93577
12869 -93577 -265298 3931 79149 258858 -75925 -55436 210770 -44828 -106616 20135 5489
12857 -187114 127321 324090 82664 -211294 31089 271862 234116 71078 -266190 -309521
12847 -309521 -130737 113072 60733 363526 180069 61291 -13115 -248405 119495 -324160
12836F853O6264i2433j00893A47544m9098D6713Q1380b21826A42497a68773B5452
12824D04272B0381a09861A03150R0239K41258i4136B00913p3035a54567j75644
12814c30211A80541o5335b59240C07967B0398a9340I1235K22382A0983L15458
12804C26441A36493L5367p4525A9550h3322A21153a10757I2191K12220a55240
12793B8861P0687J8930g726A15603l04m1614l464b4759j19965B65311h68E0986
12780A57152J55457d5411O684j37788D9917a7337B20746I7861K4591b1321j4535
12769c5856k07851a19594o7598n0287M7336C45427D1865h1967R640A08602B1772
12757c4434r3134l0942d5625b2766A28984a7684p8313d3330B75491L5941c66775
$$ plain form
12836 6853 73117 -92433 -193326 147544 98446 46713 128093 -221826 142497 -168773 25452
12824 404272 20381 -109861 103150 193389 434647 -94136 200913 127878 -154567 -330211
12814 -330211 180541 115206 -259240 307967 20398 -19340 91235 313617 10983 326441
12804 326441 136493 171860 97335 19550 -83322 121153 -110757 92191 304411 -155240
12793 28861 99548 118478 -7726 115603 115299 73685 70221 -24759 -144724 265311 -868 50986
12780 157152 312609 -45411 -38727 -176515 49917 -17337 220746 97861 122452 -21321 -35856
12769 -35856 -243707 -119594 -187192 -237479 -190143 345427 41865 -81967 -72327 108602 21772
12757 -34434 -127568 -158510 -45625 -22766 128984 -17684 -95997 -43330 275491 311432 -366775
12745b29077e3084B61910c16975i9529d7321j76898e5008A0875L5573a6072j72897
12734a88969A43822c4481j62106O5448D7069j9728a68685A04776K3862l3082d6175
12722a29360B64296E8352O056l0207b21433B22623E9716g4258j93290f9299A31130
12710B81535n3732a71922I8595J17282j0298r0795L67301B5260h8394A90272d776
12698a131I4210d3995l3231C95899p1187a95840B51496a38300A93252d19102a35481
12686b19674a304n3215p8408b992m9452I6989R1194B149d6359A4928L66644B9015
12673f7607G358M4568j7945i6638B43268B2842a15509H8766a76370G4411M9204
12662A23615O3296p4242d367k4723B83131E1561b6990q2039B82449a14689A09908
$$ plain form
12745 -229077 -53084 261910 -316975 -99529 -47321 -224219 -55008 10875 46448 -16072 -188969
12734 -188969 143822 -34481 -196587 -131139 47069 27341 -168685 104776 128638 95556 -46175
12722 -129360 264296 58352 64408 34201 -221433 222623 59716 -74258 -267548 -69299 131130
12710 281535 227803 -171922 98595 215877 205579 114784 482085 25260 -88394 190272 -4776
12698 -1131 94210 -43995 -77226 395899 324712 -195840 251496 -138300 193252 -419102 -135481
12686 -219674 -1304 -54519 -132927 -2992 -52444 96989 188183 2149 -46359 14928 381572 29015
12673 -67607 7358 51926 33981 -96638 243268 22842 -115509 88766 -176370 74411 123615
12662 123615 186911 112669 -4367 -29090 283131 51561 -26990 -109029 282449 -114689 109908
12650B59661A16990a57219C90910D0422J42768G8517J84492a16213c3793D9963
12639a4687A89794A4879M478P6817E853c90382B4262a98297g6394K5089B41573
12627B10279M2512R0325b6065C81987b25724B05915E5941K73310e980A18974O7879
12616A86853L4923n006n3902m240a50664e1513B0806c78464a75133j0015C26067
12604C9692Q324a49315C18876O938j25379P6386p5282J03221D8444b1425E0648
12592B47657A1786J17985f612q7360K0590C85789A0139N6913a14878B76735L6327
12581C13062I6842N8088b64706D1877d5419F6662a27980l459e4226k8093A92028
12569A15003c3097C3398i4661C1300b76109D4201G974i2441j855m7608A85085
$$ plain form
12650 259661 116990 -157219 390910 40422 183190 78517 263009 -116213 -33793 49963
12639 -14687 189794 14879 19357 96174 5853 -390382 24262 -198297 -76394 -51305 241573
12627 210279 252791 343116 -26065 381987 -225724 205915 55941 329251 -5980 118974 186853
12616 186853 221776 216770 162868 158628 -150664 -51513 20806 -378464 -175133 -185148 326067
12604 39692 48016 -149315 318876 325814 200435 276821 201539 304760 48444 -21425 50648
12592 247657 11786 129771 -6612 -93972 -73382 385789 10139 67052 -114878 276735 313062
12581 313062 96842 154930 -264706 41877 -45419 66662 -127980 -131439 -54226 -82319 192028
12569 115003 -33097 33398 -94661 31300 -276109 44201 7974 -92441 -94296 -141904 185085
12557b00706D02960A77186N5779a01316l2201B35763Q7907j36859J0053F6989
12546c01352g7907j33490A9750a4650C14361B8363a30123O4334C2529a16715j12888
12535b29603K1797o3230a06839I4658b8804o0912k41952b2928l57718F6891b9134
12523a0087A05907J4790a04588H850a30103j16453m1252A55874p6427L08238c71191
12511A71852b69165b5634l60873B01705a43797M1998F4014a406F585d2413E6623
12499B91986f7915J2313A54031j0930N1702m38f7105a3755D6019j0710K07156
12488B42465B0158K22363l7225G8828e4076A90217a03121B16464K04883b5612
12477g9002o0552a5284n5731D0036J1223K38028a999r6330A45685b04683e0886
$$ plain form
12557 -200706 402960 177186 232965 -101316 -133517 235763 323670 186811 196864 66989
12546 -301352 -77907 -211397 19750 -14650 314361 28363 -130123 -65789 32529 -116715 -229603
12535 -229603 -207806 -271036 -106839 94658 -28804 -89716 -331668 -22928 -380646 66891 -29134
12523 -10087 105907 120697 -104588 8850 -130103 -246556 -287808 155874 79447 387685 -371191
12511 171852 -269165 -25634 -386507 201705 -143797 -101799 64014 -1406 6585 -42413 56623
12499 291986 -67915 -55602 154031 143101 194803 194365 -67105 -13755 46019 35309 242465
12488 242465 20158 242521 205296 78828 -54076 190217 -103121 216464 421347 -25612
12477 -79002 -139554 -15284 -71015 40036 51259 289287 -1999 -98329 145685 -204683 -50886
12465A655M5020L0748b33188B908a39182I5224a66557g7308q7788A35726d6859
12453B9957K86866I232a67184A20814a9959k78753a8727A46246i8963l1968A16756
12441g8786p0605r1201M1646D4447a35443d8013J1506E5017k2187d7060r9052
12430a46112l4439B47037b4526B41382a03135j68959Q2816C68785a10282a7533
12419a59144H417J30421a26402J7036E2966a11667B8784a16527I1606b04483R7126
12408a07357A2409Q2338e9654C2815b01103B4555O2669Q396d1151j56598A31050
12396a47713A13906l0459R9474n4135K07713r0135k9339r7972a30096N3023b9312
12384b3125C29080c9518C23076c0036C2907g9312E9899J56354c8604A55700E5995
$$ plain form
12465 1655 46675 77423 -233188 2908 -139182 95224 -166557 -77308 -165096 135726 -46859
12453 29957 316823 9232 -167184 120814 -19959 -298712 -18727 146246 -98963 -130931 116756
12441 -78786 -149391 -240592 -198946 44447 -135443 -48013 -36507 55017 32830 -47060 -146112
12430 -146112 -180551 247037 -24526 241382 -103135 -272094 -189278 368785 -110282 -17533
12419 -159144 8417 138838 -126402 -109366 52966 -111667 28784 -116527 91606 -204483 -107357
12408 -107357 12409 94747 -59654 32815 -201103 24555 87224 95620 -41151 -197749 131050
12396 -147713 113906 83447 182921 128786 336499 246364 217025 119053 -130096 -77073 -29312
12384 -23125 329080 -39518 323076 -30036 32907 -79312 59899 216253 -38604 155700 55995
12372A46949m8650b60966d7215C3870J32231q0595Q0973F2340K82036r3589e552
12360g3606C26728d22567A2731a28752N0755k0403E4128K51997A48681C2214g5109
12348I0208D981d5024n14A97644g0063j69163F6536f9723p1290M0252k4325B27668
12335I4168R535L8488L9775l2423f9897C12504j03706I0708c9802C11540A45473
12323B32504f664B16645a51983B49417L4837I0147J71857j27241K21850A06110
12312D28131n9558c2109A41777L743N5110D9421a93985j6789B05198B1122M0231
12301F1353J19415i8514A60614b13969G4438a22560I9453g9778G4847K15988F1635
12289a27051c3793A65831L8864h1760k3366r7673A0340K95415C1585P6098c4346
$$ plain form
12372 146949 98299 -260966 -47215 33870 166101 85506 166479 62340 344376 250787 -5552
12360 -73606 326728 -422567 12731 -128752 -77997 -98400 54128 306125 148681 32214 -75109
12348 90208 4981 -45024 -45538 197644 -70063 -239226 66536 -69723 -141013 -100761 -125086 227668
12335 94168 103703 142191 181966 149543 -69897 312504 208798 90708 -39802 311540 145473
12323 232504 -6664 216645 -151983 249417 284254 90147 262004 134763 356613 106110
12312 428131 368573 -32109 141777 145520 200630 49421 -193985 -210774 205198 21122 61353
12301 61353 180768 -98514 160614 -213969 74438 -122560 99453 -79778 74847 290835 61635
12289 -127051 -33793 165831 204695 -81760 -105126 -202799 10340 305755 31585 107683 -34346
12277a66833F5282J64974o8412m9989l2628J25239p3845k3355n1148K71255A30569
12265G3091Q1066m198K3724F7785K41494D714J52318d9023A55361D1211J90613
12254B31824O2544A35680L8133d791D48720H3223b64714D80593k10046q8706J98718
12243C80559D4815J06230o1743K715L52625j40492I7761J7605b1857B10783M4876
12232B55659a84685G2006a12968B3417J27811K78154A72148K80425j52290c966
12221B67246b05027E02474j16800h9370B32393l0682J51508e7808G2644K83665
12211C56309j60284J28198q0614D7138a12302A37175N1790o9620h8873L2728C1566
12199a01171d9379B59561Q3970f5488A4585b41141C08738j40426K6373K5761J3370
$$ plain form
12277 -166833 65282 230256 161844 111855 79227 204466 130621 107266 56118 327373 130569
12265 73091 154157 149959 173683 67785 309279 4714 157032 -49023 155361 41211 231824
12254 231824 294368 135680 173813 -4791 448720 83223 -264714 480593 270547 181841 380559
12243 380559 44815 151045 89302 92017 444642 304150 97761 115366 -21857 210783 255659
12232 255659 -184685 72006 -112968 23417 151228 429382 172148 452573 300283 -3966
12221 267246 -205027 502474 385674 -89370 232393 201711 353219 -57808 72644 356309
12211 356309 196025 324223 243609 47138 -112302 137175 188965 119345 -88873 -56145 31566
12199 -101171 -49379 259561 343531 -65488 14585 -241141 308738 168312 194685 220446 233816
12188B33816k7836I7434J83230f8356G7704L80029b0563A43751O3883a25428d1587
12176D9702J61148J6513A375d6928I6869g5939A81658J3805m6551e4021B08773
12164A98712K38673B13320A03335L53820G1875K82389k7556q6674J1996I5904
12153D0938K56333o5847h281F2904J32684K5562m5444M04051b83867C60917h4827
12141a42258A31154J50175a16351A26373c89159E4661K69041A34364c3846A7491
12130B33168g4696B64593J56054a40496A98133m3731J3622G8178J37367l0821
12120A84724M9709n3725J39793a41163C04281k1078a4916A40010M87993B46935
12109A96049F7159a93522E3665K39764E5523Q9003m613A3812L08118A2850J10644
$$ plain form
12188 233816 205980 97434 280664 -68356 77704 457733 -20563 143751 207634 -125428 -41587
12176 49702 210850 227363 1375 -46928 96869 -75939 181658 195463 148912 -54021 208773
12164 198712 437385 213320 103335 457155 71875 354264 326708 240034 252030 95904
12153 40938 297271 231424 -8281 62904 195588 221150 175706 579757 -283867 360917 -84827
12141 -142258 131154 281329 -116351 126373 -389159 54661 323702 134364 -33846 17491
12130 233168 -74696 264593 420647 -140496 198133 154402 168024 78178 215545 184724
12120 184724 234433 180708 320501 -141163 304281 283203 -14916 140010 628003 246935
12109 196049 67159 -193522 53665 293429 55523 144526 139913 13812 321930 12850 123494
12098A23494J47738a65520B79925m952g3647A73206J85206H8656a39613c9883
12087A23316P8670d7514n2381a2004A50452J36091a38268A78951b8257q3659A29202
12075E25516E1710M7930j4582K00478J17864A29256L562M2389p4078K8198k127
12064A27200d6492A64933D8808K01151j06327E7858K27345F1471O2405a47143
12053b85032A18497A3111Q9820j7261O7979c57321A35612A1118c41217B53446
12042A69168n8604C3270a0845k79976A16706k2967a81570g5200j85285A25622
12031G4962J95089e2256a2941G7665b9409l8238A59587l2763a15013G2944L19161
12020C92105j47802A00213a91226m6693D26104j89772a62814A31620R9342j628
$$ plain form
12098 123494 271232 -165520 279925 274973 -73647 173206 358412 88656 -139613 -39883
12087 123316 201986 -47514 -99895 -12004 150452 286543 -138268 178951 -28257 -111916 129202
12075 525516 51710 99640 85058 285536 403400 129256 132818 175207 101129 129327 127200
12064 127200 -46492 164933 48808 249959 143632 57858 285203 61471 123876 -147143
12053 -285032 118497 13111 102931 85670 153649 -357321 135612 11118 -341217 253446
12042 169168 110564 33270 -10845 -290821 116706 93739 -181570 -75200 -260485 125622
12031 74962 270051 -52256 -12941 77665 -29409 -67647 159587 126824 -115013 72944 392105
12020 392105 244303 100213 -191226 -237919 426104 236332 -162814 131620 230962 229334
12010B29334a07197M1563l2937o56E3989p631c6216A93789J32127r4853L2714
11999B63777K8213e2635A88475p0034c08238d9618B35781j02072a43857A1815
11988a97922A61922a91677a5065k27751A67341f7815B08381b05105J5016E1406
11977a50991n3887I3417P3188E3556r500c4545A5604a07784E4294h9274D6732
11965a92371B69809i7802j26055F2262a97197E2175g7732k13434H0734g9786B06586
11953a91345G6150b87338a17750A16701d9905B81137b16198f922B42333i6941
11942b55978i402k22694B49180J14822I296a77851A8131e8637n9019r876l203
11931a30735M9431n8955j14872a16772d6828D451a06762C22172a04427B00525
$$ plain form
12010 229334 -107197 -65634 -98571 -99227 53989 46358 -36216 193789 325916 231063 263777
11999 263777 291990 -52635 188475 118441 -308238 -49618 235781 133709 -143857 11815
11988 -197922 161922 -191677 -15065 -242816 167341 -67815 208381 -205105 -190089 51406
11977 -150991 -204878 93417 166605 53556 44056 -34545 15604 -107784 54294 -89274 46732
11965 -192371 269809 -97802 -223857 62262 -197197 52175 -77732 -291166 80734 -79786 206586
11953 -191345 76150 -287338 -117750 116701 -49905 281137 -216198 -6922 242333 -96941
11942 -255978 -9402 -232096 249180 364002 9296 -177851 18131 -58637 -117656 -127532 -130735
11931 -130735 -81304 -140259 -255131 -116772 -46828 4451 -106762 322172 -104427 200525
11920I3385C8393n825Q3604D0017J29585a79460P6623A23544K08743a2413C52704
11908b81408h1004j17779J868A88318C8248N4628a22745A90288P8215b83183B03483
11896A31327J27872b71798e794H1954a28372A97033i1420A08154d25258B6882
11885a71343o1956D2016b08249n4142F4564M1196c05881G2744A7034b99847A17013
11873a86851A32329J6354J19105j28558c39321A10376d66934K18411E5704j3348
11863D2356k664a93289C59624j34065a89631n52576G2495O076e7439b5405p7403
11852a02808l024G9264P8342b9745j09569f5439A96582K14992A04780M6122h2459
11840A68455c7512E5044b57307j47041g9068a3380K615l36827c4119h539k39390
$$ plain form
11920 93385 38393 32568 116172 40017 169602 -179460 -102837 123544 332287 -12413 352704
11908 -281408 -81004 -198783 -196915 188318 38248 92876 -122745 190288 268503 -283183 203483
11896 131327 259199 -271798 -5794 81954 -128372 197033 -91420 108154 -425258 26882
11885 -171343 -233299 42016 -208249 -262391 64564 105760 -305881 72744 17034 -299847 117013
11873 -186851 132329 148683 267788 139230 -339321 110376 -466934 -248523 55704 42356
11863 42356 39692 -193289 359624 225559 -189631 -742207 72495 78571 -57439 -25405 -102808
11852 -102808 -105832 79264 157606 -29745 -139314 -65439 196582 411574 104780 150902 -82459
11840 168455 -37512 55044 -257307 -404348 -79068 -13380 -10765 -347592 -34119 -8539 -247929
11829b47929Q2166o2577E1303A3898a0505B50995a52831j55915c3837k01141A5075
11817B11784B8529b4963j30003A3102a08127c0743k9680A29764f7598A6502h581
11805B21001p0453b43399N1123A4081J66926f8289E5822L55703a87820Q8966a6980
11793b69375D5323J69766a1657A62567e5097o778A76820O6477c9875q6242L3866
11782i2251L7244G6199a74293A6020J09805a16035E0098b68451a08212d0025D7777
11770a47758C88077A42579m066f2603A78074B8566L3110h0072j5707n992A99640
11758B19669h6024k91243i3372B77356g1209M28B27476g4918C9289L92555I8587
11746c61309J62046A95636l2355G9575d4302A33247B8592a82327a4332k02775
$$ plain form
11829 -247929 -165763 -228340 51303 13898 -10505 250995 -152831 -308746 -33837 -234978 15075
11817 211784 28529 -24963 -154966 13102 -108127 -30743 -60423 129764 -67598 16502 -8581
11805 221001 150548 -243399 -192276 14081 181007 -68289 55822 411525 -187820 -98854 -16980
11793 -269375 45323 215089 -11657 162567 -55097 -61875 176820 243297 -39875 -126117 -92251
11782 -92251 -55007 76199 -174293 16020 125825 -116035 50098 -268451 -108212 -40025 47777
11770 -147758 388077 142579 138513 -62603 178074 28566 61676 -80072 -95779 -101771 199640
11758 219669 -86024 -377267 -93372 277356 -71209 -70781 227476 -74918 39289 431844 98587
11746 -361309 -199263 195636 163281 79575 -44302 133247 28592 -182327 -14332 -217107
11736b17107B03938l7471c74983C57167d3128E5942A1371n76K19216q6499i2171
11724I9406a52040D9385c11924A13505i6472k29910B5980M1562K14507D691Q9129
11713I3820e4058C04972I647a44144k31369G6385a97281D8047j115b1660k11075
11702b32735g7443a6418l453j99126A71803G1960a44579d8657C23588j34955J43294
11691C31927b05019D12726A800b23770B55410i5295l7288F7508N07k0079I520
11679A54855l6045h3314F2368J61767J29461c7250D9200h0422A48051R6442h6416
11667A35679F4432i6368j03172f1160A77633a11722N2660K1717m7138Q618B30220
11655C75401i8475k67149H6511A6547L12828b5672A7085a93334a1639E31740k28724
$$ plain form
11736 -217107 203938 166467 -374983 357167 -43128 55942 11371 10795 230011 143512 -92171
11724 99406 -152040 49385 -311924 113505 -96472 -326382 25980 67542 282049 4691 93820
11713 93820 -54058 304972 9647 -144144 -375513 76385 -197281 48047 46932 -21660 -232735
11702 -232735 -77443 -16418 -19871 -218997 171803 71960 -144579 -48657 323588 188633 331927
11691 331927 -205019 412726 1800 -223770 255410 -95295 -132583 67508 68015 47936 9520
11679 154855 118810 -83314 62368 224135 353596 -37250 49200 -80422 148051 244493 -86416
11667 135679 64432 -96368 -199540 -61160 177633 -111722 -59062 -37345 -84483 -75865 230220
11655 375401 -98475 -365624 86511 16547 329375 -25672 17085 -193334 -11639 531740 303016
11644C03016A5154L2401b50765N0085R5106E693a09789L0042A92915r1758J41309
11633B42466a08250C330c07404C2716d0163B08098h9066D4263a57436A58789p9294
11622G9495J48115G8751a6369j1350B8192N912J92239I4766b7644C01708b69623
11610A46781o9696a89526E0683J63422A3709a40165c4229q7869K9623b9443B9805
11598I0073a70950i353k02867A9327b17153A46452J29620q5012H6920P2435b09010
11586A44806Q8533g0910n6638A00582l892k9555L3860Q2255j8186a32057D6106
11574C0058b32207B6060J33464M4438K8004C6642a79435e937H0872h7355B07434
11562a4015I8193e5630O711r249A59573n5545e3103B2286J90501C8359a15969
$$ plain form
11644 303016 15154 47555 -250765 -200680 -105574 5693 -109789 -79747 192915 101157 242466
11633 242466 -108250 3330 -307404 32716 -40163 208098 -89066 44263 -157436 158789 79495
11622 79495 227610 78751 -16369 -27719 28192 34104 226343 94766 -27644 301708 -269623
11610 146781 77085 -189526 50683 214105 13709 -140165 -34229 -122098 -92475 -29443 29805
11598 90073 -170950 -9353 -212220 19327 -217153 146452 276072 191060 86920 159355 -209010
11586 144806 233339 -70910 -127548 100582 96690 67135 100995 183250 165064 -132057 46106
11574 30058 -232207 26060 159524 203962 231966 36642 -179435 -5937 80872 -87355 207434
11562 -14015 98193 -55630 -48919 -58168 159573 104028 -53103 22286 212787 38359 -115969
11550A32181b70454j9716C6039a26842d779B30298Q7a03004H3607K46956f294
11538a30455A39539a57102A16252D3616J54463J57652j59747O3400a84638J0625
11528a74013b3743G9341l5582P1670J53056B3146h5271B60582b47303A04541i6960
11516A10398b9647j549p6759G4107k2480a4438B94387j37935a17558B67235B6099
11504C62281h371A93935A8763N70920b78692A66327a09601o267A53731K74884
11494D28615a14094A50612E2828O2538E6025a47396a8280q1025A16172J32204
11484B48376p8262L0095M531k7077C4611J91488J34686A34612a10262I8912a99192
11472A27814E1437L82077A50033L85836k961c72161A52974J37078A22022K13593
$$ plain form
11550 132181 -270454 -290170 36039 -126842 -4779 230298 230385 -103004 83607 330563 -6294
11538 -130455 139539 -157102 116252 43616 198079 355731 195984 259384 -184638 -174013
11528 -174013 -23743 79341 43759 115429 268485 23146 -85271 260582 -247303 104541 -96960
11516 110398 -29647 -31196 -107955 74107 51627 -14438 294387 156452 -117558 267235 26099
11504 362281 -8371 193935 18763 589683 -278692 166327 -109601 -115868 153731 428615
11494 428615 -114094 150612 52828 115366 56025 -147396 -18280 -99305 116172 248376
11484 248376 170114 200209 204740 177663 34611 226099 360785 134612 -110262 98912 -199192
11472 127814 51437 433514 150033 535869 532908 -372161 152974 290052 122022 335615
11462C35615a47932L9602b6532A17720b77292A39686c06841B22060G7454L9338
11452A16792N9625a2888B69952e3439p9225B35882b4141N750A22484e2090f180
11440a11273B45517I6918b56921G7615b0309A07928J12908J16691a30598M898
11430a25700B98184E7486L9758K17895b05817e5388C2571b20573J07933G4689
11419d9040A55720c4114C28190j39709b02382H1578K020b48399C18594a918l81443
11408c83361g1518j93995a24134E6376a28219A98829a61641A39323k8549a2579
11397C47595A34602J87699d730C2121c15299a30392E1487b16447C27978j58394
11387A69584m7387b78827J27114H7524J9603l4584B3036a20176A80266m8628b04361
$$ plain form
11462 335615 -147932 -108330 -26532 117720 -277292 139686 -306841 222060 77454 116792
11452 116792 176417 -12888 269952 -53439 -132664 235882 -24141 -18391 122484 -52090 -6180
11440 -111273 245517 96918 -256921 77615 -20309 107928 220836 337527 -130598 -125700
11430 -125700 298184 57486 97244 315139 -205817 -55388 32571 -220573 -112640 74689
11419 -49040 155720 -34114 328190 188481 -202382 81578 83598 -248399 318594 -1918 -383361
11408 -383361 -71518 -265513 -124134 56376 -128219 198829 -161641 139323 110774 -12579
11397 347595 134602 322301 -4730 32121 -315299 -130392 51487 -216447 327978 169584
11387 169584 122197 -278827 -151713 87524 107127 72543 23036 -120176 180266 131638 -204361
11375B69984E9112J30978i1391j23984A60608b25779Q2472j59415A07083a23001
11364b34305C2671d5090k48669d3532A80202R828r4752A1417a0068k626H683a00786
11351a4344G4961a12625a0086B46038G3781b40150J18761j9478K8097F807L05885
11340C12692E167K02800e6974n9710o7666Q4978A46701m0995a23594C24346G8533
11328a71022o0783G029J93460b52850a02871j49433H1214b31504F3066b72971
11317A52672A5949J376a68289D4220K05537a60946A72355n7299b8429H7715N8340
11306A46055d17108A65999R9287e9284p7671L1610m1407c3492n6617D02122c6533
11294a43799k3285l9290B43238C8201a56484G6448A4478a45370j6944j78104a56731
$$ plain form
11375 269984 59112 190090 -91391 -215375 160608 -225779 -143307 -302722 107083 -123001
11364 -234305 32671 -45090 -293759 -43532 180202 190030 95278 11417 -10068 -12694 8683 -100786
11351 -14344 74961 -112625 -10086 246038 73781 -240150 -121389 -140867 -112770 6807 312692
11340 312692 5167 207967 -56974 -116684 -184350 -99372 146701 105706 -123594 324346 78533
11328 -171022 -231805 7029 200489 -252850 -102871 -252304 81214 -231504 63066 -272971
11317 152672 15949 17325 -168289 44220 249757 -160946 172355 115056 -28429 87715 146055
11306 146055 -417108 165999 265286 -59284 -136955 -105345 -146752 -33492 -90109 402122 -36533
11294 -143799 -167084 -206374 243238 38201 -156484 76448 14478 -145370 -162314 -340418 -156731
11282B56789f9406j36292e929G2722a0807D5379L0169c3199A81152c21714i2504
11270a22419e9849A25260b25787R8882G683K32016c28366k5042B83982e228j60373
11259a65601e8384q5078A53683b18092A04281b8015B74917c41000A35449A9112
11248e5912A2472g4448b4422k22623A79415m3880j4491J35750i2026j00976h8139
11236i4624H6153l5619N2525a02754H5750c32428J44978k9630b3065j37435O3853
11225i6647A41432M1886b14750n2109n728G5347b09536g4889D7704G7a33864O3340
11213g0524q7630A6428c05985O7055O4681f702D5885c44077g514A45217a86160
11201a50645A22197j3578L10099h6254B89100C7223M0871c69667e2789a060j21814
$$ plain form
11282 256789 -69406 -205698 -5929 72722 -10807 45379 75548 -33199 181152 -321714 -92504
11270 -122419 -59849 125260 -225787 -126905 7683 239699 -328366 -353408 283982 -5228 -165601
11259 -165601 -58384 -143462 153683 -218092 104281 -28015 274917 -341000 135449 19112
11248 -55912 12472 -74448 -24422 -247045 179415 135535 121044 256794 -92026 -193002 -88139
11236 -94624 86153 50534 103059 -102754 85750 -332428 -187450 -217080 -23065 -160500 -96647
11225 -96647 141432 183318 -214750 -266859 -272587 75347 -209536 -74889 47704 77 -133864 -70524
11213 -70524 -158154 16428 -305985 -238930 -174249 -6702 45885 -344077 -7514 145217 -186160
11201 -150645 122197 108619 418718 -86254 289100 37223 78094 -369667 -52789 -1060 -122874
11190a22874H0597c4760j80634B26887a34149l76867B83427b41784j00122A40327
11179b3493k02469f5872j49790d2570o1717B8442A2236b50209d5231D5792J22082
11168A67874h1925b2546a096k52723b7225l37285g8019j27211B6560b85773A61199
11156b01908A8775J5b32945k6304A5312L3026J2103J02165B6463L58650a31747
11144b18970F2687f6196C09795A24031a8100m1383A76552b32381J5087A03892
11133b71296A3040K06444H7696a44766B26228J69883f4753j27333P5112M5965
11123g1009j76140D47095A74489J09006E7626a08881F2119J36605K65206g0050
11112a15965A28295a82872e7290k0444A73128J07426L6638I1415O7117J54571
$$ plain form
11190 -122874 80597 -34760 -215394 226887 -134149 -511016 283427 -241784 -341906 140327
11179 -23493 -225962 -65872 -215662 -42570 -104287 28442 12236 -250209 -45231 45792 167874
11168 167874 -81925 -22546 -1096 -253819 -27225 -364510 -78019 -205230 26560 -285773 161199
11156 -201908 18775 18790 -232945 -259249 15312 48338 60441 162606 26463 385113 -131747
11144 -218970 62687 -66196 309795 124031 -18100 -59483 176552 -232381 -217294 103892
11133 -271296 13040 219484 87696 -144766 226228 396111 -64753 -192086 -116974 -71009
11123 -71009 -247149 447095 174489 283495 57626 -108881 62119 198724 463930 -70050
11112 -115965 128295 -182872 -57290 -77734 173128 280554 317192 91415 158532 313103
11102C13103E7429a86696A43282N0537J39106c6114I5573K06846a54786G2416
11091B66408m6914G3371J78422J75164A27370J95209F2590d5741D3753K74424
11081C18177h146D84917r7096j71990Q8729A46723m2873N20692B63381M8295p2365
11070B39311A13590J89500A27872K31009n5755D9347K12094A00275J68113J94088
11060D62476A57429J01302N126K9062K28361j92368L14119k00924j66027K21773
11050D97853K82497l28110L21023j72547K75808j85036j84479o116J6471N03309
11040A020673j56700D07405L91950K66814j48693D45862K21874B89783L40164
11031F29947L07659D41249J75304K66751l41279J04990L9587K43988j67240J7007
$$ plain form
11102 313103 57429 -186696 143282 193819 332925 -36114 95573 302419 -154786 72416
11091 266408 219494 73371 251793 426957 127370 322579 62590 -45741 43753 318177
11081 318177 -8146 484917 387821 215831 304560 146723 103850 624542 263381 311676 239311
11070 239311 113590 303090 127872 358881 303126 49347 261441 100275 268388 462476
11060 462476 157429 258731 263857 292919 521280 328912 643031 442107 276080 497853
11050 497853 780350 452240 773263 600716 876524 691488 507009 500893 517364 1020673
11040 1020673 863973 407405 799355 1066169 917476 445862 667736 289783 629947
11031 629947 937606 441249 616553 883304 542025 647015 686602 930590 763350 780357
11021G80357J04007l9881Q1737J01322l1419k93138k68278K31297P555M1658l14539
11010D00678M4928j52354k812K81561L8756j71203L74101k02045B35741O10537
11000H46278l44308J79362P5004r5126j12584M45083B72220K83170j76465J95099
10990E74024q4000J4016K47647O8209Q3730l25317R4230Q2188J21369j5024K44988
10979A106060J14512k42452J56033n2986P3935K31716N3940J01230J53882M32706
10969B128576n2765M39519P4685r7377K81153l18375k4841l31725K8496j21159
10959B006187p35930K17888l52760M45906k85978J95637M03861J50714k75822
10950A769703l3822k41587j44358j25344k9057k16798m76700K80111l12320R3236
$$ plain form
11021 780357 884364 844483 926220 1027542 996123 702985 434707 666004 673559 715217 400678
11010 400678 445606 293252 290440 572001 610757 439554 813655 611610 235741 846278
11000 846278 501970 681332 756336 661210 548626 993709 272220 555390 378925 574024
10990 574024 490024 504040 751687 819896 903626 578309 672539 754727 876096 861072 1106060
10979 1106060 1220572 978120 1134153 1081167 1155102 1386818 1440758 1541988 1695870 2128576
10969 2128576 2075811 2515330 2590015 2492638 2773791 2455416 2430575 2098850 2127346 2006187
10959 2006187 1270257 1488145 1135385 1581291 1295313 1490950 1894811 2045525 1769703
10950 1769703 1735881 1494294 1349936 1224592 1195535 978737 502037 782148 469828 563064
10940E63064A19391J43451a46777A29326J33312K4397J20491B0191a8334A02587
10929A07903a61260A71942G7087a2035A77089k1073a21795d4600j69191f7591
10918D1280L01686A5393a53879b7816n22892E0554a96927h7492k9564B9603g5882
10906a3974A0122a21162G4902a0964j24510A04634C7025D090O1794g4242A03982
10894a04658A97321c77107J87182B20413a46796A89390e7946m49710a47671o4911
10884b12582A71040b09438h243m6173k19322G3305A9394J10960L1114a2449j97493
10873b09942J01228n117L3431j24732B184a79150J4842q6777f8210G5051e464
10861B8847n572O4065G508f6852B81290E9280e9389r3868B17466k4804I2388M9302
$$ plain form
10940 563064 119391 262842 -146777 129326 262638 287035 407526 20191 -18334 102587
10929 107903 -161260 171942 77087 -12035 177089 156016 -121795 -44600 -213791 -67591
10918 41280 342966 15393 -153879 -27816 -550708 50554 -196927 -87492 -117056 29603 -75882
10906 -13974 10122 -121162 74902 -10964 -135474 104634 37025 4090 65884 -74242 103982
10894 -104658 197321 -377107 -189925 220413 -146796 189390 -57946 -507656 -147671 -212582
10884 -212582 171040 -209438 -8243 -54416 -273738 73305 19394 130354 161468 -12449 -209942
10873 -209942 -108714 -113831 -80400 -205132 2184 -179150 -164308 -251085 -68210 75051 -5464
10861 28847 23275 87340 7508 -66852 281290 59280 -59389 -153257 217466 192662 92388 141690
10849A41690C6456Q4793J65072a32328n8701c6001j12664A45439a38087o5113
10839b03200K1309o2319h529D3006K692d6685A94923b64929A5168c1255G1745
10827A922K98185G1055a01873A46488c84838J60672G2293M496K6410l8928b581
10815a07416B03914E4988A1404b7474k06615a00210r8185e8326B43577p5649a53330
10803a17292B69240a42720A856J34777K3655a23636j81011h620l7708k72911b4390
10791a58272e731l27000f1293j52065k41573e9851j86659A5439a99910E2012g5164
10779A11053i2771r3402B76509e53664b24575Q3419A78538f23288B1408a69704
10768B20666a76180M252k43806e717k85627b8083A39292d07439A99664c08471
$$ plain form
10849 141690 36456 121249 286321 -132328 -191029 -36001 -148665 145439 -138087 -203200
10839 -203200 -181891 -244210 -8529 43006 45698 -46685 194923 -264929 15168 -31255 71745
10827 1922 300107 71055 -101873 146488 -384838 -224166 72293 76789 103199 64271 -2581
10815 -107416 203914 54988 11404 -27474 -234089 -100210 -198395 -58326 243577 167928 -153330
10803 -117292 269240 -142720 1856 136633 160288 -123636 -304647 -8620 -46328 -319239 -24390
10791 -158272 -5731 -332731 -61293 -213358 -454931 -59851 -246510 15439 -199910 52012 -75164
10779 111053 -92771 -186173 276509 -553664 -224575 -141156 178538 -623288 21408 -169704
10768 220666 -176180 -171928 -415734 -5717 -291344 -28083 139292 -407439 199664 -308471
10757G3932Q0926a5020m5804l4589J7308j58160R3355G0850J9788L5001J00719
10746B26358B1566C20a45181A21974e9318H6644d24304f9026j91297j9564B78607
10734A81966a77773q6139J22043f350m5810m320B7213h0113k30719E0823a09537
10722B70165a4973D7675c45636C2634O7797b43086A27672n4075c6686k08653C4458
10710a18121c2332H3013B043P9238b23036J7834a9135B98637A114h1233D22546
10698f1730j09711A0246e1414J074k59873E007J26839d27308B64373M5172e9718
10686A40023c28701A99128l8016a59441P5107j5365n4858E8414q984b53539N2817
10675b00722B5234c03437A50677b04931B7638b46538h1771k04166H5227c44454
$$ plain form
10757 73932 154858 -15020 -60824 -95413 -78105 -236265 -142910 70850 90638 125639 226358
10746 226358 21566 320 -145181 121974 -59318 86644 -424304 -69026 -260323 -279887 278607
10734 181966 -177773 -263912 -141869 -6350 -52160 -56480 27213 -80113 -310832 50823 -109537
10722 270165 -14973 47675 -345636 32634 100431 -243086 127672 73597 -36686 -245339 34458
10710 -118121 -32332 83013 2043 81281 -223036 -205202 -19135 298637 1114 -81233 422546
10698 -61730 -171441 10246 -51414 -50340 -310213 5007 131846 -427308 264373 309545 -59718
10686 140023 -328701 199128 161112 -159441 -84334 -99699 -154557 58414 49430 -253539 -200722
10675 -200722 25234 -303437 150677 -204931 27638 -246538 -81771 -285937 85227 -344454
10664c1734l4831p9271b5730A72129a9751k8235e162A16804B2062K28176i3033
10652a16002m29208I852d2565j15284k5193i804A08064i7071A58933e4368F4001
10640f9785m29804A0203a02165j63817O5653l1307J5456J07473r6561B85335g9996
10628H6684b76455J8914d0681m6790A69298A5276M4676M4202a54299j47241a12310
10616b61881o3228D0533J8829a10552A52543C2646a41243e7987o5000a3927k3147
10605c7074k5358l7840F2606a9211D2834e708l959A63802a90570A54700N7817
10594B12517E6528M1797C0744P44b86480E1556a9410k53084H3807J06222c44223
10582B42219c88252g2825I9385b16568k52156D7637b74594H081b33987D3892a66761
$$ plain form
10664 -31734 -66565 -145836 -25730 172129 -19751 -47986 -5162 116804 22062 250238 -93033
10652 -116002 -545210 9852 -42565 -157849 -183042 -9804 108064 -97071 158933 -54368 64001
10640 -69785 -499589 10203 -102165 -265982 -200329 -231636 -216180 -108707 -205268 285335 -79996
10628 86684 -276455 -257541 -40681 -87471 169298 15276 59952 104154 -154299 -301540 -112310
10616 -261881 -325109 40533 59362 -110552 152543 32646 -141243 -57987 -122987 -13927 -37074
10605 -37074 -62432 -100272 62606 -19211 42834 -5708 -9667 163802 -190570 154700 212517
10594 212517 56528 98325 30744 31488 -286480 51556 -19410 -272494 83807 190029 -344223
10582 242219 -388252 -72825 99385 -216568 -468724 47637 -274594 8081 -233987 43892 -166761
10570C0043e6554l7328f729k26416a03775C63786i9466a8120m5916o4064N8292
10559f9808n0850A88216b64122a13114E1195i3475B42242i567j90636N7719B1295
10547A53880i2695m0072A42389M795j2341h1543o466A9481a71448f3499B5781
10535b54985I9320h9675d2076J1667j56093A04114P0610O5291e1046j15525A68359
10523H6246b5280j22980n8664q8778B14117b55331a11871j03406A60399h2077
10512D0293L9102a35363N1092n4099p266O0401j88766J14244j55376a1425A43947
10500f5584J5266c841j51516d0334n5594c5050j41760p1309E6719a2770m1451
10489e4221A06113c17933L2648M3388c3696B5334K37109Q7243e0767A11621K35730
$$ plain form
10570 30043 -56554 -93882 -6729 -233145 -103775 363786 -99466 -18120 -64036 -128100 -69808
10559 -69808 -120658 188216 -264122 -113114 51195 -93475 242242 -9567 -200203 -142484 21295
10547 153880 -92695 -132767 142389 147184 134843 -81543 -88009 19481 -171448 -63499 25781
10535 -254985 99320 -89675 -42076 -30409 -186502 104114 174724 240015 -51046 -166571 168359
10523 86246 -25280 -148260 -206924 -295702 214117 -255331 -111871 -215277 160399 -82077
10512 40293 79395 -135363 -84271 -138370 -145636 -85235 -274001 -159757 -315133 -11425 143947
10500 -65584 -50318 -3841 -155357 -40334 -95928 -35050 -176810 -248119 56719 -12770 -54221
10489 -54221 106113 -317933 -285285 -241897 -33696 25334 262443 349686 -50767 111621 347351
10478C47351A10013f7356B98396l7575L89344C09311J91786K1400c18072F4749
10467B17952K2609a87048k09687G4376e1371j37580A88308b39030A26799A1512
10456A26541a27836a694o5996l4495J6024r5283H6031g338o9496C5240b3058q1819
10444a04877I4986c341l06977A0668J7314j3455a55010d8459k29361c3123C1848
10432C25882h7934B00058k3934B7184J05536b10904k97678I7653h5713l9384j39642
10421b64739B5342c02319A25090J39373a94188E5337m473c9651A14641n1944c03853
10409e7033J183q4540A9412J46432a06341A19884C2162J33967A6346f3742I9774
10397b48336A98734h2553a9943A31126a76538C2792a46442d9567A77226f2177
$$ plain form
10478 347351 110013 -67356 298396 260821 650165 309311 501097 522497 -318072 64749
10467 217952 240561 -187048 -396735 74376 -51371 -188951 188308 -239030 126799 11512
10456 126541 -127836 -1694 -67690 -102185 -86161 -181444 86031 -7338 -76834 35240 -23058 -104877
10444 -104877 94986 -3341 -310318 10668 27982 14527 -155010 -48459 -277820 -33123 31848
10432 325882 -87934 200058 176124 27184 132720 -210904 -508582 97653 -85713 -125097 -264739
10421 -264739 25342 -302319 125090 264463 -194188 55337 50864 -39651 114641 62697 -303853
10409 -57033 -55850 -140390 19412 165844 -106341 119884 32162 166129 16346 -63742 99774
10397 -248336 198734 -82553 -19943 131126 -176538 32792 -146442 -49567 177226 -62177
10386B63090H1924K2872J40869o4576m2522R163C3328b22594I6715h2320B18467
10374b67494i9318B81116k8465q0628J96569G7688i6909C7188K88143m7458J81433
10363D59306M3694B21345L31929k75702B5801J9608L22221k2192r8316J37612
10353C84734A31017a281B71485L26064k05928k455q0123I6521M22585j18024k8699
10342C72383R2131b9192E42389B41974M11404a332B16726r9228M8212R6131M14389
10331F76230A23599R5425K16453j65851G7781J34423p7195J7831E1121k4121e6570
10319A88067J52496a88839l4547B90460o4608a35744C60241e6809L569A26809
10308A27011a94798B77220L9636i0478n4909C47841e3766C80874c02555a00152
$$ plain form
10386 263090 81924 104796 245665 181089 138567 147730 33328 -222594 96715 -82320 218467
10374 -267494 -99318 281116 252651 172023 368592 77688 -96909 37188 325331 277873 459306
10363 459306 503000 221345 553274 277572 25801 45409 367630 345438 247122 384734
10353 384734 131017 -1281 271485 597549 391621 389166 309043 96521 519106 401082 372383
10342 372383 464514 -29192 542389 241974 653378 -1332 216726 117498 165710 261841 676230
10331 676230 123599 219024 435477 269626 77781 212204 135009 152840 51121 27000 -56570
10319 188067 340563 -188839 -223386 290460 225852 -135744 360241 -56809 -53240 126809
10308 127011 -194798 277220 316856 -90478 -145387 347841 -53766 380874 -302555 -100152
10297a92197A31546c4788j15457H3191J09386b73515A71241i6492m17329d8470
10286c8253k54449f7266C16187b16955n9825f8470b4943A36938b04684G7793C2176
10274B7804a74540M2455m7687l7727A22033m3347a36194E9460b21172d1885Q370
10263c3515k08412A73879D4917e5577m07447a09658K7618r5457e7442b2051L119
10252a8932j37710j57339D29935h8500A5130J25394a35795C0656a4140j56770
10242a70910g8947r998q1386B77316q3935a07941C1238K94318H8198o230a40181
10230d60742a11885E6332a97953I2667d2254j67511a1564k10279E4174M4172d38918
10218a00495l7306B64926i5102L6176B21076b59437n8158g6204j88820J25839
$$ plain form
10297 -192197 131546 -34788 -150245 83191 192577 -273515 171241 -96492 -513821 -48470
10286 -38253 -292702 -67266 316187 -216955 -276780 -68470 -24943 136938 -204684 77793 32176
10274 27804 -174540 -132085 -179772 -217499 122033 78686 -136194 59460 -221172 -41885 -33515
10263 -33515 -241927 173879 44917 -55577 -463024 -109658 -82040 -177497 -57442 -22051 -18932
10252 -18932 -156642 -313981 429935 -88500 15130 140524 -135795 30656 -14140 -170910
10242 -170910 -78947 -88945 -170331 277316 193381 -107941 31238 325556 88198 81968 -140181
10230 -460742 -111885 56332 -197953 92667 -42254 -209765 -11564 -221843 54174 98346 -438918
10218 -100495 -137801 264926 -95102 -58926 221076 -259437 -317595 -76204 -265024 -139185
10208a39185E4606a11328G2456b03378d6445n6045B7940g8347q8357o7981j71808
10197d06493a48153d3414k31726B0250L2682a78422H8075h9465A55814K42735
10187C98549I0222c7358j68594o1178c2472k19043C2873J00949A123d9414j44641
10176a94055D475a11794B37390J52836D5076c24124J08173N2093E3607e2482k31088
10165b83570I059a94092j19638P0355E2004a52225k12731Q1893J38203A86545
10154G8998a42125A22965m1223a0741k13326k6215A7568J48795a97905A19338
10143b04736D2857c36891i6509h471o2841l7795c1200j67808k36115A4258P4959
10132H9217B2019c00518a9962r8741E4521L4238b34171g1251A29780a08294j60011
$$ plain form
10208 -139185 54606 -111328 72456 -203378 -46445 -102490 27940 -78347 -166704 -234685 -406493
10197 -406493 -148153 -43414 -275140 20250 52932 -178422 88075 -89465 155814 398549
10187 398549 90222 -37358 -205952 -267130 -32472 -251515 32873 133822 1123 -49414 -194055
10176 -194055 4475 -111794 237390 390226 45076 -324124 -215951 -163858 53607 -52482 -283570
10165 -283570 9059 -194092 -313730 -243375 52004 -152225 -364956 -283063 -144860 186545
10154 78998 -142125 122965 81742 -10741 -224067 -250282 17568 166363 -197905 119338
10143 -204736 42857 -336891 -96509 -8471 -71312 -109107 -31200 -199008 -435123 14258 89217
10132 89217 22019 -300518 -19962 -118703 54521 88759 -234171 -71251 129780 -108294 -268305
10121b68305B69116I3758J4409a42812A90800c45154A35630c66946k502c0255
10110D9167d4053B52205A3192m405J63944o6844i6169b4802l10555A05702J11790
10099B17492p6893B9879a45129j32208l2379a38092o3540E0650a75802A0070N9971
10088G0041j8613J75816c406A82450a39836D16854a17103b2664j00309N4635k39596
10077c07934J04059h0960B30222C3973b90592d8436l7109I7804c34464F9216a00722
10065B01112B9651J57127a43881O2245K8594j00483j44859j2784c3058A20469
10054b05869C5912h5797p5314r7015a08804G8382b08422o3972C808M9790d7245
10042b48600A18448g3921J3586B56195F7121b60008H7252a00139B13369g1885
$$ plain form
10121 -268305 269116 93758 108167 -142812 190800 -345154 135630 -366946 -369448 -30255
10110 49167 -44053 252205 13192 8787 172731 105887 -96169 -24802 -335357 105702 217492
10099 217492 140599 29879 -145129 -277337 -309716 -138092 -201632 50650 -175802 10070 70041
10088 70041 51428 227244 -3406 182450 -139836 416854 -117103 -22664 -122973 -68338 -307934
10077 -307934 -203875 -80960 230222 33973 -290592 -48436 -85545 97804 -334464 69216 -100722
10065 201112 29651 186778 -143881 -81636 -53042 -153525 -298384 -311168 -33058 120469
10054 -205869 35912 -85797 -161111 -258126 -108804 78382 -208422 -272394 3808 53598 -47245
10042 -248600 118448 -73921 -60335 256195 67121 -260008 87252 -100139 213369 -71885
10031a76058M3942q8811f7171k58452J47354C01923b23141d2809k80413J10888
10021b12334p525G9339a17E9674J05755f003E9782a33180n668j94684a32269k64417
10009c96686h1966k07813P6812b2533J895j10121A02251O3626a35006F2549O8678
9998A31227B039d6181C14860C167K22064b10143f5256M963j3997A35171m5094
9987I0077a18637j45127D6790J3156b29255A81146b7940A27753c69338B35726
9976G2364j3502f4004E9920K02266b51634j20257a54989c8071H0138Q8686h0285
9964E7393h0666B46764q206D352a04325G6199P094a13355a8145p3813j68480A23746
9951B08824a71875p1240A74725b24667d1468D9317J25324a62646q9023J00009
$$ plain form
10031 -176058 -132116 -220927 -67171 -325623 -178269 301923 -223141 -42809 -323222 -212334
10021 -212334 -219859 79339 -117 59674 165429 -6003 59782 -133180 -138848 -333532 -132269 -396686
10009 -396686 -81966 -289779 -212967 -22533 -20638 -130759 102251 165877 -135006 62549 131227
9998 131227 2039 -46181 314860 3167 225231 -210143 -65256 -60293 -74290 135171 90077
9987 90077 -118637 -263764 46790 59946 -229255 181146 -27940 127753 -369338 235726
9976 72364 58862 -64004 59920 262186 -251634 -371891 -154989 -38071 80138 168824 -80285
9964 57393 -80666 246764 238558 4352 -104325 76199 83293 -113355 -18145 -91958 -260438 123746
9951 208824 -171875 -243115 174725 -224667 -41468 49317 174641 -162646 -251669 -151660
9941a51660f9650n22605g1850m7607H066d0683A39003b54594A09707c74712A9568
9929a90511d0335j7287B6278f1840B79257b12805h1138E4885K17784a20022C4587
9917b71989E170a69934k69650b2214F65a29704e9442j34584A95K77598b88142
9905F8608a6765j13902j72832B50571a89750A59825a31861j8695C54230a2209
9894B51420E1574c30633J59924e2458l33797J44041k7788F7403L0606a69747e7881
9882a74215m16447a25487m7904A7194a57624k150E0358b7600o586k80156a12635
9870b41992E0143a72715j91226k9230D600J2969i1347A76377b6310B3887J9935
9859D3822b20817a6617f220C85683A28342b4822m31998F684N5496f2284n16065
$$ plain form
9941 -151660 -69650 -592255 -71850 -119457 8066 -40683 139003 -254594 109707 -374712 19568
9929 -190511 -40335 -57622 26278 -61840 279257 -212805 -81138 54885 272669 -120022 34587
9917 -271989 5170 -169934 -439584 -22214 665 -129704 -59442 -194026 195 277793 -288142
9905 68608 -16765 -130667 -303499 250571 -189750 159825 -131861 -150556 354230 -12209
9894 251420 51574 -330633 -170709 -52458 -386255 -242214 -270002 67403 98009 -169747 -57881
9882 -174215 -590662 -125487 -173391 17194 -157624 -159774 50358 -27600 -34186 -314342 -112635
9870 -241992 50143 -172715 -363941 -393171 4600 17569 -91347 176377 -26310 23887 43822
9859 43822 -220817 -16617 -6220 385683 128342 -24822 -456820 6684 62180 -62284 -578349
9848e78349K49196J32827j1872Q6654j87995J14595M2164J5421j94914a30559
9837f5298J4390j06181L2798B3644b79591B0201b17337B0477P0621h7580L6001
9826e1579F9762k5081P7218A4983J03066J40576b44536e4423q8342N5938L2424
9815e4403k70933A25b73545J15383I6801J1265k0751M16003b43402B1500b59359
9803I015f834D6733d8099m1701j50334J13807F1348J0427a36780p6142A3934K7895
9791D1829J41975b57653L9688q7259A02768J2399C3583q907b21267i6226l34282
9780d30508a13682A69946d1909H9438l5026J15162c28719G9463k0517B0558K1686
9769D2244Q9776c6195B49873b61305I4636a85929G3701M1632n5172b11210C9170
$$ plain form
9848 -578349 -329153 -196326 -208198 -121544 -309539 -194944 -152780 -137359 -332273 -130559
9837 -65298 -50908 -157089 -124291 23644 -279591 20201 -217337 20477 91098 -87580 -51579
9826 -51579 69762 44681 121899 14983 118049 258625 -244536 -54423 -142765 -86827 -54403
9815 -54403 -325336 125 -273545 -158162 96801 108066 87315 503318 -243402 21500 -259359
9803 9015 -6834 46733 -48099 -89800 -240134 -126327 61348 71775 -136780 -212922 13934 41829
9791 41829 183804 -257653 -217965 -305224 102768 115167 33583 24676 -221267 -96226 -430508
9780 -430508 -113682 169946 -41909 89438 54412 169574 -328719 79463 58946 20558 42244
9769 42244 132020 -36195 249873 -261305 94636 -185929 73701 115333 60161 -211210 39170
9757e511G3454b753m9178j44823D7961A4276J12062e6597D02958b50906F9082
9745b81573B32580d07224c580r7356A59870c97544B15553a58828k39721a94981
9734a64726k1695M4048B58573f8511P314j57679k5763b8575A6092J24991a70659
9722a07198A80094a27509l3428K8912b2562A8506a68751f5425k62170a2106o8840
9711h0946A54473e5022n3488n7797k0377D4814b12179n1537f8121m8592j17689
9700b34402f2935q645A77148c55797N6016R0084A6875a19969d6523E8005K8701
9689H6706J1918a72204B66429a11930h913k42000C08180a34738F9007j1505b62444
9677a11759C200a16404L6143D0728e6938a0174D11R5281c33154g3479K5145j1877
$$ plain form
9757 -5511 73454 -2753 -51931 -196754 47961 14276 126338 -56597 402958 -250906 69082
9745 -281573 232580 -407224 -3580 -100936 159870 -397544 215553 -158828 -398549 -194981
9734 -164726 -186421 -142373 258573 -68511 -61197 -218876 -244639 -28575 16092 141083 -170659
9722 -107198 180094 -127509 -160937 -132025 -22562 18506 -168751 -65425 -327595 -12106 -80946
9711 -80946 154473 -55022 -108510 -166307 -186684 44814 -212179 -263716 -68121 -116713 -234402
9700 -234402 -62935 -71580 177148 -355797 -299781 -209697 16875 -119969 -46523 58005 86706
9689 86706 98624 -172204 266429 -111930 -8913 -250913 308180 -134738 69007 57502 -262444
9677 -111759 3200 -116404 -80261 40728 -56938 -10174 411 95692 -333154 -73479 -48334 -60211
9665f0211b121k89122a42333c1063k14621d2686j87150B54641a84063j86428B00160
9653a44252d1418B80972a77487f7838J3378A63929c74436a27124b8692j44125
9643a72817A89030a56499P1167D2719b72660a16425B23259m3614a66906C3151
9632h7682M0526A01373K8932d9101n2054B48265b51873k29580c9790m7802C0456
9620B02702b93345B14476c0633j59794B71898a79l49667a05380M6855n8156A66802
9608H2473a32171E4530J17637a77282g2917a8344E4072a16854M116A47226a5447
9596i3901j15772Q599E4063b92770j12703D1826A5982a29526G8269c02088A2416
9584C3650L0864L1515a67405A25903m0275c44828A09270a68543A27531a45865
$$ plain form
9665 -60211 -2121 -291243 -142333 -31063 -245684 -42686 -229836 254641 -184063 -370491 200160
9653 -144252 -41418 280972 -177487 -67838 -54460 163929 -374436 -127124 -28692 -172817
9643 -172817 189030 -156499 -85332 42719 -272660 -116425 223259 179645 -166906 33151
9632 -87682 -47156 101373 130305 -49101 -101155 248265 -251873 -481453 -39790 -87592 30456
9620 202702 -293345 214476 -30633 -190427 271898 -179 -349846 -105380 -58525 -116681 166802
9608 82473 -132171 54530 172167 -177282 -72917 -18344 54072 -116854 -112738 147226 -15447
9596 -93901 -209673 -201074 54063 -292770 -405473 41826 15982 -129526 78269 -302088 12416
9584 33650 64514 96029 -167405 125903 85628 -344828 109270 -168543 127531 -145865
9573b1291G1921a60654j23492A93246H2419J80325n9083F9761d07198A55940f7975
9561a63987B81501a8537A34006c09555J02501A52540b20227a00267M8134j36272
9551a88405b1989j6571j7811j28333C6016a45015J7308B6639N2418d9328r2445
9540a41773D5663N618A9470J23386a2934q5291j05792a417j3766C3910b26171
9528a56478A91747A1729c20567j13214a15564A09845e07677F2250K78408c47570
9517a96299B32897a6186H1515J7049a37242B17931c00936a979j72805b4011j82733
9506b06744f6061b9733j85547J07201M7652A0645J19743a81205F2693K0854f1342
9494B37021a36729l9464d1769A41628j3015Q269C0812e2168j41413o1485H9089
$$ plain form
9573 -21291 71921 -160654 -284146 193246 82419 262744 203661 69761 -407198 155940 -67975
9561 -163987 281501 -18537 134006 -309555 -207054 152540 -220227 -100267 -52133 -188405
9551 -188405 -21989 -38560 -56371 -184704 36016 -145015 -127707 26639 79057 -49328 -141773
9540 -141773 45663 51281 19470 142856 -12934 -98225 -204017 -1417 -15183 33910 -226171
9528 -156478 191747 11729 -320567 -433781 -115564 109845 -507677 62250 340658 -347570
9517 -196299 232897 -16186 81515 98564 -137242 217931 -300936 -1979 -174784 -24011 -206744
9506 -206744 -66061 -29733 -215280 -108079 -60427 10645 130388 -181205 62693 83547 -61342
9494 237021 -136729 -176193 -41769 141628 128613 136882 30812 -52168 -193581 -255066 89089
9482A81960b31387c520G9901b7321n6459l51658F4777J36390i644p8017I8739
9470A27291a56716C397Q8767f4641A99672B089a59805A96058b37092A67736a55064
9458C1694a57040H5088d25788a83343E8612O4002d20393c4406G7779l3321d1148
9446C65d33892a1685m01716A78115G6082J68168b48991A39130b32578A21765c6752
9434H5602b97288A254a48093A66006B0972Q811J65692b5902q4179B09968a43094
9422H1035a39556H4159b83349c641j13665A32601a74070l3453a6006k20192E2815
9410D8888a29201q6377c4905m01125f5692L1687k5948r5492m5402B4433R6194
9399A20627b07465D9295O6994a62390c8937B9781f5377H6869b65000b3372p0155
$$ plain form
9482 181960 -231387 -3520 79901 -27321 -83780 -435438 64777 201167 -9644 -87661 98739
9470 127291 -156716 3397 92164 -64641 199672 2089 -159805 196058 -237092 167736 -155064
9458 31694 -157040 85088 -425788 -183343 58612 122614 -420393 -34406 77779 44458 -41148
9446 365 -433892 -11685 -413401 178115 76082 244250 -248991 139130 -232578 121765 -36752
9434 85602 -297288 1254 -148093 166006 20972 29783 195475 -25902 -110081 209968 -143094
9422 81035 -139556 84159 -283349 -3641 -117306 132601 -174070 -207523 -16006 -236198 52815
9410 48888 -129201 -215578 -34905 -436030 -65692 -34005 -59953 -155445 -200847 24433 120627
9399 120627 -207465 49295 116289 -162390 -38937 29781 -65377 86869 -265000 -23372 -93527
9388i3527L8504j00841g4079j38958b4593A83680H0129a86086A82127c87787A55868
9376b62051A18340l8606a70794B5555b06280A58909B115h3778q8257P0238G1997
9364B61752j24915b66951A23726b91229c0842C43906A1353b59788d4933k65227
9354c10160K2353A38569M08507F7511d87230b27018e1079A18175c3264c312l56673
9343c59985A09496c27431B2062b81307J16997A569g7878K9628k81314d8505n4783
9332a03288D25388d05073P6711C4799a17035A0547d0983j47605P0623J8864A3400
9320d7485k91829a34835B46998c84702M8846D5107J18498n9065i7611H3337h3533
9308E5092a76418j01933G3694k7478K39716a93472r8602a9107A25242A1263c29329
$$ plain form
9388 -93527 -55023 -155864 -74079 -213037 -24593 183680 80129 -186086 182127 -387787 155868
9376 -262051 118340 79734 -170794 25555 -206280 158909 2115 -83778 -172035 -101797 71997
9364 261752 136837 -266951 123726 -291229 -30842 343906 11353 -259788 -44933 -310160
9354 -310160 -287807 138569 547076 67511 -487230 -227018 -51079 118175 -33264 -3312 -359985
9343 -359985 109496 -327431 22062 -281307 -164310 1569 -77878 -48250 -329564 -48505 -103288
9332 -103288 425388 -405073 -328362 34799 -117035 10547 -40983 -188588 -117965 -99101 13400
9320 -47485 -339314 -134835 246998 -384702 -335856 45107 163605 104540 -97611 83337 -83533
9308 55092 -176418 -278351 73694 46216 285932 -193472 -292074 -19107 125242 11263 -329329
9296B55058D4808K9659g8675k73961D8815Q95P9773a9298F0515k6781q799j0771
9284A4164K01128C6163b51140A04495B7104J52723b63880A18716m0131A4849M8066
9273F2915d15187g3769j57360Q1444c4984l11861B0246c05846J20396k5850O2862
9262a48438C27101g4397E1385M8565P9595i6183c0638D8470d34892K15924b9715
9250g1911n9344a5418j10562A10063E2596a31019f3367F6865N7829a98968C53218
9238I6098b70958J30289B0842b7241C6272f3987m4690L411o7399r8210i6902A59777
9225C2738a81428b3395A38925e6822r7213j78634b9804j4471k2532I361K0206
9214B9567J83139L3889c68732h8349k25277b4348k07318M782A44317h8881A75999
$$ plain form
9296 255058 44808 74467 -78675 -352636 48815 49710 129483 -19298 60515 33734 24935 14164
9284 14164 215292 36163 -251140 104495 27104 179827 -263880 118716 78585 14849 62915
9273 62915 -415187 -73769 -231129 -149685 -34984 -346845 20246 -305846 -185450 -211300 -148438
9262 -148438 327101 -74397 51385 99950 179545 -96183 -30638 48470 -434892 -218968 -29715
9250 -71911 -131255 -15418 -125980 110063 52596 -131019 -63367 66865 124694 -198968 353218
9238 96098 -270958 -140669 20842 -27241 36272 -63987 -108677 -105266 -172665 -270875 -96902 159777
9225 32738 -181428 -23395 138925 -56822 -154035 -332669 -29804 -44275 -66807 9361 29567
9214 29567 212706 246595 -368732 -88349 -313626 -24348 -231666 -226884 144317 -88881 175999
9202b52383c6726C95988A7996d9932n3795B7205b94387R749h3856k46299h3302
9190c9044o6553m4997D1126J02421a23995f197n1180j16286f3463m1419m64862
9179e69744A48657O7118a75231e019l70845A71701d4899H5834a15067q7625B09718
9167a60573b8466H4067b27749i1021l31421b02653J4233j1134A07853b00700p0792
9156b71492i4006B06356H2240a78551M0850j23708A58802c6933m5168C8941K8598
9145F7539b29438g529m92409i8843K2305q1961r208A22271a15181p3919j98485
9134c87585B45849j1904a89594B36404a73160L0691L6824q3121L5367E9821a74206
9122B88989C3287b5396j73460o6654J4790A2675K0838J3049j5627c77576i2093
$$ plain form
9202 -252383 -36726 395988 17996 -49932 -103727 27205 -294387 -284638 -83856 -330155 -83302
9190 -39044 -105597 -150594 41126 143547 -123995 -6197 -57377 -173663 -63463 -104882 -569744
9179 -569744 148657 215775 -175231 -5019 -375864 171701 -44899 85834 -115067 -202692 209718
9167 -160573 -28466 84067 -227749 -91021 -422442 -202653 -188420 -199554 107853 -200700 -271492
9156 -271492 -94006 206356 82240 -178551 -137701 -261409 158802 -36933 -82101 38941 67539
9145 67539 -229438 -7529 -499938 -98843 -76538 -158499 -167707 122271 -115181 -189100 -387585
9134 -387585 245849 233945 -189594 236404 -173160 -142469 -105645 -188766 -153399 59821 -174206
9122 288989 33287 -25396 -198856 -265510 -250720 12675 33513 46562 30935 -377576 -92093
9110C9365Q421A211J63202f9857D5283j8641J09495a86350P0971j56677i2707
9098b7984l3908F2796g7017j07666j18675B0028L26021H8385c91698a9945k48472
9087b68417A31352a16856A908b70605e1437j50617M1273A03728b65767m6139I4543
9075a36873j14563B6847c0160j56041h5302r9252a9481A75174c86593a42505m3006
9064a85511G7756f9202k97530a50046J9751A5889c66354C1771K06892H5211d35315
9052g8217A30841a50550K3526B6752d1198r1265N9051r9581A12477b17613R8265
9041a19348j18334J04296E9532a58996I4326f6331I9696c13814K205C65524B1861
9029a50458D4402a21783B56912i6714j45864i808D365R6122h9395D7684e68923
$$ plain form
9110 39365 47786 1211 164413 -69857 45283 26642 136137 -186350 -115379 -272056 -92707
9098 -27984 -61892 62796 -77017 -184683 -303358 20028 346049 88385 -391698 -19945 -268417
9087 -268417 131352 -116856 1908 -270605 -51437 -202054 -160781 103728 -265767 -311906 94543
9075 -136873 -251436 26847 -30160 -186201 -85302 -184554 -19481 175174 -386593 -142505 -185511
9064 -185511 77756 -69202 -366732 -150046 -130295 15889 -366354 31771 238663 85211 -435315
9052 -78217 130841 -150550 -127024 26752 -41198 -132463 -73412 -172993 112477 -217613 -119348
9041 -119348 -237682 -133386 59532 -158996 94326 -66331 99696 -313814 -311609 365524 21861
9029 -150458 44402 -121783 256912 -96714 -242578 -9808 4365 100487 -89395 47684 -568923
9017b46141d986C7079a56562K5551p3779E5903K15624h9551n21489A72235c03941
9005a20903L0467r1417j00768A99761a48726B36086J66349a77148e2006b1817
8994E7729a51776b3101B0572a35498A929J26698a13310B05903e4578J6228J2599
8983b5751O326j84938H5439A4291J8013J92038f6292q0028p5853K8205f4678D0902
8970a62991l36899a86007a0525G2122a71726C52356d39417a82980O6738j9350
8960a35592j1608j29993c5834p2506j8359A54846h1326j54784A29542i5260A17985
8948c20728A1984a43866k59699h1928p7441E4996J75543j08669a43656k0228n3845
8937b17729c1755q3110d7199j68072B43530j19855J20280b19413h4619C3493O4656
$$ plain form
9017 -246141 -4986 37079 -156562 -131011 -204790 55903 271527 -89551 -611040 172235 -303941
9005 -120903 -90436 -181853 -282621 199761 -148726 236086 402435 -177148 -52006 -21817
8994 57729 -151776 -23101 20572 -135498 1929 128627 -113310 205903 -54578 -38350 -25751
8983 -25751 -19425 -204363 85439 14291 32304 224342 -66292 -146320 -222173 -193968 -64678 40902
8970 -162991 -499890 -186007 -10525 72122 -171726 352356 -439417 -182980 -116242 -135592
8960 -135592 -147200 -277193 -35834 -108340 -126699 154846 -81326 -236110 129542 -95260 117985
8948 -320728 11984 -143866 -403565 -81928 -159369 54996 230539 121870 -143656 -163884 -217729
8937 -217729 -31755 -114865 -47199 -215271 243530 123675 243955 -219413 -84619 33493 98149
8926I8149E215P3545k5117J69828A07016N27676L41799K724207L491675A856036
8915G02930k10981A20349e3914q050a0997E6957a6348A01737e3215F6859f8755
8903a61567j21633D79498c27119A46217g7752B861Q7532d10717F8594J99270A8765
8891B59804N4394a96588G1209c0274k72558a08126A1025K07122A01939j5991c02910
8879b03891k60133A12703J05762b97247c564n5652B68190r3333q6446a10353A0131
8867c22660a22188A22516D38N426J74640O4784c9378e034j77546q350h8176k50174
$$ plain form
8926 98149 5215 78760 53643 223471 107016 634692 976491 3700698 7192373 1856036
8915 702930 491949 120349 -53914 -61964 -10997 56957 -16348 101737 -53215 66859 -68755
8903 -161567 -283200 479498 -327119 146217 -77752 2861 90393 -410717 68594 267864 18765
8891 259804 314198 -196588 71209 -30274 -302832 -108126 11025 218147 101939 85948 -302910
8879 -203891 -464024 112703 218465 -297247 -3564 -59216 268190 174857 88411 -110353 10131
8867 -322660 -122188 122516 438 5864 180504 245288 -39378 -5034 -182580 -190930 -88176 -338350
$$ [...]
##END NTUPLES=NMR SPECTRUM
##END=
