
##TITLE=AC1299_CHIAH12111_6615475_XISgBI63Ux
##JCAMPDX= 6.0         $$ Bruker NMR JCAMP-DX V2.0
##DATA TYPE= NMR SPECTRUM
##DATA CLASS= NTUPLES
##ORIGIN= BRUKER
##OWNER= Administrator
$$ 1.72 TOPSPIN		Version 2.1
$$ 2012-08-02 21:13:27.921 -0500  Administrator@TOPSPIN
$$ Compression mode = diff/dup
##.OBSERVE FREQUENCY= 400.02188249412
##.OBSERVE NUCLEUS= ^1H
##.ACQUISITION MODE= SIMULTANEOUS (DQD)
##.ACQUISITION SCHEME= undefined
##.AVERAGES= 64
##.DIGITISER RES= 22
##SPECTROMETER/DATA SYSTEM= spect
##.PULSE SEQUENCE= noesygpps1d.comp
##.SOLVENT NAME= COFFEE_meoh
##.SHIFT REFERENCE= INTERNAL, COFFEE_meoh, 1, 14.96288
##AUDIT TRAIL= $$ (NUMBER, WHEN, WHO, WHERE, PROCESS, VERSION, WHAT)
$$ ##TITLE= Audit trail, TOPSPIN		Version 2.1
$$ ##JCAMPDX= 5.01
$$ ##ORIGIN= Bruker BioSpin GmbH
$$ ##OWNER= Administrator
$$ $$ C:\Bruker\TOPSPIN/data/COFFEE/nmr/AC1299_CHIAH12111_6615475_XISgBI63Ux/12/pdata/1/auditp.txt
$$ ##AUDIT TRAIL=  $$ (NUMBER, WHEN, WHO, WHERE, PROCESS, VERSION, WHAT)
(   1,<2012-08-02 21:13:22.843 -0500>,<Administrator>,<TOPSPIN>,<go>,<TOPSPIN 2.1>,
      <created by zg
	started at 2012-08-02 21:01:52.671 -0500,
	POWCHK enabled, PULCHK disabled,
       configuration hash MD5:
       6B 1B 68 BB D9 2E 58 E2 7F 35 AD 54 07 DF 0E 41
       data hash MD5: 64K
       69 89 44 66 8D A1 E8 D3 BE 75 4D C5 27 1B E4 F6>)
(   2,<2012-08-02 21:13:25.859 -0500>,<Administrator>,<TOPSPIN>,<proc1d>,<TOPSPIN 2.1>,
      <Start of raw data processing
       efp LB = 0.3 FT_mod = 6 PKNL = 1 PHC0 = 0 PHC1 = 0 SI = 128K 
       data hash MD5: 128K
       6A 8B 3D 1C 1F 7C 22 0E 60 AA AF CE 25 34 FD 50>)
(   3,<2012-08-02 21:13:27.046 -0500>,<Administrator>,<TOPSPIN>,<proc1d>,<TOPSPIN 2.1>,
      <pk PHC0 = 3.828735 PHC1 = 0 
       data hash MD5: 128K
       CE 96 52 6F 50 26 B2 79 8B F2 09 69 C2 F9 44 75>)
(   4,<2012-08-02 21:13:27.593 -0500>,<Administrator>,<TOPSPIN>,<proc1d>,<TOPSPIN 2.1>,
      <abs ABSG = 1 
       data hash MD5: 128K
       8C 16 C9 BB 7A 1C E3 BF 51 49 B3 EC 8E F7 69 C3>)
(   5,<2012-08-02 21:13:27.671 -0500>,<Administrator>,<TOPSPIN>,<proc1d>,<TOPSPIN 2.1>,
      <abs ABSG = 2 
       data hash MD5: 128K
       5B 50 F9 CE A1 ED 4D 3C EE CB DA 33 B1 D6 FA 30>)
(   6,<2012-08-02 21:13:27.718 -0500>,<Administrator>,<TOPSPIN>,<proc1d>,<TOPSPIN 2.1>,
      <abs ABSG = 3 
       data hash MD5: 128K
       6E 22 42 DE 59 7C 27 E5 00 A8 C7 E0 87 B3 28 24>)
(   7,<2012-08-02 21:13:27.781 -0500>,<Administrator>,<TOPSPIN>,<proc1d>,<TOPSPIN 2.1>,
      <abs ABSG = 4 
       data hash MD5: 128K
       A9 B7 EE B9 05 30 03 59 B3 02 9B 84 B8 C2 B1 44>)
(   8,<2012-08-02 21:13:27.828 -0500>,<Administrator>,<TOPSPIN>,<proc1d>,<TOPSPIN 2.1>,
      <abs ABSG = 5 
       data hash MD5: 128K
       34 0C 07 A5 4F A6 E0 E2 7F 77 98 7F EB 55 F4 8A>)
$$ ##END=
$$ 
$$ $$ hash MD5
$$ $$ A3 8F 1B 05 EC 45 0B 23 EE 99 63 AA B0 95 44 AD
##$RELAX= 
##$RELAX= 
##$RELAX= 
##$RELAX= 
##$RELAX= 
##$RELAX= 
##$RELAX= 
##$RELAX= 
$$ Bruker specific parameters
$$ [...]
150 150 150 150 150 150 150 150
##$TP07= 0
##$TPNAME0= <>
##$TPNAME1= <>
##$TPNAME2= <>
##$TPNAME3= <>
##$TPNAME4= <>
##$TPNAME5= <>
##$TPNAME6= <>
##$TPNAME7= <>
##$TPOAL= (0..7)
0.5 0.5 0.5 0.5 0.5 0.5 0.5 0.5
##$TPOFFS= (0..7)
0 0 0 0 0 0 0 0
##$TUNHIN= 0
##$TUNHOUT= 0
##$TUNXOUT= 0
##$USERA1= <user>
##$USERA2= <user>
##$USERA3= <user>
##$USERA4= <user>
##$USERA5= <user>
##$V9= 5
##$VALIST= <valist>
##$VCLIST= <CCCCCCCCCCCCCCC>
##$VD= 0
##$VDLIST= <DDDDDDDDDDDDDDD>
##$VPLIST= <PPPPPPPPPPPPPPP>
##$VTLIST= <TTTTTTTTTTTTTTT>
##$WBST= 1024
##$WBSW= 4
##$XGAIN= (0..3)
0 0 0 0
##$XL= 0
##$YL= 0
##$YMAX_a= 17879988
##$YMIN_a= -9833804
##$ZGOPTNS= <>
##$ZL1= 120
##$ZL2= 120
##$ZL3= 120
##$ZL4= 120
##$ABSF1= 14.96288
##$ABSF2= -5.595302
##$ABSG= 5
##$ABSL= 3
##$ALPHA= 0
##$AQORDER= 0
##$ASSFAC= 0
##$ASSFACI= 0
##$ASSFACX= 0
##$ASSWID= 0
##$AUNMP= <proc_prof1d_extract.lims>
##$AXLEFT= 0
##$AXNAME= <>
##$AXNUC= <1H>
##$AXRIGHT= 0
##$AXTYPE= 0
##$AXUNIT= <>
##$AZFE= 0.1
##$AZFW= 0.1
##$BCFW= 0
##$BC_mod= 0
##$BYTORDP= 0
##$COROFFS= 0
##$CY= 15
##$DATMOD= 1
##$DC= 0
##$DFILT= <>
##$DTYPP= 0
##$F1P= 0
##$F2P= 0
##$FCOR= 0.5
##$FTSIZE= 131072
##$FT_mod= 6
##$GAMMA= 0
##$GB= 0
##$INTBC= 1
##$INTSCL= 1
##$ISEN= 128
##$LB= 0.3
##$LEV0= 0
##$LPBIN= 0
##$MAXI= 10000
##$MC2= 0
##$MEAN= 0
##$ME_mod= 0
##$MI= 0
##$NCOEF= 0
##$NC_proc= -2
##$NLEV= 6
##$NOISF1= 0
##$NOISF2= 0
##$NSP= 0
##$NTH_PI= 0
##$NZP= 0
##$OFFSET= 14.96288
##$PC= 1
##$PHC0= 3.828735
##$PHC1= 0
##$PH_mod= 1
##$PKNL= yes
##$PPARMOD= 0
##$PPDIAG= 0
##$PPIPTYP= 0
##$PPMPNUM= 2147483647
##$PPRESOL= 1
##$PSCAL= 4
##$PSIGN= 0
##$PYNMP= <proc.py>
##$REVERSE= no
##$SF= 400.020008884813
##$SI= 131072
##$SIGF1= 0
##$SIGF2= 0
##$SINO= 400
##$SIOLD= 131072
##$SPECTYP= <>
##$SREGLST= <1H.CDCl3>
##$SSB= 0
##$STSI= 131072
##$STSR= 0
##$SW_p= 8223.68421052631
##$SYMM= 0
##$S_DEV= 0
##$TDeff= 65536
##$TDoff= 0
##$TI= <>
##$TILT= no
##$TM1= 0
##$TM2= 0
##$TOPLEV= 0
##$USERP1= <user>
##$USERP2= <user>
##$USERP3= <user>
##$USERP4= <user>
##$USERP5= <user>
##$WDW= 1
##$XDIM= 131072
##$YMAX_p= 460715117
##$YMIN_p= -11167
##$CURPLOT= <Network HP LaserJet P1505>
##$CURPRIN= <$Network HP LaserJet P1505>
##$DFORMAT= <normdp>
##$LAYOUT= <+/1D_H.xwp>
##$LFORMAT= <normlp>
##$PFORMAT= <normpl>
##$SURQMSG= 1
$$ End of Bruker specific parameters
$$ ---------------------------------
##NTUPLES= NMR SPECTRUM
##VAR_NAME=  FREQUENCY,     SPECTRUM/REAL,   SPECTRUM/IMAG
##SYMBOL=    X,             R,               I
##VAR_TYPE=  INDEPENDENT,   DEPENDENT,       DEPENDENT
##VAR_FORM=  AFFN,          ASDF,            ASDF
##VAR_DIM=   131072,        131072,          131072
##UNITS=     HZ,            ARBITRARY UNITS, ARBITRARY UNITS
##FACTOR=    0.0627417313425164, 1,          1
##FIRST=     8223.62146879497, -2085,        -59351
##LAST=      0,             -153,            -60042
##MIN=       0,             -11167,          0
##MAX=       8223.62146879497, 460715117,    0
$$ Real data points
##PAGE= N=1
##DATA TABLE= (X++(R..R)), XYDATA
$$ [...]
$$ plain form
63196 1126508 1086440 1044503 1001906 959661 918376 878644 841585 808496 779878 755356 734654
63185 734654 718033 705570 696626 690469 686946 686099 687480 690406 694680 700627 708446 717897 728533 739966
63171 739966 751906 764253 777153 790719 804633 818229 831067 843350 855607 868028 880271
63160 880271 891902 902708 912304 919661 923578 923699 920591 914656 905548 893070 878045 861689 844512
63147 844512 826618 808795 792346 777735 764274 751357 739218 728164 717840 707929 699012 691904
63135 691904 686363 681153 675453 669642 664568 660510 657129 654139 651653 649888 648850 648435 648677 649699 651438
63120 651438 653593 655915 658416 661291 664796 669213 674644 680660 686406 691321 695669 700228 705648 712238
63106 712238 720046 728762 737739 746540 755399 764739 774307 783223 790911 797600 803779 809530 814612 818927
$$ packed form
63196A126508m0068m1937m2597m2245m1285l9732l7059l3089k8618k4522k0702
63185G34654j6621j2463q944o157l523q47J381K926M274N947P819R451J0636J1433
63171G39966J1940J2347J2900J3566J3914J3596J2838J2283J2257J2421J2243
63160H80271J1631J0806R596P357L917J21l108n935r108j2478j5025j6356j7177
63147H44512j7894j7823j6449j4611j3461j2917j2139j1054j0324r911q917p108
63135F91904n541n210n700n811n074m058l381k990k486j765j038m15K42J022J739
63120F51438K155K322K501K875L505M417N431O016N746M915M348M559N420O590
63106G12238P808Q716Q977Q801Q859R340R568Q916P688O689O179N751N082M315
$$ plain form
63092 818927 822656 826053 829293 832429 835371 837888 839779 841066 842019 842897 843626 843882 843635 843489 844212 845977
63076 845977 848391 851258 854875 859435 864634 870168 876247 883274 891308 900177 909846 920326 931464 943201
63062 943201 955853 969848 985389 1002649 1022038 1043912 1068229 1094820 1123746 1155098 1188804
63051 1188804 1225023 1264433 1307655 1354648 1405027 1458666 1515476 1574846 1635819 1697673 1760002
63040 1760002 1822520 1885161 1947951 2010324 2071032 2129361 2185991 2242057 2297918 2353658 2410165
63029 2410165 2468397 2527722 2586142 2642107 2694954 2743412 2784855 2816471 2836334 2843050 2835306 2812292
63017 2812292 2774032 2721068 2654509 2576636 2490634 2399307 2304677 2209003 2115227 2025848 1942005
63006 1942005 1864233 1793513 1730930 1676724 1630355 1591281 1559317 1534487 1516861 1506240 1501788
$$ packed form
63092H18927L729L397L240L136K942K517J891J287R53Q78P29K56k47j46P23J765
63076H45977K414K867L617M560N199N534O079P027Q034Q869R669J0480J1138J1737
63062I43201J2652J3995J5541J7260J9389K1874K4317K6591K8926L1352L3706
63051A188804L6219L9410M3222M6993N0379N3639N6810N9370O0973O1854O2329
63040A760002O2518O2641O2790O2373O0708N8329N6630N6066N5861N5740N6507
63029B410165N8232N9325N8420N5965N2847M8458M1443L1616J9863O716p744k3014
63017B812292l8260n2964o6559p7873q6002r1327r4630r5674r3776q9379q3843
63006A942005p7772p0720o2583n4206m6369l9074l1964k4830j7626j0621m452
$$ plain form
62995 1501788 1502241 1506688 1514742 1525885 1539234 1554186 1570715 1588678 1607393 1626325 1645673 1665796
62983 1665796 1686435 1706906 1726637 1745074 1761431 1774930 1784991 1790840 1791353 1785728 1774006 1756526
62971 1756526 1733229 1703864 1668551 1627747 1582071 1532662 1481343 1429887 1379248 1329870 1282360
62960 1282360 1237311 1194690 1154096 1115647 1080121 1048165 1019722 994320 971600 951460 933847
62949 933847 918531 905067 893006 882110 872273 863275 854860 847041 839990 833565 827275 820805 814253
62936 814253 807743 801181 794546 788014 781611 775087 768368 761800 755730 750155 744957 740108 735490 730858
62922 730858 726209 721800 717556 712873 707328 701245 695268 689682 684447 679553 675001 670687 666612 663019
62908 663019 660052 657496 655001 652337 649367 646138 643132 640961 639636 638585 637520 636723 636230 635434 633933
$$ packed form
62995A501788M53M447Q054J1143J3349J4952J6529J7963J8715J8932J9348K0123
62983A665796K0639K0471J9731J8437J6357J3499J0061N849N13n625j1722j7480
62971A756526k3297k9365l5313m0804m5676m9409n1319n1456n0639m9378m7510
62960A282360m5049m2621m0594l8449l5526l1956k8443k5402k2720k0140j7613
62949I33847j5316j3464j2061j0896r837q998q415p819p051o425o290o470o552
62936H14253o510o562o635o532o403o524o719o568o070n575n198m849m618m632
62922G30858m649m409m244m683n545o083n977n586n235m894m552m314m075l593
62908F63019k967k556k495k664k970l229l006k171j325j051j065p97m93p96j501
$$ plain form
62893 633933 632205 630820 629480 627433 624518 621123 617407 613171 608390 603275 597889 592185 586431 581147
62879 581147 576594 572646 569174 566258 563993 562281 560794 559106 557029 554879 553242 552371 552028 551867 551627
62864 551627 550960 549607 547938 546782 546423 546217 545442 543993 542021 539504 536605 533873 531573 529278 526651
62849 526651 524108 522136 520370 518011 514870 511448 508265 505644 503789 502451 500821 498418 495862 494194
62835 494194 493575 493280 492708 491772 490471 488802 487149 486117 485890 486142 486473 486571 486043 484622 482522 480238 478131
62818 478131 476519 475854 476226 476918 477085 476785 476763 477267 477749 477761 477595 477944 479371 482137 486025 490262 494115
62801 494115 497757 502172 508098 515400 523570 532418 542032 552327 562946 573638 584684 596834 610639
62788 610639 625901 642030 658967 677307 697420 719060 742216 767770 796765 829452 865691
$$ packed form
62893F33933j728j385j340k047k915l395l716m236m781n115n386n704n754n284
62879E81147m553l948l472k916k265j712j487j688k077k150j637q71l43j61k40
62864E51627o67j353j669j156l59k06p75j449j972k517k899k732k300k295k627
62849E26651k543j972j766k359l141l422l183k621j855j338j630k403k556j668
62835D94194o19k95n72r36j301j669j653j032k27K52L31R8n28j421k100k284k107
62818D78131j612o65L72O92J67l00k2N04M82J2j66L49J427K766L888M237L853
62801D94115L642M415N926P302Q170Q848R614J0295J0619J0692J1046J2150J3805
62788F10639J5262J6129J6937J8340K0113K1640K3156K5554K8995L2687L6239
$$ plain form
62777 865691 905947 951171 1001783 1057440 1117792 1183013 1253674 1330499 1414104 1504472 1600781
62766 1600781 1701995 1807217 1914869 2021943 2124839 2220787 2307757 2383265 2444328 2488675
62756 2488675 2515242 2523315 2512108 2481663 2433590 2370403 2294403 2207414 2111327 2008548 1901933
62745 1901933 1794286 1687787 1583963 1484247 1390160 1302574 1221211 1145427 1075179 1010681 951520
62734 951520 897047 847460 803521 765083 730780 699379 670648 644629 620947 599301 579968
62723 579968 563213 548641 535609 523930 513720 504879 497125 490287 484180 478410 472666 467150 462487
62710 462487 459250 457698 457755 459017 460915 463072 465546 468731 473155 479363 487769 498478 511283 525848
62696 525848 541932 559593 579258 601371 625845 652177 680357 711293 745904 784059 824900
$$ packed form
62777H65691M0256M5224N0612N5657O0352O5221P0661P6825Q3605R0368R6309
62766A600781J01214J05222J07652J07074J02896R5948Q6970P5508O1063M4347
62756B488675K6567Q073j1207l0445m8073o3187p6000q6989r6087j02779j06615
62745A901933j07647j06499j03824r9716r4087q7586q1363p5784p0248o4498n9161
62734I51520n4473m9587m3939l8438l4303l1401k8731k6019k3682k1646j9333
62723E79968j6755j4572j3032j1679j0210q841p754o838o107n770n744n516m663
62710D62487l237j552N7J262J898K157K474L185M424O208Q406J0709J2805J4565
62696E25848J6084J7661J9665K2113K4474K6332K8180L0936L4611L8155M0841
$$ plain form
62685 824900 867922 913046 959647 1006207 1051128 1093432 1132390 1166807 1194936 1214995 1225809
62674 1225809 1227220 1219884 1204546 1181637 1151712 1115911 1075606 1031819 985442 937751 890138 843463
62662 843463 798221 755200 715306 678768 645100 613939 585408 559625 536379 515380 496371
62651 496371 478950 462723 447747 434471 423199 413849 406105 399387 392848 385896 378624 371434 364493
62638 364493 357989 352461 348098 344075 339491 334728 330964 328433 326185 323532 320665 317775 314699 311683
62624 311683 309424 307926 306326 304303 302727 302303 302454 302276 301879 302043 303090 304760 306805 309048 311197
62609 311197 313121 315145 317732 321143 325531 330920 336942 343143 349768 357662 367192 377962 389777 403011
62595 403011 417694 433234 449708 468503 490823 516300 544004 574182 608023 646171 688530
$$ packed form
62685H24900M3022M5124M6601M6560M4921M2304L8958L4417K8129K0059J0814
62674A225809J411p336j5338k2909k9925l5801m0305m3787m6377m7691m7613m6675
62662H43463m5242m3021l9894l6538l3668l1161k8531k5783k3246k0999j9009
62651D96371j7421j6227j4976j3276j1272r350p744o718o539o952p272p190o941
62638C64493o504n528m363m023m584m763l764k531k248k653k867k890l076l016
62624C11683k259j498j600k023j576m24J51j78l97J64J047J670K045K243K149
62609C11197J924K024K587L411M388N389O022O201O625P894R530J0770J1815J3234
62595D03011J4683J5540J6474J8795K2320K5477K7704L0178L3841L8148M2359
$$ plain form
62584 688530 735115 785965 840224 896285 952922 1009465 1064791 1116846 1163395 1202731 1233619
62573 1233619 1255111 1266596 1267667 1258064 1238227 1209871 1175371 1136398 1093522 1047280 999123 951020
62561 951020 904376 859641 816855 776381 738963 705042 674203 645582 618877 594591 573114
62550 573114 553942 536099 519002 502568 486759 471460 456660 442419 428778 415993 404624
62539 404624 395030 386863 379430 372469 366309 361356 357700 355112 353125 351266 349502 348349 348303 349276 350800
62524 350800 352641 354935 357838 361377 365516 370152 375131 380507 386693 394044 402447 411552 421326 432109
62510 432109 444229 457871 473272 490705 510173 531296 553645 577123 601970 628337 655821
62499 655821 683460 710230 735418 758337 777954 793211 803691 809499 810549 806467 797343 784003
$$ packed form
62584F88530M6585N0850N4259N6061N6637N6543N5326N2055M6549L9336L0888
62573A233619K1492J1485J071r603j9837k8356l4500l8973m2876m6242m8157m8103
62561I51020m6644m4735m2786m0474l7418l3921l0839k8621k6705k4286k1477
62550E73114j9172j7843j7097j6434j5809j5299j4800j4241j3641j2785j1369
62539D04624r594q167p433o961o160m953l656k588j987j859j764j153m6R73J524
62524C50800J841K294K903L539M139M636M979N376O186P351Q403R105R774J0783
62510D32109J2120J3642J5401J7433J9468K1123K2349K3478K4847K6367K7484
62499F55821K7639K6770K5188K2919J9617J5257J0480N808J050m082r124j3340
$$ plain form
62487 784003 767331 747743 725625 701786 677140 652302 627895 604856 583969 565298 548490
62476 548490 533431 520283 509053 499496 491367 484473 478603 473621 469572 466586 464873 464829 466783 470459
62462 470459 474986 479679 484543 489848 495532 501285 506928 512585 518680 525829 534279 543398 552233 560731
62448 560731 569854 580279 591621 603188 614746 626064 636385 644986 651709 656310 657835 655419 649316
62435 649316 640364 628766 614175 596837 577941 558881 540687 523980 508845 494811 481427 468844
62423 468844 457533 447766 439763 433926 430284 428051 426431 425572 426029 427610 429619 432069 435714 440873
62409 440873 447046 453842 461424 469855 478704 487615 496700 506049 515261 523690 530810 536252 539816 541495
62395 541495 541177 538525 533663 527760 522174 517044 511527 505508 500097 496043 492580 488558 484185 480896
$$ packed form
62487G84003j6672j9588k2118k3839k4646k4838k4407k3039k0887j8671j6808
62476E48490j5059j3148j1230r557q129o894n870m982m049k986j713m4J954L676
62462D70459M527M693M864N305N684N753N643N657O095P149Q450R119Q835Q498
62448E60731R123J0425J1342J1567J1558J1318J0321Q601O723M601J525k416o103
62435F49316q952j1598j4591j7338j8896j9060j8194j6707j5135j4034j3384j2583
62423D68844j1311r767q003n837l642k233j620q59M57J581K009K450L645N159
62409D40873O173O796P582Q431Q849Q911R085R349R212Q429P120N442L564J679
62395E41495l18k652m862n903n586n130n517o019n411m054l463m022m373l289
$$ plain form
62381 480896 479742 480601 482879 486396 491435 498277 506937 517326 529564 544009 560937 580348 602295
62368 602295 627217 655526 686897 720431 755628 792906 833027 876365 922768 971714 1022330
62357 1022330 1073598 1124824 1175685 1225559 1273057 1316466 1354411 1385794 1409324 1423662 1428228
62346 1428228 1423620 1411211 1392505 1368916 1341802 1312245 1280750 1247339 1212049 1175237 1137431
62335 1137431 1099179 1061251 1024737 990625 959297 930623 904344 880048 857011 834576 812738
62324 812738 791863 771912 752549 734092 717636 703813 691992 681042 670451 660324 650875 642396
62312 642396 635215 629044 622761 615482 607563 599941 592731 585193 576871 568060 559212 550563 542392 535030
62298 535030 528519 522713 517705 513685 510401 507335 504503 502651 502524 504293 507692 512277 517553 523254
$$ packed form
62381D80896j154Q59K278L517N039O842Q660J0389J2238J4445J6928J9411K1947
62368F02295K4922K8309L1371L3534L5197L7278M0121M3338M6403M8946N0616
62357A022330N1268N1226N0861M9874M7498M3409L7945L1383K3530J4338M566
62346A428228m608j2409j8706k3589k7114k9557l1495l3411l5290l6812l7806
62335A137431l8252l7928l6514l4112l1328k8674k6279k4296k3037k2435k1838
62324H12738k0875j9951j9363j8457j6456j3823j1821j0950j0591j0127r449q479
62312F42396p181o171o283p279p919p622p210p538q322q811q848q649q171p362
62298E35030o511n806n008m020l284l066k832j852j27J769L399M585N276N701
$$ plain form
62284 523254 529602 536962 545251 554091 563476 573798 585139 597008 608980 621188 633926 647025
62272 647025 659902 672196 684253 697005 711279 727156 744131 761930 780898 801492 823835
62261 823835 848105 875001 905344 939511 977598 1019811 1066144 1115987 1168550 1223295 1279187
62250 1279187 1333700 1383405 1425602 1458787 1481778 1493424 1493552 1483511 1465359 1440757 1410643 1375472
62238 1375472 1335543 1291475 1244474 1195885 1146652 1097636 1050255 1006067 965677 928710 894933
62227 894933 864722 838268 815048 794388 776024 759865 745720 733530 723380 715014 707773 701241
62215 701241 695527 690760 686798 683654 681700 681105 681464 682271 683409 684956 686904 689337 692530 696613 701466
62200 701466 707143 714017 722208 731268 740789 751085 762956 776922 792837 810126 828299 847408
$$ packed form
62284E23254O348P360Q289Q840R385J0322J1341J1869J1972J2208J2738J3099
62272F47025J2877J2294J2057J2752J4274J5877J6975J7799J8968K0594K2343
62261H23835K4270K6896L0343L4167L8087M2213M6333M9843N2563N4745N5892
62250A279187N4513M9705M2197L3185K2991J1646J28j0041j8152k4602l0114l5171
62238A375472l9929m4068m7001m8589m9233m9016m7381m4188m0390l6967l3777
62227H94933l0211k6454k3220k0660j8364j6159j4145j2190j0150q366p241o532
62215G01241n714m767l962l144j954n95L59Q07J138J547J948K433L193M083M853
62200G01466N677O874Q191R060R521J0296J1871J3966J5915J7289J8173J9109
$$ plain form
62188 847408 868042 890620 914778 939771 965328 991536 1017820 1042590 1064169 1081743 1095475
62177 1095475 1106311 1115741 1124992 1134086 1142240 1149547 1157668 1168466 1182533 1199582 1219735 1243732
62165 1243732 1272131 1304933 1341747 1381615 1422692 1462644 1499569 1532336 1560159 1582257 1598041
62154 1598041 1607374 1610633 1608743 1603103 1595110 1585435 1573756 1559306 1541807 1521936 1500937 1479847
62142 1479847 1459211 1439471 1421271 1405182 1391356 1379658 1369828 1361243 1352863 1343974 1334848 1326214
62130 1326214 1318297 1310861 1304024 1298328 1294096 1291376 1290522 1292025 1295658 1300564 1306373 1313538 1322314 1332196
62116 1332196 1342810 1354636 1368282 1383590 1400069 1417732 1436857 1457190 1478065 1499198 1520931
62105 1520931 1543730 1567772 1592944 1618953 1645544 1672771 1700941 1730214 1760550 1792207 1825919
$$ packed form
62188H47408K0634K2578K4158K4993K5557K6208K6284K4770K1579J7574J3732
62177A095475J0836R430R251R094Q154P307Q121J0798J4067J7049K0153K3997
62165A243732K8399L2802L6814L9868M1077L9952L6925L2767K7823K2098J5784
62154A598041R333L259j890n640p993r675j1679j4450j7499j9871k0999k1090
62142A479847k0636j9740j8200j6089j3826j1698r830q585q380q889r126q634
62130A326214p917p436o837n696m232k720q54J503L633M906N809P165Q776R882
62116A332196J0614J1826J3646J5308J6479J7663J9125K0333K0875K1133K1733
62105A520931K2799K4042K5172K6009K6591K7227K8170K9273L0336L1657L3712
$$ plain form
62094 1825919 1862190 1900630 1940250 1980364 2021133 2063542 2108944 2158277 2211404 2267331 2324959
62083 2324959 2383209 2440454 2494711 2545076 2592713 2640020 2689034 2740774 2795386 2851926 2907969
62072 2907969 2960197 3006022 3044952 3078622 3109666 3140354 3172019 3205571 3242232 3283287 3328992
62061 3328992 3378075 3428457 3478191 3525721 3569824 3609812 3645690 3677812 3706449 3731794 3754217
62050 3754217 3774344 3792896 3810273 3826044 3839023 3848308 3854268 3858169 3860956 3862860 3864072 3865040 3865976
62037 3865976 3866722 3867304 3868051 3868966 3869582 3869582 3868922 3867236 3863917 3859011 3853194 3846502 3838023 3827431 3815886 3804637
62021 3804637 3793486 3781521 3768715 3755784 3742939 3729912 3717034 3705211 3694766 3685170 3676084 3667938
62009 3667938 3661271 3656058 3651978 3649029 3647716 3648775 3652682 3659256 3667881 3678325 3691025 3706272 3723489
$$ packed form
62094A825919L6271L8440L9620M0114M0769M2409M5402M9333N3127N5927N7628
62083B324959N8250N7245N4257N0365M7637M7307M9014N1740N4612N6540N6043
62072B907969N2228M5825L8930L3670L1044L0688L1665L3552L6661M1055M5705
62061C328992M9083N0382M9734M7530M4103L9988L5878L2122K8637K5345K2423
62050C754217K0127J8552J7377J5771J2979R285N960L901K787J904J212R68R36
62037C865976P46N82P47R15O16%o60j686l319m906n817o692q479j0592j1545j1249
62021C804637j1151j1965j2806j2931j2845j3027j2878j1823j0445r596r086q146
62009C667938o667n213m080k949j313J059L907O574Q625J0444J2700J5247J7217
$$ plain form
61996 3723489 3741676 3760234 3778733 3796138 3810846 3821440 3826984 3826785 3820485 3808351 3791028 3769064
61984 3769064 3743109 3714422 3684537 3654319 3623751 3592629 3560969 3528757 3495847 3462277 3428390
61973 3428390 3394484 3360600 3326675 3292622 3258287 3223563 3188569 3153513 3118517 3083888 3050427
61962 3050427 3018967 2989508 2961224 2933415 2906124 2879722 2854271 2829608 2805873 2783554 2762986
61951 2762986 2743996 2726154 2709227 2693247 2678236 2664271 2651916 2642222 2635865 2632398 2630668 2629830
61939 2629830 2629665 2630208 2631719 2634895 2640403 2648083 2657208 2667610 2679867 2694314 2710674 2728980 2750026
61926 2750026 2774503 2802388 2833691 2869056 2909021 2953370 3002036 3056207 3117885 3188785 3270384
61915 3270384 3364542 3473255 3598128 3740978 3904778 4093214 4309459 4556209 4836930 5156369
$$ packed form
61996C723489J8187J8558J8499J7405J4708J0594N544j99o300j2134j7323k1964
61984C769064k5955k8687k9885l0218l0568l1122l1660l2212l2910l3570l3887
61973C428390l3906l3884l3925l4053l4335l4724l4994l5056l4996l4629l3461
61962C050427l1460k9459k8284k7809k7291k6402k5451k4663k3735k2319k0568
61951B762986j8990j7842j6927j5980j5011j3965j2355r694o357l467j730q38
61939B629830j65N43J511L176N508P680R125J0402J2257J4447J6360J8306K1046
61926B750026K4477K7885L1303L5365L9965M4349M8666N4171O1678P0900Q1599
61915C270384R4158J08713J24873J42850J63800J88436K16245K46750K80721L19439
$$ plain form
61905 5156369 5519849 5932773 6400893 6930394 7527283 8196602 8941263 9759637 10641984
61896 10641984 11567021 12499740 13391253 14182159 14810492 15222697 15383861 15283888 14938168
61887 14938168 14382857 13666420 12840583 11953605 11046644 10152266 9294354 8489009 7745732
61878 7745732 7068535 6457354 5909763 5421989 4988925 4604460 4262870 3959751 3691245
61869 3691245 3452988 3240602 3050895 2881766 2731139 2596694 2476456 2368808 2272073 2184877
61859 2184877 2106843 2038066 1977813 1924447 1876783 1834781 1798730 1768357 1743018 1722207 1705552
61848 1705552 1692582 1682696 1675212 1669413 1664823 1661350 1658942 1657227 1655715 1654076 1651878 1648486 1643828 1639000
61834 1639000 1635465 1633772 1633583 1634649 1637023 1640524 1644862 1650238 1657009 1664693 1672086 1678548 1684496 1690448
$$ packed form
61905E156369L63480M12924M68120N29501N96889O69319P44661Q18374Q82347
61896A0641984R25037R32719Q91513P90906O28333M12205J61164r9973l45720
61887A4938168n55311p16437q25837q86978r06961q94378q57912q05345p43277
61878G745732o77197o11181n47591m87774m33064l84465l41590l03119k68506
61869C691245k38257k12386j89707j69129j50627j34445j20238j07648r6735q7196
61859B184877p8034o8777o0253n3366m7664m2002l6051l0373k5339k0811j6655
61848A705552j2970r886p484n799m590l473k408j715j512j639k198l392m658m828
61834A639000l535j693j89J066K374L501M338N376O771P684P393O462N948N952
$$ plain form
61820 1690448 1696281 1701669 1706613 1711267 1715755 1720472 1726127 1733246 1741981 1752615 1765856 1782409 1802541
61807 1802541 1826216 1853404 1884153 1918634 1957227 2000382 2048410 2101566 2160196 2224586 2294939
61796 2294939 2371796 2456168 2548826 2649760 2758886 2876980 3005396 3145228 3297515 3464102
61786 3464102 3647515 3850098 4074094 4322553 4599381 4908495 5253758 5639897 6072844
61777 6072844 6559081 7105416 7719570 8410430 9187688 10061870 11044493 12146769 13376795
61768 13376795 14736894 16221211 17811682 19471969 21142349 22739092 24160161 25297763
61760 25297763 26056447 26371784 26222439 25631557 24659014 23388553 21913206 20322184 18692304
61751 18692304 17084656 15544385 14101529 12772871 11565000 10477481 9505233 8640395
$$ packed form
61820A690448N833N388M944M654M488M717N655P119Q735J0634J3241J6553K0132
61807A802541K3675K7188L0749L4481L8593M3155M8028N3156N8630O4390P0353
61796B294939P6857Q4372R2658J00934J09126J18094J28416J39832J52287J66587
61786C464102J83413K02583K23996K48459K76828L09114L45263L86139M32947
61777F072844M86237N46335O14154O90860P77258Q74182R82623J102276J230026
61768A3376795J360099J484317J590471J660287J670380J596743J421069J137602
61760B5297763P58684L15337j49345n90882r72543j270461j475347j591022j629880
61751A8692304j607648j540271j442856j328658j207871j087519r72248q64838
$$ plain form
61743 8640395 7873841 7195832 6596085 6064409 5591914 5171463 4797052 4463349 4165803
61734 4165803 3900357 3662791 3449031 3256349 3083534 2929516 2792317 2669519 2559083
61725 2559083 2459364 2369011 2287203 2213406 2146543 2084943 2027370 1973482 1923079 1875666 1831143
61714 1831143 1790092 1752807 1718673 1687041 1658109 1632356 1609602 1589102 1570072 1551717 1533369
61703 1533369 1515161 1497952 1482000 1466243 1449463 1431540 1412900 1393413 1372762 1351487 1330669
61692 1330669 1310764 1291514 1272869 1255176 1238491 1222426 1206711 1191422 1176661 1162493 1149110
61681 1149110 1136596 1124659 1113130 1102613 1094035 1087482 1082022 1076802 1071916 1068027 1065440 1063686 1061877
61668 1061877 1059430 1056601 1054289 1053191 1053172 1053522 1053625 1053213 1052137 1050222 1047377 1043804 1040049 1036711 1033881
$$ packed form
61743H640395p66554o78009n99747n31676m72495m20451l74411l33703k97546
61734D165803k65446k37566k13760j92682j72815j54018j37199j22798j10436
61725B559083r9719r0353q1808p3797o6863o1600n7573n3888n0403m7413m4523
61714A831143m1051l7285l4134l1632k8932k5753k2754k0500j9030j8355j8348
61703A533369j8208j7209j5952j5757j6780j7923j8640j9487k0651k1275k0818
61692A330669j9905j9250j8645j7693j6685j6065j5715j5289j4761j4168j3383
61681A149110j2514j1937j1529j0517q578o553n460n220m886l889k587j754j809
61668A061877k447k829k312j098j9L50J03m12j076j915k845l573l755l338k830
$$ plain form
61653 1033881 1031031 1027729 1024298 1021273 1018325 1014503 1009683 1004954 1001178 997893 994216 990142 986208 982391
61639 982391 978320 974382 971702 970904 971591 973180 975608 978952 982911 987147 991866 997667 1004872 1013262 1022442
61624 1022442 1032156 1042037 1051261 1058826 1064285 1068016 1070621 1072318 1073051 1072893 1072032 1070595 1068795 1066942 1064912
61609 1064912 1061904 1057306 1051601 1045771 1040019 1033748 1026667 1019071 1011032 1002271 992994 983952 975366 966623
61595 966623 957391 948286 940008 932581 925852 920032 915259 911323 908281 906726 906918 908368 910769 914580
61581 914580 920044 926430 933073 940544 949926 961555 975419 992203 1012669 1036163 1060843 1085571
61569 1085571 1110801 1137639 1166758 1198239 1231673 1266224 1301215 1336796 1373522 1411258 1448997
61558 1448997 1485792 1521273 1555143 1586841 1616070 1643271 1669178 1694053 1717517 1738981 1758056
$$ packed form
61653A033881k850l302l431l025k948l822m820m729l776l285l677m074l934l817
61639I82391m071l938k680p98O87J589K428L344L959M236M719N801P205Q390R180
61624A022442R714R881R224P565N459L731K605J697P33j58q61j437j800j853k030
61609A064912l008m598n705n830n752o271p081p596q039q761r277r042q586q743
61595I66623r232r105q278p427o729n820m773l936l042j555J92J450K401L811
61581I14580N464O386O643P471R382J1629J3864J6784K0466K3494K4680K4728
61569A085571K5230K6838K9119L1481L3434L4551L4991L5581L6726L7736L7739
61558A448997L6795L5481L3870L1698K9229K7201K5907K4875K3464K1464J9075
$$ plain form
61547 1758056 1774577 1788281 1798535 1804523 1805768 1802345 1794605 1782950 1767978 1750506 1731187 1710329
61535 1710329 1688226 1665410 1642480 1620052 1599025 1580442 1564756 1551582 1540478 1531620 1525440 1522054
61523 1522054 1521435 1523839 1529573 1538665 1551207 1567779 1589147 1615788 1648119 1686919 1733045 1786857
61511 1786857 1848380 1917965 1996581 2085653 2186785 2301390 2430320 2574206 2734346 2912894
61501 2912894 3111867 3332371 3574957 3839913 4126274 4430483 4746070 5063917 5372226
61492 5372226 5656992 5903932 6100886 6238987 6312907 6321419 6267993 6160192 6007989 5822169
61482 5822169 5613230 5390501 5161778 4933692 4711968 4500977 4303477 4121286 3955908
61473 3955908 3808215 3678170 3565554 3470576 3393080 3331723 3284899 3252211 3234046 3229758 3237343
$$ packed form
61547A758056J6521J3704J0254N988J245l423p740j1655j4972j7472j9319k0858
61535A710329k2103k2816k2930k2428k1027j8583j5686j3174j1104q858o180l386
61523A522054o19K404N734R092J2542J6572K1368K6641L2331L8800M6126N3812
61511A786857O1523O9585P8616Q9072J01132J14605J28930J43886J60140J78548
61501B912894J98973K20504K42586K64956K86361L04209L15587L17847L08309
61492E372226K84766K46940J96954J38101P3920Q512n3426j07801j52203j85820
61482E822169k08939k22729k28723k28086k21724k10991j97500j82191j65378
61473C955908j47693j30045j12616r4978p7496o1357m6824l2688j8165m288P585
$$ plain form
61462 3237343 3255000 3282142 3318556 3363341 3415041 3472246 3533605 3597556 3662477 3726961 3789842
61451 3789842 3850093 3906908 3959881 4009225 4055882 4101207 4146298 4191683 4237702 4284927 4333982
61440 4333982 4385216 4438709 4494252 4551067 4607830 4663111 4715456 4763049 4804098 4837918 4864979
61429 4864979 4885355 4897805 4900909 4894409 4878690 4853678 4819354 4776992 4728850 4676843 4622400 4567349
61417 4567349 4513865 4463486 4416935 4374885 4338135 4307069 4281733 4262437 4249578 4242891 4241579 4245055
61405 4245055 4252728 4263050 4273657 4282543 4288435 4290061 4286040 4275836 4260111 4239924 4216276 4190689
61393 4190689 4165571 4143606 4127186 4118540 4119819 4132804 4159073 4200673 4260161 4339720 4440662
61382 4440662 4563908 4710469 4881271 5077009 5298432 5546170 5819750 6116894 6433882
$$ packed form
61462C237343J7657K7142L6414M4785N1700N7205O1359O3951O4921O4484O2881
61451C789842O0251N6815N2973M9344M6657M5325M5091M5385M6019M7225M9055
61440D333982N1234N3493N5543N6815N6763N5281N2345M7593M1049L3820K7061
61429D864979K0376J2450L104o500j5719k5012l4324m2362m8142n2007n4443n5051
61417D567349n3484n0379m6551m2050l6750l1066k5336j9296j2859o687j312L476
61405D245055P673J0322J0607Q886N892J626m021j0204j5725k0187k3648k5587
61393D190689k5118k1965j6420q646J279J2985K6269M1600N9488P9559J00942
61382D440662J23246J46561J70802J95738K21423K47738K73580K97144L16988
$$ plain form
61373 6433882 6766018 7106929 7447137 7773552 8070972 8324955 8524315 8661965 8734606 8742682
61363 8742682 8690609 8585742 8435783 8246873 8024035 7772610 7498500 7207520 6905346 6597737
61353 6597737 6289966 5986140 5689747 5404515 5133808 4879268 4640948 4418817 4213466
61344 4213466 4025521 3855339 3703300 3569497 3452970 3352083 3265910 3194543 3137892 3094986
61334 3094986 3064677 3046285 3039161 3042294 3054817 3076419 3106842 3145277 3190451 3241008 3295638 3353153
61322 3353153 3412593 3473047 3533436 3592765 3650413 3705751 3757651 3805001 3847579 3885901 3920358
61311 3920358 3951183 3979031 4004710 4028216 4048703 4065410 4077846 4085088 4085877 4079746 4067400 4049719
61299 4049719 4027017 3999461 3967369 3930734 3889031 3841919 3789718 3733043 3672500 3608968 3543618
$$ packed form
61373F433882L32136L40911L40208L26415K97420K53983J99360J37650P2641Q076
61363H742682n2073j04867j49959j88910k22838k51425k74110k90980l02174l07609
61353F597737l07771l03826k96393k85232k70707k54540k38320k22131k05351
61344D213466j87945j70182j52039j33803j16527j00887q6173p1367n6651m2906
61334C094986l0309j8392p124L133J2523K1602L0423L8435M5174N0557N4630N7515
61322C353153N9440O0454O0389N9329N7648N5338N1900M7350M2578L8322L4457
61311C920358L0825K7848K5679K3506K0487J6707J2436P242P89o131j2346j7681
61299D049719k2702k7556l2092l6635m1703m7112n2201n6675o0543o3532o5350
$$ plain form
61288 3543618 3477485 3411521 3347149 3286013 3228936 3175847 3127063 3083963 3047900 3018961 2996245
61277 2996245 2978862 2966146 2957308 2951456 2947762 2945168 2942086 2936831 2928465 2917136 2903676 2888911 2873251
61264 2873251 2856858 2840168 2824050 2809341 2796447 2785601 2777253 2772076 2771140 2776442 2790698 2815935
61252 2815935 2852663 2900974 2961895 3036806 3126037 3229075 3345840 3476548 3620213 3774078
61242 3774078 3934206 4095335 4250017 4389075 4503479 4585444 4628320 4627212 4580609 4490930
61232 4490930 4363322 4204584 4023074 3828083 3628210 3430337 3239787 3060337 2893864
61223 2893864 2740979 2602415 2479062 2370575 2275021 2190262 2114910 2047875 1988203 1935689
61213 1935689 1890573 1852212 1819141 1790738 1767620 1749841 1735999 1724881 1716906 1713130 1713866 1719072
$$ packed form
61288C543618o6133o5964o4372o1136n7077n3089m8784m3100l6063k8939k2716
61277B996245j7383j2716q838n852l694k594l082n255q366j1329j3460j4765j5660
61264B873251j6393j6690j6118j4709j2894j0846q348n177r36N302J4256K5237
61252B815935L6728M8311O0921P4911Q9231J03038J16765J30708J43665J53865
61242C774078J60128J61129J54682J39058J14404Q1965M2876j108m6603q9679
61232D490930j27608j58738j81510j94991j99873j97873j90550j79450j66473
61223B893864j52885j38564j23353j08487r5554q4759p5352o7035n9672n2514
61213A935689m5116l8361l3071k8403k3118j7779j3842j1118p975l776P36N206
$$ plain form
61201 1719072 1728927 1742898 1759106 1775808 1792904 1810971 1829341 1846167 1859960 1870187 1876838 1880458
61189 1880458 1882357 1883809 1884950 1884880 1882591 1877443 1869227 1858364 1845623 1831194 1814551 1795760 1776170
61176 1776170 1757035 1738024 1717910 1696317 1673906 1651253 1628386 1605239 1581723 1557487 1532243
61165 1532243 1506185 1479510 1451788 1422411 1391454 1359497 1326894 1293846 1260981 1229163 1198827
61154 1198827 1170051 1143103 1118245 1095050 1072417 1049302 1025149 999838 973750 947800 922999
61143 922999 899935 878852 859903 843014 827855 814409 803310 795091 789295 784876 781430 779560
61131 779560 779966 782550 786533 791231 796647 803263 811273 820117 828994 837734 846824 856726 867617 879733
61117 879733 893275 907823 922465 936863 951717 967892 985481 1003923 1022580 1040920 1058487
$$ packed form
61201A719072R855J3971J6208J6702J7096J8067J8370J6826J3793J0227O651L620
61189A880458J899J452J141p0k289n148q216j0863j2741j4429j6643j8791j9590
61176A776170j9135j9011k0114k1593k2411k2653k2867k3147k3516k4236k5244
61165A532243k6058k6675k7722k9377l0957l1957l2603l3048l2865l1818l0336
61154A198827k8776k6948k4858k3195k2633k3115k4153k5311k6088k5950k4801
61143I22999k3064k1083j8949j6889j5159j3446j1099q219n796m419l446j870
61131G79560M06K584L983M698N416O616Q010Q844Q877Q740R090R902J0891J2116
61117H79733J3542J4548J4642J4398J4854J6175J7589J8442J8657J8340J7567
$$ plain form
61106 1058487 1074898 1089575 1101498 1109768 1114438 1116213 1115325 1111412 1104622 1095969 1086291 1075654 1064135
61093 1064135 1052393 1040929 1029472 1017641 1005672 993969 982389 970522 958374 946379 934994
61082 934994 924527 914968 905885 896838 887918 879406 871059 862466 854024 846597 840163 833861 827585 822406
61068 822406 818978 816577 814174 811445 808127 803442 796974 789379 781541 773659 765697 757972 750732 743815
61054 743815 737252 731476 726503 721698 716919 713112 711250 711358 712956 715581 718494 720963 723494 727820
61040 727820 734909 743806 753050 762349 772186 782673 793553 804607 815446 825597 835253 845068 854876
61027 854876 863688 871451 879543 888857 898564 907507 915694 923680 931707 940235 950116 961408 973215 985455
61013 985455 999402 1015656 1033117 1051031 1070453 1092365 1115844 1139636 1164215 1190770 1219398
$$ packed form
61106A058487J6411J4677J1923Q270M670J775q88l913o790q653r678j0637j1519
61093A064135j1742j1464j1457j1831j1969j1703j1580j1867j2148j1995j1385
61082I34994j0467r559r083r047q920q512q347q593q442p427o434o302o276n179
61068H22406l428k401k403k729l318m685o468p595p838p882p962p725p240o917
61054G43815o563n776m973m805m779l807j862J08J598K625K913K469K531M326
61040G27820P089Q897R244R299R837J0487J0880J1054J0839J0151R656R815R808
61027H54876Q812P763Q092R314R707Q943Q187P986Q027Q528R881J1292J1807J2240
61013I85455J3947J6254J7461J7914J9422K1912K3479K3792K4579K6555K8628
$$ plain form
61002 1219398 1249970 1283703 1322172 1365581 1413495 1466424 1525231 1589655 1658677 1731497 1807190
60991 1807190 1884672 1964348 2048822 2140957 2242494 2355377 2482432 2625237 2782997 2954943
60981 2954943 3142192 3346645 3571380 3824346 4118647 4466777 4877658 5362021 5937018
60972 5937018 6622972 7442149 8428172 9634464 11130605 12999266 15339116 18232011 21633910
60963 21633910 25250344 28546923 30966351 32217150 32402850 31908303 31186750 30630625 30538808
60954 30538808 31059476 32070893 33133933 33651371 33167606 31581759 29125308 26174061
60946 26174061 23072701 20066367 17305874 14865958 12762645 10977773 9481411 8239413
60938 8239413 7213223 6364727 5662896 5083025 4601875 4197440 3852083 3552640 3288542
$$ packed form
61002A219398L0572L3733L8469M3409M7914N2929N8807O4424O9022P2820P5693
60991A807190P7482P9676Q4474R2135J01537J12883J27055J42805J57760J71946
60981B954943J87249K04453K24735K52966K94301L48130M10881M84363N74997
60972E937018O85954Q19177R86023J206292J496141J868661K339850K892895L401899
60963B1633910L616434L296579K419428J250799J85700m94547p21553n56125r1817
60954C0538808N20668J011417J063040N17438m83765j585847k456451k951247
60946B6174061l101360l006334k760493k439916k103313j784872j496362j241998
60938H239413j026190q48496p01831n79871m81150m04435l45357k99443k64098
$$ plain form
60929 3288542 3052206 2839724 2648496 2474955 2316175 2171829 2042342 1926542 1823091
60920 1823091 1732337 1654135 1585040 1520154 1456944 1395339 1335285 1276615 1220455 1168293 1119953
60909 1119953 1074305 1031538 992959 958965 928890 902397 879379 858867 839599 821542 805564
60898 805564 791880 779925 769340 760038 751768 744669 739684 737399 737016 737432 738631 741036 744265 747668
60884 747668 751410 755923 760948 766066 771364 776515 780126 781219 780659 779968 779443 778487 776916 774714 771348
60869 771348 766599 761350 756354 751003 744584 737822 731826 726350 720591 714879 709991 705503 700580 695825
60855 695825 692678 691312 690793 690992 692648 695655 698925 701998 705443 709675 714696 721007 729460 740069
60841 740069 752038 764915 778711 792981 806929 820414 833902 847453 860568 872805 883694
$$ packed form
60929C288542k36336k12482j91228j73541j58780j44346j29487j15800j03451
60920A823091r0754p8202o9095o4886o3210o1605o0054n8670n6160n2162m8340
60909A119953m5648m2767l8579l3994l0075k6493k3018k0512j9268j8057j5978
60898H05564j3684j1955j0585r302q270p099m985k285l83M16J199K405L229L403
60884G47668L742M513N025N118N298N151L611J093n60o91n25r56j571k202l366
60869G71348m749n249m996n351o419o762n996n476n759n712m888m488m923m755
60855F95825l147j366n19J99J656L007L270L073L445M232N021O311Q453J0609
60841G40069J1969J2877J3796J4270J3948J3485J3488J3551J3115J2237J0889
$$ plain form
60830 883694 892428 898711 903597 908498 913698 918853 924388 931000 938116 944261 948853 952330 954672 955303
60816 955303 954493 953360 952206 950094 946462 941995 937544 933116 928279 922735 916183 908457 900008 891561
60802 891561 883128 874058 864145 853954 843946 834063 824291 814930 806084 797495 789074 781274 774911 770889
60788 770889 769684 770618 772076 773169 774788 778358 784030 790984 798939 808159 818309 828645 839312 851273
60774 851273 864807 879045 893098 906672 919601 931815 943903 956602 969431 980739 989451 996013
60762 996013 1001385 1005916 1009498 1012110 1013749 1014365 1014128 1013416 1012429 1011230 1010123 1009487 1009220 1008878 1008361 1008047
60746 1008047 1008411 1009973 1013312 1018389 1023953 1028285 1030481 1030506 1028404 1024332 1019183 1014063 1009020 1003128 996027
60731 996027 988606 981922 976025 970162 963655 956367 948703 941318 934640 928730 923720 920066 918027 917263
$$ packed form
60830H83694Q734O283M886M901N200N155N535O612P116O145M592L477K342O31
60816I55303q10j133j154k112l632m467m451m428m837n544o552p726q449q447
60802H91561q433r070r913j0191j0008r883r772r361q846q589q421p800o363m022
60788G70889j205R34J458J093J619L570N672O954P955R220J0150J0336J0667J1961
60774H51273J3534J4238J4053J3574J2929J2214J2088J2699J2829J1308Q712O562
60762I96013N372M531L582K612J639O16k37p12r87j199j107o36k67l42n17l14
60746A008047L64J562L339N077N564M332K196K5k102m072n149n120n043n892p101
60731I96027p421o684n897n863o507p288p664p385o678n910n010l654k039p64
$$ plain form
60717 917263 917320 918098 919379 920391 920448 919542 917783 914783 910272 904671 898245 890393 880802 870661 861461
60702 861461 853049 844239 835068 826980 820802 815937 811802 808823 807623 808162 809971 812440 814677 815875
60688 815875 815952 815165 813165 809290 803707 797355 790717 783543 775692 767276 758011 747533 736421 725925
60674 725925 716537 707837 699774 692948 687502 682879 678942 676141 674304 672463 670358 668957 668907 669464 669625
60659 669625 669370 669103 668690 667873 667003 666628 666785 667257 668057 669158 670267 671389 673205 676360 680672 685420
60643 685420 690115 694615 698787 702437 705407 707605 709103 710279 711639 713558 716403 720696 726609 733556
60629 733556 740891 748874 758312 769368 781554 794734 809170 824538 839904 854972 870455 886839
60617 886839 903527 919583 934597 948463 961044 972461 983008 992261 998834 1001632 1001061 998682 995977
$$ packed form
60717I17263N7P78J281J012N7r06j759l000m511n601o426p852r591j0141r200
60702H61461q412q810r171q088o178m865m135k979j200N39J809K469K237J198
60688H15875P7p87k000l875n583o352o638p174p851q416r265j0478j1112j0496
60674G25925r388q700q063o826n446m623l937k801j837j841k105j401n0N57J61
60659F69625k55k67m13q17q70l75J57M72Q00J101J109J122J816L155M312M748
60643F85420M695M500M172L650K970K198J498J176J360J919K845M293N913O947
60629G33556P335P983R438J1056J2186J3180J4436J5368J5366J5068J5483J6384
60617H86839J6688J6056J5014J3866J2581J1417J0547R253O573K798n71k379k705
$$ plain form
60604 995977 993701 991985 990647 989571 988955 988958 989102 988391 986052 981783 975388 966709 956071 944257 931883
60589 931883 919173 906432 894360 883801 875417 869491 865630 862817 860217 857758 855566 853196 850071
60576 850071 846322 842460 838463 834031 829526 825755 822994 821088 820314 821152 823308 826063 829514 834354 840343
60561 840343 846231 851386 856374 861643 866766 871348 875536 879196 881611 882661 883388 884842 887093 889884
60547 889884 893485 898342 904578 912284 921662 932492 944257 957302 973136 993095 1017438 1046335
60535 1046335 1081130 1123887 1176008 1237558 1307088 1381272 1454926 1522078 1577300 1616324 1636248
60524 1636248 1635841 1615739 1578451 1528360 1471263 1412851 1357153 1306535 1262721 1227002 1199652 1180204
60512 1180204 1168389 1164005 1166019 1172832 1183464 1197354 1212969 1228003 1241332 1253670 1265968 1278525
$$ packed form
60604I95977k276j716j338j076o16LJ44p11k339m269o395q679j0638j1814j2374
60589I31883j2710j2741j2072j0559q384n926l861k813k600k459k192k370l125
60576H50071l749l862l997m432m505l771k761j906p74Q38K156K755L451M840N989
60561H40343N888N155M988N269N123M582M188L660K415J050P27J454K251K791
60547H89884L601M857O236P706R378J0830J1765J3045J5834J9959K4343K8897
60535A046335L4795M2757N2121O1550O9530P4184P3654O7152N5222L9024J9924
60524A636248m07k0102l7288n0091n7097n8412n5698n0618m3814l5719k7350j9448
60512A180204j1815m384K014O813J0632J3890J5615J5034J3329J2338J2298J2557
$$ plain form
60500 1278525 1292149 1308920 1331004 1359698 1396196 1442161 1498901 1567177 1648657 1746410 1863027
60489 1863027 1999231 2155232 2332181 2530934 2750411 2988974 3247305 3528950 3838563
60480 3838563 4180536 4557698 4967507 5396759 5819704 6202191 6508991 6709985 6783781 6720085
60470 6720085 6521772 6205782 5800788 5341195 4859961 4383856 3932183 3517175 3144703
60461 3144703 2815758 2528617 2280249 2066502 1882524 1723999 1587761 1471033 1370806
60452 1370806 1284368 1209804 1145500 1089661 1040758 997887 960222 926599 896002 868013 842474
60441 842474 819214 798313 779967 763707 748309 732844 717321 702127 687530 673945 661972
60430 661972 651805 643172 636027 630526 626231 622301 618684 616098 614537 612927 610748 608816 607861 607477
$$ packed form
60500A278525J3624J6771K2084K8694L6498M5965N6740O8276Q1480R7753J16617
60489A863027J36204J56001J76949J98753K19477K38563K58331K81645L09613
60480C838563L41973L77162M09809M29252M22945L82487L06800K00994P3796o3696
60470F720085j98313l15990m04994m59593m81234m76105m51673m15008l72472
60461C144703l28945k87141k48368k13747j83978j58525j36238j16728j00227
60452A370806q6438p4564o4304n5839m8903m2871l7665l3623l0597k7989k5539
60441H42474k3260k0901j8346j6260j5398j5465j5523j5194j4597j3585j1973
60430F61972j0167q633p145n501m295l930l617k586j561j610k179j932r55l84
$$ plain form
60416 607477 607261 607842 609850 612813 615975 619276 622621 625093 626084 626442 627371 628825 630047 631138 632981
60401 632981 636041 640278 645836 652758 660281 667301 673432 678960 684175 689465 695505 702486 709470 715266
60387 715266 719588 722704 724529 724896 724229 722984 720833 717308 712890 708511 704278 699614 694504 689694 685800
60372 685800 682939 681120 680251 679879 679546 679265 679160 678949 678372 677763 677580 677686 677711 677813 678354 679154 679757 680272
60354 680272 681334 683389 686462 690351 694564 698423 701786 705382 710113 716380 724286 733791 744149 753955
60340 753955 762416 769996 777241 783698 788689 792377 795261 797394 798974 800932 803802 806577 807805 807491
60326 807491 806960 807270 808729 811588 816094 822005 828812 836160 843405 849313 853068 855088 855931 855006 851457
60311 851457 845831 839699 833974 828677 823986 820269 817276 814460 812069 810850 810774 811030 811161 811253 811150 810514
$$ packed form
60416F07477k16N81K008K963L162L301L345K472R91L58R29J454J222J091J843
60401F32981L060M237N558O922P523P020O131N528N215N290O040O981O984N796
60387G15266M322L116J825L67o67j245k151l525m418m379m233m664n110m810l894
60372F85800k861j819q69l72l33k81j05k11n77o09j83J06K5J02N41Q00O03N15
60354F80272J062K055L073L889M213L859L363L596M731O267P906R505J0358R806
60340G53955Q461P580P245O457M991L688K884K133J580J958K870K775J228l14
60326H07491n31L10J459K859M506N911O807P348P245N908L755K020Q43r25l549
60311H51457n626o132n725n297m691l717k993k816k391j219p6K56J31R2j03o36
$$ plain form
60295 810514 809672 809469 810342 812275 815432 819862 824742 828939 832286 835498 838911 842199 845151 847823 850016
60280 850016 851555 853008 855298 858601 862432 866668 871752 878047 885745 895161 906265 918236 930349
60267 930349 943032 957191 972920 989902 1008619 1029869 1053344 1078062 1104147 1132916 1165151
60256 1165151 1200546 1238969 1281042 1327223 1377409 1431758 1491031 1555934 1626965 1704964 1790878
60245 1790878 1884810 1986147 2094688 2210855 2334771 2465957 2603714 2746705 2892184 3036703
60235 3036703 3177695 3313423 3441532 3558936 3663256 3753201 3827388 3884000 3921959 3941346
60225 3941346 3942485 3925783 3892889 3846900 3790996 3727867 3660840 3594310 3532191 3476602 3428570
60214 3428570 3389336 3360550 3343898 3340985 3352949 3379839 3421024 3476551 3547430 3634337 3736694
$$ packed form
60295H10514q42k03Q73J933L157M430M880M197L347L212L413L288K952K672K193
60280H50016J539J453K290L303L831M236N084O295P698R416J1104J1971J2113
60267I30349J2683J4159J5729J6982J8717K1250K3475K4718K6085K8769L2235
60256A165151L5395L8423M2073M6181N0186N4349N9273O4903P1031P7999Q5914
60245A790878R3932J01337J08541J16167J23916J31186J37757J42991J45479J44519
60235C036703J40992J35728J28109J17404J04320Q9945P4187N6612L7959J9387
60225C941346J139j6702l2894m5989n5904o3129o7027o6530o2119n5589m8032
60214C428570l9234k8786j6652k913J1964K6890M1185N5527P0879Q6907J02357
$$ plain form
60203 3736694 3853292 3983005 4124386 4275017 4431493 4589493 4743802 4889088 5021144
60194 5021144 5137056 5234306 5310522 5364203 5394768 5401574 5383707 5341200 5275873 5190697 5088879
60183 5088879 4973926 4850001 4721757 4593954 4471163 4357286 4255175 4166959 4094547 4039432
60173 4039432 4002396 3984082 3985558 4007423 4048629 4107059 4180977 4268732 4367131 4471258 4576108
60162 4576108 4677565 4771907 4855680 4926386 4982377 5021957 5043660 5047605 5035631 5009971 4972772
60151 4972772 4926996 4876566 4825325 4776903 4735729 4706812 4693859 4698515 4721771 4765102 4829865
60140 4829865 4916697 5026090 5158685 5314669 5493981 5697705 5928357 6188336 6478885 6800842
60130 6800842 7155074 7541317 7957307 8399418 8863096 9342007 9827755 10311305 10784078
$$ packed form
60203C736694J16598J29713J41381J50631J56476J58000J54309J45286J32056
60194E021144J15912R7250P6216N3681L0565O806j7867m2507o5327q5176j01818
60183E088879j14953j23925j28244j27803j22791j13877j02111q8216p2412n5115
60173D039432l7036j8314J476K1865M1206N8430P3918Q7755R8399J04127J04850
60162D576108J01457R4342Q3773P0706N5991L9580K1703L945j1974k5660l7199
60151D972772m5776n0430n1241m8422m1174k8917j2953M656K3256M3331O4763
60140D829865Q6832J09393J32595J55984J79312K03724K30652K59979K90549L21957
60130F800842L54232L86243M15990M42111M63678M78911M85748M83550M72773
$$ plain form
60121 10784078 11237220 11660866 12045153 12381566 12662975 12883175 13037168 13121342 13132906 13069855
60111 13069855 12932189 12722919 12447704 12114351 11733022 11316005 10876453 10427424 9981789
60102 9981789 9551637 9146844 8774611 8440515 8149005 7902639 7702058 7547499 7439544
60093 7439544 7377929 7360709 7385273 7449163 7549021 7679512 7833966 8005189 8184719 8362271
60083 8362271 8527242 8670789 8786233 8868598 8914979 8925079 8900470 8843458 8756866 8643980
60073 8643980 8507664 8349787 8172074 7977094 7767959 7547721 7319786 7088379 6857891
60064 6857891 6632061 6414219 6207665 6015151 5838522 5679398 5539618 5420452 5322123 5244834
60054 5244834 5189706 5157887 5149371 5163555 5200467 5260560 5343617 5448640 5574359 5718685 5877615
$$ packed form
60121A0784078M53142M23646L84287L36413K81409K20200J53993Q4174J1564o3051
60111A3069855j37666k09270k75215l33353l81329m17017m39552m49029m45635
60102I981789m30152m04793l72233l34096k91510k46366k00581j54559j07955
60093G439544o1615j7220K4564O3890R9858J30491J54454J71223J79530J77552
60083H362271J64971J43547J15444Q2365M6381J0100k4609n7012q6592j12886
60073H643980j36316j57877j77713j94980k09135k20238k27935k31407k30488
60064F857891k25830k17842k06554j92514j76629j59124j39780j19166r8329p7289
60054E244834n5128l1819q516J4184L6912O0093Q3057J05023J25719J44326J58930
$$ plain form
60043 5877615 6045401 6216010 6384121 6544868 6693202 6823711 6931077 7011044 7061133 7080200
60033 7080200 7067323 7021689 6943765 6836014 6702222 6546754 6374610 6191338 6002230 5811983
60023 5811983 5625312 5447064 5281161 5129968 4995148 4878502 4781539 4704834 4648421 4612418
60013 4612418 4597043 4602635 4630044 4680348 4753912 4850486 4970484 5115121 5284565 5476604 5687559
60002 5687559 5913415 6149191 6387972 6621616 6842252 7042797 7217085 7360554 7470546
59993 7470546 7545347 7583392 7583837 7547213 7474880 7368567 7231248 7067975 6885198 6689676 6488514
59982 6488514 6289299 6099049 5923083 5765160 5628044 5513356 5421678 5353600 5310269 5292383
59972 5292383 5299340 5329976 5383340 5457915 5550732 5658171 5777213 5905198 6038977 6175143
$$ packed form
60043E877615J67786J70609J68111J60747J48334J30509J07366P9967N0089J9067
60033G080200j2877m5634p7924j07751j33792j55468j72144j83272j89108j90247
60023E811983j86671j78248j65903j51193j34820j16646r6963p6705n6413l6003
60013D612418j5375N592K7409N0304P3564R6574J19998J44637J69444J92039K10955
60002E687559K25856K35776K38781K33644K20636K00545J74288J43469J09992
59993G470546P4801L8045M45l6624p2333j06313j37319j63273j82777j95522k01162
59982F488514j99215j90250j75966j57923j37116j14688r1678o8078m3331j7886
59972E292383O957L0636N3364P4575R2817J07439J19042J27985J33779J36166
$$ plain form
59962 6175143 6310701 6442887 6568831 6686070 6792901 6887644 6968190 7033008 7082108 7116455
59952 7116455 7137167 7146021 7146087 7141068 7134605 7130916 7135408 7153717 7190624 7250538 7338291 7458503 7614696
59939 7614696 7809877 8047396 8330435 8661054 9040253 9467910 9941489 10455099 11000308
59930 11000308 11566691 12140190 12701434 13226981 13692344 14074067 14351260 14508288 14537430
59921 14537430 14439202 14221042 13896480 13484225 13005759 12482686 11935767 11384398 10844799
59912 10844799 10328561 9843813 9397264 8994066 8636535 8324870 8059264 7840387 7668241
59903 7668241 7542018 7461010 7424554 7431245 7479331 7567725 7695408 7859890 8057197 8282933
59893 8282933 8531857 8796195 9065343 9327129 9568379 9774628 9931159 10025405 10048441 9995132
$$ packed form
59962F175143J35558J32186J25944J17239J06831R4743Q0546O4818M9100L4347
59952G116455K0712Q854O6n019o463l689M492J8309L6907N9914Q7753J20212J56193
59939G614696J95181K37519K83039L30619L79199M27657M73579N13610N45209
59930A1000308N66383N73499N61244N25547M65363L81723K77193J57028K9142
59921A4537430r8228k18160l24562m12255m78466n23073n46919n51369n39599
59912A0844799n16238m84748m46549m03198l57531l11665k65606k18877j72146
59903G668241j26223q1008l6456O691M8086Q8394J27683J64482J97307K25736
59893H282933K48924K64338K69148K61786K41250K06249J56531R4246K3036n3309
$$ plain form
59883 9995132 9864600 9661085 9393292 9072266 8709990 8319269 7913273 7504197 7102328
59874 7102328 6715798 6350231 6008696 5692959 5404886 5146064 4916400 4714205 4537764
59865 4537764 4386064 4258029 4151826 4064905 3994056 3935485 3885516 3841110 3799346 3757078 3712121
59854 3712121 3664398 3614970 3564353 3512871 3462264 3415555 3375262 3342702 3318784 3304098 3297886
59843 3297886 3297827 3300953 3303991 3303073 3294379 3275569 3246026 3205880 3155804 3097820 3035377 2972263 2911740
59830 2911740 2856278 2807199 2764654 2728744 2700520 2681152 2670468 2667321 2671167 2682349 2701146 2727732
59818 2727732 2763034 2808500 2864883 2931929 3008802 3093639 3182874 3272445 3359937 3444753 3526285
59807 3526285 3603012 3673304 3735854 3789110 3831245 3860831 3876863 3878606 3866826 3845244 3819495
$$ packed form
59883I995132j30532k03515k67793l21026l62276l90721m05996m09076m01869
59874G102328l86530l65567l41535l15737k88073k58822k29664k02195j76441
59865D537764j51700j28035j06203q6921p0849n8571m9969m4406m1764m2268m4957
59854C712121m7723m9428n0617n1482n0607m6709m0293l2560k3918j4686o212
59843C297886n9L126L038r18q694j8810k9543m0146n0076n7984o2443o3114o0523
59830B911740n5462m9079m2545l5910k8224j9368j0684l147L846J1182J8797K6586
59818B727732L5302M5466N6383O7046P6873Q4837Q9235Q9571Q7492Q4816Q1532
59807C526285P6727P0292O2550N3256M2135K9586J6032J743j1780k1582k5749
$$ plain form
59796 3819495 3794290 3772403 3756125 3748198 3751031 3766251 3795473 3840564 3902902 3983357 4083298 4204886
59784 4204886 4350410 4522452 4724827 4962326 5239308 5559440 5926615 6344486 6813872
59775 6813872 7329984 7880092 8440684 8975878 9441224 9793276 9999986 10047265 9940853 9703870
59765 9703870 9370091 8975347 8551402 8123916 7712192 7329055 6981841 6674509 6408798
59756 6408798 6183991 5997359 5845866 5726944 5637660 5574538 5534961 5517886 5522632 5547822 5592041
59745 5592041 5654790 5736218 5836548 5956180 6095782 6255997 6437692 6642571 6872808 7129892
59735 7129892 7414741 7729173 8076417 8459938 8882620 9347309 9857110 10414556 11021000
59726 11021000 11676800 12380860 13129151 13913886 14724080 15546132 16363976 17160235 17918732
$$ packed form
59796C819495k5205k1887j6278p927K833J5220K9222M5091O2338Q0455R9941J21588
59784D204886J45524J72042K02375K37499K76982L20132L67175M17871M69386
59775F813872N16112N50108N60592N35194M65346L52052K06710M7279j06412k36983
59765I703870l33779l94744m23945m27486m11724l83137l47214l07332k65711
59756F408798k24807j86632j51493j18922q9284o3122l9577j7075M746K5190M4219
59745E592041O2749Q1428J00330J19632J39602J60215J81695K04879K30237K57084
59735G129892K84849L14432L47244L83521M22682M64689N09801N57446O06444
59726A1021000O55800P04060P48291P84735Q10194Q22052Q17844P96259P58497
$$ plain form
59717 17918732 18626866 19277164 19868706 20407988 20907836 21385026 21858608 22348641 22873510
59708 22873510 23446723 24076079 24764816 25511289 26306588 27133409 27967617 28780175 29538367
59699 29538367 30208365 30759775 31169474 31423277 31517021 31457648 31262244 30954788 30563414 30119272
59689 30119272 29654592 29199150 28778009 28412083 28119069 27913099 27804907 27803657 27918172 28156216
59679 28156216 28523954 29027067 29671335 30461009 31396714 32474437 33684008 35005862 36408016
59670 36408016 37845041 39258027 40575279 41716275 42600477 43158164 43339724 43122311 42513374
59661 42513374 41549256 40288742 38804548 37175285 35477701 33779727 32136887 30592411
59653 30592411 29177526 27909729 26791157 25809001 24936422 24133404 23350974 22541033 21667797
$$ packed form
59717A7918732P08134O50298N91542N39282M99848M77190M73582M90033N24869
59708B2873510N73213O29356O88737P46473P95299Q26821Q34208Q12558P58192
59699B9538367O69998N51410M09699K53803R3744n9373j95404l07456l91374m44142
59689C0119272m64680m55442m21141l65926k93014k05970j08192j250J14515K38044
59679B8156216L67738N03113O44268P89674R35705J077723J209571J321854J402154
59670C6408016J437025J412986J317252J140996Q84202N57687J81560k17413o08937
59661D2513374r64118j260514j484194j629263j697584j697974j642840j544476
59653C0592411j414885j267797j118572r82156q72579q03018p82430q09941q73236
$$ plain form
59644 21667797 20714750 19685356 18599315 17485916 16376119 15296644 14268020 13304793
59636 13304793 12415540 11603159 10866489 10202108 9605010 9069216 8589216 8160686 7779388
59627 7779388 7440200 7138094 6869489 6631880 6422578 6238574 6077303 5936891 5815883
59618 5815883 5713067 5627113 5555908 5496516 5445761 5400354 5356629 5311160 5261724 5206678 5143405
59607 5143405 5068837 4981926 4884327 4778259 4665114 4546663 4425922 4305760 4187894 4074128
59597 4074128 3967138 3868771 3778749 3696327 3622215 3557660 3502678 3456616 3419644 3392328 3374366
59586 3374366 3365028 3364212 3371801 3386490 3406534 3431190 3460272 3492664 3526448 3560303 3593780 3626536
59574 3626536 3658302 3689503 3721106 3754059 3789464 3828925 3874004 3925715 3985093 4053768 4133230
$$ packed form
59644B1667797r53047j029394j086041j113399j109797j079475j028624r63227
59636A3304793q89253q12381p36670o64381n97098n35794m80000m28530l81298
59627G779388l39188l02106k68605k37609k09302j84004j61271j40412j21008
59618E815883j02816q5954p1205n9392n0755m5407m3725m5469m9436n5046o3273
59607E143405p4568q6911r7599j06068j13145j18451j20741j20162j17866j13766
59597D074128j06990r8367r0022q2422p4112o4555n4982m6062l6972k7316j7962
59586C374366r338q16P589J4689K0044K4656K9082L2392L3784L3855L3477L2756
59574C626536L1766L1201L1603L2953L5405L9461M5079N1711N9378O8675P9462
$$ plain form
59563 4133230 4223921 4325619 4438401 4562890 4700217 4852160 5020670 5206844 5411092 5634655
59553 5634655 5879905 6148526 6440277 6753974 7088455 7441835 7810943 8192308 8582555
59544 8582555 8976996 9369146 9752828 10123837 10478767 10813753 11125901 11414947 11682306
59535 11682306 11929598 12159322 12375178 12579198 12769122 12940900 13094047 13233418 13366235
59526 13366235 13498706 13634433 13773129 13909515 14034117 14135482 14201515 14220031 14180158 14073986
59516 14073986 13896699 13646064 13323260 12934054 12488006 11996527 11472159 10928459 10378419
59507 10378419 9832442 9298381 8782953 8291828 7828639 7395292 6993381 6624450 6289090
59498 6289090 5986755 5716378 5476468 5265059 5080433 4921442 4786335 4671997 4575495 4495864
$$ packed form
59563D133230R0691J01698J12782J24489J37327J51943J68510J86174K04248K23563
59553E634655K45250K68621K91751L13697L34481L53380L69108L81365L90247
59544H582555L94441L92150L83682L71009L54930L34986L12148K89046K67359
59535A1682306K47292K29724K15856K04020J89924J71778J53147J39371J32817
59526A3366235J32471J35727J38696J36386J24602J01365O6033J8516l9873j06172
59516A4073986j77287k50635l22804l89206m46048m91479n24368n43700n50040
59507A0378419n45977n34061n15428m91125m63189m33347m01911l68931l35360
59498F289090l02335k70377k39910k11409j84626j58991j35107j14338r6502p9631
$$ plain form
59488 4495864 4433300 4387241 4356591 4341275 4342087 4359196 4392190 4441415 4507998 4592704 4695934
59477 4695934 4818684 4962297 5127406 5314298 5524138 5758564 6017926 6300794 6605019
59468 6605019 6928072 7266155 7613584 7962727 8303714 8624565 8912654 9156067 9343459
59459 9343459 9464119 9510269 9479537 9374484 9200368 8964509 8676963 8349689 7994403 7621698
59449 7621698 7241445 6862459 6491667 6134495 5795649 5478386 5183565 4910789 4660230
59440 4660230 4432302 4226165 4040107 3873047 3724259 3592026 3474191 3369803 3278743 3200039
59430 3200039 3132164 3074732 3028195 2991927 2964258 2944375 2932493 2928172 2930140 2937847 2951482 2970267
59418 2970267 2992444 3017195 3045023 3076031 3109537 3145642 3185504 3229876 3279198 3335310 3400508
$$ packed form
59488D495864o2564m6059l0650j5316Q12J7109L2994M9225O6583Q4706J03230
59477D695934J22750J43613J65109J86892K09840K34426K59362K82868L04225
59468F605019L23053L38083L47429L49143L40987L20851K88089K43413J87392
59459I343459J20660M6150l0732j05053j74116k35859k87546l27274l55286l72705
59449G621698l80253l78986l70792l57172l38846l17263k94821k72776k50559
59440D660230k27928k06137j86058j67060j48788j32233j17835j04388r1060p8704
59430C200039o7875n7432m6537l6268k7669j9883j1882m321J968P707J3635J8785
59418B970267K2177K4751K7828L1008L3506L6105L9862M4372M9322N6112O5198
$$ plain form
59407 3400508 3473494 3548052 3617469 3679688 3737690 3796551 3861513 3937617 4029127 4139163 4270672
59396 4270672 4427232 4611621 4823355 5058335 5311643 5581431 5871053 6187958 6540438
59387 6540438 6935145 7376976 7869586 8414409 9009183 9648135 10322986 11022549 11731784
59378 11731784 12433160 13109879 13747783 14335253 14863453 15327566 15727040 16064416 16344432
59369 16344432 16573546 16758196 16902325 17006657 17069847 17089043 17059441 16974956 16830298 16622357
59359 16622357 16350479 16017385 15630644 15202575 14748438 14284983 13829348 13396630 12996916
59350 12996916 12634575 12309544 12017680 11750185 11495107 11240825 10977785 10697591 10392943
59341 10392943 10059977 9699794 9316980 8917471 8508185 8097193 7692648 7301298 6928041
$$ packed form
59407C400508P2986P4558O9417O2219N8002N8861O4962P6104R1510J10036J31509
59396D270672J56560J84389K11734K34980K53308K69788K89622L16905L52480
59387F540438L94707M41831M92610N44823N94774O38952O74851O99563P09235
59378A1731784P01376O76719O37904N87470N28200M64113L99474L37376K80016
59369A6344432K29114J84650J44129J04332O3190J9196k9602q4485j44658k07941
59359A6622357k71878l33094l86741m28069m54137m63455m55635m32718l99714
59350A2996916l62341l25031k91864k67495k55078k54282k63040k80194l04648
59341A0392943l32966l60183l82814l99509m09286m10992m04545l91350l73257
$$ plain form
59332 6928041 6576231 6248141 5945535 5669777 5420981 5197577 4997680 4820587 4665925
59323 4665925 4531865 4415658 4315673 4231373 4161397 4103432 4056131 4019507 3993227 3976160 3967956
59312 3967956 3969323 3980132 3998898 4024857 4059035 4102457 4154617 4214599 4282460 4358453 4441723
59301 4441723 4530516 4622956 4717148 4811364 4904581 4996009 5083892 5165799 5240288 5307206 5366293
59290 5366293 5416963 5459928 5497676 5532810 5567113 5602643 5642348 5689039 5745005 5813027 5896144
59279 5896144 5995593 6110322 6239200 6382170 6538161 6703070 6870799 7035197 7190152 7329123
59269 7329123 7445981 7535914 7595065 7620601 7612314 7573452 7508939 7423075 7319013 7199220 7065775
59258 7065775 6921408 6771268 6622897 6483680 6358918 6252441 6167413 6105259 6064761 6043440
$$ packed form
59332F928041l51810l28090l02606k75758k48796k23404j99897j77093j54662
59323D665925j34060j16207r9985q4300o9976n7965m7301l6624k6280j7067q204
59312C967956J367J0809J8766K5959L4178M3422N2160N9982O7861P5993Q3270
59301D441723Q8793R2440R4192R4216R3217R1428Q7883Q1907P4489O6918N9087
59290E366293N0670M2965L7748L5134L4303L5530L9705M6691N5966O8022Q3117
59279E896144R9449J14729J28878J42970J55991J64909J67729J64398J54955J38971
59269G329123J16858Q9933N9151K5536q287l8862o4513q5864j04062j19793j33445
59258G065775j44367j50140j48371j39217j24762j06477q5028o2154m0498k1321
$$ plain form
59248 6043440 6039368 6051097 6076759 6114265 6161808 6217636 6280110 6348747 6424626 6509236 6603779
59237 6603779 6710186 6832013 6973611 7139014 7331992 7556290 7815144 8111021 8445715
59228 8445715 8819196 9227391 9661666 10110432 10559915 10993030 11389418 11728314 11991396
59219 11991396 12163287 12231645 12188810 12033303 11769413 11406362 10958357 10443901 9883216 9295887
59209 9295887 8700151 8112246 7544779 7006204 6502355 6037505 5613486 5229337 4883105
59200 4883105 4573276 4297884 4053570 3836719 3644796 3475690 3326663 3194857 3078040
59191 3078040 2974075 2880517 2795438 2717831 2646589 2580174 2517957 2460691 2408798 2361304 2317297
59180 2317297 2277222 2241681 2210077 2181576 2156458 2135418 2118404 2105155 2096045 2091384 2090702 2093682
$$ packed form
59248F043440m072J1729K5662L7506M7543N5828O2474O8637P5879Q4610R4543
59237F603779J06407J21827J41598J65403J92978K24298K58854K95877L34694
59228H445715L73481M08195M34275M48766M49483M33115L96388L38896K63082
59219A1991396J71891O8358m2835j55507k63890l63051m48005n14456n60685n87329
59209I295887n95736n87905n67467n38575n03849m64850m24019l84149l46232
59200D883105l09829k75392k44314k16851j91923j69106j49027j31806j16817
59191C078040j03965r3558q5079p7607p1242o6415o2217n7266n1893m7494m4007
59180B317297m0075l5541l1604k8501k5118k1040j7014j3249r110m661o82K980
$$ plain form
59168 2093682 2100973 2113161 2129766 2150099 2174222 2202265 2233815 2268850 2308216 2352222 2399847
59157 2399847 2450326 2504399 2562946 2625578 2691841 2762722 2839517 2922040 3009243 3100767 3196569
59146 3196569 3295764 3397243 3500826 3606522 3713041 3818020 3919136 4014137 4100629 4177087
59136 4177087 4243485 4300010 4345894 4380542 4405005 4421340 4431287 4436730 4440624 4446196 4455747 4471275
59124 4471275 4495605 4531890 4582621 4650125 4737271 4846628 4979508 5136685 5319106 5526931
59114 5526931 5758801 6013203 6289526 6586190 6897981 7215908 7528631 7822829 8083337
59105 8083337 8295002 8445100 8524380 8527895 8456928 8319721 8129034 7898950 7643893 7378313
59095 7378313 7114600 6861067 6622685 6402729 6202418 6019973 5851933 5695295 5547489
$$ packed form
59168B093682P291J2188J6605K0333K4123K8043L1550L5035L9366M4006M7625
59157B399847N0479N4073N8547O2632O6263P0881P6795Q2523Q7203R1524R5802
59146C196569R9195J01479J03583J05696J06519J04979J01116R5001Q6492P6458
59136D177087O6398N6525M5884L4648K4463J6335R947N443L894N572R551J5528
59124D471275K4330L6285N0731O7504Q7146J09357J32880J57177J82421K07825
59114E526931K31870K54402K76323K96664L11791L17927L12723K94198K60508
59105H083337K11665J50098P9280L515p0967j37207j90687k30084k55057k65580
59095G378313k63713k53533k38382k19956k00311j82445j68040j56638j47806
$$ plain form
59086 5547489 5405259 5265191 5124985 4983129 4837985 4688481 4535127 4379150 4221188
59077 4221188 4061855 3902706 3745392 3590590 3439009 3292576 3153255 3021442 2896798
59068 2896798 2779783 2670972 2569787 2475533 2388942 2311059 2241353 2178557 2122714 2074570 2033449
59057 2033449 1997434 1965289 1936543 1909985 1883753 1856744 1828524 1798139 1764483 1727650 1688600
59046 1688600 1647826 1605682 1563720 1524257 1488687 1457233 1429923 1406605 1386471 1368847 1354148
59035 1354148 1342944 1334679 1328481 1324596 1323706 1325511 1329384 1335764 1345365 1357538 1370936 1385327 1401184
59022 1401184 1417850 1433551 1446879 1456996 1462960 1464424 1462729 1459991 1457401 1455412 1454826 1456304 1459518
59009 1459518 1464191 1471318 1481950 1495545 1510955 1528158 1547353 1567154 1585557 1602094 1617267 1630544
$$ packed form
59086E547489j42230j40068j40206j41856j45144j49504j53354j55977j57962
59077D221188j59333j59149j57314j54802j51581j46433j39321j31813j24644
59068B896798j17015j08811j01185r4254q6591p7883o9706o2796n5843m8144m1121
59057B033449l6015l2145k8746k6558k6232k7009k8220l0385l3656l6833l9050
59046A688600m0774m2144m1962l9463l5570l1454k7310k3318k0134j7624j4699
59035A354148j1204q265o198l885q90J805L873O380R601J2173J3398J4391J5857
59022A401184J6666J5701J3328J0117N964J464j695k738k590j989n86J478L214
59009A459518M673P127J0632J3595J5410J7203J9195J9801J8403J6537J5173J3277
$$ plain form
58997 1630544 1640705 1647628 1651995 1653920 1653711 1653285 1654757 1658131 1662263 1667431 1674855 1684296 1694431 1705287
58983 1705287 1718046 1732694 1748081 1764075 1781420 1799619 1817346 1835035 1854818 1877629 1902463
58972 1902463 1928683 1957006 1987887 2020940 2056377 2095313 2138212 2184512 2233894 2286402 2341272
58961 2341272 2397146 2453360 2509532 2564327 2616444 2666546 2716405 2766564 2816891 2869042 2925952
58950 2925952 2988893 3057295 3131582 3213853 3305525 3406422 3516495 3636397 3766283 3906225
58940 3906225 4058028 4224431 4406341 4603132 4815896 5047938 5301621 5577260 5875902
58931 5875902 6200786 6555145 6940798 7360035 7816979 8315990 8860346 9453294 10098646
58922 10098646 10799306 11556626 12371668 13245056 14174129 15150940 16162908 17193237 18219527
$$ packed form
58997A630544J0161O923M367J925k09m26J472L374M132N168P424R441J0135J0856
58983A705287J2759J4648J5387J5994J7345J8199J7727J7689J9783K2811K4834
58972A902463K6220K8323L0881L3053L5437L8936M2899M6300M9382N2508N4870
58961B341272N5874N6214N6172N4795N2117N0102M9859N0159N0327N2151N6910
58950B925952O2941O8402P4287Q2271R1672J00897J10073J19902J29886J39942
58940C906225J51803J66403J81910J96791K12764K32042K53683K75639K98642
58931E875902L24884L54359L85653M19237M56944M99011N44356N92948O45352
58922A0098646P00660P57320Q15042Q73388R29073R76811J011968J030329J026290
$$ plain form
58913 18219527 19213197 20141198 20967987 21657248 22175685 22498301 22611176 22510980 22204670
58904 22204670 21710082 21054181 20268578 19386245 18440351 17461968 16476509 15503133 14557529
58895 14557529 13653123 12799074 11999468 11255839 10569117 9938622 9361328 8833621 8352838
58886 8352838 7916605 7522077 7166290 6845775 6555399 6289252 6043153 5814828 5601563
58877 5601563 5399805 5207580 5025296 4853459 4691500 4539452 4398699 4270056 4152749
58868 4152749 4046010 3949917 3863970 3786647 3717157 3655927 3602660 3555704 3514074 3478395 3449119
58857 3449119 3425569 3407403 3395260 3389262 3388669 3393695 3405831 3425686 3452365 3485603 3526503 3575434
58845 3575434 3631232 3693392 3763108 3841291 3927525 4021907 4125983 4240905 4366509 4503096
$$ packed form
58913A8219527R93670R28001Q26789O89261N18437L22616J12875j00196l06310
58904B2204670m94588o55901p85603q82333r45894r78383r85459r73376r45604
58895A4557529r04406q54049p99606p43629o86722o30495n77294n27707m80783
58886H352838m36233l94528l55787l20515k90376k66147k46099k28325k13265
58877E601563k01758j92225j82284j71837j61959j52048j40753j28643j17307
58868D152749j06739r6093q5947p7323o9490o1230n3267m6956m1630l5679k9276
58857C449119k3550j8166j2143n998n93N026J2136J9855K6679L3238M0900M8931
58845C575434N5798O2160O9716P8183Q6234R4382J04076J14922J25604J36587
$$ plain form
58835 4503096 4652226 4814913 4991127 5182001 5390473 5618702 5866887 6135672 6427721
58826 6427721 6745898 7092116 7469258 7882118 8335083 8830735 9371951 9963268 10608654
58817 10608654 11309688 12067035 12881409 13751107 14669775 15627247 16609879 17597840 18563545
58808 18563545 19474574 20297239 20997239 21540667 21898746 22052917 21996122 21732084 21275360
58799 21275360 20650232 19886708 19016816 18073509 17089226 16092162 15103848 14140642 13215648
58790 13215648 12338046 11512550 10741262 10025064 9362612 8750269 8184768 7664623 7188066
58781 7188066 6751622 6351952 5987065 5654312 5349280 5068319 4810331 4574476 4357962
58772 4357962 4157597 3971494 3797610 3632702 3474806 3325010 3184872 3053706 2930239
$$ packed form
58835D503096J49130J62687J76214J90874K08472K28229K48185K68785K92049
58826F427721L18177L46218L77142M12860M52965M95652N41216N91317O45386
58817A0608654P01034P57347Q14374Q69698R18668R57472R82632R87961R65705
58808A8563545R11029Q22665P00000N43428L58079J54171n6795k64038m56724
58799B1275360o25128p63524q69892r43307r84283r97064r88314r63206r24994
58790A3215648q77602q25496p71288p16198o62452o12343n65501n20145m76557
58781G188066m36444l99670l64887l32753l05032k80961k57988k35855k16514
58772D357962k00365j86103j73884j64908j57896j49796j40138j31166j23467
$$ plain form
58763 2930239 2815054 2709217 2611907 2521522 2437981 2362071 2293680 2232308 2178065 2130618 2088395
58752 2088395 2050256 2016616 1987644 1961949 1938404 1917506 1899443 1882706 1866204 1850931 1837774
58741 1837774 1825505 1812689 1799724 1787121 1773638 1758170 1741773 1725794 1709602 1692167 1674189
58730 1674189 1656565 1638261 1617825 1595590 1572466 1548065 1521875 1494711 1467130 1437993 1406570
58719 1406570 1374368 1343033 1312236 1281588 1252704 1227064 1203709 1181387 1161153 1144355 1129765
58708 1129765 1115305 1101119 1088459 1077012 1065861 1055647 1047301 1040021 1032940 1027318 1024516 1023249
58696 1023249 1021357 1018901 1016932 1014647 1010507 1004826 998545 990713 979905 966994 953875 940624 926510
58683 926510 912536 900211 888934 877375 866259 857038 849028 840784 833303 828839 827371 827049 827298
$$ packed form
58763B930239j15185j05837r7310r0385q3541p5910o8391o1372n4243m7447m2223
58752B088395l8139l3640k8972k5695k3545k0898j8063j6737j6502j5273j3157
58741A837774j2269j2816j2965j2603j3483j5468j6397j5979j6192j7435j7978
58730A674189j7624j8304k0436k2235k3124k4401k6190k7164k7581k9137l1423
58719A406570l2202l1335l0797l0648k8884k5640k3355k2322k0234j6798j4590
58708A129765j4460j4186j2660j1447j1151j0214q346p280p081n622k802j267
58696A023249j892k456j969k285m140n681o281p832j0808j2911j3119j3251j4114
58683I26510j3974j2325j1277j1559j1116r221q010q244p481m464j468l22K49
$$ plain form
58670 827298 828713 830729 832173 833454 835657 838384 841063 845282 852961 863109 873166 882521 891847 900068
58656 900068 905313 908231 911237 914951 918251 921372 926013 932845 941662 953444 969430 988550 1008510
58643 1008510 1029030 1051538 1076404 1103201 1132985 1167415 1206080 1247370 1291448 1339762 1392432
58632 1392432 1448942 1510699 1579997 1657107 1741341 1834382 1939649 2058906 2192411 2341802
58622 2341802 2509825 2697722 2905820 3136100 3391021 3670028 3969837 4287199 4617718
58613 4617718 4951707 5273904 5567144 5814364 5998895 6107469 6134300 6080785 5952538 5759390
58603 5759390 5516524 5241115 4947222 4645861 4348113 4063880 3798022 3551453 3325621
58594 3325621 3122376 2940293 2775530 2626530 2494153 2377389 2272949 2179180 2096388 2023035
$$ packed form
58670H27298J415K016J444J281K203K727K679M219P679J0148J0057R355R326Q221
58656I00068N245K918L006L714L300L121M641O832Q817J1782J5986J9120J9960
58643A008510K0520K2508K4866K6797K9784L4430L8665M1290M4078M8314N2670
58632A392432N6510O1757O9298P7110Q4234R3041J05267J19257J33505J49391
58622B341802J68023J87897K08098K30280K54921K79007K99809L17362L30519
58613D617718L33989L22197K93240K47220J84531J08574K6831n3515j28247j93148
58603E759390k42866k75409k93893l01361k97748k84233k65858k46569k25832
58594C325621k03245j82083j64763j49000j32377j16764j04440r3769q2792p3353
$$ plain form
58584 2023035 1955698 1893462 1838599 1792126 1752058 1716539 1685221 1656913 1629287 1601658 1574933
58573 1574933 1548344 1519388 1487493 1454625 1422019 1389553 1358550 1331596 1308886 1288006 1267860
58562 1267860 1249607 1233259 1216720 1198819 1180221 1160913 1140001 1118362 1098260 1079904 1061643
58551 1061643 1043785 1028808 1017467 1008151 1000403 995405 992594 989541 985807 983161 981398 977849 971931
58538 971931 966367 962718 959334 954863 950248 946007 940878 934444 927965 921559 913575 903696 893520 883309
58524 883309 871378 857464 843369 829550 814467 798113 782715 769083 755724 742459 731339
58513 731339 722998 715587 708333 702738 699348 696811 694972 695255 697061 697538 696055 695253 696526 698161 699088
58498 699088 700695 703577 706111 707631 709567 712244 714038 714877 717011 721118 725209 728379 731962 735920
$$ packed form
58584B023035o7337o2236n4863m6473m0068l5519l1318k8308k7626k7629k6725
58573A574933k6589k8956l1895l2868l2606l2466l1003k6954k2710k0880k0146
58562A267860j8253j6348j6539j7901j8598j9308k0912k1639k0102j8356j8261
58551A061643j7858j4977j1341r316p748m998k811l053l734k646j763l549n918
58538I71931n564l649l384m471m615m241n129o434o479o406p984r879j0176j0211
58524H83309j1931j3914j4095j3819j5083j6354j5398j3632j3359j3265j1120
58513G31339q341p411p254n595l390k537j839K83J806M77j483q02J273J635R27
58498F99088J607K882K534J520J936K677J794Q39K134M107M091L170L583L958
$$ plain form
58484 735920 737997 737763 737749 739328 741178 742864 745998 750687 754846 758243 763115 769664 775216 779052 783603
58469 783603 789411 793512 794434 794210 793707 790697 784611 778493 773895 768305 760013 751136 743334 734887 724561
58454 724561 714295 705502 696761 687527 680002 674866 669392 662306 656388 653639 652130 650283 650049 652880
58440 652880 656629 659444 662919 668552 674769 680200 686050 692611 697264 698682 699191 700420 700537 698357 696060
58425 696060 695241 694443 693223 694282 698748 703707 707339 712061 719627 727719 734589 742554 753377 764548
58411 764548 773633 782142 791712 800724 808132 816297 826421 835397 840665 843977 846931 847311 843526 838300
58397 838300 834134 829431 822775 816522 812334 807779 801342 796239 795095 795416 794516 794297 796772 799495 800115
58382 800115 800997 804644 808779 810619 811683 813678 814039 810528 806218 804993 806005 807124 809635 814824 820095
$$ packed form
58484G35920K077k34j4J579J850J686L134M689M159L397M872O549N552L836M551
58469G83603N808M101R22k24n03l010o086o118m598n590q292q877p802q447j0326
58454G24561j0266q793q741r234p525n136n474p086n918k749j509j847k34K831
58440F52880L749K815L475N633O217N431N850O561M653J418N09J229J17k180k297
58425F96060q19p98j220J059M466M959L632M722P566Q092O870P965J0823J1171
58411G64548R085Q509R570R012P408Q165J0124Q976N268L312K954L80l785n226
58397H38300m166m703o656o253m188m555o437n103j144L21r00k19K475K723O20
58382H00115Q82L647M135J840J064J995L61l511m310j225J012J119K511N189N271
$$ plain form
58367 820095 823351 827062 833404 839727 843581 847589 854379 861311 865426 869036 875101 881697 886475 891987
58353 891987 901004 911040 919063 927090 937493 947388 953424 957566 962410 965579 964717 963172 964654 967063
58339 967063 967718 969499 975341 981842 985249 988664 996268 1005536 1012527 1019866 1031704 1045500 1056678 1066885
58325 1066885 1079740 1092926 1102555 1111129 1122986 1136058 1146241 1155763 1169002 1184227 1197712 1211782
58313 1211782 1230257 1250147 1266527 1281510 1299624 1318425 1332740 1344224 1357602 1371389 1381531
58302 1381531 1390398 1402813 1416950 1428424 1439575 1455171 1472916 1487852 1502308 1521628 1543872
58291 1543872 1563639 1582263 1604246 1627628 1648150 1668840 1694993 1723823 1749735 1775556 1807379
58280 1807379 1842632 1874821 1905935 1942290 1982102 2019304 2055732 2097193 2141243 2181353 2219371
$$ packed form
58367H20095L256L711O342O323L854M008O790O932M115L610O065O596M778N512
58353H91987R017J0036Q023Q027J0403R895O036M142M844L169q62j545J482K409
58339I67063O55J781N842O501L407L415P604R268O991P339J1838J3796J1178J0207
58325A066885J2855J3186R629Q574J1857J3072J0183R522J3239J5225J3485J4070
58313A211782J8475J9890J6380J4983J8114J8801J4315J1484J3378J3787J0142
58302A381531Q867J2415J4137J1474J1151J5596J7745J4936J4456J9320K2244
58291A543872J9767J8624K1983K3382K0522K0690K6153K8830K5912K5821L1823
58280A807379L5253L2189L1114L6355L9812L7202L6428M1461M4050M0110L8018
$$ plain form
58269 2219371 2261224 2304296 2342141 2377700 2418462 2462508 2503129 2543180 2590579 2643484 2694505
58258 2694505 2745719 2804543 2868687 2930645 2993220 3064706 3142546 3218139 3293967 3379009 3471031
58247 3471031 3560981 3651263 3751634 3860576 3969398 4081057 4205475 4339651 4472554 4606515
58237 4606515 4753114 4911151 5070170 5232650 5410444 5602134 5796980 5998438 6219965
58228 6219965 6460373 6708140 6967080 7251746 7560408 7880083 8215555 8584657 8987419
58219 8987419 9410301 9858617 10352939 10895756 11475549 12101773 12800042 13574691 14414348
58210 14414348 15332876 16364363 17520060 18795176 20217592 21842988 23704155 25818381
58202 25818381 28244803 31077734 34384781 38216482 42677859 47920581 54068929 61244128
$$ packed form
58269B219371M1853M3072L7845L5559M0762M4046M0621M0051M7399N2905N1021
58258B694505N1214N8824O4144O1958O2575P1486P7840P5593P5828Q5042R2022
58247C471031Q9950R0282J00371J08942J08822J11659J24418J34176J32903J33961
58237D606515J46599J58037J59019J62480J77794J91690J94846K01458K21527
58228F219965K40408K47767K58940K84666L08662L19675L35472L69102M02762
58219H987419M22882M48316M94322N42817N79793O26224O98269P74649Q39657
58210A4414348R18528J031487J155697J275116J422416J625396J861167K114226
58202B5818381K426422K832931L307047L831701M461377N242722O148348P175199
$$ plain form
58194 61244128 69674847 79705963 91723967 106222926 123983985 146092768 173820759
58187 173820759 208615867 251817667 303221215 358827572 410075227 446518830 460715117
58180 460715117 451553633 423646083 384044313 339263714 294094971 251623691 213524531
58173 213524531 180407542 152248550 128719672 109306339 93374617 80308046 69598957
58166 69598957 60815287 53562472 47525183 42494500 38311706 34819816 31893319 29467239
58158 29467239 27496875 25917998 24676334 23764660 23195906 22964902 23074688 23583794 24592136
58149 24592136 26201608 28542928 31815889 36161219 41336874 46489723 50368055 51935462
58141 51935462 50908960 47782588 43397657 38502537 33603817 29022586 24944459 21427542
$$ packed form
58194F1244128Q430719J0031116J2018004J4498959J7761059K2108783K7727991
58187A73820759L4795108M3201800N1403548N5606357N1247655L6443603J4196287
58180D60715117r161484k7907550l9601770m4780599m5168743m2471280l8099160
58173B13524531l3116989k8158992k3528878j9413333j5931722j3066571j0709089
58166F9598957q783670p252815o037289n030683m182794l491890k926497k426080
58158B9467239j970364j578877j241664r11674n68754k31004J09786N09106J008342
58149B4592136J609472K341320L272961M345330N175655N152849L878332J567407
58141E1935462j026502l126372m384931m895120m898720m581231m078127l516917
$$ plain form
58133 21427542 18445190 15952596 13903661 12229253 10846841 9697306 8747678 7962676
58125 7962676 7302046 6743644 6281103 5897047 5562003 5259988 4991874 4752040 4523583
58116 4523583 4298728 4083500 3879700 3681319 3490890 3320401 3172568 3037991 2913240
58107 2913240 2805189 2715130 2634905 2561177 2497498 2439596 2374589 2298429 2219739 2143552 2065703
58096 2065703 1986158 1913062 1849427 1789049 1729347 1675536 1628851 1583303 1537535 1497564 1464532
58085 1464532 1431936 1398195 1369722 1347915 1325095 1297338 1269834 1245562 1219952 1191017 1164000
58074 1164000 1141553 1119394 1095793 1075466 1060095 1044691 1027227 1012339 1001672 990084 975342
58063 975342 962229 953071 943414 931181 921077 915670 910706 903423 896962 892430 885191 873449 862323
$$ packed form
58133B1427542k982352k492594k048935j674408j382412j149535r49628p85002
58125G962676o60630n58402m62541l84056l35044l02015k68114k39834k28457
58116D523583k24855k15228k03800j98381j90429j70489j47833j34577j24751
58107B913240j08051r0059q0225p3728o3679n7902o5007p6160p8690p6187p7849
58096B065703p9545p3096o3635o0378n9702n3811m6685m5548m5768l9971l3032
58085A464532l2596l3741k8473k1807k2820k7757k7504k4272k5610k8935k7017
58074A164000k2447k2159k3601k0327j5371j5404j7464j4888j0667j1588j4742
58063I75342j3113r158r657j2233j0104n407m964p283o461m532p239j1742j1126
$$ plain form
58050 862323 854903 847187 836365 826318 820252 815289 809092 804801 804671 805429 804408 804019 805997 807477
58036 807477 806847 807443 811522 816435 820292 825380 832477 837843 839405 839957 840984 839489 834330 829376 826779
58021 826779 823251 816640 810016 805536 800333 792388 784588 779029 773076 764960 757638 753184 748902 742818
58007 742818 737436 734167 729690 721981 714469 709940 705650 698792 691713 687239 683643 678710 674239 672223
57993 672223 670816 668133 665782 664819 662638 657742 653181 651473 650580 648744 648658 652665 658285 662761 667795
57978 667795 675469 683606 689568 694776 701130 706715 709341 710704 712774 713529 710481 705067 699484 692574
57964 692574 682909 672607 663993 655655 645824 636457 629950 624907 619142 613722 609980 605636 598179 589416
57950 589416 582614 577727 573285 570252 570027 571077 571397 571994 574386 577118 578312 579036 580641 581369 579343
$$ packed form
58050H62323p420p716j0822j0047o066m963o197m291j30P58j021l89J978J480
58036H07477o30N96M079M913L857N088P097N366J562N52J027j495n159m954k597
58021H26779l528o611o624m480n203p945p800n559n953q116p322m454m282o084
58007G42818n382l269m477p709p512m529m290o858p079m474l596m933m471k016
57993F72223j407k683k351r63k181m896m561j708q93j836q6M007N620M476N034
57978F67795P674Q137N962N208O354N585K626J363K070P55l048n414n583o910
57964F92574r665j0302q614q338r831r367o507n043n765n420l742m344p457q763
57950E89416o802m887m442l033k25J050L20N97K392K732J194P24J605P28k026
$$ plain form
57935 579343 576348 574947 574257 572174 569376 567443 565395 561668 557253 553395 548609 541495 534132 529093
57921 529093 525453 521300 517769 516835 517488 517871 519068 522974 528531 533785 539587 547474 555925 562567 568267
57906 568267 575320 583409 591025 599007 608796 618796 626161 630779 634078 635667 634758 633125 632836 632495 629438
57891 629438 624244 619406 614942 608985 601532 594064 586559 578305 570522 564826 560217 554833 549488 546216
57877 546216 544574 542683 540727 540090 540214 539619 538978 540022 542484 545233 549092 555310 562526 568580 574175
57862 574175 581395 589699 596818 602599 608553 614473 618835 621762 624450 626425 626478 625396 624698 623577 620130
57847 620130 614704 609062 603286 596561 589808 584357 579106 572276 564884 559159 554666 549460 544016 540369
57833 540369 538255 535733 532867 531104 529682 526366 521308 516562 512205 506477 499401 492673 486276 478768
$$ packed form
57935E79343k995j401o90k083k798j933k048l727m415l858m786p114p363n039
57921E29093l640m153l531r34O53L83J197L906N557N254N802P887Q451O642N700
57906E68267P053Q089P616P982R789J0000P365M618L299J589r09j633k89l41l057
57891F29438n194m838m464n957p453p468p505q254p783n696m609n384n345l272
57877E46216j642j891j956o37J24n95o41J044K462K749L859O218P216O054N595
57862E74175P220Q304P119N781N954N920M362K927K688J975N3j082o98j121l447
57847F20130n426n642n776o725o753n451n251o830p392n725m493n206n444l647
57833E40369k114k522k866j763j422l316n058m746m357n728p076o728o397p508
$$ plain form
57819 478768 470664 464002 458650 452568 445721 440249 436717 433525 430142 427618 425840 423481 420822 419522
57805 419522 419502 419138 418457 418984 420506 421261 421391 422849 425812 428590 431292 436057 443243 450790 458026 466802
57789 466802 478093 490492 502672 514340 524173 530063 532290 533597 535317 536231 535884 535911 537072 537870
57775 537870 537257 536092 534866 532570 528945 525427 522756 519878 516290 513312 512037 511971 512573 514235 516994
57760 516994 520138 523680 528383 533934 539086 543938 549968 557533 565409 573025 580781 587950 592755 595086
57746 595086 596814 598992 601094 603307 606980 612207 617451 622196 627516 633475 638510 642117 645653 649832
57732 649832 653918 658049 663677 670873 677888 684373 692378 703042 714915 726801 739701 754477 770070
57719 770070 785655 802452 821681 842575 864020 886553 911339 938558 967946 999526 1032927
$$ packed form
57819D78768q104o662n352o082o847n472l532l192l383k524j778k359k659j300
57805D19522k0l64o81N27J522P55J30J458K963K778K702M765P186P547P236Q776
57789D66802J1291J2399J2180J1668R833N890K227J307J720R14l47K7J161P98
57775E37870o13j165j226k296l625l518k671k878l588k978j275o6O02J662K759
57760E16994L144L542M703N551N152M852O030P565P876P616P756P169M805K331
57746E95086J728K178K102K213L673N227N244M745N320N959N035L607L536M179
57732F49832M086M131N628P196P015O485Q005J0664J1873J1886J2900J4776J5593
57719G70070J5585J6797J9229K0894K1445K2533K4786K7219K9388L1580L3401
$$ plain form
57708 1032927 1067486 1103770 1143397 1186810 1233142 1282901 1338644 1402187 1473280 1551955 1639942
57697 1639942 1738656 1848010 1968597 2103057 2253957 2422097 2608174 2814233 3042112 3291893
57687 3291893 3562774 3853372 4159593 4473383 4784190 5079743 5344840 5562285 5717699
57678 5717699 5803232 5817007 5762015 5647155 5486748 5296465 5090267 4881566 4684449 4511543
57668 4511543 4372124 4273218 4218933 4204311 4209986 4206027 4163545 4065444 3910810 3712787 3491508
57657 3491508 3265712 3048451 2848226 2670805 2518526 2390093 2283256 2196986 2130165 2079954
57647 2079954 2043226 2018444 2004840 2001065 2006137 2020437 2044297 2076827 2117613 2168358 2231290 2306973
57635 2306973 2395166 2496722 2613143 2745254 2893834 3060598 3247051 3453066 3677682 3920070
$$ packed form
57708A032927L4559L6284L9627M3413M6332M9759N5743O3543P1093P8675Q7987
57697A639942R8714J09354J20587J34460J50900J68140J86077K06059K27879K49781
57687C291893K70881K90598L06221L13790L10807K95553K65097K17445J55414
57678E717699Q5533J3775n4992j14860j60407j90283k06198k08701j97117j72906
57668D511543j39419r8906n4285j4622N675l959m2482r8101j54634j98023k21279
57657C491508k25796k17261k00225j77421j52279j28433j06837q6270o6821n0211
57647B079954l6728k4782j3604l775N072J4300K3860L2530M0786N0745O2932P5683
57635B306973Q8193J01556J16421J32111J48580J66764J86453K06015K24616K42388
$$ plain form
57625 3920070 4177943 4445473 4713740 4972193 5208529 5408517 5558300 5647410 5669749 5623639
57615 5623639 5512804 5346499 5136838 4895733 4634418 4363999 4094280 3832150 3582002
57606 3582002 3347034 3129180 2928683 2745071 2578242 2427989 2293334 2173132 2066441
57597 2066441 1971619 1886203 1808620 1738965 1677222 1621895 1571370 1525395 1484071 1446550 1411915
57586 1411915 1380334 1352215 1327193 1304900 1285565 1268848 1253381 1238566 1225532 1215166 1206541
57575 1206541 1198554 1191728 1186932 1183633 1180967 1179354 1179513 1181012 1183333 1187254 1193606 1201742 1210802 1221338
57561 1221338 1234001 1247775 1261396 1275628 1292252 1311553 1332566 1355080 1379660 1406370 1435165
57550 1435165 1466961 1502708 1542067 1584599 1631442 1684174 1742870 1807150 1878385 1958899 2049520
$$ packed form
57625C920070K57873K67530K68267K58453K36336J99988J49783Q9110K2339m6110
57615E623639j10835j66305k09661k41105k61315k70419k69719k62130k50148
57606C582002k34968k17854k00497j83612j66829j50253j34655j20202j06691
57597B066441r4822q5416p7583o9655o1743n5327n0525m5975m1324l7521l4635
57586A411915l1581k8119k5022k2293j9335j6717j5467j4815j3034j0366q625
57575A206541p987o826m796l299k666j613J59J499K321L921O352Q136R060J0536
57561A221338J2663J3774J3621J4232J6624J9301K1013K2514K4580K6710K8795
57550A435165L1796L5747L9359M2532M6843N2732N8696O4280P1235Q0514R0621
$$ plain form
57539 2049520 2149925 2260926 2384377 2521116 2670955 2834558 3013271 3206870 3412975
57530 3412975 3628483 3849600 4069954 4279963 4468451 4624217 4736895 4798544 4805496 4758455
57520 4758455 4661411 4521431 4348757 4155044 3950671 3743789 3540860 3346612 3163811 2994328
57510 2994328 2840127 2702183 2579226 2469079 2370900 2284844 2210195 2145451 2089882 2043429
57500 2043429 2005293 1974061 1948960 1929637 1915081 1904236 1897383 1895454 1898236 1904719 1914806 1929163
57488 1929163 1947673 1969754 1996110 2028551 2068137 2114908 2169283 2232163 2303810 2384230 2474693
57477 2474693 2577285 2692962 2821511 2963413 3120111 3292243 3478922 3678571 3888590
57468 3888590 4103671 4315552 4514500 4689853 4829694 4922583 4961124 4943472 4871822 4751125
$$ packed form
57539B049520J00405J11001J23451J36739J49839J63603J78713J93599K06105
57530C412975K15508K21117K20354K10009J88488J55766J12678O1649O952m7041
57520D758455r7044j39980j72674j93713k04373k06882k02929j94248j82801j69483
57510B994328j54201j37944j22957j10147r8179q6056p4649o4744n5569m6453
57500B043429l8136l1232k5101j9323j4556j0845o853j929K782O483J0087J4357
57488A929163J8510K2081K6356L2441L9586M6771N4375O2880P1647Q0420R0463
57477B474693J02592J15677J28549J41902J56698J72132J86679J99649K10019
57468C888590K15081K11881J98948J75353J39841R2889L8541j7652p1650j20697
$$ plain form
57458 4751125 4589482 4397754 4187268 3967889 3747805 3533553 3329582 3138617 2962697
57449 2962697 2803099 2659479 2530376 2414800 2312469 2222662 2144011 2075391 2015843 1963728
57439 1963728 1917267 1875924 1840004 1808957 1781403 1756804 1735586 1717485 1701325 1686686 1674312
57428 1674312 1664490 1656334 1649083 1642868 1637846 1633780 1630829 1629506 1629484 1629621 1629584 1630330 1632593 1635950 1639722
57413 1639722 1643720 1647747 1651393 1654790 1658744 1663846 1670188 1677859 1686691 1695626 1703592 1711145 1720001 1730813
57399 1730813 1742592 1754390 1766230 1778214 1790112 1802144 1814882 1828068 1840782 1853076 1866066
57388 1866066 1880070 1894057 1907336 1920470 1933995 1947596 1961079 1974849 1988801 2001995 2014172
57377 2014172 2026425 2039668 2053479 2067120 2080695 2094614 2108854 2123375 2138450 2153996 2169486
$$ packed form
57458D751125j61643j91728k10486k19379k20084k14252k03971j90965j75920
57449B962697j59598j43620j29103j15576j02331q9807p8651o8620n9548n2115
57439A963728m6461m1343l5920l1047k7554k4599k1218j8101j6160j4639j2374
57428A674312r822q156p251o215n022m066k951j323k2J37l7P46K263L357L772
57413A639722L998M027L646L397L954N102O342P671Q832Q935P966P553Q856J0812
57399A730813J1779J1798J1840J1984J1898J2032J2738J3186J2714J2294J2990
57388A866066J4004J3987J3279J3134J3525J3601J3483J3770J3952J3194J2177
57377B014172J2253J3243J3811J3641J3575J3919J4240J4521J5075J5546J5490
$$ plain form
57366 2169486 2184938 2201116 2218281 2235639 2252497 2269104 2285924 2302934 2319994 2337114 2354098
57355 2354098 2370801 2387831 2405987 2424928 2443583 2461927 2480948 2500644 2519672 2537484 2555335
57344 2555335 2574471 2594735 2615637 2637466 2660427 2683805 2706787 2729168 2750737 2771152 2790976
57333 2790976 2811557 2833196 2854740 2875629 2896904 2919336 2942027 2963989 2985816 3008609 3032325
57322 3032325 3056385 3080901 3106144 3131661 3157012 3182542 3208452 3234103 3259304 3285331 3313398
57311 3313398 3342908 3372397 3401476 3430686 3460248 3490244 3521416 3554421 3588642 3622879 3656983
57300 3656983 3691773 3727696 3764500 3801962 3840157 3879283 3919855 3962610 4007588 4053866 4100917
57289 4100917 4149538 4200681 4254044 4308714 4364568 4422046 4481056 4541139 4602321 4664744 4727682
$$ packed form
57366B169486J5452J6178J7165J7358J6858J6607J6820J7010J7060J7120J6984
57355B354098J6703J7030J8156J8941J8655J8344J9021J9696J9028J7812J7851
57344B555335J9136K0264K0902K1829K2961K3378K2982K2381K1569K0415J9824
57333B790976K0581K1639K1544K0889K1275K2432K2691K1962K1827K2793K3716
57322C032325K4060K4516K5243K5517K5351K5530K5910K5651K5201K6027K8067
57311C313398K9510K9489K9079K9210K9562K9996L1172L3005L4221L4237L4104
57300C656983L4790L5923L6804L7462L8195L9126M0572M2755M4978M6278M7051
57289D100917M8621N1143N3363N4670N5854N7478N9010O0083O1182O2423O2938
$$ plain form
57278 4727682 4789769 4849999 4907782 4962281 5012366 5057007 5095179 5125807 5148412 5163496 5171817
57267 5171817 5173860 5170532 5163660 5155022 5145365 5135085 5125321 5117542 5112472 5110130 5110598 5114095 5120655 5130375
57253 5130375 5143592 5160221 5179296 5199679 5220873 5242814 5265527 5289426 5315269 5343230 5372542
57242 5372542 5402500 5433092 5464223 5495209 5525716 5556334 5587519 5618794 5649745 5680957 5713052
57231 5713052 5745622 5778059 5810788 5844720 5879968 5915886 5951768 5986862 6020454 6052735 6084843
57220 6084843 6117302 6149329 6180445 6211674 6244059 6277128 6310170 6343986 6379815 6417288 6455160
57209 6455160 6493543 6533602 6575263 6616829 6656944 6695499 6732590 6767959 6801692 6834268 6865621
57198 6865621 6895042 6922159 6947190 6970251 6991280 7010797 7030061 7050367 7072626 7097367 7124513
$$ packed form
57278D727682O2087O0230N7783N4499N0085M4641L8172L0628K2605J5084Q321
57267E171817K043l328o872q638r657j0280r764p779n070k342M68L497O560R720
57253E130375J3217J6629J9075K0383K1194K1941K2713K3899K5843K7961K9312
57242E372542K9958L0592L1131L0986L0507L0618L1185L1275L0951L1212L2095
57231E713052L2570L2437L2729L3932L5248L5918L5882L5094L3592L2281L2108
57220F084843L2459L2027L1116L1229L2385L3069L3042L3816L5829L7473L7872
57209F455160L8383M0059M1661M1566M0115L8555L7091L5369L3733L2576L1353
57198F865621K9421K7117K5031K3061K1029J9517J9264K0306K2259K4741K7146
$$ plain form
57187 7124513 7153374 7183376 7214449 7246206 7277376 7306901 7334991 7362370 7389139 7415335 7441755
57176 7441755 7468862 7495375 7519382 7540596 7560295 7579432 7598198 7617169 7637214 7658023 7678086
57165 7678086 7696456 7713434 7729336 7743676 7755886 7765936 7773896 7779628 7783069 7784102 7782148 7776580
57153 7776580 7767531 7755531 7740499 7721976 7700273 7676444 7651120 7624293 7596297 7568046 7540158
57142 7540158 7512655 7485714 7460013 7436304 7415342 7398185 7385658 7377328 7371580 7366605 7360681 7351736
57130 7351736 7337663 7317236 7290141 7256354 7216385 7172014 7125828 7079941 7035978 6996134 6962997
57119 6962997 6937978 6920676 6909853 6904072 6901165 6898392 6894099 6889051 6885975 6888345 6899859 6924345 6965466
57106 6965466 7026503 7110653 7221513 7363541 7542621 7766526 8044921 8389398 8814205 9337123
$$ packed form
57187G124513K8861L0002L1073L1757L1170K9525K8090K7379K6769K6196K6420
57176G441755K7107K6513K4007K1214J9699J9137J8766J8971K0045K0809K0063
57165G678086J8370J6978J5902J4340J2210J0050P960N732L441J033j954n568
57153G776580r049j2000j5032j8523k1703k3829k5324k6827k7996k8251k7888
57142G540158k7503k6941k5701k3709k0962j7157j2527q330n748m975n924q945
57130G351736j4073k0427k7095l3787l9969m4371m6186m5887m3963l9844l3137
57119F962997k5019j7302j0823n781k907k773m293n048l076K370J1514K4486M1121
57106F965466O1037Q4150J10860J42028J79080K23905K78395L44477M24807N22918
$$ plain form
57096 9337123 9979268 10763928 11715806 12861411 14229613 15850863 17754455 19964598 22496294
57087 22496294 25351153 28513181 31946105 35593313 39377447 43196638 46925207 50434452
57079 50434452 53631918 56485532 58997344 61138674 62804834 63833498 64069464 63422053
57071 63422053 61883685 59518791 56443840 52807264 48771357 44499571 40148961 35862098
57063 35862098 31757104 27921635 24413940 21266506 18488631 16070069 13987248 12208904
57055 12208904 10699155 9420459 8337504 7419119 6637310 5966873 5387063 4882129 4439250
57046 4439250 4047118 3696938 3383034 3101249 2847654 2619155 2413785 2229441 2063444
57037 2063444 1913831 1779682 1659524 1550834 1451808 1362251 1281997 1209794 1144465 1085688
$$ packed form
57096I337123O42145P84660R51878J145605J368202J621250J903592K210143K531696
57087B2496294K854859L162028L432924L647208L784134L819191L728569L509245
57079E0434452L197466K853614K511812K141330J666160J028664K35966o47411
57071F3422053j538368k364894l074951l636576m035907m271786m350610m286863
57063C5862098m104994l835469l507695l147434k777875k418562k082821j778344
57055A2208904j509749j278696j082955r18385p81809o70437n79810n04934m42879
57046D439250l92132l50180l13904k81785k53595k28499k05370j84344j65997
57037B063444j49613j34149j20158j08690r9026q9557q0254p2203o5329n8777
$$ plain form
57027 1085688 1032779 984102 938666 897006 859500 825032 792357 761663 733695 708416 685591
57016 685591 665712 649258 635774 624660 616052 610050 605925 603015 601651 602299 604620 608355 614430
57003 614430 624145 637806 655189 676953 704670 739861 784049 839852 911304 1003329 1122306
56992 1122306 1277693 1480332 1732654 2014168 2276265 2458592 2519949 2458890 2307078 2105495
56982 2105495 1886840 1672775 1476375 1302136 1147310 1007535 881040 767314 665008
56973 665008 573521 494604 430126 379439 340533 312184 293235 281297 274134 271294 272893 277981
56961 277981 285688 296739 312220 332100 356562 387303 424955 465540 501253 524788 532294 523700
56949 523700 502310 473664 442858 412576 384058 358887 338429 322414 309672 299965 293895 291529
$$ packed form
57027A085688n2909m8677m5436m1660l7506l4468l2675l0694k7968k5279k2825
57016F85591j9879j6454j3484j1114q608o002m125k910j364O48K321L735O075
57003F14430R715J3661J7383K1764K7717L5191M4188N5803P1452R2025J18977
56992A122306J55387K02639K52322K81514K62097J82327O1357o1059j51812k01583
56982B105495k18655k14065j96400j74239j54826j39775j26495j13726j02306
56973F65008r1487p8917o4478n0687l8906k8349j8949j1938p163k840J599N088
56961B77981P707J1051J5481J9880K4462L0741L7652M0585L5713K3535P506q594
56949E23700k1390k8646l0806l0282k8518k5171k0458j6015j2742r707o070k366
$$ plain form
56937 291529 292321 296126 303322 314391 330236 352418 382353 420574 466546 517312 565405 600180
56925 600180 613579 604651 578088 540037 496328 452393 411823 375145 341597 311597 286209 265215
56913 265215 247571 233050 221774 212761 204674 197455 191655 186722 181603 176503 172393 169279 166505
56900 166505 164257 163061 162259 160746 158928 158369 159761 162746 167443 174603 184500 197126 213274 234162
56886 234162 260302 291794 328766 369571 408933 439915 458094 463098 457008 443100 425557 408064
56874 408064 392075 377473 364639 354606 347711 343850 343817 348803 358746 372857 391587 416537 448664
56861 448664 488397 537484 598663 672456 754499 835368 902181 942196 948417 923327 876543 818681
56849 818681 757685 699037 646402 601398 564476 536421 518012 508690 507310 514041 529986 555346
$$ packed form
56937B91529P92L805P196J1069J5845K2182K9935L8221M5972N0766M8093L4775
56925F00180J3399q928k6563l8051m3709m3935m0570l6678l3548l0000k5388k0994
56913B65215j7644j4521j1276r013q087p219n800m933n119n100m110l114k774
56900A66505k248j196q02j513j818n59J392K985M697P160R897J2626J6148K0888
56886B34162K6140L1492L6972M0805L9362L0982J8179N004o090j3908j7543j7493
56874D08064j5989j4602j2834j0033o895l861l3M986R943J4111J8730K4950L2127
56861D48664L9733M9087O1179P3793Q2043Q0869O6813M0015O221k5090m6784n7862
56849H18681o0996n8648n2635m5004l6922k8055j8409r322j380O731J5945K5360
$$ plain form
56837 555346 589900 635230 694744 771646 868284 985816 1120174 1256848 1372451 1444614 1461800
56826 1461800 1425812 1348273 1245433 1133001 1022184 919101 827022 747966 682533 630209
56816 630209 590602 563434 547370 540486 542246 553813 576400 610876 659098 723813 806001 902094
56804 902094 1002548 1091881 1152104 1170472 1146108 1088540 1010128 921083 829918 744078 668101
56793 668101 603035 548736 505147 471106 444431 424340 411902 407364 409152 416521 431038 454313
56781 454313 486246 526491 574963 628549 678745 714815 729221 719840 689158 643212 589934 536055
56769 536055 485128 438623 397616 362522 332519 306684 285026 267606 253589 242071 232875 225701
56757 225701 219465 213351 207619 202672 198212 193976 190291 187284 184531 182017 180276 179083 177309 174665
$$ packed form
56837E55346L4554M5330N9514P6902R6638J17532J34358J36674J15603P2163J7186
56826A461800l5988p7539j02840j12432j10817j03083r2079p9056o5433n2324
56816F30209l9607k7168j6064o884J760J1567K2587L4476M8222O4715Q2188R6093
56804I02094J00454Q9333O0223J8368k4364n7568p8412q9045r1165q5840p5977
56793F68101o5066n4299m3589l4041k6675k0091j2438m538J788P369J4517K3275
56781D54313L1933M0245M8472N3586N0196L6070J4406r381l0682m5946n3278n3879
56769E36055n0927m6505m1007l5094l0003k5835k1658j7420j4017j1518r196p174
56757B25701o236o114n732m947m460m236l685l007k753k514j741j193j774k644
$$ plain form
56743 174665 172224 170582 168919 166619 164319 162458 160265 157171 153911 151205 148590 145604 142872 141025
56729 141025 139661 138411 137872 138527 139726 140611 141004 140797 139685 138117 137106 136461 134809 132126 130424 130900
56713 130900 132223 132854 133261 134326 135313 135249 134893 135508 136727 137406 137571 137918 138246 138019 137644 137727 137782 137055 135881
56694 135881 134976 134229 133445 133346 134453 135762 135959 135303 135070 135819 137270 139146 141022 142226 142936 144488 147504
56677 147504 150758 153018 154910 157614 160725 162820 163309 162476 160540 157955 155776 154565 153735 152938 152857 153549
56661 153549 153400 151214 148067 145596 143748 141928 141053 142470 145737 149419 153268 157763 162256 165551 167809
56646 167809 170136 172733 175014 176937 178621 179303 178328 176589 175376 174399 172540 169833 167064 164143 160647
56631 160647 157293 154956 152797 149293 144742 140901 138495 136873 135704 135155 134655 133406 132047 132057 133520
$$ packed form
56743A74665k441j642j663k300k300j861k193l094l260k706k615k986k732j847
56729A41025j364j250n39O55J199Q85L93k07j112j568j011o45j652k683j702M76
56713A30900J323O31M07J065R87o4l56O15J219O79J65L47L28k27l75Q3N5p27j174
56694A35881r05p47p84r9J107J309J97o56k33P49J451J876J876J204P10J552L016
56677A47504L254K260J892K704L111K095M89q33j936k585k179j211q30p97q1O92
56661A53549j49k186l147k471j848j820q75J417L267L682L849M495M493L295K258
56646A67809K327K597K281J923J684O82r75j739j213r77j859k707k769k921l496
56631A60647l354k337k159l504m551l841k406j622j169n49n00j249j359J0J463
$$ plain form
56616 133520 135016 135638 135674 135467 135092 135022 135742 136853 137752 138729 140134 141152 140972 140485 141084 142347 142835 142685
56598 142685 143390 145177 146631 146949 146732 146513 146162 145835 145908 145954 145331 144663 145178 146699 147934 148626 149655 151065
56580 151065 151847 151839 152109 153202 154592 156112 158282 160949 163050 164156 164990 166164 167669 169758 173009 177261
56564 177261 181648 185849 190267 194978 199610 204296 209551 215277 220948 226699 233092 239973 246643 252927
56550 252927 258926 264051 267544 269638 271011 271504 270653 268981 267279 265046 261302 256573 252463 249438 246575
56535 246575 243273 239643 235530 230809 226478 223783 222391 220891 218899 217084 215488 213548 211499 209893
56521 209893 207903 203980 198219 192313 187202 182521 178262 175055 172621 169751 166087 162462 159397 156734
56507 156734 154682 153659 153159 152375 151781 152433 153914 154740 154669 154827 155691 156739 158038 160305 163438 166717
$$ packed form
56616A33520J496O22L6k07l75p0P20J111Q99R77J405J018j80m87N99J263M88j50
56598A42685P05J787J454L18k17k19l51l27P3M6o23o68N15J521J235O92J029J410
56580A51065P82qK70J093J390J520K170K667K101J106Q34J174J505K089L251M252
56564A77261M387M201M418M711M632M686N255N726N671N751O393O881O670O284
56550B52927N999N125L493K094J373M93q51j672j702k233l744m729m110l025k863
56535B46575l302l630m113m721m331k695j392j500j992j815j596j940k049j606
56521B09893j990l923n761n906n111m681m259l207k434k870l664l625l065k663
56507A56734k052j023n00p84n94O52J481Q26p1J58Q64J048J299K267L133L279
$$ plain form
56491 166717 170276 174575 178714 181260 182583 184273 186502 188115 189172 190972 193546 195569 196956 199137
56477 199137 202427 205434 207524 209584 211935 213758 215101 217250 220489 223556 225854 228158 230671 232462
56463 232462 233368 234408 235832 236871 237812 240113 243868 247351 249666 251725 254028 255702 256356 256770 257113
56448 257113 256706 256103 257053 259669 261940 262881 263788 265518 266935 267144 267001 267234 267160 266417 265846 265502 263830
56431 263830 260105 255780 252197 248763 244584 240075 235822 231514 227070 223170 219725 215612 210828 207119
56417 207119 205487 204783 203635 202011 200133 197757 195432 194543 195237 196074 196445 197307 198877 199896 200082 201044
56401 201044 203634 206549 208644 210508 212657 214266 214837 215045 214907 213304 210353 208021 207277 206900 206171 206282
56385 206282 207845 209491 210387 211664 213870 215489 215597 215565 216432 217029 216620 217046 220157 225185 230667 236897
$$ packed form
56491A66717L559M299M139K546J323J690K229J613J057J800K574K023J387K181
56477A99137L290L007K090K060K351J823J343K149L239L067K298K304K513J791
56463B32462R06J040J424J039R41K301L755L483K315K059K303J674O54M14L43
56448B57113m07o03R50K616K271R41R07J730J417K09j43K33p4p43n71l44j672
56431B63830l725m325l583l434m179m509m253m308m444l900l445m113m784l709
56417B07119j632p04j148j624j878k376k325q89O94Q37L71Q62J570J019J86R62
56401B01044K590K915K095J864K149J609N71K08j38j603k951k332p44l77p29J11
56385B06282J563J646Q96J277K206J619J08l2Q67N97m09M26L111N028N482O230
$$ plain form
56369 236897 244414 251929 257916 262586 266466 268730 268850 268232 268354 268799 268746 268738 269315 269573 268759 267712 267252
56352 267252 266804 266036 265985 267192 268698 270296 273618 279396 285860 291448 296855 302690 307551 310474 313009
56337 313009 316716 320781 324212 328197 333988 340521 346497 352901 361105 370264 378820 386839 394771 401820
56323 401820 407739 414341 422974 432244 440290 447389 454260 459951 463774 467265 471795 476130 478672 480095
56309 480095 481462 481885 480616 479343 479734 480667 480502 480091 480829 481817 481843 482193 484536 487870 490502 493216 497481
56292 497481 502449 506910 512383 520908 531311 541044 550312 561116 573590 586620 600906 618040 637528
56279 637528 657790 679178 703115 729338 756920 786873 820783 858013 897178 939238 986168
56268 986168 1037755 1092804 1152467 1219379 1294469 1377472 1469551 1572529 1686628 1811769 1949988
$$ packed form
56369B36897P517P515N987M670L880K264J20o18J22M45n3qN77K58q14j047m60
56352B67252m48p68n1J207J506J598L322N778O464N588N407N835M861K923K535
56337C13009L707M065L431L985N791O533N976O404Q204R159Q556Q019P932P049
56323D01820N919O602Q633R270Q046P099O871N691L823L491M530M335K542J423
56309D80095J367M23j269j273L91R33j65m11P38R88K6L50K343L334K632K714M265
56292D97481M968M461N473Q525J0403R733R268J0804J2474J3030J4286J7134J9488
56279F37528K0262K1388K3937K6223K7582K9953L3910L7230L9165M2060M6930
56268I86168N1587N5049N9663O6912P5090Q3003R2079J02978J14099J25141J38219
$$ plain form
56257 1949988 2103683 2272590 2455166 2651515 2861969 3084149 3314458 3551047 3792023
56248 3792023 4031933 4263233 4480174 4678260 4851291 4992564 5098313 5167227 5198022 5190716
56238 5190716 5149145 5078976 4984277 4868809 4738927 4601496 4460068 4316179 4172788 4032825
56228 4032825 3895852 3760015 3626064 3495737 3367524 3238088 3106956 2975989 2845305
56219 2845305 2713663 2581992 2452522 2325165 2198587 2074075 1954555 1840521 1730780
56210 1730780 1626453 1530333 1442830 1362238 1288308 1221901 1161919 1106393 1055881 1012102 974000
56199 974000 938861 906424 878084 853056 829300 807339 789137 774043 759769 746468 735801
56188 735801 727003 718079 709879 704683 701711 698463 695575 695716 698433 700727 702193 705021 709504 714031
$$ packed form
56257A949988J53695J68907J82576J96349K10454K22180K30309K36589K40976
56248C792023K39910K31300K16941J98086J73031J41273J05749O8914L0795p306
56238E190716m1571p0169r4699j15468j29882j37431j41428j43889j43391j39963
56228D032825j36973j35837j33951j30327j28213j29436j31132j30967j30684
56219B845305j31642j31671j29470j27357j26578j24512j19520j14034j09741
56210A730780j04327r6120q7503q0592p3930o6407n9982n5526n0512m3779l8102
56199I74000l5139l2437k8340k5028k3756k1961j8202j5094j4274j3301j0667
56188G35801q798q924q200n196k972l248k888J41K717K294J466K828M483M527
$$ plain form
56174 714031 718982 726031 734037 740092 744152 748371 752689 755507 757690 761131 764352 764556 763101 763709 766077
56159 766077 766713 765482 765710 768151 770483 772624 777057 783856 790803 798361 809180 822704 835749 848494
56145 848494 864523 884898 907545 932469 962090 996452 1033659 1075097 1124736 1183447 1249685
56134 1249685 1325524 1415803 1520949 1636316 1758344 1885025 2010327 2125020 2224351 2309590
56124 2309590 2382282 2443397 2497901 2552647 2608013 2657355 2695283 2720625 2731739 2726607 2708761
56113 2708761 2686084 2662078 2633969 2599489 2558469 2507308 2439714 2354823 2258182 2153960 2043250
56102 2043250 1930661 1824533 1728632 1640642 1560124 1490531 1431918 1379463 1331237 1290233 1257040
56091 1257040 1227999 1202306 1183288 1170783 1159848 1148828 1140940 1136123 1129513 1120149 1113104 1110716
$$ packed form
56174G14031M951P049Q006O055M060M219M318K818K183L441L221K04j455O08K368
56159G66077O36j231K28K441K332K141M433O799O947P558J0819J3524J3045J2745
56145H48494J6029K0375K2647K4924K9621L4362L7207M1438M9639N8711O6238
56134A249685P5839R0279J05146J15367J22028J26681J25302J14693R9331Q5239
56124B309590P2692O1115N4504N4746N5366M9342L7928K5342J1114n132j7846
56113B708761k2677k4006k8109l4480m1020n1161o7594q4891r6641j04222j10710
56102B043250j12589j06128r5901q7990q0518o9593n8613n2455m8226m1004l3193
56091A257040k9041k5693j9018j2505j0935j1020p888m817o610r364p045k388
$$ plain form
56079 1110716 1109671 1108853 1111658 1118163 1123485 1126528 1132051 1141555 1150686 1158194 1168630 1183277 1197277
56066 1197277 1208762 1221983 1238313 1253127 1264777 1277659 1293243 1307246 1318855 1333265 1351789
56055 1351789 1369030 1383290 1399919 1420823 1440790 1457943 1477432 1500854 1522637 1541207 1563008
56044 1563008 1590943 1619620 1646605 1677235 1713360 1748620 1780126 1813567 1851601 1888722 1922970
56033 1922970 1960753 2004349 2046805 2085088 2125912 2172387 2217791 2259195 2304105 2356484 2409292
56022 2409292 2458278 2509827 2567537 2624604 2677547 2733762 2797316 2861290 2922595 2989795 3067346
56011 3067346 3146918 3223574 3305282 3396826 3490115 3580733 3677947 3787473 3900748 4012572 4132464
56000 4132464 4266491 4405109 4541632 4685347 4843304 5007093 5171237 5346215 5539084
$$ packed form
56079A110716j045q18K805O505N322L043N523R504R131P508J0436J4647J4000
56066A197277J1485J3221J6330J4814J1650J2882J5584J4003J1609J4410J8524
56055A351789J7241J4260J6629K0904J9967J7153J9489K3422K1783J8570K1801
56044A563008K7935K8677K6985L0630L6125L5260L1506L3441L8034L7121L4248
56033A922970L7783M3596M2456L8283M0824M6475M5404M1404M4910N2379N2808
56022B409292M8986N1549N7710N7067N2943N6215O3554O3974O1305O7200P7551
56011C067346P9572P6656Q1708R1544R3289R0618R7214J09526J13275J11824J19892
56000D132464J34027J38618J36523J43715J57957J63789J64144J74978J92869
$$ plain form
55991 5539084 5740102 5943108 6159362 6396019 6641783 6890080 7154864 7446375 7753864
55982 7753864 8070518 8411907 8790437 9196157 9623321 10090051 10609839 11170870 11767193
55973 11767193 12421914 13154793 13957515 14828009 15796916 16891284 18107457 19452339 20975203
55964 20975203 22725541 24721215 26996789 29639340 32735692 36335081 40511820 45410160
55956 45410160 51176829 57919137 65801015 75120648 86243075 99576446 115740439 135692006
55948 135692006 160627057 191915686 231079690 278965403 333615428 388402033 433080145
55941 433080145 458165933 459509602 439475435 404437824 361350062 315791941 271604418
55934 271604418 231095113 195329610 164545353 138558919 116953771 99139190 84476319
$$ packed form
55991E539084K01018K03006K16254K36657K45764K48297K64784K91511L07489
55982G753864L16654L41389L78530M05720M27164M66730N19788N61031N96323
55973A1767193O54721P32879Q02722Q70494R68907J094368J216173J344882J522864
55964B0975203J750338J995674K275574K642551L096352L599389M176739M898340
55956D5410160N766669O742308P881878R319633J1122427J3333371J6163993J9951567
55948A35692006K4935051L1288629L9164004M7885713N4650025N4786605M4678112
55941D33080145K5085788J343669k0034167l5037611m3087762m5558121m4187523
55934B71604418m0509305l5765503l0784257k5986434k1605148j7814581j4662871
$$ plain form
55927 84476319 72414727 62497241 54304923 47479330 41768110 36985353 32948256 29494554
55919 29494554 26525259 23976106 21767638 19822739 18105739 16600615 15270103 14072097
55911 14072097 12994748 12039063 11184580 10404320 9695532 9064253 8495603 7968324 7482960
55902 7482960 7047810 6651778 6277697 5928473 5614465 5328083 5055298 4799691 4571323
55893 4571323 4363400 4162640 3971786 3800113 3642156 3486922 3338277 3205938 3085695
55884 3085695 2967975 2856665 2760265 2673165 2584238 2495732 2415806 2340690 2262023 2184141 2116583
55873 2116583 2056578 1995722 1936853 1887615 1844000 1796839 1748645 1708112 1673549 1637200 1600438
55862 1600438 1569323 1540236 1505069 1466255 1432261 1402479 1370542 1338426 1313485 1295291 1278647
$$ packed form
55927H4476319j2061592r917486q192318o825593n711220m782757m037097l453702
55919B9494554k969295k549153k208468j944899j717000j505124j330512j198006
55911A4072097j077349r55685q54483p80260p08788o31279n68650n27279m85364
55902G482960m35150l96032l74081l49224l14008k86382k72785k55607k28368
55893D571323k07923k00760j90854j71673j57957j55234j48645j32339j20243
55884C085695j17720j11310r6400q7100q8927q8506p9926p5116p8667p7882o7558
55873B116583o0005o0856n8869m9238m3615m7161m8194m0533l4563l6349l6762
55862A600438l1115k9087l5167l8814l3994k9782l1937l2116k4941j8194j6644
$$ plain form
55851 1278647 1265999 1263950 1270911 1280467 1293081 1311902 1330474 1337255 1329839 1313502 1289184 1254631
55839 1254631 1214116 1174978 1136744 1094600 1050888 1012272 978258 943426 908553 878888 853827
55828 853827 828824 805201 787733 774698 760444 745621 734919 726901 716107 703157 692905 684570
55816 684570 673499 660879 651964 646394 639839 633415 631806 633602 633160 630757 631391 634620 635036 632014
55802 632014 629821 628740 625047 619193 615278 612827 607468 599208 591744 584246 572237 556165 540898
55789 540898 527195 511755 495205 481807 471485 460201 448051 439006 432816 425147 415820 409115
55777 409115 405772 402489 399575 401195 407265 412353 413372 411575 406750 396707 383113 370883 361025
55764 361025 350498 339368 331270 326449 321293 315400 312302 312356 311507 308042 304276 300810 295390 288211
$$ packed form
55851A278647j2648k049O961R556J2614J8821J8572O781p416j6337k4318l4553
55839A254631m0515l9138l8234m2144m3712l8616l4014l4832l4873k9665k5061
55828H53827k5003k3623j7468j3035j4254j4823j0702q018j0794j2950j0252q335
55816F84570j1071j2620q915n570o555o424j609J796m42k403O34L229M16l022
55802F32014k193j081l693n854l915k451n359q260p464p498j2009j6072j5267
55789E40898j3703j5440j6550j3398j0322j1284j2150r045o190p669r327o705
55777D09115l343l283k914J620O070N088J019j797m825j0043j3594j2230r858
55764C61025j0527j1130q098m821n156n893l098N4q49l465l766l466n420p179
$$ plain form
55750 288211 282124 276787 268724 257984 248635 241908 234898 226864 220691 217133 213527 209236 206635 205770
55736 205770 203740 200326 198548 198795 198100 196158 196293 199397 202490 204303 206626 209021 208013 202960 197343
55721 197343 192868 187549 180907 175681 172886 170302 167243 165828 166270 165926 164356 164241 166094 167235 167339
55706 167339 169784 175855 182741 188950 196643 206704 216391 223958 231027 238322 243528 245402 245890 246170
55692 246170 244582 240287 235111 230123 224178 217399 212250 209658 207734 205652 205014 206266 207709 209271
55678 209271 213208 219870 226683 232482 238729 245325 249556 250667 251264 252700 253105 251515 249845 249218 248265
55663 248265 246606 246019 246624 245925 243225 241099 240906 240766 239548 238873 239488 239564 238275 237253 236807 234638 229975
55646 229975 225090 220932 215259 206908 197992 189857 180848 170225 160419 153055 146386 138965 132388 128050
$$ packed form
55750B88211o087n337q063j0740r349o727p010q034o173l558l606m291k601q65
55736B05770k030l414j778K47o95j942J35L104L093J813K323K395j008n053n617
55721A97343m475n319o642n226k795k584l059j415M42l44j570j15J853J141J04
55706A67339K445O071O886O209P693J0061R687P567P069P295N206J874M88K80
55692B46170j588m295n176m988n945o779n149k592j924k082o38J252J443J562
55678B09271L937O662O813N799O247O596M231J111N97J436M05j590j670o27r53
55663B48265j659n87O05o99k700k126j93j40j218o75O15P6j289j022m46k169m663
55646B29975m885m158n673q351q916q135r009j0623r806p364o669p421o577m338
$$ plain form
55632 128050 124538 120489 116826 114034 110486 105671 101865 100422 99473 97382 95351 94543 93771 92211 91352
55617 91352 92109 92938 92815 93137 94679 95692 94997 93893 93076 90900 86813 83254 81860 80878 78695 76802
55601 76802 76807 77448 77204 77095 78284 79408 78887 77512 76378 74589 71358 68185 66709 66423 66407 67085 68434
55584 68434 68829 67537 66011 65087 63516 60923 59329 59783 60297 59217 57852 57619 57467 56430 55951 57211
55568 57211 58758 59228 59821 61639 63216 63274 63474 65640 68515 69977 70347 70946 71443 71262 71624 73603 75921
55551 75921 77016 77464 78157 78167 76805 75797 76956 79522 82033 84864 88585 91923 93872 96003 100132
55536 100132 105415 110104 114383 119036 123029 124962 125493 126067 126601 126419 125882 125200 123389 120315 117857 117022
55520 117022 115960 112927 109076 106073 103170 99164 95238 93121 92172 90835 89307 88271 86674 83271
$$ packed form
55632A28050l512m049l663k792l548m815l806j443r49k091k031q08p72j560q59
55617I1352P57Q29j23L22J542J013o95j104q17k176m087l559j394r82k183j893
55601G6802NO41k44j09J189J124n21j375j134j789l231l173j476k86j6O78J349
55584F8434L95j292j526r24j571k593j594M54N14j080j365k33j52j037m79J260
55568E7211J547M70N93J818J577N8K00K166K875J462L70N99M97j81L62J979K318
55551G5921J095M48O93J0j362j008J159K566K511K831L721L338J949K131M129
55536A00132N283M689M279M653L993J933N31N74N34j82n37o82j811l074k458q35
55520A17022j062l033l851l003k903m006l926k117r49j337j528j036j597l403
$$ plain form
55506 83271 78809 74364 69307 63303 58363 56188 55241 53188 50571 49256 48923 47989 46587 45730 44794 42692
55490 42692 40325 39081 38102 35771 32741 30738 29512 27727 25810 25097 25102 24419 23456 23511 23932 22931 20642
55473 20642 18739 17535 15946 13935 12700 12779 13864 15864 18313 19604 18766 17162 16612 16881 16924 17197
55457 17197 18553 20136 20753 21121 22362 23489 22949 21576 21394 22406 23161 23563 24477 25338 24839 23367 22271
55440 22271 21356 19608 17711 17266 18038 18517 18697 19830 21857 23474 24348 24991 25006 23770 22338 22269 23083
55423 23083 23226 23049 24305 27030 29414 30585 31197 31452 30833 29639 28698 27740 26015 24187 23521 23606 22974
55406 22974 21545 20402 19599 18480 17716 18622 20661 21888 21849 21935 22965 24504 26376 28768 30870 31402
55390 31402 30502 29433 28600 27559 26583 26423 26860 27186 27625 28574 29127 28268 26892 26626 27297 27547 27233 27077
$$ packed form
55506H3271m462m445n057o004m940k175r47k053k617j315l33r34j402q57r36k102
55490D2692k367j244r79k331l030k003j226j785j917p13No83r63N5M21j001k289
55473B0642j903j204j589k011j235P9J085K000K449J291q38j604n50K69M3K73
55457A7197J356J583O17L68J241J127n40j373j82J012P55M02R14Q61m99j472j096
55440B2271r15j748j897m45P72M79J80J133K027J617Q74O43J5j236j432o9Q14
55423B3083J43j77J256K725K384J171O12K55o19j194r41r58j725j828o66Q5o32
55406B2974j429j143q03j119p64R06K039J227l9Q6J030J539J872K392K102N32
55390C1402r00j069q33j041r76j60M37L26M39R49N53q59j376k66O71K50l14j56
$$ plain form
55372 27077 26709 25397 24053 24132 25139 25607 25924 27556 29924 30825 29758 28265 27080 25514 23671 22667
55356 22667 22465 21846 20655 19870 19468 18498 17224 16865 17232 16923 15869 15280 15148 14350 13304 13885 16322
55339 16322 18652 19732 20422 21328 21687 21172 20637 20424 19772 18484 17337 16506 15406 14332 14382 15450 16197
55322 16197 16257 16586 17398 17747 17449 17508 18294 19119 19776 20704 21514 21265 20324 20052 20576 20832 20761 21346 22451 22876
55302 22876 22749 23574 25635 27484 28319 28680 28631 27535 25965 25461 25982 25871 24763 24141 24500 24470 23455 22736
55284 22736 23029 23190 22347 21245 20573 19871 19001 18712 18869 18037 15769 13534 12539 12353 12433 13152 14429 15114
55266 15114 14617 13709 13085 12746 13182 15281 18446 20722 21405 21752 22566 23136 23179 23676 24884 25512 24851 23870
55248 23870 23346 22743 21765 21159 21102 20665 19704 19326 19624 19021 16902 14891 14347 14538 14482 14684 15669 16581 16697
$$ packed form
55372B7077l68j312j344P9J007M68L17J632K368R01j067j493j185j566j843j004
55356B2667k02o19j191p85m02r70j274l59L67l09j054n89j32p98j046N81K437
55339A6322K330J080O90R06L59n15n35k13o52j288j147q31j100j074N0J068P47
55322A6197O0L29Q12L49k98N9P86Q25O57R28Q10k49r41k72N24K56p1N85J105M25
55302B2876j27Q25K061J849Q35L61m9j096j570n04N21j11j108o22L59l0j015p19
55284B2736K93J61q43j102o72p02q70k89J57q32k268k235r95j86Q0P19J277O85
55266A5114m97r08o24l39M36K099L165K276O83L47Q14N70M3M97J208O28o61r81
55248B3870n24o03r78o06n7m37r61l78K98o03k119k011n44J91n6K02R85R12J16
$$ plain form
55229 16697 16804 17726 18862 19419 19701 20067 19964 19086 18160 17595 16712 15277 14373 14807 16016 17330 18835
55212 18835 20289 20899 21023 22251 24816 26761 26806 26227 26655 27783 28565 28984 29213 28641 27179 26062 25963
55195 25963 25783 24651 23654 24080 25362 26261 26785 27395 27581 26814 25895 25885 26540 26965 26895 26334 25090 23681
55177 23681 23449 24677 25871 25949 25715 26065 26336 25755 24979 24667 24037 22450 21043 21025 21569 21207 20304 20332 21556
55158 21556 23164 24896 26908 28632 29333 29274 29058 28486 27312 26326 26364 26920 26980 26569 26242 25845 25007 24182
55140 24182 23992 24174 24217 24292 24546 24390 23595 23141 23814 24870 25249 25142 25165 25004 24297 23897 24742 26193 26975
55121 26975 27141 27702 28858 29951 30703 31293 31576 31299 30752 30375 30202 30335 31194 32617 33623 33854 34216 35313
55103 35313 36416 36883 37327 38318 39262 39766 40714 42574 43983 43598 42182 41264 40908 40508 40668 42305 44723
$$ packed form
55229A6697J07R22J136N57K82L66j03q78r26n65q83j435r04M34J209J314J505
55212A8835J454O10J24J228K565J945M5n79M28J128P82M19K29n72j462j117r9
55195B5963j80j132r97M26J282Q99N24O10J86p67r19j0O55M25p0n61j244j409
55177B3681k32J228J194P8k34L50K71n81p76l12o30j587j407j8N44l62r03K8J224
55158B1556J608J732K012J724P01n9k16n72j174r86L8N56O0m11l27l97q38q25
55140B4182j90J82M3P5K54j56p95m54O73J056L79j07K3j61p07m00Q45J451P82
55121B6975J66N61J156J093P52N90K83k77n47l77j73J33Q59J423J006K31L62J097
55103C5313J103M67M44R91R44N04R48J860J409l85j416r18l56m00J60J637K418
$$ plain form
55086 44723 46463 47447 48554 49765 50494 51157 52546 54142 54803 54734 55065 55903 56510 56994 58012 59066 58898
55069 58898 57525 56270 55763 55454 55047 54932 55080 54876 54247 53824 53929 54329 54795 54973 54049 51698 49064 47582
55051 47582 47120 46526 45692 45711 47055 48940 50547 51719 52392 52402 51991 51661 51417 50804 49594 47878 45859
55034 45859 44171 43861 45153 46770 47406 47408 48069 49734 51644 53265 54697 56060 57354 58683 59939 60717
55018 60717 61224 62556 65253 68245 70139 70821 70955 70750 70283 70137 70489 70389 69180 67834 67603 68128 68251
55001 68251 67893 67648 67223 65965 64369 63492 63242 62791 62204 62110 62125 61253 59543 57853 56242 54141 51865
54984 51865 50354 49488 48227 46366 44765 43853 43297 43171 44071 45963 48062 49917 51651 53297 54905 57061
54968 57061 60163 63522 66309 69098 73196 78710 84459 89529 93759 97152 100094 103801 109232 115889
$$ packed form
55086D4723J740R84J107J211P29O63J389J596O61o9L31Q38O07M84J018J054j68
55069E8898j373j255n07l09m07j15J48k04o29m23J05M00M66J78r24k351k634j482
55051D7582m62n94q34J9J344J885J607J172O73J0m11l30k44o13j210j716k019
55034D5859j688l10J292J617O36KO61J665J910J621J432J363J294J329J256P78
55018F0717N07J332K697K992J894O82J34k05m67j46L52j00j209j346k31N25J23
55001F8251l58k45m25j258j596q77k50m51n87r4J5q72j710j690j611k101k276
54984E1865j511q66j261j861j601r12n56j26R00J892K099J855J734J646J608K156
54968E7061L102L359K787K789M098N514N749N070M230L393K942L707N431O657
$$ plain form
54954 115889 122943 131006 141341 153826 167317 181560 196924 212411 225762 235596 241936 244701
54942 244701 243351 238093 229853 218981 205478 190478 175895 162484 149798 138138 128810 122109
54930 122109 116670 111318 106236 101897 98156 94858 92215 90199 88532 87498 87767 89283 91286 93408
54916 93408 95762 98139 100317 103061 107527 113782 121139 129736 140383 152982 166561 180760 195664
54903 195664 210137 221881 229363 232329 230576 223931 213579 201717 189542 177004 164558 153376
54891 153376 143570 133979 124226 115434 108453 102898 98406 95203 92955 90616 87990 86036 85059 84139 82912
54876 82912 82329 82939 83908 84492 85056 85821 85957 84843 83056 81282 79409 77403 75889 75021 73891 71889
54860 71889 69641 67895 66523 65299 64582 64404 63962 62806 61599 60942 60426 59564 58672 58059 57331 56317 55772
$$ packed form
54954A15889P054Q063J0335J2485J3491J4243J5364J5487J3351R834O340K765
54942B44701j350n258q240j0872j3503j5000j4583j3411j2686j1660r328o701
54930A22109n439n352n082m339l741l298k643k016j667j034K69J516K003K122
54916I3408K354K377K178K744M466O255P357Q597J0647J2599J3579J4199J4904
54903A95664J4473J1744P482K966j753o645j0352j1862j2175j2538j2446j1182
54891A53376r806r591r753q792o981n555m492l203k248k339k626j954r77r20j227
54876H2912n83O10R69N84N64P65J36j114j787j774j873k006j514q68j130k002
54860G1889k248j746j372j224p17j78m42j156j207o57n16q62q92o13p28j014n45
$$ plain form
54843 55772 56220 56908 56749 55605 53930 51896 49678 47960 47349 47701 48620 50051 51901 53690 55135 56561
54827 56561 58234 59824 60874 61261 60942 59930 58823 58623 59662 61331 63095 65011 67014 68579 69524
54812 69524 70376 71617 73221 75224 77960 81448 85268 89318 93906 98988 104166 109665 116430 125008 135168
54797 135168 146778 160115 175070 190917 206994 222712 236815 247731 254790 258133 257489 252354
54785 252354 243542 233110 222364 211195 199673 188835 179339 170676 162376 154880 148634 143412 138984
54772 138984 135345 131966 128083 124211 121981 121917 122719 123319 124245 126231 128952 132032 135987 141170 146896
54757 146896 152657 159263 167882 178814 191834 206741 222884 239199 255306 271445 286712 298716
54745 298716 305803 308399 307444 302910 294835 284358 272481 259023 243950 228553 214049 200231 186773
$$ packed form
54843E5772M48O88j59j144j675k034k218j718o11L52R19J431J850J789J445J426
54827E6561J673J590J050L87l19j012j107k00J039J669J764J916K003J565R45
54812F9524Q52J241J604K003K736L488L820M050M588N082N178N499O765Q578J0160
54797A35168J1610J3337J4955J5847J6077J5718J4103J0916P059L343o44n135
54785B52354q812j0432j0746j1169j1522j0838r496q663q300p496o246n222m428
54772A38984l639l379l883l872k230o4Q02O00R26J986K721L080L955N183N726
54757A46896N761O606Q619J0932J3020J4907J6143J6315J6107J6139J5267J2004
54745B98716P087K596r55m534q075j0477j1877j3458j5073j5397j4504j3818j3458
$$ plain form
54732 186773 174747 165303 157735 150394 142873 135889 129654 123829 118615 114517 111318 108377 105752 104020
54718 104020 103266 103064 103013 102547 100779 97464 93710 90950 89608 89307 89680 90244 90269 89634 89183 89480 89867 89554
54700 89554 88880 88639 88914 89440 90373 91767 93022 93743 94469 95696 96933 97612 98097 98878 99618 99980 100519 101632
54682 101632 102534 102478 102217 102928 104438 105828 107182 109238 111793 113921 115467 117024 118685 120144 121807
54667 121807 124527 128274 132180 135838 139563 143489 147417 151480 156052 161038 166053 171190 176831 182865
54653 182865 188741 194053 198425 201300 202673 203680 205580 208392 211311 214104 217262 221061 225410 230442
54639 230442 236525 243823 252356 262123 272582 282499 290918 297759 302841 305067 303480 298478 291019 281254
54625 281254 269019 255200 241383 228363 215957 204052 192945 182832 173859 166409 160579 155633
$$ packed form
54732A86773j2026r444p568p341p521o984o235n825n214m098l199k941k625j732
54718A04020p54k02n1m66j768l315l754k760j342l01L73N64K5o35m51K97L87l13
54700H9554o74k41K75N26R33J394J255P21P26J227J237O79M85P81P40L62N39J113
54682A01632R02n6k61P11J510J390J354K056K555K128J546J557J661J459J663
54667A21807K720L747L906L658L725L926L928M063M572M986N015N137N641O034
54653A82865N876N312M372K875J373J007J900K812K919K793L158L799M349N032
54639B30442O083P298Q533R767J0459R917Q419O841N082K226j587n002p459r765
54625B81254j2235j3819j3817j3020j2406j1905j1107j0113q973p450n830m946
$$ plain form
54613 155633 150780 146244 142872 141037 140574 141308 142886 144584 146096 148069 151038 154334 156882 158583 160037
54598 160037 161334 162051 161960 160960 158798 155727 152819 150681 148459 145127 141113 137565 134534 131112 126937
54583 126937 122398 117776 113298 109631 107111 104845 101785 98391 95985 94754 93657 92152 90717 89653
54569 89653 88543 87090 85570 84350 83582 83225 82756 81275 78654 76138 74972 74960 75196 75546 76350 77317 78015
54552 78015 78942 80733 82723 83701 83793 84190 85189 85920 85970 85935 86321 87050 88104 89572 91010 91785 92020 92384
54534 92384 93231 94778 97638 102017 106863 111100 115249 120479 126499 131971 136668 141459 146203 149431 150322
54519 150322 149430 147201 143288 137763 131650 125830 120474 115771 112029 108847 105388 101647 98340 95514
54505 95514 92574 89784 88271 88194 88362 88099 88115 88950 89789 89585 88372 86835 85382 84157 83224 82286 80898
$$ packed form
54613A55633m853m536l372j835m63P34J578J698J512J973K969L296K548J701J454
54598A60037J297P17r1j000k162l071k908k138k222l332m014l548l031l422m175
54583A26937m539m622m478l667k520k266l060l394k406j231j097j505j435j064
54569H9653j110j453j520j220p68l57m69j481k621k516j166j2K36L50Q04R67O98
54552G8015R27J791J990R78R2L97R99P31N0l5L86P29J054J468J438P75K35L64
54534I2384Q47J547K860M379M846M237M149N230O020N472M697M791M744L228Q91
54519A50322q92k229l913n525o113n820n356m703l742l182l459l741l307k826
54505I5514k940k790j513p7J68k63J6Q35Q39k04j213j537j453j225r33r38j388
$$ plain form
54488 80898 79219 77940 77353 77221 77563 78652 80224 81599 82637 83688 84674 85237 85692 86627 87622 87643 86790
54471 86790 86369 87000 87884 88151 87720 86649 84863 82869 81534 80939 80526 80453 81405 82994 83832 83534 83133 83106
54453 83106 82583 81067 79423 78408 77600 76578 75842 75731 75652 75215 74973 75235 75346 74955 74876 75730 76802 77220
54435 77220 77211 77228 76792 75321 73357 71967 71567 72155 73850 76259 78095 78493 78137 78185 78686 79029 79298 80082
54417 80082 81316 82384 83160 84018 84951 85532 85764 86282 87661 89893 92499 94885 96724 98260 100070 102454
54401 102454 105333 108696 112613 116743 120503 123900 127564 131763 136155 140730 146153 152686 159419 165132
54387 165132 169436 172727 175553 178412 181563 184614 186648 187101 186177 184309 181739 178734 175608 172298 168494
54372 168494 164321 160329 156790 153576 150733 148440 146440 144301 142163 140389 138568 135948 132806 130158
$$ packed form
54488H0898j679j279n87j32L42J089J572J375J038J051R86N63M55R35R95K1q53
54471H6790m21O31Q84K67m31j071j786j994j335n95m13p3R52J589Q38k98m01k7
54453H3106n23j516j644j015q08j022p36j11p9m37k42K62J11l91p9Q54J072M18
54435G7220rJ7m36j471j964j390m00N88J695K409J836L98l56M8N01L43K69P84
54417H0082J234J068P76Q58R33N81K32N18J379K232K606K386J839J536J810K384
54401A02454K879L363L917M130L760L397L664M199M392M575N423O533O733N713
54387A65132M304L291K826K859L151L051K034M53r24j868k570l005l126l310l804
54372A68494m173l992l539l214k843k293k000k139k138j774j821k620l142k648
$$ plain form
54358 130158 127998 125184 121377 117796 115603 114749 114885 116056 117815 118918 118862 118794 120052 122583 125473 128227
54342 128227 130858 133496 136535 140486 145118 149553 153568 157906 162817 167387 170933 174047 177556 181311
54328 181311 184667 187260 188683 188338 186366 183832 181316 178171 173772 168563 163198 157652 151861 146280
54314 146280 141035 135525 129570 123950 119081 114297 109268 104928 101962 99494 96394 92924 89932 87376
54300 87376 84809 82429 80452 78310 75710 73657 73157 73633 73890 73887 74258 74728 74423 73251 71724 69896 67692
54283 67692 65767 64774 64303 63750 63651 64714 66088 66180 64965 63978 64133 64950 65919 67173 68583 69388 69147 68234
54265 68234 67213 66413 66070 66216 66476 66621 67126 68522 70527 72471 74174 75650 76484 76429 76160 76424 76876
54248 76876 76751 76243 76035 75866 74878 73218 71981 71618 71588 71592 71954 72644 73048 72909 72587 72239 71602 70769 70329
$$ packed form
54358A30158k160k814l807l581k193q54J36J171J759J103n6o8J258K531K890K754
54342A28227K631K638L039L951M632M435M015M338M911M570L546L114L509L755
54328A81311L356K593J423l45j972k534k516l145m399n209n365n546n791n581
54314A46280n245n510n955n620m869m784n029m340k966k468l100l470k992k556
54300H7376k567k380j977k142k600k053n00M76K57lL71M70l05j172j527j828k204
54283F7692j925r93m71n53r9J063J374R2j215r87J55Q17R69J254J410Q05k41r13
54265F8234j021q00l43J46K60J45N05J396K005J944J703J476Q34n5k69K64M52
54248G6876j25n08k08j69r88j660j237l63l0ML62O90M04j39l22l48o37q33m40
$$ plain form
54229 70329 70536 71051 71551 71938 71954 71291 70144 69058 68270 67756 67616 67733 67386 66095 64550 63712 63247 61925
54211 61925 59513 57199 56051 56102 57088 58986 61461 63641 64972 65766 66623 67710 68789 69547 69801 69672
54195 69672 69528 69522 69472 69454 69973 71005 71506 70666 69148 68230 68150 68298 68570 69326 70238 70465 70031 69919 70622 71539
54175 71539 72011 72043 71870 71555 71199 70883 70360 69442 68611 68452 68603 68113 66893 65981 66240 67497 68966 69908
54157 69908 69884 69057 68225 67999 68132 68203 68460 69163 69583 68798 67213 66127 65987 66252 66793 68049 69763 70973
54139 70973 71487 72100 73081 73694 73613 73555 74005 74402 74181 73639 73180 72650 72011 71864 72613 73742 74438 74395 73604 72045
54119 72045 70028 68239 67025 66088 65143 64286 63565 62881 62522 63049 64351 65584 66261 66629 66770 66306 65388
54102 65388 64978 65532 66284 66464 66464 67031 68024 68777 69172 69541 69872 69861 69512 69155 69019 69247 69985 71051 71821 71892
$$ packed form
54229G0329K07N15N00L87J6o63j147j086p88n14j40J17l47j291j545q38m65j322
54211F1925k412k314j148N1R86J898K475K180J331P94Q57J087J079P58K54j29
54195F9672j44on0j8N19J032N01q40j518r18q0J48K72P56R12K27m34j12P03R17
54175G1539M72L2j73l15l56l16n23r18q31j59J51m90j220r12K59J257J469R42
54157F9908k4q27q32k26J33P1K57P03M20p85j585j086j40K65N41J256J714J210
54139G0973N14O13R81O13q1n8M50L97k21n42m59n30o39j47P49J129O96m3p91j559
54119G2045k017j789j214r37r45q57p21o84l59N27J302J233O77L68J41m64r18
54102F5388m10N54P52J80%N67R93P53L95L69L31j1l49l57j36K28P38J066P70P1
$$ plain form
54082 71892 71580 71337 71007 70163 68905 67845 67406 67575 68219 69251 70426 71241 71207 70294 69184 68898 69870 71432
54064 71432 72607 73288 74164 75499 76644 77014 76978 77350 78367 79554 80409 80878 81214 81631 82169 82805 83644 84795
54046 84795 86060 87086 88015 89553 92011 94642 96464 97438 98286 99535 101457 104576 109178 114279 118112
54031 118112 120004 121115 123076 126551 131309 136973 143149 149319 155153 160778 166525 172545 178716 184745
54017 184745 190346 195454 200099 203950 206437 207719 209021 211326 214114 216220 217518 218763 220015 220455
54003 220455 219858 219067 218685 218247 217154 215573 213928 212161 209973 207252 204011 200415 197134 195040 194240
53988 194240 193944 193515 193065 192794 192398 191460 189984 188192 186198 184111 182086 180156 178331 176838 175788 174687
53972 174687 172907 170629 168651 167211 165631 163243 160013 156277 152552 149674 148320 148259 148640 149037 149504
$$ packed form
54082G1892l12k43l30q44j258j060m39J69O44J032J175Q15l4r13j110k86R72J562
54064G1432J175O81Q76J335J145L70l6L72J017J187Q55M69L36M17N38O36Q39J151
54046H4795J265J026R29J538K458K631J822R74Q48J249J922L119M602N101L833
54031A18112J892J111J961L475M758N664O176O170N834N625N747O020O171O029
54017A84745N601N108M645L851K487J282J302K305K788K106J298J245J252M40
54003B20455n97p91l82m38j093j581j645j767k188k721l241l596l281k094q00
53988A94240k96m29m50k71l96r38j476j792j994k087k025j930j825j493j050j101
53972A74687j780k278j978j440j580k388l230l736l725k878j354o1L81L97M67
$$ plain form
53957 149504 149745 149258 148370 148083 148691 149474 150043 150939 152585 154637 156825 159493 162750 165959 168645 171228
53941 171228 174347 178148 182651 188092 194385 200987 207760 215283 223827 232699 241072 248763 255687 261255
53927 261255 264968 266973 267512 266365 263424 259276 254738 250246 246134 242928 240906 239864 239697 240671 242732
53912 242732 245208 247618 250240 253502 257403 261906 267261 273501 280185 286964 293828 300576 306809 312699
53898 312699 318789 324637 328641 329835 328972 327235 324858 321822 318881 316799 315217 313285 310939 308629
53884 308629 306310 303553 300236 296239 290919 283790 275465 267065 258932 250693 242352 234520 227699 221911
53870 221911 216914 212250 207260 201644 195838 190501 185855 181806 178294 175047 171483 167376 163314 160052
53856 160052 157732 156022 154568 152902 150533 147601 144948 143020 141199 138664 135378 131808 128290 125230
$$ packed form
53957A49504K41m87q88k87O08P83N69Q96J646K052K188K668L257L209K686K583
53941A71228L119L801M503N441O293O602O773P523Q544Q872Q373P691O924N568
53927B61255L713K005N39j147k941m148m538m492m112l206k022j042j67R74K061
53912B42732K476K410K622L262L901M503N355O240O684O779O864O748O233N890
53898C12699O090N848M004J194q63j737k377l036k941k082j582j932k346k310
53884C08629k319k757l317l997n320p129q325q400q133q239q341p832o821n788
53870B21911m997m664m990n616n806n337m646m049l512l247l564m107m062l262
53856A60052k320j710j454j666k369k932k653j928j821k535l286l570l518l060
$$ plain form
53842 125230 123228 122351 121841 121127 120452 119930 118809 116577 114143 112901 113065 113819 114648 115556 116306 116455 116031
53825 116031 115442 114858 114313 114122 114475 114911 114859 114420 113961 113302 112051 110458 109214 108625 108660 109433 110957 112709
53807 112709 114185 115610 117421 119365 120828 121848 123058 124836 127129 129884 133051 136389 139802 143541
53793 143541 147661 151724 155615 160017 165417 171239 176743 182162 187976 193635 198066 201145 203674 206198
53779 206198 208745 211340 213807 215398 215658 215379 215653 216265 216094 214838 213168 211335 208809 205354 201404
53764 201404 197328 193300 189811 187304 185296 182913 180230 178055 176423 174458 171817 169132 166885 164937
53750 164937 163289 162172 161178 159530 157568 156774 157802 159505 160460 160408 159707 158389 156563 154927 154057 153760
53734 153760 153675 153908 154472 154803 154550 154295 154754 155757 156703 157605 158830 160095 160635 160375 160220 161018 162771 165043
$$ packed form
53842A25230k002q77n10p14o75n22j121k232k434j242J64P54Q29R08P50J49m24
53825A16031n89n84n45j91L53M36n2m39m59o59j251j593j244n89L5P73J524J752
53807A12709J476J425J811J944J463J020J210J778K293K755L167L338L413L739
53793A43541M120M063L891M402N400N822N504N419N814N659M431L079K529K524
53779B06198K547K595K467J591K60k79K74O12j71j256j670j833k526l455l950
53764B01404m076m028l489k507k008k383k683k175j632j965k641k685k247j948
53750A64937j648j117r94j648j962p94J028J703R55n2p01j318j826j636q70k97
53734A53760q5K33N64L31k53k55M59J003R46R02J225J265N40k60j55P98J753K272
$$ plain form
53716 165043 167691 170815 174287 177657 180595 183145 185476 187556 189310 190950 192770 194593 195833 196259
53702 196259 196271 196176 195650 194376 192831 191893 191851 192297 192845 193492 194382 195657 197436 199527 201320 202352 202872
53685 202872 203508 204553 205920 207565 209477 211469 213440 215649 218323 221206 223868 226236 228415 230353
53671 230353 232134 234145 236400 238114 238624 238373 238313 238751 239527 240836 242871 244935 246028 246245 246617 247531
53655 247531 248292 248381 248251 248573 249441 250520 251410 251690 251123 249915 248367 246378 243808 241073 238709 236581
53639 236581 234332 232388 231528 231493 231069 229707 228108 226979 226143 225242 224520 224418 224926 225658 226209 226281 225921 225687
53621 225687 226118 227075 228043 228956 230072 231216 231893 232151 232602 233652 235384 238019 241668 245726 249354 252460
53605 252460 255362 257754 259131 260150 262297 266037 270451 274866 279557 284539 289013 292596 296032 300049
$$ packed form
53716A65043K648L124L472L370K938K550K331K080J754J640J820J823J240M26
53702A96259J2r5n26j274j545r38m2M46N48O47Q90J275J779K091J793J032N20
53685B02872O36J045J367J645J912J992J971K209K674K883K662K368K179J938
53671B30353J781K011K255J714N10k51o0M38P76J309K035K064J093K17L72R14
53655B47531P61Q9j30L22Q68J079Q90K80n67j208j548j989k570k735k364k128
53639B36581k249j944q60l5m24j362j599j129q36r01p22j02N08P32N51P2l60k34
53621B25687M31R57R68R13J116J144O77K58M51J050J732K635L649M058L628L106
53605B52460K902K392J377J019K147L740M414M415M691M982M474L583L436M017
$$ plain form
53591 300049 304505 309188 314393 319979 324819 328084 330364 332802 335736 338826 341848 344648 346900 348596
53577 348596 350324 352497 354803 356889 358971 361199 363014 363861 364106 364590 365599 366814 367945 368875 369414
53562 369414 369381 368787 367767 366618 365921 366127 366870 367322 367359 367688 368600 369470 369848 370218 371134 372382 373586 374931
53544 374931 376638 378380 379891 381573 383843 386407 388830 391243 393778 395831 396727 396797 397070 398204 400295
53529 400295 403369 407289 411462 415352 419176 423542 428608 434107 439956 446267 452990 460066 467743 476187
53515 476187 485036 493856 502845 512540 522998 533852 545030 556852 569473 582713 596415 610513
53503 610513 624836 639347 654541 671139 689236 708103 726996 745954 765678 786779 809224
53492 809224 832409 855670 878675 901387 923867 946261 968824 991662 1014499 1036973 1059076
$$ packed form
53591C00049M456M683N205N586M840L265K280K438K934L090L022K800K252J696
53577C48596J728K173K306K086K082K228J815Q47K45M84J009J215J131R30N39
53562C69414l3n94j020j149o97K06P43M52L7L29R12Q70L78L70R16J248J204J345
53544C74931J707J742J511J682K270K564K423K413K535K053Q96P0K73J134K091
53529D00295L074L920M173L890L824M366N066N499N849O311O723P076P677Q444
53515D76187Q849Q820Q989R695J0458J0854J1178J1822J2621J3240J3702J4098
53503F10513J4323J4511J5194J6598J8097J8867J8893J8958J9724K1101K2445
53492H09224K3185K3261K3005K2712K2480K2394K2563K2838K2837K2474K2103
$$ plain form
53481 1059076 1081068 1103057 1124975 1146822 1168577 1190033 1211088 1232035 1253177 1274446 1295865
53470 1295865 1317943 1340843 1363498 1384549 1404029 1423152 1442469 1461301 1478977 1495453 1510473
53459 1510473 1523347 1534006 1543253 1551500 1558240 1563217 1567022 1569912 1571092 1569895 1566774 1562363 1556425
53446 1556425 1548534 1538969 1528092 1515559 1501044 1485089 1468397 1450889 1432290 1412947 1393141 1372235
53434 1372235 1349590 1325895 1302532 1279908 1257421 1234774 1212324 1190262 1168411 1146924 1126460
53423 1126460 1107603 1090669 1075984 1063789 1053912 1045932 1039502 1034223 1029567 1025376 1022059 1019813 1018100
53410 1018100 1016479 1015524 1016281 1019119 1023705 1029738 1037060 1045421 1054809 1065812 1079050 1094513 1111854
53397 1111854 1130951 1151656 1173523 1196439 1221004 1247565 1275368 1303541 1332529 1363620 1397304
$$ packed form
53481A059076K1992K1989K1918K1847K1755K1456K1055K0947K1142K1269K1419
53470A295865K2078K2900K2655K1051J9480J9123J9317J8832J7676J6476J5020
53459A510473J2874J0659R247Q247O740M977L805K890J180j197l121m411n938
53446A556425p891r565j0877j2533j4515j5955j6692j7508j8599j9343j9806k0906
53434A372235k2645k3695k3363k2624k2487k2647k2450k2062k1851k1487k0464
53423A126460j8857j6934j4685j2195r877p980o430n279m656m191l317k246j713
53410A018100j621r55P57K838M586O033P322Q361R388J1003J3238J5463J7341
53397A111854J9097K0705K1867K2916K4565K6561K7803K8173K8988L1091L3684
$$ plain form
53386 1397304 1433017 1470394 1509824 1551673 1595708 1641402 1688337 1736308 1785419 1835935 1887710
53375 1887710 1940083 1992736 2046221 2101075 2156831 2212493 2267520 2321673 2374412 2425314 2474729
53364 2474729 2523144 2570088 2614424 2655435 2692868 2726237 2755027 2779383 2799709 2815740 2826768
53353 2826768 2832656 2833791 2830189 2821455 2807479 2788436 2764337 2735530 2703425 2669798 2635317 2599524
53341 2599524 2561967 2522355 2479790 2433194 2382779 2330156 2276768 2223176 2170021 2118625 2069992
53330 2069992 2023838 1978982 1934223 1888785 1842681 1796979 1753077 1711429 1671529 1633241 1597384
53319 1597384 1564640 1534610 1506449 1479944 1455509 1433468 1413753 1396135 1380347 1366003 1352502
53308 1352502 1339046 1324895 1309882 1294555 1279646 1265546 1252489 1240858 1230897 1222355 1214845 1208322
$$ packed form
53386A397304L5713L7377L9430M1849M4035M5694M6935M7971M9111N0516N1775
53375A887710N2373N2653N3485N4854N5756N5662N5027N4153N2739N0902M9415
53364B474729M8415M6944M4336M1011L7433L3369K8790K4356K0326J6031J1028
53353B826768N888J135l602q734j3976j9043k4099k8807l2105l3627l4481l5793
53341B599524l7557l9612m2565m6596n0415n2623n3388n3592n3155n1396m8633
53330B069992m6154m4856m4759m5438m6104m5702m3902m1648l9900l8288l5857
53319A597384l2744l0030k8161k6505k4435k2041j9715j7618j5788j4344j3501
53308A352502j3456j4151j5013j5327j4909j4100j3057j1631r961q542p510o523
$$ plain form
53296 1208322 1202929 1198724 1195949 1194996 1195582 1196599 1197548 1199548 1203951 1210450 1217596 1224806 1232738 1241966 1252608
53281 1252608 1265141 1280255 1297694 1316418 1336090 1357341 1380413 1404747 1430082 1456628 1483738
53270 1483738 1509777 1534065 1557838 1582382 1607101 1630280 1651061 1669711 1686501 1701277 1713909
53259 1713909 1724450 1732889 1739202 1743482 1745754 1745898 1743869 1739649 1732898 1723284 1711320 1698133 1684014
53246 1684014 1667891 1648762 1627044 1603923 1579951 1554993 1529152 1502923 1476535 1449777 1422502
53235 1422502 1394902 1367288 1339917 1312903 1286053 1258899 1231243 1203618 1176962 1151824 1127982
53224 1127982 1104774 1081695 1058745 1036321 1014790 994316 975140 957689 942050 927501 913084
53213 913084 898616 884744 872041 860460 849606 839059 828393 817344 806014 794549 782682
$$ packed form
53296A208322n393m205k775r53N86J017R49K000M403O499P146P210P932R228J0642
53281A252608J2533J5114J7439J8724J9672K1251K3072K4334K5335K6546K7110
53270A483738K6039K4288K3773K4544K4719K3179K0781J8650J6790J4776J2632
53259A713909J0541Q439O313M280K272J44k029m220o751r614j1964j3187j4119
53246A684014j6123j9129k1718k3121k3972k4958k5841k6229k6388k6758k7275
53235A422502k7600k7614k7371k7014k6850k7154k7656k7625k6656k5138k3842
53224A127982k3208k3079k2950k2424k1531k0474j9176j7451j5639j4549j4417
53213I13084j4468j3872j2703j1581j0854j0547j0666j1049j1330j1465j1867
$$ plain form
53202 782682 770090 757107 744442 732144 719422 705643 691047 676418 662582 650234 639552
53191 639552 629819 619985 609797 599805 590176 580251 569624 558908 548865 539208 528826 516983 503977
53178 503977 490822 478486 467245 456539 445606 434351 423384 413304 404308 396377 389362 382848
53166 382848 376458 370384 365155 360809 356760 352531 348114 343600 339041 334753 331193 328349 325713 322954
53152 322954 320119 317172 313988 310884 308492 306896 305503 303960 302624 301940 301944 302513 303523 304593 305281 305746
53136 305746 306695 308544 311139 314272 317728 320811 322775 323938 325474 327821 330163 331782 332885 333630 333320
53121 333320 331322 328028 324264 320367 316438 312725 309060 304567 298685 291987 285413 279199 273203 267631
53107 267631 262711 258202 253940 250323 247494 244595 240696 236102 231853 228269 224813 221120 217328 213565
$$ packed form
53202G82682j2592j2983j2665j2298j2722j3779j4596j4629j3836j2348j0682
53191F39552r733r834j0188r992r629r925j0627j0716j0043r657j0382j1843j3006
53178E03977j3155j2336j1241j0706j0933j1255j0967j0080q996p931p015o514
53166C82848o390o074n229m346m049m229m417m514m559m288l560k844k636k759
53152C22954k835k947l184l104k392j596j393j543j336o84MN69J010J070O88M65
53136C05746R49J849K595L133L456L083J964J163J536K347K342J619J103P45l10
53121C33320j998l294l764l897l929l713l665m493n882o698o574o214n996n572
53107B67631m920m509m262l617k829k899l899m594m249l584l456l693l792l763
$$ plain form
53093 213565 209917 206777 204440 202438 199983 197025 194159 191601 188999 186294 184016 182495 181385 180252
53079 180252 179154 178349 177710 176756 175194 173311 171796 171079 170773 169979 168264 166145 164421 163278 162277 161005
53063 161005 159434 157799 156413 155517 155176 155323 155873 156611 157107 157131 157114 157650 158508 158733 157946 156896 156403 156351
53045 156351 156120 155473 154608 153792 153363 153595 154185 154356 153886 153502 153827 154533 155022 155308 155547 155281 154013 152119
53027 152119 150388 148960 147498 146151 145458 145411 145420 145178 144889 144650 144325 144082 144413 145469 146931 148552 150363
53010 150363 152260 153916 155248 156553 158002 159361 160362 161060 161679 162307 162881 163410 164116 165329 167077 168871
52994 168871 170247 171629 174200 178595 184090 189429 194153 198667 203328 208016 212551 217009 221520 226007
52980 226007 230144 233529 235960 237578 238555 238700 237745 235983 234035 231872 228800 224700 220572 217331 214724
$$ packed form
53093B13565l648l140k337k002k455k958k866k558k602k705k278j521j110j133
53079A80252j098q05o39r54j562j883j515p17l06p94j715k119j724j143j001j272
53063A61005j571j635j386q96l41J47N50P38M96K4j7N36Q58K25p87j050m93n2
53045A56351k31o47q65q16m29K32N90J71m70l84L25P06M89K86K39k66j268j894
53027A52119j731j428j462j347o93m7Rk42k89k39l25k43L31J056J462J621J811
53010A50363J897J656J332J305J449J359J001O98O19O28N74N29P06J213J748J794
52994A68871J376J382K571M395N495N339M724M514M661M688M535M458M511M487
52980B26007M137L385K431J618R77J45r55j762j948k163l072m100m128l241k607
$$ plain form
52965 214724 212050 209311 206875 204504 201588 198119 194643 191444 188511 186107 184620 183874 183242 182449 181711
52950 181711 181134 180593 180093 179705 179155 178050 176515 175086 173958 172867 171738 170901 170596 170673 170902 171204 171490
52933 171490 171628 171618 171595 171645 171821 172250 173017 174042 175232 176576 177934 179070 180022 181027 181821 181618 180303
52916 180303 179036 178985 179838 180381 180244 180163 180675 181519 182454 183772 185613 187386 188283 188084 187236 186408 186109 186453
52898 186453 187136 187783 188319 188883 189491 189992 190258 190220 189880 189547 189866 191372 194096 197674 201494 204656 206296
52881 206296 206397 205922 205843 206428 207705 209932 213044 216174 218498 220198 221985 224082 226370 229135 232793
52866 232793 237096 241410 245637 250147 254931 259526 263715 267606 271149 274169 276743 278912 280237 280336 279663
52851 279663 279040 278605 277936 277005 276149 275202 273540 271029 268137 265097 261713 258041 254556 251546 248961 246829
$$ packed form
52965B14724k674k739k436k371k916l469l476l199k933k404j487p46o32p93p38
52950A81711n77n41n00l88n50j105j535j429j128j091j129q37l05P7K29L02K86
52933A71490J38j0k3N0J76M29P67J025J190J344J358J136R52J005P94k03j315
52916A80303j267n1Q53N43j37q1N12Q44R35J318J841J773Q97j99q48q28k99L44
52898A86453O83O47N36N64O08N01K66l8l40l33L19J506K724L578L820L162J640
52881B06296J01m75p9N85J277K227L112L130K324J700J787K097K288K765L658
52866B32793M303M314M227M510M784M595M189L891L543L020K574K169J325R9o73
52851B79663o23m35o69r31q56r47j662k511k892l040l384l672l485l010k585k132
$$ plain form
52835 246829 245186 243681 241903 240006 238321 236534 234029 230866 227585 224186 220300 216226 212783 210143
52821 210143 207867 206039 205118 204517 202656 198937 194638 191341 189402 188320 187611 186738 185150 183075 181514
52806 181514 180910 180539 179680 178581 177662 176666 175308 174067 173481 173219 172554 171384 170145 169160 168627 168744 169252
52789 169252 169324 168544 167575 167189 167130 166592 165443 164170 162947 161529 160028 159000 158695 158723 158564 158021 157094 155775
52771 155775 154120 152413 151139 150667 150804 150800 150116 149119 148549 148397 147929 146897 145902 145309 144557 143055 141110
52754 141110 139377 137910 136376 134779 133330 131920 130353 128861 127831 127149 126374 125376 124401 123641 123168 123066
52738 123066 123197 123021 122078 120515 118785 117087 115588 114890 115621 117551 119681 121256 122307 123170 124006 124944
52722 124944 126338 128576 131747 135604 139759 143812 147430 150413 152829 155087 157728 160873 163837 165597
$$ packed form
52835B46829j643j505j778j897j685j787k505l163l281l399l886m074l443k640
52821B10143k276j828r21o01j861l719m299l297j939j082p09q73j588k075j561
52806A81514o04l71q59j099r19r96j358j241n86k62o65j170j239r85n33J17N08
52789A69252P2p80r69l86n9n38j149j273j223j418j501j028l05K8j59n43r27j319
52771A55775j655j707j274m72J37mo84r97n70j52m68j032r95n93p52j502j945
52754A41110j733j467j534j597j449j410j567j492j030o82p75r98r75p60m73j02
52738A23066J31j76r43j563j730j698j499o98P31J930K130J575J051Q63Q36R38
52722A24944J394K238L171L857M155M053L618K983K416K258K641L145K964J760
$$ plain form
52708 165597 165816 165178 164577 164150 163323 161668 159395 156982 154527 151680 148230 144611 141518 139055 136594
52693 136594 133659 130585 127982 125966 124370 123310 122844 122358 121091 119193 117409 115708 113221 109764 106448
52678 106448 104269 102905 101517 100040 98948 98169 97059 95312 93290 91571 90569 90418 90799 90960 90345
52663 90345 89144 87994 87253 86765 86238 85607 85080 84926 85106 85137 84562 83603 83032 83310 84197 85264 86378 87502
52645 87502 88406 88834 88742 88272 87692 87313 87154 86797 86086 85768 86723 88600 90091 90711 91373 92868 94705 96031
52627 96031 96831 97494 97864 97552 96722 95770 94605 92972 91204 89896 89041 88134 87079 86380 86498 87459 88984
52610 88984 90613 91790 92170 91762 90655 88966 87297 86667 87488 88947 89945 90317 90647 91207 91669 91632 90894
52593 90894 89482 87914 87148 87663 88763 89337 89166 88939 89218 89955 90948 92143 93490 94958 96658 98617
$$ packed form
52708A65597K19o38o01m27q27j655k273k413k455k847l450l619l093k463k461
52693A36594k935l074k603k016j596j060m66m86j267j898j784j701k487l457l316
52678A06448k179j364j388j477j092p79j110j747k022j719j002j51L81J61o15
52663I0345j201j150p41m88n27o31n27j54J80L1n75r59n71K78Q87J067J114J124
52645H7502R04M28r2m70n80l79j59l57p11l18R55J877J491O20O62J495J837J326
52627I6031Q00O63L70l12q30r52j165j633j768j308q55r07j055o99J18R61J525
52610H8984J629J177L80m08j107j689j669o30Q21J459R98L72L30N60M62l7p38
52593I0894j412j568p66N15J100N74j71k27K79P37R93J195J347J468J700J959
$$ plain form
52577 98617 100569 102353 104270 106567 108775 110122 110444 110177 109664 109081 108878 109565 110998 112479 113654 114773
52561 114773 116035 117263 118364 119543 120798 121680 121891 121829 122236 123433 125063 126469 127281 127766 128670 130546
52545 130546 133174 135736 137538 138494 138972 139340 139658 139772 139685 139748 140336 141397 142623 143975 145670 147599 149233
52528 149233 150287 151018 151716 152330 152809 153300 153726 153743 153446 153506 154172 154699 154335 153363 152556 152099 151738 151521 151572
52509 151572 151484 150833 150121 150322 151548 152911 153694 153951 154004 154065 154374 154990 155405 155023 154123 153616 153821 154186 154355
52490 154355 154711 155513 156220 156207 155648 155197 155095 155098 155089 155290 155899 156824 157841 158784 159536 159914 159756 159211 158851 159247
52470 159247 160423 161995 163826 166108 168629 170549 171386 171806 172914 174964 177288 179261 180771 181964 183140
52455 183140 184783 187107 189586 191476 192731 193831 194839 195354 195457 195951 197398 199517 201808 204206 206754
$$ packed form
52577I8617J952J784J917K297K208J347L22k67n13n83k03O87J433J481J175J119
52561A14773J262J228J101J179J255Q82K11o2M07J197J630J406Q12M85R04J876
52545A30546K628K562J802R56M78L68L18J14q7O3N88J061J226J352J695J929J634
52528A49233J054P31O98O14M79M91M26J7k97O0O66N27l64r72q07m57l61k17N1
52509A51572q8o51p12K01J226J363P83K57N3O1L09O16M15l82r00n07K05L65J69
52490A54355L56Q02P07j3n59m51j02LrK01O09R25J017R43P52L78j58n45l60L96
52470A59247J176J572J831K282K521J920Q37M20J108K050K324J973J510J193J176
52455A83140J643K324K479J890J255J100J008N15J03M94J447K119K291K398K548
$$ plain form
52440 206754 209132 211032 212769 215046 218148 221617 224654 226669 227538 227541 227112 226578 226070 225626 225305 225117 224850
52423 224850 224065 222458 220376 218699 217896 217350 216046 213866 211658 209990 208534 206835 204968 203033 200709
52408 200709 197919 195375 193777 192863 191857 190562 189364 188492 187842 187276 186573 185400 183918 182996 183150 183714
52392 183714 183789 183580 183873 184539 184712 184305 184192 184756 185329 185369 185279 185641 186392 187135 187680 187912 187692 187255 187259 188130
52372 188130 189689 191522 193266 194483 194848 194715 194975 196087 197611 198918 199935 200987 202285 203806 205408
52357 205408 206907 208252 209686 211480 213579 215749 217976 220372 222794 224989 227032 229255 231848 234882
52343 234882 238446 242292 245640 247936 249595 251417 253559 255811 258473 261937 265572 268209 269809 271570
52329 271570 274098 276542 277933 278458 278923 279779 281269 283781 287375 291422 295209 298531 301388 303625 305300
$$ packed form
52440B06754K378J900J737K277L102L469L037K015Q69Lm29n34n08m44l21j88k67
52423B24850p85j607k082j677q03n46j304k180k208j668j456j699j867j935k324
52408B00709k790k544j598r14j006j295j198q72o50n66p03j173j482r22J54N64
52392A83714P5k09K93O66J73m07j13N64N73M0r0L62P51P43N45K32k20m37MQ71
52372A88130J559J833J744J217L65j33K60J112J524J307J017J052J298J521J602
52357B05408J499J345J434J794K099K170K227K396K422K195K043K223K593L034
52343B34882L564L846L348K296J659J822K142K252K662L464L635K637J600J761
52329B71570K528K444J391N25M65Q56J490K512L594M047L787L322K857K237J675
$$ plain form
52314 305300 306964 309169 312030 315484 319532 323981 328412 332686 337075 341718 346465 351422 357018 363329
52300 363329 369912 376621 383947 392278 401413 411135 421585 432682 443888 455062 466923 480066 494017
52287 494017 507858 521424 535344 550257 566445 583930 602380 621146 639801 658480 677505
52276 677505 696984 716992 737643 758650 779253 798936 817797 835829 852363 866802 879562
52265 879562 891704 903799 915505 926070 934898 941809 947096 951264 954530 956721 957702 957572 956416 954324
52251 954324 951698 948996 945961 941679 935683 928528 921032 913564 906399 900139 895217 891415 888342 886028
52237 886028 884747 884660 886013 889235 894402 900992 908527 917083 926906 937974 950166 963308 976761 989598
52223 989598 1001637 1013695 1026398 1039294 1051575 1063002 1073638 1083329 1092005 1099842 1106530 1111107
$$ packed form
52314C05300J664K205K861L454M048M449M431M274M389M643M747M957N596O311
52300C63329O583O709P326Q331R135R722J0450J1097J1206J1174J1861J3143J3951
52287D94017J3841J3566J3920J4913J6188J7485J8450J8766J8655J8679J9025
52276F77505J9479K0008K0651K1007K0603J9683J8861J8032J6534J4439J2760
52265H79562J2142J2095J1706J0565Q828O911N287M168L266K191R81j30j156k092
52251I54324k626k702l035m282n996p155p496p468p165o260m922l802l073k314
52237H86028j281q7J353L222N167O590P535Q556R823J1068J2192J3142J3453J2837
52223I89598J2039J2058J2703J2896J2281J1427J0636R691Q676P837O688M577
$$ plain form
52211 1111107 1113194 1113647 1113133 1110815 1105545 1097797 1089166 1080236 1070236 1058703 1046228 1033321 1019576
52198 1019576 1004482 988365 972062 956081 940341 924487 908305 892056 876418 861877 848312
52187 848312 835380 823069 811541 800729 790541 781236 773120 766064 759727 753983 748704 743430 737819
52174 737819 732189 727124 722776 719086 716313 714622 713369 711596 709162 706722 704711 703044 701750 701070
52160 701070 700763 699991 698184 695545 692627 689822 687361 685272 683143 680286 676384 671779 667138 663022 659692
$$ packed form
52211A111107K087M53n14k318n270p748q631q930j0000j1533j2475j2907j3745
52198A019576j5094j6117j6303j5981j5740j5854j6182j6249j5638j4541j3565
52187H48312j2932j2311j1528j0812j0188r305q116p056o337n744n279n274n611
52174G37819n630n065m348l690k773j691j253j773k434k440k011j667j294o80
52160G01070l07p72j807k639k918k805k461k089k129k857l902m605m641m116l330
$$ [...]
##END NTUPLES=NMR SPECTRUM
##END=
