
##TITLE=AC1300_CHIAH12112_6534624_r4z7lKFjlq
##JCAMPDX= 6.0         $$ Bruker NMR JCAMP-DX V2.0
##DATA TYPE= NMR SPECTRUM
##DATA CLASS= NTUPLES
##ORIGIN= BRUKER
##OWNER= Administrator
$$ 1.72 TOPSPIN		Version 2.1
$$ 2012-07-17 02:16:00.093 -0500  Administrator@TOPSPIN
$$ Compression mode = diff/dup
##.OBSERVE FREQUENCY= 400.02188249412
##.OBSERVE NUCLEUS= ^1H
##.ACQUISITION MODE= SIMULTANEOUS (DQD)
##.ACQUISITION SCHEME= undefined
##.AVERAGES= 8
##.DIGITISER RES= 22
##SPECTROMETER/DATA SYSTEM= spect
##.PULSE SEQUENCE= zg30
##.SOLVENT NAME= COFFEE_meoh
##.SHIFT REFERENCE= INTERNAL, COFFEE_meoh, 1, 14.98509
##AUDIT TRAIL= $$ (NUMBER, WHEN, WHO, WHERE, PROCESS, VERSION, WHAT)
$$ ##TITLE= Audit trail, TOPSPIN		Version 2.1
$$ ##JCAMPDX= 5.01
$$ ##ORIGIN= Bruker BioSpin GmbH
$$ ##OWNER= Administrator
$$ $$ C:\Bruker\TOPSPIN/data/COFFEE/nmr/AC1300_CHIAH12112_6534624_r4z7lKFjlq/10/pdata/1/auditp.txt
$$ ##AUDIT TRAIL=  $$ (NUMBER, WHEN, WHO, WHERE, PROCESS, VERSION, WHAT)
(   1,<2012-07-17 02:15:53.187 -0500>,<Administrator>,<TOPSPIN>,<go>,<TOPSPIN 2.1>,
      <created by zg
	started at 2012-07-17 02:14:46.593 -0500,
	POWCHK enabled, PULCHK disabled,
       configuration hash MD5:
       6B 1B 68 BB D9 2E 58 E2 7F 35 AD 54 07 DF 0E 41
       data hash MD5: 64K
       8C 53 61 66 3D DB EF 47 30 5E 96 5E 98 AD B2 60>)
(   2,<2012-07-17 02:15:55.859 -0500>,<Administrator>,<TOPSPIN>,<proc1d>,<TOPSPIN 2.1>,
      <Start of raw data processing
       efp LB = 0 FT_mod = 6 PKNL = 1 PHC0 = 0 PHC1 = 0 SI = 32K 
       data hash MD5: 32K
       3A 49 93 D7 EB DD 90 DD F0 E4 27 FC 4B 20 CA 87>)
(   3,<2012-07-17 02:15:56.234 -0500>,<Administrator>,<TOPSPIN>,<proc1d>,<TOPSPIN 2.1>,
      <pk PHC0 = 181.8732 PHC1 = 0 
       data hash MD5: 32K
       80 B6 84 B9 DE 24 0E 4B EF 95 08 C0 36 91 75 5D>)
(   4,<2012-07-17 02:15:56.312 -0500>,<Administrator>,<TOPSPIN>,<proc1d>,<TOPSPIN 2.1>,
      <abs ABSG = 1 
       data hash MD5: 32K
       AB F5 02 C6 BF E4 72 82 A8 B2 99 6D 9E 23 82 6E>)
(   5,<2012-07-17 02:15:56.359 -0500>,<Administrator>,<TOPSPIN>,<proc1d>,<TOPSPIN 2.1>,
      <abs ABSG = 2 
       data hash MD5: 32K
       72 CF DD 5A D4 DE 40 83 E9 58 DD 0A 43 F3 2F 05>)
(   6,<2012-07-17 02:15:56.375 -0500>,<Administrator>,<TOPSPIN>,<proc1d>,<TOPSPIN 2.1>,
      <abs ABSG = 3 
       data hash MD5: 32K
       95 22 78 00 7C 75 B6 38 F8 F7 4A 61 AA B3 CC 82>)
(   7,<2012-07-17 02:15:56.406 -0500>,<Administrator>,<TOPSPIN>,<proc1d>,<TOPSPIN 2.1>,
      <abs ABSG = 4 
       data hash MD5: 32K
       A9 E7 BF A5 4D 7E B1 3F A4 FB 61 6D B3 34 22 DF>)
(   8,<2012-07-17 02:15:56.437 -0500>,<Administrator>,<TOPSPIN>,<proc1d>,<TOPSPIN 2.1>,
      <abs ABSG = 5 
       data hash MD5: 32K
       AA DA 69 73 4F BA 81 7A 35 D5 95 41 62 60 1E 19>)
$$ ##END=
$$ 
$$ $$ hash MD5
$$ $$ 17 1C C7 FE 03 70 CF 50 C2 22 68 FC 66 50 09 E7
##$RELAX= 
##$RELAX= 
##$RELAX= 
##$RELAX= 
##$RELAX= 
##$RELAX= 
##$RELAX= 
$$ Bruker specific parameters
$$ --------------------------
$$ [...]
150 150 150 150 150 150 150 150
##$TP07= 0
##$TPNAME0= <>
##$TPNAME1= <>
##$TPNAME2= <>
##$TPNAME3= <>
##$TPNAME4= <>
##$TPNAME5= <>
##$TPNAME6= <>
##$TPNAME7= <>
##$TPOAL= (0..7)
0.5 0.5 0.5 0.5 0.5 0.5 0.5 0.5
##$TPOFFS= (0..7)
0 0 0 0 0 0 0 0
##$TUNHIN= 0
##$TUNHOUT= 0
##$TUNXOUT= 0
##$USERA1= <user>
##$USERA2= <user>
##$USERA3= <user>
##$USERA4= <user>
##$USERA5= <user>
##$V9= 5
##$VALIST= <valist>
##$VCLIST= <CCCCCCCCCCCCCCC>
##$VD= 0
##$VDLIST= <DDDDDDDDDDDDDDD>
##$VPLIST= <PPPPPPPPPPPPPPP>
##$VTLIST= <TTTTTTTTTTTTTTT>
##$WBST= 2048
##$WBSW= 25
##$XGAIN= (0..3)
0 0 0 0
##$XL= 0
##$YL= 0
##$YMAX_a= 507555
##$YMIN_a= -651485
##$ZGOPTNS= <>
##$ZL1= 120
##$ZL2= 120
##$ZL3= 120
##$ZL4= 120
##$ABSF1= 14.98509
##$ABSF2= -5.573092
##$ABSG= 5
##$ABSL= 3
##$ALPHA= 0
##$AQORDER= 0
##$ASSFAC= 0
##$ASSFACI= 0
##$ASSFACX= 0
##$ASSWID= 0
##$AUNMP= <proc_prof1d_extract_pilot.lims>
##$AXLEFT= 0
##$AXNAME= <>
##$AXNUC= <1H>
##$AXRIGHT= 0
##$AXTYPE= 0
##$AXUNIT= <>
##$AZFE= 0.1
##$AZFW= 0.1
##$BCFW= 0
##$BC_mod= 0
##$BYTORDP= 0
##$COROFFS= 0
##$CY= 15
##$DATMOD= 1
##$DC= 0
##$DFILT= <>
##$DTYPP= 0
##$F1P= 0
##$F2P= 0
##$FCOR= 0.5
##$FTSIZE= 32768
##$FT_mod= 6
##$GAMMA= 0
##$GB= 0
##$INTBC= 1
##$INTSCL= 1
##$ISEN= 128
##$LB= 0
##$LEV0= 0
##$LPBIN= 0
##$MAXI= 10000
##$MC2= 0
##$MEAN= 0
##$ME_mod= 0
##$MI= 0
##$NCOEF= 0
##$NC_proc= -8
##$NLEV= 6
##$NOISF1= 0
##$NOISF2= 0
##$NSP= 0
##$NTH_PI= 0
##$NZP= 0
##$OFFSET= 14.98509
##$PC= 1
##$PHC0= 181.8732
##$PHC1= 0
##$PH_mod= 1
##$PKNL= yes
##$PPARMOD= 0
##$PPDIAG= 0
##$PPIPTYP= 0
##$PPMPNUM= 2147483647
##$PPRESOL= 1
##$PSCAL= 4
##$PSIGN= 0
##$PYNMP= <proc.py>
##$REVERSE= no
##$SF= 400.02
##$SI= 32768
##$SIGF1= 0
##$SIGF2= 0
##$SINO= 400
##$SIOLD= 32768
##$SPECTYP= <>
##$SREGLST= <1H.CDCl3>
##$SSB= 0
##$STSI= 32768
##$STSR= 0
##$SW_p= 8223.68421052631
##$SYMM= 0
##$S_DEV= 0
##$TDeff= 65536
##$TDoff= 0
##$TI= <>
##$TILT= no
##$TM1= 0
##$TM2= 0
##$TOPLEV= 0
##$USERP1= <user>
##$USERP2= <user>
##$USERP3= <user>
##$USERP4= <user>
##$USERP5= <user>
##$WDW= 1
##$XDIM= 32768
##$YMAX_p= 466664977
##$YMIN_p= -635699
##$CURPLOT= <Network HP LaserJet P1505>
##$CURPRIN= <$Network HP LaserJet P1505>
##$DFORMAT= <normdp>
##$LAYOUT= <+/1D_H.xwp>
##$LFORMAT= <normlp>
##$PFORMAT= <normpl>
##$SURQMSG= 1
$$ End of Bruker specific parameters
$$ ---------------------------------
##NTUPLES= NMR SPECTRUM
##VAR_NAME=  FREQUENCY,     SPECTRUM/REAL,   SPECTRUM/IMAG
##SYMBOL=    X,             R,               I
##VAR_TYPE=  INDEPENDENT,   DEPENDENT,       DEPENDENT
##VAR_FORM=  AFFN,          ASDF,            ASDF
##VAR_DIM=   32768,         32768,           32768
##UNITS=     HZ,            ARBITRARY UNITS, ARBITRARY UNITS
##FACTOR=    0.250966925370066, 1,           1
##FIRST=     8223.43324360094, 103151,       24812
##LAST=      0,             -41547,          -106076
##MIN=       0,             -635699,         0
##MAX=       8223.43324360094, 466664977,    0
$$ Real data points
##PAGE= N=1
##DATA TABLE= (X++(R..R)), XYDATA
$$ [...]
23836 -237467 429915 -79345 77047 -99872 47691 151456 -46906 -127541 -214377 -55036 -100772
23825 -100772 186486 183825 -63306 96051 127887 186669 69300 -422731 -188670 -36620 -156408
23814 -156408 -34709 41944 -11112 185556 133824 -121540 -421063 93045 165674 241424 -46185
23802 -150348 215755 -281858 -99368 -107801 -136938 -256535 51238 -34768 90993 -117600 -161356
23791 -161356 -46188 132882 -333698 347632 -163782 136350 -282789 -16158 242527 -163391
23780 -27217 210798 -86300 34821 -435385 -68867 -301484 264000 -54913 75401 -51170 -33151
23769 -33151 -93514 407326 124507 -1817 -159524 -271128 -116368 -75260 35233 73118 44122
23758 44122 -120165 -208954 444370 -269721 243267 -204474 -173226 -107021 -104727 -34125 94900
23746 -122507 -143426 -13044 138896 96966 83776 -67927 47257 -176585 -222980 -34855 -165264
23735 -165264 -111224 15885 -174877 -72210 98522 257896 -161869 248214 -110018 -54079
23724 -104838 159416 -182028 -99613 30515 -330687 207852 -139291 137457 -181902 198919
23713 -15834 -52907 -215507 -46146 -382249 105505 223082 -18306 120945 -68508 -34509 -108760
23702 -108760 -29274 -187089 142686 -375514 187318 -85416 -89005 -108079 66215 122121 -28356
23690 -164746 -10831 -314090 -70753 -123933 -243848 16833 180097 -153307 -161732 162814 -196594
23678 117618 79291 80897 39132 40339 295845 -99084 313692 -183972 87970 202948 -279315
23666 -165703 50269 226942 -11261 -73399 -215944 -297974 -134583 51412 -175257 -154846 -133786
23655 -133786 276601 -32830 -196411 1325 55117 164414 -319669 221541 -239755 -376746
23645 -376746 -194684 87430 -242507 -171724 -28776 -229570 214295 62507 -206754 -150352
23635 -150352 55848 199715 80317 -5023 63025 67506 132945 223710 -268053 -84015 52812
23623 105209 236239 -122533 122978 81350 -187420 183623 324007 52774 18385 -136447
23612 116726 30433 -84812 213556 -149869 -23188 -100182 -166997 136939 -187490 143955
23601 -17288 152328 -210700 208234 -224829 15933 -78530 187430 67401 -321583 -169236
23591 -169236 139036 100376 84485 -134753 -217966 -290325 -235570 -81885 336969 74811 57717
23580 57717 -152325 -117986 213732 185832 -158346 155801 -66910 124676 124571 149457 -250136
23568 -6535 -326382 99673 -16907 -224212 -246756 -127166 8234 -326033 -127689 233526 98443
23556 -25431 24054 -98185 -98018 -354091 -224062 6988 -10623 -317248 61193 -349443 -2446 227604
23543 207647 28488 -71526 98589 248948 30939 -31579 -16536 -512053 -314035 -134405 -311230
23532 -311230 -17471 124178 -312542 -44545 49257 -19604 -73798 -124514 237743 -130209 37760
23520 -64453 -143398 234172 -257829 134176 53463 -26925 90321 16279 -203521 -332262 -18568
23508 -350945 -71091 -80516 -8063 135402 140044 -22356 81863 141835 87722 132965 124437 108270
23496 108270 100929 23748 50196 168826 194471 72151 32360 -59172 -96591 63576 122439
23485 122439 8942 -124855 -19927 205188 -322926 -62336 -25350 -120476 -137252 -182381 -70883
23473 32719 -30600 -53901 105909 -250202 86445 144703 -181916 117529 -47895 -408966 -30856
23461 123065 118627 143222 106401 -17717 5813 119563 -154931 83193 47365 -7528 181135
23449 244442 -455548 -383707 -39098 118950 81328 109834 -255742 -35195 502970 242182
23438 82209 197042 -297717 -93152 -58188 36371 58716 60122 269753 205698 179701 -47812
23426 -169681 -289048 -58328 100915 -2189 11539 87799 58285 231048 -77021 151384 87558
23415 87558 230877 -43767 219616 329148 392939 80691 -105401 -270600 -36247 -87524 15706
23403 -73739 -269957 150042 95935 -90101 -132070 105533 137502 45880 -237050 -156830 -70284
23391 -130488 -121564 69288 -410362 69726 33354 -119029 -25034 129353 76551 -363511 150414
23379 20661 -101735 -284240 60636 -220941 -171072 229545 -99422 11376 98341 282435 -119303
23367 -217139 -342945 274858 -276948 -30661 -76950 -331253 -112761 -193652 -94447 -166505
23357 -166505 -144437 -360710 -120921 169813 22822 282218 -167965 6212 -103453 -114801
23347 -114801 450657 -58813 -161075 33140 183863 -205384 -14656 -120861 -136543 14166
23336 -230042 -26160 -56174 -190970 150957 -164764 -243992 -96834 -75032 14817 -156626 78167
23324 73536 359354 38518 186890 -192776 -192500 59194 -49728 4724 -42402 -79034 -143257 -134458
23312 -134458 155492 -68542 82071 -328883 -116653 -47335 -71158 -124697 80084 31398 96971
23301 96971 36549 -5999 -296879 -49518 -29991 -332953 114641 237520 -229853 118750 -108624
23289 -169371 170544 -64918 -196442 143570 -82610 1451 154315 -31587 -172679 -36687 29068
23277 119409 59128 -296971 -10190 -376780 53306 135256 112081 182659 -115879 -149489 91846
23265 19931 -196388 -1478 -80348 168550 -350613 7731 36487 84521 112591 180186 -173659
23253 169866 -122565 16301 -117669 166765 -294737 -431618 131147 262714 -32161 -118901
23243 -118901 -308942 -116475 -155251 192675 -217724 125427 5676 -195261 -231070 174470
23232 133692 214921 -213795 -78196 59161 117098 -135218 -14607 -231161 -68315 62890 235878
23221 235878 123147 259547 134889 -20226 -150258 -100523 -297463 -413642 29848 31240
23211 31240 485498 -180041 18183 43417 247977 -7557 -207034 -31047 184512 129111 -216617
23199 -303566 88532 -60138 12780 128876 253132 96335 -52437 -290241 -285988 94362 -150826
23187 241475 -275963 113181 -164488 79301 -95236 143867 216622 -31419 138943 -236958
23176 34715 -34352 -394207 38585 -236810 116058 -106545 -199357 164177 129162 -9565 24124
23164 -262288 -323714 -64438 -137365 67595 52202 -52913 -90017 -283341 -116249 188450 39892
23152 269723 167177 241153 -160999 -78956 168521 -158267 86665 -94536 -78972 75843 -109382
23140 108778 -169166 -68494 153074 155463 -360660 -251713 -152618 128449 138773 -137003
23129 74766 -22798 -324899 6204 -22814 91601 -94329 -250025 70926 287493 -149879 142478
23117 -8535 -30847 190528 -296641 70317 -150647 173861 -148771 -45981 7246 -195893 1959
23105 108723 153672 3182 -211789 8258 5094 -16501 -328701 272736 -24946 -162880 128867
23093 -129694 -79461 -314187 45834 -71442 -70662 -49669 78736 -117149 -140589 46127 -33806
23081 -307419 70963 -246166 38245 155103 -252125 46142 24974 -54702 275077 52955 -203401
23069 96533 -90654 32494 127842 -327764 -108649 -105809 56464 119209 -1841 60038 82724 -109814
23056 43043 55172 228599 -140730 -125655 13201 105957 -143600 -293584 -86640 343789 -241545
23044 49742 113469 99227 3956 61827 66167 16478 -118491 8842 112457 -284458 -156148
23033 -156148 -239125 -341687 153252 293289 55315 183665 -246315 -221954 -49910 -87638
23023 -87638 160194 51260 55508 125336 233169 -28297 -192834 243135 -412295 55691 133337
23012 133337 -43665 120755 219804 -53877 -76499 131196 273223 -395 -10097 -45785 -373246
23001 -373246 -157713 221384 149008 -173539 -105492 -236707 -39442 234345 50765 20926
22990 144431 92209 7382 21871 383107 -399171 291939 210490 -55066 23331 -355859 -139228
22978 292292 98950 -20547 -38818 13504 43786 107890 -41764 30064 145841 248716 -115072
22966 347835 238589 -48292 -191870 24681 161415 67036 227337 320751 170053 -67887
22955 -39193 114748 357204 -216517 98730 -318899 -325888 189248 207531 -134071 -65597 -386395
22944 -386395 -376839 -222260 346157 -89075 226596 26309 -144304 -203130 143033 429490
22934 429490 -228158 -172066 35957 -508126 -325348 -98824 -87130 -13993 -310473 -175886
22924 -175886 -142744 20271 45020 35760 54170 -179303 259716 27243 56935 -3083 205287
22912 39880 -13203 -343372 110518 -218881 220266 -87879 -2917 123084 -113453 -13472 -399183
22901 -399183 224936 -92574 133735 127055 -124157 -79981 -14241 16287 13375 -10624 -14267
22890 -14267 -384322 92680 73377 -205767 -169956 283710 39699 -16463 -170158 15436 226199
22879 226199 -235287 -118068 -128009 -125221 182578 -276241 -149285 -55558 38198 103409 -45383
22867 64690 44917 -65941 -2470 -356512 70064 26210 -130499 71159 327253 151206 -424484
22855 -12638 -191199 -261102 -171374 95608 84299 83394 -147472 -94192 241194 258519 -24943
22843 180803 -234791 61045 -20796 95928 -191313 142019 -95839 -125567 80996 -94239 -246159
22832 -246159 -280757 -303833 366590 -141100 205525 -107125 230067 119718 83749 -185135
22821 14787 155457 -10799 -119927 -188667 -132279 -236428 -192799 -348148 87606 -137814 -215614
22810 -215614 -3242 103393 -168200 75892 -184676 68063 45369 -218025 90989 -254731 -10484
22798 -125326 -172283 99799 67852 -115749 139501 92054 193128 -87721 180024 60802 -80429
22786 145709 -89724 131137 -102743 -70799 -8666 -205954 -58250 60468 137026 3631 -187291
22774 -90173 -100169 161152 -251559 -58664 208743 -51737 -304505 -364054 96440 78174 4472
22762 -42789 -122769 -22093 193921 106013 95958 2553 -328383 -26182 59810 -146672 197103
22750 -92265 -252776 -56940 86464 -32424 -45762 -157312 -113385 100637 115659 -306472 -59547
22738 -70998 -59403 -32565 156511 4971 225273 -159662 -456123 -276665 106045 7996 -172587
22726 21874 -452226 197146 105940 -55019 -127821 317536 -18855 152403 105509 201359 165732
22715 165732 227148 175448 132881 -103438 -110781 -79555 9782 -86971 10677 77030 9396 66137
22703 66137 -164839 -66845 -129238 127927 3017 -279570 -38494 59900 -15074 236674 -48636
22691 -7104 -201438 -451 145205 -68148 -12885 135606 -136975 139333 122011 7205 206646
22680 206646 -15684 -55534 -94360 126161 -430537 57775 264870 44541 15380 -12747 -101021
22669 -101021 -86919 -6052 26147 -446232 -194866 31911 235594 -278195 -186726 -60865 335501
22657 -323841 -356525 -22048 -90464 -387847 -57546 -203395 -170131 -28775 251888 -125169 -51665
22645 -366809 107476 -181677 255394 111130 -36576 -139474 47009 257001 -130134 -224585
22635 -224585 -261564 -156190 5313 -104770 91150 -226139 -275932 -95257 -232233 -130802 181931
22623 -309247 -46389 -240305 17198 4630 -6827 -179977 -154301 242350 285077 -241230 -124662
22612 -124662 -1520 -20247 10528 272824 -89910 -221012 115877 60364 138181 195283 -139456
22600 -268305 -151511 6449 113308 27587 -53060 44901 -61811 -69620 -167650 -1222 186369
22588 -142105 47729 410775 46101 23398 -204730 -168248 56310 71776 38732 -545101 137930
22576 32818 -156514 -40556 -262149 -347311 -203414 -347743 15459 23074 -12585 31864 -365343
22564 21146 1418 -115325 -319517 11148 109830 -220632 -223416 162689 -2685 37341 312463
22553 312463 -484025 -2932 -155190 -227734 -151938 127798 113415 207816 -69513 -1472 28275
22541 112843 299385 -42895 176274 133174 -284607 80719 -317122 2120 -83034 -269956 -68738
22529 -25092 -385836 -223224 185368 183307 -199324 195611 64878 9380 146410 -94289 -31260
22517 152250 -20178 -243682 317307 -160467 -156593 203403 276469 -426728 237638 -327444
22506 49822 38516 195217 -122505 377767 -193897 -359136 -26171 146980 136473 53438
22495 306066 64304 280490 12148 -3202 133910 -157215 72383 -214288 -141286 70502 219169
22484 219169 83034 8260 206366 -84078 -3159 92182 -203278 69851 -165166 -12738 -127108
22473 -127108 6017 -36677 117939 5858 71230 -165923 -68266 -308639 60714 -162026 183115
22461 -102087 -140893 -174422 16322 -114854 -7622 -115229 140924 77610 -198115 -117368 -154066
22450 -154066 507 -186823 119023 -88593 147562 23187 -99683 47672 -151625 -4446 -187606
22439 -187606 -252464 61640 52477 213064 178841 -26664 -171517 -175313 -280792 -78083 -239058
22428 -239058 -231527 48780 -45354 237206 163545 -71507 270986 126205 100523 -382089 -202584
22417 -202584 102269 148252 -46902 466799 -7731 23071 -223327 -32131 -49990 -33680 119587
22405 76694 204600 -315481 -64646 -368057 9785 82167 -120408 48983 258707 -44530 -172758
22394 -172758 -487417 -54035 33183 -24418 112785 171883 -159706 59310 -120388 100705
22383 54202 -222429 134368 39179 -114342 82294 -202295 -30271 -14736 -112807 7833 -81968
22371 55421 224339 -303796 160683 -98724 149257 -79847 89798 -349895 -185809 152726
22360 31366 -101593 62155 -206990 89800 191479 -29111 -133280 -37411 -348 167207 -155746
22348 -52531 83731 176427 -123769 159099 11099 118843 188338 -15546 -80823 -49794 24660
22336 1478 74031 50962 247839 -135325 26734 105625 -126620 -72170 -263341 -128648 11452
22324 -276141 -156861 -197521 388759 -110276 166029 1220 -258287 10181 175156 43542
22313 41905 -187484 -142557 -300666 2767 -102332 -316793 -36750 -325723 -161783 87152 -19993
22301 -60560 70148 -178629 -117760 279824 -53854 9761 38024 151280 160365 226636 -327245
22289 -30529 -13886 -203319 10343 129654 -83728 -14375 -368264 142602 -413320 11705 13516
22278 13516 -255428 169524 -47857 -59043 -93055 -47170 -183560 115148 -99100 -245520 309692
22266 70527 -332752 -41764 -315055 -141884 -70788 -265782 338847 -184237 -12988 -15082 224171
22254 -213246 -79379 285229 -130352 9855 14887 -130195 26621 -41571 197142 -298300 125139
22242 -74815 -173848 94310 98099 -277250 -339499 -161218 4375 -373671 -150753 13028 119901
22231 119901 -135825 -44167 -184233 -30259 -251771 -229649 72230 -33950 27697 -11046 -354995
22220 -354995 -72301 174805 -149717 104737 -36189 -320079 -8521 100866 -210985 -52675
22209 -113583 -516702 -69737 -296710 130253 284083 85467 254126 74749 -67199 -115054
22199 -115054 -155327 318071 777 -324776 15577 -18412 118686 24555 216712 -85285 60004
22187 168363 -69965 194409 -24057 323805 -316039 -5802 113965 -66927 -482948 410376
22176 -329880 -46360 -175505 -59741 51228 -144807 20429 -178568 189212 71099 -172231
22165 -120190 -67858 147656 -271462 -341067 58676 98970 36921 -197094 55728 122932 339099
22154 339099 -69441 -18326 45030 87007 -359568 -315251 116523 320596 39289 -41348 86471
22142 -406678 115701 -74297 -172971 731 -299940 -147005 -37161 127601 -176314 -196642 271840
22130 -188780 -82203 -138720 48882 -225677 135540 -223019 -163589 -151399 -155585 39989 86892
22119 86892 36609 -229540 -64698 -197114 -163588 64214 -232883 -60392 -80019 -410984 36586
22107 196913 209835 -26480 -131314 -90377 -121120 58709 282543 -67425 -203784 -68938 209095
22095 130010 301127 111396 -116038 -582783 412714 30092 -163947 -183076 -27888 -193780
22085 -193780 274775 36596 160366 -301674 -190666 -269944 -135166 17705 -330520 245833
22074 -72169 160690 -158006 -98205 -907 30579 -34837 -160071 -300 -159555 254024 33754
22062 175084 163172 -272447 -93384 -5580 -25452 4293 -165327 -29789 -139841 371893 -151536
22050 -147545 16713 -28092 -205752 239018 -127964 -13185 58965 186617 289236 -55241
22039 -311290 -289295 -263004 -225633 -216062 -136353 -193904 -189442 114697 4929 -186443 -199255 -184123
22027 -184123 -28828 13251 75500 -244925 -477529 -4930 59353 132805 -118134 -138260 97883
22015 -33174 -108285 145137 -350942 -432355 -92835 21311 -69653 -314487 -68051 102203 -458271
22003 -4978 -63213 -312965 123224 -27884 277818 -37270 -174617 35220 109523 -26085 -15707
21992 -15707 302582 -80106 -318152 10056 -367737 214147 -132897 -26062 124655 -142043
21981 251929 39344 191036 398013 39351 -195188 151182 172700 74092 42228 209927
21971 209927 -64840 -76279 -117235 61338 481671 54421 166214 -202842 -174038 -333641 -123542
21959 -2829 -246106 153313 108381 -199531 -76505 -3193 -179803 202724 -210353 -56492 -236637
21948 -236637 -207159 -221787 183738 189794 -165548 45239 -155184 50756 -208008 277408 -67731
21936 -293502 279660 -226582 -143141 128135 -163077 129176 -165573 79326 133727 139594
21926 139594 -411477 793 -172127 -187553 122561 -246326 14058 44838 -33422 9946 116909
21915 116909 -280417 -408217 -21748 -91220 306123 -324438 -288832 -100605 -186569 -7594 -124452
21904 -124452 98760 -205476 -46242 -221410 -96611 14835 238128 -286752 -97233 -273958
21894 -273958 84679 -68574 -12801 -24736 -117013 -51433 85361 -87407 -103659 -252545 -57148
21882 -31851 194179 -98943 -9189 -119228 -150677 -94520 110434 269418 -86689 132663 93394
21871 93394 414988 347705 382104 -78299 245232 226682 -28045 3289 71340 -29731 -284345
21860 -284345 -230852 -182899 178476 22510 -98867 46707 -65860 174948 -96146 25492 -216572
21848 207672 -360798 -312862 138498 205344 103873 -242930 -169639 -326011 -38137 187706
21837 -77247 170068 -99402 -31342 -119879 -382446 -4443 -193353 17967 -45240 -205258 -219184
21826 -219184 158045 -149096 -63693 87529 -42008 -42233 -164159 -196434 -245942 97343 186453
21815 186453 -187175 205042 89270 -330443 -16769 -195358 233404 -119664 194415 206620
21805 206620 -220786 70486 244888 -14985 -56535 337076 145661 -2235 -125190 6656 94370
21794 94370 -264427 -194335 -28076 -82825 -315888 -98976 -12676 -104129 -125577 -241410 102684
21782 193828 -269208 84884 -90021 81927 -52968 -226290 89383 -149274 -131184 -225036 -418563
21771 -418563 127668 14593 -209616 -138670 -316680 -90488 -125555 99061 -5025 181201 -280603
21759 489 -129314 -119947 -165602 21043 152625 112117 -51021 52365 -10630 8339 -171797 -366153
21747 -366153 -116384 99416 149528 -167846 -108606 202589 13242 -177100 -93732 69506 -253494
21735 -31226 -32113 -44068 -24845 143648 -144193 26551 -142571 -45953 -101715 -220907 -379166
21724 -379166 -219560 166457 262233 212717 355027 62722 -347081 -27728 178320 -135444
21713 93201 117485 -376395 -200594 -14235 -136459 109736 443 -144809 27385 -332716 -15849
21701 32402 -88003 100196 227779 10903 167557 -287599 103648 124786 -59267 -12118 229899
21689 -85120 21977 24865 279473 -155676 -59938 20748 175261 89654 34064 -430056 -222803
21678 -222803 176859 237084 -30173 17104 -21912 60819 234973 -149343 -90838 205588 194429
21667 194429 155639 -64607 -69163 51370 347211 15305 -24887 144384 243369 82216 -467228
21655 -166546 30245 119470 138543 305735 -62566 -166447 -268010 -166807 95455 282195
21645 282195 52698 117620 -46209 -290935 1250 -257929 56029 -89084 215085 -116019 -120740
21634 -120740 -297754 104097 186688 250691 -95241 212214 -17077 4996 -258151 -4981 23436
21622 -265402 -380171 106582 -56315 -341108 148279 257777 -260919 -252814 -74362 -118658
21612 -118658 -183960 -206279 -313198 -182661 29958 -425778 -62324 136490 -286809 56905
21601 152936 -179337 -271974 -45829 217021 -105210 -113944 31999 -169186 -102245 -326664 -281828
21590 -281828 276142 -271281 164345 -127225 -32986 -163530 -159947 -381479 -231385 -397261
21580 -397261 182067 -207992 33624 39703 197063 -120314 -29065 22765 -152208 -143531 -74645
21569 -74645 -154563 -197188 -229926 -222159 -178334 -3637 -71334 250078 3080 -212275 -75799 46447
21556 -167486 -84613 -130733 165183 79636 59013 -241574 -41874 173733 130 -87950 104055
21544 -268983 94355 -205585 27297 -86612 98643 56043 104772 110341 -131539 -27798 20914
21532 226345 173760 29546 -42642 -190531 56032 -224753 -124168 -88711 -85395 124402 139806
21521 139806 -53686 -156880 -36241 4900 -81578 108118 -106046 -92702 -109244 116682 -9524
21509 -118593 -161033 -146949 182031 -287603 -27589 19223 12298 -272477 150549 139102 -61981
21497 -125847 -16924 -320485 -76747 221624 -98782 325974 83762 249815 -238872 -164715
21487 -164715 137534 117096 88921 -124748 -519213 183059 72922 137336 -57503 -38696 -9897
21475 -320950 -80335 171627 73417 -75250 83057 -114501 -454713 -88973 -28098 232647 113948
21463 -333516 34542 203245 -122134 66950 -20754 325227 -27071 127608 20138 -410767
21452 -148866 -258202 169881 151042 -135789 139120 -183813 -45377 -81696 306780 163948
21442 163948 26147 99699 29884 -27741 104763 123616 224975 58272 48064 -161126 5071
21430 205705 -120676 430117 -354476 -101951 -78983 -432189 -93559 88008 151577 -38082
21419 -242271 -314018 245544 21378 38059 368322 -469773 -209785 35440 -33164 117580
21408 -223189 154659 -2098 -62873 178375 36795 102172 141036 -58781 217673 60441 26659
21396 -205522 -204209 125052 -457798 -409841 143576 2657 159796 -66468 -40130 253266 -311786
21384 4102 -144792 -381277 -510016 82263 20043 -259455 12352 50409 -130082 360524 -220126
21372 -124618 170260 8954 -156197 25113 -22312 -59446 -235139 33717 -29022 11867 140082
21361 140082 -79575 -9956 28482 -215000 -28574 112738 -121225 23166 -93062 186013 -219850
21349 -316876 162245 -239206 107923 66064 263602 46997 56515 -78126 7240 -32773 571897
21337 -168765 72766 -272205 -117768 13942 12265 -361175 -160296 -16462 -303979 -197203
21327 -197203 141983 -68217 120754 111734 116374 -260809 -20570 -73033 -34906 -102498 174801
21315 5891 -91452 -29009 2548 -245904 -318126 203758 -249317 -152713 227209 -169913 -75931
21303 -180597 37474 -77612 -34271 -17432 -207272 248317 -16009 96514 66074 -227046 1205
21291 -55440 -39655 3187 -182188 -196576 77210 -133590 80612 -34468 206264 -282951 -8977
21279 18282 66775 58913 16695 49234 -110353 -59289 -256745 340004 -425768 395910 107588
21267 -58232 65878 -167364 -79909 -60334 -92896 -170149 -39327 -44187 -111667 26090 123576 142540
21255 142540 230658 13906 -161234 -150101 237282 -85999 49814 -193745 103319 186802 -270930
21243 210532 88017 88278 132562 94377 36841 106125 -159473 -67612 -137720 120059 -123574
21231 100634 -44738 -240234 -35319 42418 -154238 -241313 210163 151685 -86453 -115997 -174179
21220 -174179 -237830 -116419 197322 -60632 78109 -66169 -262957 -248117 -50981 -227370 -110408
21208 -72687 -86197 162689 272615 151508 -101212 -236303 -24416 -4955 113551 215 -122649
21196 126980 -63883 3166 -162514 -91242 44591 -5274 198516 -77601 18624 -45883 197875
21184 -67160 214507 17112 -84974 422506 -269629 -70046 -37985 -104205 256428 -260 -354807
21173 -354807 910 -242656 426073 -82570 -134316 -111535 -10230 -212683 104654 -116420 -215429
21162 -215429 -64076 -246598 -217390 -223447 -234082 8439 -4256 -349853 -190090 -128189 161679
21150 -334653 186026 49501 -101530 -24368 -143968 130525 79522 66489 -80647 188066
21139 -30022 -59164 -263364 14256 -295455 -102462 -457534 -44009 -20518 -113451 -151296 117646
21127 331397 -43426 -137222 125578 16268 114994 -345977 -355508 -125949 52592 -110831 -141063
21116 -141063 -269575 -22766 -17604 -307069 -429261 57479 183758 -110157 -402389 -359865
21106 -359865 202235 -108301 141128 -94940 -424050 66931 155649 -83544 -88188 70679 137562
21095 137562 125606 -99783 -70827 -109783 228440 -263969 -85236 -77753 -43363 180345 -109333
21083 110030 -127373 -311472 118929 -150419 -261526 118953 70060 -110483 -369690 109521
21072 -262069 123409 107713 -23519 -36418 -264245 -161277 -105532 154239 -20615 68858 -488680
21060 -78786 -31124 -114902 45896 488078 -192178 -88710 -62268 68136 -120990 98606 -67740
21048 357491 10834 -90943 -57422 -282966 -307588 -27231 -601946 40651 -39043 27577 -243972
21036 203152 -46284 -117606 -145254 207689 -106795 -192219 -32317 -90053 -41974 111184 76677
21025 76677 -77825 -27726 -125436 -71378 103886 39240 -155912 349270 -136106 -81880 -111392
21014 -111392 -201825 -164979 -153997 -173463 -92995 -223493 -79183 2396 -144686 -59919 64489
21002 -193991 57954 -1223 132369 -253457 -72867 -133650 6089 -153458 -380192 161091 -2403
20990 -121317 -87258 33064 -48453 88626 3349 237143 24596 20966 -116418 -223713 -1486
20978 335342 -242830 17035 -108211 -11995 16573 -377353 7085 28955 89908 35352 -100632
20966 -211821 71188 304341 -45897 55439 -294547 115825 -347497 -57787 219895 -100346
20955 240252 66797 46885 -279604 200948 190072 -32611 37515 -369888 4216 -51611 -87966
20944 -87966 -135176 -143459 273788 -204490 334298 -11585 -313152 102619 -140295 -413101
20934 -413101 -183686 111680 1522 27072 -450223 127920 -116556 81915 -63819 140947
20923 -84900 -42061 96431 -155689 32034 -179584 -319361 -103051 -182784 -30574 -423496 -227809
20912 -227809 231676 -140349 320358 232346 -214993 57180 -49575 23857 -158813 103824
20901 87330 -208882 -213066 138379 -86452 -6556 361563 -217757 -69164 -184286 107309 -83531
20889 198405 -128892 43333 174167 -91672 -53326 -377694 -94631 114302 -190202 4544 -221717
20877 -248668 60515 -105729 -181762 -104488 141255 197860 -220518 285098 104452 -35666
20866 -116654 -193283 -104362 -69019 -189063 -137222 85533 -147653 46143 -81246 -98488 -110391
20855 -110391 13127 229827 -231100 -167066 -59872 -99005 35293 306000 -106380 -98771 18135
20843 -113871 -217466 -134779 283453 -240208 -10526 -66052 123068 -253223 -257453 -158153 113859
20831 280729 41332 438122 -166542 -163764 304141 -12212 5336 349792 149405 -256896 -51743
20819 133964 64158 -168146 -55961 -103776 -119474 -201483 -110570 -150629 -29520 -154347 158412
20807 -335614 -270151 -222484 22008 76902 -182312 116591 151728 92718 -319469 22092 134078
20796 134078 65582 -243383 -326177 116181 -102866 -193789 -271264 41833 -156596 -202992 -392636
20785 -392636 153441 69658 -129285 153514 312040 -11712 34638 210178 -205549 -255019
20775 -255019 5663 -164031 89879 10126 -12247 -190176 109824 40140 -11595 155995 102683
20764 102683 -25689 -9954 -198321 38089 102722 78079 7984 -229344 -302000 -42150 -91677
20753 -91677 -245261 -146932 -247428 115572 -635699 -69318 168600 -165765 22929 31107 60893
20742 60893 -353707 5244 -448594 76337 255986 -24752 -482109 -70539 66373 12251 -213613
20730 -105558 -101039 91166 -178712 -86072 105314 96512 -55049 66657 12740 -284705 -248256
20719 -248256 38553 40803 31050 -93346 -429363 -45729 -184374 -125875 72773 -45961 -20737
20707 212649 301580 -132744 141232 45554 -75909 -231725 -3417 -27384 100795 371662 -27996
20695 185300 -164223 -59234 35621 20500 57079 -397358 -253926 373702 -6432 135733 -134533
20683 -373853 -175304 -59607 -51073 99119 -50388 -284804 151321 -491030 -209703 141042
20672 -94039 -224024 -262146 158586 -221141 251796 -61245 -25683 2674 -231266 -226459 48000
20660 -500504 120154 -103138 -52511 45256 -4084 114896 -369075 -17236 285249 -74191 -181473
20649 -181473 -137317 -218009 -278679 -55103 307795 33683 -72744 67246 -48511 -306148 -81432
20637 -41465 -38851 11508 -39628 165944 -24294 -75398 -42645 31516 -179209 -71881 84709
20625 -319779 -182901 43293 -2758 -40948 183702 -105140 -143102 -56170 -323732 4280 167384
20614 167384 -514852 -31454 -126962 -184110 -61891 113228 -207109 208457 248746 -162479
20603 -425656 -147958 20955 -40051 -112599 -28768 -144242 -257098 -284596 -216197 -49504 -16725
20591 -128398 -232734 81022 -306365 -5953 -65152 205209 164811 -6287 255595 -295841 248660
20579 157425 -54546 209211 9457 -61105 -193628 -25665 -78535 38499 -408688 240143 -168710
20567 -151532 -94378 12646 1572 -75638 169627 -187249 34117 266209 -101439 22057 -146083
20555 -260906 17376 -70334 -125963 -39934 78149 95053 147959 121071 -36905 -50849 156981
20543 106050 -121658 155915 -7364 -147844 26128 -58761 19484 -143268 -104895 7456 -39827
20531 -245626 -296748 102225 -80812 -31403 32848 158684 -170353 -124530 -124372 -67999 81717
20519 -63057 13499 -126549 5090 -48116 -174820 -69715 -49174 14517 15706 -8206 24624 174270
20507 174270 -106751 -333570 201130 -44637 -85439 -270737 -451944 96402 -262248 360155
20496 -78465 -177492 10047 -313368 3733 -127073 122739 -100966 125085 262855 -81524 -29371
20484 94169 -30582 51247 -123103 -79374 -216806 7874 -156045 -4000 -374339 -85033 103037
20472 152377 63312 -2746 13268 44431 209379 334692 -66894 261400 23519 46453 -173413
20460 -176464 -167345 -180432 131865 -140949 -53141 7464 137775 -50932 166008 -61034 -227875
20449 -227875 -178175 -3910 65416 -298077 95133 -122832 66014 287548 23092 158305 -222990
20437 207968 -170522 182008 -172540 -393682 -275967 -197206 55233 -36057 -26330 -185219
20427 -185219 -182441 67750 -204491 -152825 -22749 19367 -279275 -142802 157250 60179 -127431
20415 -75074 207349 -352797 -173317 285678 -65593 -149043 3564 -12793 -40680 -203522 184878
20403 -427242 -85584 -101167 -72622 -23903 -71879 10615 81857 -414197 117798 24077 162646
20392 162646 -141741 -25172 -502870 -87407 -64619 -99561 177731 -3415 -206447 -184456 -149697
20381 -149697 -426722 21045 203307 -11171 10238 -183984 -121338 -20571 -268275 47053 68828
20370 68828 -205448 -19731 10063 -18815 233882 -143635 -35693 171715 -209732 183338
20359 -380359 80368 -267100 -251303 155301 -247688 32418 -22849 -77896 -67616 192755 -272387
20347 -149439 -72125 -38296 184388 -413340 104649 -218411 -212182 135350 -159038 -245479
20337 -245479 -84495 16653 287420 -89899 -91954 -159038 97004 -40638 305640 -26822 -271222
20326 -271222 -145681 293458 -369848 -66418 130923 -117314 -168109 -243181 72422 -68482
20315 150004 -128192 -280181 19280 368393 56116 85364 -288 -15536 -245226 -253183 51333
20303 9177 90286 286042 283939 66849 -119995 108076 -91730 53129 -81202 -195289 -314492
20292 -314492 -83425 -276541 -102977 11715 -73251 380358 -219582 -191896 -93698 -135320 -311930
20281 -311930 -78950 -39360 51972 -31436 175350 88321 106208 -197674 112168 -108264 -85806
20270 -85806 -16472 -105317 270563 -220215 298263 149766 13034 154258 -295631 4645 236812
20259 236812 5026 -362985 147999 -449943 -62164 -329606 30121 -209931 -154454 76001 -44758
20247 75291 81694 -86677 160488 139977 -97347 -10225 137608 2113 67700 -146305 29576
20235 -241628 -151263 -283668 -14550 -76807 -78230 -143893 -443802 -105181 -202506 -215072 18046
20223 125330 -316874 -95739 93432 -142408 309457 -64083 -153593 39182 2172 18673 -284963
20211 -133575 -389252 -142259 110375 136603 122492 130841 -19848 137461 -116395 14888 244290
20200 244290 -222929 -175013 14425 -166577 -25778 -69175 -189238 177180 -111285 -149805
20190 -149805 27717 -6431 87746 -326007 -121230 -183884 -106060 95065 11824 -176896 245810
20178 -1626 -22339 -43685 -256104 -344542 -352564 -77477 156177 -163955 -79009 -21482 -237157
20167 -237157 176876 55214 -284632 -219405 24116 -198501 -65983 -159305 170115 -328410
20156 -11641 -212552 25950 -24898 19100 -46485 52798 -133569 -17336 115383 59209 154504
20145 154504 12960 -122223 223190 176655 -133915 -237391 192988 69533 -88035 -16207
20134 103355 217986 1587 -413114 -7799 -229357 -114367 228793 -2708 149635 96949 118330
20123 118330 165603 -276238 57063 -244727 209961 -225670 128657 51203 88515 -290013
20112 -87400 -46324 -35406 53856 -99707 -242263 -424560 4646 -187356 58158 -338786 -229264
20101 -229264 -146474 -96932 -218504 -5891 -834 -334004 -243945 73709 136312 66756 197358
20090 197358 84939 -44103 -152692 196206 42420 -118639 99122 -66815 234934 -200124
20079 59406 -122070 234645 26969 -122314 -191177 310249 206563 61472 72223 47459 4696
20067 -49894 11497 40165 -4526 -161583 -61137 43375 -42663 -67037 -120199 -182829 -210282 -23390
20054 121414 91835 84368 -116532 97982 101740 -146833 98495 273992 -48121 -124113 -135287
20043 -135287 -223044 65941 3382 -106582 -190492 -169118 -84064 95930 -289483 181308 103595
20032 103595 -51347 -45978 11557 159743 164366 77507 216985 -153586 17851 49091 6672
20020 -119013 102572 -79949 221125 81469 -228437 -167240 -67463 -254239 -136451 -132931 -230057
20009 -230057 -378443 344194 -142224 -21099 -368587 438445 -12614 -90752 -102255 16533
19998 291813 45056 -90869 -181395 -44859 80961 394313 -76856 185026 45672 -15715 -22578
19987 -22578 165730 246611 170006 -14852 89619 -227111 -114718 -238146 -323755 197741 -121947
19975 -283278 -173180 -156451 -69338 18133 -165147 158318 55264 129258 3950 -207915 -285737
19964 -285737 -278123 -235045 -16093 44037 -34323 94735 -100122 -352511 194843 105126 -67283
19952 -419595 2811 144539 42406 215013 -66497 -44558 68781 -64779 195256 -65355 -412859
19941 -412859 -365183 160749 -11625 10044 -90538 127013 -360402 -430760 18582 -47011 -172020
19930 -172020 65383 -17450 -129758 -117385 -202560 -102580 -322847 -46847 -92041 -51118 8699
19918 56090 -216866 85115 -114174 -52933 -252784 -338926 194625 180077 -42276 219897 -123094
19906 -75289 -262652 -12633 -114052 -164464 173219 -276238 -15440 -337151 -20787 -221508
19896 -221508 58616 -509444 -47012 198120 -70385 -224264 -41338 -254695 -338360 -39831 -297829
19885 -297829 -382645 -2855 -60196 37829 -290994 -231014 176206 -190288 50304 11454 -268051
19873 70252 -100652 65943 -250425 31626 -255321 385702 37224 -276788 233700 -152943
19862 44433 -60152 289925 131057 -213904 -131660 -65235 -78335 -176246 202423 -44262 40185
19850 -115503 240299 124306 70725 -5851 51652 138801 -37207 -298334 -82061 173032 -53402
19838 110496 365577 -233917 231773 62853 -206974 -136776 -283913 -280112 87113 30753 -90476
19826 -132845 -259008 -32373 -112672 -245127 146096 188902 -143166 -121064 -90702 -57759 309176
19814 -298831 -197269 -307557 -150579 -41868 33983 -225437 55086 -206082 -116970 80089
19803 -48906 -57681 -75402 -403418 -49909 -167884 82019 -64501 297871 121345 -305729 -462265
19792 -462265 -249368 -281833 10801 -88653 -216447 130912 5040 211149 -147400 -322641
19782 -322641 -266746 -175479 -68551 -183216 -119164 -111520 -107143 -266807 -174497 -114983 42883
19770 -163167 113132 -185257 -111772 -334990 -28535 146290 -34877 25259 200609 245102
19760 245102 123918 -330182 268917 -226423 -482303 71980 -86371 -470640 -151678 23832
19749 123195 363896 -88610 267747 243250 242514 205978 -60172 85532 -62826 -73798 -55073
19738 -55073 38803 39577 88825 139703 -114000 128891 -76459 -52442 75549 -236562 -58952
19726 90331 -173114 -18958 1632 113727 -5528 -179369 -78177 32398 17970 315747 -126943
19714 -36186 -81291 -23971 -229869 -34696 -39307 -86428 -453369 -395293 127446 -63348 25269
19702 -35802 153316 -300959 -103615 -50159 -318194 103971 -340747 -48205 271143 -134414
19691 28847 -16701 -324456 -203624 34127 -217462 304697 -158300 212251 -342050 -214232
19681 -214232 326698 173982 -118244 -176115 -81184 313694 -64854 -188790 109849 -416119
19670 -208676 -107671 142813 45289 246467 201898 93198 26228 -406743 -147932 95882
19659 -473471 -104483 124463 58615 -226330 -222469 -22920 -148498 -30226 -264008 -243068 2762
19647 44656 -3289 -157995 -188999 -19392 -140192 451770 97208 33368 -53482 -103256 -183708
19636 -183708 113509 50755 30452 123309 103377 -105394 175848 -25724 -224193 -447208
19626 -447208 37996 -184125 -59319 387589 -165949 -58226 96553 -360295 105568 -197253
19615 -82367 30056 -318139 -56768 -152842 -201555 -166819 53059 109539 -205537 -87490 -237246
19604 -237246 -25098 -81609 -26881 16282 -32352 272290 64958 79887 -104501 110239 -239141
19592 -106611 -259367 -108623 -160037 -29755 229175 -196089 -118587 269528 73315 32992
19581 126 11850 -190178 -192159 -126824 -143398 -114904 35439 -79437 -49854 -44453 6960 109566
19569 109566 -117101 144738 -110870 56287 -198336 -155878 146664 -45532 -278722 236040
19558 -89988 31917 -192391 1815 15022 -350160 29350 128220 -132124 -245410 -29880 86993
19546 -254168 -163914 40147 -147831 39257 60633 -10871 -209640 280305 -37014 -171894 -210395
19535 -210395 -298762 -189940 -101234 -42762 -37106 -40641 -22335 90237 281832 -278317 10273
19523 -22800 -24434 -302488 -144269 212574 76607 -7963 50453 -6124 269088 -291206 -322428
19512 -322428 -126505 -39887 157331 -317176 108261 12890 76503 -24461 198334 -401957
19501 14503 -225987 85005 -437408 -50529 -78773 89093 -65633 -92431 -354425 -142547 199268
19489 -71240 -117882 -16133 -114110 106987 305068 -278770 106617 8753 160796 339459 -159608
19477 76374 -108810 -24900 -213959 -113751 -204413 -24154 -371804 17457 -174501 209556
19466 28527 66889 -118614 -225684 261835 -178799 -156193 -91004 -126710 -298688 -77971 -144418
19455 -144418 -174519 208363 68957 -40465 -56051 -20762 -283452 140623 -176187 -16895 -145321
19444 -145321 -240495 -78598 -308960 398774 135634 -316582 -297006 59436 -620399 -144302
19433 63198 102445 -266120 166466 -215474 -114894 21846 212094 -52924 132426 59725
19422 160712 27081 -97736 75772 50787 85581 -49179 -28437 -102900 248970 17351 -232436
19410 -199735 -246736 287381 81184 44583 -16478 6103 45228 -119241 -201641 -131299 8747
19398 -290052 -9161 -533790 -254537 -92179 -206151 280706 -21180 -14227 24310 -80106 -118106
19387 -118106 156134 -78227 -36893 -467191 -206920 -128128 -18920 439718 217621 128993
19377 128993 -176016 -454169 6697 144684 -239551 350707 14534 184189 99756 -262457
19366 -65355 99618 -363979 368660 -127778 -6881 222649 -83768 3763 -47301 -110756 -268091
19355 -268091 -50252 -127941 3605 -221946 -264329 175534 -37475 -56320 -197351 10161 290166
19344 290166 -276320 -102383 231622 43735 -236639 -161980 40608 -22354 -243933 -228182
19334 -228182 132564 -81804 -203115 22310 -18020 -14023 -185971 50822 66227 70981 89967
19323 89967 97324 -20430 -128047 160693 -230331 -24908 -434486 -26759 38456 -303139 264736
19311 -130036 168754 -152915 68632 -105200 -63630 158520 48138 -51734 -12221 -274347
19301 -274347 -116595 -227047 156005 -3625 -28777 179171 -76813 -62042 -25567 -162173 -462311
19290 -462311 -46344 -189285 -181641 -108589 -316441 -369109 -187391 52821 -63826 -405542 -29459
19278 190948 -98585 -32242 -98736 -198583 190057 -315066 -290972 2172 -128841 -260657 -107126
19266 2953 24593 -288532 28152 -280132 26140 -130466 -213192 43016 -140711 -234483 -238431
19255 -238431 -242856 -3754 -351077 -93325 -310514 67221 12789 -185774 66746 -131531 -258383
19244 -258383 -160249 327630 -201946 -108062 -99596 259438 184787 -185883 -66405 48568 29494
19233 29494 -71509 -30445 -126039 -228106 59206 45384 4771 56570 111006 -137832 -341833
19222 -341833 -199464 56508 -402043 233785 120638 -277298 -187099 101082 18852 363 254576
19211 254576 74423 144337 66502 -291037 3080 243456 -40190 80837 -172739 -273461 -47017
19199 -136677 -345540 -172977 -157524 -39616 92170 -58994 68388 163669 24572 -473353 -63449
19187 -443443 150491 -264745 5788 -76815 -43550 -235860 -185910 47641 -149948 -49892 128056
19175 251768 -124424 41806 -338458 -141745 -47571 135471 -117706 -122359 -131561 48446 -219433
19163 -427477 162446 88905 92059 10454 302158 282973 119360 -207821 -187805 105507 -70567
19151 -214109 -206374 44282 -45669 -64423 24644 -122459 21559 248599 5954 -92559 -330248
19140 -330248 -295247 -12549 251175 183452 100305 -151737 34729 217355 -49017 121777 -378567
19128 212190 -293208 -286478 -137402 50660 -52868 172453 49212 93 -181417 -245071 -41493
19116 -351554 116389 -80593 154504 38592 -67499 -150449 106453 -389969 -383584 12588 -80468
19104 -79689 120789 119599 -66324 -54009 274755 -247410 -84034 -259596 -139393 31964 -27286
19092 115890 75951 118416 -210965 -137302 -163354 125571 341190 218714 -37580 83981 221213
19081 221213 -35448 505494 -53046 -76771 -42185 1718 -38626 26596 200321 -140347 42978
19069 -63745 -142858 -37311 37465 -244857 319479 -94086 -204763 -164989 -10710 48812 -159527
19057 400025 -88264 -81213 -201810 -19163 -124336 -290790 -188393 -170100 -251095 153617 -10228
19045 25828 496 -104920 -67809 -193317 66243 -295676 -370213 315561 -223829 256657 214637
19034 214637 20502 62851 9834 -106621 -162422 34491 156025 -261349 -167880 56584 323726
19023 323726 82035 398364 162597 -50861 -49217 90864 245780 6018 109062 -90516 -104505
19012 -104505 -8537 -107547 34161 2637 33201 2945 63187 -82692 134648 -101926 15276 -175174
18999 10426 4864 -155352 -192186 -11429 -208591 -161134 -144371 -79138 -255754 -311565 -26922
18987 -129227 62543 279876 -256841 -294803 56203 30453 391096 -220223 -14724 -18688 -53202
18976 -53202 126909 -224092 -107507 14994 -155257 9771 261908 -53497 204749 -63165 -287527
18965 -287527 -47206 7101 -63773 197626 109524 65500 110880 218781 131798 -200385 62328
18953 -272343 -110427 -285076 107069 -33293 -201622 107791 -209136 180572 190610 192389
18943 192389 -74086 158819 81710 255607 3547 -291388 -40697 -235792 219233 21587 -114157
18931 -67673 -309409 -245832 2667 -55719 11157 -26502 -41930 -126062 241997 -138367 126248
18919 -102647 -198724 -235786 188723 44667 -272456 -17825 -138723 -84266 21 -196664 -106101
18908 -106101 43774 -290366 214244 -228921 -591010 8958 -209255 -205544 125530 -260015
18897 -154090 -256337 26683 31158 -313706 -96712 96498 -326282 44047 76106 -231995 -80901
18885 -183831 119199 204564 60356 -55141 -77635 -279576 -268204 257353 -139193 155997
18874 -251335 -176732 -333731 -7342 150144 207143 157077 -504179 -430836 -127829 99648 43240
18862 99373 -284162 -16058 153153 198989 -46836 -24672 -291065 97592 -51345 -322085 -198996
18851 -198996 55322 204824 150313 -102338 104969 -176389 -254043 -22276 -56489 -297570
18841 -297570 -40892 -183570 -159151 -35672 285357 70536 -246419 -152648 -145364 -116147 140959
18829 96562 15594 44474 280399 -59259 -225292 11441 -340794 -51068 -119942 67130 -102566
18817 34474 8469 190615 15663 183509 198467 269950 -162101 185816 44732 14689 -127242
18805 -105816 -186622 109996 180919 192613 -304992 257383 -271908 77892 186795 -274565
18794 167062 -164873 62891 -164327 -11378 -50145 95140 -99258 -85600 -298267 -231071 -125136
18783 -125136 -124475 122456 -30886 -188659 59485 -178888 -238840 -156203 133460 -65098 206575
18771 58669 -90059 -108375 -40056 151841 -95121 -606935 -365647 36920 -150882 -229903 -278062
18760 -278062 195723 -13757 -219723 223840 182937 28778 -550269 -100032 -105255 19337 -224233
18748 -249417 41455 -19081 -226363 31217 114231 -73561 -203155 -96040 -23354 81044 -242866
18736 -278028 -371092 -172714 31884 -166809 54727 76668 40354 -176161 141742 107817 -183573
18724 55663 -50377 -116889 -75345 -201150 -121983 44344 -14915 -154521 145309 -359411 -147005
18712 -69644 -122027 25799 96559 -71328 165266 82786 -156367 23207 383518 -158811 -63447
18700 -339007 -303770 -334014 -78972 -38055 148040 -118576 110244 175050 -25236 236573 111281
18688 59417 159351 -298401 23825 -6898 -32795 -73601 17912 14001 -266233 -110247 175247
18676 -381036 -145588 194989 -81818 -229271 -48930 -30789 -40637 71678 888 -229687 -9998
18664 134782 -239090 -17615 -112240 309814 173302 106824 48158 -324256 -89805 -187247 32957
18652 -188626 -101613 -2188 -44920 -378490 -110632 191946 -210453 89193 -126517 -339580
18642 -339580 -252620 -167989 -335672 176922 -219695 47634 -47661 84889 11886 -539903 -612
18630 295388 40361 -196601 -107696 -62482 -182919 -45172 47704 -133206 104339 -96821 70505
18618 181339 178031 -82428 61697 129810 -321261 -169365 -70304 105463 -200983 -29575 -52253
18607 -52253 26427 -277910 -600966 198958 45741 -66330 -386097 63489 111684 -97307 -130583
18596 -130583 -63579 143081 -163493 14160 -154455 -10293 206110 80609 -281166 60592
18585 -8896 -156700 -252688 141591 34561 -146345 355787 -57366 -157984 -388515 -68536 -120946
18574 -120946 -268138 -61710 -226380 -249016 -154590 -118116 -144535 308365 29154 101958 -94081
18562 -85857 -313897 -363128 120756 -108800 313487 38570 -45552 84739 139879 -235907 -165067
18551 -165067 -56485 -42825 -176782 -158930 -514993 -54354 -248813 -34080 249045 -248074
18540 -84022 6091 180317 44437 -171915 279142 -318829 437337 -10189 -61762 22226 238880
18529 238880 114378 184329 -154956 154035 -182592 116969 -77611 -138573 -2174 121023
18518 -74507 -509983 -328326 -51610 -252575 282006 82624 101696 -95772 -306071 -91309 80150
18506 -148259 42815 56775 -2083 309092 117355 -162568 -2693 18762 51224 -14589 -221945
18495 -221945 -109597 -196237 -214585 23799 -236552 58262 -34838 -261644 79526 -301648 -126888
18483 214188 -74343 -131426 112131 -87000 43660 -123204 270055 208720 137060 -284516 -376242
18472 -376242 78050 -474469 88429 283319 -154775 68341 11413 -283859 -309268 65964 -63947
18460 98210 -381269 9360 -222375 -47784 -107948 -76488 101831 -315178 -150822 -126149 -1846
18448 -92594 60046 93585 -131441 -280409 -222002 -93729 36465 14650 199164 169437 87740
18437 87740 18596 -202472 27960 34967 -93961 -146127 -165224 128786 -114886 -163268 169550
18425 80218 49593 203704 -313071 -244382 -190708 -181019 101701 -44720 -169991 -35026 -53126
18414 -53126 -101631 -46347 -138082 -106368 -23830 312333 -199298 75262 61099 144472 -66835
18402 286725 83983 73875 -339054 -198152 -213250 69775 -388747 44972 -215423 -62786 95028
18390 -60069 -100184 119185 -229861 65107 66810 15562 -133421 348146 -190352 9973 -154814
18378 -81301 46004 -83295 59108 57079 -162512 -328122 -87521 -313584 -159578 -110262 -198341
18367 -198341 -154599 149367 20539 136828 -23399 -81889 93986 -333627 60419 -46331 -218233
18356 -218233 -271319 -4992 87543 213638 -88849 189289 7548 -151338 79197 -93955 -344343
18345 -344343 40844 285382 -276652 50038 -224563 -6180 -60787 -222073 -278437 83030 -95864
18333 132465 -107037 -362232 -68133 -264251 -297137 139897 -58524 -17030 -63867 4818 7809
18322 7809 -152596 8807 343678 -203491 -98155 -212814 70870 18563 -292764 -193781 266356
18310 -204453 23754 -129570 34910 -118312 -207271 -2471 -362426 4401 -281116 -76203 153978
18298 -18495 4738 -7589 953 -243362 23880 102892 -146792 235789 10390 -312576 81705 -325145
18285 -83653 -307750 31790 -111354 39236 -135125 -45984 181282 -47734 -122574 102737 219935
18274 219935 79403 134776 76654 26167 38364 -300698 -256810 -34263 -162708 104006 16210
18262 -387332 36856 179243 -124627 163853 241412 -225921 118572 -80223 235035 111042
18251 -89074 138125 -59960 -225636 -232807 34155 -313835 -310157 -66299 101017 -241055 -48272
18239 -106763 -108874 -125326 -129414 180886 -167585 33588 -19219 -15075 -282503 -241643 422658
18227 -83996 141533 229287 22454 10144 -506414 111603 -95339 183304 -445341 -90093 135889
18215 84501 -51154 -161899 -146939 195068 52555 -404556 99930 -53252 105384 88216 243645
18204 243645 35430 24448 11260 -22150 -135380 293213 126647 -61551 -168338 -316065
18194 -316065 61155 -33765 -209574 -9563 -117015 -222933 -37512 107984 -256725 137061
18183 -130792 -86725 -162269 -467 -9032 249053 10615 -96444 -95716 327256 12897 -79505 -150102
18171 -150102 138417 -56196 28841 -234801 -42673 79998 143156 -119173 -214253 517270 -23203
18159 199242 168295 19809 -22863 46033 221585 -157714 53594 190125 117305 68193 -31911
18147 -85866 87663 94788 -199575 -109188 85599 -102801 147596 -224866 78938 -34668 -231169
18136 -231169 -19442 23566 169471 5331 106866 -118577 -355203 -73921 331471 -194254
18125 133181 -168778 -244683 18040 42533 -122553 61738 85018 235567 -108125 133754
18114 -89558 -1461 -177179 243974 -52727 99 104794 -177171 -125135 -20534 -245630 -209672
18103 -209672 -204365 -90283 107972 -44862 -13210 -120506 75774 -231038 -252349 -30812 241914
18091 -141323 -29613 16965 55225 -146019 -51533 -373664 -157654 49537 16670 -108705 -248305
18080 -248305 -135530 -267239 -16241 -86843 -252887 136048 -57595 87541 -245973 -104203
18069 -121283 -127756 127088 -16936 163681 -76902 141090 -105930 -218426 101609 -128622
18058 116053 -37736 -214794 142000 -189337 -105322 -131186 62444 35259 -67786 -105237 -212193
18047 -212193 34118 -208582 -56606 41677 52438 -26416 180064 -185039 394892 104432
18036 -72982 4320 164790 140727 281460 56672 105569 16089 382043 105811 -282933 -130928
18024 -145293 69983 -16101 -317396 -24476 49605 199635 51938 257403 18006 -119602 304597
18012 -177285 -21922 44914 -375254 184448 60742 -56549 72602 66315 110735 156461 -54338
18000 -129406 118912 -31406 -304062 76674 140854 202161 -204420 -96719 -55938 106658 -161604
17988 -162671 222636 401155 -50116 50399 99344 -275826 -162712 -72605 317932 111022
17977 266522 -371710 93057 48720 -66099 -48990 71521 58140 -191447 113112 524 -54274
17965 -61320 -170645 -35250 -161331 -19221 1384 29643 170650 -93263 216599 118481 -254618
17953 265371 167127 2508 -359455 -203273 -95370 319223 110095 -97031 -347322 -88703 176465
17941 50651 105211 740 -31107 248873 -128208 112837 -146178 -24918 301427 119343 -70310
17929 -19353 -448225 116255 -255713 -97891 181182 43036 110608 -111867 232579 3689 33427
17918 33427 -2017 -157248 -146201 243139 -72695 -172863 128576 -126926 -35160 -339494 307554
17906 -38494 -109003 132599 -16811 74312 -23415 108383 144869 -169136 67940 107889 161755
17895 161755 -123507 65453 26286 -56773 -167381 343900 -10902 -57499 102871 154036 148190
17884 148190 97292 109704 30373 217099 57778 239669 -68377 -16593 204058 -106953 73481
17872 67040 224658 -156234 96700 1762 -57626 -89479 106204 -203360 -105701 -132998 196572
17860 60703 -121915 194242 -301818 -95896 67498 83735 -38493 61993 -124107 -249496 150953
17848 207832 -112873 68413 335 -214846 -33613 -181492 -88911 -253584 -14700 -175494 264701
17836 -90951 82379 171671 -166870 13599 -75484 -138058 280492 -379977 200410 169473 -53271
17824 223242 135631 -18705 76059 26815 11181 378885 372913 7623 490314 -46259 -47675 271014
17811 -14680 -125002 -135902 -72647 -249092 -51912 126915 -146023 -152643 154657 118552 -87911
17799 90804 134135 72822 231008 -151281 -61340 -150419 -18447 119418 160505 185738 -124326
17787 49708 -113882 -391835 182297 168630 98765 240267 202811 79036 -486097 -146289
17776 -51419 -127522 -283742 184813 17469 199277 88563 301929 20887 -14537 -247690 -116184
17764 -48546 191696 24001 135524 74198 295946 -24490 -49069 385976 -366952 -284340 70218
17752 -382000 13379 -13138 -191334 -320135 188691 246848 -275708 31936 92106 -81429 -305718
17741 -305718 -46936 -183099 134151 119899 169157 -103902 -15384 -19947 -197095 -196000 -146308
17730 -146308 129673 151317 -203079 13803 126569 -124279 -332064 200385 154709 134974
17720 134974 -133727 39729 338066 28382 668 268124 -168623 -261939 -50072 88154 -217492
17708 89705 101931 -100102 36420 -167792 -18444 -66200 208728 83719 13668 51580 -285896
17696 43667 151721 76608 109655 101660 42272 275732 303888 14995 25657 13850 -244983
17684 -30483 201538 -9701 -5353 100613 -53780 28037 229009 5254 -431613 -157939 2321
17672 -172081 -2422 -27282 97840 -124244 170214 384793 -72548 -154570 47768 243970 -136835
17660 -158594 11462 -133282 113429 -245425 92567 23922 23900 25863 -9274 40765 -270543 269354
17647 342600 436857 -127054 -48952 -55415 94152 103362 -231832 184808 -43061 -10698 -35726
17636 -35726 77580 -107493 -123814 -271737 197411 155569 75103 -497832 -193575 -207142 232265
17624 -197260 167275 151327 31260 15431 -102219 144329 22959 56608 189776 89341 -74795
17612 288855 232881 -16648 -323103 138703 68727 -22054 96335 137478 6942 157545 -89283
17600 -135180 36277 3750 130766 84204 67805 55998 335651 41681 -40439 132175 76556
17589 76556 -55328 43683 169258 146794 -205256 36750 -206483 85830 86697 -114295 -113132
17578 -113132 -305575 122048 121642 -215698 -6110 -10772 81444 68236 241154 -46838 121583
17566 -7610 -75447 180964 238033 -5404 102195 124926 172096 -79844 -32712 18731 290993
17555 290993 77285 326550 -273428 -47896 -99077 133767 -45728 -228461 -127482 85181
17544 226268 195804 95075 -23284 325509 346527 167355 27529 260395 328993 106328 -83972
17532 112366 155265 59155 -33640 -77337 305664 -180482 17380 42039 -320204 120662 276530
17521 276530 264886 149285 48644 328416 188488 -10957 155308 109932 118218 236603 -74878
17509 324449 828 103908 205791 135624 -67673 -18112 375 871 1260 488695 64523 -7739 16882
17495 190825 140862 -21404 188714 234955 162334 25618 128510 9923 -218992 340810 74146
17483 163735 187024 17169 291760 164230 -224760 573623 280216 120566 -20147 57924
17472 273323 724538 178293 -133596 -127619 81166 320152 42605 -35663 30594 -41074 -63272
17461 -63272 403226 375734 61858 94598 184313 196461 438116 155395 -40085 112540 52976
17449 163693 504703 734223 416070 116174 -62433 385481 24108 26983 422261 213385
17439 213385 -118603 95075 340466 138280 132869 380246 11682 256755 181490 275951 229339
17428 229339 -199794 95662 62114 -120819 263301 -53455 587312 205311 112388 475370
17418 475370 328677 384694 450150 315619 85982 370115 185479 152914 -137889 36506
17407 47623 64890 52106 -183641 -91902 -144553 -147942 205050 354750 307003 383933 -61600
17395 158824 25892 411258 -140899 -34373 152810 -47792 370078 443110 118662 175199
17385 175199 229137 219990 8819 248403 -132065 -75417 156908 33912 235078 225296 -133498
17373 -8548 541368 11620 136318 -50924 61959 92941 145706 135881 58076 75144 8452 101149
17361 101149 247222 17801 -23177 276290 54942 192732 209823 -116861 103424 -42383
17350 359699 -18314 189641 97372 51783 293597 181728 94615 326246 179354 -76292
17339 123364 198833 329384 -15725 216893 146807 281864 119140 428161 70639 398489
17329 398489 165731 36954 198478 198946 58844 182591 31885 160399 288531 539486 -58544
17317 132132 48941 361580 167856 264818 193447 32415 213723 325367 -5999 230051 127970
17306 127970 153246 -78929 691 313995 57968 92904 475478 15370 184247 179141 16399
17294 32353 274311 87363 63370 207035 34555 154277 160689 269255 213140 474226 234564
17282 160304 86365 255967 48478 199581 252069 185235 -47171 252939 45325 558154 -256921
17270 226842 -191919 207333 506439 -243044 421551 121097 -77855 -46501 352268 168642
17259 38163 527647 190102 130292 253651 351527 440905 286331 -99035 51900 444475 499862
17248 499862 -82436 -20686 201735 263356 -44010 67154 217536 205584 113584 -10002 38495
17236 218613 270285 106218 100129 447254 494295 547853 527827 362445 245155 276933 110600
17224 113468 154141 557848 355993 255561 332244 329202 97553 271003 124478 203679 152340
17213 152340 -20426 129034 406217 224650 252124 -98056 85620 -47796 338427 352510 238029
17202 238029 214307 298608 151447 302163 137009 484818 174111 359727 516742 58346
17191 -137005 135589 87255 766558 208514 128435 -6295 229931 360249 375037 271042
17181 271042 436418 379183 3769 322994 109450 357885 544542 285209 520782 320098
17171 320098 299533 68514 350952 98919 258832 260587 220542 150236 305022 469028 79906
17159 61171 234175 199834 301518 916139 159060 287583 458645 163971 282074 243363
17149 243363 53680 174104 412600 252763 344911 167764 63524 245035 277414 -138877
17138 581898 17244 689658 305191 197263 450287 190927 134010 481239 -23795 313065
17127 504754 334234 318772 314328 155688 424130 194757 495295 430619 474617 211787
17116 -28291 503794 307487 596166 314533 169393 365969 361743 258457 604432 164875
17105 633670 486323 235350 224447 546135 150298 615890 512020 678204 368780 284179
17095 284179 518117 270450 144568 414969 534671 404038 352797 20529 433458 491292
17085 491292 567848 441533 412095 620362 92189 342113 406036 438566 315736 543694
17075 543694 455678 509296 250126 540402 338554 451872 -20031 365664 150041 803031
17065 803031 400695 444996 756680 844414 394160 647664 457049 533538 141304 368837
17055 368837 329348 665224 870764 607424 650663 545877 361804 590267 545627 404926
17045 404926 439607 354498 673244 449945 553719 440725 163884 549571 333350 626008
17035 626008 424604 203641 742980 331882 537173 498687 475417 640328 340280 375874
17025 375874 625889 675507 780954 710221 581160 250570 723364 841464 414721 344290
17015 344290 677282 363360 553357 740175 831747 851499 654550 674333 882172 375754
17004 504392 900882 731233 818586 456241 767480 624578 652466 436823 897036 703531
16994 703531 688261 1085372 941611 810558 778935 1193558 1144053 442371 669701 853393
16984 853393 694610 780685 804251 480216 787361 1032412 818144 1030805 713394 832987
16974 832987 619832 614616 834959 789738 931268 795612 1081405 632607 990331 882669
16964 882669 1103170 1151008 1122232 812885 740093 855285 907992 1250957 721420 839067
16954 839067 916496 1072004 938927 729484 1112338 1293434 1078160 980720 1177986 917286
16944 917286 1177709 1209888 1048907 1310422 1069974 1182850 1035937 1358063 1239190 1316053
16934 1316053 1352508 1077449 1076140 1041112 1418611 1146998 1380810 1216280 1640038 986382
16924 986382 1497211 1297921 1309412 1401172 1819127 1313416 1738363 1400658 1494821 1525188
16914 1525188 1710918 1792621 1777499 1698014 1525696 1628608 1691766 1887202 1540176 1393068
16904 1393068 1548818 1818119 1501877 2086397 1659562 1919442 1666176 1861041 1665514
16895 1665514 1713114 2002594 2020499 1439481 1780576 1667591 1923839 1946575 1994607 1917631
16885 1917631 2089787 2254837 1864981 2427611 2238157 1870746 1995992 2604760 2293968
16876 2293968 2237032 2204177 2098507 2465845 2252367 2546264 2213294 2393900 2335881 2418160
16866 2418160 2697798 2528714 2682284 2769574 2764539 2895510 2813370 2742761 2887569 2911328
16856 2911328 2867148 2725594 2954399 2926882 3390188 3343046 3149152 3285565 3384345 3389469
16846 3389469 3172723 3276365 3695081 3671517 3634520 3746702 3490337 4085948 3966243 3459272
16836 3459272 3968112 3944971 4223528 4517304 4376053 4507122 4364051 4413941 4567970 4802671
16826 4802671 4556621 5009330 5055750 5043733 5082882 4890457 5311099 5315977 5531937 5528802 5479785
16815 5479785 6280863 5806835 5874569 6354963 6089598 6602052 6827963 6936357 6797627 7028540
16805 7028540 7310066 7437538 7383734 7429327 7763713 7932139 8544835 8131526 8567234 8702568
16795 8702568 9156078 8875613 9583796 9639504 9923382 10367188 10384612 10523536 11085163 11227493
16785 11227493 11735703 11842297 11907765 12634103 13046762 13327035 13767008 14295059 14610992
16776 14610992 15050096 15526869 16126983 16514834 16973119 17555018 18337410 18936641 19378195
16767 19378195 20087773 20524910 21392026 22499809 23376825 23951087 24840726 25971254 26605568
16758 26605568 28265636 29409541 30659525 32153330 33443280 34711867 36046869 37907328
16750 37907328 39833201 41527981 43719751 45730258 48117994 50923481 53459995 56018772
16742 56018772 58839403 62262199 65813361 69441855 73222665 77540750 82259201 87394142
16734 87394142 92308472 98005888 103767280 109997803 116618705 123763983 130776557 138485613
16726 138485613 146110855 153725333 161527400 169417685 176180493 183347508 189302809 194068739
16718 194068739 198349954 201079765 202117261 202097282 200253439 197395453 193074964 187565491
16710 187565491 181153857 173845580 166144079 158307904 150032206 142072793 133985472 126454241
16702 126454241 118976062 111809690 104934764 98293698 92468844 86738733 82075376 76995594
16694 76995594 72560319 68103062 64380141 60653030 57196421 53965538 51260692 48611926
16686 48611926 46103419 43459302 41536382 39316502 37359490 35727674 33984752 32588743
16678 32588743 31134680 29545813 28133886 27246784 25755017 24860242 23888725 22763519
16670 22763519 21977730 21111460 20173838 19849346 18679725 18060246 17872733 16966761 16421955
16661 16421955 15782246 15237728 14844403 14315153 13319534 13114079 12858460 12405947 12244183
16652 12244183 11822016 11452204 11158564 11108049 10382210 10310934 10116043 9233892 9351683 9038012
16642 9038012 8760574 8392342 8337476 8100871 7826686 7675311 7614615 6930413 6974283 7132205
16632 7132205 6596737 6573529 6361983 6365366 6153492 6102884 5903852 5889666 5862306 5794079 5298843
16621 5298843 5585739 5337459 5136173 4868554 4899022 4982426 4917752 4303069 4216128 4703294
16611 4703294 4406746 4252498 4236530 4071030 4278165 3586748 4046369 3737178 3774746 3571329
16601 3571329 3183549 3285610 3469224 3469639 3317690 3531153 3224765 2993451 3124177 3385284
16591 3385284 2963765 3094707 2992903 2901021 2736448 2950545 3022925 2540312 2731321 2899353
16581 2899353 2608314 2305959 2570155 2427314 2068125 2538388 2197072 2278921 2255579 2071871
16571 2071871 2384025 1851734 2345981 2164545 2509149 2363335 1869965 2260587 2083948
16562 2083948 2090452 2037715 1712259 1526979 1755902 1786079 1896880 2002825 1734451 1786213
16552 1786213 1402672 1719965 1725099 1554635 1534973 1568537 1561842 1543606 1533591 1662031 1523284
16541 1523284 1376629 1320316 1285973 1324384 1618626 1187496 1312897 1294198 1318260 1362842
16531 1362842 1254564 1215342 969371 965714 1286790 1237088 991844 1098809 1121820 1280130
16521 1280130 1353741 1145058 1091014 1239425 1245915 1168468 1091805 762551 730327 769774 1186126
16510 1186126 852649 1142878 970003 993447 926771 954844 954353 793891 1089216 835627
16500 835627 1182522 764519 680235 749669 582222 1185210 790524 632576 893117 755460
16490 755460 950532 726037 749713 803193 953244 648345 539484 771255 739789 667300
16480 667300 566582 1074029 845459 641131 771181 1005070 684087 1292059 666799 306989
16469 620327 653859 591030 279662 629896 485208 537635 567532 542905 688638 985823
16459 985823 518620 448655 575903 495806 654235 1119583 329645 629623 764600 891980
16449 891980 447251 378640 496419 548355 649826 591677 389809 725408 367836 592995
16439 592995 308499 319985 317893 518202 444372 742877 478486 565616 321065 212738
16429 212738 369836 744393 451590 611874 363121 384159 549122 323507 244826 433097
16419 433097 400194 341867 691540 576578 474544 138516 421676 315202 271013 246052
16409 246052 439268 470964 541086 18922 483318 -87243 553845 99845 303937 353573 121693
16397 614094 83414 453689 226595 676324 563602 559936 644716 597719 345209 302515 663509
16386 663509 395087 339897 358759 562366 111768 299956 220470 385359 371561 20486
16375 60685 477644 295558 352960 202397 306036 236796 485664 338845 331943 22119 350553
16364 350553 191355 332895 226419 434810 466173 260679 544839 167182 120425 194121
16354 194121 511128 37953 221495 143072 293375 128302 359077 266993 298184 392858
16344 392858 210335 655001 544708 249305 96026 486506 182978 140026 242481 138285
16334 138285 -16234 307871 252514 54621 150240 192982 460365 319034 133617 255070
16324 255070 353672 190919 250176 97305 338339 77623 76900 188230 -58112 105985 92791
16313 92791 434573 50089 183071 260372 228659 261692 202752 -322389 288350 286780 -62192
16301 362610 286400 261142 342089 237375 -267096 -128103 271941 206739 -136697 576840
16290 109161 413328 270510 375816 222334 -195297 166513 145548 238274 234680 118632
16280 118632 66328 53299 42043 301381 -225921 198229 153818 342889 -136779 -34182
16269 28926 79197 101332 117486 277973 155254 59750 27999 300065 -327609 79468 333927
16258 333927 10442 72692 -163985 324526 109152 213433 672397 79096 -34437 285597
16247 -212692 291767 -292911 8568 242345 -143812 222047 384303 322103 82886 317626
16237 317626 -212381 -9574 70896 -79535 -42576 375973 179942 142945 135835 57537 -32578
16225 78063 76206 97525 315190 -79247 15764 311143 387940 -88201 -228728 6512 -37818
16213 66552 141290 125469 70564 114046 83800 -83683 99300 -32436 -50577 -177373 -200241
16202 -200241 -12182 183358 231093 86614 118628 379355 235409 -118038 108869 85441
16192 85441 117370 -500968 58716 75911 242738 154675 -51635 85544 53169 315206 -59926
16180 354103 -103111 120477 -159966 98667 177716 319508 435634 -52099 -2662 376022
16169 17090 365445 -53006 -185189 -68563 -78220 -185827 68893 87895 -233464 136443 89651
16158 89651 38880 -126737 160581 339608 163445 -230625 -477301 -6900 180176 -208211
16147 -52507 179408 -271750 291119 341882 76752 -17018 109871 348255 55807 -413000
16136 78667 -175036 -40727 -136165 -63446 170384 -135340 -39755 -147382 -29038 -20516 86890
16124 351158 90888 -60280 -157071 8610 -49885 -19389 76977 -41489 -189540 -35111 -150412
16113 -150412 108301 36876 264647 187665 147536 219907 -51335 159100 88953 -120585 -113257
16102 -113257 33947 257678 112780 145529 -189118 -4003 29115 84680 228802 -343983 -42713
16090 -106954 49948 -92202 167477 -313535 -143103 -120800 -29443 -260371 116517 41650
16079 -187208 -378485 -271185 -88419 357979 -55193 -76004 -276194 301157 177749 -107204
16068 27722 -186764 -289161 14487 48614 -95842 113093 341761 154137 -116048 118549
16057 -206714 134924 -296785 154652 -30932 5568 -144520 140368 -79352 -41502 -32027 -105854
16046 -105854 42298 -185235 8034 73424 151635 -94208 -78817 -23554 -206364 175669 -74066
16034 66290 -68180 -49593 -89877 -122580 44663 -42025 -118 -29078 298617 31854 -50211 -36415
16022 -36415 49271 24084 -137744 347479 128985 106734 86029 -270144 -28505 -39118 169532
16010 -199884 119939 137063 -105387 64713 -367689 216888 -81300 -160055 -121504 -36442 -142604
15999 -142604 -264805 -116860 -53914 -180116 -308630 -177197 -46895 -84816 320805 -238585
15988 148865 228967 -164165 150156 226575 235970 -52936 172666 571045 245447 47486 46007
15977 46007 188928 220300 -94320 132785 -296237 -580044 204027 9495 383490 129647
15966 -229444 -197198 16123 223056 118890 -278757 -51832 -178936 84178 46338 115946 -216810
15954 40201 -65012 152058 -254373 258501 -131656 -106602 170839 198923 -38103 -6415 5851
15942 -11707 37840 -132318 122201 -8221 23283 -386928 -46156 -272943 -312684 94706 -438495
15930 -108380 -347841 -233904 18596 -101765 -79902 -30100 2630 -27367 12215 153096 -55212
15918 -172344 132313 38073 200482 -19866 -15255 -49515 -58527 64538 246090 198069 -13762
15906 -159854 -74440 51412 -376050 -79146 -119401 -115949 -66244 145176 -132928 -39753 -239619
15895 -239619 -94848 65585 -52831 -206029 -177202 -81318 65678 -37904 -124176 -60752 116284
15883 -37643 -240519 -60041 -107026 122288 -281621 153304 19455 -149190 -307232 -436194
15873 -436194 53419 15457 -43954 124005 167235 -295889 -109644 -71022 -77619 -40772 -185935
15862 -185935 -476446 -156500 -280950 -66140 37455 -120886 246207 192749 -303688 157875
15851 -371618 140641 214859 115389 99677 -237221 209787 48852 -77440 51013 284893 79759
15839 -282286 -16063 -50788 59650 -145727 105364 -35954 129328 -89415 154426 -20186 -265011
15828 -265011 339924 -165519 69632 109656 -4200 -74665 14260 -210084 -400632 -242755 58317
15816 -252529 -90567 56618 -152981 -51646 -125853 -149398 -113544 -238540 -135634 53990 -417424
15804 -178573 90717 -99367 -9060 -36850 46775 16673 -233310 -290511 294840 17792 96454
15793 96454 24498 120867 143261 -395836 36386 -93803 -231431 94899 -178933 -65979 -118403
15782 -118403 216490 -246020 108205 193005 -195553 -195879 -143421 -65639 -187841 -143328 -135444
15771 -135444 -406072 112778 23451 -103417 268576 -130351 -466690 -280415 45961 -263882
15760 -181006 81782 -88212 98965 119967 -143364 -20857 102868 -34090 99187 2071 115757
15749 115757 -25978 -116778 141641 84299 -259913 -61477 -384714 -184542 -363464 120301
15738 39778 222425 -153903 -75606 84762 198013 127709 -80713 -195368 292110 167513
15728 167513 120782 50143 -96675 -49612 -80592 -232163 22093 -333142 -178194 291078 -112684
15716 -365694 -52261 -216616 26392 -289539 -29360 271601 -255217 -119912 5931 276074
15706 276074 -187605 -276226 122262 155552 -290524 147393 102106 -218465 -134586 -347162
15696 -347162 63174 275021 -92004 -120580 -106671 84552 46263 214982 130213 -200805 -100376
15684 -261027 60853 -62887 -38287 45154 166763 254022 -36179 -36449 -69802 33449 -17094 -101722
15672 -101722 -151965 -103842 127621 -72423 -204448 -43604 96978 -134091 -89985 20133 155658
15661 155658 -105694 26534 -189133 -164561 356555 26274 -78477 -15537 -277546 299545
15650 53531 -67475 -409855 -180686 80138 -278038 179815 321615 20275 315380 12594
15639 -133014 59245 14068 217268 149998 -148436 105361 -140394 -205128 -348994 -104871
15628 -118725 -256662 62730 -99461 36743 -91956 175009 -72021 63418 164783 153002 124415
15617 124415 -281502 -89614 -88236 -81222 -239693 52177 -222080 93950 -250422 -172661 -214350
15606 -214350 86667 -117577 214128 43561 -215508 -240575 195606 -45955 -103450 -141111 -3657
15594 -73985 -78670 -14899 103776 -48464 -120765 113580 237636 222530 97056 16536 -182762
15582 232933 -74632 -212837 -167683 -93387 -60289 152785 47960 -106392 31937 -147464 151304
15570 1105 349708 86683 40843 -127187 257045 -93196 47961 -142407 115017 81705 160575
15559 160575 291959 -23493 -80867 279402 108422 102556 -214597 268258 -210324 77947
15548 118671 -153092 -203707 -66711 -45194 -337662 11916 -417663 398791 -239535 173918
15537 -69561 240941 23437 7054 -314500 -213926 -91050 -41570 -165732 76094 -72681 97873
15525 -77476 -31953 153529 163350 270972 148759 267296 -190949 45516 254563 90825 92487
15514 92487 83479 342346 -74533 296544 149870 105921 -414923 -115895 -283999 -175792
15504 -175792 311851 49076 164650 117039 -24062 -81737 -57286 -42095 -563001 -34634 -138662
15493 -138662 -324715 227507 -195032 -53407 -210995 -29495 -163358 99714 -8262 -27031 -304827
15482 -304827 226157 137593 -194880 157261 -222165 48316 11254 150073 -311193 -99570
15471 75933 181281 -26412 -167550 -206633 -203666 -141174 -9486 112382 133403 -186907 -1267
15459 -6449 -140942 -137666 17610 -109900 40353 -342859 21480 176782 41976 131045 98615
15448 98615 -126764 554172 234822 114767 -57632 -192980 141649 28465 -7483 -96858 -42716
15436 14722 1061 -155768 178258 -94065 325945 -352418 -363794 -185497 -33928 39648 -122139
15424 75696 8075 -227962 71892 -379475 9919 50999 -173473 -101807 20575 -102024 38837
15412 103048 -130430 -124654 36481 -206105 91733 -51500 -379021 -470127 325698 135513 -17272
15400 92072 59625 -162868 -203873 38537 26136 -205629 204069 214099 183153 -38356 99271
15388 -118750 35992 -128708 -30107 175008 -139903 106024 69915 217765 351127 182202
15378 182202 3734 28485 -168140 -131433 -203882 -9691 230926 139568 26190 393845 272419
15367 272419 -132552 -17267 108860 -28450 -33994 -95167 -79035 -148998 188067 -138996 230842
15355 -186908 -3439 195499 -45213 256902 116086 -130090 119147 -184078 -83344 147392
15344 104422 59834 -132862 40301 124223 27370 -15025 182533 -62926 367550 -82311 -41954
15333 -41954 87721 174114 184927 -165768 -6843 93122 122821 36880 95024 131640 -41868 320498
15320 -275127 -562907 -45083 -280961 366627 -81333 308078 267516 100662 36775 186175
15310 186175 93307 -199835 -67817 13141 207190 262864 97188 152620 -103340 -83456 68064
15298 305172 -33721 -102466 145194 -56813 -109629 115664 -60242 282400 -68377 217530 185091
15287 185091 329613 350698 -135028 204039 -94819 80838 -41940 -1643 -38041 -328124 156773
15275 136558 239428 -205203 113023 -179629 159071 287535 -13144 535790 31682 236282
15265 236282 263382 90864 178398 200738 84521 195211 90437 -141331 -167257 -129753 385146
15253 165604 -80577 -175627 301154 367394 951771 1597445 974953 1199429 1175934 413978
15242 8501 -56793 223686 202561 4600 32691 9679 17986 -73939 136135 33071 -16158 -305400
15230 -305400 62533 -52786 -33838 151486 222234 406087 13864 169441 3495 -95386 74901
15218 -209822 -276992 185051 43157 42915 -15000 -143522 333227 -243899 267671 -252964 -598
15206 134396 -50179 223718 -107871 221040 286659 -234122 373809 411575 210367 -4381
15195 -187469 -195005 192897 50450 120033 206407 87570 -133866 33584 -206824 -1456 259471
15183 -25729 316918 21745 168376 -24570 473732 -47040 306528 83778 136257 -302400 59129
15171 -328 -207252 186196 235582 268700 125629 95336 154497 129319 -87844 102980 313901
15160 313901 74275 210621 -252949 -77769 7141 323733 106551 33192 -260731 123670
15149 126245 389621 514979 -65925 47878 -94087 124529 193038 232302 163746 214498 17292
15137 29209 105755 41419 292372 119500 168696 65211 -240261 108465 127618 217214 66831
15125 163561 327035 248912 439402 30609 244859 292824 376486 77298 -19433 -29569 264710
15113 266976 78968 -258232 127861 64863 -154853 198461 318284 32602 211957 107172
15103 107172 135899 -81311 207639 295849 255380 107291 197434 -30124 166526 8260 187728
15092 187728 103710 311582 -27081 190005 225650 131330 -97894 437961 -80526 164762 8113
15080 158711 111253 204348 32537 146006 288884 -112171 298724 266550 285793 109802
15069 281119 101309 204850 -207202 272386 -103526 241811 179741 20738 314258 78128
15058 244928 220121 293065 675150 -199096 250212 151212 68979 123195 91463 376125 116389
15046 -23244 223265 458556 97769 140753 297582 193691 145278 336871 370425 244236
15036 244236 56700 155091 214341 -6545 228436 138326 -53059 167496 240192 191739 -6189
15024 388002 158081 107898 136235 57119 256021 73432 163457 264701 122605 302431
15014 302431 335191 92957 -32934 90194 111088 98382 86663 271695 149439 73662 -124157
15002 -186967 27765 85976 -37010 468730 393288 259546 474249 13705 43571 173465 344220
14991 344220 371339 410748 345453 520540 123138 66250 -39854 407150 233275 219977 408489
14980 408489 246303 452693 133657 307984 8509 296725 -12341 384938 262225 -37559
14969 132993 176707 331844 335482 589683 -62919 133514 276789 528501 210243 173188
14959 173188 212087 335679 -47372 624627 411878 175968 203369 19198 483266 436180
14949 436180 398828 260483 78580 362476 8460 505557 373876 196933 221953 379878
14939 379878 273332 161909 108865 78094 280398 108725 499262 110895 395447 318383
14929 318383 159661 124999 551881 88199 119316 174944 322234 232497 478993 489987 374092
14918 374092 389813 263868 -86411 568177 294902 274244 165222 654247 364249 64546
14907 520235 342215 223123 496143 532360 315144 103850 260936 304259 388381 319502
14897 319502 310283 473773 120753 528904 372317 185612 232387 397758 457109 204869
14886 354959 412452 487063 528671 370603 635869 678605 429925 540439 359459 341598
14876 341598 295026 179360 240298 298046 360780 339184 444619 340078 679894 642967 260919
14864 695612 284778 654859 544541 436607 460923 181777 463676 444501 388459 482600
14854 482600 547506 560076 244449 416703 247863 397119 273306 690369 566588 337400
14844 337400 503780 562113 71348 216339 283776 500665 357299 448635 281660 341007
14834 341007 382310 782893 457610 201485 480076 640293 224526 683558 685150 694234
14824 694234 68173 448163 181484 484457 196193 331074 470594 661708 482132 653729
14814 653729 590694 535207 675371 884032 567578 530925 157077 487035 405834 760493
14804 760493 599880 558688 416176 282842 689183 893531 461142 479049 335253 427256
14794 427256 533439 325167 513473 546929 473422 951708 535784 679229 560072 331661
14784 331661 445215 409500 617146 447904 712583 664081 593614 602340 1104512 493449
14773 693312 835349 372389 512677 825395 515642 811492 356457 728993 539356 408591
14763 408591 582584 1047117 908873 452639 654965 509450 774123 747289 825703 649444
14753 649444 785259 404447 730252 642519 946689 951090 715517 1025561 434885 806829
14743 806829 1013301 902365 523143 716058 946995 688810 701362 873150 619512 487009
14733 487009 794174 943109 325145 658374 761328 743344 710591 771243 930609 708074
14723 708074 622767 1149150 657783 939378 870622 820060 1138485 977893 1096624 815113
14713 815113 1128503 1032069 1021121 834755 957680 892802 827537 791310 921181 866972 1123061
14702 1123061 1079018 880418 1319236 1169998 817593 1008999 1011774 757228 953648 1066890
14692 1066890 942261 707911 1020922 952167 1082194 818929 925207 969215 1059883 1016080
14682 1016080 1009024 907411 911728 820025 907399 1253809 1123368 1260082 1227300 1137769 976744
14671 976744 923375 1099988 864767 894693 962848 835955 1286076 1135046 1081383 1527638
14661 1527638 1181639 909607 1138100 1253712 1126158 1400190 1183878 1304753 1426866
14652 1426866 1200651 1422801 797075 1093090 1138387 1482720 1321103 1291115 1349807 1397296
14642 1397296 1146735 1598236 1409324 1461696 1144123 1352256 1289246 1315951 1164895 1441647
14632 1441647 1561596 1311806 1467929 1740751 1752684 1370445 1742933 1192699 1756186 1081496
14622 1081496 1543442 1422144 1372538 1488334 1590181 1645356 1475162 1670938 1496532 2043700
14612 2043700 1496696 1455527 1610122 1655555 1546829 1801607 1577601 1572319 1893418 1721174
14602 1721174 1808215 1733700 1512515 1713462 1816910 2066748 2090228 2095309 1949576 2051534
14592 2051534 1965211 1993807 1737014 1887360 1961982 1938248 1986854 1618646 2078550 2141261
14582 2141261 1994611 2118690 2224044 2143341 2091325 2222737 2371280 2399573 2243403 2468836
14572 2468836 2374362 2173840 2718590 2662777 2611409 2638008 2707418 2795894 2542147 2563822 2346334
14561 2346334 2976832 3031044 2908682 3183013 3164055 3286621 3511768 3646538 4130772 4897652
14551 4897652 4955926 5999440 7551547 10934410 18924937 38237852 49520037 23621927
14542 8752345 4224271 3245851 2558214 2490786 2069330 2071271 1872601 2140401 2548656 2330603
14532 2330603 2404270 2327925 2144557 2272932 2254530 2721238 2615882 2113584 2793788 2604996
14522 2604996 2753777 2698733 2607505 2851285 2682151 2636205 2844618 2592751 2756408 2834233
14512 2834233 2785790 3195090 3200435 2938413 3075208 2733313 3289274 2808294 3029744 3190419
14502 3190419 3405222 3430213 3219036 3343682 3082923 3285142 3122768 3378777 3603092 3599962
14492 3599962 3491123 3651766 3767699 3769287 3635424 4252672 4061364 3928738 3846179 4109659
14482 4109659 3868243 4102039 4410352 4443486 4292599 4365379 4685369 4467637 4424576 4751429
14472 4751429 4403059 4732479 4816823 4601676 4622990 4863446 4934770 4805964 4859678 5338358
14462 5338358 5081733 5349777 5163343 5357921 5247918 5200134 5276056 5347711 5501455 5980712
14452 5980712 5530386 5546540 5410276 5637858 6303092 6201867 6382890 6274026 6040405 6248650
14442 6248650 6468772 6670703 6712073 6745923 7115398 6825875 6763892 7138936 7148113 7018244
14432 7018244 7321767 7250626 7348013 7563002 7376203 7627887 7553480 7925282 8042553 8003534
14422 8003534 7969083 8333519 8270656 8577351 8699650 9023271 8947776 8896560 9287261 9049117
14412 9049117 9756326 9534667 9819048 10017450 10101679 10294769 10533448 10612821 10845608 10883121
14402 10883121 10655397 11267500 11230505 11453582 11764300 12204413 12318922 12306509 12267810 12771182
14392 12771182 13207297 13308419 13614471 13752820 13785024 14252938 14236881 14610343 14884844 15349437
14382 15349437 15481480 15982260 16082347 16407661 16525222 16694429 17117765 17293756 17640095
14373 17640095 18245134 18143134 18593274 19394157 19841727 19844268 20343309 20922357 21475731 21733760
14363 21733760 22236329 22535764 23091057 23816844 24175372 24477694 25007369 26007800 26256108
14354 26256108 26858140 27649505 27999995 29150460 29771799 30154299 30639497 31936986 32753324
14345 32753324 33653951 34520508 35219712 36330109 36977462 38074761 39175768 39880449 41388135
14336 41388135 42183319 43631650 45046750 46546729 47810000 48929976 50432531 52230943
14328 52230943 53806951 55287383 56998565 59011808 60920700 62806500 64802392 67116369
14320 67116369 69393629 72121308 74752257 77263689 80092647 83184748 86104571 89431247
14312 89431247 93235905 96710727 100458415 104452768 108607241 113089389 117810093 122714825
14304 122714825 127859342 133535928 139378486 145697847 152398749 158924697 166335824 174259115
14296 174259115 182354335 190896195 200003550 209500503 219304480 230023695 241199907 252537943
14288 252537943 264968108 277341036 290255998 303410345 317512240 331646976 345935658
14281 345935658 360426493 374771585 389010461 402764461 415965533 428256194 439558407
14274 439558407 449356929 457765870 463359137 465825853 466664977 465472242 463544424 460017378
14266 460017378 453379133 445637808 435581342 423673040 410222122 395982945 380835401
14259 380835401 365191135 349581808 333965059 318461614 304355181 290107656 276052885
14252 276052885 262708717 249706026 237512592 225862253 214650153 204477470 194359189
14245 194359189 185310878 177076552 168386028 160348528 152793838 146177802 139313448 133694876
14237 133694876 128032896 121978056 116880755 111833195 107476757 102947400 99339183 95123297
14229 95123297 91625569 87979386 84285544 81309229 78184955 75331780 72885841 70000033
14221 70000033 67971357 65539369 63553543 61089679 59389716 57001402 55348784 54011988
14213 54011988 52270503 50616778 48722155 47231264 45748788 44940811 44145513 42736212
14205 42736212 41310544 39946523 38878130 37956041 36829867 36746631 35020542 34037388 33292366
14196 33292366 32414192 31666412 30834890 30169415 29336372 28956567 27635060 27307355 26706211
14187 26706211 26067456 25361718 24794292 23978670 23849864 23134460 22711682 22472679 21894743
14178 21894743 21267469 20842383 20605121 19832207 19554913 19254213 18441965 18510174 17843036
14169 17843036 17740779 17690699 17085436 16517442 16750735 16357688 15796517 15414256 15632502
14160 15632502 15044062 14843500 14469890 14144268 14054724 13922714 13561970 13412403 13228293
14151 13228293 12756822 12463479 12527772 12346560 12333412 11884034 11995778 11515895 11266294 11256765
14141 11256765 11025324 10894614 10887123 10749365 10496487 10207302 9850295 9800587 9812104 9481878
14131 9481878 9645951 9140006 9452317 9107201 8835685 9023208 8599000 8585731 8362746 8307381
14121 8307381 8324640 8007898 8373351 8107307 7920056 7669077 7770408 7882795 7794726 7400759
14111 7400759 7492502 7194588 7319142 6921912 6859312 6885687 6813307 6294944 6273467 6845346
14101 6845346 6537806 6499011 6350412 6404656 5904589 5954770 5908643 5822764 5735239 5700111 5871092
14090 5871092 5700826 5754276 5338104 5717966 5471432 5299367 5088838 5437022 5180623 5490031
14080 5490031 5036663 5051319 5158697 4936611 4926447 4783393 4732370 4846073 4663534 4689483
14070 4689483 4704543 4375878 4562698 4690957 4489785 4227748 4039783 4497633 3984396 4261754
14060 4261754 4382670 4244271 4254312 4355945 4140555 4017100 4002068 4032881 3803759 3705240
14050 3705240 3618322 3610455 3923556 4000216 3450981 3727700 3578266 3692371 3199008 3442365
14040 3442365 3231381 3394679 3157360 3274602 3546729 3247764 3326523 3418178 3420635 3498045
14030 3498045 3148661 3139383 3017852 3090886 3060124 2762502 2814177 3073611 3055355 2669945
14020 2669945 2567743 2720115 2775036 2377555 2699364 2699191 2711794 2687734 2684996 2507742 2797413
14009 2797413 2477408 2690697 2553778 2567312 2293239 2235707 2632034 2156982 2223707 2373715
13999 2373715 2373027 2143476 2096906 2312380 2535999 2130535 2323571 2405162 2838582 2911564
13989 2911564 4104025 5933355 11722191 30048151 49327424 27540578 13632250 8705992
13981 8705992 6070730 4740733 4303035 3475830 3424519 3219250 3352190 2799396 2581578
13972 2581578 2299135 2815175 2369241 2654755 2329537 2412864 2499628 2663755 2389012 2279214
13962 2279214 2009534 2248669 1859253 1796259 2264618 2153412 2120064 2355756 1995670 1957307
13952 1957307 1872615 1958018 1660068 1739493 1962806 1631177 1895591 1845250 2170363 1636098
13942 1636098 1710575 1827029 2125762 1732297 1850496 1906372 1887531 1871339 1765097 1886428
13932 1886428 1529506 1611155 1754909 1656211 1779865 1827656 1742234 1472983 1640567 1579662
13922 1579662 1572392 1819430 1608725 1557966 1558789 1399175 1544333 1827000 1617229 1448511
13912 1448511 1688888 1565714 1455501 1333604 1557678 1511654 1819153 1269417 1391052 1166814
13902 1166814 1475479 1625667 1455819 1454229 1282126 1349079 1059233 1159611 1422779 1458718
13892 1458718 1191874 1118931 1386333 1288065 1460402 1515039 1052819 1069635 1157086 1297241
13882 1297241 1170739 1145571 1177591 1205623 946155 1061708 1457080 1324369 1356486 1065666
13872 1065666 1281510 1129372 1339354 1262295 931743 1046198 1043923 1020451 1017613 929763 1291471
13861 1291471 816790 1053245 1310037 907338 887811 1120279 1389197 1137722 1033529 1321573
13851 1321573 1000041 1100769 1246814 1006177 1482479 437230 1151318 643751 960586
13842 960586 1073712 1142643 596381 1212813 990143 751473 1019078 1024791 845959 873067
13832 873067 849300 902881 1097528 1037740 798424 915743 943423 1013537 981651 919999 804675
13821 804675 981800 821723 1012160 841422 937310 709085 889162 963416 1172984 968924
13811 968924 714401 1067529 860498 1060736 1108460 759368 1185250 991909 993155 817809
13801 817809 738696 724165 617743 858549 802341 1011261 1126941 447700 888917 710510
13791 710510 449018 592204 851974 823171 978910 693988 925761 954033 760148 360319
13780 795171 907865 693069 724241 580837 717873 947523 808259 760897 788284 522288
13770 522288 872244 645770 910207 761405 886461 1022493 752080 836436 653648 776494
13760 776494 329530 786682 609325 278323 392813 577835 785628 742068 886603 922576
13750 922576 876679 753859 231788 676689 592299 917666 867382 397501 567236 622559
13740 622559 705304 1024475 786460 673599 540971 799277 622052 713089 562333 455035
13730 455035 764282 540972 455336 781034 380223 527597 495821 716698 533504 866955
13720 866955 440604 499576 346919 674340 1031656 446840 680024 546404 608779 480570
13710 480570 563171 586215 445799 872895 412904 695817 601999 229012 333940 479698
13700 479698 354078 668644 924484 165850 720097 312189 636955 590841 339215 414751
13690 414751 476495 493729 205625 549971 655519 609952 447741 391839 536409 515163
13680 515163 337632 719744 155525 527957 713363 720459 379953 600865 81169 809838
13670 809838 233428 586592 819668 383944 466892 222297 352663 687755 554584 228236
13659 644461 350406 496353 319529 445190 353948 537595 471044 226156 185199 299721
13649 299721 372824 560186 475731 541765 331357 310366 329697 451030 232907 674879
13639 674879 707757 498951 546819 207938 364750 252099 430047 330970 478261 504994
13629 504994 187710 326796 377807 278099 320378 220911 230853 452876 318231 602854 250822
13617 458415 24162 443199 272289 634818 421030 635695 188720 645575 421577 260998
13607 260998 502873 58893 363432 265383 49419 589640 233248 440423 497479 527771
13597 527771 136353 689091 429512 285954 185518 138954 226901 319410 285182 314711
13587 314711 383912 -24168 161268 128400 406604 123734 467804 -39477 424744 235703
13577 235703 180527 450561 239452 443969 275150 149290 158939 233048 171899 226505 242987
13566 242987 301496 508357 577952 492633 230763 181307 191521 567275 580920 199025 429336
13555 429336 415949 394826 195881 362782 417455 111272 297385 232644 312008 441347
13545 441347 244716 142804 179145 436036 492186 273586 417537 192380 178692 494218
13535 494218 491794 299869 379221 428537 258219 182769 235324 442671 184369 172882 271839
13524 271839 315814 186614 -18467 212879 292269 146934 136215 204247 158710 167599 185750
13513 185750 231666 48803 86478 325304 499653 291227 42903 214335 285614 512486
13503 512486 421705 283561 648949 321444 485962 486487 116776 161120 87608 220016 3656
13491 213427 17827 105437 244354 57798 402584 379132 353181 231995 223637 235553 242909
13480 242909 218670 -9193 -34088 359548 108251 307661 61410 322059 135892 353282
13470 353282 453099 628744 295641 144076 377953 139622 132306 407186 573940 299790
13460 299790 -5263 229940 319086 146913 171775 160056 202741 71274 -156988 155157 264538
13449 264538 -23616 337997 155360 357516 28621 210307 376235 367087 328959 330814 157908
13437 443358 166686 256197 282177 353797 -102926 86872 137848 194125 295435 147036 505029
13426 505029 190108 223435 127458 469868 518347 168344 166948 62097 -192873 216993 172017
13415 172017 -86794 234397 346773 365363 122000 269266 240966 59499 105618 279501
13405 279501 104309 272043 380598 115379 117294 447952 440966 198504 352932 411260
13395 411260 147008 216207 463462 -133067 336497 2620 207808 200334 369545 61254 176684
13384 176684 291665 557743 110289 168014 57223 72030 247099 97360 529729 492794
13374 492794 -1530 310966 94473 -159964 68732 319327 108784 91389 145805 418884 297786
13363 297786 190656 115909 298338 414830 153937 340690 301690 330123 78864 336220
13353 336220 385521 166139 457513 131227 339370 438807 284614 465307 490097 170087
13342 183425 409426 208632 242233 231934 267589 179877 230902 246795 545911 178716 491448
13331 491448 156500 -34499 -37481 248388 386656 -173746 333371 89495 10371 479315
13321 479315 60303 272817 445784 327344 286501 267164 5790 173778 350987 449016 265691
13310 265691 216312 254983 114102 -36922 145666 54422 191044 335533 180884 -38237
13299 149783 122983 -81533 313353 500942 -70879 227010 154589 263381 -84106 303152
13288 332512 162637 159136 30151 478971 364532 56975 -41819 431038 161445 -57873 83352
13276 -305996 19887 -165461 310303 -26339 270253 90727 -301752 398537 119487 -101009
13265 354300 53831 129324 35334 264509 113220 84100 173024 100673 -52009 198239 -46878
13253 75117 137353 14790 147792 345716 215178 75709 112977 -17822 323892 63846 293531
13242 293531 327943 185528 221120 47232 184277 480036 234892 -148040 -13047 -80595
13232 -80595 98298 193033 -227844 -216343 -3975 81010 139239 -101804 -93706 66982 186786
13221 186786 82580 93151 126418 138590 189691 42370 255531 233905 272459 133610 -311034
13209 169725 -1788 -87348 -12957 -139085 12163 149871 49593 -137740 330432 77181 -40604
13197 69986 431613 -19630 104014 104364 144232 5840 213597 339537 -241494 39038 210191
13186 210191 -250937 -97198 60317 -120952 72735 277829 326094 159184 -14965 -135888
13176 -135888 -182987 263806 199953 162351 -134394 415274 270118 105621 -28366 -135692
13166 -135692 201564 93829 46214 33418 162174 77169 115593 29128 -105653 -66242 479476
13154 -2197 418007 121766 40203 60734 -287184 13935 -247877 3016 -44164 115170 35265
13142 309829 232577 228386 89839 316382 -36293 -235437 -52917 38232 195280 -116995 -74379
13131 -74379 -90681 -289768 5087 99392 -62907 150634 127071 129274 413636 176997 100515
13120 100515 -70611 -16110 -2169 176279 -96226 303134 245622 267260 -100201 -30000 278720
13108 -136133 -39319 26454 75298 -195870 -477 17978 23260 104703 -31980 89700 220857 442186
13096 442186 160487 308608 131460 -3387 220907 15066 119172 579 22687 52982 222264
13085 222264 6647 223163 164119 -109621 396416 206458 83109 191786 159189 -266633
13074 212613 47917 -123069 -299558 -71622 91933 -168684 -29925 77297 18331 347444 347
13062 -5758 -5636 184765 -219961 -111878 -3393 164873 -249661 5178 82752 -6621 238503 126235
13050 126235 289194 127602 -356444 226436 24931 -192181 -39925 -97019 89230 168243
13040 168243 -142314 -304065 179578 117935 154398 316234 85100 82218 142197 -61491 -97577
13029 -97577 195812 155756 224676 77854 12306 -109374 125650 324903 13555 245589 123961
13018 123961 25713 163801 540537 112437 168272 177041 -83319 -36288 -11954 -102499 651
13006 131920 209422 -42670 -28932 420708 229172 143178 -138457 195344 223320 -170633
12995 195547 24363 -124081 -151343 47766 314311 -43237 -131015 276140 160042 65974 11165
12983 83335 23618 -332143 143821 -61664 -35203 -18384 -10626 -17274 -450458 108491 366035
12972 366035 340584 97407 191598 489954 -92469 379144 -189779 -40179 25110 -98531 199598
12960 126090 24242 146273 -9757 -39546 245928 -70871 73241 226406 -98287 227026 44779
12948 279245 37560 -44383 8035 -236663 152307 70297 113203 -68257 174845 -437452 197880
12936 34433 282994 -61390 -74582 109887 306862 -294401 156868 -101502 41918 -40599
12925 -93635 -14350 140697 -16672 -399941 276480 157933 80616 49026 -45244 72013 -135641
12913 83915 -10090 202036 31774 119361 61589 -22264 212314 -24199 170119 42212 -221116
12901 -215687 94134 -148051 40972 -200773 -377139 105597 45854 75337 51989 -159971
12890 -165887 19471 -74556 83467 69555 4852 -255373 42635 71662 -218620 -328048 -126729
12878 145810 147517 -246622 168642 73539 -18783 135714 2184 -56142 -270230 -141481 46853
12866 24421 148669 162150 -69142 254281 116227 -48473 -296054 309346 -346437 219803
12855 307459 157460 92922 -368724 202966 19879 144050 -122336 137066 336627 -156849
12844 -81888 289314 -219941 -86172 -29630 268878 244897 -105423 247983 -108187 319403
12833 -193243 -318483 -28013 233423 -109731 -229362 57528 57098 -113963 -45600 168143 214039
12822 214039 239191 -91310 415410 56363 -218206 51130 -249263 -34799 150047 127273 293252
12811 293252 -72193 -22777 230727 192058 212298 -220898 -195680 -110985 397148 397873 -60980
12799 153569 119616 -139907 113539 -120661 -4020 -134235 197228 448858 29423 -369655
12788 -74933 -256195 -290698 -403754 198500 -18774 -154380 60989 108411 80480 71476 110009
12777 110009 221730 271801 -140606 206078 175830 -25688 86022 284973 100140 -97444
12766 -94047 -242988 -94833 -112653 95333 89694 103700 -85693 -74037 79608 -33654 10135 -176611
12753 -54202 321257 93799 11528 92737 86677 -4251 -200914 21064 236843 30300 -77688
12741 -77198 -17437 37652 458968 96738 177055 71370 245029 -160491 105451 69351 52061
12730 52061 121459 -33406 -82619 -1613 190409 29156 155178 28023 118788 -246000 17758
12718 -40755 190220 -302686 -150338 89897 193075 17422 202246 -70870 373887 241969
12708 241969 252874 391357 201953 562705 -62321 346284 226433 113787 -163755 309798
12697 141101 282772 328505 420037 44235 80619 116798 3493 306771 125740 117301 -149379
12685 -19626 -42992 -103033 156519 -148878 41594 55894 278669 26934 -96800 189565 244715
12674 244715 199444 -48263 85422 -68463 231643 1877 108418 52601 141866 77987 112825
12663 112825 124844 310502 243113 5293 128673 144929 215469 137407 1475 -116644 88702
12651 73034 17420 113372 -107779 68914 -90135 -11966 -67810 -80004 205751 228086 305071
12640 305071 -50563 96419 542478 147863 219017 -42390 -101302 -52786 89172 104039 108972
12629 108972 85831 425704 142950 -16982 324059 227392 35428 4904 -12949 223319 208048
12618 208048 374106 540438 -151768 -121457 51300 1795 105578 -292065 253929 -154906
12607 48163 -67328 -8942 -66641 181444 -33302 170221 -86417 129814 -401163 170373 -18728
12595 296896 -63294 28935 120746 -204030 -133747 52016 -19729 95623 148851 -179886 -106768
12584 -106768 -47305 -193604 284832 80148 -256238 -23473 -6169 -153824 -234321 210723 -182122
12572 214667 290052 149569 179297 -19777 273227 -353477 -89143 381349 -94799 55436 216272
12561 216272 21170 -316148 28193 12037 164449 -64301 296783 157996 278381 70126
12550 -69767 247533 163243 80642 -169033 349515 55827 18283 -137344 13722 143918 -139317
12538 125741 -234364 26899 -75803 -44724 -134224 126097 164 100656 -210872 60180 -103122
12526 -42684 129599 300069 61919 40192 -59582 35626 139991 41773 -37839 164843 -19937
12514 26022 50524 -77488 286943 103587 35390 -20307 -116570 63855 -210876 256572 -228849
12502 37705 34235 -9703 55237 31963 88647 44393 -42817 78663 95972 43992 364302 47458
12489 -236656 50285 -79887 -25195 -176054 -130870 20308 -98280 -47062 78349 5109 -195172
12477 -76972 -59941 -56399 222803 -173377 -24031 177832 203469 9263 -227796 59498 291617
12466 291617 -200141 -105606 -521586 -308688 137166 118964 -215424 10764 -203283 -48323
12455 -116997 258507 93181 -98543 -25878 168890 30650 -199430 -10732 80277 -17847 175669
12443 314940 -250881 -147437 -51969 5762 -251985 -8681 -56873 -8590 -20350 -69272 -91969
12432 -91969 -215617 -38493 -267269 -87676 306972 85092 -226370 -29483 -84049 -232891 17186
12420 106144 162786 -2795 116155 188201 -34991 190510 -175650 22544 361247 15115 197914
12409 197914 -221048 116353 -98311 144219 15695 -30399 36148 9992 -36755 11549 -266878
12397 -11629 -382330 128689 313929 44794 -140195 -3169 -143800 -37640 69114 -346552 -242263
12386 -242263 -277788 -189784 258609 -176654 39880 51328 24566 16320 -92857 175383 -358791
12374 -43407 -36044 -365841 -145699 169439 -235538 249469 242190 -110180 -114917 77277 -10381
12362 -58115 220508 -299356 33992 278020 -49406 75726 -142212 240470 89434 83730 -338924
12350 27007 -39595 264 -85937 99212 -70394 -130937 95269 206312 285078 407351 -37062 -268687
12338 -268687 -126100 20161 31749 59374 -131138 -203009 112039 195093 23671 -101190 81776
12326 105184 207768 134534 -103357 -342081 397437 45597 87557 -165006 151262 216523
12316 216523 -160098 -38242 -89406 202707 -96998 5527 171675 4857 -64638 -158307 -57031
12304 -43338 101984 -4635 -209655 -89486 -276806 -255786 78316 15747 -132639 -269776 18676
12292 34768 44596 114556 -33538 135661 -121409 270730 61769 247567 420 -42580 -166636
12281 -166636 135450 -66970 161668 249218 105301 86149 15640 71906 311550 137419
12270 148964 44842 225356 20904 -31907 164426 -249529 207436 -15641 168540 113981
12260 113981 -22733 -169576 135737 39906 486279 170761 270633 -109567 109735 209087
12250 209087 -599427 345568 195674 85410 -360248 295575 -109792 -32396 -318009 55398
12239 115484 218022 -58980 112482 9627 62183 -165981 -88242 124292 163562 -19831 -81817
12228 -81817 441591 62306 172229 19760 396350 376538 70639 2318 82607 92388 335411
12217 335411 320644 32179 75982 138500 84970 121925 391457 -10719 -58394 68064 -77676
12205 -166146 294539 36702 564698 179977 500454 317636 272423 84241 -179057 221529
12194 281494 602315 461271 213568 194609 241956 112009 217229 -73103 349271 269327
12184 269327 -143902 -69897 -55828 -297926 296399 -50160 74795 158647 303414 37265 -8672
12172 -89591 290319 274194 157343 247564 190744 347798 84523 -75056 179779 72819 -148151
12160 38273 234418 59036 88402 86125 -20169 230008 112239 -220491 -13271 386346 -228373
12148 63547 -55976 -92650 15826 -192926 32328 119205 -114314 -195705 344016 -156564 -109766
12137 -109766 54756 10139 -190954 -165171 133566 -229917 -38899 -38059 40272 -17055 -291714
12126 -291714 56209 -239535 119766 121925 133703 2283 -213395 13978 13120 159931 128647
12115 128647 108974 -128465 -220017 254872 -154940 -73286 29842 -7610 262714 139278 -73075
12103 69828 -311971 -76900 208985 43968 92025 4903 256658 -110465 -223735 42605 13669
12091 192675 -29726 -62264 -60961 40977 75617 53498 50062 -133286 16032 132253 11619
12079 -56342 392205 -136978 -112118 87536 6365 150825 -106023 -128682 -51649 232257 -202985
12067 383530 146246 1006325 1887740 442341 439475 186559 274173 -128891 -98560 -107635 -175529
12056 -175529 -27985 130107 121762 43255 123955 270978 -66441 140214 -60402 200053 32402
12044 -204700 88971 22987 110913 309390 315054 153872 147402 128173 -330768 51186 72802
12033 72802 -277536 24698 -269672 -293688 -122605 91493 -324639 40781 -83305 -126113 23746
12021 20597 142745 -24622 62701 166585 45307 302564 62539 387547 24656 -255019 -6093
12009 25930 -115643 178874 -268273 -126892 -154690 140825 518 -70936 -232916 -116660 -107761
11998 -107761 264590 44067 -158744 294742 -139580 -122041 233960 126863 113535 120850
11988 120850 -41222 -25249 -312329 -290299 8961 194400 -40505 -138827 -70037 -84418 18577
11976 68584 -199472 -190992 74120 -272451 115533 -121670 175422 211975 122218 104105 37968
11964 147348 13760 159780 -241251 -86891 -215724 -15821 59756 13045 -228960 -148935 -369341
11953 -369341 -157741 -406007 -61828 -140626 30394 22998 125673 -160426 215902 65218 -206598
11941 -59193 -288963 -327456 -41628 380050 -231687 -103744 -145547 144248 -7055 128457 36540
11929 -143911 1631 168641 125345 131555 182879 30718 53957 90939 -381147 -17287 -372213
11918 -372213 -56135 -136638 63585 26532 -32397 121097 -75671 384894 -142208 53451 -154997
11906 -140585 -353249 113961 -277496 95836 37840 -214062 44900 31191 15408 -64477 95055
11894 31219 126170 -63949 68626 -83278 114588 -9029 129482 -145914 -307490 -48915 -7244
11882 177814 -171497 99810 -58775 -164265 78121 -36300 181363 -230006 -143207 -247776
11872 -247776 -6962 -139987 -154454 -166377 -55808 -185872 -53598 91264 -457703 -15035 -158495
11861 -158495 -178820 -28766 -99015 173502 -132825 -266924 62665 -68912 -65110 239804 -52207
11849 -197133 -208351 371896 -2346 -174757 9112 189190 -133757 -85797 -82934 -224622 313025
11837 -47032 -187546 -297733 -253940 105543 302517 -167948 3749 -377567 24886 -62058 -33861
11826 -33861 42966 -398783 113359 -290373 256204 178040 -137303 177186 295536 -156105
11815 160240 -108124 -46818 -218800 55341 30197 168255 254667 13078 -59250 -186237 -222579
11804 -222579 -311252 75433 -127212 109339 166866 -164663 -104054 -151390 -101645 -354872 55488
11792 -227477 39288 -87128 25153 -42174 -282681 -125699 -88748 230161 -167030 141622
11781 -302916 -29234 41630 338197 -55627 -110250 -146982 -217567 11365 52679 81793 -138658
11769 -242263 -59181 135919 122968 105325 -230193 269256 119592 -132104 56429 67580
11759 67580 153800 236495 10541 159245 8635 297637 -130219 220281 161992 68348 117979
11748 117979 -168228 -210485 323411 -133121 10248 51928 -394099 148260 64978 -274538
11737 -156916 -96150 90592 34725 -116761 137323 -291830 82248 -167277 -82363 174746
11726 -1155 89872 406836 114552 -182559 29677 78591 -125835 147310 -103484 -59662 -112790
11715 -112790 223602 43666 235160 284094 265380 -35641 150695 91630 31120 97577 161309
11704 161309 11700 98341 -9838 -250477 242227 -127566 -58783 -136422 -217654 180212 84459
11692 -194532 -137703 35007 -188569 24887 53980 -2894 -113053 136396 106488 -4588 -226984
11681 -226984 -130226 -284117 -127000 88091 -65013 145676 -356384 423440 49773 -29001
11670 -53677 -58865 248972 360582 -45691 -47476 163325 380714 -99619 516554 -102132 -259522
11659 -259522 -196123 -148830 352936 283002 -69563 59102 23766 28741 186950 -329899 329560
11647 19060 -100145 -177515 -5059 -21478 45806 -141995 -337673 -99277 -136438 -38332 -182198
11636 -182198 260431 -1704 -248979 -147603 61901 386264 103803 213320 36838 -340431
11625 33834 411296 463143 316467 124316 -250380 151465 37661 -49991 177432 178359 -53072
11613 247195 -316559 129002 -264642 90993 -78309 124713 166732 167547 32746 -120908 321309
11601 -287203 110377 89827 -107197 -13252 24643 49570 83122 -128 245618 -237112 -255652
11590 -255652 65136 153707 -79593 -69977 228871 50780 156375 74979 -205749 285216 -335367
11578 23075 -21749 278143 -266176 -267136 80884 215686 -161880 -58780 79928 23148 376855
11567 376855 57225 183777 141744 -379339 -86624 -182050 230232 -113031 -73474 -11685 12600
11555 113386 62571 166377 26043 41544 57056 29832 -57990 -59660 -17443 -25628 85285 155212
11543 155212 106985 -18561 585448 -203859 204812 166929 174667 395733 41092 234806 328430
11532 328430 146090 -132578 96962 -68609 37903 25497 -34823 -155273 -124310 95131 330712
11521 330712 -90096 181854 306257 -112309 40530 326125 -138575 -175339 -4647 438198
11510 201910 -7915 64297 72782 5928 -77230 462476 298571 80171 79778 294117 90159 -10063
11497 -82468 59757 243538 -39528 148047 52285 -191113 -109078 25126 -27096 95825 -388267
11485 225071 132394 -14677 73844 398444 133738 152161 246697 202834 231290 203650 502070
11474 502070 66574 2246 236093 -223177 -21801 271463 40573 -13239 -104340 -76154 59172
11462 280382 323167 70310 -12946 442110 17261 218447 284580 -22553 12321 23389 63267
11451 63267 685267 214989 -1551 195134 -124723 92120 262815 80262 177466 358312 90047
11439 -115636 -12656 49787 111603 277878 -160372 -389423 -241663 264523 -71504 -112613
11429 -112613 -30453 -99784 -138743 -113929 -89048 79678 -163224 -82576 -87379 12631 419363
11418 419363 -124643 -230203 88299 14505 -27842 -11899 19890 32967 77170 -72063 -222152
11407 -222152 -146123 -85036 233371 73808 -121718 117037 18107 37819 45323 -207277 26628
11395 -24489 251380 -2545 226671 160110 -232514 140415 -73854 -57453 242353 -146812 264756
11383 -410692 -149669 -174731 -28601 142963 45649 10714 85070 185521 94040 -73995 40928
11371 19798 129744 148733 68082 -128990 16678 -55889 -105707 -101188 130307 242600 -315114
11359 -85336 202868 -5662 -124535 -62960 -244826 -79896 -122566 150671 41648 187127 15252
11347 154771 340380 -116056 168999 -58687 244129 218669 332279 -223234 -198777 -108926
11337 -108926 -199283 60072 -106249 -45300 -125521 86762 -124088 -79980 80030 194795 -65388
11325 -155001 291147 115786 -186244 -129705 22981 -396414 71548 71028 -184812 -176712 -187416
11314 -187416 72431 -33704 -198802 252432 -119688 -37284 190526 112270 -140595 208752
11303 11041 -34334 156162 -163413 -82665 -188200 175277 245959 -99792 -235484 -12229 -230666
11292 -230666 172413 -50361 -46061 -177253 63856 -143194 -238574 -405815 62865 85377 -191883
11280 -63997 -253902 -59254 55406 -238777 42243 255229 -103076 205370 -62855 -391476
11270 -391476 -153193 -208901 118960 -155565 -499936 -97469 -23727 -122159 -263220 -66518
11259 -82798 -356893 -307017 -143138 -204973 233461 -117346 -276307 -266464 21536 42241 -57557
11247 156304 6724 -63078 -86457 -266082 40549 266369 -148519 -109322 -168844 -70406 64910
11235 52934 -186467 171336 13225 -126321 -56818 255322 -123587 -251015 -91410 -157486
11225 -157486 180189 -230792 -320700 303032 -123404 27619 -242565 -126095 -43948 -402036
11215 -402036 34545 -188276 -346913 -176151 -33343 -137020 18387 -97794 -137353 -266531
11205 -266531 -275176 12380 -35963 -237225 129744 -132054 38732 467599 -296490 -147821
11194 80272 -98511 -22981 -382166 -79275 24763 236990 -163895 69497 -240256 52077 117652
11183 117652 -47726 -71224 219025 -198752 51917 -177142 -33324 60706 -234595 84410 -298225
11171 -389975 -177006 269004 -85627 -82508 -70501 -24623 -93434 -324575 190432 25858 133612
11160 133612 196642 -16703 107789 -134408 -71004 7452 105909 -397685 -264393 186063 83345
11148 -123218 221621 -29696 228947 -53855 64166 -88156 -21947 2621 55077 28523 -4162
11136 -134792 102280 56049 31018 124402 147157 23606 -182045 166128 258891 -162437 74050
11124 120650 17589 225720 107128 -149980 -137159 -102902 155706 -17919 -25691 326 14639
11113 14639 -101237 293432 88270 -130483 5915 211940 38087 -157892 -6612 353371 366053
11102 366053 3244 141369 133578 12432 -167550 150353 -111791 97568 -104327 236761 -142651
11090 137129 -51337 26747 1047 92638 87072 384018 293241 290220 173732 173827 188817 566500
11078 566500 -84945 488446 111256 137222 405103 322047 454478 231829 453791 330840
11068 330840 114182 124241 510024 171150 501876 295204 341263 496219 651163 643190
11058 643190 373629 938458 582071 313967 665331 343452 760313 676263 454010 631537
11048 631537 699058 509585 692594 758644 789329 626586 426357 514035 728937 824838
11038 824838 499258 716563 642244 709457 790809 836894 556668 828458 514792 766155
11028 766155 588042 894413 774855 656334 780399 655786 1217740 655099 558987 773560
11018 773560 485482 950128 905905 755115 606594 373161 281912 624388 595019 454685
11008 454685 623021 389922 971474 634799 913544 561448 455097 513754 637557 732061
10998 732061 741744 832185 338228 278564 573438 470865 718875 695256 820103 425009
10988 425009 597792 825825 936835 767837 1045626 1176052 1320844 1263961 943250 1223030
10978 1223030 1546665 1655101 1545245 1985240 2536810 2617896 2369392 2652845 2760408 2515480
10968 2515480 2500632 2248182 2038187 1875471 1731350 1634590 1542857 1550299 1630643 1560536 1511542
10957 1511542 1745219 1314575 1635551 1422576 1181645 1527086 1340900 576798 783777
10948 783777 602564 506944 197378 425759 89226 525215 201241 172206 65976 238960
10938 238960 -48293 -1391 129963 134579 -3173 13939 -110163 -45199 38086 160771 -141754
10926 206328 -21833 -9943 191262 -260175 110075 239108 149540 60292 228949 255759 -265368
10914 -279889 312461 -80106 85097 -306882 -66023 -129348 135727 2144 -122642 23014 118390
10903 118390 85025 -430064 -81882 44134 -313102 -106966 -50358 -127410 -54012 140530 150243
10892 150243 41352 -91027 77319 -205781 145207 -404202 -4620 -190989 88572 16731 -18891
10880 83690 -217621 175134 -143474 234612 65566 -148645 111125 -177774 98520 -50530
10869 36042 -100556 23143 -75576 -67124 43001 -82474 -380603 76908 41206 -271680 105625
10857 -19910 28055 75671 -307407 54049 -360488 -14850 -362869 -249428 -72230 -248941 148359
10845 178147 -234730 -221023 52857 -123415 -58983 -5591 7879 -171683 94293 -77800 175079
10833 14761 -184854 71039 53957 31833 312208 -106992 -106649 -143428 -99174 -236345 -17840
10821 -368694 -220846 -311770 43263 74269 -88492 141288 -73029 161796 4499 -246587 238974
10809 31643 110202 -83476 -135525 -24287 191526 -283377 34296 49620 154508 -371919 186886
10797 85695 258477 -500848 410594 -117416 112738 167678 231017 -185318 -391239 -67588
10786 -86187 -79579 -153855 -127450 99555 -21503 -19354 40063 -74211 -76586 99390 -243869 105217
10773 -263173 -379760 -88181 251903 -209306 302686 -182757 -332661 -382532 -292732 -234783
10763 -234783 -81162 34270 161326 -219228 -213316 -80863 269241 207583 174937 -57729 -24978
10751 110730 15794 782314 -190534 103660 -288351 -160105 7565 -228836 50528 110479
10741 110479 -4109 81949 -248328 -51921 59925 291263 148428 -187262 -94427 103367 -38179
10729 -168552 177691 114565 -184704 -73475 -203829 -169457 136180 132471 -131978 74477 -157521
10717 -320915 -191026 -287268 92445 -107323 55844 -33064 -88848 -28428 -369939 10212 -203533
10705 -40949 833 166668 -343650 127852 -22634 -315989 22206 254153 -179301 -174752 49593
10693 108041 84509 205310 -31081 -79695 43244 -236896 38729 -168075 -271579 -224242 -51571
10681 -242970 -93561 25750 -165212 -219870 16330 5535 -201686 -161604 -355794 114122 55199
10669 73557 101402 137324 -22940 42865 -285072 -148550 -298359 183431 51571 29836 242600
10658 242600 50640 -61009 200178 18764 314402 8118 151397 115819 162104 -39707 -223565
10647 -223565 -380121 52462 78892 434816 -67159 126894 -220463 -87049 -156796 -221651 -312724
10636 -312724 -41811 128294 103558 43888 -65501 8545 -38552 78648 -190219 104734 -130733
10624 -311258 -56466 384648 140599 -240623 91816 174570 -406915 41564 15680 296283
10614 296283 -119709 -39209 -177690 87943 -131564 150540 -12830 80966 171635 218534 36985
10602 9481 -443258 -140644 -156732 -208165 91762 -80614 -125938 -337085 73247 183151 -187380
10590 -84023 -127836 -269778 -259156 174597 200649 -77867 -159575 147375 -494683 -6797 -376967
10579 -376967 -170812 -85872 120076 -120704 -127765 -214203 34049 -263397 -104851 -97986 -153907
10568 -153907 -168579 -59540 -399234 -276992 -71045 -435765 -538475 407587 226890 -38996
10557 -30819 -85621 192036 -149201 -177608 -401592 92464 181983 -152174 -39674 66690 -31797
10545 -52877 -257442 92211 137274 129931 -42792 -124793 -54954 -6384 -110810 -163224 -147625 -326558
10533 -326558 195528 118974 -115104 -249767 -84903 -53709 -393835 -28375 -34824 77524 -207886
10521 -81015 64021 106784 -105003 -327606 -237510 85394 -61273 -90132 264411 111454 301330
10510 301330 -114206 -69995 198778 226186 -233705 -159678 -4760 -342397 -243677 -301496 -118876
10498 149529 47747 -124963 62624 7271 320439 -124060 222382 102081 194262 -64232 277818
10486 -357208 273967 -98466 167933 204868 638520 624410 433797 260707 180681 165028
10476 165028 349760 184810 114816 -124294 314929 171941 -126800 -461791 63351 -32555
10465 160042 82779 165301 83955 209970 -86188 364020 -38213 -276674 192925 -345036
10454 -256578 163834 23524 -223748 -138133 -287097 -54219 -206454 87080 -122082 -78506
10444 -78506 -256724 94411 -608400 -59597 -180640 -130678 -214054 121685 -90132 243532 213138
10433 213138 -5931 -11713 14031 -279580 -285313 117407 5884 -314445 -32320 -74575 -10898 -106404
10421 -106404 130275 121586 -86049 253610 164455 180238 113838 -65976 80769 26277 -703 201952
10408 118072 -72022 25197 34418 164826 25781 -43971 46751 -98924 -137731 115303 72253
10397 72253 145446 -48626 245661 -62275 -28839 -54154 325882 -107590 3253 100729 131235
10386 131235 -123047 477306 137375 -116686 -103866 25329 276127 294169 5727 65560 490198
10375 490198 47799 85844 179312 504514 16766 250 271682 333080 521405 384234 151258
10363 154791 313380 558926 76251 7274 202805 104159 127787 222526 127043 34107 189824
10352 189824 298230 614032 770040 581442 535962 182242 -15903 270928 280113 234948
10342 234948 572475 263992 184930 163435 230232 422889 -61720 137966 41664 -103071
10331 405948 206416 58486 -98220 -117939 111285 297289 162478 26982 -72970 216717
10320 262093 -13289 202125 123307 138040 -24111 -86890 -6629 138147 97974 161317 242350
10309 242350 -83996 60782 211429 312019 67127 187714 187906 -49425 -130086 41350 -65945
10297 37202 31403 -81367 -33679 419581 -116420 -75543 -39551 68591 -48529 70681 75164 -69205
10284 124744 21040 139849 -388677 63831 114697 -16422 -183098 -300280 31918 -442656
10273 -108142 91833 88998 80107 -38266 -134727 -69970 -259922 -92639 -195980 -135761 234177
10261 183557 -207356 450549 412336 410093 354545 544243 5756 -100867 232848 8857 -123887
10249 -84354 139333 -126399 75566 83949 -33527 -430 189200 8422 -60129 -30529 27567 -182798
10236 54637 -81625 -109504 -49557 -150272 -88808 63000 227008 183069 -162471 -19671 277577
10224 -85758 58304 243739 173803 -140538 -55123 -312883 -208388 -223571 255936 -249094
10213 -198099 -171218 -5029 -42870 145653 -360867 -85307 31886 -320902 166861 136632 -38466
10201 -28804 -203973 181290 145367 -232617 38840 179307 80572 60959 35507 267991 -1909
10189 -174506 -147224 -259043 -55759 149423 221290 108319 -220126 -247788 -294298 -58252 -285027
10178 -285027 -76619 -178787 -409748 -288093 138185 403528 1794 -396413 -50274 374019
10167 -86731 -124499 -227296 -28714 232295 -147771 -268097 30261 19699 -195164 -174009 -88790
10156 -88790 -195582 -251607 154154 23489 -13188 -349720 -110421 15727 -77781 -7186 -183268
10145 -183268 -82882 -20045 34902 185952 18494 96352 -62154 41439 -176770 -273225 -84322
10133 214957 -255998 -260542 -347258 -168159 -232416 -160154 -289332 134416 3349 51332 -194597
10121 -110565 36819 -4654 -15537 -291193 -27023 -115040 140800 -140370 176896 165864 -19348
10109 347664 69776 -206921 -269070 52321 -56891 -80944 -218752 233845 -288310 -493737
10099 -493737 -173492 -37856 192069 -226453 -182308 -54352 -212761 -31893 105961 135909
10089 135909 -159948 245136 -147579 -41007 -192787 66309 -179682 -106136 -40069 -27943
10079 -27943 -234274 -306737 -174455 -151355 109905 10758 18498 95253 -214123 -74504 -128382
10068 -128382 297327 -151426 -133955 -233977 -188395 347389 7014 7471 -314817 142988 209038
10057 209038 -98813 -156037 -183174 -304193 152256 169218 -232626 -169878 -266289 -157613 -15860
10045 117819 -47469 177511 -219846 -59893 50399 -171584 89113 -21987 -38276 -7683 -120910
10034 -120910 -273333 -90428 54864 -368387 -40977 176712 148908 -249851 -57846 -97417 -46249
10022 -101833 159108 -413606 25443 24671 58899 74292 112191 -37506 -314604 -55394 -212723
10011 -212723 -406487 177981 -282376 33842 -140351 -49337 -208490 -11178 -931 79785 -119789
9999 36385 46850 -289293 -14922 -70305 -103899 -167333 130788 320928 14404 148973 -26501
9987 -24254 -228841 17285 -130240 -62739 -393296 -151747 -40041 75531 -7943 41041 -337380
9975 132114 -200810 199203 5772 268669 -149198 -120638 77731 -6447 126776 29101 233036
9964 233036 -110009 -168442 -340388 27866 252825 -115825 -223871 -281994 -215175 31315 -354132
9952 -69317 -115883 247709 225442 145035 77542 -105868 409507 -247761 243182 -216067 -65591
9940 -90578 -13037 96359 -167744 -147631 249420 21710 -202618 235434 -294950 -261917 -145918
9929 -145918 -123984 -185857 -150566 27942 -230995 46571 -205604 -250377 45151 -597592 -104369
9917 -96172 -158386 111277 -110115 -170387 14624 45394 -38861 137687 -515278 26798 -99942
9905 -442131 -8406 90711 -46697 205546 -283602 -179724 212972 -492689 55957 30182 23193
9894 23193 -177233 -154949 -159245 -33743 -63616 191680 -57047 -151890 8270 -242239 33809 -28360
9881 42710 -72668 52821 18440 -124630 -541504 -105812 77398 -190304 -60742 11132 118219
9870 118219 -288972 -84002 -86778 -136208 -145964 -65544 -264572 -91512 -206216 -68146 -317677
9859 -317677 110846 142641 -87029 -68214 -93521 -177082 204125 107509 -75663 -143608 46203
9847 -172179 -315147 -364111 -174098 -16142 -245748 -422935 -251421 -288744 -302927 -32171 -122200
9836 -122200 68516 218884 -301002 78413 -574584 -289145 -12897 76829 335891 -322533
9825 92525 -225697 61886 -88069 40019 153050 45367 87339 -55700 89670 -106804 -326931
9814 -326931 105456 -45118 -201782 -332495 -119287 219877 60745 93464 -135373 -120640
9804 -120640 74005 258745 283601 319488 -241568 -64866 80911 -378516 -214855 17551 -209690
9792 -214737 -144612 -260183 261627 -361578 -39480 89992 154634 -13599 1180 11538 -107277
9780 -313396 -168340 -83850 -119423 16836 24922 -194799 82256 -34659 -50284 127423 419101
9769 419101 -93071 -406808 -11248 -101848 48207 30430 -867 70671 -33148 -392283 84102 -20773
9756 -213055 -258242 2137 -97736 56947 -2252 -155219 -452117 80192 -58507 -42986 383997
9744 183033 -272256 -54497 136077 33860 -138720 100986 -112367 -150470 -280317 -128736
9733 196719 112031 -336579 -144802 77102 -53521 274505 82639 30566 5843 77973 -207201
9721 -247099 -320018 -149730 -78338 -1079 -27462 -288859 148515 10576 -205130 61059 -54444
9709 -446468 -368471 165985 -253579 231639 260027 -484091 162975 130042 -314296 -2068 -417939
9698 -417939 234236 -218949 86981 163767 127242 107777 -43362 283705 193379 506 -229379
9686 -310146 -253450 73492 -293786 -13874 114139 -46331 -29984 205947 30077 80792 -182496
9674 -97482 -34069 -190851 234020 -149033 -54916 179233 -86117 -236017 -102923 52918 307174
9663 307174 30426 -129657 -137853 161670 92648 -116403 24476 -227761 -207078 42917 -37958
9651 -85366 -35545 -82328 562 -125010 184393 -48063 -51 -194528 165924 -9158 62329 -193731
9638 -53345 -22526 -508861 -67411 -140646 -119996 -6642 -221230 -112798 123918 -111487 -408760
9627 -408760 5792 -143221 -257699 272964 -103459 100468 240969 29216 192230 -311693
9616 -244611 21856 -121426 323930 -346887 -48046 -69064 -365188 48543 15043 -382114 -126547
9604 95228 -316815 -125124 -300237 -376377 -160314 -20796 -388022 80306 -86910 339090 80676
9592 -505 122833 185076 -230257 -125948 -152833 -295179 -204299 -63912 260228 -92890 99697
9580 120274 -78623 -138575 -84039 -21203 51273 -18847 -443486 140997 65859 -251097 -70941
9568 122561 -199781 25411 -287496 74500 210545 -318766 -5188 -47935 344261 104884 95734
9557 95734 -303217 -56010 -140085 96608 75855 64692 -391129 22603 64226 -278050 -8418
9545 331499 -222891 -175690 -181519 -296406 -264594 195019 -226117 226473 -8027 -265455 -59291
9533 -164673 -174043 -90168 154824 53817 58456 -261290 104518 89910 188134 50866 53629 -113469
9520 22199 -159580 -139931 72905 -444858 847 42507 45865 209143 -279440 -27451 -215435
9509 -215435 118404 153831 37128 -197519 -135121 146475 28448 -230588 84784 -295238 -208727
9498 -208727 81638 -56621 -70192 63078 -216611 -89074 -96021 -41476 -237771 -39117 40942
9486 262417 -40881 67954 -199351 -155734 -364496 -148059 -272276 94575 8221 -288828 -163469
9475 -163469 13512 69828 -486095 76324 40573 -183740 -40683 58014 68153 186441 18463
9463 10457 -55531 -127028 24592 -23004 -160960 -243796 279455 -195655 -276058 219157 182197
9452 182197 -129248 -171072 388406 267961 319257 -66098 -293181 -442155 262269 -176444
9441 208287 -443383 1615 -308048 78059 -97277 -182136 -240083 -240236 4876 47831 -1640 73292
9428 39489 -157859 -215642 -50468 -172142 -125601 -124590 94376 75602 -327482 -265585 89976
9416 249527 125531 -19003 -286461 -165962 174519 -103730 -110515 -95867 81505 113322 203775
9405 203775 -72110 -276615 -246310 -234902 -226890 -104156 4683 298188 214020 -110130 38032
9393 36443 -147524 153018 50296 -192338 215458 -210438 -168924 -37810 471592 247484
9383 247484 -71508 -157182 -152346 -330177 40890 -63929 -89803 -51523 301854 -363089 72133
9371 101921 -169801 -190420 -143603 -415964 72514 -10387 -162325 197225 -45460 -1992 -218841
9360 -218841 102675 156659 -170870 125477 -383288 -100817 -135534 -26190 189325 -330822
9349 -32934 115993 -211912 -187108 208257 -24595 -26723 -462336 -96811 131263 122082 -163739
9337 31197 -54786 189274 182827 2985 35326 -212269 -72640 96675 -128361 -222386 83279 -27903
9324 9962 88794 -38514 11359 124903 -282762 51369 -56790 134859 -169108 -226370 -930 192282
9311 -63848 3167 -55738 -23276 -103486 -6384 -295521 -126491 -183892 -292795 -208726 -71981 -49066
9299 -49066 -96582 -32372 270001 222487 -247688 -60218 -176579 -412550 -272892 -176429 -83552
9287 -89259 -32555 211484 -243736 -275707 -124522 -51291 -64822 -97522 153113 3985 -162903
9275 -187055 -256329 -122078 -279234 -67948 -186949 38539 77984 -96122 -11067 55731 -41018
9263 69887 -64524 81692 -243392 -272847 166656 -245195 -64772 -163774 -266474 188493 -207102
9251 25460 232959 -10444 -246294 -102621 191325 -45433 -160953 12246 -120555 -153181 -281314
9240 -281314 -22047 -123952 -187213 74163 -333288 -10630 107334 -305016 56465 -424826 171056
9228 34668 133750 -9376 -216162 -76687 -136257 -221674 19067 108418 -459189 -109637 47143
9216 116424 -220472 -320024 192467 75133 -142647 -64821 -83689 -162742 -17394 140450 -231218
9204 -7629 -401601 245346 -134621 170859 132525 360589 -6693 -175212 -38881 -51233 150021
9192 -275952 -237891 66051 -142532 -90490 58583 -91852 -330443 -183863 33943 -624170 -67106
9180 2623 190740 -356074 198493 -213594 -119716 5959 -220397 -230561 244875 -169737 -234385
9169 -234385 -58980 258254 -428147 -235021 85067 -14763 225767 -93012 -51836 314439 -410186
9157 -74417 142457 39756 -84869 -51464 -3920 109134 -148595 -193092 33781 -113357 -180999
9146 -180999 -344749 -64275 87292 -23982 -273821 4240 133667 156696 325780 105247 -49438
9134 -52811 -151495 -66677 -121665 57510 123986 138121 4731 -134344 -33915 -19435 168470 -253543
9121 -237148 -286942 210235 157386 -102479 111674 -35507 -238854 -64361 43085 29351 -278838
9109 -276290 135615 216325 -114073 -440662 -81975 172642 63474 -328655 -106841 119353
9098 -9643 -153937 120256 8912 48439 166812 -64621 266112 -320388 -179339 50442 205691
9087 205691 6433 -255185 -149886 6671 -178667 104358 205566 148448 -134885 -188481 76793
9075 -5518 -430483 -48266 -40984 86194 -152405 -111556 -109379 50299 -87976 160654 24318 83000
9063 83000 -104574 -214635 -424175 -45722 -84135 31681 -424059 -22548 165458 36462 11838
9051 -91392 -101852 -27342 -214833 -26761 86424 -45322 -69447 2525 -24822 -100531 -61733 17138
9038 113274 -339285 -84163 -144589 -308252 -53780 -135217 124105 -116310 -2070 54554 185669
9027 185669 -245091 110621 -26299 329 -102764 -255064 -321929 -156158 -118525 68336 -289258
9015 183493 60375 -139681 -159639 145336 -85252 122301 88792 263051 -331365 456851
9004 127566 300622 -27333 -873 -260389 -354041 -31164 -15937 50198 37026 -90360 -53476 -229447
8992 -229447 -45016 -375241 -347413 60966 -139962 -10673 75711 -48454 -264702 56334 -255597
8980 -38621 14347 160117 -188302 -145983 57684 113048 -378246 -25378 -142075 115837 56580
8968 -19995 20246 -235655 -281157 -202679 73795 69346 -216663 -24728 95355 -167361 -55684
8956 -428262 -191097 -95906 -76219 -108432 -161458 -94235 225587 -65003 -210531 -84073 58935
8944 -528661 -32502 263488 1204 3124 3840 194193 -190757 27793 43935 108439 210236 -251088
8931 -87753 -24660 -366643 213166 204711 456841 315545 78178 556052 1215264 6800162
8921 6800162 4870275 931367 531916 222971 315078 -134419 185124 48755 60207 110305
8911 110305 -275201 -94565 307503 418728 -43822 -204953 82772 -52128 20169 157052 -23019
8899 -60520 -389577 -23619 -62742 51036 -369368 24149 -98038 -114295 71668 -291067 -183919
8888 -183919 -140770 -40381 -1603 -133063 -61440 -119404 -168959 -21873 133765 -11012 -4991 34399
8875 30917 -205354 -134011 21560 31038 -103845 -433169 68329 -26816 -423740 171317 15823
8863 141418 -52717 496478 -204814 65112 49166 -186852 -81079 -368025 -30365 359283 -240780
8851 -94670 233302 57249 -170236 140944 -9808 100392 -486368 37783 245608 -176716 67471
8839 -187161 -227280 -412351 29451 -145411 130186 71597 -75407 -206370 75800 -165792 17807
8827 -104874 92489 -253659 -89531 58584 82370 234749 278984 -3207 -2326 -81163 125124 -90432
8814 -776 107457 -114838 1690 -398007 140048 -212084 -392327 -80268 -237051 -145464 168992
8802 6937 23001 -41591 -295241 -144634 -170859 233901 -210201 86285 241110 -292084 -82425
8790 -40367 173027 -509330 -7347 -13361 -200422 -38584 206958 -342487 174023 105363 47269
8778 -167726 64624 31671 -79758 -82613 79179 297073 -112534 -35405 98562 1617 271439
8767 271439 -86781 52899 -396105 -217351 -58567 16536 -251629 -209704 189974 -64866 -39321
8756 -39321 -217882 -252918 -219766 65361 44039 -270358 -177882 1086 6379 256751 -158987
8744 -234795 -223605 -32062 -68599 189804 91991 235964 -315079 -106924 36661 -446436 423785
8732 162039 -418985 69201 -5930 15644 -323252 24693 -68779 82051 -137891 -70303 -50660
8721 -50660 -304708 51924 -328473 175902 27362 -5054 26014 -184663 17236 -195828 20318
8709 -179620 -166648 -287 78767 113395 -65496 -62841 206923 -57439 59165 -176565 268793 68657
8696 -339871 -119346 -57851 -36542 -5884 -211909 52754 -24750 -146460 129429 227329 -148558
8684 -26009 -217384 21981 -225970 -181212 248445 -56567 -532560 135193 -142951 188007
8673 -102861 -151063 75551 176621 -301481 38642 -143169 -114915 -246439 -195055 -211547 -13494
8661 -64416 -119259 -119973 -162879 -68407 -65402 256359 -169766 -282036 230253 -246539 -415926
8650 -415926 116115 -118598 -70763 6583 -218405 49019 -151715 74141 -79099 99602 4415
8638 123427 55475 -244987 196674 -147397 49801 -100890 -274947 -60985 325518 97543
8627 154768 -96495 -112135 -159372 -149249 -203405 -75360 -423106 79311 11651 167619 -4757
8615 20021 -128488 119875 -480608 -295195 33022 -183499 130752 -111635 -115233 -145052 113520
8603 -329624 64355 293506 561860 -375738 -306856 -88685 125271 -64381 -148801 -78311 80082
8591 -89790 -62140 -196496 132547 -161980 -194463 -204750 -375402 -2606 241461 -354025 132905
8579 -173597 47316 69190 -182602 -285534 -262924 329449 -161721 61822 -235626 -161022 -186504
8568 -186504 96207 -69053 -189919 -134323 -221280 -3439 5971 -190463 220752 7892 -193481
8556 -102681 -255750 303039 44136 -182532 -235576 -255292 -252601 121987 482430 170551 -249730
8544 -312879 127778 252805 16436 222221 -74288 197939 16031 73483 -11653 74376 109367
8533 109367 -46496 142491 -61245 -110004 -74016 -51839 -152334 82353 4155 8546 20431 -133243
8520 -103577 123172 -156260 85302 -4195 51066 -98867 -193839 4474 -24416 143648 268307
8509 268307 -273483 166994 -400233 -23019 222808 148836 -137835 -299612 -160772 -14507
8498 89558 -169136 -101028 -55285 -65140 -26066 -149143 -344587 -229015 -116742 -79811 154315
8486 -91881 -433395 -68548 -269048 19085 40258 207091 125688 -5900 -146955 -124363 23282
8474 -116431 5827 -229816 -224441 36066 -207083 102157 203209 -262134 270712 155243 97150
8463 97150 115074 150527 -266566 -69744 185278 -262205 68743 -150314 -73406 -185713 -109990
8452 -109990 154790 -122685 53696 -134684 -97813 97396 -60165 -283270 -91830 229183 -23395
8440 78461 -312763 84722 108813 -151656 -216409 -348524 -562843 -14540 -174 151782 -120140
8428 45636 -8712 -294581 -227808 36509 -50194 -115099 19469 -46421 -38280 185526 214135 290851
8416 290851 -49365 45860 -19485 326280 -190251 -85587 33206 205330 43901 338138 -258391
8404 -343198 340337 -258256 80891 69771 -264156 -189463 28378 -19820 -206372 115452 60073
8393 60073 50370 119009 -45956 67610 -87634 -16110 -165360 -181120 59036 -40809 -187096 -314106
8381 -314106 115723 -197467 203285 -243305 -278285 -304324 -192412 -102494 -390164 -128710
8370 -26045 -2483 7185 146997 -287334 50030 -301518 290125 -105375 -29263 -63917 105537
8358 266228 19535 19685 278450 -66699 -53647 -265515 46072 66411 -315922 142121 243722
8347 243722 6918 223768 -57954 185046 -8833 -32846 -42612 -85505 -148009 284663 -88901 -108809
8335 -108809 -114305 -74494 -185919 -172945 -269242 -362394 -305252 -426932 -217848 -109102 105790
8323 -461849 -130617 -166356 43638 -21323 223289 525079 44790 -54514 12211 22211 127721
8312 127721 -133039 -229651 -100259 -41526 65775 -132322 -169485 -10617 37287 -241249 -20322
8300 -124635 57593 92997 -252932 -75350 84781 181141 14440 -106491 139447 57366 -149284
8288 -32056 45024 -212626 -142951 -135517 -247564 -18789 -39395 -172610 -33865 30395 -289195
8276 117705 135659 -29524 42899 -143872 -363035 -102665 -358005 -209533 -345353 44680
8265 407614 -168426 58094 69986 -97476 87252 -118825 -38160 71309 -285916 -312358 -139671
8253 -24765 121379 -109771 -14274 205467 -47095 64772 30859 -31170 -70362 -230937 -100167
8241 -35393 44587 -108886 -115804 -255095 -127039 63771 -24363 -142567 -161784 -257962 114099
8229 -202419 112303 131655 -119063 -30697 25611 -120034 91539 -260726 -219902 -32452 7609
8217 -16642 111730 -205785 176601 -87414 349702 146211 -353020 62431 -431297 -5560 348055
8205 129359 120790 -388099 -118244 33477 -234287 -321104 -235290 -39485 160119 356363 -306817
8193 16270 -325354 -97921 40892 -24376 -181285 -473831 -109225 -194653 -310924 -67005 102907
8181 13584 130971 325853 176696 -137696 -24735 -122636 126471 -77784 -139099 248124 -145191
8169 -168499 21442 -60629 -50110 -286930 -13488 -88537 -101397 78332 213419 -297829 167196
8157 -111896 -178111 13537 -4985 44960 -68397 361962 37995 -81283 7476 -184436 -321538
8146 -321538 -302315 -73780 594 -91850 -269857 -51678 -18211 188489 -60469 -246301 -72268
8134 182926 -359877 -240707 46340 204077 -256833 -317730 35900 18116 189112 87274 -233666
8122 -60735 -125049 -46227 -84150 305469 -123190 -74060 -148846 82888 -218931 -136993 -89041
8111 -89041 -123849 297700 -429702 -253277 292822 -227979 116613 -121592 -111326 -40360
8100 -112812 220782 -203226 -161991 -415045 8500 115005 65795 -144859 13888 -69863 155267
8088 -123143 -250406 -66293 130269 81421 23319 368412 -18633 -76306 -247596 35032 -265950
8076 83577 -97516 -226122 -101977 196035 23525 195191 -101204 -431157 23676 59253 67921
8065 67921 22116 165241 48410 18049 30477 -375908 -48233 165004 -116837 -86498 -189811
8054 -189811 290382 12769 4125 150310 -100466 83873 -282147 -33033 -37868 197007 280955
8043 280955 106120 -60174 -427448 -2725 -231986 -196390 194658 165298 207888 -100848 6588
8031 -193737 153004 143781 -196803 68452 75211 -44473 -79723 -89478 -292456 -39627 142161
8019 -231963 -183435 -168150 -42791 -116546 -84984 59015 -358298 119273 -145163 -80982 158220
8007 -42304 158250 -205162 -50847 185630 -254185 -152076 -13856 82931 97405 -123513 -224795
7996 -224795 -158856 155638 -279658 153596 -113595 12540 134058 -192466 -129905 10605
7985 -49077 180958 -213472 322078 296135 12451 -283248 29110 90394 -37024 -58304 22597
7973 -48418 268487 -19155 -140395 134630 90367 -147842 -265991 -182301 -283697 11407 -131970
7961 -123798 -264524 -392122 138592 -9492 -244560 75170 43423 -158938 241645 19062 7952
7949 -342821 3243 -214155 -93582 24245 14433 -351405 -190929 256631 120043 -210324 -1428
7937 139982 -220396 -269732 -14954 -163246 -87832 -260404 -5174 -180416 13203 6121 -2107
7925 124342 -265434 -105176 -207226 -98326 -13545 102625 29272 171851 110110 -264393
7914 -42958 190582 164534 -103963 -178532 144440 287098 -347029 -229407 -106117 -129678
7904 -129678 71419 95495 -198375 -191645 -130313 -104217 -134694 -199038 -198098 -18227 60819 -58862
7891 -109863 -110743 -138048 223038 -148792 50986 -119222 -35575 253696 -68724 -68596 325531
7879 70082 -3132 -94621 -26705 184921 62976 -256986 -101808 94807 -223585 -77685 160383
7867 75746 -212734 2662 -118769 151645 39600 261880 168215 -213327 -142400 -325613 -207400
7856 -207400 142405 182542 94650 41259 58556 -240601 234822 -187940 247039 -126025
7845 3139 26322 37492 384210 -20972 -37296 10998 117157 203310 40286 138033 26197 55393
7833 55393 -60735 -157634 -165851 261009 -119651 241344 -94797 -275029 -287695 -166689 -122910
7822 -122910 -13589 -132324 -474264 -241871 56565 -46853 -433424 115338 -225657 -135332
7812 -135332 227158 -122510 261875 -57265 169734 -39150 -177012 171877 -153210 8775
7801 62093 -328183 -235327 -158625 -46233 2505 -134341 -450801 4175 39399 -260162 127980
7789 11624 -60288 52835 150418 -92901 42258 139042 -132755 210200 -70408 400858 98289
7777 117395 -148793 -85053 2892 -16235 63421 -144262 -71447 282784 68931 18360 40112
7766 40112 -6641 -7604 130574 -191039 -259788 -92602 -387686 -167812 159600 2415 176286
7755 176286 -143447 -210739 86450 -112551 -130829 189075 32971 9527 87974 64491 139553
7744 139553 313833 181754 -79858 -279198 171375 113813 6543 -102144 -227258 -68359 83292
7732 -124090 -310587 -118757 1933 -119789 21665 -439391 -59386 26799 384992 224667 -20406
7720 -102417 110461 -98036 9685 59544 55129 -54392 -48381 -120817 -59497 -304022 -336999 147485
7707 193694 -289432 215955 106680 -214267 -43860 257 -7300 -343130 -185180 149953 -137554
7695 60774 -190687 -166613 80676 -13467 -246638 -2351 216131 105414 -136178 -21048 -72068
7684 -72068 -121242 185366 -122822 -243319 74939 -23971 66490 23153 -207386 17731 -37144
7672 -262410 -204839 12193 278362 -463280 137313 -158247 -52185 -173008 69031 -100799
7661 -308717 -33251 -193730 -113943 -216208 -180454 12860 -282880 106490 -24248 60587 -66979
7649 159357 140733 -21646 245378 -69243 52695 -413177 220762 299985 24756 164185 -342249
7637 -55376 -172753 37427 -268090 18131 -22445 -242626 -4973 -114309 -142595 256389 152105
7626 152105 -108261 -125647 54365 -31895 68256 8932 -301002 -209786 88013 122014 -275112
7614 -10835 -79299 271473 -62719 -106440 -62770 -101352 -243069 269020 -46130 -15530 15125
7602 -71518 86661 -106836 -130028 -12947 247295 154564 145309 -239705 -284885 -53307 -302791
7591 -302791 39490 -94548 -53946 -34119 -344110 -48962 -116353 18761 185123 -205653 -93556
7579 -255605 26013 -80004 116950 -40522 -24429 118275 -278966 -231524 -238231 44419 -14067
7567 309470 67523 -179070 -63167 -101729 144250 -29758 -142665 -204693 82408 176194 -170822
7555 -387322 9019 56970 -28320 -52246 -179417 96980 31334 -82029 178728 76635 -2517 98160
7542 38883 145012 -271087 12638 -358164 -90936 -310271 190454 195410 -198222 253237 -44922
7530 -78103 -77843 263569 229576 -282535 36221 175645 -256354 152644 -34613 -107373 2223
7518 -91714 221199 194037 42828 -195500 -42676 10061 403474 -235851 -57931 41802 425
7506 -57235 4252 -270055 -39770 217836 271219 -71043 168360 -123756 -217306 30468 31348 -117032
7493 -51738 -74550 -188489 -72552 29481 185961 -301667 -33401 215603 43675 -52146 117344
7481 61134 -273528 158732 -159592 -44770 178647 -42775 76570 -306525 -248395 146405 -34628
7469 10224 179006 -179690 -18146 -78385 -179190 -113804 -248024 234472 35571 -44017 -25401
7458 -25401 -124362 -194875 229063 -103955 -25262 -227528 -348040 191851 -286538 -368933 -102594
7446 90729 -227330 -320300 -255179 -38322 134628 170848 -39153 -105939 -51943 47670 378731
7435 378731 -95347 109874 -5921 77513 283848 181542 -57151 235332 -22072 -12586 3420
7423 -34357 65567 -142170 -47457 13355 49519 -86308 -37182 310439 -70607 290038 -44700
7411 -51207 -269590 154703 -127439 -44452 119402 309491 -163372 158777 -177536 -317087
7401 -317087 45390 -341719 45227 111762 199089 191401 -109827 9514 176008 42778 232543
7390 232543 -105275 -133847 59524 -522752 9930 139123 -292442 -51014 62141 -230086 -126310
7379 -126310 -92568 -133846 -20700 -84521 71565 -144815 -119297 202730 2446 -58699 -3982 -114810
7367 -114810 119400 46533 49430 -75235 -19766 28393 -118267 283400 76182 35653 -174275
7355 355726 124917 -283508 319378 -474148 -145882 95635 -576347 84129 -69569 -152217
7345 -152217 -211201 88858 -107494 88775 188594 209278 56309 191642 64057 46652 138006
7334 138006 90243 -93968 226621 -88277 194417 70554 56940 -75612 159025 114457 -252691
7322 -161292 -33304 -338606 -138222 -18148 -117461 -74082 90573 -233504 116931 -134506 61483
7310 -82239 -27270 -140566 -318576 -106666 52036 -67413 6911 -180867 -86434 50608 -216991
7298 -148382 -51194 -81490 63367 -68195 -284749 -89269 130120 -85413 86963 118529 -195301
7286 82201 46068 -146173 -166821 -70977 469919 -82412 93992 -55455 -43078 -186716 67358
7274 -119093 110396 5309 64335 149940 -242832 -36660 -187917 30258 182215 161339 250776
7263 250776 204260 181579 -29109 35433 -300883 -316762 -91092 -218749 -220420 130475 -29066
7251 -236368 146476 37516 -21487 -25629 -44496 -333110 -9695 -133985 199633 82958 -13863
7239 2439 -78337 346079 -143072 -111280 -39072 34121 -50581 -25745 7229 154613 -84598 -229700
7227 -229700 -12154 207813 -151662 -127760 -113591 -90761 -317244 68414 232517 159912 166477
7216 166477 -93196 -98633 139195 -90582 171885 -2429 46953 -23698 -95424 -24930 335078
7204 -168011 58858 -64342 -279092 -195241 143798 -3969 49593 -125925 -22369 95222 1339
7192 149970 150231 -66436 -51943 107072 -93179 -227626 71418 -348000 -192227 92944 278144
7181 278144 139682 35792 -163041 -297727 196531 -178125 -6150 169240 38334 124081 -241885
7169 206703 -297981 -195740 -254131 -161886 -46914 32435 133230 16170 34069 3887 165088
7158 165088 9734 -220948 316452 229591 470005 -139676 355814 -43939 -215203 7694 -166950
7146 -87882 99914 10310 188972 386628 -157468 245594 -8979 -46857 114077 143735 50290
7134 32123 250305 -34872 147326 -273874 49405 -141822 -6742 -343636 164440 12255 -54088
7122 -104076 -225809 120442 58367 60745 63587 186317 -137746 232793 215870 -137229 17003
7110 -38691 148061 -205705 -183319 -52430 -171152 -16014 -128383 40918 149868 129780 -19129
7098 -234939 -77160 239115 48544 -398439 -22344 -218185 -92695 114616 -153080 158829
7087 -143881 5758 116137 -393049 -143 69435 -254305 -693 34582 162972 40499 -269622 17541
7074 -162226 222675 -56706 -50891 -229577 86460 223386 -281077 227395 -51218 -111114 59236
7062 -197327 157402 -77559 175761 12869 4058 25502 -309805 27119 213054 144698 -252609
7050 8742 467255 237199 11962 159956 -242243 -32705 225562 -101289 -4573 29428 75237
7039 75237 -81774 210215 -32504 40202 306091 -4582 -204230 -66072 92855 14692 -39513
7027 -112982 -16719 126129 -246286 -114708 35938 31990 299190 -56324 328605 162699 -131214
7015 -173938 97982 -2425 -200388 -64689 -209191 68237 -355066 147068 141922 -346159 82909
7003 155089 -98815 58496 -518845 101398 92763 142595 -323238 -171368 -133644 -87210 -121566
6992 -121566 83208 -62910 -91684 6304 -271966 -194596 18266 -47256 24375 211640 -69396
6980 46471 -214545 -92318 8757 84238 209070 -196275 226428 91561 -397903 -133286 27286
6968 -443549 -81064 298458 126825 156941 156166 96527 69423 -68600 -145292 46290 -208630
6956 -246871 224504 -138485 -362470 115544 154169 207677 -180906 -87753 -209097 277289
6945 -63055 2524 197902 -139077 -129465 121931 224583 45768 -161835 14460 -90723 -811 -308655
6933 -308655 18011 18832 -211927 -37295 -69203 298385 -196879 148609 226839 -87246 -96946
6922 -96946 -169119 134349 235684 -15523 -90591 -90892 21535 -51551 -215992 302808 -96736
6910 81251 -45712 -329288 -75131 -237612 -104592 -250625 -45244 84387 -261612 164711 204217
6899 204217 -9355 47402 -110776 -90778 176302 -42957 21427 340606 237618 55437 22108
6887 -35259 139421 14445 -130938 311753 -123159 -345998 87119 -343131 180712 302245
6877 302245 62156 -224045 -23001 -105996 -32385 -103383 -15443 5283 -37835 405938 -59860
6865 26223 -83016 -49325 -183459 150076 68464 240080 200857 -204366 36600 -551227 206481
6853 -14949 -131192 -177054 -169207 112573 56859 87212 -309350 146961 159311 190684 -58411
6841 95932 91041 106701 -209045 50733 -334422 -199913 53928 -264513 -33748 80734 -34027
6829 -8416 -176701 -235336 98702 210818 -108990 103861 112190 -126742 15430 7087 19696
6818 19696 -87427 41027 -252 381417 233666 27911 -90994 103440 -38131 -33156 -109243 -207889
6806 -207889 -89397 -132379 146039 95758 231414 94918 103958 63907 308632 163239 -108853
6794 16384 -29077 -95732 -129671 -153732 146150 -191178 123251 -62384 118721 278429 110537
6782 81579 150545 -248729 36068 -182219 -145815 202519 130500 -37972 100106 -54581 -130662
6771 -130662 137888 39152 -332749 -251920 -328220 90725 -140451 -156672 38190 -31824 185279
6759 -122774 66669 -123328 45361 -11956 -36342 261307 269032 -99534 -140010 153295 123985
6748 123985 -220868 194507 144394 -190378 22353 -327802 95850 31376 170528 10575 -251282
6736 99954 -256413 -149826 -268906 10757 31741 40870 -277455 -278774 -14003 386469 292494
6725 292494 -61631 -194349 232870 43608 -84842 72177 -280488 108417 -94963 210161 -84320
6713 -43593 159431 107700 -146809 -15754 -213373 -81542 7159 -99693 187746 65219 -196246
6701 -46994 -162901 264346 -157966 75948 -37218 -147511 -31285 139725 46187 251709 56443
6689 -82124 -88403 -258349 432196 101792 377671 -125586 -423095 219317 16698 245495
6679 245495 204147 11200 -89984 -408101 44831 -125049 227708 147337 3511 -205784 -230062
6668 -230062 148276 -75296 167095 -359929 11800 -32995 -221462 -20818 34667 158800 78370
6656 207022 -128118 -68444 -17249 13889 77905 38175 91572 16665 -261748 -9812 65553
6644 -64220 12503 183399 -211992 36558 -17622 -99542 -287590 -189022 -123389 49740 175564
6633 175564 -109288 -214657 -11714 -99252 -280257 -375902 -99088 87478 41145 -39999 -147540
6622 -147540 138182 65982 289146 -161850 313635 -672 269428 77695 360406 467550 -347900
6610 -202945 27453 -9565 64406 136457 -462996 304974 -57677 109149 29785 -158993 -27429
6598 -250833 -195385 -11069 265950 -343989 -24035 -161935 47068 -158313 -96465 390246 19690
6586 -337532 -30764 -320958 -337235 269965 208668 -217329 -1760 -33200 73610 78751 39701
6575 39701 -69773 -185145 88063 96943 -3443 -227375 -139174 -96701 20737 405918 -99601 -35313
6562 98352 -148593 158016 10895 -2625 97981 -331843 363430 299807 33736 -6195 129056
6550 2149 188171 -113256 62904 -42680 -241722 228973 158403 -13741 31149 211372 -53331
6538 -161462 22724 -125728 -216973 -60652 -206586 -356627 -97191 -54318 -37958 -86781 9715
6526 -310584 371998 -21069 -39333 245884 42638 -92063 203096 -20685 -221617 -179314 50765
6514 -16553 -11613 380034 74071 -360000 4946 129916 328377 -293123 -49871 165020 -185427
6502 -117897 45757 -7907 160824 -74993 43258 -88590 -18508 174103 8770 93396 186538 -327400
6489 -28015 -131160 27534 183401 -202234 -318966 -194645 -178129 -244168 121238 60164 47374
6478 47374 -72839 -318443 -214082 -46163 -68739 -95123 -11906 -275088 -101561 -68400 77673
6466 212559 27772 -78937 376515 -269960 -82520 -15287 5822 -54510 157406 -260933 53142
6454 16289 90044 -139354 160060 -34204 -328947 -137213 37038 -59789 -29478 -132463 -143559
6443 -143559 281127 135737 140593 -16688 -397764 -105658 128433 -199771 3137 -58071 -120478
6432 -120478 -142434 -225134 22053 -362343 24459 -13466 -105941 -28546 39414 -90156 157667
6420 126914 16070 -66060 -51801 186687 160785 39805 206872 -249547 -284082 -70014 -232727
6409 -232727 64840 67916 437742 39998 385937 -31007 -217341 -162928 -31990 90815 -329265
6397 53882 -18744 193307 68459 65356 133805 -344118 -208447 -113687 -32805 -215454 112888
6385 -357188 -93367 -170851 180622 60105 -91184 396965 -105023 -30506 104998 246226 218080
6374 218080 -183116 68093 -115238 90299 -237218 47970 101649 -98633 -324231 -84173 -143610
6363 -143610 -126310 218088 -198423 43759 316593 41128 -98016 140308 -262263 394260
6352 266159 19707 -227393 190004 21865 40764 121594 141729 307047 -268898 -251169 36424
6340 205994 -184041 151202 130181 104509 44647 33039 -38342 -156037 -59381 -4769 178860
6328 40285 -229556 211871 183286 107307 53658 -12510 -37478 128396 -4397 31738 -166542
6316 22808 -273237 28640 -65527 -24890 327793 236149 -802 245534 58606 -52793 -241129
6305 -241129 50664 -149805 -304343 -53982 180172 -209336 -116174 29114 -139203 -143553 294346
6293 -32109 24667 -170559 27600 -337723 -81483 -232054 -247575 -149530 195837 -153274 -95972
6282 -95972 116815 29411 111362 165747 -103076 37826 -203289 247387 23445 -180133 -202598
6271 -202598 -75629 62724 231909 19577 75319 64688 -240997 140412 141 4911 -128180
6259 204758 -144401 13420 -27969 -276265 34633 -73006 65241 195228 301689 315450 -246267
6247 161188 75142 -42253 -174092 -585763 41078 -288932 -73067 -243943 15463 187210 23657
6235 -150494 250767 -32216 102103 -160405 -47745 100960 27299 -10306 12197 194467 51143
6223 234797 282972 -91422 298636 62206 117974 -224979 -49567 18735 -247945 -88737 90278
6211 -64013 171838 286402 21199 -222628 263545 149368 -248702 -108659 28388 -62206
6200 54328 -326849 385425 -230716 146416 -215507 -15491 -73090 46332 -142604 -71127 93825
6188 6882 134653 -222289 168494 857 -208822 -165670 311127 -94747 -60563 -148041 204002
6176 -131296 -330787 -156876 -214556 -52602 83625 93579 245460 -75199 -362138 -230113 55912
6164 34563 143461 -119471 -143701 -132032 -5876 300584 99298 31540 -95411 -268040 -172619
6153 -172619 163762 -232239 176064 44151 -145264 124416 266472 -170047 -73011 -142739
6143 -142739 241063 -110262 -197013 -106882 392760 -183105 -87195 -35039 -146938 22202 71443
6132 71443 -250833 108900 -119112 -150212 -17519 71561 -93429 -13131 143373 -237790 233982
6120 -248452 77344 -217936 -55122 378079 40313 253406 120444 -14773 9823 57857 -42720
6108 -130523 98990 16673 -168957 -12862 -11323 -70913 238515 27086 81883 127767 222243
6097 222243 362041 -81657 65192 242340 218846 308491 -161002 -197360 249648 -201549 36610
6085 -109568 107660 145840 -178354 -186410 -43106 266033 -198478 170204 381309 -136507
6074 230306 144178 -68360 8016 -5465 -130733 -201842 -161581 170151 -64593 -170007 394985
6062 -17556 57638 24412 -79031 -244403 132408 127470 96226 -281889 -155873 -196316 -74480
6050 -44646 85799 31537 40964 39534 39115 -45893 91012 -27693 8919 -109287 -56554 305025
6037 -178268 235476 -163582 4649 -257665 118888 -136096 -364690 -132956 322617 -85502
6026 -100005 -828 -109600 301881 80188 -98811 -1966 118027 -164463 -18412 112641 72704
6015 72704 -157177 82159 -276579 8622 -178971 27023 58623 176621 84473 46873 -52999
6003 -130737 -88206 94412 181369 -149246 -263517 -92177 314299 239615 -331784 -214920 -119072
5992 -119072 523007 248966 106304 -214 -267560 -29187 110609 -11575 276294 212579 200686
5981 200686 177041 -79294 -112584 -137893 12781 -122758 225476 84753 -264408 -39096 -33326
5970 -33326 -195421 -218851 -7790 19982 -259024 253752 -178326 -156354 -148087 -316874 -122999
5958 -84160 146383 207662 -69938 53923 -109864 228867 -37732 -120677 -7953 293410 53496
5946 211115 55239 -8867 -166820 -78351 238883 -255143 -316122 -20188 180313 90598 243603
5935 243603 116866 -133656 169791 -127232 132298 153041 -473842 -129956 122154 43836
5924 97646 -70896 -181221 -362247 -336684 -120402 -28887 -29940 -50894 -88367 -111426 -122801
5913 -122801 -78912 44168 -268900 -322670 -60240 75805 -244345 211750 265729 214157 -145747
5901 44212 -53273 -129706 87106 -373444 184719 -127233 -62924 200758 -45781 -116345 514613
5889 -116423 52619 71532 50297 -116859 -176477 -44376 78260 94345 -352440 239140 29884
5877 491706 258519 169177 -17175 -148769 -276467 -169731 -111228 -253311 -100619 -11827
5866 246111 -345424 128974 -187743 -342334 164643 66949 -249171 57804 -265172 150484
5855 -41680 -142240 -33675 -86221 -200630 -100787 353728 -94338 24811 -279225 -153466 226587
5843 124261 25895 -62393 -303950 67972 -182316 166976 161528 484963 211138 139770 7579
5831 -111951 -135791 -155457 -237796 -169055 -201157 -69003 -35606 155646 137765 -10542 158027
5819 -28459 -122507 -175430 50699 -88702 -307137 -121637 -170063 281579 71474 -221541 29988
5807 354794 70283 -343124 -140499 97096 244617 -69463 27226 -82405 39956 -180396 104403
5795 -69348 187917 -58305 -319387 -263937 4930 -62949 -472219 -147125 -246313 175081 248012
5784 248012 -117953 -237566 -241058 -90180 130356 -64813 -253 -84472 -92811 46807 -122256 46842
5771 94793 -16679 -170961 46060 147863 -143235 145628 97400 141140 88724 252213 -1555
5759 209066 -115834 -491519 -57095 185704 -44578 -190429 -147928 983 -212690 -267950 143276
5747 100956 285375 -315582 18234 99697 -43869 35581 -4423 244417 -34334 -87927 216138
5735 240903 -3280 -70636 -74065 -240918 155216 110005 127907 9993 135329 145931 -120128
5723 -118116 -256442 -101472 -31262 -127858 -87884 -307748 -24751 -64364 160177 76236 -244552
5711 103347 -108406 388650 -182680 -57557 -372693 105073 -541286 -89897 -29946 -264578
5701 -264578 -87374 362428 192893 -178110 231920 -54342 43147 56602 -26597 -207057 142693
5689 126316 27589 68305 79262 102918 -74522 157894 5114 -130233 5039 -431284 -347770
5678 -347770 152778 38645 60041 175258 -115385 86608 -57295 -158589 124615 140843 -435590
5666 98326 -168310 31013 -82645 -105240 -41516 -29385 -65047 -56183 -144083 -191558 210110 33634
5653 57206 6669 -42494 201156 -119850 -344432 102058 201969 160303 274474 83038 -53935
5641 24668 270909 -166902 -155854 -137542 80851 -420723 57502 -221839 7015 -251639 -157538
5630 -157538 -58495 297541 270604 207975 -254366 140753 -78029 323220 53283 -484451 72210
5618 -53608 -54225 -26864 -125934 100975 -226306 167354 -272545 -43282 -130166 121929 -381934
5606 -164878 -13912 -189583 -103503 49327 109603 213449 491080 -119778 427217 121180
5595 -114325 78147 90392 17338 -62831 229642 162198 -123853 143258 73094 9744 172733
5584 172733 -133592 -54524 -175133 -312718 282117 -275990 -138296 217571 -112603 2644
5573 77808 45228 14001 209217 87653 20854 -546203 -26877 17735 -128420 -33016 195600
5561 -245226 49983 178872 -216551 284601 404798 170553 -161160 118879 69319 -2118
5550 -77727 85917 22135 165780 -136161 -114911 -221829 -169787 -7224 -35722 -83346 -51911
5539 -51911 -219139 64061 -39614 -213945 73087 -185004 298820 -42903 -297619 -68355 216552
5527 -35335 172582 -15946 -209214 -57607 114295 -199208 -20813 49552 118756 39931 212085
5516 212085 116313 48437 113381 187628 29754 -97768 -268863 124129 197611 555731 152242
5504 -23247 -129352 -19998 167551 4938 -11248 -21620 -208721 159316 239395 -101490 -227286
5493 -227286 -62353 -124398 -107086 139249 -83068 -141148 -100476 4591 170150 -127418 292311
5481 66951 -232338 21440 -113122 97478 88110 30970 19342 199177 -111334 -166551 -392406
5470 -392406 69268 -22389 -275044 -145654 95880 28990 -526555 163226 143054 -104779 186348
5458 57708 231571 135707 -139252 6209 -132488 227917 6676 -120500 50450 -140944 28965
5446 96830 -174476 177780 253989 272446 -138240 126719 96951 -207215 -43329 -178772 13856
5434 21972 24480 -184113 -13053 -205384 410613 -15466 100796 -13218 10819 117841 35239
5422 -5249 79576 237648 68917 220439 342555 -136915 185665 185199 100702 42560 222291
5411 222291 75559 -112059 -189104 -88629 -12247 53518 37368 -133008 55180 -20806 -11909
5400 -11909 53178 166738 -187927 -10841 347163 82023 -151644 347937 -83402 26615 77883
5389 77883 177559 -184520 113679 189203 -66503 151578 107782 -107492 51407 33912 143268
5378 143268 -251098 404839 134228 161456 -256449 -8315 -24565 44612 107879 -15109 -134841
5367 -134841 -82787 112466 123405 -90188 142009 -28712 38663 -370998 102969 11117 -86400
5355 192444 -227030 -97816 -102926 48641 304336 -166261 32271 -6897 105180 111095 -211873
5343 -162361 -290605 -254220 187996 -38408 -123235 132042 -190076 -170023 14613 45646 -7204
5331 -120576 -90657 341654 -183528 414650 5801 126547 171778 86869 12257 -341166 109567
5319 -112089 26567 81544 47310 -229332 -300048 -58576 172507 -333242 1084 54174 -265133
5307 256107 -74728 -7034 -76725 -70310 -197619 79083 -329741 100165 -277662 222893 -40496
5295 34576 -2651 -82408 -158827 -187935 186496 15926 -220590 -190421 -238706 -200823 283075
5283 51797 -108335 48683 -64641 141675 18230 -88636 70787 53746 -138173 303723 -117356
5271 74445 169971 11134 186440 264652 -14596 5576 -12783 -118370 119988 322130 -102515
5259 169165 -172887 -226507 -255091 25635 -77189 -134825 289013 -315963 -28471 118095 6946
5247 -89488 241343 54676 -313638 25430 -17575 310112 85039 112527 -246138 -52491 -245287
5236 -245287 4911 214779 -77336 -104145 51225 -185501 25910 -31884 -96467 101775 132684
5225 132684 37764 -59552 -227077 -139119 85363 70806 258333 17155 23444 -171248 -194840
5214 -194840 120168 146684 -99795 138911 199407 -135108 -175664 228577 184435 256438 39840
5202 -585 -163957 42143 -31897 250211 -86438 43006 -170905 -199073 -229094 -79700 262953
5190 -33557 74875 -20636 -189112 -18186 -63622 111376 -125992 -259445 353900 -174371 133206
5178 -38270 101429 70517 287718 -284816 27653 -211273 -35967 -227517 -43856 22257 165867
5167 165867 235290 101280 -53198 -196922 -131241 155728 -116715 278797 10240 120173
5157 120173 259440 -242869 -258313 2248 -247401 -103178 265202 178610 -251557 305587
5146 300261 -100718 -113269 259789 -266847 174401 -218817 51713 200781 263512 31310
5135 -169299 18965 -311960 -34429 170633 -53780 40876 -242073 -206288 -81432 -153015 71668
5123 248028 171987 207736 116995 140568 -207904 225454 299396 392199 112290 -9230 -157409
5112 -157409 119290 -204216 277212 -202669 -25905 -89704 -9397 -98951 9274 270886 -163645
5100 -110298 219968 131639 -56412 -67552 197697 -230813 22640 182964 -95915 13285 76252
5089 76252 -270339 -28510 -419280 100741 -145217 36502 70460 -161324 95175 -201591 150414
5077 233480 -223764 128182 156102 -174276 116113 319724 87452 61040 94140 391298
5067 391298 83841 -21427 37353 -83509 57863 -160338 150900 -119776 83312 -122271 113533
5055 -195443 -278372 161928 -8620 83334 137334 57247 130975 365857 -293976 105455 -201935
5043 171995 -314320 76060 323298 24026 97919 -8613 -356731 60145 217876 -164318 -1296
5031 -30294 54330 -159506 300827 -59340 -158055 -334857 6314 104731 -15236 -122313 -49873
5019 304363 106766 17189 70593 179413 -161533 -76397 -17134 97611 162615 99530 160534
5008 160534 160005 -150115 -244415 206960 73514 97260 196247 253173 -83937 -138821 121485
4996 -39631 169421 -82555 17351 -153170 201196 268181 -7096 -235880 161355 -178114 44815
4984 -12975 -13288 227844 -15827 -168983 -167365 289958 -6844 -45743 -324414 -263378 566452 -153496
4971 -94437 84980 -196982 -23434 152009 17221 -77549 -230945 -74015 62173 -5482 210186
4959 -62992 -124314 41131 -138948 149274 -86499 90093 263204 156188 -110920 -202307 -116586
4948 -116586 426151 -115086 -220064 49773 28401 24007 -13170 -115042 -75540 -205480 111949
4936 245003 124741 219772 -22224 -86233 -27413 104081 -148861 102761 112675 -121041 93649
4924 3453 46086 233328 208328 280306 -128920 -37658 -136952 345710 -35874 112757 -132279
4912 -379788 187559 -106598 86742 58836 4657 -51060 149079 205383 -102662 -157363 -222829
4901 -222829 -39866 69391 29091 171772 -47461 -327635 -95510 232465 201295 323762 186207
4890 186207 -44905 50479 198224 130834 -110127 -319960 98839 118959 97538 196076 180206
4879 180206 -75159 259481 158369 119679 -96424 -166683 -273484 290799 18102 -298643 -110335
4867 95843 -33149 453044 177687 162918 -95743 -139332 76504 -559 151563 -82345 162788
4855 -241319 171286 -398373 -169571 288640 202954 -22921 -101683 90939 83438 -286603 23356
4843 -124679 195270 32262 -131978 468202 -76380 -15649 5025 -55793 -42338 84318 -223799
4831 134079 393672 99050 -148589 -62690 -132321 113245 404930 192354 225345 237417 6569
4819 -93095 -234177 -277692 -80556 199859 53922 140547 279338 -94853 141338 131147 -39049
4807 33374 -79858 414067 120852 -328555 65670 -508931 -235907 12699 -58995 -17529 -84966
4796 -84966 94551 1400 -317421 152435 345282 239765 289342 -41732 -150537 -155158 -31769
4784 -217278 -136539 -108141 -72969 -168204 -44277 122241 -16758 -64069 95604 97671 -151939
4772 -50423 128024 -74103 475975 182981 -32321 -78937 -129915 33847 -11101 -40628 -19979
4760 -139792 2076 168860 182572 -115026 184680 124030 -293255 -100834 23121 -74060 -31459
4748 59796 -347284 -208190 155250 84651 -218022 35465 57264 -94668 64451 -82791 -27617
4736 -17449 95183 -75850 -34375 -243513 -195961 -26350 -109810 121282 97915 152501 -82345
4724 -5053 71059 -208801 263576 270684 256112 329125 37185 198874 117567 -76371 214980
4712 -130354 44010 177900 252683 54780 -40342 -227542 52435 136970 -8655 209233 29062
4700 187957 260956 123834 -668 -321828 44935 414471 -16977 27846 -198358 -165250 -343101
4689 -343101 -103056 237378 199675 -275100 -51536 151695 -112740 -45390 34162 -32828 198142
4677 -100830 167517 -222021 -7612 292670 185886 -298581 -128745 110547 -270875 25862
4666 -46383 -30689 -170287 -15588 77179 6586 -256512 55288 277722 146332 318153 -56880
4654 191698 -38843 -222287 75590 21159 125049 -37221 -102882 197080 -147505 209237 573377
4643 573377 -180935 189944 -191312 41127 -213053 -21245 365363 -134326 115714 130276
4633 130276 278422 -15837 25918 145766 18945 -105457 -51201 81087 -203803 30316 -265912
4621 -263791 247012 221600 1342 177432 117222 -248939 196785 92378 6072 -141247 -200018
4610 -200018 -176145 -138368 -116514 -146415 -266271 262218 238401 -137769 70561 -43874 139180
4598 -103551 -102085 147285 -11311 220326 -209857 73758 -208417 75638 -195658 124629 131561
4587 131561 -252622 -141918 187802 269884 97944 -471313 -200380 -187058 112476 7743 -125595
4575 -204688 -320782 99160 -86810 -111955 -13661 -232558 -107192 -53659 137701 -56814 -45028
4564 -45028 -96879 -308867 -154761 -141462 234924 79243 173534 171037 71481 -54190 -388377
4553 -388377 -96050 -19657 254110 230128 264298 -131740 -113898 36573 191855 -370569 125960
4541 -312071 -90120 66616 -6243 11393 -59142 127128 -55856 -179047 268371 -395267 -180473
4529 39002 -45268 -258665 -117106 167508 89489 -279832 -31713 -158073 -303913 112081
4518 -280015 86992 -22137 -194390 -311457 111557 -22003 27749 -62643 149511 111815 291862
4507 291862 -42837 -108050 -64858 -27801 -87197 13491 -126588 -15173 -53946 -340312 -143489
4495 3272 -344591 -268346 81098 196404 364256 25049 -295880 -21390 100220 167664 -70668
4483 -190031 98912 16678 -129873 146298 224728 270504 -61018 100302 -30573 -91381 187305
4471 170125 -127399 -243614 112257 6240 -138108 196772 182993 99353 -28794 122241 13791
$$ [...]
##END NTUPLES=NMR SPECTRUM
##END=
