
##TITLE=AC1300_CHIAH12112_6534624_r4z7lKFjlq
##JCAMPDX= 6.0         $$ Bruker NMR JCAMP-DX V2.0
##DATA TYPE= NMR SPECTRUM
##DATA CLASS= NTUPLES
##ORIGIN= BRUKER
##OWNER= Administrator
$$ 1.72 TOPSPIN		Version 2.1
$$ 2012-07-17 02:29:05.078 -0500  Administrator@TOPSPIN
$$ Compression mode = diff/dup
##.OBSERVE FREQUENCY= 400.02188249412
##.OBSERVE NUCLEUS= ^1H
##.ACQUISITION MODE= SIMULTANEOUS (DQD)
##.ACQUISITION SCHEME= undefined
##.AVERAGES= 64
##.DIGITISER RES= 22
##SPECTROMETER/DATA SYSTEM= spect
##.PULSE SEQUENCE= noesygpps1d.comp
##.SOLVENT NAME= COFFEE_meoh
##.SHIFT REFERENCE= INTERNAL, COFFEE_meoh, 1, 14.96081
##AUDIT TRAIL= $$ (NUMBER, WHEN, WHO, WHERE, PROCESS, VERSION, WHAT)
$$ ##TITLE= Audit trail, TOPSPIN		Version 2.1
$$ ##JCAMPDX= 5.01
$$ ##ORIGIN= Bruker BioSpin GmbH
$$ ##OWNER= Administrator
$$ $$ C:\Bruker\TOPSPIN/data/COFFEE/nmr/AC1300_CHIAH12112_6534624_r4z7lKFjlq/12/pdata/1/auditp.txt
$$ ##AUDIT TRAIL=  $$ (NUMBER, WHEN, WHO, WHERE, PROCESS, VERSION, WHAT)
(   1,<2012-07-17 02:29:00.265 -0500>,<Administrator>,<TOPSPIN>,<go>,<TOPSPIN 2.1>,
      <created by zg
	started at 2012-07-17 02:17:30.015 -0500,
	POWCHK enabled, PULCHK disabled,
       configuration hash MD5:
       6B 1B 68 BB D9 2E 58 E2 7F 35 AD 54 07 DF 0E 41
       data hash MD5: 64K
       30 86 27 28 56 4F 4D ED 8F 6F 57 35 43 89 1D 80>)
(   2,<2012-07-17 02:29:03.203 -0500>,<Administrator>,<TOPSPIN>,<proc1d>,<TOPSPIN 2.1>,
      <Start of raw data processing
       efp LB = 0.3 FT_mod = 6 PKNL = 1 PHC0 = 0 PHC1 = 0 SI = 128K 
       data hash MD5: 128K
       B2 66 DC C5 AF 9E A4 98 8E C6 2C 33 BF 8B B9 33>)
(   3,<2012-07-17 02:29:04.343 -0500>,<Administrator>,<TOPSPIN>,<proc1d>,<TOPSPIN 2.1>,
      <pk PHC0 = 4.301147 PHC1 = 0 
       data hash MD5: 128K
       83 89 D6 9C 10 CB F2 EF 6E 26 36 25 FC B3 07 28>)
(   4,<2012-07-17 02:29:04.578 -0500>,<Administrator>,<TOPSPIN>,<proc1d>,<TOPSPIN 2.1>,
      <abs ABSG = 1 
       data hash MD5: 128K
       59 B4 85 8D A3 A9 2D DA F0 01 9E 9B 56 B0 7C 48>)
(   5,<2012-07-17 02:29:04.640 -0500>,<Administrator>,<TOPSPIN>,<proc1d>,<TOPSPIN 2.1>,
      <abs ABSG = 2 
       data hash MD5: 128K
       93 ED 26 D9 B1 89 FD 67 DB 42 BD FA B0 06 3E 72>)
(   6,<2012-07-17 02:29:04.812 -0500>,<Administrator>,<TOPSPIN>,<proc1d>,<TOPSPIN 2.1>,
      <abs ABSG = 3 
       data hash MD5: 128K
       23 3A BB 02 15 89 9F CB 98 84 0D 53 4E 68 E3 A7>)
(   7,<2012-07-17 02:29:04.937 -0500>,<Administrator>,<TOPSPIN>,<proc1d>,<TOPSPIN 2.1>,
      <abs ABSG = 4 
       data hash MD5: 128K
       A8 AF 40 2F FE 75 A2 0F 1E 0D 8F F5 B0 9E 6F A9>)
(   8,<2012-07-17 02:29:04.984 -0500>,<Administrator>,<TOPSPIN>,<proc1d>,<TOPSPIN 2.1>,
      <abs ABSG = 5 
       data hash MD5: 128K
       5B 71 F2 D8 55 60 C6 66 A7 6E A9 6A 51 A0 A6 37>)
$$ ##END=
$$ 
$$ $$ hash MD5
$$ $$ 0E 07 BB 6C 60 0F FE E8 96 E9 EC B9 A5 FF 9B E5
##$RELAX= 
##$RELAX= 
##$RELAX= 
##$RELAX= 
##$RELAX= 
##$RELAX= 
##$RELAX= 
##$RELAX= 
$$ Bruker specific parameters
$$ [...]
##$TP07= 0
##$TPNAME0= <>
##$TPNAME1= <>
##$TPNAME2= <>
##$TPNAME3= <>
##$TPNAME4= <>
##$TPNAME5= <>
##$TPNAME6= <>
##$TPNAME7= <>
##$TPOAL= (0..7)
0.5 0.5 0.5 0.5 0.5 0.5 0.5 0.5
##$TPOFFS= (0..7)
0 0 0 0 0 0 0 0
##$TUNHIN= 0
##$TUNHOUT= 0
##$TUNXOUT= 0
##$USERA1= <user>
##$USERA2= <user>
##$USERA3= <user>
##$USERA4= <user>
##$USERA5= <user>
##$V9= 5
##$VALIST= <valist>
##$VCLIST= <CCCCCCCCCCCCCCC>
##$VD= 0
##$VDLIST= <DDDDDDDDDDDDDDD>
##$VPLIST= <PPPPPPPPPPPPPPP>
##$VTLIST= <TTTTTTTTTTTTTTT>
##$WBST= 2048
##$WBSW= 25
##$XGAIN= (0..3)
0 0 0 0
##$XL= 0
##$YL= 0
##$YMAX_a= 12200007
##$YMIN_a= -8897558
##$ZGOPTNS= <>
##$ZL1= 120
##$ZL2= 120
##$ZL3= 120
##$ZL4= 120
##$ABSF1= 14.96081
##$ABSF2= -5.597372
##$ABSG= 5
##$ABSL= 3
##$ALPHA= 0
##$AQORDER= 0
##$ASSFAC= 0
##$ASSFACI= 0
##$ASSFACX= 0
##$ASSWID= 0
##$AUNMP= <proc_prof1d_extract.lims>
##$AXLEFT= 0
##$AXNAME= <>
##$AXNUC= <1H>
##$AXRIGHT= 0
##$AXTYPE= 0
##$AXUNIT= <>
##$AZFE= 0.1
##$AZFW= 0.1
##$BCFW= 0
##$BC_mod= 0
##$BYTORDP= 0
##$COROFFS= 0
##$CY= 15
##$DATMOD= 1
##$DC= 0
##$DFILT= <>
##$DTYPP= 0
##$F1P= 0
##$F2P= 0
##$FCOR= 0.5
##$FTSIZE= 131072
##$FT_mod= 6
##$GAMMA= 0
##$GB= 0
##$INTBC= 1
##$INTSCL= 1
##$ISEN= 128
##$LB= 0.3
##$LEV0= 0
##$LPBIN= 0
##$MAXI= 10000
##$MC2= 0
##$MEAN= 0
##$ME_mod= 0
##$MI= 0
##$NCOEF= 0
##$NC_proc= -2
##$NLEV= 6
##$NOISF1= 0
##$NOISF2= 0
##$NSP= 0
##$NTH_PI= 0
##$NZP= 0
##$OFFSET= 14.96081
##$PC= 1
##$PHC0= 4.301147
##$PHC1= 0
##$PH_mod= 1
##$PKNL= yes
##$PPARMOD= 0
##$PPDIAG= 0
##$PPIPTYP= 0
##$PPMPNUM= 2147483647
##$PPRESOL= 1
##$PSCAL= 4
##$PSIGN= 0
##$PYNMP= <proc.py>
##$REVERSE= no
##$SF= 400.020009713691
##$SI= 131072
##$SIGF1= 0
##$SIGF2= 0
##$SINO= 400
##$SIOLD= 131072
##$SPECTYP= <>
##$SREGLST= <1H.CDCl3>
##$SSB= 0
##$STSI= 131072
##$STSR= 0
##$SW_p= 8223.68421052631
##$SYMM= 0
##$S_DEV= 0
##$TDeff= 65536
##$TDoff= 0
##$TI= <>
##$TILT= no
##$TM1= 0
##$TM2= 0
##$TOPLEV= 0
##$USERP1= <user>
##$USERP2= <user>
##$USERP3= <user>
##$USERP4= <user>
##$USERP5= <user>
##$WDW= 1
##$XDIM= 131072
##$YMAX_p= 447366643
##$YMIN_p= -11139
##$CURPLOT= <Network HP LaserJet P1505>
##$CURPRIN= <$Network HP LaserJet P1505>
##$DFORMAT= <normdp>
##$LAYOUT= <+/1D_H.xwp>
##$LFORMAT= <normlp>
##$PFORMAT= <normpl>
##$SURQMSG= 1
$$ End of Bruker specific parameters
$$ ---------------------------------
##NTUPLES= NMR SPECTRUM
##VAR_NAME=  FREQUENCY,     SPECTRUM/REAL,   SPECTRUM/IMAG
##SYMBOL=    X,             R,               I
##VAR_TYPE=  INDEPENDENT,   DEPENDENT,       DEPENDENT
##VAR_FORM=  AFFN,          ASDF,            ASDF
##VAR_DIM=   131072,        131072,          131072
##UNITS=     HZ,            ARBITRARY UNITS, ARBITRARY UNITS
##FACTOR=    0.0627417313425164, 1,          1
##FIRST=     8223.62146879497, -3327,        -54300
##LAST=      0,             -2296,           -55631
##MIN=       0,             -11139,          0
##MAX=       8223.62146879497, 447366643,    0
$$ Real data points
##PAGE= N=1
##DATA TABLE= (X++(R..R)), XYDATA
$$ [...]
63922D066073m6756p7002j06227j32889j55277j72184j83366j89509j91673j90683
63912B620507j86940j80735j72534j62788j51667j39268j26050j12777j00013
63903A287735q7985p6881o6880n7835m9285m1139l4007k8559k4662k1477j8318
63892G80707j5242j2805j1467j1179j1430j1695j1763j1603j1044r926q525p321
63880F46707o169m220j092K364M996O863R166J2719J7051K1066K4130K6323K8138
63867G88042L0111L2512L5111L7422L9173M0319M0682L9860L7705L4558L0943
63856A186438K7247K3637J9963J5716J0563M956k34m803r309j3927j8007k1134
63844A221106k3944k7153l0410l2982l5159l7853m0933m3052m3400m2626m1695
$$ plain form
63922 4066073 4019317 3942315 3836088 3703199 3547922 3375738 3192372 3002863 2811190 2620507
63912 2620507 2433567 2252832 2080298 1917510 1765843 1626575 1500525 1387748 1287735
63903 1287735 1199750 1122869 1055989 998154 948869 907730 873723 845164 820502 799025 780707
63892 780707 765465 752660 741193 730014 718584 706889 695126 683523 672479 662553 654028 646707
63880 646707 640538 636318 635226 637590 642586 649449 658615 671334 688385 709451 733581 759904 788042
63867 788042 818153 850665 885776 923198 962371 1002690 1043372 1083232 1120937 1155495 1186438
63856 1186438 1213685 1237322 1257285 1273001 1283564 1288520 1288286 1283483 1274174 1260247 1242240 1221106
63844 1221106 1197162 1170009 1139599 1106617 1071458 1033605 992672 949620 906220 863594 821899
63833H21899m0684l9317l7846l6581l5015l2368k8887k5810k3976k3015k2075
63822D76325k0800j9367j7878j6140j3969j1570r571q556q497q673q392p669o989
63809C18254o503n829m711l481k655k350k339k506k907l405l577l133k317j670
63795B70871j436j383j225j091j345k057k828l249l268l049k652k077j476j035
63781B42700p82o67q43j452k189k450k060j572j530j666j216m6R50Q44j35p93
63765B27093l86M64O39mn30k84J99L6p42j285j095n15j06n2l09p33r45n38K50
63746B21157N60M3m38J70J593K450K005J051P99J436K221K604K670K599K321J830
63730B45071J431J359J483J654K078K957L970M565M690M761M887M745M352M295
$$ plain form
63833 821899 781215 741898 704052 667471 632456 600088 571201 545391 521415 498400 476325
63822 476325 455525 436158 418280 402140 388171 376601 367030 358474 349977 341304 332912 325243 318254
63809 318254 311751 305922 301211 297730 295075 292725 290386 287880 284973 281568 277991 274858 272541 270871
63795 270871 269435 268052 266827 265736 264391 262334 259506 256257 252989 249940 247288 245211 243735 242700
63781 242700 241918 241251 240408 238956 236767 234317 232257 230685 229155 227489 226273 226227 227177 228021 227886 227093
63765 227093 226707 227171 227810 227806 227276 226992 227191 227227 226485 225200 224105 223590 223484 223432 223123 222390 221445 220907 221157
63746 221157 221717 221760 221322 221492 223085 225535 227540 228591 229390 230826 233047 235651 238321 240920 243241 245071
63730 245071 246502 247861 249344 250998 253076 256033 260003 264568 269258 274019 278906 283651 288003 292298
63716B92298M800N091M321K828J728J399J065l2j662l032l729l907l805l406k529
63701B91428j271l20n12j803k921k571q79R04J959K460K641K273J436J015J779
63686B95618L377M759N209M657L363J841P40L58M16N77Q39J138J051L97k56k31
63670C23853L76R55J236J363J416J374J425J701J890J550O54n55j957l329m129
63655C27823m186m254n093o213o439n575m571m013l444k456j459r08m88L03J293
63640B80320J961K217K425K795L201L422L352L039K705K631K925L559M531N721
63626C24804O718P141P160P268P613P942Q191Q607R250R930J0725J1996J3773
63613D41118J5677J7542J9578K1711K3427K4575K5709K7294K9075L0561L1673
$$ plain form
63716 292298 297098 302189 306510 309338 311066 312465 313530 313498 311836 308804 305075 301168 297363 293957 291428
63701 291428 290157 289837 289325 287522 284601 282030 281151 282055 284014 286474 289115 291388 292824 293839 295618
63686 295618 298995 303754 308963 313620 316983 318824 319564 319922 320338 320915 321754 322892 323943 324340 324084 323853
63670 323853 324229 325184 326420 327783 329199 330573 331998 333699 335589 337139 337793 337238 335281 331952 327823
63655 327823 323637 319383 314290 308077 301638 296063 291492 287479 284035 281579 280120 279212 278724 279027 280320
63640 280320 282281 284498 286923 289718 292919 296341 299693 302732 305437 308068 310993 314552 319083 324804
63626 324804 331522 338663 345823 353091 360704 368646 376837 385444 394694 404624 415349 427345 441118
63613 441118 456795 474337 493915 515626 539053 563628 589337 616631 645706 676267 707940
63602G07940L2398L2172L0071K5478J8556J0366K590l371p274r636j0664j0249
63590H18377r023q320q718r547j0371j2020j5348j9728k3640k6164k7204k6823
63578F21471k5319k3413k1472j9019j5840j2981j1509j0727q948n845k749o51
63566D62998P84K083L143L944M960O281P250P533P689Q180Q650Q825R337J0792
63552E52449J2657J4019J5095J7029K0323K4309K8346L2759L8252M4649N0417
63541H50304N3226N0974M2798K9690J4359K41j0019j5675j7769j7798j6494j3996
63529I49841j0866q288p165p519r057j1869j6114k1304k6422l0674l3806l5778
63517G30979l6514l6042l4579l2408k9810k7122k4634k2397k0243j8047j5843
$$ plain form
63602 707940 740338 772510 802581 828059 846615 856981 859571 856200 848926 839290 828626 818377
63590 818377 809354 801034 792316 782769 772398 760378 745030 725302 701662 675498 648294 621471
63578 621471 596152 572739 551267 532248 516408 503427 491918 481191 472243 466398 463649 462998
63566 462998 463782 465865 469008 472952 477912 484193 491443 498976 506665 514845 523495 532320 541657 552449
63552 552449 565106 579125 594220 611249 631572 655881 684227 716986 755238 799887 850304
63541 850304 903530 954504 997302 1026992 1041351 1041592 1031573 1015898 998129 980331 963837 949841
63529 949841 938975 930687 923522 916003 906946 895077 878963 857659 831237 800563 766757 730979
63517 730979 694465 658423 623844 591436 561626 534504 509870 487473 467230 449183 433340
63506D33340j3708j1702r960q683p896p376o898o467o119n592m509k996j848j704
63492C37882k185k218j375m30l60j011j274m86P51J381J220J163K041L615M869
63477C43583N208N051N096N388N477N256N035M716L612J445r88k648l407l873
63463C78951m343m596m536m385m181l651k740j778j007l82J09L18K91L27N22P30
63447C49649J090K010L356M284M407M632O090Q522J0518J1328J1708J2848J5133
63434D45575J8342K2489K7816L4009L9759M3011M1743L5109K4522J3402N017L02
63422G51096j928k684j567J969P108J2299J7051K2132K7950L3588L7670L9511
63410I44195L9046L6218L0929K3424J4431N071l298r519j3212j4803j4946j4203
$$ plain form
63506 433340 419632 407930 397970 389287 381391 374015 367117 360650 354531 348939 344430 341434 339586 337882
63492 337882 335697 333479 332104 331674 331314 330303 329029 328543 329294 330675 331895 333058 335099 338714 343583
63477 343583 348791 353842 358938 364326 369803 375059 380094 384810 388422 389867 388879 386231 382824 378951
63463 378951 374608 370012 365476 361091 356910 353259 350519 348741 347734 347352 347461 347779 348070 348397 348919 349649
63447 349649 350739 352749 356105 360389 364796 369428 375518 384040 394558 405886 417594 430442 445575
63434 445575 463917 486406 514222 548231 587990 631001 672744 707853 732375 745777 750794 751096
63422 751096 749168 746484 744917 746886 753994 766293 783344 805476 833426 867014 904684 944195
63410 944195 983241 1019459 1050388 1073812 1088243 1093314 1090016 1080497 1067285 1052482 1037536 1023333
63398A023333j3272j2925j3484j4862j7306k1399k6834l1913l4986l6009l5996
63387G64347l5355l3673l0957k8084k5777k3870k1766j9167j6153j3035j0257
63376E06253q122o475m935l384j874k02J883M108N853P039Q340J0289J2705J5079
63362E46557J7155J8895K0302K1609K3356K5965K9301L2758L5676L7763L9219
63351H48556M0357M0899L9768L5932K9408K1211J2486M143l010q341j1713j3307
63339A036389j3322j2285j1433j1959j3843j6151j8507k1525k5580k9939l3407
63328H28438l5256l5315l3807l1447k9019k6461k2963j8285j3202q262k956K877
63316E74342P463P959L081n647j5066k2379k6229k6779k5109k2319j9032j5697
$$ plain form
63398 1023333 1010061 997136 983652 968790 951484 930085 903251 871338 836352 800343 764347
63387 764347 728992 695319 664362 636278 610501 586631 564865 545698 529545 516510 506253
63376 506253 498131 491656 486721 483337 481463 481261 483144 487252 493105 500144 508484 518773 531478 546557
63362 546557 563712 582607 602909 624518 647874 673839 703140 735898 771574 809337 848556
63351 848556 888913 929812 969580 1005512 1034920 1056131 1068617 1072760 1069750 1061409 1049696 1036389
63339 1036389 1023067 1010782 999349 987390 973547 957396 938889 917364 891784 861845 828438
63328 828438 793182 757867 724060 692613 663594 637133 614170 595885 582683 574421 571465 574342
63316 574342 581805 589764 592845 587198 572132 549753 523524 496745 471636 449317 430285 414588
63304D14588j2947j1208j0129q876p093n194l720k702j843j166j116j905k910
63291C43779l137k428j814k255l375l949l475k572j919j560j385j541j995k283
63277C10091k058j436o26L14J081J163N70l1k35l68p02q19k64P09J531J987K189
63260C13096K310K730L794N046N460M875M431M915N564N381M798M873N482N613
63246C78368N131M972N627O640P649Q855J0339J1850J3422J5289J7064J7945J8045
63233E21196J8540K0205K2471K4368K5621K6416K6703K6291K5303K4094K3036
63222G84244K2525K2853K3877K5071K6064K6818K7346K7634K7791K7767K6959
63211A068949K4640K0713J5434Q639J53q981j6824k2560k7231l1983l6345l9029
$$ plain form
63304 414588 401641 390433 380304 371428 364335 359141 355421 352719 350876 349710 348594 346689 343779
63291 343779 340642 338214 336400 334145 330770 326821 323346 320774 318855 317295 315910 314369 312374 310091
63277 310091 308033 306597 305971 306285 307366 308529 309099 309068 308833 308465 307763 306944 306680 307389 308920 310907 313096
63260 313096 315406 318136 321930 326976 332436 337311 341742 346657 352221 357602 362400 367273 372755 378368
63246 378368 383499 388471 394098 400738 408387 417242 427581 439431 452853 468142 485206 503151 521196
63233 521196 539736 559941 582412 606780 632401 658817 685520 711811 737114 761208 784244
63222 784244 806769 829622 853499 878570 904634 931452 958798 986432 1014223 1041990 1068949
63211 1068949 1093589 1114302 1129736 1138375 1138528 1129547 1112723 1090163 1062932 1030949 994604 955575
63199I55575l9726l9290l8418l6994l4563l1005k6727k2501j8879j5586j1934
63188F39952p997m812k930j432Q95L904O480Q183R571J0926J1733J1721J1573
63175F97767J2059J2939J3321J2855J2086J1617J1400J0948J0087R124Q245P016
63163H29464M729J247k805o768j0544j4295j7883k0960k3360k5098k6078k6192
63151F61457k5617k4621k3144k0951j8267j5838j4204j3155j2092j0692r044p396
63139D66436n974m944m275l745l218k788k518k182j547p54j66K04P03J453K089
63124D38774K253K132K223K756L578M381M890M947M701M553M635M615M297M142
63110D92877M628N271N083M045L267L418L768L346K359J734J749J900J895J931
$$ plain form
63199 955575 915849 876559 838141 801147 766584 735579 708852 686351 667472 651886 639952
63188 639952 631955 627143 624213 622781 623676 627580 634060 642243 651814 662740 674473 686194 697767
63175 697767 709826 722765 736086 748941 761027 772644 784044 794992 805079 814203 822448 829464
63163 829464 834193 835440 832635 825867 815323 801028 783145 762185 738825 713727 687649 661457
63151 661457 635840 611219 588075 567124 548857 533019 518815 505660 493568 482876 473832 466436
63139 466436 460462 455518 451243 447498 444280 441492 438974 436792 435245 434491 434325 434529 435232 436685 438774
63124 438774 441027 443159 445382 448138 451716 456097 460987 465934 470635 475188 479823 484438 488735 492877
63110 492877 497505 502776 507859 511904 515171 518589 522357 525703 528062 529796 531545 533445 535340 537271
63096E37271K095K230K399K811L173K841J873J259J721K671K855J779J36j049
63082E64065j363j132q33n13J84J477L049M378N234N701N915O116O786Q221R975
63067F17260J1201J1643J1912J2722J4226J6193J8285K0073K1237K2124K3673
63056H00549K6458L0063L3723L7189M0645M4071M7236N0188N3255N6470N9349
63045A279196O1306O2117O1962O1201O0207N9227N8436N8097N8552N9862O1612
63034A941775O3274O4605O5424O5142O2891N8222N1293M2339L1287J8183L651
63023B468086j1434k6563m1527n5782o8377p8617q6346r1422r3400r2131q8368
63012A734119q3252p7360p0746o3659n6516m9166m0999l2095k3586j6438j0422
$$ plain form
63096 537271 539366 541596 543995 546806 549979 552820 554693 555952 557673 560344 563199 564978 565114 564065
63082 564065 562702 561570 560737 560224 560408 561885 564934 569312 574546 580247 586162 592278 599064 607285 617260
63067 617260 628461 640104 652016 664738 678964 695157 713442 733515 754752 776876 800549
63056 800549 827007 857070 890793 927982 968627 1012698 1059934 1110122 1163377 1219847 1279196
63045 1279196 1340502 1402619 1464581 1525782 1585989 1645216 1703652 1761749 1820301 1880163 1941775
63034 1941775 2005049 2069654 2135078 2200220 2263111 2321333 2372626 2414965 2446252 2464435 2468086
63023 2468086 2456652 2430089 2388562 2332780 2264403 2185786 2099440 2008018 1914618 1822487 1734119
63012 1734119 1650867 1573507 1502761 1439102 1382586 1333420 1292421 1260326 1236740 1220302 1209880
63001A209880m784N22M936Q242J0790J2912J4708J6320J7827J8896J9077J8604
62989A347930J8384J9048K0238K0942K0324J8278J5440J2577R682N835L00o480
62977A502498j3391j9946k6425l2830l8493m2874m5983m7750m7654m5612m2765
62966A098775m0588l9305l7672l4514l0180k6183k3608k2091k0493j8345j6247
62955G89549j4872j4087j3381j2766j2717j3327j4055j4298j3834j2725j1285
62944F42202j0137r864j0391j1023j1201j0914j0403r778r024q154p251o522o205
62931E21335o182n863m804l329k166j545j114o09j34J57J95j02o17q62n85l88
62915D93387r89k006k256j460o81q10j370j404r04p02j254k092k445k105j571
$$ plain form
63001 1209880 1205096 1205618 1210554 1218796 1229586 1242498 1257206 1273526 1291353 1310249 1329326 1347930
62989 1347930 1366314 1385362 1405600 1426542 1446866 1465144 1480584 1493161 1502843 1508678 1508978 1502498
62977 1502498 1489107 1469161 1442736 1409906 1371413 1328539 1282556 1234806 1187152 1141540 1098775
62966 1098775 1058187 1018882 981210 946696 916516 890333 866725 844634 824141 805796 789549
62955 789549 774677 760590 747209 734443 721726 708399 694344 680046 666212 653487 642202
62944 642202 632065 622201 611810 600787 589586 578672 568269 558491 549467 541313 534062 527540 521335
62931 521335 515153 509290 504486 501157 498991 497446 496332 495723 495589 495746 495941 495839 495222 494360 493775 493387
62915 493387 492398 490392 488136 486676 485995 485185 483815 482411 481507 480805 479551 477459 475014 472909 471338
62900D71338j482j817j886j225k44L67N42N78L92j98p02m27L31N56N2l14n3L44
62882D66152N36R22J584J736J005L16O10J415J603J049O29Q76J425J597J031r6
62866D82390j125j514j590k169l148l357k255r25n99j032j173q41o43o76m07L28
62850D61264J102J557J614J130J06q86j119n42K62P99Q87N30l8m02n04p63j236
62833D63761j275n55K14L25K05O08J250J265O30J11P5L34R28K027L145L509L177
62816D79734K910L001L123L293L908M851N411N344N123N128N306N644O191O615
62802E45582O605O674P669R458J1080J2191J3311J4499J4999J4591J4273J5042
62790F85974J6840J9124K1750K4733K7924L1422L5682M0765M6035N1062N6265
$$ plain form
62900 471338 469856 468039 466153 464928 464684 465051 465593 466171 466563 466365 465663 465236 465567 466123 466175 465861 465808 466152
62882 466152 466688 467610 469194 470930 471935 472251 472861 474276 475879 476928 477557 478433 479858 481455 482486 482390
62866 482390 481265 479751 478161 475992 472844 469487 467232 466307 465708 464676 463503 462662 462019 461343 460936 461264
62850 461264 462366 463923 465537 466667 466773 465887 464768 464226 464488 465287 466174 466704 466666 466264 465760 464997 463761
62833 463761 462486 461931 462145 462470 462675 463283 464533 465798 466428 466539 466614 466948 467876 469903 473048 476557 479734
62816 479734 482644 485645 488768 492061 495969 500820 506231 511575 516698 521826 527132 532776 538967 545582
62802 545582 552187 558861 566530 575988 587068 599259 612570 627069 642068 656659 670932 685974
62790 685974 702814 721938 743688 768421 796345 827767 863449 904214 950249 1001311 1057576
62779A057576O2310O9373P7242Q5496R3295R9636J04211J07388J09026J08077
62769A973630J03745R6285Q6098P2868N6428L7871J8817j06j9139l7947n5241
62758B333309o9893q1693r0752r6837r9836j00484j00028r9053r6957r2902q7087
62747A317787q0711p4723o9115o3557n8142n3070m8112m3043l8244l4195l0681
62736G24194k7205k3965k1581j9967j8317j6211j3932j1763r748q178p373o948
62724E39006o087m678l305k160q97L39Q75P38P97J421K076K601L651N355O791
62709E46523P527Q533J0671J3384J5814J8166K0889K3508K5503K7626L0867L4784
62697G83795L8121M0713M3414M6344M8628M9862N0594N1217N1294N0174M7426
$$ plain form
62779 1057576 1119886 1189259 1266501 1351997 1445292 1544928 1649139 1756527 1865553 1973630
62769 1973630 2077375 2173660 2259758 2332626 2389054 2426925 2445742 2445636 2426497 2388550 2333309
62758 2333309 2263416 2181723 2090971 1994134 1894298 1793814 1693786 1594733 1497776 1404874 1317787
62747 1317787 1237076 1162353 1093238 1029681 971539 918469 870357 827314 789070 754875 724194
62736 724194 696989 673024 651443 631476 613159 596948 583016 571253 561505 553327 545954 539006
62724 539006 532919 528241 524936 522776 521879 522218 523093 523831 524628 526049 528125 530726 534377 539732 546523
62709 546523 554050 562583 573254 586638 602452 620618 641507 665015 690518 718144 749011 783795
62697 783795 821916 862629 906043 952387 1001015 1050877 1101471 1152688 1203982 1254156 1301582
62686A301582M2640L5662K7123J8001Q586j438j1904k1987l1117l9203m5901n0535
62674A231509n3114n4514n5308n5071n3283n0366m7236m4197m0862l7030l3205
62663G07323l0107k7838k5726k3105k0182j7781j6254j5034j3524j1888j0540
62652D95344r355p955o480n408m866m709n012n758o283n810m563l563l310l311
62638D18961l012k427j700p89K08R21J200J299J407J431J323J120O35k84j139
62623D19154j087o7R67J276J143J190J474J764K163K864L652M179M534N087N925
62608D54218O809P584Q268Q901R634J0795J2509J4295J5508J6236J7426J9905
62596F02088K3510K7355L0900L4512L8831M3743M8284N1519N3264N3756N2948
$$ plain form
62686 1301582 1344222 1379884 1407007 1425008 1433594 1432156 1420252 1398265 1367148 1327945 1282044 1231509
62674 1231509 1178395 1123881 1068573 1013502 960219 909853 862617 818420 777558 740528 707323
62663 707323 677216 649378 623652 600547 580365 562584 546330 531296 517772 505884 495344
62652 495344 485989 478034 471554 466146 461280 456571 451559 445801 439518 433708 429145 425582 422272 418961
62638 418961 415949 413522 411822 411033 411241 412162 413362 414661 416068 417499 418822 419942 420577 420293 419154
62623 419154 418067 418000 418967 420243 421386 422576 424050 425814 427977 430841 434493 438672 443206 448293 454218
62608 454218 461027 468611 476879 485780 495414 506209 518718 533013 548521 564757 582183 602088
62596 602088 625598 652953 683853 718365 757196 800939 849223 900742 954006 1007762 1060710
62585A060710N0543M6459M0869L3756K4969J4782M045o421j6291k5452l3536l9979
62573A154454m4459m7137m8470m8808m8134m6260m3422m0437l7985l5960l3807
62562F79575l1367k8884k6319k3303j9934j6910j4578j2414r901p491o100n862
62550D76512o048o162o401o831o701n204k765r29o74j236j070J99J457J749J497
62535D37393J577J826J351P3r68r83l26K86P48J308J896K345K917M065N777P591
62519D66876R216J0750J2347J4031J5818J7769J9904K2214K4714K7289K9585L1281
62507G01794L2313L2656L2049L0233K7399K4097K0693J7128J3198Q763L765j705
62495I42383p141j1732j4856j6428j6659j5637j3277r669n382j311J954M680P740
$$ plain form
62585 1060710 1111253 1157712 1198581 1232337 1257306 1272088 1276133 1269712 1253421 1227969 1194433 1154454
62573 1154454 1109995 1062858 1014388 965580 917446 871186 827764 787327 749342 713382 679575
62562 679575 648208 619324 593005 569702 549768 532858 518280 505866 495965 488474 482374 476512
62550 476512 470464 464302 457901 451070 444369 439165 436400 435471 434797 433561 432491 432690 434147 435896 437393
62535 437393 438970 440796 442147 442220 441252 440269 439943 440229 440977 442285 444181 446526 449443 453508 459285 466876
62519 466876 476092 486842 499189 513220 529038 546807 566711 588925 613639 640928 670513 701794
62507 701794 734107 766763 798812 829045 856444 880541 901234 918362 931560 940323 944088 942383
62495 942383 935242 923510 908654 892226 875567 859930 846653 836984 831602 830291 832245 836925 844665
62482H44665J1605J5818J9691K3337K7430L1964L5853L8022L8356L7063L3726
62471A157530K7770J9775J1441M003k760r728j7210k4952l2704m0004m5704m8605
62459I98852m8847m8010m7518m7238m6002m3142l9131l4823l0660k6678k2910
62448E63893j9416j6084j2763r663p259n614m068j992L09J953K681L212M160N244
62434E04593N919O245O583O775O248M747K444m34l461n844p136p975r267j0734
62420D98703j1246j0614r853r457q664p040n604n424n957n906n079m285l844l355
62406D02375k752k488k647k826k924l138l166k344q03L71N44L90R41K287L623
62391C87443M187L861L098K540K454K484K172J673J567J972K450K740L064L558
$$ plain form
62482 844665 856270 872088 891779 915116 942546 974510 1010363 1048385 1086741 1123804 1157530
62471 1157530 1185300 1205075 1216516 1220519 1217759 1208031 1190821 1165869 1133165 1093161 1047457 998852
62459 998852 950005 901995 854477 807239 761237 718095 678964 644141 613481 586803 563893
62448 563893 544477 528393 515630 505967 498708 493094 489026 487034 487343 489296 491977 495189 499349 504593
62434 504593 510512 516757 523340 530115 536363 541110 543554 543120 539659 533815 526679 518704 509437 498703
62420 498703 487457 476843 466990 457533 448869 441829 436225 430801 424844 418938 413859 409574 405730 402375
62406 402375 399623 397135 394488 391662 388738 385600 382434 380090 379287 379658 380202 380592 381533 383820 387443
62391 387443 391630 395491 398589 401129 403583 406067 408239 409912 411479 413451 415901 418641 421705 425263
62377D25263M033M519N412O749P889Q300Q297Q502R022R587J0245J1374J3056
62364E32248J4882J6385J7547J8903K1157K4553K8566L2480L6228M0342M5009
62353H28300M9647N3561N6513N8395N8787N7147N3158M6640L7652K7018J6270
62342A343088O560j997r550j5755k0553k5078l0658l6928m1964m4530m5202m5020
62330A032413m3966m1480l7742l3547k9297k4934k0714j7267j4854j3224j2276
62319G43112j2262j3165j4417j5564j6701j7921j8821j8996j8706j8448j8139
62308E59972j7282j5836j4291j2867j1246r288p448o194n418m685l752k684j715
62295D47266j235j483k053k102j323l67M7J0R1N31J252K262L506M451M507L771
$$ plain form
62377 425263 429296 433815 439227 445976 453865 462165 470462 478964 487986 497573 507818 519192 532248
62364 532248 547130 563515 581062 599965 621122 645675 674241 706721 742949 783291 828300
62353 828300 877947 931508 988021 1046416 1105203 1162350 1215508 1262148 1299800 1326818 1343088
62342 1343088 1349648 1347651 1338101 1322346 1301793 1276715 1246057 1209129 1167165 1122635 1077433 1032413
62330 1032413 988447 946967 909225 875678 846381 821447 800733 783466 768612 755388 743112
62319 743112 730850 717685 703268 687704 671003 653082 634261 615265 596559 578111 559972
62308 559972 542690 526854 512563 499696 488450 479162 471714 465520 460102 455417 451665 448981 447266
62295 447266 446031 444548 442495 440393 439070 438703 438750 438760 438851 439382 440634 442896 446402 450853 455360 459131
62279D59131K938K550K744L584M992O371O876O290N269M672M875N715O788P767
62265E30562Q695R928J1601J3386J5126J7378K0802K5228K9921L4642L9782M5533
62253H02584N1510N7193O2078O5426O6535O5315O2014N6391M8015L7429K6149
62242A400639J5313N137m139j1883j8206k4464l1832l9897m7370n3537n8201o0821
62230A070739o0788n8393n4729n0619m6280m1913l7868l4203l0636k7071k3702
62219F04537k0603j7617j4759j2365j0684r616q865q245p800p696p879p778o671
62206D63959m575k450j272j101j339j515j440r66j61N20P56R22J674L021M374
62191D60407N429O453P629Q664R249R564J0077J1041J2309J3464J4119J4224J4093
$$ plain form
62279 459131 462069 464619 467363 470947 475939 482310 489186 495476 500745 505417 510292 516007 522795 530562
62265 530562 539257 549185 560786 574172 589298 606676 627478 652706 682627 717269 757051 802584
62253 802584 854094 911287 973365 1038791 1105326 1170641 1232655 1289046 1337061 1374490 1400639
62242 1400639 1415952 1421089 1416950 1405067 1386861 1362397 1330565 1290668 1243298 1189761 1131560 1070739
62230 1070739 1009951 951558 896829 846210 799930 758017 720149 685946 655310 628239 604537
62219 604537 583934 566317 551558 539193 528509 518893 510028 501783 493983 486287 478408 470630 463959
62206 463959 459384 456934 455662 454561 453222 451707 450267 449301 449140 449660 450416 451338 453012 456033 460407
62191 460407 465836 472289 479918 488582 497831 507395 517472 528513 540822 554286 568405 582629 596722
62178E96722J3970J3665J2883J1776J0843J0341J0128J0151J0738J2291J4887
62167G28395J8292K2217K6466L0960L5607M0155M4257M7644M9965N0401M7904
62156A142263M2240L4479K6017J7393Q591J59o911j2431j7323k2311k7044l0962
62144A154160l4347l7759m0760m2036m0914l8119l4827l1467k7792k3766j9808
62133G82565j6140j2343p944l265N92K689L019K413J845J899K657L891N394P145
62119G74417R084J0803J1785J2008J1900J1518J0093O866K191k478n671o788o203
62106H39525m932m200m769o543q913j1367j3453j4432j3545j0801p063l234K46
62093G36519L075M877N688O146O749P212P084O630O505O680O436N480M432L944
$$ plain form
62178 596722 610692 624357 637240 649016 659859 670200 680328 690479 701217 713508 728395
62167 728395 746687 768904 795370 826330 861937 902092 946349 993993 1043958 1094359 1142263
62156 1142263 1184503 1218982 1244999 1262392 1270983 1271142 1264231 1251800 1234477 1212166 1185122 1154160
62144 1154160 1119813 1082054 1041294 999258 958344 920225 885398 853931 826139 802373 782565
62133 782565 766425 754082 746138 742873 743465 746154 749173 751586 753431 755330 757987 761878 767272 774417
62119 774417 783501 794304 806089 818097 829997 841515 851608 858474 860665 858187 852516 845728 839525
62106 839525 834593 830393 825624 819081 810168 798801 785348 770916 757371 746570 739507 736273 736519
62093 736519 739594 744471 750159 756305 763054 770266 777350 783980 790485 797165 803601 809081 813513 817457
62079H17457L975M315N295P314R957J2225J3685J4794J6037J7247J7972J8129
62067I58402J7962J7721J7572J7727J8412J9835K2200K5355K8388L0049K9875
62056A203498K8420K6043K2103J6033Q778K230k777o999j1339j5759j9956k4240
62044A226035k9047l4000l8133m0905m2521m3395m3583m2850m1058l8502l5865
62033G96176l3681l1805k9589k6615k3080j9531j6527j4443j3115j1701r467o873
62021E59749n224n048n478n585n608o222p183p546o997o152n559n143m636l951
62007D79417k970j514J93J443J792J710K174L561N126N734N115M191L941M184
61993E14097L898K696J365O77L08o11k269m075n545o704p734q607r160r209q684
$$ plain form
62079 817457 821432 825747 831042 838356 848313 860538 874223 889017 905054 922301 940273 958402
62067 958402 976364 994085 1011657 1029384 1047796 1067631 1089831 1115186 1143574 1173623 1203498
62056 1203498 1231918 1257961 1280064 1296097 1304875 1307105 1304328 1297329 1285990 1270231 1250275 1226035
62044 1226035 1196988 1162988 1124855 1083950 1041429 998034 954451 911601 870543 832041 796176
62033 796176 762495 730690 701101 674486 651406 631875 615348 600905 587790 576089 566622 559749
62021 559749 554525 549477 543999 538414 532806 526584 519401 511855 504858 498706 493147 488004 483368 479417
62007 479417 476447 474933 475126 476569 478361 480071 482245 485806 490932 496666 501781 505972 509913 514097
61993 514097 517995 520691 522056 522733 523041 522430 520161 516086 510541 503837 496103 487496 478336 469127 460443
61978D60443p869p325p280p363p152o682o082n113l655k343k034k667l286l198
61964C88394k586j930j367q33l52j1J26n3n44r76q03Q8J217J953K063J845J921
61947C88152K734M110N381O240P171Q659J0350J1498J2111J2949J4441J6165J7504
61934E17465J8251J8466J8287J8074J8183J8387J8025J6961J5850J5083J3943
61923G06975J1460P776M102J302r15l266n774p749q644q564p853o531m469j933
61909F75917N08K639M760P017R009J0429J1672J3272J4839J5178J3543J0381O743
61896G95907L245k04l874p595j0713j2715j3763j4445j4957j4955j4305j3507
61884F78119j2919j2124j0634q878p822p698p816p576p103o836p039p750q725
$$ plain form
61978 460443 452574 445249 437969 430606 423454 416772 410690 405577 401922 399579 397545 394878 391592 388394
61964 388394 385808 383878 382511 381678 381326 381315 381441 381388 380844 379868 379065 379153 380370 382323 384386 386231 388152
61947 388152 390886 394996 400377 406617 413788 422447 432797 444295 456406 469355 483796 499961 517465
61934 517465 535716 554182 572469 590543 608726 627113 645138 662099 677949 693032 706975
61923 706975 718435 726211 730313 731615 730700 727434 721660 713911 705267 696703 688850 682319 677850 675917
61909 675917 676425 679064 683824 690841 699850 710279 721951 735223 750062 765240 778783 789164 795907
61896 795907 799152 798948 795074 787479 776766 764051 750288 735843 720886 705931 691626 678119
61884 678119 665200 653076 642442 633564 625742 618044 610228 602652 595549 588713 581674 573924 565199
61871E65199r406r328q592p532o039l860j439K19P00O03O67J071J794K967M543
61856E31567O135P542R059J0960J3041J5044J7144J9658K2479K5145K7238K8547
61844G33559K8981K8577K7469K5709K3255K0164J6581J2504P806K602k690p611
61832I16906j1752j4662j6017j5953j4861j2831r684n513p96M081Q877J3039J5751
61819H56585J6617J5944J4140J1331P616L196j974q063j4618k0451k4697k7501
61807H28125k9367l0302l0038k8715k6823k4682k2403k0159j8070j6001j3787
61796E67778j1581r683q166o882n738m737l825k905j949j096o33q05j411j771
61782E06596j417p10l47m28n46o61j138j872k155j765j367j475j697j502j100
$$ plain form
61871 565199 555793 546465 537873 530341 524302 520442 519003 519222 519922 520525 521192 522263 524057 527024 531567
61856 531567 537702 545244 554303 565263 578304 593348 610492 630150 652629 677774 705012 733559
61844 733559 762540 791117 818586 844295 867550 887714 904295 916799 924605 927207 924517 916906
61832 916906 905154 890492 874475 858522 843661 830830 821146 815633 814837 818918 827795 840834 856585
61819 856585 873202 889146 903286 914617 922233 925429 923455 915392 900774 880323 855626 828125
61807 828125 798758 768456 738418 709703 682880 658198 635795 615636 597566 581565 567778
61796 567778 556197 546514 538348 531466 525728 520991 517166 514261 512312 511216 510583 509778 508367 506596
61782 506596 505179 504469 504122 503694 503148 502487 501349 499477 497322 495557 494190 492715 491018 489516 488416
61767D88416r87j149j293j497j917k269k146j641j106n75J00P20J011J133J430
61752D78230J765J676J095M49Q8k0j06m52j297k500l365l259k354j506j341j733
61736D65370k112k039j527r87q12r48r47n22J84Q44J227J230J005J031J588K123
61720D64708J817Q72M73J186K240K786K978L189L047K228J444J536K009J588n
61705D92096j857l239m140m585m481m192m279m508m064k863j775j367j345j429
61691D47972j861k631l102k897k497k368k182j465n06L1k1l81r05j609k296k625
61675D20657k419j721p45jo8r06j678j652j007n06n58r84j407j522j179n63j71
61658D03570k82o08o95n24m40o20r56j172r21L5J327K001J511N26K27Q57J567
$$ plain form
61767 488416 487429 486280 484987 483490 481573 479304 477158 475517 474411 473836 473936 474656 475667 476800 478230
61752 478230 479995 481671 482766 483215 483303 483283 483177 482725 481428 478928 475563 472304 469950 468444 467103 465370
61736 465370 463258 461219 459692 458705 457893 456945 455998 455476 455660 456504 457731 458961 459966 460997 462585 464708
61720 464708 466525 467397 467870 469056 471296 474082 477060 480249 483296 485524 486968 488504 490513 492101 492096
61705 492096 490239 487000 482860 478275 473794 469602 465323 460815 456751 453888 452113 450746 449401 447972
61691 447972 446111 443480 440378 437481 434984 432616 430434 428969 428463 428494 428473 428092 427187 425578 423282 420657
61675 420657 418238 416517 415772 415771 415703 414797 413119 411467 410460 409954 409396 408412 407005 405483 404304 403741 403570
61658 403570 403288 402680 401985 401461 401021 400401 399445 398273 397352 397387 398714 400715 402226 402752 402979 403836 405403
61641D05403J667J467J679K466L348L742L305K150R07K95K96K9j156k766l760
61626D19072l843l649l661l665l396l119l123l096k483j313k09L74M48J43n31
61611C87949j458k300k762k847k741k683k951l707m719n411n365m667l799l210
61597C39329l013k958k697k217j918k068k370k315j892j589j727k153k563k769
61583C07080k615k114j672j700j969j847j308j104j679k471k672k187j422n99
61569B81721K07P20P29M86L28J75j44l44o2M11L86k51q64r24n47j11K23M82O73
61550B83294Q44J072J301J315J022O55O23J096J742J890J257M26L68J331K546
61535C00782L137K913K227J489J061J074R88j8j775k820k102m71L51p8p66r96
$$ plain form
61641 405403 407070 408537 410216 412682 416030 419772 423077 425227 426134 426429 426725 426754 425598 422832 419072
61626 419072 415229 411580 407919 404254 400858 397739 394616 391520 389037 387724 387515 387889 388337 388480 387949
61611 387949 386491 384191 381429 378582 375841 373158 370207 366500 361781 356370 351005 346338 342539 339329
61597 339329 336316 333358 330661 328444 326526 324458 322088 319773 317881 316292 314565 312412 309849 307080
61583 307080 304465 302351 300679 298979 297010 295163 293855 292751 291072 288601 285929 283742 282320 281721
61569 281721 281928 282648 283377 283863 284191 284366 284222 283878 283816 284227 284613 284362 283498 282574 282027 281916 282139 282621 283294
61550 283294 284138 285210 286511 287826 288848 289503 290126 291222 292964 294854 296111 296537 296905 298236 300782
61535 300782 303919 306832 309059 310548 311609 312683 313671 313653 311878 309058 306956 306485 306836 306758 305992 304996
61519C04996j105j417j595j433j395j825k265k166j713j392j119m95L67Q81Q02
61504B89126M56J50k00p13j191j299r50l38K38M97K29n43j434j862j514o22K04
61487B80234N13L70J89K46L54J46k88l09M49J323J314N51L47J419K773L033K227
61470B94891J350O78k48j199j244l72K25q0m72j91K86L22K82O68J027P98M70P95
61452B97986J443J562J147P66L94k79q51o83j35o6l29m1Q20J367J386J664K529
61435C08680L233L178K690K266J983J897K166K490K274J620J232J226R86M64M65
61420C36850J246J903J766J444J809K691L293L221K534J372J43n02m67m32q52
61405C56019j269j202j031j384k106k539k487k344k491k928l232k739j222M32
$$ plain form
61519 304996 303891 302474 300879 299446 298051 296226 293961 291795 290082 288690 287571 287076 287443 288324 289126
61504 289126 289582 289732 289532 288819 287628 286329 285379 285041 285279 285776 286005 285462 284028 282166 280652 280030 280234
61487 280234 280747 281117 281306 281552 281906 282052 281764 281455 281904 283227 284541 285092 285439 286858 289631 292664 294891
61470 294891 296241 296919 296671 295472 294228 293856 294081 294001 293529 293338 293624 293946 294228 294896 295923 296721 297191 297986
61452 297986 299429 300991 302138 302904 303298 303019 302168 301485 301350 301284 300955 300914 301734 303101 304487 306151 308680
61435 308680 311913 315091 317781 320047 322030 323927 326093 328583 330857 332477 333709 334935 335921 336385 336850
61420 336850 338096 339999 341765 343209 345018 347709 351002 354223 356757 358129 358272 357770 357303 356871 356019
61405 356019 354750 353548 352517 351133 349027 346488 344001 341657 339166 336238 333006 330267 329045 329477
61391C29477R18J76m76j94L43K86O5M45J017Q02p4n16j31L60M03L32O19J200J769
61372C36821K182K301J970J368J039J341K056K617K616K135J663J673K106K502
61358C64390K648K810L160L414L322L109L062L103L167L616M730O094P050P525
61344D21200P881Q059P562O275M827M021M152M861N429N331M658L900L163K076
61330D93395O27m44n85l16m40q87j099j269k165l639m371l505j743l47M16J154
61314D74782K162K996L278L293L654M609N887P059P871Q342Q735R503J1042J3223
61300E66436J5251J6139J5372J3081R771O208L295J477J92j534l821n742o632
61287F29493o965p491q061q015p408p069p452q083q256p808p024o128n103l786
$$ plain form
61391 329477 330395 330571 330095 329901 330244 330530 330595 331040 332057 332859 332785 332269 332138 332498 332901 333233 333852 335052 336821
61372 336821 339003 341304 343274 344642 345681 347022 349078 351695 354311 356446 358109 359782 361888 364390
61358 364390 367038 369848 373008 376422 379744 382853 385915 389018 392185 395801 400531 406625 413675 421200
61344 421200 429081 437140 444702 450977 455804 459825 463977 468838 474267 479598 484256 488156 491319 493395
61330 493395 494022 493578 492993 492677 492237 491350 490251 488982 486817 483178 478807 475302 473559 473212 473628 474782
61314 474782 476944 479940 483218 486511 490165 494774 500661 507720 515591 523933 532668 542171 553213 566436
61300 566436 581687 597826 613198 626279 636050 642258 645553 647030 647222 645688 641867 636125 629493
61287 629493 622528 615037 606976 598961 591553 584484 577032 568949 560693 552885 545861 539733 534630 530844
61273E30844k071j31J541K511K844K980L180L334L315L150K831K240J546J326
61259E59440K023L364M663N687O820Q275R427R385Q066O285M833L863L182K654
61245F37967K144J486Q52O35O74P5j645l682m827m918m704m539m081l224k479
61230F09734k242k312k257j770n98J245L171M457N028N292N352N160N260O364
61216F41884Q043Q946Q621Q120Q409R146R587R680R531Q683O857M845L727L544
61202G49623L468K998K423K293K909M158N488O448P403R148J1645J3878J5313
61189H37195J6515J7743J7939J6074J2788R638P282N407L996L391L322K947J992
61176I56229R51J20q12k127l672n134o256o800o835o912p506q456r391j0455j1994
$$ plain form
61273 530844 528773 528642 530183 532694 535538 538518 541698 545032 548347 551497 554328 556568 558114 559440
61259 559440 561463 564827 569490 575177 581997 590272 599699 609084 617150 623435 628268 632131 635313 637967
61245 637967 640111 641597 642449 643084 643758 643833 642188 638506 633679 628761 624057 619518 615437 612213 609734
61230 609734 607492 605180 602923 601153 600555 601800 604971 609428 614456 619748 625100 630260 635520 641884
61216 641884 649927 658873 667494 675614 684023 693169 702756 712436 721967 730650 737507 742352 746079 749623
61202 749623 753091 756089 758512 760805 763714 767872 773360 779808 787211 796359 808004 821882 837195
61189 837195 853710 871453 889392 905466 918254 927892 935174 940581 944577 947968 951290 954237 956229
61176 956229 957180 957300 956488 954361 950689 945555 939299 932499 925664 918752 911246 902790 893399 882944 870950
61161H70950j3782j5242j6254j7058j7495j7061j5804j4576j4188j4594j4916
61150F99980j4065j1610q309n554l929k777j445m33o05j880l474n063o787q298
61136F25751q816q129o799n341l832k331j032R6J254K437L574M910O709Q657J0169
61121F27277J1309J2812J5071J7650J9848K1432K2746K4318K6326K8278K9448
61110H56515K9797L0096L0843L1504L1307L0271K8905K7329K5360K3141K0970
61099A166038J8679J5793J2162Q026L645p42m879q793j2733j6493j9351k1155
61087A140197k2742k4719k6515k7374k7578k7853k8200k8194k7806k7006k5263
61076H46947k2408j9460j7524j6403j5303j4203j3402j2414j0707q933p935p024
$$ plain form
61161 870950 857168 841926 825672 808614 791119 774058 758254 743678 729490 714896 699980
61150 699980 685915 674305 665996 660442 656513 653736 652291 651858 651253 649373 645899 640836 634049 625751
61136 625751 616935 608806 602007 596666 592834 590503 589471 589567 590821 593258 596832 601742 608451 617108 627277
61121 627277 638586 651398 666469 684119 703967 725399 748145 772463 798789 827067 856515
61110 856515 886312 916408 947251 978755 1010062 1040333 1069238 1096567 1121927 1145068 1166038
61099 1166038 1184717 1200510 1212672 1220698 1224343 1223601 1218722 1209929 1197196 1180703 1161352 1140197
61087 1140197 1117455 1092736 1066221 1038847 1011269 983416 955216 927022 899216 872210 846947
61076 846947 824539 805079 787555 771152 755849 741646 728244 715830 705123 696190 688255 681231
61064F81231m930k062j01N48J112K210L026L087L282M499O451Q358R778J0503
61050G26992J0536J0459J1002J2175J3677J5767J8656K1439K3030K3972K5723
61039I13428K8271L0120L0754L1378L2985L5273L7853M0865M3952M6205M7619
61028A318703M9241N1395N3064N3469N2967N2189N1703N2661N6231O2038O8710
61017A922371P5986Q4561R3890J02343J09887J18523J29845J44593J64910J94227
61007C141136K34272K85047L48449M28893N29901O54083Q07505R99455J236401
60998H665142J519682J842910K168924K394727K362769J958476J230822M08251
60990B2551703k32702n32456m98663k30240J60781N42844P35301N65089l344q03419
$$ plain form
61064 681231 676301 674239 674138 674686 675798 678008 681034 684121 687403 691902 698353 706711 716489 726992
61050 726992 737528 747987 758989 771164 784841 800608 819264 840703 863733 887705 913428
61039 913428 941699 971819 1002573 1033951 1066936 1102209 1140062 1180927 1224879 1271084 1318703
61028 1318703 1367944 1419339 1472403 1525872 1578839 1631028 1682731 1735392 1791623 1853661 1922371
61017 1922371 1998357 2082918 2176808 2279151 2389038 2507561 2637406 2781999 2946909 3141136
61007 3141136 3375408 3660455 4008904 4437797 4967698 5621781 6429286 7428741 8665142
60998 8665142 10184824 12027734 14196658 16591385 18954154 20912630 22143452 22551703
60990 22551703 22319001 21786545 21287882 21057642 21218423 21761267 22496568 23061657 23058313 22254894
60980B2254894j558447k054696k240298k188953k004047j761181j506357j268317
60972G672598j060606q83266p31940o04607m99753m13596l42235k84021k38027
60963B614547k02289j74655j53537j36969j22666j09734r8659q9136p9618o9426
60953A377858n9560n0916m3349l7055l3139l1921l2034l1899l1031k9511k7477
60942I69966k5530k4366k3550k1888j9353j7278j6283j5584j4761j4642j5577
60931G61154j6325j5699j4204j2994j2201j1281j0247r501r041q605q221q005
60919F24830p748p254o627o020n419m873m391l627k409j458j677k629k844j780
60905E66074m00M50R95J485J497R13M95P20J053J089J351K185K817K478J694J372
$$ plain form
60980 22254894 20696447 18641751 16401453 14212500 12208453 10447272 8940915 7672598
60972 7672598 6611992 5728726 4996786 4392179 3892426 3478830 3136595 2852574 2614547
60963 2614547 2412258 2237603 2084066 1947097 1824431 1714697 1616038 1526902 1447284 1377858
60953 1377858 1318298 1267382 1224033 1186978 1153839 1121918 1089884 1057985 1026954 997443 969966
60942 969966 944436 920070 896520 874632 855279 838001 821718 806134 791373 776731 761154
60931 761154 744829 729130 714926 701932 689731 678450 668203 658702 649661 641056 632835 624830
60919 624830 617082 609828 603201 597181 591762 586889 582498 578871 576462 575004 573327 570698 567854 566074
60905 566074 565674 566124 567119 568604 570101 571014 571509 572229 573282 574371 575722 577907 580724 583202 584896 586268
60889E86268J337P76k92j071j169r05o05l55k13j15K38Q84J288J032N02L52O53
60872E88605J084J613K405L328M148M985O037P051P570P578P470P506P705Q095
60858F65180Q708R318R459Q761P292N740N119N811O950P273O686O229O346O066
60844G64938M500K346J076J020J116L81j077k546l554m156m689n404o235o906
60830G40810p343p728q033p881p124o281o025o397o780o610n910n238n185n831
60816F48444o636p011o991p061p377p531p133o286n380m762m607m760m673l940
60802E64296k992k776l667n011n823n553m230k418j104j033j955k913l287l127
60788E18407k581j802j345j767k637k851k232j893k571l526l648k920k045j367
$$ plain form
60889 586268 587605 588381 588089 587018 585849 584944 584339 583984 583771 583656 583894 584778 586066 587098 587600 587952 588605
60872 588605 589689 591302 593707 597035 601183 606168 612205 619256 626826 634404 641874 649380 657085 665180
60858 665180 673888 683206 692665 701426 708718 714458 719577 725388 732338 739611 746297 752526 758872 764938
60844 764938 769438 771784 772860 773880 774996 775377 774300 771754 768200 764044 759355 753951 747716 740810
60830 740810 733467 725739 717706 709825 702701 696420 690395 683998 677218 670608 664698 659460 654275 648444
60816 648444 641808 634797 627806 620745 613368 605837 598704 592418 587038 582276 577669 572909 568236 564296
60802 564296 561304 558528 554861 549850 544027 538474 534244 531826 530722 529689 527734 524821 521534 518407
60788 518407 515826 514024 512679 510912 508275 505424 503192 501299 498728 495202 491554 488634 486589 485222
60774D85222r18r86j729k628k978k804k652k708k679k287j518o59l00r19k050
60759D57407k468j676o68o69j606k498k897l107l317l375l257l086k687j717k68
60744D24111J125J970K069J483N93j73r38k277m112n322n089m032l274k919k406
60729D00809j825j746j953j636q31n12j011j503j435j333j660j845j272n16o07
60714C81124j476k015j637r59q28j243j580j490j221j138j255j360j400j527j779
60699C60216j973j932j636j068k65M00L51m01r47m44P90J624J470P55J16k78m24
60682C56354o4R74K297L200L364L095K827K601K104J217L59J47O98J551K291K896
60666C85911L285K964J610j56j245j329j062j031j009n12L50R90J055O88K85K55
$$ plain form
60774 485222 484304 483318 481589 478961 475983 473179 470527 467819 465140 462853 461335 460676 460376 459457 457407
60759 457407 454939 453263 452595 451926 450320 447822 444925 441818 438501 435126 431869 428783 426096 424379 424111
60744 424111 425236 427206 429275 430758 431351 431178 430240 427963 423851 418529 413440 409408 406134 403215 400809
60729 400809 398984 397238 395285 393649 392818 392306 391295 389792 388357 387024 385364 383519 382247 381731 381124
60714 381124 379648 377633 375996 375037 374209 372966 371386 369896 368675 367537 366282 364922 363522 361995 360216
60699 360216 358243 356311 354675 353607 353342 353742 354093 353692 352745 352301 353091 354715 356185 356940 357056 356778 356354
60682 356354 356290 357264 359561 362761 366125 369220 372047 374648 376752 377969 378328 378475 379173 380724 383015 385911
60666 385911 389196 392160 393770 393614 392369 391040 389978 388947 387938 387426 387776 388766 389821 390509 390794 391049
60650C91049Q41J862K692K898K836L200M001M406L762K387J003j92j434k602l181
60635D13528l033k682k618k855l251l763m102l718k598j602j409j563j221n28
60621C78585l38q03j138r00n55n69o82n33k98k43k01o0k01r31j703j555k45J394
60603C69024K233J819P29O5M06J146J241N63P6N03J399J886J780J508J360J306
60587C87044J326J413J372J022M57j05n27o48l29J37J89j02J89J647L532M693
60571D01310N110N765P142Q747J0114J1485J3166J4815J5777J5773J4909J3182
60559E37295J0398O625K462j334m400o837q710r754r765r003p861o343m296k027
60545D86450o4J644L595N726P372Q396R575J1371J3173J4295J5015J5844J6330
$$ plain form
60650 391049 391890 393752 396444 399342 402178 405378 409379 413785 417547 419934 420937 420745 419311 416709 413528
60635 413528 410495 407813 405195 402340 399089 395326 391224 387506 384908 383306 381897 380334 379113 378585
60621 378585 378247 377444 376306 375406 374851 374282 373600 373067 372769 372526 372325 372265 372064 371133 369430 367875 367630 369024
60603 369024 371257 373076 373805 373870 374276 375422 376663 377226 377302 377805 379204 381090 382870 384378 385738 387044
60587 387044 388370 389783 391155 392177 392634 392529 392002 391354 391025 391162 391351 391249 391438 393085 396617 401310
60571 401310 406420 412185 419327 428074 438188 449673 462839 477654 493431 509204 524113 537295
60559 537295 547693 554318 556780 555446 551046 544209 535499 525745 515980 506977 499116 492773 488477 486450
60545 486450 486386 488030 491625 497351 504723 513119 522694 534065 547238 561533 576548 592392 608722
60532F08722J5461J2846Q896M174n80m308o367p245p742p787o881n428m480m276
60518E95005m059l458l004k949k651j623l62M85J123K097L173L525K964K406K951
60503E95623M861P569J0496J3679J7512K2075K6998L1943L6879M1762M6317N0300
60491I06014N3569N5552N5089N1310M4334L4675K2433P776q153k3574l7195m8291
60479A113539n6012n9709n9959n8308n5713n1974m6937m1350l6112l1388k6977
60468E89100k2988j9684j7053j4969j3366j2027j0578q978p624o725o090n720
60456D43298n933o527o469n158l447k686k981l249k841k283k279k649k647j927
60442C92222q97k15j87n72q83q70p56q73j202j420j378j250j155q92l36J32o5
$$ plain form
60532 608722 624183 637029 645925 650099 649519 645211 638844 631599 623857 616070 609189 603761 599281 595005
60518 595005 590946 587488 584484 581535 578884 577261 576899 577384 578507 580604 583777 587302 590266 592672 595623
60503 595623 600484 608053 618549 632228 649740 671815 698813 730756 767635 809397 855714 906014
60491 906014 959583 1015135 1070224 1121534 1165868 1200543 1222976 1230752 1222599 1199025 1161830 1113539
60479 1113539 1057527 997818 937859 879551 823838 771864 724927 683577 647465 616077 589100
60468 589100 566112 546428 529375 514406 501040 489013 478435 469457 461833 455108 449018 443298
60456 443298 437365 430838 424369 419211 415764 413078 410097 406848 404007 401724 399445 396796 394149 392222
60442 392222 391325 391110 390923 390351 389468 388598 387842 386969 385767 384347 382969 381719 380564 379672 379336 379468 379403
60425C79403q54j396j036k24jo68j423j386n90L30R92J427J630J483J077Q42J147
60408C80753J933K662K661J728N24j7K62O00M73K79N24Q72P45M10O36J410J893
60391C98348J631J008M20j74o90o51J95J472K639L334L200K070O09MO33J568J857
60374D17473J685J776K188K339J891J053K47p4L55J164J444Q29J18K23Q29Q51
60358D34391P0n58l02L96P03M82K33L28Q31J800L258M837N847N868N155M324L744
60341D71407L326K849K241J475M50q49k126l019l497l758l789l433k891k720l043
60326D52623l237k719j792j223j211j305j209j117j138r53k95O07J333J765J973
60311D42102J977J987K609M286O635Q793J0481J2220J4457J7010J9535K1864K3458
$$ plain form
60425 379403 378549 377153 376117 375893 375892 375224 373801 372415 371825 372155 373147 374574 376204 377687 378764 379606 380753
60408 380753 382686 385348 388009 389737 390261 390244 390506 391106 391579 391858 392382 393254 393999 394409 395045 396455 398348
60391 398348 399979 400987 401407 401233 400543 399892 400087 401559 404198 407532 410732 412802 413411 413415 414048 415616 417473
60374 417473 419158 420934 423122 425461 427352 428405 428652 428578 428933 430097 431541 432370 432488 432711 433540 434391
60358 434391 434461 433903 433601 433997 434700 435182 435415 435743 436574 438374 441632 446469 452316 458184 463339 467663 471407
60341 471407 474733 477582 479823 481298 481748 480899 478773 475754 472257 468499 464710 461277 458386 455666 452623
60326 452623 449386 446667 444875 443652 442441 441136 439927 438810 437672 436719 436424 437031 438364 440129 442102
60311 442102 444079 446066 448675 452961 459596 468389 478870 491090 505547 522557 542092 563956 587414
60298E87414K3244K0658J6536J2062P107N77p433j4887j9662k1488k1500k0543
60286E62085j8650j5819j2555r581p405o070n116l968k683j977k214k754k780
60273D70513k414k418l064l889m438m580m208l328k429k139k375k456k100j775
60259D28900j859k011j650p38J66M27j57j047j314o02L31N25J24J43J013K067
60243D24318K628K759K673K168J145J44k69k19j55q6K23O34P68O38O37R60J454
60226D40420J999K566K921K675J794P92K65L60Q32J422K017K546K943L335M075
60211D70962N329O633P192O774O040N744N840N795N526N508N977O539O735O551
60197E57145O182N655M916M081L375K902K576K218J712J244J163J431J365L91
$$ plain form
60298 587414 610658 631316 647852 659914 667021 667598 660165 645278 625616 604128 582628 562085
60286 562085 543435 527616 515061 505480 498075 492005 486889 482921 480238 478261 476047 473293 470513
60273 470513 468099 465681 462617 458728 454290 449710 445502 442174 439745 437606 435231 432775 430675 428900
60259 428900 427041 425030 423380 422642 422808 423235 423078 422031 420717 420115 420446 420971 421095 421238 422251 424318
60243 424318 426946 429705 432378 434546 435691 435835 435566 435347 435192 435106 435329 435963 436731 437369 438006 438966 440420
60226 440420 442419 444985 447906 450581 452375 453167 453432 453792 454624 456046 458063 460609 463552 466887 470962
60211 470962 476291 482924 490116 496890 502930 508674 514514 520309 525835 531343 537320 543859 550594 557145
60197 557145 563327 568982 573898 577979 581354 584256 586832 589050 590762 592006 593169 594600 595965 596356
60183E96356j124k303k946l661m739n672o070o360o960p364o760n350m207l827
60169E29013l491k371q38p5n08j176r31Q7O67K01n69p02l58l29o51n47K78J095
60151E18795J134N56J27L55J155K112K818L176L476L982M509M727M798N189N909
60136E62818O473O729P095P691P940P414O581O201O301O198N305L596J556r9r07
60121F40892j149j518k111k167j215N0N86L62K50P28J350J569J404J117O62j67
60105F40643j282k286k873l075l172l409l830m281m574m686m734m743m455l556
60091E89687k187j011n11l28K63J321K160K455K764L592M526M901M874N081N499
60076F23086N368M255K550R63j01p48j616l450o118q381r254r214r323r673r685
$$ plain form
60183 596356 595232 592929 589983 586322 581583 575911 569841 563481 556521 549157 542397 537047 532840 529013
60169 529013 525522 523151 522313 522238 521730 520554 519623 519710 520377 520578 520009 519307 518949 518620 517969 517422 517700 518795
60151 518795 519929 520485 520612 520967 522122 524234 527052 530228 533704 537686 542195 546922 551720 556909 562818
60136 562818 569291 576020 583115 590806 598746 606160 612741 618942 625243 631441 636746 640342 641898 641799 640892
60121 640892 639743 638225 636114 633947 632732 632782 633368 633730 633980 634708 636058 637627 639031 640148 640810 640643
60105 640643 639361 637075 634202 631127 627955 624546 620716 616435 611861 607175 602441 597698 593243 589687
60091 589687 587500 586489 585978 585650 585913 587234 589394 591849 594613 598205 602731 607632 612506 617587 623086
60076 623086 628454 632709 635259 636222 636121 635373 633757 630307 624189 615808 606554 597340 588017 578344 568659
60061E68659r502r743j0066r416p888o825o674o294m947l589l188l056k054m90
60047D84927M33N22O68J407K506L708M985O046O469O336O176O306O544O510N920
60032E49463M803L634K828K074P80p30j478j514k200m140o033o655o804p948r732
60017E16348j0534r964r243r089q896q059o836n508l966k442j618j503j241m36
60003D37013K01P8k90j26M51P93P70P11P45P78R82J632K495K910K610K191K486
59986D56430L603M791N297N153M918M811M528L877L143K562J916R59j50j184k239
59971D98415l321l988l826k993j815k82J533K934L294K989K894L167L280L133
59957E05414L283L927M511M492L927L061J934N91p75k055l245m165m542m417m035
$$ plain form
60061 568659 559157 549414 539348 529932 522044 515219 508545 502251 497304 493715 490527 487471 485417 484927
60047 484927 485360 485882 486550 487957 490463 494171 499156 505202 511671 518007 524183 530489 537033 543543 549463
60032 549463 554266 557900 560728 562802 563582 562852 561374 559860 557660 553520 547487 540832 534028 526080 516348
60017 516348 505814 495850 486607 477518 468622 460563 453727 448219 444253 441811 440193 438690 437449 437013
60003 437013 437214 437292 437002 436876 437327 438120 438890 439601 440346 441124 442106 443738 446233 449143 451753 453944 456430
59986 456430 460033 464824 470121 475274 480192 485003 489531 493408 496551 499113 501029 501988 501838 500654 498415
59971 498415 495094 491106 487280 484287 482472 482190 483723 486657 489951 492940 495834 499001 502281 505414
59957 505414 508697 512624 517135 521627 525554 528615 530549 531140 530365 528310 525065 520900 516358 511941 507906
59942E07906l387k367j361j020j402j913k289k914l949m735m531l447k208j323
59928D71060q21n75m09m6O90J564K090K045J731J588J673J680J527J708K724M218
59912D92447N186N231N074N544O451P047P179P338P690P724O974N616M209L111
59898E76821K244J251q5j520k569l162l680m177m071l081j901j339j044NJ911
59883E55603L654M504M797N134N491N571N509N732O281O640O225M953L342K000
59869F25436R49l38k079l677m369m148l622l207k822k380k014j875j958k143k227
59854E89526k027j623j211o08P09K786M954O768Q535J0347J1103R476N533P27
59840F44995l430o028o566n141k840j049l68p13k075m325o515p488p203o485n661
$$ plain form
59942 507906 504519 502152 500791 499771 498369 496456 494167 491253 487304 482569 478038 474591 472383 471060
59928 471060 470239 469664 469255 469209 469899 471463 473553 475598 477329 478917 480590 482270 483797 485505 488229 492447
59912 492447 497633 502864 507938 513482 519933 526980 534159 541497 549187 556911 563885 569501 573710 576821
59898 576821 579065 580316 580231 578711 576142 572980 569300 565123 561052 557971 556070 554731 553687 553692 555603
59883 555603 559257 563761 568558 573692 579183 584754 590263 595995 602276 608916 615141 620094 623436 625436
59869 625436 626385 626047 623968 620291 615922 611774 608152 604945 602123 599743 597729 595854 593896 591753 589526
59854 589526 587499 585876 584665 584057 584766 587552 592506 599274 607809 618156 629259 638735 644268 644995
59840 644995 641565 635537 628971 623830 620990 619941 619573 618860 616785 612460 605945 598457 591254 584769 579108
59825E79108m447l145k645l009l300l130l250m069m794m687m203l996l727k832
59811E27874j759j390j663j737j345j012j017r68n60j23j17n43j087j608k205
59796E10740k935l658m202m556m776m767m375l776l414l398l256k588j740j396
59782D61903j712k221k413k062j209k94o0p45j543j467n80K50O34R45J415J762
59766D52603J866J958K030J727J161J068J742K477K546K255K594L995N855P165
59752D91042P428P067O948P449Q106Q359Q336Q542Q991R187Q778P818O513N194
59738E99758M320L937L420K273R16J7n65j349k129k298k123k466l310l625k934
59723E93842j936j358j214j393k017k794k959k327j653j530j656j530j149o70
$$ plain form
59825 579108 574661 571516 568871 565862 562562 559432 556182 552113 547319 542632 538429 534433 530706 527874
59811 527874 526115 524725 523062 521325 519980 518968 517951 516983 516423 516300 516183 515640 514553 512945 510740
59796 510740 507805 504147 499945 495389 490613 485846 481471 477695 474281 470883 467627 465039 463299 461903
59782 461903 460191 457970 455557 453495 452286 451992 451932 451187 449644 448177 447597 447847 448481 449426 450841 452603
59766 452603 454469 456427 458457 460184 461345 462413 464155 466632 469178 471433 474027 478022 483877 491042
59752 491042 498470 505537 512485 519934 528040 536399 544735 553277 562268 571455 580233 588051 594564 599758
59738 599758 604078 608015 611435 613708 614624 614641 614076 612727 610598 608300 606177 603711 600401 596776 593842
59723 593842 591906 590548 589334 587941 585924 583130 580171 577844 576191 574661 573005 571475 570326 569656
59709E69656o8N11O55K46m11j070j582j509o09L69L73l76o20J7O09P13J188K570
59691E70662L953M297L825L201K305P43j123k511l076k804j740m06K32j35p47
59676E76676j025j376k166k835k917l033l996n472o504o753o411n521m285l472
59662E20910l615m140m108l399k477j533o03K0K98Q46K025L138L363L056L166
59647E16947L758M045L566K513J162k51j258j593j750k440l618m601m900m481
59633E07099l513k357j441p23K81J499K026J380L41j69l06o56j035r46o05n71
59617E00304q27j162j899l239m350m187k988j868j274p67p3O83J497K293K477
59602D84620J655N55J88M18L93N7M5K59r1j012j536j194n65j94K8J76Nm03o18
$$ plain form
59709 569656 569588 570099 570754 571000 570589 569519 567937 566428 565819 566188 566561 566185 565565 565582 566191 566904 568092 570662
59691 570662 574615 578912 582737 585938 588243 588986 587863 585352 582276 579472 577732 577326 577558 577423 576676
59676 576676 575651 574275 572109 569274 566357 563324 559328 553856 547352 540599 534188 528667 524382 520910
59662 520910 517295 513155 509047 505648 503171 501638 501035 501055 501353 502199 504224 507362 510725 513781 516947
59647 516947 520705 524750 528316 530829 531991 531740 530482 528889 527139 524699 521081 516480 511580 507099
59633 507099 503586 501229 499788 499065 499346 500845 502871 504251 504592 504423 504117 503461 502426 501480 500875 500304
59617 500304 499477 498315 496416 493177 488827 484640 481652 479784 478510 477743 477670 478353 479850 482143 484620
59602 484620 486275 486830 487018 487436 487829 487886 487931 488190 488099 487087 485551 484357 483792 483598 483626 483802 483807 483404 482786
59583D82786p36j322k247k518j649m30P3m20j627l157m355m407l207j655p07m69
59567D53953m99n58o45o97n87l00O3L43L60J41M9M54J278K106K564K351J360J80
59549D61916N0J528L435M000L021K078K486L919N333O488P862R548J1098J2534
59535E35296J4889J8947K3241K4064J8496P691l527j0727j3055j2388j0527q029
59523E84371m994j700J496M095N498N674N443N414N041L469J019j157k600l863
59509F07206n409p096q685r966j0501j0061r237q831q657p835o238m701l785l231
59495E02973k816k745k898k542j333M5P25P08O65R47J290J322J112J125J611K298
59479E02487K830L478M832O786Q438R268R653R928R669Q551P015N412L322N93
$$ plain form
59583 482786 482050 480728 478481 475963 474314 473884 473957 473537 471910 468753 464398 459991 456784 455129 454422 453953
59567 453953 453454 452896 452251 451554 450967 450667 450730 451073 451433 451574 451623 452077 453355 455461 458025 460376 461736 461916
59549 461916 461966 463494 466929 470929 473950 476028 478514 482433 487766 494254 502116 511664 522762 535296
59535 535296 550185 569132 592373 616437 634933 642624 639097 628370 615315 602927 592400 584371
59523 584371 579377 577677 579173 583268 588766 594440 599883 605297 610338 613807 614826 613669 611069 607206
59509 607206 601797 594701 586016 576050 565549 555488 546251 537420 528763 520928 514690 509989 506204 502973
59495 502973 500157 497412 494514 491972 490639 490684 491409 492117 492782 493729 495019 496341 497453 498578 500189 502487
59479 502487 505317 508795 513627 520413 528851 538119 547772 557700 567369 575920 582935 588347 591669 592262
59465E92262j690k416j957j441j066l08P39J568K507M309O670Q428R231R807J0646
59450F37289J1552J2527J3870J5283J5968J5695J4853J3402J0815P030K451k833
59438G67902q592j3428j5653j5406j4532j4095j3356j1675r969r481j0112j0722
59426F20881j0458r192p194m830k294M77L286N462O841Q526J1679J5829J9497
59413F58510K2231K4804K7799L1258L5158L8275L6841K6997R631q958k2234k8053
59401H52259k7922k3931j7675j0370k341O524J4397J6755J0067l953j9055k9400
59389G65355l3246l2447k9772k6831k3760k0218j6466j3133j0308p665n446m276
59377E41787l842k946j236K53Q01J094J878K649K611K044J806K095K448K531K311
$$ plain form
59465 592262 590572 588156 586199 584758 583692 583384 584123 585691 588198 592507 599177 607605 616836 626643 637289
59450 637289 648841 661368 675238 690521 706489 722184 737037 750439 761254 768284 770735 767902
59438 767902 759310 745882 730229 714823 700291 686196 672840 661165 651196 641715 631603 620881
59426 620881 610423 601231 594037 589207 586913 587390 590676 596138 602979 611505 623184 639013 658510
59413 658510 680741 705545 733344 764602 799760 838035 874876 901873 911504 902546 880312 852259
59401 852259 824337 800406 782731 772361 770020 776544 790941 807696 817763 813810 794755 765355
59389 765355 732109 699662 669890 643059 619299 599081 582615 569482 559174 551509 546063 541787
59377 541787 537945 534999 533763 534016 534817 535911 537789 540438 543049 545093 546899 548994 551442 553973 556284
59362E56284K009K215L391M936N666N568N925P273Q473Q601Q415R012J0215J1368
59348F49351J2670J4464J6138J7053J7827J9340K1069K1717K1043J9816J8413
59337H48901J6638J4654J2795J0658P456L214j301n627r666j2997j5185j6685
59325H52855j8376k0142k0890k0096j8507j7069j5875j4458j2707j1047r861q948
59313F64879p733o115m812m418m318l291j158J067K771M378O149P554Q558J0352
59299F73863J3787J7825K0335J9706J5154O707l836j2907j7643j8210j6806j5096
59287F82879j3564j2492j1860j0706q145m970k936k409k024p89P29J602J910K448
59273F19673L781N897Q268J0115J1103J1735J2587J3398J3506J2962J2314J1424
$$ plain form
59362 556284 558293 560508 563899 568835 574501 580069 585994 593267 601740 610341 618756 627768 637983 649351
59348 649351 662021 676485 692623 709676 727503 746843 767912 789629 810672 830488 848901
59337 848901 865539 880193 892988 903646 911102 914316 913015 907388 897722 884725 869540 852855
59325 852855 834479 814337 793447 773351 754844 737775 721900 707442 694735 683688 673827 664879
59313 664879 657146 651031 646219 641801 637483 634192 633034 634101 636872 641250 647399 654953 663511 673863
59299 673863 687650 705475 725810 745516 760670 767377 763541 750634 732991 714781 697975 682879
59287 682879 669315 656823 644963 634257 626112 621142 618206 615797 613773 612984 613713 615315 617225 619673
59273 619673 623454 629351 637619 647734 658837 670572 683159 696557 710063 723025 735339 746763
59261G46763R507O418L080L15k012m415o977r424j1492j2914j3382j2893j1906
59248F80668j0939j0099r093p628n796m020k607j462l96M21P91J068J865L107
59234F35880M130M769N558O584P046O432N244M027K483K82k031l740m941o120
59220F65603p258q150r045j0110j0752j0313r052p726o626n729n225n106m719
59207E65792l583k240j413q64k1Q11R88Q90J551K992M084M042L118J871O64o1
59191E78621K8N33O59K17l03n98p30n01N05K145L664M558M889M727M009L120K878
59174F08421L571M430M492L759L205L666M881N819N925N769O173P045P747Q296
59160F83199R257J0361J0453R095P169N360L185K46k700m812o421q134r597j0164
$$ plain form
59261 746763 756270 762688 765768 766083 764071 759656 752679 743255 731763 718849 705467 692574 680668
59248 680668 669729 659630 650537 642909 637113 633093 630486 629024 628628 629049 629840 630908 632773 635880
59234 635880 640010 644779 650337 656921 663967 670399 675643 679670 682153 682435 680404 676664 671723 665603
59220 665603 658345 650195 641150 631040 620288 609975 600923 593197 586571 580842 575617 570511 565792
59207 565792 562209 559969 558556 557692 557671 558482 559470 560360 561911 564903 568987 573029 576147 578018 578682 578621
59191 578621 578649 579182 579841 580058 579755 579157 578427 577926 578431 580576 584240 588798 593687 598414 602423 605543 608421
59174 608421 611992 616422 620914 624673 627878 631544 636425 642244 648169 653938 660111 667156 674903 683199
59160 683199 692456 702817 713270 722365 729534 734894 738079 738325 735625 730813 724392 716258 706661 696497
59146F96497j0118j0077r840r004q116p937q023p309n810m581m180m238m377m510
59132E98377m470m209m144m414m176k671o57L61J46j41L73J406K362L076L771
59117E84990M812O384P889Q203P189O235O487P328P594P394P443P434O671N791
59103F81844O002O928O971N740M504M107L978L383K295Q08r97k422k664k119j972
59088G16386k406k447j728j027q45q20q96j749l573n539o893p737q399q959r563
59073F53805j0251j0381r226p344o225o410o981p062o697o048m916l398k051j123
59059E65692n14n34j517k704k753j637p92j095j897k354k447k268j622q33p21
59044E42004j236j228j98Q65R64L95q1l79o97q45o02j38L77R51J355J386J685
$$ plain form
59146 696497 686379 676302 666462 657458 649342 641405 633382 626073 620263 615682 611502 607264 602887 598377
59132 598377 593907 589698 585554 581140 576964 574293 573636 573997 574143 574002 574375 575781 578143 581219 584990
59117 584990 589802 596186 604075 612278 619467 625702 632189 639517 647111 654505 661948 669382 676053 681844
59103 681844 687846 694774 701745 707485 711989 716096 720074 723457 725752 726560 725563 723141 720477 718358 716386
59088 716386 713980 711533 709805 708778 707933 707113 706217 704468 700895 695356 688463 680726 672327 663368 653805
59073 653805 643554 633173 623947 616603 610378 603968 596987 589925 583228 577180 572264 568866 566815 565692
59059 565692 565178 564644 563127 560423 557670 556033 555241 554146 552249 549895 547448 545180 543558 542725 542004
59044 542004 540768 539540 539342 540207 541171 541566 541485 541106 540409 539564 538962 538824 539201 540152 541507 542893 544578
59027E44578L214N590P201P468P726R299J1758J3970J5681J7092J7791J7256J5863
59014F94487J4369J2764J0412P123L380k73l480n857p038o987o155n269m774m275
59000F98427k842k51K452M199N192O240P339P931Q068Q079P521N838L859L028
58986G65080L212K870J459j0j038k395m313n701n903n662n495m624k527j16J757
58971G36594L657O278Q878J0336J0900J1595J2509J2925J2713J2600J3163J4254
58959H66402J5248J5406J4329J2296R789O671K567k005n879q844j1811j5080j7626
58946H81463j8638j8602j8267j7681j6829j6090j5372j3910j1632r612q383p050
58934G09397m977l147k623k777k294j186m79m49m57j68J88N13R27J281J296R72
$$ plain form
59027 544578 547792 553382 560583 568051 575777 585076 596834 610804 626485 643577 661368 678624 694487
59014 694487 708856 721620 732032 739155 742535 742262 738782 732925 725887 718900 712745 707476 702702 698427
59000 698427 695585 695334 697786 701985 707177 713417 720756 728687 736755 744834 752355 758193 762052 765080
58986 765080 768292 771162 772621 772611 771573 769178 764865 759164 753261 747599 742104 737480 734953 734837 736594
58971 736594 740251 746529 755407 765743 776643 788238 800747 813672 826385 838985 852148 866402
58959 866402 881650 897056 911385 923681 933470 940141 942708 940703 934824 925980 914169 899089 881463
58946 881463 862825 844223 825956 808275 791446 775356 759984 746074 734442 724830 716447 709397
58934 709397 704420 701273 698650 695873 693579 692393 691914 691465 691008 690840 691028 691541 692468 693749 695045 696017
58918F96017M46k91j111j684k014k432k794k373r71O27J745K573L406M026M395
58903F99565N054O226P415Q476J0131J2690J5108J6153J5841J4968J4003J3143
58891H38773J2781J3091J3702J4448J5807J8075K0775K3330K5632K7391K7824
58880A051629K6498K3824K0250J5850J1053O728K987j114o094j1304j6108k0550
58868A103649k4272k6143k5831k4514k3162k1319j8573j5870j4251j3367j2500
58857H83847j1861j1738j1446j0486r669r735r814q772p201o467o549o391n812
58844G67906n431n179m487l757m083n548p039p767p931p948q053q527r441j0151
58830F72564r861q583o991n582m486l710l058k186j192n47j26Q07K280L325L598
$$ plain form
58918 696017 696463 696172 695061 693377 691363 688931 686137 683764 682793 683420 685165 687738 691144 695170 699565
58903 699565 704619 710845 718260 726736 736867 749557 764665 780818 796659 811627 825630 838773
58891 838773 851554 864645 878347 892795 908602 926677 947452 970782 996414 1023805 1051629
58880 1051629 1078127 1101951 1122201 1138051 1149104 1155832 1158819 1157705 1151611 1140307 1124199 1103649
58868 1103649 1079377 1053234 1027403 1002889 979727 958408 939835 923965 909714 896347 883847
58857 883847 871986 860248 848802 838316 828647 818912 809098 800326 793125 786658 780109 773718 767906
58844 767906 762475 757296 752809 749052 744969 739421 732382 724615 716684 708736 700683 692156 682715 672564
58830 672564 662703 654120 647129 641547 637061 633351 630293 628107 626915 626368 626242 627049 629329 632654 636252
58815F36252M101N390O371N981M970M673M947M827M321M052L687K357L14j204
58801F91039j667j683j913k499l342m145m434m248m349n141o016o420o697p123
58787F31362p033n855m173k795j640n01J65K47P62K315L751L759K883K563K980
58772F28790L236K893J929J5k657m662n001m712n309o404o589n888n395n111m122
58757E81013k582j579j170m10Q47J811K410L338M546N140M907M425L826K826J851
58742F11199J663J943J741J235J524K704L708M080M429N031N394N338N195M867
58728F60051M010L176L361M333M767M201L524L338L184K723K460K814L484M109
58714G09535M771N540O253O890P529P986Q026P734P090N632L314J128j62j350
$$ plain form
58815 636252 640353 645743 652114 658095 663065 667738 672685 677512 681833 685885 689572 691929 692243 691039
58801 691039 689372 687689 685776 683277 679935 675790 671356 667108 662759 657618 651602 645182 638485 631362
58787 631362 624329 618474 614301 611506 609866 609365 609530 609777 610539 612854 616605 620364 623247 625810 628790
58772 628790 632026 634919 636848 636863 634206 629544 624543 619831 614522 608118 601529 595641 590246 585135 581013
58757 581013 578431 576852 575682 575272 576119 577930 580340 583678 588224 593364 598271 602696 606522 609348 611199
58742 611199 612862 614805 616546 617781 619305 622009 625717 629797 634226 639257 644651 649989 655184 660051
58728 660051 664061 667237 670598 674931 679698 683899 687423 690761 693945 696668 699128 701942 705426 709535
58714 709535 714306 719846 726099 732989 740518 748504 756530 764264 771354 776986 780300 781428 781266 779916
58700G79916l710p046j0042j2193j4071j5879j7053j7312j6958j6152j4857j3413
58688F21230j2252j1208r888q416p125n971n044m977n856o509n951m888m551m689
58674E23905m101k554q44N28J491J732J206Q33J491K904M522O625R330J1486J2047
58659E70601J1627J1103R743O556K550l32j822k888l503l025k212k514l695m235
58645E87954l882l701l863l513k678k261k259j887j253j013p36M17J799K167K037
58630E67328K822M057M012K851K431K924K458N48r06p66l08p23j194n77Q49K331
58614E88137L905N769P653R334J0704J1153J0168Q472P136N819L493O58j089j509
58600F69803j810k422k708k821l605m660m684l864l659m137l852k545j600j386
$$ plain form
58700 779916 776206 769160 759118 746925 732854 716975 699922 682610 665652 649500 634643 621230
58688 621230 608978 597770 587882 579466 572341 566370 561326 556349 550493 543984 538033 533145 528594 523905
58674 523905 519804 517250 516406 516934 518425 520157 521363 522196 523687 526591 531113 537738 547068 558554 570601
58659 570601 582228 593331 603074 609630 612180 611848 610026 607138 603635 600610 598398 595884 592189 587954
58645 587954 584072 580371 576508 572995 570317 568056 565797 563910 562657 561644 560908 561325 563124 565291 567328
58630 567328 570150 574207 578219 581070 583501 586425 588883 589431 588525 587759 587451 586728 585534 584957 585806 588137
58614 588137 592042 597811 605464 614798 625502 636655 646823 655295 662431 668250 671743 672401 671312 669803
58600 669803 667993 665571 662863 660042 656437 651777 647093 643229 639570 635433 631581 629036 627436 626050
58586F26050n68J421L481M979O573Q445R764J0426J1188J1759J0906Q910P669
58573G21003P825Q061P652P379P427O858N891O279Q583J1311J3497J5836J8515
58560H46117K0415K1415K3049K5682K7297K6331K3671K0632J6969J2195O989K140
58548A072902k398o341q593q856q238p568o628n536n170n767o821q627j1987j6098
58534I64274j8959k0218k1274k2228k1359j8283j5049j3096j1536r371p058m945
58522G80898k475R3J423J437J685K613K782J589L59p8m36r13o28J26k59j708k181
58505G84327j258j053k430l358k461j267j346j958k148k501l208k952j407l58
58491G56622p98j290p16j05l11l46M23J037J300K707N548P783Q386Q989J0720
$$ plain form
58586 626050 625482 626903 630384 635363 641936 650381 660145 670571 681759 693518 704424 713334 721003
58573 721003 728828 736889 744541 751920 759347 766205 772096 778375 786958 798269 811766 827602 846117
58560 846117 866532 887947 910996 936678 963975 990306 1013977 1034609 1051578 1063773 1070762 1072902
58548 1072902 1070504 1064163 1055570 1046714 1038476 1030908 1024280 1018744 1013574 1007807 1000986 992359 980372 964274
58534 964274 945315 925097 903823 881595 860236 841953 826904 813808 802272 792901 785843 780898
58522 780898 778423 778516 779939 781376 783061 785674 788456 790045 790404 790326 789890 788977 788349 788475 788216 786508 784327
58505 784327 783069 782016 779586 776228 773767 772500 771154 769196 767048 764547 761339 758387 756980 756622
58491 756622 755824 754534 753818 753713 753402 753056 753479 754516 755816 758523 764071 771854 780240 789229 799949
58476G99949J2309J2977J4178J6525J7951J6951J4791J2540Q853L037k586n790
58464I21685p433r104j0327j0264r668q888o574k496R15K061K631M463O681Q097
58450H81779R552J1522J2284J0914R191Q178N798N65n288r084j1267j2935j2913
58437H98296j0393p541o203m762j486J736K438J819K397L758M181M290N630P537
58423I01697Q752J0140J2605J4409J3729J1875J0781R510O482K947Q15q43l678
58410I99221o467p168o661p049p946p760o950o835o944o423o172o704o157l416
58396I06569p51k09n0J926M192M417L817M667N903N362M101M361N262M708L551
58381I57826L823M735M482L998M930N864M758L059L346M747M970M761O099P902
$$ plain form
58476 799949 812258 825235 839413 855938 873889 890840 905631 918171 927024 930061 927475 921685
58464 921685 914252 905148 894821 884557 874889 866001 859427 856931 857846 859907 862538 867001 873682 881779
58450 881779 891331 902853 915137 926051 935242 943420 949218 949783 944495 935411 924144 911209 898296
58437 898296 887903 880362 874159 869397 867911 869647 872085 873904 876301 880059 884240 888530 894160 901697
58423 901697 910449 920589 933194 947603 961332 973207 983988 993498 999980 1002927 1003742 1002899 999221
58410 999221 992754 985586 978925 971876 963930 956170 949220 942385 935441 929018 922846 916142 909985 906569
58396 906569 905818 905609 905559 907485 911677 916094 919911 924578 930481 935843 939944 944305 949567 954275 957826
58381 957826 961649 966384 970866 974864 979794 985658 990416 993475 996821 1001568 1006538 1011299 1017398 1025300
58367A025300P957P246Q027R465R516R261J0850J3100J3669J3722J5730J8434
58355A162277J8805J7377J6822J6748J4716J1111Q304O314L771J728K037L486
58343A283496L866M168O276Q512Q238O946P850J0265J1377J1719J3748J6711J8069
58330A411241J8341J9603K0938K0434J9690K1095K2697K1097J7467J5248J4000
58319A621851J1238Q186P776Q885Q442P374Q467J0461J0358R467J0942J3485J3966
58306A750898J3990J6979K1076K2043K1109K2546K5447K5595K3788K4375K6941
58295A994787K7328K5773K6159K8221K8354K7208K8647L1970L3011L2015L2695
58284B316168L4495L3815L1871L3207L7267L9508L9895M2127M5580M6385M5378
$$ plain form
58367 1025300 1033257 1040503 1048530 1057995 1067511 1076772 1087622 1100722 1114391 1128113 1143843 1162277
58355 1162277 1181082 1198459 1215281 1232029 1246745 1257856 1266160 1272474 1276245 1277973 1280010 1283496
58343 1283496 1287362 1291530 1297806 1306318 1314556 1321502 1329352 1339617 1350994 1362713 1376461 1393172 1411241
58330 1411241 1429582 1449185 1470123 1490557 1510247 1531342 1554039 1575136 1592603 1607851 1621851
58319 1621851 1633089 1641275 1649051 1657936 1666378 1673752 1682219 1692680 1703038 1712505 1723447 1736932 1750898
58306 1750898 1764888 1781867 1802943 1824986 1846095 1868641 1894088 1919683 1943471 1967846 1994787
58295 1994787 2022115 2047888 2074047 2102268 2130622 2157830 2186477 2218447 2251458 2283473 2316168
58284 2316168 2350663 2384478 2416349 2449556 2486823 2526331 2566226 2608353 2653933 2700318 2745696
58273B745696M6497M8638M7878M6227M8931N4534N7177N7445O0966O7408P1146
58262C352543P2040P5150Q0486Q3438Q4695Q9150R5612R8307R7831R9787J03500
58251D332539J03415J00682J01705J06186J08550J10091J17078J27924J35271
58242E343441J39835J48708J61014J69399J74759J84705J98314K07739K14262
58233F942176K26692K44273K57916K68055K84002L05655L23908L39299L61627
58224I553603L90760M17290M42361M76483N18363N56496N92425O39642O98589
58215A4286012P56768Q14934Q87747R76642J068936J166256J285691J430166J587476
58206B4260628J761606J973186K225701K505588K820055L199329L659160M202484
$$ plain form
58273 2745696 2792193 2840831 2888709 2934936 2983867 3038401 3095578 3153023 3213989 3281397 3352543
58262 3352543 3424583 3499733 3580219 3663657 3748352 3837502 3933114 4031421 4129252 4229039 4332539
58251 4332539 4435954 4536636 4638341 4744527 4853077 4963168 5080246 5208170 5343441
58242 5343441 5483276 5631984 5792998 5962397 6137156 6321861 6520175 6727914 6942176
58233 6942176 7168868 7413141 7671057 7939112 8223114 8528769 8852677 9191976 9553603
58224 9553603 9944363 10361653 10804014 11280497 11798860 12355356 12947781 13587423 14286012
58215 14286012 15042780 15857714 16745461 17722103 18791039 19957295 21242986 22673152 24260628
58206 24260628 26022234 27995420 30221121 32726709 35546764 38746093 42405253 46607737
58198D6607737M862812N702483O765196Q081528R726351J1812462J4418111J7581093
58190A25557773K1366220K5853350L1015704L6599637M1949477M5666310M5496215
58183C73504686L9180593K6141834Q539530r607533k4628950l4774181m0095306
58176C38260673m1447684l9850304l6382359l2075321k7661686k3502470j9760837
58169A17580012j6534513j3832553j1574057r681106q122387o857381n811338
58162D5166677m929375m199928l607018l108980k679689k325066k042639j804140
58154B0469842j591602j413903j274237j154098j041362r43775q63490p86499
58146A1400876p07545o39096n85899n35300m81440m35189m01779l71309l39667
$$ plain form
58198 46607737 51470549 57173032 63938228 72019756 81746107 93558569 107976680 125557773
58190 125557773 146923993 172777343 203793047 240392684 282342161 328008471 373504686
58183 373504686 412685279 438827113 447366643 437759110 413130160 378355979 338260673
58176 338260673 296812989 256962685 220580326 188505005 160843319 137340849 117580012
58169 117580012 101045499 87212946 75638889 65957783 57835396 50978015 45166677
58162 45166677 40237302 36037374 32430356 29321376 26641687 24316621 22273982 20469842
58154 20469842 18878240 17464337 16190100 15036002 13994640 13050865 12187375 11400876
58146 11400876 10693331 10054235 9468336 8933036 8451596 8016407 7614628 7243319 6903652
58137F903652l16855l06168k95612k78290k61911k50583k36131k15286j97398
58128D545418j87200j76704j61538j49046j43138j36699j26063j17925j15252
58119C231853j10983j02137r5881r5220r2707q4749p8334p7123p4325o6146n9278
58108B294970n8075n6744n1263m7095m8018m8593m4806m1450m2151m2408l9233
58097A775134l7582m0496m2515l9554l6149l6373l6503l3083k9758k9712k9433
58086A383976k6084k3301k3830k4020k1281j9474k1409k3281k2031k0902k2362
58075A136001k2795j9588j6568j6876j7259j4767j2562j3631j5102j4053j2884
58064I59916j3736j3675j0660q366r812j1729j0428q048q000r179r447j0000j1836
$$ plain form
58137 6903652 6586797 6280629 5985017 5706727 5444816 5194233 4958102 4742816 4545418
58128 4545418 4358218 4181514 4019976 3870930 3727792 3591093 3465030 3347105 3231853
58119 3231853 3120870 3018733 2922852 2827632 2734925 2650176 2571842 2494719 2420394 2354248 2294970
58108 2294970 2236895 2180151 2128888 2081793 2033775 1985182 1940376 1898926 1856775 1814367 1775134
58097 1775134 1737552 1697056 1654541 1614987 1578838 1542465 1505962 1472879 1443121 1413409 1383976
58086 1383976 1357892 1334591 1310761 1286741 1265460 1245986 1224577 1201296 1179265 1158363 1136001
58075 1136001 1113206 1093618 1077050 1060174 1042915 1028148 1015586 1001955 986853 972800 959916
58064 959916 946180 932505 921845 913479 903667 891938 881510 873462 865462 856283 846836 836836 825000
58051H25000j2576j0986r949j1100j1431q950o495o226n638k969j156k316l628
58038G31580k853k677n192p349o401m914n820p268o939o767q785j0747j0423r926
58024F35519j1278j1991r631o673o245o934o168n020n292n464l810k067k100k353
58010E50493j385j217l299m961l782j820j577j600j7J297L40r45l31M01r42k555
57994E28100k055j038j960l585l673l217l940m504l225j679j722j853k77J377
57980D96749J134M24R46J009r96k727j675J93j32j483j153J5l49j445j061J46
57964D89595L42L54J747L134K473J024J202K370K493J931J999J872N24m87K89
57949E10862J078L7j012J74J924J627N16J150K547K323J520K662M894N653N512
$$ plain form
58051 825000 812424 801438 791489 780389 768958 760008 753513 747287 741649 738680 737524 735208 731580
58038 731580 728727 726050 720858 713509 707108 702194 696374 689106 682167 675400 666615 655868 645445 635519
58024 635519 624241 612250 602619 595946 589701 582767 576599 571579 566287 560823 557013 554946 552846 550493
58010 550493 549108 547891 544592 539631 535849 534029 532452 530852 530835 532132 532472 531527 531196 531597 530655 528100
57994 528100 526045 525007 523047 519462 515789 512572 508632 504128 500903 499224 497502 495649 495372 496749
57980 496749 497883 498307 499253 500262 499266 496539 494864 495057 494925 493442 492289 492304 491955 490510 489449 489595
57964 489595 489937 490291 492038 495172 497645 498669 499871 502241 504734 506665 508664 510536 511060 510573 510862
57949 510862 511940 511977 510965 511139 513063 514690 515206 516356 518903 521226 522746 525408 530302 535955 541467
57934E41467O715Q485Q452P442Q128R939R787P163M260J817j104l884m942m996
57920E98729o016p624q036p679q264r201q686p421p473q239p386n094l519k761
57906E01330j150R76J669J064R19R77m96k793l258j624k80j83j7N62L17o53o29
57889D96731O92J714J745J596J404M82o55o95J32M00n2m21r80k410l711l542k863
57872D89567l463m580m083k306j549k238k724k626l052l711l037j270l36m88j7
57857D54087J516K598K621K752L567M297M624N066N424N008M222L938L663K552
57843E05935J550K142L555L811K951K480K261Q95j185k035j394p17k68Q62K096
57828E22939J799L37k34M76R89J033J820L229L807L675M413N807N814M159K928
$$ plain form
57934 541467 548182 556667 565119 572561 580689 590628 600415 607578 611838 613655 612551 608667 603725 598729
57920 598729 592713 585089 577053 569374 561110 551909 543223 535802 528329 520090 512704 507610 504091 501330
57906 501330 500180 501156 502825 503889 504808 505785 505289 502496 499238 497614 497334 497151 497134 497696 498013 497360 496731
57889 496731 497423 499137 500882 502478 503882 504364 503709 503014 503146 503546 503494 503073 502093 499683 495972 492430 489567
57872 489567 486104 481524 477441 475135 473586 471348 468624 465998 462946 459235 456198 454928 454592 454104 454087
57857 454087 455603 458201 460822 463574 467141 471438 476062 481128 486552 491560 495782 499720 503383 505935
57843 505935 507485 509627 513182 516993 519944 522424 524685 525580 524395 522360 520966 520249 519981 520843 522939
57828 522939 524738 525075 524841 525317 526306 527339 529159 532388 536195 539870 544283 550090 555904 560063 562991
57813E62991L054L110K154Q87n80l240o599q332p473n686m628m244m156m480m681
57798E18097l876k692k621l319k991j611j041j615j468P9J273J001M55P40J243
57783E01654J420J935K983L587L549M046N442O439O325O084O467O805O539O105
57769E69380N638M591L199K512K475J830L78o20p49j069j955k384j978j761k241
57754E77246k642k599k679k809k196j138q48j077k09J823L074K662J945K015K311
57739E74879K454L073L891L414J506P1J13L42k67p61j99P17J262J881K631K408
57723E97415J007O8O66J711J939J723J749J648J143Q96J081P41l26q15j07N65
57707F11104K63j81m4k09j296k048j213L90J210J147R88Q78P01R00J634K140J945
$$ plain form
57813 562991 566045 569155 571309 572196 571616 568376 561777 553445 545972 540286 535658 531414 527258 522778 518097
57798 518097 514221 511529 508908 505589 502598 500987 499946 498331 496863 496942 498215 499216 499671 500411 501654
57783 501654 503074 505009 507992 511579 515128 519174 524616 531055 537380 543464 549931 556736 563275 569380
57769 569380 575018 579609 582808 585320 587795 589625 590003 589383 588634 587565 585610 583226 581248 579487 577246
57754 577246 574604 572005 569326 566517 564321 563183 562335 561258 561049 562872 565946 568608 570553 572568 574879
57739 574879 577333 580406 584297 587711 589217 589288 589401 589743 589476 588715 588516 589233 590495 592376 595007 597415
57723 597415 598422 598490 599156 600867 602806 604529 606278 607926 609069 609965 611046 611787 611461 610646 610539 611104
57707 611104 611367 611186 611142 610933 609637 607589 606376 606766 607976 609123 610111 610989 611690 612590 614224 616364 618309
57690F18309J716J926J911J152L55K36M53O63J451L152M931N992O707P654Q638
57675F65246R489J0797J2992J5783J9148K3832L0170L7528M5424N3902O1923O6413
57663A052647O3621N1107K9045J301k4906m2876n0957n2182m9636m4234l6921
57652H96009k9965k4763k0626j6860j3986j1831q825m677j625j289k167j911m40
57639G57044R25J869K797L478L628L819M395M570L844L116L216L577L442L153
57625H02873L110K844K209K074K727L087K595K267K731K911K085J399J832K331
57611H37075J723R11J343K652L614M138M564M334L160K293K776L596L349K627
57597H78155K807L531L374K219J113M71J45M67J598K540K439K117K765L901M260
$$ plain form
57690 618309 620025 621951 623862 625014 625369 625605 626058 626721 628172 631324 636255 642247 648954 656608 665246
57675 665246 674735 685532 698524 714307 733455 757287 787457 824985 870409 924311 986234 1052647
57663 1052647 1116268 1167375 1196420 1197721 1172815 1129939 1078982 1026800 977164 932930 896009
57652 896009 866044 841281 820655 803795 789809 777978 769153 764476 762851 761562 759395 757484 757044
57639 757044 757969 759838 762635 766113 769741 773560 777955 782525 786369 789485 792701 796278 799720 802873
57625 802873 805983 808827 811036 813110 815837 818924 821519 823786 826517 829428 831513 832912 834744 837075
57611 837075 838798 839709 841052 843704 847318 851456 856020 860354 863514 865807 868583 872179 875528 878155
57597 878155 880962 884493 887867 890086 891199 891670 891815 892282 893880 896420 898859 900976 903741 907642 911902
57582I11902L878L659L634L287K989L430M252M697M934N326N188L889K415K197
57568I65677L022L673L934M372M822M796M852N801P023P185O317N588N462N485
57554A038009N582O050O567O671O837P765Q904R072Q240P362O836O365O069O411
57540A136740P224P917Q391Q817Q959Q671Q491Q734Q666P662O485O223O646O832
57526A246458O729O853P102P179P537Q621R717R897R435R116Q828Q151P662Q156
57512A361441R139R451Q998Q555Q381Q193Q028Q021P861P462P373P667P402O352
57498A474324N880O802P734P199O099O145O990P141O720P002P868Q041P468P270
57484A572683P569P472P059P372Q498R502J0149J0924J1451J0822R377Q493Q584
$$ plain form
57582 911902 915780 919439 923073 926360 929349 932779 937031 941728 946662 951988 957176 961065 963480 965677
57568 965677 968699 972372 976306 980678 985500 990296 995148 1000949 1007972 1015157 1021474 1027062 1032524 1038009
57554 1038009 1043591 1049641 1056208 1062879 1069716 1077481 1086385 1095457 1103697 1111059 1117895 1124260 1130329 1136740
57540 1136740 1143964 1151881 1160272 1169089 1178048 1186719 1195210 1203944 1212610 1220272 1226757 1232980 1239626 1246458
57526 1246458 1253187 1260040 1267142 1274321 1281858 1290479 1300196 1310093 1319528 1328644 1337472 1345623 1353285 1361441
57512 1361441 1370580 1380031 1389029 1397584 1405965 1414158 1422186 1430207 1438068 1445530 1452903 1460570 1467972 1474324
57498 1474324 1480204 1487006 1494740 1501939 1508038 1514183 1521173 1528314 1535034 1542036 1549904 1557945 1565413 1572683
57484 1572683 1580252 1587724 1594783 1602155 1610653 1620155 1630304 1641228 1652679 1663501 1672878 1681371 1689955
57471A689955Q895R063R305R302Q663Q172Q864J0075J0299R706R938J1459J3004
57458A816700J3693J3842J3706J3156J2641J2771J3026J2510J1786J2118J3148
57447A959097J3369J2780J2886J3913J4316J3390J2317J2107J2481J3165J4433
57436B104254J5813J6130J5366J4792J4819J4538J3789J3804J5061J6326J6613
57425B271305J6459J6507J6407J5931J5711J6053J6295J6023J5702J5613J5442
57414B447448J5347J5995J7124J7591J7266J7340J8211J8763J8396J8078J8530
57403B640089J8970J8657J8169J8163J8204J7904J8004J9159K0601K1109K0554
57392B849583J9664J9007J8871J9366K0097K0477K0751K1707K3162K3890K3516
$$ plain form
57471 1689955 1698850 1707913 1717218 1726520 1735183 1743355 1752219 1762294 1772593 1782299 1792237 1803696 1816700
57458 1816700 1830393 1844235 1857941 1871097 1883738 1896509 1909535 1922045 1933831 1945949 1959097
57447 1959097 1972466 1985246 1998132 2012045 2026361 2039751 2052068 2064175 2076656 2089821 2104254
57436 2104254 2120067 2136197 2151563 2166355 2181174 2195712 2209501 2223305 2238366 2254692 2271305
57425 2271305 2287764 2304271 2320678 2336609 2352320 2368373 2384668 2400691 2416393 2432006 2447448
57414 2447448 2462795 2478790 2495914 2513505 2530771 2548111 2566322 2585085 2603481 2621559 2640089
57403 2640089 2659059 2677716 2695885 2714048 2732252 2750156 2768160 2787319 2807920 2829029 2849583
57392 2849583 2869247 2888254 2907125 2926491 2946588 2967065 2987816 3009523 3032685 3056575 3080091
57381C080091K3095K3264K3151K1995K0574K0080K0465K0879K0958K0856K0675
57370C316083K0564K0768K1133K1134K0749K0503K0466K0179J9813K0280K1773
57359C543445K3255K3885K3917K3801K3495K3150K3367K4178K4762K4743K4751
57348C806749K5269K5890K6183K6304K6348K6080K5685K5757K6228K6397K6207
57337D093097K6300K6607K6381K5910K6494K8236K9503K9339K8714K8610K8559
57326D397750K8157K8305K9566L0765L0648K9748K9223K8980K8474K8262K9092
57315D718970L0241L0358K9542K9079K9425K9830K9728K9364K9094K8989K9070
57304E043690K9298K9430K9388K9456K9684K9626K9121K8713K8838K9189K9438
$$ plain form
57381 3080091 3103186 3126450 3149601 3171596 3192170 3212250 3232715 3253594 3274552 3295408 3316083
57370 3316083 3336647 3357415 3378548 3399682 3420431 3440934 3461400 3481579 3501392 3521672 3543445
57359 3543445 3566700 3590585 3614502 3638303 3661798 3684948 3708315 3732493 3757255 3781998 3806749
57348 3806749 3832018 3857908 3884091 3910395 3936743 3962823 3988508 4014265 4040493 4066890 4093097
57337 4093097 4119397 4146004 4172385 4198295 4224789 4253025 4282528 4311867 4340581 4369191 4397750
57326 4397750 4425907 4454212 4483778 4514543 4545191 4574939 4604162 4633142 4661616 4689878 4718970
57315 4718970 4749211 4779569 4809111 4838190 4867615 4897445 4927173 4956537 4985631 5014620 5043690
57304 5043690 5072988 5102418 5131806 5161262 5190946 5220572 5249693 5278406 5307244 5336433 5365871
57293E365871K9790L0324L0509L0057K9569K9660L0061L0261L0373L0742L1289
57282E698506L1790L2221L2381L1937L1275L1455L2761L4116L4592L4571L4823
57271F060428L5305L5626L5858L6084L5920L5239L4668L4698L4899L4727L4354
57260F447806L4062L3660L3122L3073L3877L4955L5658L6072L6392L6283L5602
57249F830562L4901L4613L4517L4497L4846L5248L4636L2894L1499L1515L1962
57238G201690L1197K9076K6582K4296K2270K0764J9893J9156J8223J7637J7943
57227G448727J8824J9873K1308K3082K4243K4197K3769K3925K4330K4244K3968
57216G700490K4109K4159K3186K1400J9842J8937J8456J8352J8537J8370J7452
$$ plain form
57293 5365871 5395661 5425985 5456494 5486551 5516120 5545780 5575841 5606102 5636475 5667217 5698506
57282 5698506 5730296 5762517 5794898 5826835 5858110 5889565 5922326 5956442 5991034 6025605 6060428
57271 6060428 6095733 6131359 6167217 6203301 6239221 6274460 6309128 6343826 6378725 6413452 6447806
57260 6447806 6481868 6515528 6548650 6581723 6615600 6650555 6686213 6722285 6758677 6794960 6830562
57249 6830562 6865463 6900076 6934593 6969090 7003936 7039184 7073820 7106714 7138213 7169728 7201690
57238 7201690 7232887 7261963 7288545 7312841 7335111 7355875 7375768 7394924 7413147 7430784 7448727
57227 7448727 7467551 7487424 7508732 7531814 7556057 7580254 7604023 7627948 7652278 7676522 7700490
57216 7700490 7724599 7748758 7771944 7793344 7813186 7832123 7850579 7868931 7887468 7905838 7923290
57205G923290J6504J6385J6731J6557J5708J4718J3822J3085J2897J3249J3176
57194H086122J1989J0508R923J0013R726Q950Q481Q628R025R443R727R327P997
57181H209859O511N638M958L761K481J942J753Q08r34k561l740m862n941o667
57167H213006p410q922j1162j3460j5694j8221k0988k3732k6786l0544l4479l7781
57155G963827m0700m3988m7339m9702n0944n1933n3029n3708n3668n3201n2414
57144G413201n1092m9280m7212m4826m2185m0026l8914l8326l7509l6858l7290
57133F949683l8724m0409m2314m4856m7548m9414n0535n1852n3503n4585n4511
57122F421432n3425n1391m8350m4746m1240l7980l5075l3164l2324l1002k7499
$$ plain form
57205 7923290 7939794 7956179 7972910 7989467 8005175 8019893 8033715 8046800 8059697 8072946 8086122
57194 8086122 8098111 8108619 8118542 8128555 8138281 8147231 8155712 8164340 8173365 8182808 8192535 8201862 8209859
57181 8209859 8216370 8222008 8226966 8230727 8233208 8235150 8236903 8237711 8236777 8234216 8230476 8225614 8219673 8213006
57167 8213006 8205596 8196674 8185512 8172052 8156358 8138137 8117149 8093417 8066631 8036087 8001608 7963827
57155 7963827 7923127 7879139 7831800 7782098 7731154 7679221 7626192 7572484 7518816 7465615 7413201
57144 7413201 7362109 7312829 7265617 7220791 7178606 7138580 7099666 7061340 7023831 6986973 6949683
57133 6949683 6910959 6870550 6828236 6783380 6735832 6686418 6635883 6584031 6530528 6475943 6421432
57122 6421432 6368007 6316616 6268266 6223520 6182280 6144300 6109225 6076061 6043737 6012735 5985236
57111E985236k1943j5394p640K285J3967K6013L8402N2640O9736R0079J15118
57100F348499J47103J86938K34268K89855L56047M34826N27348O35180P59484
57091I919548Q98486J047798J203199J360484J512735J651283J770374J867829
57083B1231736J940805J985376K000702J984705J916995J750027J430914R42668
57075C5183928L27063l32463r50602j469948j866456k139525k300617k366010
57067B4085370k352965k277856k155749k000750j826148j643681j462374j288094
57059I077753j124489r74275q39674p21859o20490n33934m60030l96868l43073
57050C063061k97537k59036k26309j98324j74206j53108j34487j18308j04534
$$ plain form
57111 5985236 5963293 5947899 5940259 5942544 5956511 5982524 6020926 6073566 6143302 6233381 6348499
57100 6348499 6495602 6682540 6916808 7206663 7562710 7997536 8524884 9160064 9919548
57091 9919548 10818034 11865832 13069031 14429515 15942250 17593533 19363907 21231736
57083 21231736 23172541 25157917 27158619 29143324 31060319 32810346 34241260 35183928
57075 35183928 35510991 35178528 34227926 32757978 30891522 28751997 26451380 24085370
57067 24085370 21732405 19454549 17298800 15298050 13471902 11828221 10365847 9077753
57059 9077753 7953264 6978989 6139315 5417456 4796966 4263032 3803002 3406134 3063061
57050 3063061 2765524 2506488 2280179 2081855 1907649 1754541 1620054 1501746 1397212
57041A397212r2544q1591p1660o3244n6348n0352m4791l9599l4505k8929k2625
57030H11024j5732q114Q39J1556K3648L5300M2417L9309K2535m851l4027n6353
57018H67551o8497p2069p0053o4737n7809n0551m3647l7448l2362k8491k5226
57007C16661k1915j8712j6218j4440j2670j0427q057o322n642n806o188o185n544
56994A78535m382l052k003j466j140l92R99K658M362O429Q942J1105J2069J1864
56980B24528J0784Q346L990j504o442r956j2303j3517j3093j1201q985p210n540
56967A57897l554j572J8J451L100M953O955R237J1764J4259J6670J8977K0295
56954B60450J9046J4387P074j305r210j5294j8669j9506j8843j7398j5111j1947
$$ plain form
57041 1397212 1304668 1223077 1151417 1088173 1031825 981473 936682 897083 862578 833649 811024
57030 811024 795292 787178 788017 799573 823221 858521 900938 940247 962782 957931 923904 867551
57018 867551 799054 726985 656932 592195 534386 483835 440188 402740 370378 341887 316661
57007 316661 294746 276034 259816 245376 232706 222279 214222 207900 202258 196452 190264 184079 178535
56994 178535 174153 171101 169098 167632 166492 166100 167099 169757 174119 180548 189490 200595 212664 224528
56980 224528 235312 243658 247648 246144 239702 229746 217443 203926 190833 179632 170647 163437 157897
56967 157897 154343 152771 152789 154240 157340 162293 169248 178485 190249 204508 221178 240155 260450
56954 260450 279496 293883 300957 299652 290442 275148 256479 236973 218130 200732 185621 173674
56942A73674q449n273k727q76N13K206M895Q368J1922J5475J9403K3372K6434
56929B68937K8007K7597K3662J4706J961j0533j9390k4306k6559k6675k4708k1575
56917B11124j8612j6272j4196j2155j0184q289o639n618n166m624l674k695j904
56904A01096r11L78J282J411J327J566J854J947K432L862N779P313Q212Q748R305
56889A55601J0571J3305J7171K0569K2266K2441K1454J8639J3301O223q67o849
56877C13825j1339j3921j4359j3288j1788j0259q303n484j738K619O887J0361
56865B43213J3227J6616K1377K7225L3430L9671M5654N0301N1700M7660L6623
56854F26697J9191r08j8489l0292l6325l7985l6224l1927k6525k1037j5353r240
$$ plain form
56942 173674 165225 159952 157225 156349 156862 159068 163963 172331 184253 199728 219131 242503 268937
56929 268937 296944 324541 348203 362909 364870 354337 334947 310641 284082 257407 232699 211124
56917 211124 192512 176240 162044 149889 139705 131416 124777 119159 113993 109369 105695 103000 101096
56904 101096 100185 100563 101845 103256 104583 106149 108003 109950 112382 116244 122023 129336 137548 146296 155601
56889 155601 166172 179477 196648 217217 239483 261924 283378 302017 315318 321541 320674 313825
56877 313825 302486 288565 274206 260918 249130 238871 230568 225084 223346 225965 232852 243213
56865 243213 256440 273056 294433 321658 355088 394759 440413 490714 542414 590074 626697
56854 626697 645888 644980 626491 596199 559874 521889 485665 453738 427213 406176 390823 381583
56842C81583l088K932R492J6976K4872L2968M2061N2540O3394P3387Q1630Q5669
56830H64416Q0639O2709L3352r19l2606n6367o9858p3904p1761o6659n9803n1258
56818E57981m1794l2590k3866j5297p268k54O479J4123K2626L1117L9533M8248
56806E99038N6137O0383N8070M7268K7547J340k5530m6679n9122o3786o2828n8017
56794E33821n1217m4199l7419l0351k3204j7047j2099p401k407K440P002J2013
56782C29932J7954K4303L0057L3841L3526K7252J5428Q57j3395k5394l3900l8187
56770D02274l8806l7319l4698l0909k6271k1983j8811j6323j3929j1794j0151
56759A41280q733p379o371n716m906l836l116l013k867k106j069l76j48l09r43
$$ plain form
56842 381583 378495 381427 390919 407895 432767 465735 507796 560336 623730 697117 778747 864416
56830 864416 945055 1007764 1041116 1040197 1007591 951224 881366 807462 735701 669042 609239 557981
56818 557981 516187 483597 459731 444434 437166 436912 443391 457514 480140 511257 550790 599038
56806 599038 655175 715558 773628 820896 848443 849783 824253 777574 718452 654666 591838 533821
56794 533821 482604 438405 400986 370635 347431 330384 318285 310884 308477 310917 317919 329932
56782 329932 347886 372189 402246 436087 469613 496865 512293 513150 499755 474361 440461 402274
56770 402274 363468 326149 291451 260542 234271 212288 193477 177154 163225 151431 141280
56759 141280 132547 125168 118797 113081 108175 104339 101223 98210 95343 93237 92168 91792 91644 91335 90392
56744I0392j834k275j925j274q50m53K47Q85P52j99j141j219m09L68J65q19j264
56727G9147k96J299K029J538Q08O79J091J716K421K940K880K282J596J011M46
56712A01587J87O80J554J670M74j229k176j857o86N19J079R05N62N50O28K58m38
56695A04267p43l00M99R83O42o61k268k851j664M48J934K186J733J077K54n90
56679A04946j078j088p31m1Q37J413J460J424J554J280K72n81l77K29J9q07j089
56662A07642p23o12q50o82j62j33m22K01J910L293L424K945K664K479K234K229
56646A25437K328J806P28J70N36R07O71M57P84J036O68K78N22R68Q57L04p3j0
56628A38374N42J614K714K873J821L94o08j237j714j896j885k187k779k899k258
$$ plain form
56744 90392 88558 86283 84358 83084 82234 81781 82028 82913 83665 83466 82325 81106 80697 81065 81230 80411 79147
56727 79147 78851 80150 82179 83717 84525 85204 86295 88011 90432 93372 96252 98534 100130 101141 101587
56712 101587 101774 102454 104008 105678 106152 104923 102747 100890 100204 100723 101802 102707 103269 103819 104447 104705 104267
56695 104267 103524 103224 103723 104706 105348 104687 102419 99568 97904 98352 100286 102472 104205 105282 105536 104946
56679 104946 103868 102780 102049 102008 102845 104258 105718 107142 108696 109976 110248 109667 109290 109519 109538 108731 107642
56662 107642 106919 106307 105457 104775 104613 104480 104058 104259 106169 109462 112886 115831 118495 120974 123208 125437
56646 125437 127765 129571 130299 130469 131005 131912 132583 133040 133824 134860 135528 135806 136328 137296 138153 138457 138384 138374
56628 138374 138916 140530 143244 146117 147938 148332 147724 146487 144773 142877 140992 138805 136026 133127 130869
56613A30869j522j155q06l01j82o27q88m13L09O26M81j40j369k571k479r79L62
56596A19215L94j68j55L17N81P82J397K119K333K026J398L03j094j905j656j051
56580A24836p75l73P12J845K052J442P62J61m43m50P86K728M104M365L840K914
56564A48506J904J416J891K997M210N627P562R634J0948J0899R307O266K483o96
56550B22954k236k198j267q4O88M07q21k076k807l337l837l789l087k630k976
56535A92904l352k869j897j265r99q16j049j868k349j536lQ36N34l13j241k054
56519A72663k247j471l93j4l02m01n0J75j17o04q16n98q3L31K86l3k0M02N87K26
56499A67521j59k62n12j048j084k03P29Q50O36Q85J252R43J65l34n75r50j081
$$ plain form
56613 130869 129347 128192 127386 127085 126903 126276 125388 124975 125284 125910 126391 126251 124882 122311 119832 118853 119215
56596 119215 119609 119441 119286 119603 120184 120966 122363 124482 126815 128841 130239 130542 129448 127543 125887 124836
56580 124836 124061 123688 124400 126245 128297 129739 130501 130662 130219 129769 130555 133283 137387 141752 145592 148506
56564 148506 150410 151826 153717 156714 160924 166551 174113 183747 194695 205594 214901 221167 223650 222954
56550 222954 220718 218520 217253 217169 217857 218264 217443 215367 212560 209223 205386 201597 198510 195880 192904
56535 192904 189552 186683 184786 183521 182522 181706 180657 178789 176440 174904 174901 175737 176271 175958 174717 172663
56519 172663 170416 168945 168552 168538 168236 167835 167785 167960 167843 167239 166423 165825 165742 166073 166359 166326 166306 166708 167295 167521
56499 167521 167362 167100 166588 165540 164456 164253 164982 165832 166468 167353 168605 169548 169713 169379 168804 167854 166773
56482A66773l40Q30J358J066O99O52O75O20N82M73K20J24L47M42J14j16K42O91
56464A75452N11n6k84q5K18O57J297J651J364R42R36J010O90L37M22N30J50k83
56446A85459k17j06n23q26p9J241J772J074j34j132j530j034k7K81o04j453j095
56429A81067k94m44j220j229l62L00N42J133K075K434J959J426J359J608K048
56414A92402K466K129P49n22m83K46K53k77k9R39J184L04m62l40L5K4j62l09m89
56395A97658l26P25K153K738K216J401P09nl06N61K119K907K454J672J231R78
56379B18885R94J649K425K236J152L80K95N9n49n65M17J407J525J130Q97Q81R19
56362B34137R85Q76M23J80P95J763J943J285P93P97P39O50J317K651L424K994
$$ plain form
56482 166773 166433 167263 168621 169687 170386 171038 171713 172333 172915 173388 173608 173732 174079 174521 174635 174519 174761 175452
56464 175452 175963 175907 175623 175538 175756 176413 177710 179361 180725 181667 182603 183613 184303 184640 185062 185592 185742 185459
56446 185459 185242 185136 184613 183787 183708 184949 186721 187795 187661 186529 184999 183965 183938 184219 183615 182162 181067
56429 181067 180773 180329 179109 177880 177518 177818 178360 179493 181568 184002 185961 187387 188746 190354 192402
56414 192402 194868 196997 197746 197224 196741 196987 197240 196963 196934 197873 199057 199361 198899 198559 198594 198618 198456 198147 197658
56395 197658 197332 198057 200210 202948 205164 206565 207274 207269 206963 207524 209643 212550 215004 216676 217907 218885
56379 218885 219879 221528 223953 226189 227341 227721 228016 228075 227526 226961 227378 228785 230310 231440 232337 233218 234137
56362 234137 235122 235998 236421 236601 237396 239159 241102 242387 243180 243977 244716 245366 246683 249334 252758 255752
56346B55752K060J385R67P42Q41R78O44J45L19J209K137K924L815M366L839K620
56330B84743J822J674J658J898K773L502K977J795J499K014J879R64O05J029J014
56315C11846L64L03R68J001K06J52J360K287K143K227L387M402M255L909M303
56300C43113M627M166M025N277O848O980N693M346L689L618L923M202L956L515
56286D07978L882N078N904N892O048P004Q012Q538R210J0296J0917J0737J0879
56273E10375J2080J3412J3913J3989J4227J4338J4388J5452J7918K0486K2088
56262F82666K3402K5371K7634K9634L1936L5277L9443M4128M9752N6476O3659
56251A109378P1106P9585Q9308R9356J09389J20274J32173J43616J53418J61821
$$ plain form
56346 255752 257812 259197 260164 260906 261747 262725 263369 263514 263833 265042 267179 270103 273918 278284 282123 284743
56330 284743 286565 288239 289897 291795 294568 298070 301047 302842 304341 306355 308234 309198 309803 310832 311846
56315 311846 312210 312513 313481 314482 314688 314840 316200 318487 320630 322857 326244 330646 334901 338810 343113
56300 343113 347740 351906 355931 361208 368056 375036 380729 385075 388764 392382 396305 400507 404463 407978
56286 407978 411860 416938 422842 428734 434782 441786 449798 458336 467546 477842 488759 499496 510375
56273 510375 522455 535867 549780 563769 577996 592334 606722 622174 640092 660578 682666
56262 682666 706068 731439 759073 788707 820643 855920 895363 939491 989243 1045719 1109378
56251 1109378 1180484 1260069 1349377 1448733 1558122 1678396 1810569 1954185 2107603 2269424
56241B269424J68811J73023J73422J70341J63856J52909J37214J18060R6049P0037
56231C693146L9786P843k2820n1299p7525j00361j18718j33049j44068j51400
56221B941535j54866j55645j54704j51533j45762j38381j30214j20948j10970
56212A678512j02082r4906q7703p9395p1561o5552n9936n3085m6264m1560l8506
56201I37962l5275l1754k8874k6240k2959j9766j7891j6793j5188j3321j2141
56190F97760j1222r673q075p447p238o331n127m680m727m366l780l506l034j794
56176F16760m33L21Q50J305P58p55j225M50K458K916K753L564M637M686M587N646
56160F49278O834O608N979O811Q436Q875Q282Q310R118R796J0690J2640J4871
$$ plain form
56241 2269424 2438235 2611258 2784680 2955021 3118877 3271786 3409000 3527060 3623109 3693146
56231 3693146 3732932 3740775 3717955 3666656 3589131 3488770 3370052 3237003 3092935 2941535
56221 2941535 2786669 2631024 2476320 2324787 2179025 2040644 1910430 1789482 1678512
56212 1678512 1576430 1481524 1393821 1314426 1242865 1177313 1117377 1064292 1018028 976468 937962
56201 937962 902687 870933 842059 815819 792860 773094 755203 738410 723222 709901 697760
56190 697760 686538 676865 668790 661343 654105 647774 642647 637967 633240 628874 625094 621588 618554 616760
56176 616760 616327 616648 617498 618803 619561 618806 617581 618031 620489 623405 626158 629722 634359 639045 643632 649278
56160 649278 656112 662720 668699 675510 683946 692821 701103 709413 718531 728327 739017 751657 766528
56147G66528J6267J7740K0771K4767K8393L2339L8019M4690N0659N6190O2528
56136A158891O9121P4377P7945P9565P7214O9463N8639M8649M0913L5111L2181
56125A822069L2944L4850L3789K8556K0674J1101M89q534j3228j4544j5967j9338
56113A912861k4693l2868m4463n6938o6323p1460p3531p2463o7302n9314n1131
56102A292375m3372l5279k7772k2413j8359j3817r509p112n485k352J367L006
56090A111278K946L750N453O037N859P133R471J0373R774R863J0740J0580R696
56077A212953J0153J1654J2049J1585J2291J3718J3684J2800J3627J5793J6650
56066A356957J6343J7411J9704K0633K0262K1084K2981K3451K2799K3904K6716
$$ plain form
56147 766528 782795 800535 821306 846073 874466 906805 944824 989514 1040173 1096363 1158891
56136 1158891 1228012 1302389 1380334 1459899 1537113 1606576 1665215 1713864 1754777 1789888 1822069
56125 1822069 1855013 1889863 1923652 1952208 1972882 1983983 1984472 1975938 1962710 1948166 1932199 1912861
56113 1912861 1888168 1855300 1810837 1753899 1687576 1616116 1542585 1470122 1402820 1343506 1292375
56102 1292375 1249003 1213724 1185952 1163539 1145180 1131363 1121854 1114742 1109257 1106905 1108272 1111278
56090 1111278 1114224 1117974 1123427 1129464 1135323 1142456 1151927 1162300 1172074 1181937 1192677 1203257 1212953
56077 1212953 1223106 1234760 1246809 1258394 1270685 1284403 1298087 1310887 1324514 1340307 1356957
56066 1356957 1373300 1390711 1410415 1431048 1451310 1472394 1495375 1518826 1541625 1565529 1592245
56055A592245K8206K7824K7967K8904K8519K7110K7149K8159K7222K4720K4090
56044A892115K5782K6963K7318K9272L2368L3420L2593L3394L6196L7822L7875
56033B245118L9261M2079M3407M3526M5804M9915N1948N1824N3614N7882O0805
56022B785183O1712O4075O8139P0121O9929P2083P7565Q2266Q4814Q8258R2822
56011C616967R4999R5219R8146J03996J07917J09412J13534J21245J27718J31980
56001D721133J38716J48639J56777J62479J71063J83286J93413K00251K09427
55992F285184K22185K33030K41271K53360K70732K87187L01618L20940L46954
55983H762461L73098L97890M28049M64457M99351N31955N71907O22375O75370
$$ plain form
56055 1592245 1620451 1648275 1676242 1705146 1733665 1760775 1787924 1816083 1843305 1868025 1892115
56044 1892115 1917897 1944860 1972178 2001450 2033818 2067238 2099831 2133225 2169421 2207243 2245118
56033 2245118 2284379 2326458 2369865 2413391 2459195 2509110 2561058 2612882 2666496 2724378 2785183
56022 2785183 2846895 2910970 2979109 3049230 3119159 3191242 3268807 3351073 3435887 3524145 3616967
56011 3616967 3711966 3807185 3905331 4009327 4117244 4226656 4340190 4461435 4589153 4721133
56001 4721133 4859849 5008488 5165265 5327744 5498807 5682093 5875506 6075757 6285184
55992 6285184 6507369 6740399 6981670 7235030 7505762 7792949 8094567 8415507 8762461
55983 8762461 9135559 9533449 9961498 10425955 10925306 11457261 12029168 12651543 13326913
55974A3326913P28850P91969Q67842R48573J033717J135307J257985J393706J543362
55965B3028224J722797J939750K187702K471524K815292L235875L736142M335875
55957D5473181N081692O016913P175857Q621183J0448281J2734781J5523312J8865340
55949A29940540K2825471K7399605L2408653L7328308M0962264M1262736L5974166
55942C68101743K4181318P582626r938462k4367960l3532007l7490210l7554745
55935B56982303l5197500l1589116k7564430k3638215k0045673j6868998j4143670
55928H7934701j1861634r959839q368107p047772n965808n069874m315247l687115
55920C1659305l174591k748549k383403k075967j824672j611650j421526j257661
$$ plain form
55974 13326913 14055763 14847732 15715574 16664147 17697864 18833171 20091156 21484862 23028224
55965 23028224 24751021 26690771 28878473 31349997 34165289 37401164 41137306 45473181
55957 45473181 50554873 56571786 63747643 72368826 82817107 95551888 111075200 129940540
55949 129940540 152766011 180165616 212574269 249902577 290864841 332127577 368101743
55942 368101743 392283061 399865687 389927225 365559265 332027258 294537048 256982303
55935 256982303 221784803 190195687 162631257 138993042 118947369 102078371 87934701
55928 87934701 76073067 66113228 57745121 50697349 44731541 39661667 35346420 31659305
55920 31659305 28484714 25736165 23352762 21276795 19452123 17840473 16418947 15161286
55912A5161286j124230j010108r04498q11520p35871o69467o04904n47730n03383
55903H249575m65202m26500l91914l66133l43231l17397k93138k75224k58939
55894E111897k39493k21066k07726j94938j78566j63098j52756j43258j30286
55885C480710j17642j09334j01829r1849q3991q3024q5724q7254q8636r1197r0852
55874B449378q4905p7882p4135p1005o5558o1354o1832o3228o0819n6573n4251
55863A717836n2360m8228m3875m1825l9967l6283l3714l4718l5972l4064l1529
55852A285301l1594l1864k9124k5842k5854k7581k7416k6127k6317k6954k5807
55841I80821k4113k3766k3104k0281j7641j7903j9114j8043j5555j4123j3140
$$ plain form
55912 15161286 14037056 13026948 12122450 11310930 10575059 9905592 9300688 8752958 8249575
55903 8249575 7784373 7357873 6965959 6599826 6256595 5939198 5646060 5370836 5111897
55894 5111897 4872404 4651338 4443612 4248674 4070108 3907010 3754254 3610996 3480710
55885 3480710 3363068 3253734 3151905 3060056 2976065 2893041 2807317 2720063 2631427 2540230 2449378
55874 2449378 2364473 2286591 2212456 2141451 2075893 2014539 1952707 1889479 1828660 1772087 1717836
55863 1717836 1665476 1617248 1573373 1531548 1491581 1455298 1421584 1386866 1350894 1316830 1285301
55852 1285301 1253707 1221843 1192719 1166877 1141023 1113442 1086026 1059899 1033582 1006628 980821
55841 980821 956708 932942 909838 889557 871916 854013 834899 816856 801301 787178 774038
55830G74038j1106r471r879j0498r262p827q269q963p933p135q998j1695j2224
55817F50778j1458j1763j2371j1403j0020j0168j0627r380p635p411p511n834
55805E35197l493k662k514j161N76J131J668L751N759N422L870L397L360K027
55791E56328L06k15p01k708m474l722k016k200l351k715j151k093o076j0325j3089
55776E01798j4699j5077j3671j1301r090o362k162K439O031R005J1184R659K624
55763D70378o388j2011j3379j3439j3495j2509j0679r544r063q120p438q598j0690
55750C35025j1287j0233r364r011p942o237n196m711l654k393k199k607k030n04
55736B57657O30J076J240N09j518l102k373l98L64l46j180k108l804n215m872
$$ plain form
55830 774038 762932 753461 743582 733084 723822 715995 707726 698763 690830 683695 674697 663002 650778
55817 650778 639320 627557 615186 603783 593763 583595 572968 563588 555953 548542 541031 535197
55805 535197 531704 529042 526528 525367 525943 527074 528742 532493 538252 543674 547544 550941 554301 556328
55791 556328 556634 556419 555718 553010 548536 544814 542798 540598 537247 534532 533381 531288 525212 514887 501798
55776 501798 487099 472022 458351 447050 437960 431598 429436 431875 437906 446911 458095 467754 470378
55763 470378 463990 451979 438600 425161 411666 399157 388478 378934 369871 361751 354313 345715 335025
55750 335025 323738 313505 304141 295130 287188 280951 275755 271044 267390 264997 262798 260191 258161 257657
55736 257657 258287 259363 260603 261112 259594 256492 254119 253721 254085 253739 252559 250451 246647 241432 236560
55721B36560l802m021m966m466k624j508j548j323m52K69J117K969M993N645N417
55706B32260N717N759L757O07r29n32n72k129l886n060o307p441p112n318l705
55691B05109l038k625k301k649l214k836j748j181j033j51J331K259K689L541
55677A94153M398M041K852K177J809O27p76q70j51m32j513j625r14j339k953l523
55661A95961k228p32j05N33J602K072J587J224J477J647J610J991K357J611L08
55646B10915J97J229J584Q41M56P37J43j768l412l894m230n096n726n762n940
55631A80274o265n742m546m120m526m069k274q79r33j270q48m27q29j474j652
55616A40420j579j384p14J03J54l37k89N3p11k434l214k454j742k050k346j811
$$ plain form
55721 236560 232758 228737 223771 219305 216681 215173 213625 212302 211850 212119 213236 216205 221198 226843 232260
55706 232260 237977 243736 247493 248100 247171 246639 246067 243938 240052 234992 228685 221244 214132 208814 205109
55691 205109 202071 199446 197145 194496 191282 188446 186698 185517 184484 184333 185664 187923 190612 194153
55677 194153 198551 202592 205444 207621 209430 210057 209281 208411 208260 207828 206315 204690 203776 202437 199484 195961
55661 195961 193733 193001 192896 193429 195031 197103 198690 199914 201391 203038 204648 206639 208996 210607 210915
55646 210915 211112 212341 213925 214766 215222 215959 216102 214334 210922 207028 202798 197702 191976 186214 180274
55631 180274 174009 168267 163721 159601 155075 151006 148732 147853 146920 145650 144802 144375 143546 142072 140420
55616 140420 138841 137457 136743 136846 137000 136663 136374 136427 135716 133282 130068 127614 125872 123822 121476 119665
55600A19665j122p12J1Q52N27q59j384l50M86j04q69n03J68q9q12r70o66l63J50
55581A13056Q42R50L49J1K58J85m49n38L32J061J158J660K946L705L304L075L862
55564A35767M289L133J485P63K74j236l078l740l418l479m076m130l210j993j127
55549A16224p43p34p69m88j89n65j384j464m39O40R80J017J172J014M01R9N17
55532A15289J013J159J333J474Q03n15j029j63P88O83K6m64j089j983k339j913
55516A13073j775k411k654j692n97n94j261j686j979k291j886n91K23m03j324
55501I2152j066n9L93K15J21J21o8p3L32M33k14p92o28l82o90q14n8P44O42K61
55481I0570N51R57M96l34m09O8J35j75j75K2j72o40r51j212j446j041O5O61K3
$$ plain form
55600 119665 118543 117831 117842 118694 119221 118362 116978 116628 117114 117010 116141 115638 115806 115717 114905 113935 113269 112906 113056
55581 113056 113898 114848 115197 115208 115466 115651 115202 114664 114996 116057 117215 118875 121821 125526 128830 131905 135767
55564 135767 140056 143189 144674 145437 145711 144475 141397 137657 134239 130760 126684 122554 119344 117351 116224
55549 116224 115481 114747 113978 113490 113301 112736 111352 109888 109449 110089 111069 112086 113258 114272 114673 114772 115289
55532 115289 116302 117461 118794 120268 121071 120556 119527 119364 120152 120835 120861 120397 119308 117325 114986 113073
55516 113073 111298 108887 106233 104541 103944 103350 102089 100403 98424 96133 94247 93656 93879 93476 92152
55501 92152 91086 91027 91420 91635 91756 91877 91809 91736 92068 92501 92287 91495 90867 90485 89795 88981 88923 89667 90309 90570
55481 90570 91121 92078 92574 92240 91831 91899 92034 91859 91684 91706 91534 90894 89943 88731 87285 86244 86309 86970 86993
55462H6993p61n70r0l00m59M41J414Q66n62q63J56Q05L76r6M7J87m4j38J18K27
55442H7747L6k7M5k42p93q75l32J70J78n4j51J9M70R86J091P35N46Q08Q66K85
55422I1508j90J72O85K92o56r61m50K1J59N14J272J914K060J759J097K63k89m25
55404I8745p52j663k467k308j428o68k97j56l32p46p67j71J85l49r96p41k5J6
55386H5080n92r28p57n80m63p9L78M26K14K21M23N69P81R62M08r98j942j302J27
55367H1948P60L95p3l34o32o88j92J63l82j180j162o99q69j352q89M95J468J510
55349G8287J389J485J243M26m57r98j102n42N09R81L12k32P48K326K413R78j5
55332H7751J95L17l65q37m18M0j40k93O6J86m38r34m58L87O52N56Q23J253J058
$$ plain form
55462 86993 86232 85662 85572 85272 84813 85254 86668 87534 86972 86109 86265 87070 87446 87350 87397 87584 87540 87402 87520 87747
55442 87747 87783 87756 87801 87559 86766 85891 85559 85729 85907 85853 85702 85721 86191 87177 88268 89003 89549 90357 91223 91508
55422 91508 91318 91490 92175 92467 91811 90850 90400 90421 90580 91094 92366 94280 96340 98099 99196 99459 99170 98745
55404 98745 97993 96330 93863 91555 90127 89459 89162 89006 88674 87928 87161 86990 87175 86826 85830 85089 85064 85080
55386 85080 84488 83560 82803 82223 81760 81681 82059 82485 82699 82920 83343 83912 84693 85655 86063 85065 83123 81821 81948
55367 81948 82708 83103 83030 82696 82064 81376 81184 81347 80965 79785 78623 77924 77055 75703 74814 75309 76777 78287
55349 78287 79676 81161 82404 82830 82373 81375 80273 79731 80240 81221 81533 81301 82049 84375 86788 87766 87751
55332 87751 87946 88263 87898 87061 86643 86683 86543 86250 86316 86502 86064 85130 84672 85059 85711 86267 87090 88343 89401
55313H9401J78o22p41k61L08N11L00M0l7k84j070k026k390j944j027P2J061J362
55295H2831P72J10K24O66L86n26r39m22K71M73L08K8k81k98K74R68R65K86k48
55276H5848j70L13R34J356R34m56j656j451l21K12k32o96o32m35k82J10N32M64
55258H4372K17N49J108P96k11m72M37J175O97l57r63j035q77m80kN7k67k69K65
55239H4740O52L96j94o81q94m97O88J834J698L98o05n15o4j15n89j082j368j030
55221H2772K33J609J739N94m55o75p39j166j462j308j171j163o43L56P33O0n58
55204G8756j68O84J119J221J351J260Q04N40P61Q26K79k92k83o0j73m28m81n09
55186H5207o19l89L08Q04O32J92o7k93n28l12L98Q34N53J20R9K89M78Q51J187
$$ plain form
55313 89401 89579 88957 88216 87955 88263 88774 89074 89114 89077 88793 87723 85697 83307 81363 80336 80408 81469 82831
55295 82831 83603 83713 83937 84603 84989 84463 83524 83102 83373 83846 84154 84182 83901 83603 83877 84845 85810 86096 85848
55276 85848 85678 85991 86925 88281 89215 88759 87103 85652 85331 85543 85311 84615 83983 83548 83266 83376 83908 84372
55258 84372 84589 85138 86246 87042 86831 86359 86796 87971 88668 88311 87348 86313 85436 84956 84954 85011 84744 84475 84740
55239 84740 85392 85788 85594 84913 84019 83522 84210 86044 87742 88140 87535 87020 86956 86841 86252 85170 83802 82772
55221 82772 83005 84614 86353 86947 86492 85817 85078 83912 82450 81142 79971 78808 78165 78521 79254 79314 78756
55204 78756 78588 79272 80391 81612 82963 84223 85027 85567 86328 87154 87433 87141 86858 86798 86625 86197 85716 85207
55186 85207 84588 84199 84507 85311 85943 86135 86068 85775 85247 84935 85333 86167 86720 86840 86939 87228 87706 88557 89744
55167H9744P67k85p54j93K69k55j013j015n75l54KR63J846J792J219J068J198
55150I4424Q43Q0l67l99m48m95j74L55O29O65P67P85L72l14q06r55q46m46Q7K78
55130I4035j2k97k62k45m66n14j31J98O2k18l15m87p98o28K45R34O58m2j59L95
55110I1953R97J287J144M84k51k09N46P47k04j158r27q8J64j9K55Q71J035P63
55092I7390O43N22j35r02q06P8P60Q43P74P13L90L5K60R82J430J296R23M58k53
55073A05401r40j034n70j75n8J49N44P18M87J91J73M28P64Q52L50n72j097p15
55055A04896m0K1m28n18P9P84R79O21J5m74o18n62p08j081j191q48n42o41p68
55036I8976n46k83l32l69j5M21N02L76K72p7p36j006m44K69L49J21K12K87k76
$$ plain form
55167 89744 90511 90226 89472 89279 89548 89293 88280 87265 86690 86336 86338 87301 89147 90939 92158 93226 94424
55150 94424 95267 95347 94980 94581 94133 93638 93464 93819 94448 95113 95880 96665 97037 96723 95917 94962 94116 93670 93757 94035
55130 94035 94023 93726 93464 93219 92753 92239 92108 92306 92368 92150 91835 91348 90550 89922 90167 91101 91759 91717 91558 91953
55110 91953 92950 94237 95381 95865 95614 95405 95951 96698 96494 95336 94409 94321 94485 94466 94721 95592 96627 97390
55092 97390 98033 98555 98420 97518 96712 96790 97550 98393 99167 99880 100270 100305 100565 101547 102977 104273 105196 105654 105401
55073 105401 104461 103427 102857 102682 102624 102773 103317 104035 104522 104713 104886 105314 106078 106930 107280 106708 105611 104896
55055 104896 104856 104877 104449 103931 104010 104794 105773 106394 106409 105935 105317 104755 104047 102966 101775 100927 100385 99744 98976
55036 98976 98430 98147 97815 97446 97431 97852 98354 98730 99002 98925 98189 97183 96739 97008 97357 97478 97690 97977 97701
55017I7701j009r41j46N01P71J124J543J561J199Q74N94K27J46O07Q57J05r88
55000A04726j098k53K99N7k30oM88J055J695J917J140r8o12k67l5k67k87J06J36
54981A08466m75q80m68J92L50N7l92j020j669j726r30K12J173J905K306K039J197
54964A10337M12n8n70j139j157l93N11J057J469J817J461J11j348j876j529r72
54948A08133l33O01J447J528R48N21N39L75m17j211j075o0P69O54L1j43L57R18
54930A13582J078J035J049R72O52M02N12P91R63J181J673K208K448K581L037L786
54914A37950M444M905N319N593N306M118K041n16k768m067m598n115n704n516
54900A41392m176k667k129k401k504k005j211n23l10q01j451j117L43J506J264
$$ plain form
55017 97701 96692 95751 95605 96106 96877 98001 99544 101105 102304 103178 103772 103999 104145 104752 105609 105714 104726
55000 104726 103628 103375 103674 103731 103501 103495 103983 105038 106733 108650 109790 109692 109080 108813 108778 108511 108224 108330 108466
54981 108466 107991 107111 106643 106835 107185 107242 106850 105830 104161 102435 101505 101717 102890 104795 107101 109140 110337
54964 110337 110749 110691 110121 108982 107825 107432 107943 109000 110469 112286 113747 113858 112510 110634 109105 108133
54948 108133 107800 108401 109848 111376 112324 112845 113384 113759 113342 112131 111056 110996 111765 112419 112450 112307 112664 113582
54930 113582 114660 115695 116744 117716 118368 118770 119282 120073 121036 122217 123890 126098 128546 131127 134164 137950
54914 137950 142394 147299 152618 158211 163517 167635 169676 169160 166392 162325 157727 152612 146908 141392
54900 141392 137216 134549 132420 130019 127515 125510 124299 123776 123466 122665 121214 120097 120440 121946 123210
54885A23210L76O4J11k13l56N89J788J613L95K16J765L448L969L986M527N343
54869A50831N694N472M770L380J479j49j203k307l765m740m443l420k905l345
54855A45349m100m342l902l347l291l514l120j894r42j157j755j398l15J31l37
54840A12066o52l17J2oQ6L27R8m23j96Q43J298L92q21j122o69j56L78R58J028
54821A13124L91j74q2J04k26o44n54l56o27r53n67L38R25R37P45N26J88j47j91
54802A12757P0L98N21K29l87o73l2J097J562J017K98Q1J00oo2k0k70p80q23j57
54782A14920M48M12J92K71K47k58o27p1J169K179K495K265J856J742K193K741
54766A32174K654K230K625M010N072M991M722N367O387O460N334L671J847r2j805
$$ plain form
54885 123210 123586 123650 123761 123548 123192 123781 125569 127182 127577 127793 129558 133006 136975 140961 145488 150831
54869 150831 156525 161997 166767 170147 171626 171477 170274 167967 164202 159462 155019 151599 148694 145349
54855 145349 141249 136907 133005 129658 126367 122853 119733 117839 116897 115740 113985 112587 112272 112403 112066
54840 112066 111414 111097 111109 111103 111189 111516 111614 111191 110995 111838 113136 113528 112707 111585 110916 110760 111138 112096 113124
54821 113124 113515 113341 113259 113363 113137 112493 111939 111583 110956 110003 109436 109774 110699 111636 112381 112907 113095 112948 112757
54802 112757 112827 113225 113746 113975 113588 112915 112883 113980 115542 116559 116857 116938 117038 117032 116970 116950 116680 115900 115077 114920
54782 114920 115368 115780 115972 116243 116490 116232 115605 115534 116703 118882 121377 123642 125498 127240 129433 132174
54766 132174 134828 137058 139683 143693 148765 153756 158478 163845 170232 176692 182026 185697 187544 187452 185647
54751A85647l040m146n350o032n620m640m056m003l948l588k963k151j527j627
54737A32956k226k284j470p80r06j095n93o6l44p86l33O44J138J405K349L497
54721A31106L465K312J739K728M353N305N346M944M396L703K648R44j093k389
54707A69507k345j962k667m339n517n424m604l688k768k045j876j943j480n84
54693A28265k86j003j868k011j602j164o64J05P60O60k16j113j266o46L7J55n3
54676A18090J59Q75J244P31p0l35r4J40K51L14J13l44m85j62l22j606k930k787
54658A12782j442m41k04K71J347K032J641P67J61k25n72o38l84j95p7N25J660
54641A17008K457K246J314K06r04j764j771q18K29M81L2m00l71P4O19Q34N25J28
$$ plain form
54751 185647 182607 178461 173111 167079 161459 156819 152763 148760 144812 141224 138261 136110 134583 132956
54737 132956 130730 128446 126976 126196 125290 124195 123602 123536 123192 122406 122073 122717 123855 125260 127609 131106
54721 131106 134571 136883 138622 141350 145703 151008 156354 161298 165694 169397 172045 172989 171896 169507
54707 169507 167162 165200 162533 158194 152677 147253 142649 138961 136193 134148 132272 130329 128849 128265
54693 128265 127979 126976 125108 123097 121495 120331 119667 119772 120532 121192 120976 119863 118597 117951 117988 118143 118090
54676 118090 118249 119124 120368 121099 121029 120694 120600 120740 120991 121305 121418 121074 120589 120427 120105 118499 115569 112782
54658 112782 111340 110899 110695 110966 112313 114345 115986 116753 116914 116689 116117 115479 115095 114900 114823 115348 117008
54641 117008 119465 121711 123025 123231 122327 120563 118792 117974 118203 118684 118716 118316 117945 118019 118638 119472 119997 120125
54623A20125K45P34P94J33o83j146j349j329p48L45J168J177P99O42N35k5q94
54606A20523j407j233o33L6N41P41O49M91M17K85q1n48p69n87j54K35M20N05P01
54587A20132R46R11N50L24N63Q86P56L42K17L36O4p91j591j700j174n01j03j42
54569A20025l73k16O26J621J962J554R42M79J86K08N96P80J98o10n60K19L79o42
54551A27374j730j781j149o89l54K82Q62P21J24kO33J410J823J954J965J761J298
54534A34502P61L27L8j2K65P00R11O13j52j064j641j500p06K07P26P98O94N98
54516A36065M45Q2m86r74r84m67N1j0n45r04p42m00l48n87q07q03n68j81K34N91
54496A28662Q85J020P11q2p89p65j73K25J54N4J16j06p05p96L57K021K649J762
$$ plain form
54623 120125 120370 121104 121898 122031 121348 120202 118853 117524 116776 117121 118289 119466 120265 120907 121442 121417 120523
54606 120523 119116 117883 117250 117286 117827 118568 119217 119708 120125 120410 120329 119781 119012 118425 118271 118506 118926 119431 120132
54587 120132 121078 121989 122539 122863 123426 124312 125068 125410 125627 125963 126027 125236 123645 121945 120771 120270 120167 120025
54569 120025 119652 119436 120062 121683 123645 125199 126141 126620 126806 127014 127610 128390 128588 127978 127418 127637 128016 127374
54551 127374 125644 123863 122714 122025 121671 121953 122815 123536 123660 123658 124291 125701 127524 129478 131443 133204 134502
54534 134502 135263 135590 135628 135616 135881 136581 137492 138105 137953 136889 135248 133748 133042 133249 133975 134773 135467 136065
54516 136065 136510 136592 136106 135132 134148 133681 133732 133722 133177 132273 131531 131131 130783 130196 129389 128586 128018 127837 128071 128662
54496 128662 129547 130567 131278 131196 130407 129642 129469 129694 129848 129902 130018 129912 129207 128411 128768 130789 133438 135200
54478A35200M76J8L57N41O7n77o21O4Q37J009N15r9k39K13Q31J032N89j40n79
54459A39494n78n02o07o43k42M34Q11N75m2n49n70r3M28L54n02j521j861j276
54441A33110k97L46L35J4O1O95J256R59R5k26L26P74L60l28l85L2K73M25Q51J140
54421A39816P14Q4J81O77M49m03n30M73J372J228O40L52m4j031j917j714o42K75
54403A39980O63R12J207J306J172J071J066Q95M38m8j86J27N48N73J95M6N25J024
54385A51514O79k32n91j24J96k68q54p43j47K41K59M1n12j235j344m22O60P37
54367A47855p7o37l79J98N49P60J026J223J280J439J867K203J903Q86l08j029
54351A58759j088p79l87Q5O01Q42N72P4j60p6J22N13J307K221K723K870L256M039
$$ plain form
54478 135200 135676 135694 136051 136592 136659 136082 135461 135525 136362 137371 137886 137787 137548 137761 138592 139624 140213 140073 139494
54459 139494 138916 138414 137807 137164 136922 137356 138167 138742 138700 138151 137581 137488 137916 138270 137768 136247 134386 133110
54441 133110 132813 133159 133494 133508 133569 134264 135520 136479 136574 136348 136674 137448 137808 137480 137095 137127 137400 137825 138676 139816
54421 139816 140530 140614 140795 141472 141921 141518 140988 141461 142833 144061 144701 145053 145009 143978 142061 140347 139705 139980
54403 139980 140643 141555 142762 144068 145240 146311 147377 148272 148710 148662 148476 148603 149151 149724 149919 149965 150490 151514
54385 151514 152193 151961 151370 151246 151442 151174 150320 149577 149430 149671 149930 149971 149459 148224 146880 146458 147118 147855
54367 147855 147778 147141 146762 146960 147509 148269 149295 150518 151798 153237 155104 157307 159210 160096 159788 158759
54351 158759 157671 156892 156505 156590 157191 158033 158605 158679 158519 158443 158565 159078 160385 162606 165329 168199 171455 175494
54333A75494M757N146N313N048L843J951M32k74r65k325l823m632m902n230n474
54318A74359n000l814k619j896j511j183q57o60p50j046j066m44L27L39m03q75
54302A52901o15m48j055j745j520o59j80k98l35Q6O99J161J215O33k73m49O95
54285A49813K181K477J370l6r23j330j375r95n33n29p66m19O04J415J463J280
54269A53697J471J790J721J335J003O73J30m09m61J9M95N23K05l7n7j54o09j170
54251A60165j222n45L64Q99J000R47Q02M27q7m23m15k09n4r8l44o39q33j019j386
54232A57330j777j795j439j197j295j361j113q21p39o51m79o52j243j346j98J515
54216A42739K385K076J484J274J189Q18J99m50r30r38l89J59P8l38k24M97R40
$$ plain form
54333 175494 180251 185397 190710 195758 199601 201552 201984 201710 200745 198420 194597 189965 185063 179833 174359
54318 174359 169359 165545 162926 161030 159519 158336 157479 156819 156069 155023 153957 153513 153840 154179 153776 152901
54302 152901 152286 151838 150783 149038 147518 146859 146679 146381 146046 146132 146831 147992 149207 149840 149567 149118 149813
54285 149813 151994 154471 155841 155805 154882 153552 152177 151182 150649 150120 149354 148935 149539 150954 152417 153697
54269 153697 155168 156958 158679 160014 161017 161690 161820 161411 160950 160969 161464 161987 162192 162155 162098 161944 161335 160165
54251 160165 158943 158398 158762 159661 160661 161608 162410 162837 162750 162327 161912 161703 161649 161551 161207 160568 159735 158716 157330
54232 157330 155553 153758 152319 151122 149827 148466 147353 146532 145793 145142 144663 144011 142768 141422 141224 142739
54216 142739 145124 147200 148684 149958 151147 151965 152164 151714 150784 149846 149457 149616 149694 149356 149132 149629 150569
54199A50569O35K47N65J461K235K473K178J485O50J8k87m55o11o66o45p82j172
54182A57898j601j829j741j255n11m3k70p20l58J038K374K388R39j024k379k487
54166A50419j478k09M18L14R8K9l56j261j935j580n03L07N34P01J066J148N98
54149A48310o4r9M80R47Q05K52k54n34o33n73l65j33M0K63N96P59M25j55j76Q01
54129A50692K161K728J891J85j212j486q28j13N9o0J20O48J043R95O55K15k24
54112A57469l44K23J178J617J113K44k80m61n90n68k46O1L0m4K59O83O19Q6l10
54093A60739k13J67M77M66l4p59r30j26R26J112M25p0L01J064J478J448J325J325
54075A69121J451J613J635J386R60N20L2m94o67j32P79J346J371J266J247J053
$$ plain form
54199 150569 151204 151451 152016 153477 155712 158185 160363 161848 162498 162516 162229 161774 161163 160497 159852 159070 157898
54182 157898 156297 154468 152727 151472 150961 150918 150648 149928 149570 150608 152982 155370 156309 155285 152906 150419
54166 150419 148941 148732 149150 149464 149562 149591 149235 147974 146039 144459 143956 144263 144797 145498 146564 147712 148310
54149 148310 148246 148147 148627 149574 150379 150631 150377 149843 149210 148637 148272 148139 148179 148442 149038 149797 150222 150067 149891 150692
54129 150692 152853 155581 157472 157657 156445 154959 154131 154018 154077 154017 154137 154785 155828 156823 157478 157693 157469
54112 157469 157125 157348 158526 160143 161256 161500 161220 160759 160169 159601 159355 159416 159446 159402 159661 160344 160963 161049 160739
54093 160739 160526 160693 161170 161636 161602 160843 159913 159787 160713 161825 162250 162180 162481 163545 165023 166471 167796 169121
54075 169121 170572 172185 173820 175206 176166 176686 176718 176224 175557 175425 176204 177550 178921 180187 181434 182487
54059A82487O32M26O59R05O86K83M38J395K492K790K104J315J499K656L651L580
54043B07998K864K569L061L881M685N558O474P137P499P960Q882J0308J2134J4155
54029C05165J6003J7389J8359J8752J7623J3939Q048J772l182o491q766j0434
54017C88177j1442j1631j1038r951q789p837p130o664o582o882p265p508p717
54004B77741p771p031n280l557l123l787m201l722k919k295j604q14n70j153j911
53989B28003k318k723l392l632k826j666j323j768j917j319o70n48n64j87K68
53974B03418Q3p17j266r48j49L07J84j16l26n73p74m08O32J547J556R87P45R69
53956B05151J043P72O99J111J590J777J846J926J750J294J161J792K718L103K817
$$ plain form
54059 182487 183119 183545 184204 185109 185795 186078 186516 187911 190403 193193 195297 196612 198111 200767 204418 207998
54043 207998 210862 213431 216492 220373 225058 230616 237090 244227 251726 259686 268568 278876 291010 305165
54029 305165 321168 338557 356916 375668 393291 407230 415278 417050 413868 407377 398611 388177
54017 388177 376735 365104 354066 344115 335326 327489 320359 313695 307113 300231 292966 285458 277741
54004 277741 269970 262939 257659 254102 250979 247192 242991 239269 236350 234055 232451 231637 231067 229914 228003
53989 228003 225685 222962 219570 215938 213112 211446 210123 208355 206438 205119 204449 203901 203337 203150 203418
53974 203418 203501 202784 201518 200570 200421 200728 200912 200796 200470 199897 199123 198715 199347 200894 202450 203437 204182 205151
53956 205151 206194 206966 207665 208776 210366 212143 213989 215915 217665 218959 220120 221912 224630 227733 230550
53941B30550K505K791L615M376M523M123L824M060M472M418L933L638L787M031
53927B84646M087M104M217M348M535M914N274N201M803M719N208N911O613P514
53913C56094Q485Q882Q546Q246Q550Q854Q174O471M547K972J653L38r56j939k230
53898D26687j725r11n42q33j409k009k767l589l962l718l368l315l304l094l056
53883C89085l530m112m173l764l313k853k126j225l60Q55L217O916J0993J3848
53869C99458J4073J1019N030k677j0515j6945k0759k1527j9982j7540j5181j3043
53857B91411j1125r704q825p980o771n455m457l761l177k801k701k584k269k058
53843B17743k176k181j526m44L12M02P8l35o83q08o42l93k84k31o4J50K73L60
$$ plain form
53941 230550 233055 235846 239461 243837 248360 252483 256307 260367 264839 269257 273190 276828 280615 284646
53927 284646 288733 292837 297054 301402 305937 310851 316125 321326 326129 330848 336056 341967 348580 356094
53913 356094 364579 373461 382007 390253 398803 407657 415831 422302 426849 429821 431474 431812 430856 428917 426687
53898 426687 424962 424051 423509 422676 421267 419258 416491 412902 408940 405222 401854 398539 395235 392141 389085
53883 389085 385555 381443 377270 373506 370193 367340 365214 363989 363629 364484 367701 374617 385610 399458
53869 399458 413531 424550 429580 426903 416388 399443 378684 357157 337175 319635 304454 291411
53857 291411 280286 270582 261757 253777 247006 241551 237094 233333 230156 227355 224654 222070 219801 217743
53843 217743 215567 213386 211860 211416 211728 212130 212208 211873 211190 210382 209740 209347 209063 208832 208768 208918 209191 209551
53825B09551M94O44Q91J399J976K068J552R92Q05P21M89M98J003J399J103P52
53809B26337J469L131M355M260L418K899L065L622M193M559M658M672M835N068
53795B80541N054M722M378M203L908L104J930J125J360K445L362L248K206Q90
53781C22476m15j814l070l662l737m126n113n946o005n678n456n016m015l173
53767B65250l453m558n220m865m037l265k526j902j862k457k977k799k149j702
53753B21478j722j875j761j375j108j288j717j817j299n07J22N17P30O03J49j27
53737B09003J92P17O62j18r04r38j61Q19J241Q08N7j09N86J497J975K119K375
53720B19821K818L263L650L842L417K210P01m55j004q64R8J575K673K882K669
$$ plain form
53825 209551 210045 210689 211580 212979 214955 217023 218575 219567 220372 221093 221582 222080 223083 224482 225585 226337
53809 226337 227806 230937 235292 239552 242970 245869 248934 252556 256749 261308 265966 270638 275473 280541
53795 280541 285595 290317 294695 298898 302806 305910 307840 308965 310325 312770 316132 319380 321586 322476
53781 322476 322061 320247 317177 313515 309778 305652 300539 294593 288588 282910 277454 272438 268423 265250
53767 265250 261797 257239 252019 247154 243117 239852 237326 235424 233562 231105 228128 225329 223180 221478
53753 221478 219756 217881 216120 214745 213637 212349 210632 208815 207516 207009 207131 207648 208378 208981 209130 209003
53737 209003 209195 209912 210574 210456 209552 208614 208453 209272 210513 211321 211378 211269 211855 213352 215327 217446 219821
53720 219821 222639 225902 229552 233394 236811 239021 239722 239267 238263 237399 237497 239072 241745 244627 247296
53705B47296K607K494K054J779K122K441J908J039J121K336L579M103M152M046
53691B83077L709L248K954K604J712N74J4mm75j695k682k635k060j903k310k779
53675B81349k873k370j364n36o34j352j416k92J005J254N10l44q45j055r76n85
53659B69476j85j08k55l93n77q57r37o16k71l68p00o34l7N84Q12P69P79R25J023
53640B68430R07O48N56Q81J513K103K454K632K581K073J152M11M81J280K069K217
53624B92388J845J632K011K675K994K857K775L045L242K838K111J870K443L341
53610C28067L941M110M137M325M734N084M993M402L661L014K339J502O94Q4m49
53595C74638q70p90j78K20k13j055j515j560j581j432q05k20m91j349j705j268
$$ plain form
53705 247296 249903 252397 254451 256230 258352 260793 262701 263740 264861 267197 270776 274879 279031 283077
53691 283077 286786 290034 292988 295592 297304 297878 297892 297888 297413 295718 293036 290401 288341 286438 284128 281349
53675 281349 278476 276106 274742 274206 273572 272220 270804 270512 271517 272771 273281 272937 272092 271037 270061 269476
53659 269476 269291 269183 268928 268535 267958 267101 266164 265548 265277 264909 264209 263575 263538 264122 264934 265703 266482 267407 268430
53640 268430 269337 269985 270541 271422 272935 275038 277492 280124 282705 284778 285930 286341 286822 288102 290171 292388
53624 292388 294233 295865 297876 300551 303545 306402 309177 312222 315464 318302 320413 322283 324726 328067
53610 328067 332008 336118 340255 344580 349314 354398 359391 363793 367454 370468 372807 374309 375003 375087 374638
53595 374638 373768 372978 372800 373020 372807 371752 370237 368677 367096 365664 364859 364639 364148 362799 361094 359826
53579C59826p24k79O76K165L106K788J849J299J398J889K478K562J441n37j949
53564C77988k078j895k538l635m025l494k793k319j754r18p0N24Q78J057J150
53549C56078J331J620J804J826J969K347K629K571K429K503K737L142M021N275
53535C92282O087O004N873O804Q504R516R128Q247Q205R264J0549J1122J0851
53522E02436J0428J0617J1488J2512J3364J4278J5503J6858J8147J9545K1188
53511F66364K2657K3432K3596K3681K4009K4555K5253K5944K6185K5613K4456
53500I35745K3309K2490K1893K1367K0826K0142J9241J8281J7425J6633J5924
53489A153276J5617J5865J6215J6129J5830J6030J6831J7479J7392J6863J6394
$$ plain form
53579 359826 359102 358823 359499 361664 364770 367558 369407 370706 372104 373993 376471 379033 380474 379937 377988
53564 377988 375910 374015 371477 367842 363817 360323 357530 355211 353457 352539 352469 352993 353871 354928 356078
53549 356078 357409 359029 360833 362659 364628 366975 369604 372175 374604 377107 379844 382986 387007 392282
53535 392282 398369 404373 410246 417050 425554 435070 444198 452445 460650 469914 480463 491585 502436
53522 502436 512864 523481 534969 547481 560845 575123 590626 607484 625631 645176 666364
53511 666364 689021 712453 736049 759730 783739 808294 833547 859491 885676 911289 935745
53500 935745 959054 981544 1003437 1024804 1045630 1065772 1085013 1103294 1120719 1137352 1153276
53489 1153276 1168893 1184758 1200973 1217102 1232932 1248962 1265793 1283272 1300664 1317527 1333921
53478A333921J5841J4692J2977J1337J0053Q562O268L520J194o26k858o036r312
53465A399533j1455j2495j3542j5051j6204j6164j5282j4568j4552j5122j6140
53454A238958j7632j9430k1072k2025k2035k1331k0562k0183j9827j8703j6711
53443A019447j4784j3818j3613j3148j1681r255o450l918k059p81L01J412K399
53430I34052L052L425L781M435N620P219Q699R644J0341J1386J2827J4235J5548
53417A044264J7131J8931K0374K1273K2157K3343K4531K5651K7281K9614L1767
53406A306317L2912L3520L4694L6695L8914M0960M2939M4856M6476M7815M9133
53395A755231N0450N1562N2450N3190N3609N3512N3219N3274N3604N3411N2011
$$ plain form
53478 1333921 1349762 1364454 1377431 1388768 1398821 1407383 1413651 1417171 1418365 1417739 1414881 1408845 1399533
53465 1399533 1388078 1375583 1362041 1346990 1330786 1314622 1299340 1284772 1270220 1255098 1238958
53454 1238958 1221326 1201896 1180824 1158799 1136764 1115433 1094871 1074688 1054861 1036158 1019447
53443 1019447 1004663 990845 977232 964084 952403 943148 936698 932780 930721 929940 930241 931653 934052
53430 934052 937104 940529 944310 948745 954365 961584 970283 979927 990268 1001654 1014481 1028716 1044264
53417 1044264 1061395 1080326 1100700 1121973 1144130 1167473 1192004 1217655 1244936 1274550 1306317
53406 1306317 1339229 1372749 1407443 1444138 1483052 1524012 1566951 1611807 1658283 1706098 1755231
53395 1755231 1805681 1857243 1909693 1962883 2016492 2070004 2123223 2176497 2230101 2283512 2335523
53384B335523M9539M6678M3959M1398L8743L5908L3064L0138K6593K2078J7150
53373B720771J2634Q387L505k170p763j2993j8939k6390l4286m0874m5781m9800
53361B506301n3113n5028n5437n5312n5466n5718n5602n5068n4149n2482m9770
53350A909156m6433m3426m1487m0634m0312m0020l9754l9751l9725l8813l6536
53339A462265l3492l0722k8601k6778k4863k2747k0410j7878j5274j2693j0258
53328A218549q511q229r409j0862j1424j1152j0752j0345r551q517p876p787p833
53315A096301p768p595o951n367l150j194K42J702L332M420M608M708N660P297
53301A096245Q788R981J1578J4067J7048J9662K1422K2528K3547K4834K6247K7394
$$ plain form
53384 2335523 2385062 2431740 2475699 2517097 2555840 2591748 2624812 2654950 2681543 2703621 2720771
53373 2720771 2733405 2741792 2745297 2743127 2735364 2722371 2703432 2677042 2642756 2601882 2556101 2506301
53361 2506301 2453188 2398160 2342723 2287411 2231945 2176227 2120625 2065557 2011408 1958926 1909156
53350 1909156 1862723 1819297 1777810 1737176 1696864 1656844 1617090 1577339 1537614 1498801 1462265
53339 1462265 1428773 1398051 1369450 1342672 1317809 1295062 1274652 1256774 1241500 1228807 1218549
53328 1218549 1210038 1201809 1192400 1181538 1170114 1158962 1148210 1137865 1128314 1119797 1111921 1104134 1096301
53315 1096301 1088533 1080938 1073987 1068620 1065470 1064276 1064518 1066220 1069552 1073972 1078580 1083288 1088948 1096245
53301 1096245 1105033 1115014 1126592 1140659 1157707 1177369 1198791 1221319 1244866 1269700 1295947 1323341
53289A323341K8042K8105K7421K5903K3906K2050K0544J9001J7115J5196J3627
53278A564251J2013R377N369R03k810n705q750j2356j5560j7314j8033j9044k0788
53265A471553k2497k3661k4785k6291k7677k8387k8792k9565l0592l1183l1037
53254A167086l0341k9285k8060k7021k6330k5676k4840k4163k3960k3901k3588
53243H79921k3248k3217k3155k2569k1689k0943j9937j8013j5604j3904j3127
53232F64515j2192j0339q134o518n649n202n146n705o822q071r030r601j0074
53219E62032j0788j1656j2170j2129j1935j1877j1613j0888j0240j0190j0147
53208D38399r117p367o238o249o424n880n078m961n535o004o001o042o702p713
$$ plain form
53289 1323341 1351383 1379488 1406909 1432812 1456718 1478768 1499312 1518313 1535428 1550624 1564251
53278 1564251 1576264 1585641 1591010 1591913 1589103 1583398 1574648 1562292 1546732 1529418 1511385 1492341 1471553
53265 1471553 1449056 1425395 1400610 1374319 1346642 1318255 1289463 1259898 1229306 1198123 1167086
53254 1167086 1136745 1107460 1079400 1052379 1026049 1000373 975533 951370 927410 903509 879921
53243 879921 856673 833456 810301 787732 766043 745100 725163 707150 691546 677642 664515
53232 664515 652323 641984 633850 627332 621683 616481 611335 605630 598808 590737 581707 572106 562032
53219 562032 551244 539588 527418 515289 503354 491477 479864 468976 458736 448546 438399
53208 438399 429282 421915 415677 409428 403004 397124 392046 387085 381550 375546 369545 363503 356801 349088
53194C49088q068p080n262l889l630m019m323m385m224l613k644k114k556l344
53180B89937l566l320l169k837j661q1O05L0q31j097q32l47K18M77j2r04j325
53163B71285j067o59k36N23J275J110P1p41r24j294k111k307j277j70l12j336
53147B61830k022k080k023j886j390q29p27r18q90p15p22o35qP50Q02J95j89O
53129B48549K77L46O34J364J933J694Q66K74L44O70N11l92j462j752q79N94J727
53112B55298K059J728J025R7r37j841k329k261j793j274r00n51j07J53j78j003
53096B47186j654j558q12m6J42l01p70o40p2J17l70p98n57j58l39o67j63J002
53078B39542J626J297Q56Q75P97Q6p78j038o15J40R07J247P22l35q82m83Q7k7
$$ plain form
53194 349088 341020 333940 328678 324789 321159 317140 312817 308432 304208 300595 297951 295837 293281 289937
53180 289937 286371 283051 279882 277045 275384 275303 275908 275938 275107 274010 273178 272831 273049 273526 273514 272610 271285
53163 271285 270218 269559 269323 269846 271121 272231 272302 271561 270637 269343 267232 264925 263648 263478 263166 261830
53147 261830 259808 257728 255705 253819 252429 251600 250873 249955 249065 248350 247628 246993 246985 247735 248537 248732 248543 248549
53129 248549 248826 249172 249806 251170 253103 254797 255663 255937 256281 256951 257462 257070 255608 253856 252977 253571 255298
53112 255298 257357 259085 260110 260207 259270 257429 255100 252839 251046 249772 248872 248321 248214 248367 248189 247186
53096 247186 245532 243974 243162 243116 243258 242957 242187 241547 241475 241592 241222 240424 239867 239709 239370 238703 238540 239542
53078 239542 241168 242465 243321 244196 244993 245079 244301 243263 242648 242788 243695 244942 245664 245329 244447 243964 244051 244024
53060B44024o92j246j384j147o10j6L53O56J208J582R68l63j049n10L13N84O74
53043B43345R43P42l26j342j466j376j934k436j736l57J89j95j99N86J109O93
53027B36240Kj91j3J82L94N62M06N1L4M07N41J14l81l71J31Q03J367J469Q22k89
53007B42280j084j087n22J71P02Q11L16m82r48p71k31K47M34K36k44n83m24K0
52989B38841K74L64P40J414J803J549J025P58P95Q25O28K10k38l61J20J124K217
52972B52088K934K947K132Q11k02k13O47J542J820J580J376J574J911J743P77
52957B73467m12j011j105j574k664l402k997k064j688j812j561q49n28r42j424
52942B49434j414j218j197j038l39N80R75O08j10o34p34m82q8K01J79k14p31q56
$$ plain form
53060 244024 243332 242086 240702 239555 238945 238929 239282 239938 241146 242728 243696 243333 242284 241774 242087 242671 243345
53043 243345 244288 245030 244704 243362 241896 240520 238586 236150 234414 234057 234246 234051 233852 234438 235547 236240
53027 236240 236242 236051 236038 236220 236614 237176 237582 237633 237667 238074 238615 238729 238348 237977 238108 238911 240278 241747 242569 242280
53007 242280 241196 240109 239587 239758 240460 241271 241587 241105 240157 239386 239155 239402 239836 240072 239828 239245 238821 238841
52989 238841 239115 239479 240219 241633 243436 244985 246010 246768 247563 248388 249016 249226 248988 248627 248747 249871 252088
52972 252088 255022 257969 260101 260912 260710 260497 261144 262686 264506 266086 267462 269036 270947 272690 273467
52957 273467 273055 272044 270939 269365 266701 263299 260302 258238 256550 254738 253177 252328 251800 250858 249434
52942 249434 248020 246802 245605 244567 244228 244808 245783 246391 246281 245647 244913 244431 244343 244544 244723 244509 243778 242922
52924B42922l00N33Q53M47p4j84j69n39j151j432j183p03k51R0K07O3j24j44p4
52905B38787KK02M70L90j61n82l41K27M94M61M19J90m54r80o63K11P04O59P56
52886B40791J153J247Q51O19Q84J032N11l07p84r09j024j179j220j158r97n25
52870B38985L49J262J697J520J137J141J872L026L812L668K759J544K02j150k013
52855B59811j940j228n92k53k7q7q00j895k642k905l199l529l171j911o45k40
52839B34747n50j029j605k330k755k400j522p48j65O17J596K204K049J382P15
52824B30206K36j62n08o29m41j78j12j92j52J4P8M0J32K50Km51k96P55J884K357
52804B32833K581L142L495K712J071l33j284k395l493l524k320j148r92j392j487
$$ plain form
52924 242922 242622 243155 244008 244455 244381 244197 244028 243489 242338 240906 239723 239020 238769 238859 239066 239129 239005 238861 238787
52905 238787 238789 238991 239461 239851 239690 239108 238767 238994 239488 239949 240368 240558 240104 239124 238461 238672 239376 240035 240791
52886 240791 241944 243191 244042 244661 245545 246577 247088 246781 245997 245088 244064 242885 241665 240507 239510 238985
52870 238985 239334 240596 242293 243813 244950 246091 247963 250989 254801 258469 261228 262772 262974 261824 259811
52855 259811 257871 256643 256051 255798 255771 255684 254884 252989 250347 247442 244243 240714 237543 235632 234987 234747
52839 234747 234197 233168 231563 229233 226478 224078 222556 221808 221643 222260 223856 226060 228109 229491 230206
52824 230206 230442 230280 229772 229143 228702 228524 228412 228220 228068 228082 228160 228200 228332 228582 228584 228133 227837 228592 230476 232833
52804 232833 235414 238556 242051 244763 245834 245501 244217 241822 238329 234805 232485 231337 230345 228953 227466
52789B27466j227r68p11m05k78l37j86K15K67k78p13l23O83J644K276K480K027
52772B31632R97O4l23n04q81j135q81n02o26j094j241r26o28n91n78m06j89L2
52754B22220M12R93J540J730J352M46n74j090p64J61J114J621J469P42j75q11
52738B30386r20m70N04J702K426K178J361Q59R88J386J857K466K871K486J509
52723B51589Q37O49R7j205k346k458j984j804j848j507q20l10l0K80M35R4m33
52706B39236n03k03k20p14j019o00K94J032J168N78m88j395j486o88M11J080J002
52689B37485M98L02Q35J597J636P98j6m4M32P73R48J202J285Q01L4k89j16j46
52671B48015p88j578j799j276m17L11P23R35J043R51O34M37O87R88N50n48j043
$$ plain form
52789 227466 226239 225271 224560 224155 223877 223540 223354 223569 223836 223558 222845 222522 223205 224849 227125 229605 231632
52772 231632 232629 232693 232370 231866 230985 229850 228969 228467 227841 226747 225506 224580 223952 223361 222783 222377 222188 222220
52754 222220 222632 223625 225165 226895 228247 228693 228119 227029 226265 226426 227540 229161 230630 231372 231197 230386
52738 230386 229466 228996 229500 231202 233628 235806 237167 238026 239014 240400 242257 244723 247594 250080 251589
52723 251589 252426 253075 253172 251967 249621 247163 245179 243375 241527 240020 239200 238890 238860 239140 239575 239669 239236
52706 239236 238733 238530 238310 237596 236577 235977 236271 237303 238471 239049 238561 237166 235680 234992 235403 236483 237485
52689 237485 237983 238285 239120 240717 242353 243151 243135 243091 243523 244296 245244 246446 247731 248532 248566 248277 248161 248015
52671 248015 247227 245649 243850 242574 242157 242468 243191 244126 245169 246120 246754 247191 247878 248866 249416 248868 247825
52654B47825O0K252M169N011M794L721K062M04o92j243j629j992k328k808l489
52639B56117l897l527k605j771j154k94R66K117K533K097J255O78P64J212J409
52624B55900J320J468J786J230p05k753l201k046q41n11m82q0L40J53m65p78m01
52607B49934M27J139J215O27j2o7K30N4p38j253p61K36O73K96r5K62J190J862
52589B55219J745J101M86qp68j796k274j462J72J258J045J86j29M67J327J642
52573B58211J231N15l2k95m63o84r49j172j221r02j81N00N38j08p69q89o35n40
52555B52155p69j079j199j017n62r1J09J25L50Q27J072Q22M62L37J53m16j016
52538B50263j127r19q91r08m03O09J411J501J011K60m98q62m65M54J154J215R08
$$ plain form
52654 247825 247885 250137 254306 259317 264111 267832 269894 270298 269606 268363 266734 264742 262414 259606 256117
52639 256117 252220 248693 246088 244317 243163 242869 243835 245952 248485 250582 251837 252515 253279 254491 255900
52624 255900 257220 258688 260474 261704 260999 258246 255045 252999 252158 251647 251165 251085 251425 251578 251113 250335 249934
52607 249934 250361 251500 252715 253342 253330 253263 253493 253547 252809 251556 250795 251031 251704 252000 251905 252167 253357 255219
52589 255219 256964 258065 258551 258543 257775 255979 253705 252243 252415 253673 254718 254904 254775 255242 256569 258211
52573 258211 259442 259957 259925 259630 259167 258483 257534 256362 255141 254239 254058 254558 255096 254988 254219 253330 252695 252155
52555 252155 251386 250307 249108 248091 247529 247438 247547 247672 248022 248849 249921 250743 251205 251542 251695 251279 250263
52538 250263 249136 248217 247326 246418 246015 246624 248035 249536 250547 250807 250309 249447 248982 249436 250590 251805 252713
52521B52713O68N80M74K09j08r5N94J632K045J291J65J2J228L005M379M964M771
52504B78527L982K987K077J067l52j909k944l288l382l486l384k902k237j640
52490B63116j205j062j218j298q42K4P07Q47M82k69j080j183p8J519K324K089
52474B62873J707J685J631J397J534K061J995R52J34O87J870K171J633J693K875
52459B86898M071M224L569K706J563q9j821k982l589m099m493m255l222j965j212
52444B75304j198j645k091k192j843j223o15j97o8l61j066j746j805j187n21l05
52428B57241k69J54R07J390J275P95K64j66k42L18J234J673J202L74K9L46Q39
52411B67364J085J131J387K328M101O277Q257R973J1728J3276J3599J1940Q514
$$ plain form
52521 252713 253381 253961 254435 254644 254536 254441 255035 256667 258712 260003 260168 260180 261408 264413 268792 273756 278527
52504 278527 282509 285496 287573 288640 288288 286379 283435 280147 276765 273279 269895 266993 264756 263116
52490 263116 261911 260849 259631 258333 257491 257515 258222 259069 259551 259282 258202 257019 256941 258460 260784 262873
52474 262873 264580 266265 267896 269293 270827 272888 274883 275835 275969 276656 278526 280697 282330 284023 286898
52459 286898 290969 295193 298762 301468 303031 302942 301121 298139 294550 290451 285958 281703 278481 276516 275304
52444 275304 274106 272461 270370 268178 266335 265112 264497 264300 264232 263871 262805 261059 259254 258067 257546 257241
52428 257241 256972 257126 258033 259423 260698 261493 261757 261591 261349 261667 262901 264574 265776 266150 266179 266525 267364
52411 267364 268449 269580 270967 273295 277396 283673 291930 301903 313631 326907 340506 352446 360960
52398C60960L978j128n975r269j0280r648q498p169n570m210l805m020l691k439
52384B89236j174p48r37j024p98m79j51L55J172K261L422M357M823M827M581M432
52368C14155M788N734O594O359M898L279K453K068J167l70j767k389k163j284
52354C43522k10L45J38j02L97J319J839J907K039K166J813J294J526K617L672
52339C64282M172M496M989N501O006O682P240P220P126Q112J0259J2270J3361
52326D61716J4241J5711J7355J8432J9119K0025K1155K2090K2587K2437K1358
52315F76226J9658J8314J7811J7514J6809J6123J6120J6556J6732J6536J6262
52304H64661J5850J5094J4205J3437J2485J1011R413Q342P634O426M241J396j460
$$ plain form
52398 360960 364938 363810 357835 348566 338286 328638 320140 312971 307401 303191 299386 295366 291675 289236
52384 289236 288062 287314 286377 285353 284555 284076 283925 284280 285452 287713 291135 295492 300315 305142 309723 314155
52368 314155 318943 324677 331271 337630 342528 345807 348260 350328 351495 351125 349358 346969 344806 343522
52354 343522 343312 343657 343795 343693 344090 345409 347248 349155 351194 353360 355173 356467 357993 360610 364282
52339 364282 368454 372950 377939 383440 389446 396128 403368 410588 417714 425826 436085 448355 461716
52326 461716 475957 491668 509023 527455 546574 566599 587754 609844 632431 654868 676226
52315 676226 695884 714198 732009 749523 766332 782455 798575 815131 831863 848399 864661
52304 864661 880511 895605 909810 923247 935732 946743 956156 964498 972132 978558 982799 984195 982735
52291I82735l747n135n873o740q221r891j0920j0937j0156r037q142p833p667
52278H78436o615m356j743M23K433M725O732P677Q037R012J0770J2361J3288J4078
52264I55258J5061J5650J5272J4254J3281J2533J1849J1265J1031J1154J1347
52253A097955J1307J0913J0167R054P444N224K533k48k877n435q054j0582j2736
52240A114665j4371j5552j6441j7273j8075j8430j7831j6489j5292j4776j4551
52229I35584j4043j3333j2836j2560j2152j1411j0331q911p277n747m462l216
52217H19305j930r76o06m89j11O80J791L060M010M089L608L694M726N536M975
52202H51362L550K561K225J846J371J430J962K150J853J837K382K758K553K402
$$ plain form
52291 982735 978988 973853 967980 961240 953019 943128 932208 921271 911115 902078 893936 886103 878436
52278 878436 871821 867465 865722 866145 868578 873303 880035 887712 895749 904761 915531 927892 941180 955258
52264 955258 970319 985969 1001241 1015495 1028776 1041309 1053158 1064423 1075454 1086608 1097955
52253 1097955 1109262 1120175 1130342 1139396 1146840 1152064 1154597 1154349 1151472 1146037 1137983 1127401 1114665
52240 1114665 1100294 1084742 1068301 1051028 1032953 1014523 996692 980203 964911 950135 935584
52229 935584 921541 908208 895372 882812 870660 859249 848918 840007 832730 826983 822521 819305
52217 819305 817375 816399 815793 815304 815193 815873 817664 820724 824734 828823 832431 836125 840851 846387 851362
52202 851362 854912 857473 859698 861544 862915 864345 866307 868457 870310 872147 874529 877287 879840 882242
52188H82242K922L767M269M344M139L524K465J360M16q24k799n147p110q365r038
52173H76165r219q934q306p293n673l641k028j286p04O18K334L263L166L118L853
52158H45433M720M855M576M793N420N377M090K229Q16K59M32J080J746J957J861
52143H89644K289L645N157N751N337M633M032L457L045L197L821M378M801N753
52129I48940P680J0235J2823J5227J7563K0007K2718K5486K7575K8592K9450L1502
52117A197798L4493L6383L5694L3089L0137K7486K4979K2645K0494J7920J4313
$$ plain form
52188 882242 885164 888931 893200 897544 901683 905207 907672 909032 909448 908624 905825 900678 893568 885203 876165
52173 876165 866946 858012 849706 842413 836740 833099 831071 829785 829081 829699 832033 835296 838462 841580 845433
52158 845433 850153 855008 859584 864377 869797 875174 879264 881493 882309 882568 883000 884080 885826 887783 889644
52143 889644 891933 895578 900735 906486 911823 916456 920488 923945 926990 930187 934008 938386 943187 948940
52129 948940 956620 966855 979678 994905 1012468 1032475 1055193 1080679 1108254 1136846 1166296 1197798
52117 1197798 1232291 1268674 1304368 1337457 1367594 1395080 1420059 1442704 1463198 1481118 1495431
$$ [...]
##END NTUPLES=NMR SPECTRUM
##END=
