
##TITLE=AC1300_CHIAH12112_6614048_owvnLmB4iw
##JCAMPDX= 6.0         $$ Bruker NMR JCAMP-DX V2.0
##DATA TYPE= NMR SPECTRUM
##DATA CLASS= NTUPLES
##ORIGIN= BRUKER
##OWNER= Administrator
$$ 1.72 TOPSPIN		Version 2.1
$$ 2012-08-02 16:36:31.781 -0500  Administrator@TOPSPIN
$$ Compression mode = diff/dup
##.OBSERVE FREQUENCY= 400.02188249412
##.OBSERVE NUCLEUS= ^1H
##.ACQUISITION MODE= SIMULTANEOUS (DQD)
##.ACQUISITION SCHEME= undefined
##.AVERAGES= 8
##.DIGITISER RES= 22
##SPECTROMETER/DATA SYSTEM= spect
##.PULSE SEQUENCE= zg30
##.SOLVENT NAME= COFFEE_meoh
##.SHIFT REFERENCE= INTERNAL, COFFEE_meoh, 1, 14.98509
##AUDIT TRAIL= $$ (NUMBER, WHEN, WHO, WHERE, PROCESS, VERSION, WHAT)
$$ ##TITLE= Audit trail, TOPSPIN		Version 2.1
$$ ##JCAMPDX= 5.01
$$ ##ORIGIN= Bruker BioSpin GmbH
$$ ##OWNER= Administrator
$$ $$ C:\Bruker\TOPSPIN/data/COFFEE/nmr/AC1300_CHIAH12112_6614048_owvnLmB4iw/10/pdata/1/auditp.txt
$$ ##AUDIT TRAIL=  $$ (NUMBER, WHEN, WHO, WHERE, PROCESS, VERSION, WHAT)
(   1,<2012-08-02 16:36:23.703 -0500>,<Administrator>,<TOPSPIN>,<go>,<TOPSPIN 2.1>,
      <created by zg
	started at 2012-08-02 16:35:16.750 -0500,
	POWCHK enabled, PULCHK disabled,
       configuration hash MD5:
       6B 1B 68 BB D9 2E 58 E2 7F 35 AD 54 07 DF 0E 41
       data hash MD5: 64K
       DE DD 4D E0 2A 36 92 F7 12 F3 82 17 2F E0 AC FE>)
(   2,<2012-08-02 16:36:27.671 -0500>,<Administrator>,<TOPSPIN>,<proc1d>,<TOPSPIN 2.1>,
      <Start of raw data processing
       efp LB = 0 FT_mod = 6 PKNL = 1 PHC0 = 0 PHC1 = 0 SI = 32K 
       data hash MD5: 32K
       76 DC BA 1A 48 81 21 F1 A4 13 2F 94 6C 4A 1B E5>)
(   3,<2012-08-02 16:36:27.984 -0500>,<Administrator>,<TOPSPIN>,<proc1d>,<TOPSPIN 2.1>,
      <pk PHC0 = 179.4562 PHC1 = 0 
       data hash MD5: 32K
       B0 13 77 0A E2 C7 12 A2 A3 3E 4F A6 5F D3 BA 52>)
(   4,<2012-08-02 16:36:28.062 -0500>,<Administrator>,<TOPSPIN>,<proc1d>,<TOPSPIN 2.1>,
      <abs ABSG = 1 
       data hash MD5: 32K
       04 B7 08 2C 01 37 D4 20 9C B5 55 36 FF 6A 0C 4E>)
(   5,<2012-08-02 16:36:28.093 -0500>,<Administrator>,<TOPSPIN>,<proc1d>,<TOPSPIN 2.1>,
      <abs ABSG = 2 
       data hash MD5: 32K
       51 5C DF 38 16 81 61 1F 85 6C 41 B3 C8 66 99 82>)
(   6,<2012-08-02 16:36:28.125 -0500>,<Administrator>,<TOPSPIN>,<proc1d>,<TOPSPIN 2.1>,
      <abs ABSG = 3 
       data hash MD5: 32K
       16 BE 1B 9F 36 32 30 56 79 3C 45 C1 E0 CD A2 9C>)
(   7,<2012-08-02 16:36:28.156 -0500>,<Administrator>,<TOPSPIN>,<proc1d>,<TOPSPIN 2.1>,
      <abs ABSG = 4 
       data hash MD5: 32K
       1C 21 CB D3 3C ED CC 77 44 61 22 D7 F0 B4 33 1C>)
(   8,<2012-08-02 16:36:28.187 -0500>,<Administrator>,<TOPSPIN>,<proc1d>,<TOPSPIN 2.1>,
      <abs ABSG = 5 
       data hash MD5: 32K
       01 BD 15 66 67 32 75 70 DA FD 9D C1 CE A1 0A 16>)
$$ ##END=
$$ 
$$ $$ hash MD5
$$ $$ AB AA 14 6A CE 3B 0C 48 83 97 0E 6A AE 48 EE BC
##$RELAX= 
##$RELAX= 
##$RELAX= 
##$RELAX= 
##$RELAX= 
##$RELAX= 
##$RELAX= 
$$ Bruker specific parameters
$$ --------------------------
$$ [...]
150 150 150 150 150 150 150 150
##$TP07= 0
##$TPNAME0= <>
##$TPNAME1= <>
##$TPNAME2= <>
##$TPNAME3= <>
##$TPNAME4= <>
##$TPNAME5= <>
##$TPNAME6= <>
##$TPNAME7= <>
##$TPOAL= (0..7)
0.5 0.5 0.5 0.5 0.5 0.5 0.5 0.5
##$TPOFFS= (0..7)
0 0 0 0 0 0 0 0
##$TUNHIN= 0
##$TUNHOUT= 0
##$TUNXOUT= 0
##$USERA1= <user>
##$USERA2= <user>
##$USERA3= <user>
##$USERA4= <user>
##$USERA5= <user>
##$V9= 5
##$VALIST= <valist>
##$VCLIST= <CCCCCCCCCCCCCCC>
##$VD= 0
##$VDLIST= <DDDDDDDDDDDDDDD>
##$VPLIST= <PPPPPPPPPPPPPPP>
##$VTLIST= <TTTTTTTTTTTTTTT>
##$WBST= 1024
##$WBSW= 4
##$XGAIN= (0..3)
0 0 0 0
##$XL= 0
##$YL= 0
##$YMAX_a= 471800
##$YMIN_a= -617103
##$ZGOPTNS= <>
##$ZL1= 120
##$ZL2= 120
##$ZL3= 120
##$ZL4= 120
##$ABSF1= 14.98509
##$ABSF2= -5.573092
##$ABSG= 5
##$ABSL= 3
##$ALPHA= 0
##$AQORDER= 0
##$ASSFAC= 0
##$ASSFACI= 0
##$ASSFACX= 0
##$ASSWID= 0
##$AUNMP= <proc_prof1d_extract_pilot.lims>
##$AXLEFT= 0
##$AXNAME= <>
##$AXNUC= <1H>
##$AXRIGHT= 0
##$AXTYPE= 0
##$AXUNIT= <>
##$AZFE= 0.1
##$AZFW= 0.1
##$BCFW= 0
##$BC_mod= 0
##$BYTORDP= 0
##$COROFFS= 0
##$CY= 15
##$DATMOD= 1
##$DC= 0
##$DFILT= <>
##$DTYPP= 0
##$F1P= 0
##$F2P= 0
##$FCOR= 0.5
##$FTSIZE= 32768
##$FT_mod= 6
##$GAMMA= 0
##$GB= 0
##$INTBC= 1
##$INTSCL= 1
##$ISEN= 128
##$LB= 0
##$LEV0= 0
##$LPBIN= 0
##$MAXI= 10000
##$MC2= 0
##$MEAN= 0
##$ME_mod= 0
##$MI= 0
##$NCOEF= 0
##$NC_proc= -8
##$NLEV= 6
##$NOISF1= 0
##$NOISF2= 0
##$NSP= 0
##$NTH_PI= 0
##$NZP= 0
##$OFFSET= 14.98509
##$PC= 1
##$PHC0= 179.4562
##$PHC1= 0
##$PH_mod= 1
##$PKNL= yes
##$PPARMOD= 0
##$PPDIAG= 0
##$PPIPTYP= 0
##$PPMPNUM= 2147483647
##$PPRESOL= 1
##$PSCAL= 4
##$PSIGN= 0
##$PYNMP= <proc.py>
##$REVERSE= no
##$SF= 400.02
##$SI= 32768
##$SIGF1= 0
##$SIGF2= 0
##$SINO= 400
##$SIOLD= 32768
##$SPECTYP= <>
##$SREGLST= <1H.CDCl3>
##$SSB= 0
##$STSI= 32768
##$STSR= 0
##$SW_p= 8223.68421052631
##$SYMM= 0
##$S_DEV= 0
##$TDeff= 65536
##$TDoff= 0
##$TI= <>
##$TILT= no
##$TM1= 0
##$TM2= 0
##$TOPLEV= 0
##$USERP1= <user>
##$USERP2= <user>
##$USERP3= <user>
##$USERP4= <user>
##$USERP5= <user>
##$WDW= 1
##$XDIM= 32768
##$YMAX_p= 451272608
##$YMIN_p= -717784
##$CURPLOT= <Network HP LaserJet P1505>
##$CURPRIN= <$Network HP LaserJet P1505>
##$DFORMAT= <normdp>
##$LAYOUT= <+/1D_H.xwp>
##$LFORMAT= <normlp>
##$PFORMAT= <normpl>
##$SURQMSG= 1
$$ End of Bruker specific parameters
$$ ---------------------------------
##NTUPLES= NMR SPECTRUM
##VAR_NAME=  FREQUENCY,     SPECTRUM/REAL,   SPECTRUM/IMAG
##SYMBOL=    X,             R,               I
##VAR_TYPE=  INDEPENDENT,   DEPENDENT,       DEPENDENT
##VAR_FORM=  AFFN,          ASDF,            ASDF
##VAR_DIM=   32768,         32768,           32768
##UNITS=     HZ,            ARBITRARY UNITS, ARBITRARY UNITS
##FACTOR=    0.250966925370066, 1,           1
##FIRST=     8223.43324360094, -199124,      -185797
##LAST=      0,             70156,           -212173
##MIN=       0,             -717784,         0
##MAX=       8223.43324360094, 451272608,    0
$$ Real data points
##PAGE= N=1
##DATA TABLE= (X++(R..R)), XYDATA
$$ [...]
23771 -239019 153450 -138366 -145115 151471 -18886 -338779 316059 -271015 -136941 -146812
23761 -146812 -55514 155029 -225882 -200195 -15526 -50984 215168 -128079 49726 -351382
23750 106403 -138854 -23772 -170637 85854 37819 -113999 170040 -311277 -127095 -265840
23740 -265840 -35635 89151 -48967 -42191 166683 -144132 -10739 -140341 109864 220932 -136717
23728 113744 -378650 -127795 63733 -58479 -86448 -155215 301144 222844 -107866 -157461 -31024
23716 -106963 -38632 -186527 -302407 2114 -120147 -10343 -216659 -54759 -163618 137496
23705 249055 83807 36994 -140892 165657 -216179 -84638 -448228 166457 -43000 -89829
23695 -89829 -26080 -131089 -13101 103151 -170863 -21333 -17071 62590 -150398 -78162 -23913
23683 177674 103449 -60564 192213 94104 300560 -199520 -45557 299516 13840 35595 -104688
23671 -93010 -62424 56090 228485 -26463 -189076 -242731 117865 -230936 165967 65300 50150
23660 50150 209293 -56192 -31367 15950 -127771 103912 -22957 174845 252048 50856 60303
23649 60303 255532 -292678 85568 365960 -100094 -52566 171227 -38769 73336 -44467 -383167
23638 -383167 178297 -194697 364624 71020 84645 -282624 61253 52767 -291279 -3117 149814
23626 -70665 369275 66404 70861 -118148 24959 -129788 20393 -836 399262 -78735 303912
23614 -225749 253803 -142805 -10099 -201171 -171283 36118 -58198 -41073 -229708 -181336 -18808
23602 -170813 -43911 169960 -21456 212904 -20508 30927 244727 253792 4556 -5280 141689
23590 321504 2201 432502 -13321 202994 -3621 -133328 330026 132318 71093 95428 100335
23579 100335 -71107 -220940 449279 166668 231903 -75119 -338250 -367149 -233994 313236
23568 -320936 -259790 -18143 -64728 -11681 28288 -133507 -87357 8479 -72873 38058 -205593
23556 49160 -341600 -193426 -373389 71641 -165948 71951 212464 56905 217296 6427 302681
23545 302681 -97593 68335 -257575 -245618 87902 281388 37820 -168790 -225556 276767 -175141
23533 -174269 -77287 -223661 335915 -143552 153372 96175 -204921 50842 236781 -2743
23522 -105086 -55891 283812 -223463 -253223 8308 129463 115427 54818 172050 -77040 -5527
23510 88159 -190854 -335501 136651 155866 -236800 72091 32479 195807 111025 -12656 -131328
23499 -131328 43991 85591 267202 14724 124863 -483926 -13755 118264 296413 -37097
23488 -23610 -103607 -13148 -272688 166753 66637 -38668 -49307 332317 -173844 -150315 -30819
23476 88430 22976 110975 -257036 -97859 104559 276494 -36807 -329869 -169114 116451
23465 -179760 122549 -213249 160741 -31319 -573562 110152 92449 -59503 115886 122948
23455 122948 139951 -220932 273880 -197585 59262 36801 -57368 115825 -32260 101032
23444 188172 192797 -13678 37323 -332330 -49966 -155093 -363318 36400 -50183 231226 33697
23432 -187087 124233 24042 -269 -473343 35894 58148 98598 144389 -10243 -602936 119413
23420 143661 -146257 -114550 207971 -248742 222388 130987 -322554 -229573 211890 124649
23410 124649 -161852 128545 -473559 -25663 368766 137356 162915 39905 -12100 166237
23399 -24619 -54491 -414773 145887 -147766 14167 -255925 -165590 82525 -270898 178612
23388 -127942 -53865 89189 -73581 276245 -269003 38723 457 105910 -154109 296972 -243799
23376 344071 166907 -151012 -112973 16382 290996 -133786 -229960 82022 -231994 -118668
23366 -118668 -10028 -212321 183342 -99928 65416 -62947 76565 -151985 -180620 -298291 69437
23354 166379 -135055 -9203 -177038 132970 174156 -11915 142661 -169745 -137862 249115
23343 74496 166377 73013 191833 -214151 111295 47773 -29474 -157630 -115289 162839 214704
23332 214704 -212966 -42939 -411644 -83030 33586 159938 315202 -119343 90392 -93591
23321 287455 -197072 -238719 -98489 -277785 88173 -125679 -18152 -32861 -92696 -281439 -299256
23310 -299256 287223 -243018 -195791 145767 59565 -46710 -340212 -291758 -56499 -134639 -396094
23299 -396094 2082 -52701 328479 -118109 120031 45744 6534 -174691 -115793 -81575 -76715
23288 -76715 11505 -497681 -76452 412442 256232 -174405 4414 177385 180498 -140583 219458
23276 -175832 120317 -89009 -71574 50717 71327 -241715 -69881 -81988 -147825 41353 -265708
23264 263960 -88422 -2406 -233379 -11521 -251465 56171 -223915 -108604 195810 165146 -177517
23252 -143422 -34778 200874 -159295 -186925 104863 -73230 -260282 18103 248019 366752
23242 366752 -7098 -133880 254227 222742 -411463 -104373 -126179 43514 -147814 -242108 142339
23230 58635 -196765 -143085 -81480 207439 76552 -25419 25444 91735 -42688 -143267 -228802
23219 -228802 60998 -192012 -15271 69082 -248569 139151 72866 -56053 291359 -101710
23208 189482 -65270 -108650 -297054 255342 -80789 -129595 273665 42305 29654 43102 -64936
23196 246085 -4170 -108277 -623 -339738 -115538 249337 91012 -71298 73203 -150961 -10237
23184 304521 -18386 -184220 -307673 -1996 -23332 -290759 -208221 -342934 31395 180076 -65050
23172 -216276 43754 -60094 -55894 191686 405190 -118357 -230252 308000 46051 -115640
23161 501771 -31346 -198324 43128 -100230 -171331 93361 395842 -24531 84291 -106688 423849
23149 -267387 32520 178118 -311902 142567 -95005 137447 29467 69498 36330 -330324
23138 105 -112269 -62596 -59118 199766 53434 -419849 -256458 41735 147771 -106098 87512
23126 24922 203875 244535 210716 51362 -85986 99243 -154487 -57132 14858 -16921 -32246
23115 -32246 8683 -303111 113291 -64920 -134955 127928 -129945 -128866 192400 70133 -338796
23103 -215299 139680 51888 -172253 203847 -185308 351348 -284108 145708 67447 266018
23093 266018 -71998 153807 -78418 -505406 -26473 406051 -137462 -123229 -75411 54168 127547
23082 127547 243481 207947 -27084 59057 217267 46686 -163858 47580 -11666 -184401 110781
23070 115631 -124153 61303 185776 33347 -56941 241081 72567 244345 -345948 -37375
23059 68717 83168 355703 21978 72605 148081 -87383 386731 -193126 213865 -171333 -133283
23048 -133283 164333 254337 352312 59018 334871 -196785 -202028 -178286 28090 105139 -2482
23036 -17617 -27870 64305 -154345 208894 367495 -187589 55298 125571 -8226 -57154 -99668
23025 -99668 -37761 1519 90240 260637 -65530 -91994 -290474 -18379 190001 239117 -138691
23013 3099 359781 -137336 -206513 46599 51875 258814 -60980 -100499 -37437 -393325 136377
23001 14331 64840 -200119 -117785 -74990 -53074 -89849 -7846 -212180 -99677 -246138 128127
22989 -63199 -96505 11524 -285695 -305474 -316454 272781 -147884 -104342 -323198 -9520 78638
22977 -177940 86576 -97234 129876 -287325 237599 43927 54079 -309260 -108042 -518642
22967 -518642 -383208 -214197 17578 42385 50806 136371 168419 180745 -64094 -204913 -36397
22955 13758 -92577 -211086 -243669 -25151 -148238 -171007 -129672 -253216 61990 -120793 174657
22943 -172446 235390 -359660 41503 -57760 460951 206297 -168617 64548 -99764 -201435
22933 -201435 -30936 -158017 -219618 191985 130737 61730 -12488 -190442 -203305 -59111 -282046
22922 -282046 -259574 -60098 -129683 65927 -155630 -238124 522726 -341409 194 22325 75227
22911 75227 -202641 -173206 -187314 45938 -259026 -194915 -77995 -180616 -368034 -240341 -54837
22899 73244 -207466 -214796 -109403 77652 -165504 -145458 34314 -138632 302410 -190339 79100
22887 67467 -70314 -238019 125035 -10856 128480 44594 -89832 -133319 -161020 62227 -145316
22875 -123797 227633 -7155 -42874 -130306 150153 270997 -57432 65830 -216805 -12204 -268308
22864 -268308 22438 141226 -3254 -115649 -63693 260587 -362043 -91889 -2000 -229953 -222619
22853 -222619 119955 -51300 92799 -229333 -27948 101091 -85386 29405 27547 -91354 -113787
22842 -113787 46107 42587 -47801 169469 -93189 382881 56288 33709 168302 11481 -178141
22830 -135520 -252905 37966 14910 -131085 -90674 96660 -182220 87436 -30951 -156800 -47503
22818 -218863 -417571 -240652 -113460 -248595 58921 -13330 -182995 -11993 260559 173405
22808 173405 -136572 -75293 363004 -107249 40760 4339 213639 66108 -120464 299896
22797 -182445 -129723 -39927 100186 35233 -3152 -114552 283152 -3890 13779 21934 -34902
22785 260179 12939 46334 -183498 72572 -48121 69631 -109958 -35755 -60411 57558 -61892
22773 73007 -107822 -231898 32830 219077 238120 2829 -151446 -274186 -284407 -163381 -52458
22761 -179557 96442 -162323 14087 195876 216771 245840 -213960 -281375 340536 221179
22751 221179 12578 112071 -194201 -150156 -60533 10558 13504 22600 -327421 85573 -278961
22739 -65117 281653 -96374 143517 -247377 -176873 -276698 -166365 54204 -32494 139787 171210
22728 171210 -282911 148132 -63538 -117086 -25066 -39877 44068 14716 306058 -378392 -79324
22716 115498 -65377 -437177 -19467 243234 93956 -120135 24866 10749 31512 -33854 -81490
22705 -81490 -36074 -133378 155653 120005 -166218 -67419 -160762 -230303 -353239 -108082 170071
22693 -222715 118199 138288 -277870 43734 -212753 57316 -71127 -320582 -333020 -57379 -153671
22682 -153671 163721 -15823 171403 116171 24516 165112 -214554 -119351 -127682 -266786 99670
22670 -45440 -10488 -202472 -108566 -174179 51913 1076 -164649 -182175 145365 258615 18142
22658 -337859 106392 -296127 32256 61058 -197655 -45985 166142 241233 -187603 -29147
22647 33969 200140 -11553 53600 -110671 -65685 -9407 -35590 -114626 -74199 -203164 -121249
22636 -121249 -159681 141494 -358427 -285265 -195804 35875 125632 79536 -125304 -221942 107433
22624 -264506 171078 -69769 -106168 287452 191043 -60236 162922 17968 -112285 -156189 -107404
22613 -107404 -21833 245380 -12120 27849 -113948 29113 -418140 -290495 122476 -62630
22602 -229827 180454 -259393 -201805 117654 53987 -112469 -268766 -180911 -290932 -323021
22592 -323021 256654 -122836 -117885 15295 3840 160709 -46805 -32279 -549627 106748 -104734
22580 128727 -48233 -17398 -52699 -62903 -135144 154601 -95128 -32330 66280 -365299 -358719
22569 -358719 -340812 -71381 333071 -228240 -164138 -50218 127231 7176 -58762 57725 -227708
22557 60321 -186753 75657 136513 -65669 -13670 -21538 -68097 -107771 14361 -265464 67664
22545 25677 222737 -168744 60700 44044 -75803 -87506 -330969 75385 245724 -52351 -271985
22534 -271985 12160 249783 -247029 -147396 87773 -178696 -77722 -170773 -385267 46120 -186815
22522 -267219 -179160 43725 -30188 -204553 320267 264787 -5936 -252778 -285230 -29636 -53665
22511 -53665 -144766 -165925 -250566 -80603 2367 -108169 -40831 76152 30506 131852 121044
22500 121044 -217040 -54964 -269505 -79953 13845 78010 10132 -179573 94774 -218779 -2691
22488 -394513 -128251 49188 -107331 256955 66186 190664 -79258 141631 76221 -75992
22477 79808 -205937 -226529 -179924 53895 -120315 3682 135012 -160694 -35773 99784 100210
22466 100210 165192 -125373 5877 50363 -300013 43788 -198742 53968 246823 86189 37625
22454 97891 26839 -102433 126072 14001 -13190 -121605 -313795 336836 140193 11944
22443 -349941 -58969 -9248 63106 -437518 -21681 -115514 -406957 136735 -118558 60634 -322990
22431 -225480 45480 -129633 -55116 187408 30154 114899 -80398 112117 349449 86288 -247046
22419 83693 -85349 25266 62910 -173380 -181807 -203818 -86321 150175 167318 308616 188171
22408 188171 43853 -66196 -199500 -212073 -345287 48887 76576 146011 -104440 -285561 182167
22396 -331626 152546 -281702 -6349 -881 -264100 -206359 3412 -115300 -363423 -172388 69063
22384 -242178 33036 74570 -143944 -84997 -8409 -65571 -21006 79545 -173642 -326497 -208466
22373 -208466 136078 124799 143962 27471 -175390 -175227 31539 -65988 41816 89904 -41369
22361 217138 73429 14138 -139166 -175320 -146094 81679 -58075 120961 -172265 124452 -275816
22349 -25371 354332 185111 155158 -229005 60544 -170541 134538 -145574 146357 46698
22338 -122667 -70967 -105307 -31617 30718 -118367 -82326 83617 -131918 -143265 -91381 61575
22326 -276066 -35935 -248775 -99662 20851 -209885 -28937 93448 -134983 369051 -197046
22315 -16760 -42627 -204653 -57447 -383896 336021 -268509 -212188 34798 -163840 9163 181873
22304 181873 -233610 106779 70846 -108051 -461118 -173905 185207 48100 138897 36376
22293 -152898 -23933 -163193 271683 -364396 155269 -30046 -174454 -50518 -115194 111646
22282 -83666 51540 -222450 -269002 -167427 -150404 102664 -325791 29949 -227225 32751 -99396
22270 54207 2034 -79268 -136340 -103893 50051 11525 -1891 263009 -386060 -90015 -680542
22259 -680542 -336295 -121625 -53536 138316 56400 -79893 72700 -203085 -62052 51208 -180671
22247 265375 -61697 -275194 -3884 79769 -205251 -299455 74768 -216113 145850 240182 -341048
22235 -282475 -141255 -198351 -420131 -564941 24242 325508 -182841 -41882 184989 -12670
22224 -191892 217528 -81801 88638 -153097 -30294 213741 -137545 76521 -234140 180938
22213 -18626 -160486 -81294 229174 -418357 115465 -316675 -263355 84416 -174117 38051
22202 -209575 52394 -2213 -90455 161454 114106 -135132 -357380 -334627 184033 100748 98760
22191 98760 202764 -198344 427943 167468 -50527 -27632 323021 -112280 -57326 -88888
22181 -88888 -168681 -91140 42019 255814 -164927 -307599 -56235 -374633 45537 48770 -287287
22169 -204477 -236510 -273766 -212987 123301 91862 47942 -84894 -131248 -4612 72611 -37758
22157 -137928 12840 -76351 -169313 36313 -48287 -58858 -105065 -173714 -40339 -330241 211791
22145 -149216 -238165 -35609 192375 238467 32186 -73150 -63043 -121864 -314674 48585 -106445
22133 160299 31719 -230257 123029 58335 -368775 7952 -165596 133603 181899 -21807 -36598
22122 -36598 -89093 53523 21886 -46289 -325641 149959 30683 -24736 68260 28474 -140761
22110 31220 -12768 329964 51946 -2139 -15163 -41941 -112596 181331 -373538 3051 -175269
22098 -36658 -22498 812 -176493 -6523 -172957 -200161 -158817 330858 -231055 -120392 358931
22086 139788 -294214 71159 47134 -433445 232567 144000 -123043 -255153 33567 -268765
22075 -256159 -286992 188089 -25575 -312445 -158819 -116830 58895 -100497 -206978 70539
22064 -225266 242919 175794 -357137 -183936 -155469 -149455 123703 70899 -61004 -81034 -214486
22053 -214486 -379929 -38863 -155077 111971 -23141 -195850 50347 -33459 -17569 -86900 -236726
22042 -236726 -104132 -44152 -20327 26783 -97540 -23044 -352066 61630 -101622 -196761 -29845
22030 2883 -79726 -133552 76108 -62062 40611 37442 -33094 -332072 -129906 7385 -94058 -108638
22018 -108638 -134706 -191592 -144470 -143227 -17238 -305477 -20426 -353605 -27576 -62253 140811
22006 -176625 -296200 31453 176629 -31228 -208532 129309 -11573 -111048 -81639 -15737 -84325
21995 -84325 31258 -184310 114221 -212225 92425 -253736 70319 111931 -107610 -150809 -186143
21984 -186143 -165692 -13528 52455 52453 123277 80649 -215972 167631 -513687 -51763 -84192 7497
21971 -267162 -299861 -201473 1942 50660 -169339 126172 50677 186532 44971 -386603 204855
21959 -38447 146723 -451746 66248 -373341 -274058 252596 -43610 95383 -50342 -84714 -59418
21948 -59418 205674 264488 -175776 92092 15676 -172731 94395 -117748 -167970 -184829 -393336
21937 -393336 49207 -129415 35560 -129808 -126215 -329438 163353 -54733 -22765 -159714 185400
21925 -519818 -202329 -33981 49135 -292217 59646 94311 -271235 332934 -157425 313049
21914 205879 38551 -67460 251236 131531 108401 108396 -79621 264961 63322 -182405 -240766
21903 -240766 -244655 -203064 30433 -262208 -259471 -87732 -243154 193088 -23914 -281252 137879
21891 99650 -221015 -106971 -187379 -112619 -124974 -254584 -355749 -268318 -144545 -43584 144253
21879 -332687 -177341 -57766 324942 -118376 -24944 -189578 -48869 -95820 -137719 -102121 -263416
21868 -263416 -197507 -317788 311707 -187168 90364 -211612 17849 -92755 234125 -210535
21857 -201620 246059 92114 173807 -109263 -117639 -58862 -108070 -95786 -130893 149046 -24976
21845 -244100 -19403 -105402 227337 177861 -385315 -253110 78021 141637 -20059 -65957 102471
21833 -376010 -175223 10696 -227267 -276573 -190684 -51025 231033 -36259 -136756 -4328 -38471
21822 -38471 -92553 261581 -50586 -117338 -24002 -88698 19506 -5342 -5034 -197262 309527 -111734
21809 -215074 -65575 55889 -5518 -83611 -115005 128714 -79361 7670 -163978 -48234 -170647
21798 -170647 297308 240841 203802 28303 24204 -186588 -44377 15565 -227297 -248884 -149243
21787 -149243 -51832 140558 -105976 -106121 204046 -147805 -133323 -120823 -166654 48839 228740
21776 228740 -74782 286336 231164 -267218 -136326 -153503 385411 -137729 -243335 -4990
21765 434246 295843 -110054 13544 -27418 86960 162969 -24729 235886 128792 27632 -42467
21753 -36444 233205 -235686 -20052 238278 150399 184995 -119972 25606 -42573 -50993 -45203
21742 -45203 -58382 -71379 55006 -208562 178534 -451301 33129 -134329 235607 108424
21731 114253 -145856 157874 18616 -115799 9960 109483 288079 -254694 -216083 -133186 -305269
21720 -305269 -46414 -83833 -239769 -271616 299418 -412689 -264515 -21527 -186002 -510464
21710 -510464 -35219 -37435 -332873 -92568 213820 -256233 262755 240788 -25381 -306665 -199572
21699 -199572 127769 7145 -247931 37193 -69787 -423307 -134520 118417 70775 -77717 -287725
21688 -287725 18145 46642 -95396 195355 -136580 -216657 -102134 -103634 -100107 -73878 138207
21676 66967 -197479 -182555 -23321 164274 216008 -274785 64511 144012 -88020 -51064 -232858
21665 -232858 -100056 186866 72742 -81191 -394869 213788 -132293 -393967 29583 -101578
21654 -372561 -86524 233170 46570 -83586 63324 -349766 31517 -220102 -165247 130775 -449295
21642 -58305 -239284 76485 154178 -15295 16891 91280 25024 147159 -123413 -197538 -331509
21631 -331509 155473 -290424 75134 -73170 -13162 -234583 336814 261115 151892 -284678
21620 184755 -148261 -140301 8264 85012 -171611 184776 1101 38837 -310708 -79612 -34965
21608 -280111 270734 -91623 18143 -83034 -128237 37721 -252739 -194959 -141610 -292602 196916
21596 -78003 -316083 -67530 -146411 -58851 252748 -130424 -241218 -148161 22216 -5813 -63165
21585 -63165 -111342 132651 -162521 -281693 27830 -334912 232664 -251186 242032 106752
21574 -3462 151760 121365 185817 -4273 -167302 -31201 127107 48949 -14568 -208423 -95324
21562 -31196 15219 -212737 153357 -86039 -88857 -16581 206188 174876 -13441 -346730 125078
21550 -218901 -96974 -94637 -130840 -129571 6701 80536 126730 -122958 -206665 82052 -148981 -91494
21538 -91494 -171339 40827 263575 -224014 -142791 -171671 -40054 235346 -75963 -170879 9871
21526 305642 -62185 -345506 281559 15688 -277364 46945 108737 -23656 220402 -311344
21515 150973 2541 -35595 -67691 -47030 -131148 -218461 -174235 49337 133174 -283457 59510
21503 45969 -48969 -220190 -480203 -161248 46975 -12728 25656 -333427 -265254 -385132 -90443
21491 -271629 -79847 -191108 -217931 122405 -223028 -130606 -141392 -186308 -221678 21547 -78
21479 19259 38221 -12892 -114792 -29091 -319016 -2655 171158 -34951 16282 36044 -318156
21467 27739 -74700 125495 -368854 -28445 -79322 6135 -243798 122147 44621 -108084 339346
21455 52521 -77575 96630 -226941 -243736 -50199 -219847 -359905 185176 41474 -288281 -207617
21444 -207617 -331386 -10930 80488 -139783 178226 259505 195110 251633 396865 451681 265385
21433 265385 134015 437349 -49901 148669 -72973 257913 72289 22953 -6827 74982 -152502
21421 141388 69806 67013 -90841 51945 -147515 125837 22173 30511 -52072 82197 78801 -265407
21408 -7889 -234034 51336 -74515 -188692 -388394 -3982 180232 -94523 -228870 -85315 53250
21396 -456371 -228463 -137579 -284772 -237407 -67222 76782 -436378 -502795 -153371 -45622 -145370
21385 -145370 127930 117997 -126087 -252121 -328564 105715 -318093 -386374 -66928 -323140
21375 -323140 70527 -120545 248805 -307661 -117793 -64446 14704 -280076 -49350 113878
21364 -284322 -170348 -170510 -177660 -128300 88146 25741 -213082 119612 -116524 -43270 -54297
21353 -54297 -151236 1858 169374 -12487 -165002 -502443 -255382 260592 22472 -382057 -198541
21342 -198541 76873 106593 142229 -201628 112720 65006 -241930 -157886 -114474 353372 -128391
21330 89307 -28000 -84895 -225775 9543 -73459 -83940 -194568 14509 297094 -338969 -2559
21318 128670 16064 127302 -89813 20062 -262722 121841 -397251 -141904 1990 -236043
21307 -65227 -131094 205045 -38563 126399 -365819 -174261 -31025 219999 -121323 -206381
21297 -206381 66144 41963 -384013 -38 -220539 41040 -545127 35216 23896 -77316 -388204
21286 -388204 536 -76805 -39301 -80362 -38277 144508 372714 -114133 212647 -45969 71 -22646
21273 -91564 -581641 -27289 57121 -157388 51906 -6145 81685 -13350 -128005 -231563 -41559
21261 -204653 -59101 -22439 -233816 -48431 -52074 -51584 -326795 -105237 308710 -219768 -40334
21249 27455 62784 -31501 136266 -164925 215676 245361 -29013 21100 -96678 -264242 -24095
21237 -173379 58025 -385800 -40198 230841 117135 43448 89867 17847 -132083 -43424 157628
21225 -218553 116172 -93196 -381739 -21551 -471090 -185945 35440 33375 -60900 -80897 -185308
21214 -185308 -391716 92250 253071 168869 43980 128629 -110333 60629 173800 -386116
21203 -221377 -3072 273361 -56038 -6489 60166 152797 -54018 108895 -412497 29995 -89008
21191 44194 26845 64555 -69615 -130842 -402215 -512092 -24795 -129864 20995 -154356 138128
21179 -247296 -252247 64447 91959 -117186 -30188 79122 -191684 -142153 -63226 29214 -313373
21167 74338 -148982 -286932 -193727 -88528 -371997 81905 -258562 29909 79309 -189982 106819
21155 133325 -111384 -244311 -169696 -225746 -102117 153217 58384 -282432 -233994 -322149
21145 -322149 301874 -133503 -67457 -101014 37640 -335288 -195914 31702 101494 407733
21135 407733 -882 -170524 -71079 -93846 -364398 -199040 -59024 -269074 113625 -232217 -25184
21123 -232864 -126850 -104586 -37420 -228805 -333935 -26627 292961 -233121 -144967 -99665
21113 -99665 -81366 56133 249708 149746 -6623 -134218 -49981 -535278 8646 21177 -252723
21101 -53668 -35699 -169476 -424085 159966 -155902 101766 -15862 -96543 -213182 -21547
21090 38238 196844 136162 -80650 -5271 61452 -252906 -307083 -2619 -96125 165107 -24307
21078 -7016 -136507 -99687 61907 -136026 59244 69418 44920 47923 -395243 -21699 -171301
21067 -171301 -186537 -204526 104223 91287 -212764 6388 213900 -331483 -473454 35005 64782
21056 64782 -56599 -120486 105152 -248989 -83694 65685 385133 -16908 -38517 31986 -193058
21044 77956 86913 -55867 -212045 -229543 -67 -98100 -289218 195290 -297132 -295651 -226358 2767
21031 7902 3794 186037 286977 171484 135058 -11935 -288133 7722 334198 163171 -179946
21019 53664 -193539 68007 -10760 76984 -1983 -241068 -108789 -17723 -211319 221348 -142704
21007 193850 156242 338377 305442 288436 373774 122163 -430011 -48439 -45331 -191290 275793
20995 113562 36358 45080 2436 54629 -259884 -270909 -368984 -26141 25401 -70228 -108336 -291009
20983 -291009 -328572 137373 -185008 158485 -284734 129086 -66020 -161920 -125519 294396
20972 25101 46786 -60938 110516 46628 -200046 -2483 151131 243974 241540 -49998 72130
20960 -66860 -62408 -164262 -196244 -358723 -82247 80415 -214686 105759 -1894 -1010 -167050
20949 -167050 -71394 314508 -170066 -160175 74913 -105393 441238 438831 445956 409986 215952
20938 215952 -156089 335928 -206370 -161540 -75930 65622 8892 -2076 -55746 -66181 216216
20926 -34589 -340341 -177216 -167756 -112166 30355 -50242 59609 -139456 166628 249480 -165716
20914 30933 -19854 -94896 190457 -73827 -297491 145288 158725 -22789 -269201 -464263 -214939
20902 181342 92786 224009 -104012 27742 -22584 -55456 -164038 291214 -155080 -74250
20891 -196888 187865 -74525 164276 290061 100815 7619 107991 -59007 -127431 -166521 -105687
20880 -105687 -5792 -39638 -286770 -293589 110753 223850 -47999 -423558 -103438 -101228 -208539
20869 -208539 -170129 -20088 -168134 -50228 205027 160114 -112519 -266592 -187842 -163307 -133381
20858 -133381 -331325 50722 37300 -242454 4174 61207 233254 -112200 22785 -299753 -33317
20846 10376 137762 -116740 -69195 203713 -318790 6834 129108 -115151 -94470 -20857 -111805
20835 -111805 -170457 -270627 -90740 -127176 -115531 1514 -46763 -53007 91453 153016 -4142 -83408
20823 -83408 219530 261189 50564 8001 41179 -84381 -177636 57022 60038 -196138 -89873 194397
20810 91464 147974 115641 -120245 -32051 -220171 -193256 130212 -261673 -159543 -143386 -66491
20798 -69210 -33753 -38824 -11121 205710 320933 -7058 -26555 167833 208946 148339 -297476
20786 -473449 -3131 -26815 -71301 -169765 -351926 -318936 -76405 -188233 5417 14219 124180
20775 124180 -144020 54783 -236115 -295788 -66383 -128014 -50964 -81650 -48612 133684 192715
20764 192715 -35836 -331783 39552 -50153 268512 218935 -194261 -123133 9383 337438 -215480
20752 -167963 -253446 -209266 6239 -163132 -111134 -263612 148674 41608 -249883 -120021 62607
20740 200401 -193130 94743 -101169 -156701 -186619 28077 -375694 -275668 -27581 3111 132426
20729 132426 -139522 269812 164566 -2728 -186588 -16413 -187548 -454483 269447 -147129
20718 81157 -401109 -164701 -51113 -34967 -195236 -182406 -44271 249932 124367 -125090
20707 -175828 -20022 -112274 -325475 -23604 -209560 83817 80321 -223290 20756 -148520 -335579
20696 -335579 98878 69245 -14083 135430 42137 22666 35456 -3831 -189963 -153538 -277450
20685 -277450 110667 -354304 -49424 -188451 139385 -26602 -47950 -125137 116845 -27754
20674 -117617 -129862 -28329 -216500 -190147 -271992 188569 26525 -322146 -79672 17169 75308
20663 75308 -413817 -154400 -68882 -93551 41294 -167518 -139542 33214 -38940 -224588 -30269
20651 156253 98850 81003 192658 219314 -110054 -12595 -93369 40190 -297917 -221555 -62818
20639 -279919 -239929 56318 33911 321398 -99222 92664 -118830 159459 -352179 -73367 -227939
20628 -227939 -69255 217346 -94386 -135312 -210174 -52101 2944 -219796 -212298 87757 -414957
20616 -308355 349907 -181479 -248712 -189372 275366 -76781 -220839 -60102 -6461 -126441 172761
20604 96219 -16452 26494 278863 87237 187221 -371878 -9472 135196 -7018 -291088 -195279
20593 -195279 -34242 -145301 16744 -159437 -85034 -211566 -11072 117321 -9719 194530 902
20581 -211593 24085 -110093 -69255 146738 377487 -10857 -113693 42436 -14345 -106001 -444862
20570 -444862 -43948 -147274 -178409 -331016 -130734 -114235 59486 -386059 -465006 -49164 -53548
20559 -53548 -111565 150599 -141934 -179012 -264347 -17817 7750 146413 -268272 -97620 57803
20547 -289441 -103015 214191 -109797 59247 17309 -414371 -69529 -341429 -374318 -211253
20537 -211253 -392650 -258827 -202980 -209823 -57776 13823 -119154 -410160 76117 -40479 -144992
20526 -144992 87137 -230538 -56297 54713 90648 -72915 -12778 13136 -191243 -84200 -73744
20515 -73744 -28061 -153956 72737 226902 -32895 169948 -169163 -211084 -81957 -198265 166703
20503 -152399 33486 192105 -66656 40836 -204854 41388 35017 50825 104849 -296335 478848
20491 -6883 131300 97952 -18548 121639 389603 -98781 109492 -206677 -242965 -46501 16918
20479 -173603 17778 -15186 -97571 -14897 -144795 -125446 -90715 -196227 -114655 -131349 -46923
20467 -147524 223184 50267 268084 -361132 -76307 -425294 182109 123511 171060 -188442
20456 -131180 72245 171058 -73526 -163252 -64115 126701 -58584 -254966 2215 185809 20544
20444 -209487 20107 -161054 -40468 190565 -82643 -174975 20553 182277 -333770 -16588 89017
20432 -184708 -197266 -300557 -17678 -11087 -57264 140076 -272672 -163578 38753 173004 439732
20421 439732 89594 -42904 342581 -105804 -121475 -153942 171533 -205828 -155648 56347 -202353
20409 -230672 15511 -54004 251553 -330170 -163063 -95894 75730 -302884 179493 78419
20398 22654 -267388 -196859 -18667 218182 82819 -223918 192420 37359 13312 116244 -260235
20386 -11108 -187266 11237 132210 2075 68942 -391328 -10865 -150484 -158034 -17753 84060
20374 308888 -174394 -69978 11315 -354386 78652 134589 235782 -237544 127089 -47405
20363 257213 -19659 79610 -231893 -192180 -185795 -382645 -229734 -114135 347573 -99740 -41564
20351 33968 -344134 -54395 -154561 -48325 258474 -220590 189484 -214989 -219663 -116057
20341 -116057 -241973 -122912 371601 -391287 82604 -168564 -54643 145828 -85872 -131872
20331 -131872 -198676 -24559 62597 -259780 -105404 -12345 68873 -120302 85938 -177481 207153
20319 -250258 269578 -70971 -543226 -142547 62620 190806 18606 360107 -254448 -54218
20308 8383 144527 69497 98334 -329228 34747 -145610 -236532 59751 -235020 -29678 -209411
20297 -209411 -21783 -114579 161564 -355073 -268521 56025 -137038 -211028 -62617 -77146 -194313
20286 -194313 -154233 -16464 -202336 32796 -217112 -263498 299464 5416 -312186 294794 -400779
20274 -43820 -290549 199675 -479821 56344 350290 -193175 -61957 -482983 100353 110285
20264 110285 -46791 -229127 -202702 231686 10576 231083 -211737 -162976 -148336 107367
20253 -131902 31237 68181 -16437 -201460 68899 -45300 63678 -152914 -222963 -33484 -197685
20242 -197685 55353 -202246 -88828 -226066 155758 -32652 40552 -133269 -194054 30760 -17321
20230 -81115 -162412 -320517 71129 -121019 7963 -214949 59473 -72753 -33979 212345 -41072
20218 -228374 -27436 42211 -25770 -67356 -82933 17261 -233148 -236405 -47877 110858 94 21776
20206 21776 -55528 -254205 -34449 277048 85207 81607 -226309 -110828 -174517 27054 135954
20195 135954 225429 118849 -153039 -65447 -196019 -280009 -135123 50212 -75853 -108903 155525
20183 -215589 -21946 -178610 203102 -128385 -33191 -189065 -3720 -69544 -31489 215151 139613
20172 139613 233529 55438 117961 -97317 10481 -121164 334170 -162331 -9878 142312 -306769
20160 -82568 315936 -63564 60449 202248 -103522 -148497 70147 -6005 51772 321660 -256493
20148 221556 245143 515962 584199 120709 -238096 39069 190600 282588 118031 492474
20138 492474 210591 297302 258160 24392 -236768 -13058 143736 5374 -33192 -283813 -93629
20126 -238165 125363 -165943 -135144 177961 4107 -35384 103015 248011 -223581 -159803
20116 -159803 -77918 85354 -106921 22732 -16782 -167593 -174342 -173566 -215633 217130 -136692
20104 8287 -351869 33829 -85851 -220280 61561 -119672 -469920 -89878 1813 141747 -217005
20092 92913 115731 17694 -141578 -70718 -123246 174911 15552 -6706 -133873 -123815 -240405
20081 -240405 -80818 -167600 -40816 -326751 167406 -62277 53896 75056 -407534 -84383 148396
20069 -52055 -72151 -206584 -403321 -39652 -167830 171193 -135120 238246 -64273 -91335
20059 -91335 -154788 45339 -141527 -115151 299806 -16794 122619 68689 -134301 -59980 64042
20047 -184553 -117686 -40889 -158988 108252 -218046 -156059 -195049 -108034 -8589 -141781 -326903
20036 -326903 -187546 70458 -174311 -181098 -135358 -98249 -351193 -252251 62963 -75369 34042
20024 -149237 81740 18667 93000 79254 -104867 75674 14553 29799 -81203 109764 349777
20013 349777 120195 96129 77883 68040 149633 110203 -147638 -105820 105674 -156354 -125206
20002 -125206 205350 94144 150426 325532 237423 198519 341643 485886 60035 170970
19992 170970 76378 45389 307664 -106328 220879 -83597 158352 332641 186922 371980
19982 371980 -306156 -170019 199488 136668 43483 -202625 153938 112979 -239488 -181940
19972 -181940 -83617 -245501 -53622 -329602 4093 -186766 -297779 21170 127742 163912 208350
19961 208350 67986 -13335 -61486 -69467 -206994 -186692 122529 100606 285100 222587 132288
19950 132288 -104961 119895 129241 -99400 25366 -33826 -111583 -75725 7951 12191 -170371
19938 114804 60953 -15959 -147597 -50744 -160846 -190274 109035 -317649 -158338 -278265
19928 -278265 -67608 103028 -90047 3410 -176558 195786 -277439 -83705 -71574 -291979 -196361
19917 -196361 -34981 153320 67237 -47023 -129418 221487 133019 -110680 -208472 -293696 -183673
19906 -183673 -155507 165135 119313 -74285 -132634 -222416 -56311 132217 17729 -162565 -1093
19894 -92001 -133807 -82537 -243344 -343297 -105841 105390 126195 -182362 -121556 301451 -94204
19882 44277 -123523 2370 -94824 187530 -211503 20951 -432644 -300606 -26106 161078 -151144
19870 -241512 -42895 297786 -59584 -22793 -309106 -287262 -159621 -32238 -72860 290931 -17007
19858 -7625 -85242 71928 -144087 -135247 -92695 159585 -368604 -111126 83009 -115079 92175
19846 -40268 -50410 -172266 -83547 296273 -187941 -5917 82229 -277185 -136085 -509712 -85936
19834 -176452 -165005 -101579 -252416 -29987 31019 -298400 2010 -208579 345105 -101247 15302
19822 126904 -249710 -34635 -20822 87234 -74871 -30173 -322743 -244820 -131187 284131 -293743
19810 -147236 129984 -290108 -25076 -8267 207341 -244851 -54365 -321241 -42175 -52093 282842
19798 -113600 -145224 5272 -54475 101039 79898 -74541 -155896 -162822 -51208 43728 307081
19787 307081 -175333 -43180 -367374 123199 8976 156843 -162015 183468 -258543 106716
19776 -197290 -95446 106924 -115252 -18111 269925 -215004 -171811 -100830 -168275 131249
19765 215268 -211556 -155808 -98119 -13934 -43890 3999 -47466 -206825 -273175 -144430 -126825
19754 -126825 -72018 -252968 233986 124283 -274739 326287 -150230 9594 120727 -268443
19743 -24646 -283857 22726 38046 -6011 284152 254896 324686 5364 116844 -26400 21502
19731 148627 205256 355461 901343 265949 241602 239786 -142881 -48663 114591 -89947 -123472
19720 -123472 218403 35461 48659 -161862 7851 -130557 121463 3476 -18254 -12828 140111
19708 -38227 -95405 183671 301456 -163105 15213 -3969 -213 308785 78020 -89485 389996
19696 472207 482226 303310 -15575 -161880 -346640 31205 -107165 115937 -270136 175267
19685 -380734 -67156 -253462 -87951 -50477 3011 111253 275234 134474 -277579 -50974 287736
19673 -134121 30859 -158727 -134805 -165548 -428888 -14170 -163961 -225034 235544 -81686 -151316
19662 -151316 159396 -31435 -219944 -28066 -49294 5113 29885 4383 140774 -245064 -93468
19650 -353711 61663 -236331 -13703 -211336 -215223 -316508 -144884 -182448 66791 -145449 -78137
19639 -78137 131974 -163148 -172617 -262233 -73279 220893 225213 15622 141043 -97753 -42317
19627 100051 -125191 -280782 75564 -141959 233766 -199866 112365 -92977 185664 -32401
19616 9934 -165414 -114344 -155594 100524 -475810 -390224 56772 -120825 -221232 -373484 -64913
19604 -242711 225087 -93267 -27511 188951 -76303 -92215 42896 223966 -62198 100038 -106128
19592 41037 -180862 -185373 16169 68988 12529 246640 -325045 -82491 -375865 64246 90977
19581 90977 19071 -293955 -196407 199942 36458 -153934 29174 -134796 -320759 -353877 -31606
19569 -43516 -189823 -160380 -63325 -180234 160038 -77893 -199590 130831 -289979 -171880
19559 -171880 -250020 72434 22637 27739 -94732 55297 343319 -213193 78081 -215569 280862
19547 -294049 -312900 -156683 -16213 -275864 265815 93373 13228 -32012 -185514 1457 406969
19536 406969 -63124 180389 -37154 -570738 -197502 -239357 -209017 -98128 -141842 -225435 -3195
19524 -253202 -446559 -326860 -46822 -6719 -260474 -380079 -270134 -113416 15335 375045
19514 375045 84655 6141 -328541 118691 386558 211346 -317838 -265447 -144895 -315708
19504 -315708 -62095 7383 -307618 229681 1187 -248754 -269843 -133393 -112702 295084 -288544
19492 115582 -274277 -227856 -257739 -50801 66546 -326013 -360576 6886 -72651 -79166 104479
19480 -88750 112840 219783 136197 -15607 141889 486 -127689 -202772 149334 -231763 76558
19468 72439 123956 28961 -262538 -3921 -240891 -210667 6078 -70635 15983 -175960 -120496
19457 -120496 -280079 113107 -33234 -247820 -109844 105423 -130558 15661 74499 -196089
19446 197402 40386 158061 89849 -1189 329527 -154457 2041 -134151 29624 84568 -38404
19434 -140106 180576 88332 66322 153111 -183075 -18223 227822 -331814 -340747 -228505 -84295
19422 148940 -246850 -62277 -138890 43494 206984 -279604 139627 58004 27499 74860 -191627
19410 -103153 56882 -457315 229779 -305218 -27682 -162391 -94996 37660 -260957 150978
19399 189812 10145 4575 136735 -68863 25670 -15481 144178 4562 19891 12337 -33858 220735
19386 -114516 197746 -44312 -35665 -60247 -316735 -164747 -73432 -40295 -51364 -261712 -102351
19374 -215668 -287698 -81671 79207 114719 121130 150779 165054 -194458 137967 -40142 143122
19362 -115669 -135183 -39375 -85610 -76120 -218555 -78479 -155510 -208959 191073 12197 -99689
19350 -43933 4852 -97425 -326378 355543 -187883 -155379 -15875 -473572 -189595 -116922 -184013
19339 -184013 -155503 -55481 63013 -133537 -272550 -160447 -72436 12517 -156961 -422803
19329 -422803 102324 -180006 117683 -93200 55102 -122596 -330495 -16029 -83162 -187151
19319 -187151 241879 56210 -384783 168654 -234852 -194719 168219 -203698 62379 55443
19309 55443 -357366 -22211 -129506 -395283 371855 -79179 -133522 -67967 136861 -248945
19298 -231123 37066 -283456 253039 -215472 -265770 117460 -231986 91506 -162935 395304
19287 -165086 142972 11334 481475 -54946 -276043 189985 -159371 -64443 -33756 -541127
19277 -541127 -169690 -148063 -81446 -256998 -278894 -96192 -282300 65479 -201944 -281932 44275
19265 -413566 -244611 -127599 -272543 -69465 -41371 -172153 -222593 -110621 -144116 -127263
19255 -127263 272960 -70884 17846 229440 -27811 -196910 -74845 -62329 82866 -197258 -114874
19244 -114874 -94272 -142506 -4487 -22351 -80740 97170 -254851 -76264 -153603 -277437 29488
19232 114508 -53416 215868 118810 64836 193197 118179 -71118 114332 -156411 -340952
19222 -340952 -441019 -48855 42550 1434 -199953 96746 -183038 1340 -213167 -302611 -254
19210 -399458 9643 302139 -23584 -366462 -135301 77623 88361 -229610 -329018 -33027 60719
19198 26615 30810 -640601 47251 -183822 -261584 -50849 -198614 -349658 -354890 -205535 -7899
19186 -165854 40829 -238472 -153157 2775 -228442 113567 -31974 -81514 -255008 -175265 -7610
19174 -141553 -98570 -184352 -84466 -197659 15820 -220397 -144603 -149236 296406 -174595 61645
19162 86753 88644 67192 160830 133657 -86264 28613 -89676 -89378 48495 -25249 -43356 58696
19149 36560 -308102 99410 136681 10824 201171 -79794 -69570 -324577 -110822 201871 73123
19137 199745 -4851 -281 -45737 -206629 -177939 -16376 -337441 -233167 -165915 -281734 189027
19125 -50784 6857 -257693 140679 5399 40845 -102854 23872 -315680 -114188 -107801 229739
19113 213705 -95015 152508 192440 230746 145745 86786 136425 -10377 33799 -160054 -265487
19102 -265487 395918 -41782 1696 -289116 6242 -426030 17803 296948 -402765 -270672 -232846
19091 -232846 -176139 94217 57559 83835 -7439 -125856 -155772 -284488 -196954 -50226 -210150
19080 -210150 -110619 -164972 -193831 -151549 9927 -89222 -129196 190539 342131 220443 401000
19069 401000 184900 -306820 184864 -70294 -301638 135918 -16000 280781 72200 -47854
19058 -155000 -210500 158872 -33808 5520 381171 -92667 -73712 132942 -181345 -225791 556
19046 -125733 222595 -158310 -421416 -117183 -141079 318855 -7268 42510 -147411 -266906
19036 -266906 -138374 -195065 -430671 -115171 89459 -3189 -347802 -149310 12258 413693
19026 413693 -91279 256544 187976 15551 -33525 -174468 280404 105788 85816 -139410
19015 -87178 154390 55512 13237 -337949 -117496 -81192 -230345 58464 51668 -137954 -136314
19004 -136314 -137701 143500 -27254 -36728 -114799 135948 -73705 -109975 208961 -73594 95130
18992 229882 21931 -191159 -23482 -132251 13221 -336 -177701 110778 -400612 120935 118259
18981 118259 -13996 366901 246864 9074 -68 -119251 -149645 18576 -13677 56992 563687
18970 563687 535876 62465 -210115 237060 -217574 -66259 -21979 -45584 86427 -54127 -101677
18959 -101677 -111685 -408953 -167024 56653 -58148 -98508 -65682 -40798 257053 -233254 -135447
18948 -135447 -127487 294472 -142388 -234260 -20293 -133255 41699 132187 -108009 -345459 -19832
18936 -121625 81270 75408 -124415 -3562 235711 25836 -526 -13555 -498784 -137188 -87772
18925 -87772 -118261 71629 -115140 -254910 -202181 -298721 327591 -90597 -2768 69679 298914
18914 298914 235643 -242116 -86720 -8469 14541 160032 761638 432095 66849 177178 431990
18903 431990 -72201 -400038 152729 14132 3041 44718 216968 -41056 -25762 27818 -152878
18891 -63984 145159 -168435 -146129 -318612 -8878 54814 -243129 251056 -164467 -158147 -161792
18880 -161792 -263174 -223681 -182231 30156 -89302 -218621 -63320 66948 -162582 -67507 80490
18868 -46424 -318929 -83472 4044 65194 264989 323427 -139696 176293 -4412 -178515 -133865
18857 -133865 -47579 -57435 111761 -273674 168235 -162656 -106750 -3653 238024 103793 80912
18846 80912 247239 326962 -236267 -325898 92960 22106 -205053 -111535 22937 -3516 -222416
18835 -222416 -15174 201660 -251508 142464 57217 133410 -228307 -65051 -422134 -83277
18824 -153010 101913 -283133 60530 -195696 -195078 -42290 193542 -154851 25942 142310 103780
18813 103780 -50216 220710 -148083 -237908 51609 232614 309859 61346 126337 183091 -67739
18801 89721 102684 467795 10607 -37051 -206718 -187645 58396 -343670 -117467 -367019 -141247
18789 232219 176605 -174507 -42133 12247 40037 -9143 377468 -149349 146141 -397414 166060
18777 2025 7689 48176 -306133 -194599 -243707 4461 -129096 -27366 -15328 -80740 34866 117407
18765 117407 456378 -29007 -190878 -2030 159435 -427266 -76564 210255 241060 135633
18755 135633 -124200 -84688 -389125 -111140 50428 251246 -341568 95909 188235 81385
18744 -9787 157113 -7494 -397881 74458 -394897 55348 -249108 -152029 -168305 226872 -61334
18732 -261958 108419 -325668 -176636 142520 -273804 -88071 -42474 -55183 -308494 -189869
18722 -189869 -38083 -220996 -61857 23473 -36065 131972 -356214 -422882 -449139 -281819 129128
18710 178098 159694 -55653 -13890 -22738 -75566 -127642 -366911 -126146 208063 -180725 -46519
18698 50319 73392 -21497 82147 -81107 -133932 -127990 -145255 -243231 -37181 517708 283589
18687 283589 140962 -118928 79325 -15975 -53562 60538 102696 -167624 -101105 -63742 91921
18675 -310526 -224137 280281 -89490 59075 -335396 11865 -71387 -500049 -51696 -237033 38584
18663 -287714 239162 -244124 -129487 -22888 -250306 -85183 -127221 -127935 87820 -90309 -23791
18651 -137834 171000 -317922 -17414 108601 278790 -85296 -130273 330449 -150338 -9974
18640 5947 -24874 -258193 -145537 -198375 -266053 -392392 -112783 -94160 -64110 -89695 -175241
18629 -175241 254707 218345 72402 38306 -4015 -110330 184108 -124503 -171622 43638 196007
18618 196007 -75816 -280451 101180 72704 -9228 55121 -216630 -276434 117669 -53153 -227870
18607 -227870 60680 -403510 99205 9521 24804 -128395 -171200 -279464 -163075 -125199 288855
18595 -115992 -38446 -230917 20229 64650 -179151 -208683 36025 -283347 -71331 -216114 -67721
18583 3867 -175185 -65790 -263482 -121415 -278213 -196294 133302 -30311 267591 72434 -265175
18571 315851 -81732 -9214 -75071 157555 -43902 44723 -150882 92372 -15943 144058 -311539
18559 188762 -21376 -64119 47510 186553 135418 -55829 -10185 -13029 -26145 -289920 -270589
18548 -270589 -324051 -73551 -253211 -130171 -166945 -26310 -111605 -165062 -56060 33739 -162228
18536 19590 193321 -35982 7554 -51647 -558042 -17784 46969 -15673 -257575 -237006 -151173
18525 -151173 -212135 -47283 36592 -35838 -156629 149958 -126602 -211456 39313 149108 -15447
18513 -271645 -268954 -383937 -106585 -210275 156682 -97959 -179799 46216 -105592 -161975 -137818
18502 -137818 123 139043 -190851 -331272 -123171 -65294 -226656 42759 263985 33445 -17285
18490 -60739 -117960 -151687 -66682 120376 -104999 -81682 -365087 -236780 203402 168536 55465
18478 -311304 -39683 23336 -130030 -281901 -45904 -130680 -9702 -79405 123580 -162420 232168
18466 -44722 69411 -82536 -245055 -45849 -347199 269086 180295 -192537 -246104 160933 62620
18454 -101649 -164520 -210101 56277 -114517 138553 3763 -204407 -135308 -364153 -90671 -131490
18443 -131490 212663 -250201 50155 -84964 -241847 -339014 -262350 -1471 -86439 -31155 -286072
18432 -286072 40991 144523 -203089 114364 178569 -266623 23346 350619 231452 31326
18421 -79161 179051 -139228 249 -222360 -111034 62631 6921 -94703 -177461 329967 -124183
18409 49033 125310 34206 -34684 -223768 120810 -279156 212133 -176300 -35662 -86064 -101186
18398 -101186 36029 -133171 181733 -213699 64183 225049 -129328 193798 -247711 249351
18387 15976 -419655 -78926 -390453 -86143 -168334 49452 106148 114469 213968 168782 -176781
18375 -113486 228152 -91907 41579 26366 30523 -89037 62320 -371926 -166911 -7219 -5057
18364 -5057 -392096 -187759 62305 71864 -102477 -81423 182674 -94140 249434 217062 -258412
18352 149092 107864 -242333 -10999 285759 -185630 92549 4798 8006 -187892 27642 -243690
18340 132227 -271817 33457 -45740 -168997 -246190 -46488 -193129 59189 -306292 -107794
18329 80034 -419131 27557 35465 16613 72049 -84006 139950 310628 -58750 -93414 15124
18317 -37112 -107106 -141449 -216207 17485 30554 -170135 -4438 -283355 -96802 -139564 -219774
18306 -219774 -152409 196337 187195 16867 -7702 -188979 -135310 89129 -80870 3173 201761
18295 201761 -48634 103956 61224 -6778 -275671 -30809 -56118 -76850 -36372 -147946 -524582
18284 -524582 63585 187801 -379653 60470 -254731 65877 -291955 -14920 -88361 -137326 -265671
18273 -265671 -75300 -131487 87309 198554 58758 -68808 -156919 -261763 152287 -40064 -139194
18262 -139194 111402 -196278 -243979 -77807 255147 -286677 -326651 267015 36571 -23701
18251 -75771 -275368 19029 87332 18552 79625 139737 -38338 161417 -34492 -123323 -152499
18240 -152499 160886 80862 102532 134951 125387 -81015 -143701 -20084 97650 175546 -337371
18228 -160941 40220 -105890 94356 8555 332479 -2412 -130144 106037 103262 101088 13090
18216 -71896 81596 74033 -205725 -168344 -320445 197206 -69682 218859 80076 36064 24421
18205 24421 60666 -71969 -26611 25577 254854 225496 56147 -298742 -73194 -64744 -54726
18194 -54726 -222996 -78605 -124629 -124209 147758 80787 -215140 -165527 -155457 -105355 -192233
18183 -192233 -182991 198145 1735 -12690 -51582 -118934 50272 317316 -120737 43529 -24432
18171 23939 -388022 -140124 -139218 -50025 62378 -230954 -271502 -70574 38976 229341 208658
18160 208658 29473 133763 -154386 139421 -216405 -197384 -229868 26060 87371 217692
18150 217692 -163924 -38440 34332 96717 121681 -118283 46719 -86131 34780 -56636 31670
18138 -214078 -231856 221977 -268595 264022 -183397 -84249 203905 -220830 53844 -36788
18127 -86297 -34727 -86354 -76619 -98883 -194549 -48202 -132397 84358 371132 249878 -293614
18115 37662 -192654 -419294 -3555 68094 -127721 20679 -160089 -7791 -258472 124121 98237
18104 98237 -30375 -22745 -92540 92598 8219 -177408 56936 392308 -167065 -225529 49987
18092 -26692 -74174 -55361 -117874 142366 74454 -243024 25832 -393172 -97711 -75116 -62356
18081 -62356 -50999 -22573 -51498 73248 -73868 -147886 -5919 -202641 100272 -139110 716 -5331
18068 96772 -79316 -44924 -218445 65497 -198463 26653 41035 110437 -93731 -141913 205089
18056 -86862 266576 212945 61586 -214519 138535 -140646 -170613 -85306 59369 -291445 174752
18044 -89211 -220458 -37150 -266521 151657 70805 238213 -333130 -199964 -181453 252382
18033 54801 -114221 -289881 -160501 -208635 118824 -116281 -335620 -51779 190632 -128613
18022 1415 164352 -104684 -129889 2452 152506 409166 -82787 -17491 113871 -184934 -60135
18010 -10541 31734 159830 -92009 -272883 -37343 -73535 -76794 -343049 -121264 168459 -301536
17998 -75428 -150576 283167 -136910 147598 -13541 -92428 -147533 208979 -237627 4919 -145371
17986 13912 -18949 -43883 -3796 -34277 -86487 -127881 -57706 18875 -265115 -43225 148304
17974 -27993 357751 17962 146910 17938 -26861 225795 226681 218611 -92967 77654 13998 193000
17962 193000 -108955 19336 -110406 -38032 -83021 -101086 -37433 -97465 -314781 -153284 94637
17950 -60345 -74620 -199471 192861 368442 93196 347598 -136743 -32898 -168405 -256271
17940 -256271 196779 -237424 958 49408 -62282 145392 101611 195724 -28978 -68509 136718
17928 -232547 147666 253357 112629 -68845 46172 -3869 -47326 -171560 -285174 21834 -388242
17916 205367 -101987 -2580 292313 -242115 -220602 154781 458098 -89109 32810 207150
17906 207150 -15363 154101 -75496 -168300 123302 81662 -12720 -143209 20171 -570108 59773
17894 84195 -86808 34422 368989 90959 116148 -66172 -148994 165924 230457 129554 224769
17883 224769 -22674 -279733 306228 152494 9187 169107 -218810 165664 148829 48656
17872 -145014 -74102 8832 13628 -13637 -228131 -274106 78851 -122554 328509 -71421 205686
17860 -82678 324666 75973 110144 -153123 -93338 79562 -319716 138114 -43914 -346524 173863
17848 87285 61835 147582 -49506 208586 180457 -64055 140193 -1459 145286 447776 476500
17837 476500 -99183 -132969 118729 55116 -154040 -221230 -78339 -168933 252177 58741 -71753
17825 -47746 -190496 136942 -17981 -42031 140200 13665 -180968 271651 -30626 230810
17814 -53562 -139275 85973 -211633 -5268 211735 253138 155550 29587 -28837 308053 56037
17802 -68782 183218 97907 4802 -40733 -151909 130189 28767 -6474 18483 -41987 101615
17790 111677 314819 130311 60727 175651 -41899 -160899 83693 -245351 146258 80885
17780 80885 118258 124244 48877 252193 -68786 276763 -73981 28201 104848 77042 -129546
17768 10463 5967 -132784 16162 -51311 211174 -80618 -70781 -104319 73293 48305 79005 -142661
17755 295562 133956 286869 18628 -251961 238665 58469 -24688 170817 23813 -238520
17744 84380 205054 -110024 376223 360731 187348 -155450 -128794 -155723 -149759 180930 -184033
17732 85698 -134042 -6741 405290 61820 159400 -79921 12016 -125992 385579 -84447 83585
17720 15182 -208876 -371680 -215661 -87473 48318 270192 58255 -86415 -63216 31863 -26472
17708 302694 35139 -12331 28075 -21337 252891 122246 -201190 -496118 144506 449367
17698 449367 185963 146413 -161786 203604 129217 143844 195771 217972 168021 -68002 274422
17686 -50271 9337 252910 -147917 -235674 230851 -43665 66861 -8991 193517 -155014 217430
17674 29682 70889 -17793 34198 41435 212103 84772 37385 -259988 201928 -80881 -83755
17663 -83755 280090 53928 158984 485359 283474 89563 -59879 373841 8427 144082 415395
17652 415395 186899 357035 156885 133966 119056 -47936 12511 13394 -76512 -319284 41775
17640 -47255 133476 -160277 -86027 -6808 209643 -90964 115791 -201359 454722 341896
17630 341896 33128 197970 193934 -85272 69613 111806 282410 -185267 230741 58772 43155
17619 43155 96689 -60382 -340210 207604 58278 31844 -10658 -12620 196057 16545 -23332
17607 -263254 288051 253414 -27401 89814 -16906 -348995 267059 40090 -90241 -4978 62 134323
17595 134323 -107442 82933 294091 -842 190854 -174443 292780 162339 133252 14710 117481
17584 117481 109785 332505 27348 143429 253832 260881 183211 74475 102292 265326 -25072
17572 196386 405270 424139 229965 47131 60135 288032 8392 358117 -196964 40493 388229
17561 388229 244502 348219 73148 -231837 236416 213995 80056 129803 -46520 24369 20436
17550 20436 206183 255551 300688 113175 639389 233841 304052 302702 290024 93879 373487
17539 373487 336161 131910 247686 232833 330304 431032 16275 -32009 439299 347641 367400
17528 367400 605174 722329 772147 818550 1057630 1010768 1064165 865570 404002 539700
17518 539700 258795 508820 348210 284366 445841 520585 857719 909862 798370 1201868
17508 1201868 1315752 654459 722516 664504 469889 217231 296724 353263 69794 277314
17498 277314 337288 95938 525624 219830 502683 530691 516499 315195 65885 -4731 230280
17486 592289 -44496 557948 214640 -15972 373184 320956 375259 28516 336037 787555
17476 787555 139250 167622 450085 52024 205645 185780 360927 42607 454890 258910
17466 258910 466274 593448 -132278 178673 186521 6652 41731 195346 45184 -7119 219382
17454 53869 180443 183083 327078 434227 259697 257554 336224 478584 247536 528290 333182
17443 333182 389246 323861 139627 400554 332321 339084 144637 136150 428862 371962 -23191
17431 456746 592884 499339 777742 68381 147639 302449 234358 314555 241194 380999 311736
17420 311736 246161 492193 359710 293426 437113 816494 167113 578391 129768 283187
17410 283187 442312 401469 82352 327899 41279 127369 562746 104414 208074 179934
17400 179934 44312 366449 -7010 271085 11918 313437 300204 248803 262135 123537 109306
17389 109306 264148 269338 364613 439439 313065 165753 120200 463868 655709 145657
17378 231245 30100 -32025 86347 267493 -93433 282450 192201 211681 241921 104306 175449
17367 175449 145988 -16571 261660 127846 305384 52724 265167 475068 8884 107534 82396
17356 82396 -89015 93446 244299 449684 324922 313937 244652 309003 168477 331698 102624
17344 278010 252295 599138 254464 342734 206334 401400 4430 374004 277697 456838
17334 456838 385397 98698 623867 3985 172473 269235 543351 34146 108759 280894 261162
17323 261162 458056 201304 432789 108993 230964 209921 287313 542093 220833 -53470
17312 133420 128856 -4178 131522 198045 549015 82764 531428 299360 550460 403751 174958
17300 -16106 -42397 301151 298508 450324 655358 91176 453645 531689 404827 437509 335072
17289 335072 249452 282225 297672 76164 355216 266986 533612 192142 819158 246236
17278 482820 858469 632364 268263 68733 156745 351238 400282 410064 -49858 88286 499176
17267 499176 316234 463071 606231 427565 428287 476912 396775 261040 293589 162958 485652
17256 485652 147938 223102 322899 319819 159461 358797 122838 642633 176576 392185
17246 392185 550151 257585 468367 335494 645041 256881 370702 168766 442245 367829
17236 367829 215069 -62963 479409 39706 399697 565201 474255 501158 299743 188026
17226 188026 264434 208313 343763 353825 280894 370459 664159 471601 500950 322328 581401
17215 581401 285566 187190 394107 600017 315231 296234 474843 456573 526458 255807
17204 330408 280901 382414 171212 394579 432068 244498 525525 350080 455371 320103
17194 320103 179154 169368 366383 288086 630826 241211 259528 442263 469938 290595
17184 290595 520806 477504 173737 453015 351884 733034 516267 346613 537192 581009
17174 581009 279458 551323 303251 834481 686976 689499 630107 468469 501326 454522
17164 454522 979685 498106 646493 610647 389709 88634 177683 654932 674690 691261
17154 691261 289874 889060 598526 440973 578180 817413 658256 629550 619256 751131
17144 751131 506798 399971 712984 486852 670600 301032 504913 843083 416578 492525
17134 492525 794432 687523 830344 354543 744181 541049 647902 571514 544816 722016
17124 722016 468278 629610 808215 449244 620006 549143 229133 614623 692809 461792
17114 461792 662663 581266 754801 452010 416619 623311 335023 685070 558662 732099
17104 732099 667869 781919 512204 287748 498076 566146 840120 643143 787470 761569
17094 761569 771230 825451 895917 620333 752073 736344 519832 449680 603503 746700 540001
17083 540001 621813 379699 924449 909140 895173 1035036 728102 720297 996497 844461
17073 844461 898056 826571 711777 599949 808979 388076 763784 1253833 918805 740995
17063 740995 665592 952999 1044208 777131 997517 791570 1047734 911303 899261 904166
17053 904166 675121 355368 1042705 936237 1232665 989921 909727 1048408 696711 1022226
17043 1022226 980572 989523 892726 605110 966901 828256 784640 888373 1218397 740766
17033 740766 1053413 544058 782840 992481 1240841 895335 1141445 1262305 1026719 1014677
17023 1014677 961913 913043 1029292 1322435 1040915 989425 1082176 1336401 1340740 974111
17013 974111 1471204 1241349 1129649 1204283 1056101 1463803 1255150 1480443 1472780 1184837
17003 1184837 953661 1077309 1003734 1116288 1386824 1107390 1486626 1551957 1496867 1353433
16993 1353433 1569338 1281419 1365313 1458057 1084917 1406902 1345339 1219319 1187065 1251958
16983 1251958 1065560 1275278 1369461 1368178 1363647 1396210 1369894 1682250 1778356 1552710 1433107
16972 1433107 1761797 1112135 1467761 1479127 1639350 1606761 1539694 1738950 1593612 1416438
16962 1416438 1769623 1524857 1781514 1827799 1560961 2058172 2120768 1765465 1485258 2148275
16952 2148275 1963757 1998264 1760680 1770502 1828694 1923544 1905691 1767250 2032711 1993319 2018981
16941 2018981 2098026 2047259 2140213 1744100 1750653 1795700 1686476 2024160 2143132 2055563 2182738
16930 2182738 2303479 2171876 2179153 2257377 2189862 2374536 2093628 2001893 2386198 2572613
16920 2572613 2505639 2435712 2486627 2295901 2648499 2441892 2895323 2727035 2628639 3032991
16910 3032991 2695136 2930643 2618408 2636225 3266315 2542689 3077195 2962470 2916289 2949508
16900 2949508 3261220 3009933 3072873 2806481 3138835 3238898 3117876 2821968 3306027 3514457
16890 3514457 3132088 3184472 3241388 3554682 3468522 3659820 3539278 3765606 3818641 3813562
16880 3813562 3714753 3739694 3852195 3943879 3989849 4005420 3544141 3967329 4214817 4055883
16870 4055883 4234959 4563439 4230001 4231260 4413381 4638379 4580534 4658608 4810019 4833388
16860 4833388 4731357 5024085 5116750 4776820 5112533 5374288 5392944 5307854 5520157 5450009
16850 5450009 5658987 5527210 5926600 5964271 6399964 6070407 6058085 6206901 6244872 6542313
16840 6542313 6610177 6869056 6807551 6912695 6947850 7239304 7329795 7581700 7450532 7722963
16830 7722963 7417254 7664397 8100132 8352460 8381791 8266170 8700955 8571537 8784017 8998153
16820 8998153 9311612 9231308 9333080 9689165 9987398 10367239 10408200 10795435 10967315 11141962
16810 11141962 11145086 11422771 11493175 12123351 12144716 12527479 12887140 12957946 12919175 13638331
16800 13638331 13726798 14479343 14438855 15225194 15414063 15346826 15904774 16144010 16799606 17156782
16790 17156782 18041522 18395728 18490969 19078479 19481773 20170455 20143662 20714087 21472710 22228558
16780 22228558 22766090 23297624 24143104 24618983 25244456 25953673 26730441 27584627 28625372
16771 28625372 29322322 30219260 31300054 31976362 33199663 34371136 35094738 36506043 37237845
16762 37237845 38629345 40174882 41419636 42743288 44045593 45593159 46956027 48484510
16754 48484510 50561155 52289134 54168996 56118273 57988506 59665512 62068540 64049723
16746 64049723 66023129 68370356 70881905 73249144 75588832 77813885 80311607 82846975
16738 82846975 85183457 87687788 90136816 92332926 94902145 97155138 98985546 101277366
16730 101277366 103057812 104465495 106680424 107728224 109125004 109965254 110874304 111093740
16722 111093740 111068288 111432846 110964343 110514183 109716552 108792102 107397494 106041131 104128671
16713 104128671 102454537 100094155 98415489 95889133 93453230 91511293 88701422 86177385
16705 86177385 83819563 81289913 78639436 76245141 73529138 71347953 69304144 66547139
16697 66547139 64587951 62075647 60021965 57893104 56090086 54121943 52474781 50621561
16689 50621561 48669763 46788677 45474181 43536054 42374194 40911132 39756874 37939981
16681 37939981 37468441 35828025 34879456 33697104 32878074 31562223 30386093 29624965 28550683
16672 28550683 27725738 27148640 26234958 25092591 24727684 24148465 23019112 22754601 21889642
16663 21889642 21564459 20589818 20594060 19847138 19152696 18950405 18069124 17463172 17352484 16887203
16653 16887203 16489172 15805960 15451229 15207530 14948135 14355234 14051635 13847425 13287618
16644 13287618 13269171 12901467 12584346 12214228 12013001 11725774 11347218 11130062 11004035
16635 11004035 10614898 10568221 10297862 9854304 9782168 9907975 9378639 9436488 9172084 8694629
16625 8694629 8653985 8825829 8537803 8094797 8069998 7975620 7698705 7500361 7599310 7091787
16615 7091787 7447453 7200349 7256951 7083396 6537727 6510190 6714582 5948097 6435046 6312267
16605 6312267 6091806 5927277 5961177 6136725 5753263 5602674 5360852 5384388 5483439 5271163
16595 5271163 5105740 5035436 4730958 5084595 4553126 5161455 4751955 4807123 4760444 4521900
16585 4521900 4661475 4423909 4618977 4410549 4049825 4479101 4280272 4063284 3761556
16576 3761556 4230585 4020352 4049376 3637056 3552205 3841289 3651488 3812232 3478517 3571532
16566 3571532 3368468 3588386 3252829 3335665 3370243 3091351 3256721 3310521 3211185 2950547
16556 2950547 3154081 3060328 2896681 2866312 2990160 2738729 2794516 3127931 2937467 2447569
16546 2447569 2572609 2696852 2384062 2609896 2727916 2379379 2580450 2362526 2514201
16537 2514201 2396174 2649779 2074425 2294170 2422147 2536718 2330765 2234707 2437238 2194408
16527 2194408 2114634 2228260 1782339 2340376 2376061 2086297 2126850 2092260 2102122 1873025
16517 1873025 2303978 1586221 2376194 1753854 1982307 1805796 1532827 2140850 1864565
16508 1864565 1745166 1580391 1877493 1653037 1781959 1622743 1539325 1754839 1959363 1776389
16498 1776389 1616445 2120159 1474226 1505270 1450772 1396363 1439602 1539442 1649790 1474335
16488 1474335 1838913 1435733 1032054 1169378 1685831 1193454 1479825 1597650 1158877
16479 1158877 1151262 1486873 1371856 1297475 1353171 1442207 1256335 1621262 1250200 1384195
16469 1384195 1015592 1462460 1233903 1190089 1564785 1190568 934833 1349160 1036352 1409436
16459 1409436 1035103 1138155 1360217 1057958 1317623 1105287 1477174 1200677 858644
16450 858644 1185145 1159440 1105739 1090124 877669 928083 945213 1065096 990188 1048752 1211163
16439 1211163 802243 826668 972397 838706 999716 1154641 769380 994767 1179190 953628
16429 953628 750851 785713 938349 846021 1215048 732435 1096989 590480 842156 972277
16419 972277 921170 728633 914188 801193 934827 761353 824225 631631 807317 996372
16409 996372 787524 1208355 740914 888240 1032428 893585 315107 898813 713504 863294
16399 863294 872139 653315 1003173 723017 588551 812620 836106 855722 761773 709412 679211
16388 679211 702478 763427 372313 793129 1102197 561678 482818 563824 823587 696453
16378 696453 994457 1025121 587307 780877 651493 489593 1104138 622454 504955 773191
16368 773191 598227 527089 521420 608537 643392 545965 548742 354541 499128 310820 731912
16357 731912 152365 660824 773176 616997 514181 714438 369497 470760 333767 841873
16347 841873 658256 518342 680964 229689 711702 705593 607312 558066 333924 348526
16337 348526 412798 490076 370381 470866 647430 393314 204132 535561 327803 629832
16327 629832 484000 509953 329582 511329 382281 453567 507934 62703 417791 341778
16317 341778 15277 253092 516989 450208 653963 508988 348938 471200 57905 516431
16307 516431 249299 363098 623671 351581 156379 268227 241867 40574 615801 620394
16297 620394 481280 437949 694532 471409 431021 1015647 729476 432164 183254 393475
16287 393475 536010 221188 141213 403002 211164 670115 314043 284072 639572 381609
16277 381609 536621 154979 331560 252669 22182 258283 359690 594436 317140 218450
16267 218450 525136 361653 331466 8468 48807 392655 289762 337730 273020 252735 379954
16256 379954 246615 341962 409337 228124 235333 467854 415725 215575 241666 157614 276080
16245 276080 90055 374427 298128 -552 192937 637507 253133 582642 379695 110584
16234 265143 -22453 254052 422243 284757 363372 207613 62810 547180 165970 303694
16224 303694 61867 384574 364205 322579 309538 166675 255904 294570 113316 88781 221948
16213 221948 108351 474545 129303 244471 -13548 178705 286006 218586 20974 307719
16203 307719 328314 122594 325913 105612 446149 -106794 18481 16816 -13001 519941
16192 183334 434199 420994 343125 -4658 -107750 52000 81858 -27035 343995 289560 82171
16180 60210 271497 27800 324846 -61486 245425 -39827 163181 161887 73631 -33509 110189
16168 -10117 236069 130896 118885 -10778 139197 -32676 129319 65110 181422 146947 -41111
16156 28130 311373 627926 302429 4873 151623 -51766 62108 163496 162266 -75921 -91849
16145 -91849 124738 100545 -233809 114989 -65317 -10679 -182370 346579 27473 88522 -96841
16133 204403 164263 61038 155178 265888 -102253 307318 150791 -87769 78255 91513 194426
16122 194426 251123 170213 495906 178063 175031 -17004 286916 -382096 -60273 40797 62923
16111 62923 114773 231558 -76096 134377 242670 -336227 -13923 -75980 6628 -183230 23075
16099 35100 174630 279325 151232 93744 -70289 139157 -229108 -288037 204623 -213046
16088 180289 117467 -38844 318902 280035 -88824 -90880 175631 10721 -10126 2675 -11273
16076 264341 -72204 84968 116804 291658 173502 -17954 -53721 48430 161913 59736 137169
16065 137169 364615 -153475 -231520 171285 162942 221958 -73869 194405 -6293 -132482 211134
16053 135370 -50594 180678 126491 226970 442473 -55328 251694 67139 44361 -21831 176355
16041 107721 -212135 13199 -71395 -7689 94870 -29081 -167268 -236481 91672 103364 396064
16030 396064 251030 37761 6476 96983 -18195 385468 -37945 -159768 220243 -216205 -88504
16018 73578 -44529 -84043 -28532 -273746 -232470 93310 -49317 221008 187664 28437 20204
16007 20204 -166301 498745 176533 -261540 -68334 -85275 -110770 -46944 -90024 80558 164731
15996 164731 247132 249652 137047 150966 -18738 341471 56608 -77277 314027 503462 658959
15985 658959 878329 1353097 1000895 1062007 1013037 499661 215104 45053 16196 -121890
15974 272541 254254 -90848 -166238 -240898 48284 254114 -261922 227427 111526 208300 -17033
15962 -78028 -288595 -39752 -41304 336213 298577 -321591 -199372 -206379 -143491 -27388 53215
15950 349023 -364648 151485 -17433 -125030 103681 242144 85021 -236385 -137447 30543
15939 222922 -70667 128270 200859 92344 -6750 -2445 132 243362 -184190 133321 130820 -111721
15926 -151331 15041 -22809 44093 -115796 132745 -172090 36907 8604 75925 -110489 302428
15914 -364352 -112571 -184665 -147764 -154338 212358 -3377 -27018 100022 115519 153445 -168936
15902 -61281 -74596 42117 -58759 -55044 91011 107688 -54607 -156348 322078 276283 123524
15890 -287665 -69705 408333 70324 190906 334394 334319 55691 -149534 8988 -201045 -101563
15879 -101563 -72144 252709 -284303 -375867 191311 3107 320853 260001 -197213 -390024
15869 -390024 39938 106069 -247830 -331619 24958 36812 10623 83796 24466 -237466 -160149
15858 -160149 -267765 -239879 144563 56255 7648 -61887 46786 -14903 125659 368850 -229048
15846 -68752 274828 -90216 -101466 54297 -33433 397649 32288 -52915 -77412 -180189 89419
15834 -141574 81663 -21883 -116628 -13180 -276755 -388958 -122425 -150508 113850 -33076 -113317
15823 -113317 -51686 -191933 58051 131162 -66232 -174602 94978 119507 184854 -70549 30446
15811 -154871 1599 -661814 267581 -32323 66018 -99497 -168359 140981 112048 78918 -138344
15799 -23659 -337812 60698 -167272 -12857 -153769 -72100 118773 -31354 -324325 168839
15788 207672 -203895 11881 25256 15680 -102563 120517 79883 -184992 -302062 -13274 -138274
15777 -138274 142695 -57485 -164729 71179 -159938 -136479 366243 59851 -172032 78479
15766 -186324 139517 131793 95720 -115412 -124487 152361 -56346 262892 -63359 52804 -353683
15754 53954 84677 124129 184215 121681 219857 -73893 -63237 -228218 56933 -18173 92002
15742 7146 203383 317849 143544 55792 174969 80892 -30924 -270280 -36009 75873 -470626
15730 -50094 -255988 15682 137055 -281987 10183 -217038 97906 46346 186330 -182596
15719 245045 -86676 237911 -90427 -288206 -36325 118334 71766 -91488 -209876 -433106
15709 -433106 45518 -254278 -114473 -84589 -104923 224686 -194506 -450974 265057 29005
15698 34979 -179763 85271 62107 93746 -214928 276264 306413 -175 -35229 -202616 181681
15686 47949 -13094 -121024 96108 -27197 -117680 109037 14400 192914 -181972 98956 44905
15674 -102923 77366 -97538 -211669 -27699 270072 326419 -132152 -124558 310023 79962 49027
15663 49027 -179352 142734 -71316 -345635 -215424 248530 -21549 380599 175806 -66815
15652 -121832 -412510 -147622 23053 496686 -17560 83410 -146372 -77255 205724 -41717
15641 -66271 -29840 -110341 29466 -292739 -199771 -209508 -17022 126156 1054 -312776 64974
15629 130131 88082 210027 274658 -235049 -163157 -29521 123309 2209 232735 358542 -126445
15617 21101 22626 -67772 -294295 -207765 -16474 -105757 -33215 59527 238085 -95504 -93242 -220763
15605 -220763 -61799 238365 -181614 164791 -174250 -204464 116596 -246101 198675 236979
15595 236979 -413196 23853 136898 179138 105122 -2675 -64145 198979 194027 -204238 43810
15583 -17245 124650 -6184 50283 -43217 -75124 144434 -68188 -208531 84914 91692 -56507
15571 -250777 155448 -134283 -86806 163294 -113586 41343 -164788 63037 -164460 -145460
15561 -145460 -222614 23237 -370591 257555 -23233 -85032 104090 129930 70247 -300086 214115
15549 149910 -294981 -41887 -158304 -158 61076 104490 -71924 -15938 321885 -21786 -74942
15538 -74942 -45044 152258 23672 -159860 213129 -1146 265834 -6119 -257745 49505 -262264
15526 -51263 52614 -292439 -83221 -335154 350166 103451 228235 245 218854 130217 80765
15515 80765 -181887 329069 67152 423247 220499 -130274 241534 -97194 -29709 362181
15504 286780 303302 169165 120406 130237 119613 217600 440312 127627 206510 325678 16787
15492 207295 -184316 155500 -116548 -137294 31847 3431 131208 161156 -23965 -79646 -81403
15481 -81403 459836 255170 84128 235297 99673 207375 232394 393543 677528 786862
15471 786862 672777 298247 224046 149637 254401 51720 -11934 -246616 -183491 -58876 -73920
15460 -73920 151647 -373074 -213891 97722 116650 79793 -1949 172437 -174878 -197268 -25031
15448 9040 188589 108361 124809 195177 172220 535129 694680 945756 1363810 1296135 672086
15437 672086 528818 496362 181437 315923 143701 95590 -73805 69462 132386 94042 -97198
15425 53480 63048 244634 -97864 63877 240742 121491 44956 75720 -137358 298372 39593
15413 125520 155716 -88730 -29953 379478 -9293 31981 -92788 152297 -229816 -73667 306935
15401 -158098 -223447 -6367 137494 15690 -40234 26603 -129461 -66185 60492 35108 339890
15390 339890 -58761 290765 -37043 386300 -97825 -14409 -3700 -62145 -105765 -68181 -277519
15379 -277519 -46679 142909 175919 242801 293363 339261 98118 746035 -15517 -57225 335002
15367 -35244 48802 15551 236017 -119145 -32209 478184 316925 31692 105681 131118 154023
15356 154023 307729 84166 250115 74805 202742 276241 161326 334713 27117 146143
15346 146143 207555 499469 -57588 302569 325931 201650 284429 345808 33474 -279476 229224
15334 50171 63345 -119650 -18128 76149 43830 45618 -99940 -171215 -329313 -81650 9050 189790
15322 189790 122642 197450 233461 -82925 312943 315991 371410 228909 208361 49469 315855
15311 315855 70572 81762 73888 84191 136123 193250 -63520 205989 -175864 -31368 86282
15299 -42246 337537 141795 399046 134566 245057 25723 388736 -215764 -3294 223436
15288 71957 233636 89287 355744 283945 35944 -15923 -182877 -399669 -160660 137017
15277 103955 -23024 448494 55618 -71036 -72772 -122994 -228387 -173629 372109 120893 50099
15265 -6255 -100873 85050 -99730 -27900 69360 -14047 168095 12124 -202468 176509 -46569
15253 93184 146812 86314 74169 249260 -11674 386137 82226 118585 -99273 -107433 272277
15241 809850 1255371 1536909 1595296 2038300 917648 329096 411010 227538 -273137 301336
15230 134438 230679 316048 19731 -178575 -92820 -39754 49945 -77754 91696 111617 177673
15219 177673 -223264 239945 -16805 121330 361665 124138 191311 -42885 -290700 -25232
15208 295177 246549 50033 -172399 338711 63241 43582 -336498 -84303 110619 214946
15198 214946 613848 227755 83837 39842 111434 -46653 16092 -195281 209764 101078
15187 359706 -169247 176937 -32010 249136 -58762 -30650 303945 -264704 -170822 41028
15176 181586 114064 -148214 -134401 311228 63114 235357 -144167 497470 85033 32461
15165 183604 93165 21294 28316 -149225 269975 209571 3642 202156 56547 58340 -38897
15153 209999 230599 101413 312466 205282 255099 -50888 114428 158537 -58145 33580 -41732
15141 145578 324901 95920 -113011 216309 87556 -236151 -119276 -238843 55223 188045
15131 188045 76571 211641 34288 151488 333477 194196 1447 -127034 290345 274366
15121 274366 8877 457776 571866 426806 643052 10222 -115978 143589 153946 -119931
15110 -75957 21086 372676 384601 -177638 194970 180817 43110 166216 -35980 -336575 -149965
15098 154557 183676 -184747 264559 285753 -222303 151966 290743 -60386 126012 133181
15088 133181 235371 140285 212329 47299 4294 285151 -90909 306849 442308 336386 104552
15076 202883 321210 100839 -33332 29228 -207617 217089 65526 415391 -44730 77613
15065 294276 105981 290492 -179720 65490 128360 154271 420888 396649 364676 201332
15055 201332 268333 531814 427870 591139 4586 340779 342230 453158 283931 74892 137929
15044 137929 461442 155183 465385 360051 602866 572923 377023 94493 312754 629169
15034 629169 493622 414418 437917 291073 804614 527804 861600 829101 293206 462850
15024 462850 148140 357162 414681 884940 350072 549406 426149 310750 626784 270296
15013 369328 238363 476084 457264 251188 382863 520209 336242 213902 448278 357665
15003 357665 422550 606208 416147 481282 455301 569050 129151 234689 631218 257279
14992 486394 393169 431276 625734 384186 392098 264655 489637 703837 522609 640561
14982 640561 737146 583002 893162 592606 775750 740659 235889 430049 307718 796480
14972 796480 718792 570424 942113 603025 465860 298923 903150 236604 464097 222828
14961 187260 491199 429781 430734 244301 182134 265201 666442 146794 229009 514119 358209
14950 358209 734469 385671 335134 362410 539042 511176 649014 544436 889137 434573
14939 815480 668016 336145 843818 275522 201947 574794 432903 895562 933377 1290268
14929 1290268 1090713 1521569 1076846 1583094 1655498 1843208 1783945 1548674 1654546 1476055
14919 1476055 1660590 1866863 2551012 2482673 2262117 2294673 1353869 1091287 1043065 994557
14909 994557 769699 827751 521502 512110 434463 353447 450925 273067 627981 432745 577376
14898 577376 274888 -147488 509578 475661 716274 272639 297294 310753 528400 146650
14887 639456 647236 392881 1018009 822001 845241 1162158 1141682 1063929 908482 778505
14877 778505 873187 641485 98348 496787 443605 493104 463421 257819 -134213 365081
14866 618787 768510 763120 616809 795115 749988 639586 511978 516773 386000 499920
14856 499920 470752 297269 151698 452456 553989 307390 551093 143920 411714 335256
14846 335256 804785 782281 723064 1159047 861027 1314520 1030917 795257 628995 777003
14836 777003 995458 416233 689001 636425 664458 490239 586952 280631 328724 484563
14826 484563 498098 1101923 690765 699879 471359 460921 732708 729352 881388 646333 640430
14815 640430 992578 907467 197220 776107 874442 591382 919382 952106 616462 620099
14805 620099 1401601 1116115 984876 795444 534706 492031 553996 255494 480553 340262
14795 340262 350681 238954 273931 816640 474479 665158 424521 638534 561149 741300
14785 741300 786931 515715 651735 641516 612022 571676 695503 813925 1150992 818620
14775 818620 947016 624019 680518 795410 1037106 801790 700723 1031021 729438 795705
14765 795705 739526 528097 730964 291089 700410 549151 591136 675966 444075 542877
14755 542877 60548 442427 852890 445846 767125 440780 662821 536059 606174 778586
14745 778586 761219 737333 680319 639190 1049001 789659 1032939 532432 641006 1060960
14735 1060960 842627 742139 710647 1131591 1231902 1740672 1561805 2092220 1793277 1694508
14725 1694508 1431979 1516387 1212987 1363548 1091999 1019463 964740 900141 1112103 621313
14715 621313 533826 818475 846864 514956 925513 915993 1024848 703235 604848 1168911
14705 1168911 1479789 1036310 1535236 1742990 2259573 1897428 1388738 1496464 1508056 532603
14694 1112004 841209 857670 847383 790942 575450 815662 1031275 709901 925269 705371
14684 705371 932205 1006088 950394 870633 833234 865597 907558 890599 1111218 756218 584413
14673 584413 774455 782919 1143855 929438 1122394 924999 936448 1064015 793693 1116712
14663 1116712 1170354 910261 905948 787286 1140255 918621 871320 961046 1214035 1194783
14653 1194783 1177410 1224109 1348507 932679 1077930 1155582 1074422 1285461 1405572 1196968
14643 1196968 1174194 1287375 928826 1088988 718882 998396 1117402 1196142 1072596 1171166
14633 1171166 1458277 1200111 1279593 1624304 1155539 1237151 1252330 1184498 974841 1298326
14623 1298326 1139436 1288565 1389316 1173658 1151720 1227816 721180 1727797 1471178 1331497
14613 1331497 1369618 1014650 1050309 1262875 1244434 1498779 1404710 1429655 1324668 1215412
14603 1215412 1384280 1264328 1482888 1506330 1498936 1691962 1694837 1339994 1537742 1678050
14593 1678050 1626184 1496048 1422654 1239447 1637712 1647242 1654502 1819075 1728872 2009185 1641545
14582 1641545 1679865 1722125 1735081 2008536 1670053 2194743 2089377 1801222 1694483 2041201
14572 2041201 2174672 1646021 2204493 1961242 1953069 2026417 2193033 2096229 2221138 2231567
14562 2231567 2297292 2502187 2488384 2691801 2971517 2770706 2667308 3387612 3075396 3347291
14552 3347291 3783768 3885426 5068924 5991807 9474587 18294049 34561788 44931563
14544 44931563 22508491 10866181 5043109 2951784 2175939 2154854 2393140 3299953
14536 3299953 5143539 3815094 2922106 2401071 2075871 2101111 2147178 1909957 1742388
14527 1742388 2022419 2232668 2256984 2301326 2044025 2116181 2649442 2075027 2589189 2520648
14517 2520648 2198781 2441287 2284465 2351443 2477397 2331257 2285323 2664277 2397452 2659786
14507 2659786 2591828 2623184 2875340 2799809 3009653 2881864 2707061 2754359 3221225 3078212
14497 3078212 3009628 3027961 3042528 2949094 3157952 3203126 3256052 3242748 3382491 3212931 3309329
14486 3309329 3544102 3264336 3524928 3293122 3360520 3740998 3726461 3634432 3583596 3673849
14476 3673849 4050705 3716068 4068426 4097176 4028519 4039638 4131911 3993950 3904198 4028614
14466 4028614 4067106 4398005 4284248 4402686 4250794 4542485 4537463 4508494 4450919 4634968
14456 4634968 4606861 4699308 5021220 4777489 4585480 4899898 5318661 5162141 5183611 5391324
14446 5391324 5140418 5360849 5438005 5480243 5396524 5444827 5678377 5864479 5812670 5973866
14436 5973866 5990638 6038748 6177413 6114245 6545042 6596741 6417289 6744599 6566014 6957168
14426 6957168 7038647 7049247 6995975 7260950 7544909 8011199 7986871 7977873 8097810 7846294
14416 7846294 8074242 8152392 7948447 8556515 8296496 8318020 8552072 8831078 8863574 9116540
14406 9116540 9551480 9861156 10101904 9849112 9924562 9694628 10141659 10184493 9971228 10478965
14396 10478965 10382670 11106056 10862724 11167198 11284292 12058712 11611984 12015663 12325195
14387 12325195 12622342 12652516 13010237 12911405 13686675 13952862 14113531 14401819 14401559 14790656
14377 14790656 14675671 14894319 15350396 15459597 16111412 16385911 16798257 16871900 17539386
14368 17539386 18020468 18495675 18835562 18769533 19793967 19522616 20265034 20243127 20826036
14359 20826036 21340760 21774958 21956821 22528251 23355270 23712095 24259826 24752546 25473935
14350 25473935 26171694 26962066 27663841 28178939 29104827 29726007 30515132 31065430 32392064
14341 32392064 33104758 33736557 34573047 35750585 36838021 37666599 38578614 39670393 41100261
14332 41100261 42197257 43345685 44991986 46471372 47923961 49255069 50997592 52724404
14324 52724404 54617363 56562053 58548627 60487082 62533894 65068457 67182766 69809436
14316 69809436 72413051 75084796 77485775 80874911 83821058 87513705 91005599 94827890
14308 94827890 99175436 103121533 107710831 112481893 117365756 122787876 128330797 134035035
14300 134035035 140301731 147137440 154207504 161621211 169946506 178276235 186892736 196431266
14292 196431266 206247762 216643830 227814334 239534496 251652356 263959448 276910341
14285 276910341 290551196 304489968 318823244 333581957 348100969 362658541 377188269
14278 377188269 391259812 404946702 417560131 428818382 438872864 446723824 451272608
14271 451272608 450547421 447715370 447308016 443563118 441503209 439285334 432567056 423176826
14263 423176826 411267404 398062287 383723679 368460469 352960746 337317676 321853190
14256 321853190 306649846 291856290 277413396 263596323 250402438 237817126 225855989
14249 225855989 214162948 203090393 193710268 185091022 176030933 167738993 159680333 151984850
14241 151984850 144626193 138220992 131761559 125992769 120721309 115123693 109665211 105170157
14233 105170157 100806085 96710816 93351349 89329143 85662102 82271539 79108959 76206055
14225 76206055 73343308 70446418 68228705 65626810 63016501 61121426 59386010 57044854
14217 57044854 55144211 53291317 51690907 50443320 49052204 47029585 45652896 44296309
14209 44296309 42730106 41791395 41078909 40088398 38764379 37674935 36411767 35294651
14201 35294651 34561538 33902357 32869119 31654176 31024043 30129748 29568495 28952627 28619667
14192 28619667 27474044 26638192 26134798 25488720 24963422 24237735 23505508 23169467 22729431
14183 22729431 22059900 21774210 20919035 20612663 20130303 19804267 19244422 19076124 18837985
14174 18837985 18724889 18010579 17842537 17509249 16504285 16553329 16384669 15979946 15393235
14165 15393235 15122383 15129891 15067327 14780897 14388251 14132532 13804345 13406086 13032581 13147537
14155 13147537 12684105 12509443 12844578 12390882 12200729 11973969 12071772 11403415 11476576 11078901
14145 11078901 10918870 10887211 10770922 10191579 10257866 9865636 9696340 9738245 9634462 9651993
14135 9651993 9885760 9105873 9183596 8749328 9234551 8739460 9136174 8649220 8588752 8407027
14125 8407027 7969941 8128785 7987442 7422631 7585164 7581635 7699588 7158456 7460147 7271835
14115 7271835 7404965 7183825 7033532 6785088 7064573 6840207 6665437 6482612 6510604 6434778
14105 6434778 6623401 6119357 6155765 6223309 5923543 5981375 5982006 5713777 5720311 5787828 5655350
14094 5655350 5622430 5421287 5516861 5507723 5043431 5118088 5331500 5127166 5324586 4886910
14084 4886910 4822681 5195634 5137289 5007361 4771776 4697967 4748436 4615163 4794395 4414206
14074 4414206 4398967 4458220 4317892 4374032 4253107 4221144 4133467 4161459 4172553 4205086 4073744
14063 4073744 4110783 3809417 4469097 4184898 4146218 4321262 3940673 3507970 3927693 3918175
14053 3918175 4067475 3705951 3672104 3476705 3684306 3782452 3469301 3500728 3342718 3347560
14043 3347560 3126656 3337515 3450518 3283665 3312663 3183993 3460077 3011257 3130850 2788607
14033 2788607 3007310 3298203 2961808 3232795 3214120 2929665 2707994 2845102 2788723 2991158
14023 2991158 2818615 2826652 2622526 2800630 2674587 2375399 2445136 2301052 2864634 2080744
14013 2080744 2485086 2347979 2429212 2549829 2535359 2405859 2436905 2432143 2682327 2321498
14003 2321498 2256519 2022726 2022170 2229847 2096319 2274794 2003120 2133460 2060335 2083756
13993 2083756 2549376 2202708 1699239 2615041 2869430 4697325 11313431 26722523 45952662
13984 45952662 29374435 16795656 9697530 6638502 4823109 4127738 3632066 3168771
13976 3168771 3129037 3173395 3077512 2508450 2688355 2587268 2421158 2110837 2430599 2257034
13966 2257034 2037086 2306056 2012193 2211156 2026318 2448461 1860767 2241540 2139786
13957 2139786 2050461 2121151 2019655 2013796 1661591 1864529 2166439 2353140 1801948 1949620
13947 1949620 2200255 1924764 1706302 1611642 1785915 1922850 1864937 1682906 1936055 1761621
13937 1761621 1747454 1636920 1622429 1715755 1431438 1655289 1685291 1349509 1474084 1627690
13927 1627690 1954686 1278843 1778595 1581629 1840202 1539762 1858393 1597644 1569378 1407341
13917 1407341 1575032 1303067 1077962 1285257 1602533 1283468 1541747 1556869 1134194 1370361
13907 1370361 1491459 1197037 1740027 1285878 1320407 1503175 1376155 1183548 1630118 1312555
13897 1312555 1126171 1241555 1135996 1592184 1448444 1297883 1543219 1270354 1403290
13888 1403290 1008132 1023332 990542 1304303 1116945 1134485 1172473 1046060 1193591 1100115
13878 1100115 1105167 1242796 1318125 1299931 1086291 968350 1148036 1196630 980630 927326
13868 927326 1190758 1377475 1257857 1003121 903630 1295273 862236 1235814 1252989 1172484
13858 1172484 995987 897324 1076251 980661 1200233 1035284 1002162 816675 1108104 1389779
13848 1389779 1037730 867795 516234 1130849 1231611 660475 1136349 963950 928102 1004719
13838 1004719 1184185 573814 1200052 904568 687642 799453 689187 1061908 905643
13829 905643 831059 1197859 642862 961881 1057231 928073 799826 793009 1117958 999609
13819 999609 1087372 951719 842124 715291 915368 1118105 673611 492212 906634 718555
13809 718555 851853 1068112 734012 1049959 617246 284799 716833 689019 812760 1053371
13799 1053371 777324 790911 539404 997898 913535 705011 877682 558652 892138 762413
13789 762413 1073687 976747 852149 698333 752139 987382 895656 942224 818541 626078
13779 626078 611352 849416 695945 867766 1057154 901676 442836 602884 718815 625832
13769 625832 567305 612263 670037 621045 472019 836354 786359 624638 931530 927474 662895
13758 662895 525340 635561 369027 477648 569689 251569 599410 474110 841391 868195
13748 868195 302226 629292 610954 881825 303428 848098 594791 485909 501245 583851
13738 583851 504878 597576 486484 705050 682327 846440 634412 459270 618424 535253
13728 535253 358421 618643 332857 828358 623338 630467 412659 598298 186302 557291
13718 557291 215498 659338 569633 280303 670497 556310 367008 273679 550025 659887
13708 659887 700616 778969 614755 567668 363629 440768 401602 163769 743594 497356
13698 497356 328762 382388 638784 302439 384191 399575 471437 307923 96013 660681
13688 660681 542901 460584 465037 255017 519520 516738 511569 579607 459187 314887 567113
13677 567113 588785 493282 443100 499145 375387 417844 244967 266563 401486 554989 435561
13666 435561 542845 409099 604890 254131 385734 523777 270708 652463 227367 510694
13656 510694 482307 753997 656016 814499 377726 417329 701669 324901 286209 506992
13646 506992 4956 411831 733667 244324 387544 528426 437140 368716 544408 333784
13636 333784 466580 208227 609891 602123 -106205 481465 451374 405301 201364 312379
13626 312379 373777 252832 526393 638247 432006 38820 338667 121315 450546 61211
13615 736797 158398 93154 393364 342406 477485 417534 37809 307330 726766 427007
13605 427007 537911 257399 278310 397678 643776 155041 643651 303557 410813 226910
13595 226910 450304 312211 247909 68916 408676 503897 485449 427217 439379 269139 548147
13584 548147 298654 335321 302953 427486 371886 299499 224322 753011 349081 506374
13574 506374 -45223 529819 335256 364374 256724 226851 310024 250533 319292 161594 374243
13563 374243 342177 405483 208187 -139734 394605 236190 209901 114735 90559 469488
13553 469488 286299 230966 496690 269218 364605 480928 144009 211716 391685 520521
13543 520521 269059 278765 432199 240737 349215 202222 257361 288424 398196 121470
13532 380356 374169 338261 142932 254805 442539 386959 329417 479320 143198 357891
13522 357891 464550 70538 19328 44576 435356 417129 747322 273024 350115 275546 311451
13511 311451 140119 324837 380885 302467 406304 -13396 209431 132085 253055 -5983 235033
13499 597489 233575 59171 166882 253522 273584 423343 230756 247702 529880 189499
13488 165796 306458 98136 274109 337911 308735 181514 382977 283528 240047 66366 330407
13477 330407 229417 161398 339837 426086 170532 468120 -30646 303574 -42595 494391
13466 83815 214671 132844 302888 370980 208208 487169 9736 295068 -56608 131845 258903
13455 258903 246353 371378 360275 112357 136689 329865 124508 110416 199873 499893
13445 499893 370485 338936 86906 526993 77802 444847 27208 500033 59322 363665
13435 363665 262766 125492 -31618 -128940 169122 477696 221825 35477 366917 29878
13424 3552 -83047 309446 -125304 95459 282370 71584 187403 445078 223206 153774 120659
13413 120659 359800 60264 64871 372103 495055 99842 156480 306049 167325 179409 109373
13402 109373 311747 -117706 305156 215856 28895 292644 70566 -93451 -34569 110167
13391 195391 129466 127244 103241 359342 282668 157470 197100 32911 234565 145441 -100149
13379 87696 172953 110925 17347 368372 637089 -1393 426840 201566 -136265 461538 193994
13367 57678 -231148 497589 99433 289183 288533 -33982 103223 116256 309030 164173 66147
13355 32508 79461 180143 1252 -12987 178992 183473 245245 283566 307427 181941 17898
13343 236361 447101 324189 49977 675166 180509 567355 241329 524946 240699 52039
13332 320222 201263 146333 372166 185856 -36116 -2375 63413 -84138 250457 241596 157445
13321 157445 265795 92090 228640 52473 433425 227458 106477 64624 667930 93520
13310 226632 284903 591634 192793 79763 -43375 -175858 102793 12953 175188 146171
13300 146171 346308 1292 266756 170610 259082 -124170 184858 309373 170086 146946
13290 146946 21778 383095 61983 285843 268823 70856 -66076 209818 62141 322750 57653
13278 231823 177713 147929 135933 144821 -67373 45363 -46059 264134 129918 741711 258300
13266 171471 168472 139907 323944 9506 176321 17299 63808 127263 -140552 190052 158109
13255 158109 268710 246323 -49162 283912 347267 213264 274460 121043 469343 93046
13244 -137196 121574 342432 259427 137423 109536 -15036 -246859 -84953 262246 83756
13233 199458 101980 7143 244870 637431 194717 -170241 146297 -36681 328702 -28691
13222 72062 107355 -67903 30010 105149 17107 -252066 97818 -72203 306296 -103083 -14847
13210 150887 -131234 -21657 386201 267338 -117138 131448 130336 6656 410260 192054
13199 133222 19548 133503 -101309 -22407 -295226 -70274 110403 62357 330551 44852
13188 374704 100833 165280 144531 -114154 -83498 126222 130178 -98133 170846 369077 70531
13176 -25405 133702 193276 -174107 -21686 204280 43647 150939 152491 184528 59921 -34610
13164 105635 399537 140116 -82918 137553 18466 -147191 407386 40622 -115503 144480
13153 -13469 30004 176284 224776 7171 227834 26473 39524 239619 -303824 227508 -87168
13141 474869 70248 269021 -108021 -288877 -32192 148512 251837 73881 13030 233310
13131 233310 437 447698 497230 -438301 121431 369416 46122 150281 -54577 426916 187380
13119 -121747 60085 352323 -113988 211805 -72225 9390 163479 6182 -48564 15282 187814
13108 187814 224112 -73462 36241 225665 59452 55141 -52416 37235 -60717 51445 66786
13097 66786 -77939 -93048 116471 364091 43657 -31284 65039 -88288 39535 96719 77894
13086 77894 159677 67067 168589 -82965 65989 209756 20200 -188287 -210902 199089 349723
13075 349723 287127 -67028 102254 121211 -57567 187580 83958 -24701 -27801 199996 324751
13064 324751 -143447 183771 143587 250460 152880 469525 34894 197700 292102 -67042
13053 284183 -11995 227219 201857 77216 117252 88375 -40763 171304 180616 -110980 178422
13041 139715 18306 221523 74422 -56028 -93016 43498 134588 49289 146340 -229624 207843
13029 24857 -272082 122705 -42653 35963 170429 61377 76730 52641 -46398 233441 39927
13017 35901 -18184 8631 437764 -144377 97916 30281 199346 306941 -118812 29061 264447
13006 264447 28605 178458 28634 94653 249486 214042 163230 271061 96166 -37872 86980
12994 -189560 275913 -112969 -189002 5581 -113057 356507 -326117 -100604 174958 271031
12984 271031 40569 289618 -375046 5835 109782 -195606 246447 43169 25954 466066
12974 466066 17781 50823 -141928 -203776 117124 89887 324119 -3405 78532 -63149 -129613
12963 -129613 323693 13259 241370 32953 -96263 -139839 -258136 96364 -161159 7139 -127503
12951 149135 -5836 -40023 91104 -72450 224505 -24360 116059 -121257 -217057 -220347 97298
12939 39707 -207990 -15760 95774 -143280 51683 173834 14356 83159 45983 -225032 -470
12927 19432 51134 11447 -49187 345123 309975 -43289 159862 -163011 196164 65795 -350175
12915 -49535 12008 -160809 1607 -156162 108640 -148529 -293490 84348 -140125 59006 271655
12904 271655 27256 265796 -107511 -64338 -3229 144410 120689 53791 121189 -20799 27334
12892 -112980 59116 192943 281913 -448658 51558 -71851 -145465 -278823 274082 -51943 -119435
12881 -119435 304860 233795 -4063 61258 -212677 177096 85253 -89916 114574 119077 72811
12870 72811 361843 -50839 -397193 41407 -325516 -119102 -140901 -45469 98830 6757 -99833
12858 267129 -73473 66360 67636 39264 131316 -175544 -27931 155759 87344 -28744 61258
12846 67465 -28591 -197132 -36464 -11908 -436157 29985 46351 32957 -223616 146292 33760
12834 84145 270749 23166 -5144 5728 -52147 184513 -136199 79752 276852 54137 -314725
12822 -77937 -113742 2576 -12272 -167004 146693 152326 187033 2477 170718 -12079 41623 216236
12810 216236 -210232 87871 62403 265714 -280549 -45963 130862 15316 138165 156110
12800 156110 46791 143189 175601 -32277 231310 -333815 -2844 214851 -15401 -241860 146477
12788 -74805 -196124 -148021 229725 -51777 4599 -45589 -22862 107632 149243 10219 62511
12777 62511 -67962 -45550 274877 142907 -105452 -156390 88536 -237646 -1765 268679 59248
12765 -149716 -15327 -54811 50048 185880 89586 269732 -34468 40687 -75004 -10982 -169166
12754 -169166 62781 -67346 120899 21906 -103273 250687 223153 314869 443295 279120
12744 279120 -123661 -36670 -459149 -261759 133176 -85811 87382 15405 233767 -98066
12733 -204790 -129747 118134 163414 34415 87021 -76560 117060 -48599 -414338 281151 -37364
12721 264248 -356508 -200575 -408615 -194065 9324 -34998 -109363 5698 38668 131085 79737
12710 79737 177516 -163337 47462 457412 10509 13392 -37041 191741 85679 93997 98070 -81682
12697 -98644 -247886 -224629 -44760 -189925 20364 90245 88657 207121 -8362 -264585 -186411
12686 -186411 119757 -76417 323859 -252245 91456 -80186 90954 290007 300483 79424 45916
12675 45916 150607 132499 283345 50922 162696 172629 168039 26162 203349 -103747 255693
12663 -97057 -153232 136482 213710 -319357 163316 183881 -22845 259449 -80625 488540 45582
12651 165390 110063 87429 123885 208644 12060 -71294 -55456 251552 -60909 395966 -208291
12639 112040 -17413 59362 122887 -31369 50149 234112 -173902 8974 6392 134405 225021
12628 225021 350216 181530 123156 161286 -244102 419475 -301462 88814 164067 180386
12618 180386 252086 102332 15924 -46162 75402 -60603 -63981 142851 120631 -113738 102841
12606 -246040 -253031 36595 -214697 -69623 -75181 1574 -48284 -162553 215681 210066 5190 -219988
12593 106430 19172 33728 -7877 -15068 104945 229921 -70001 279134 -126695 -101355 204200
12581 131279 80853 -118824 -184434 -142068 -192223 34861 -19659 18241 154354 246061 -72367
12569 143675 -189430 128208 101030 100815 -208272 -163055 -216884 -134990 38970 127991 237209
12558 237209 203004 -141127 -228660 -57024 145943 191318 372247 -285384 -35495 54001 320594
12547 320594 -113340 -142536 -164465 -6476 -6998 -69234 -88323 342586 9670 340983 -158117
12535 -111449 -298898 127490 225426 -109835 214314 143426 53135 -132101 86327 -161960
12524 -4023 -76086 -262229 -80011 -148099 -60929 -55803 -249517 -137515 32933 246852 60155
12512 -119093 131460 8056 42803 -254691 24469 -6931 -174366 -31231 -77854 -234328 -102713
12500 -177741 -47659 61674 151099 73452 -165765 15978 -272159 107627 184183 -101712 -30584
12488 -78419 188857 167324 45435 9069 334883 82380 -76649 -169139 -93477 62830 51506
12477 51506 -150282 55149 -421763 -214013 240624 22072 169115 -195261 -38997 13220
12466 161938 -129909 174543 -44387 -185604 -211238 96273 158745 -20560 165231 83795 -219543
12454 51399 127375 46229 231019 -67640 87128 -115342 -229508 -49964 40084 227749 -338597
12442 7255 -249569 148080 42512 122004 -213557 -83385 -130500 87174 -190895 252576 93618
12430 -208873 -13984 351905 119819 -123971 92492 74552 -85775 -198450 85323 86002 31590
12418 117104 -45385 107384 174212 -258881 -146372 -52274 -92765 259035 -15352 77146 42036
12407 42036 272728 114115 -118883 7429 -21849 94418 -122315 -223426 166253 54597 211091
12396 211091 230407 -103051 123248 -24245 379027 -9812 111057 -115889 105649 -21306
12385 87435 -149896 159234 116796 -274369 26500 -97786 94069 71041 17082 34425 -146968
12373 -206087 -50731 -93756 43530 246326 -234902 184102 -9862 -240429 89014 56407 65779
12362 65779 -3928 124759 -103315 57777 293897 -476751 -187240 -235420 -62270 -176608 389078
12350 -157504 -296603 89377 -253611 95547 180389 -45529 225653 -131435 111649 89841
12340 89841 208573 48170 -123369 -101644 146011 -70620 70618 208415 244215 227462 79846
12328 240576 55009 -82941 382769 -43451 310062 191236 -8754 20455 406995 127791 175532
12317 175532 153476 575805 160806 22617 -102070 -68627 259244 76836 -191664 -43513
12306 179617 -264416 119938 -73730 42968 -112560 -130360 282132 -242355 -76873 183949
12295 96874 49448 -129613 -404956 180379 370420 162116 27524 137564 28744 112901
12285 112901 233278 -122572 -157336 9447 252141 308535 -141901 376732 300253 132145
12274 197179 89418 263066 234691 -11659 301671 316092 259092 691873 219420 211720 13195
12262 -126506 209230 354244 410899 124100 216942 -21089 112680 233146 231782 -123657
12251 537289 22799 -176447 48749 83843 445071 357120 67292 59699 37783 -97957 -57396
12240 -57396 231025 340729 -46893 -97848 94092 223350 106446 152267 219726 -49138 141576
12228 -186353 306088 84440 -70267 162035 -4515 145984 330562 108135 205644 286186 203681
12217 203681 -153260 180351 282548 311102 309705 56492 34262 26965 19618 142439 145886
12206 145886 -29678 432690 89317 99548 219190 63110 124344 -108944 367615 193528
12196 193528 463305 95910 372832 161589 -22012 307765 340776 130974 125992 -46448 129200
12184 44361 168826 287514 397841 116634 206705 89025 246800 94955 -144829 145383
12173 150217 293192 524584 -51875 112210 290367 -37553 230444 343290 30620 -128718
12162 -32512 110242 327241 457907 -39172 201047 249943 162571 470641 311227 179424
12152 179424 721 275586 -41098 390004 -57664 -18676 190280 193340 182558 92646 91586 -17308
12139 64888 368931 -126148 76882 122591 19311 -286072 196670 -69814 220733 248570 157624
12128 157624 -49420 195036 480801 453882 86662 321217 111716 266419 204179 182999
12118 182999 251982 168175 222312 -155447 214209 14935 212677 287318 -86932 315778 189698
12107 189698 122531 -49108 -15835 -150136 26409 21113 -75760 -98614 233471 -149634 107922
12095 213076 -105824 203053 320661 -100552 82536 -4536 40629 100497 268847 329884 -157457
12083 364578 170460 310944 -15717 98536 79201 -250376 -394526 -226638 156598 -105161
12072 435784 18676 100683 177718 106449 157526 -120418 159313 87287 -81747 395467 119102
12060 21919 7209 -11265 148067 14163 277041 259928 -27322 77949 -166844 179731 157859
12049 157859 -383120 -379736 52038 395422 45108 -51559 188726 139522 -358867 9545 -343831
12037 260174 215809 76324 109134 -101131 -194249 184775 -239193 -172530 285226 -64506 -314084
12026 -314084 -125835 76099 61074 219651 -35474 360407 50993 323291 -132793 249439
12015 19631 -131587 -184795 -189056 353568 -75401 306204 209695 204795 128400 126271 39132 115528
12003 115528 358138 -31895 153575 -183035 -167278 -37671 22488 17480 66694 123790 447976
11992 447976 -65983 111780 169741 -122780 85167 147453 -127210 125118 -232605 29604
11981 -122905 -67418 -241532 34335 233656 -247528 -148602 -35891 61126 -109586 -403274
11971 -403274 -71472 -217401 -49660 -29964 -328277 -84593 306889 240269 -39360 39890 79600
11960 79600 -5642 23212 -49930 305453 -51750 62299 -142178 141461 373403 -135395 -18191
11948 -264522 -21769 -120837 84028 207218 244131 -258990 82520 -127172 100854 -141620
11937 73110 10542 33868 -74097 67594 145396 77435 91580 -39676 -50535 -35020 -60843 238299
11924 -19679 32623 173102 -217105 191816 18389 116544 -156982 121644 247244 165022
11914 165022 -39853 50437 53483 60066 -94334 -120610 -162719 -197495 133761 -209015 162922
11902 320418 -37559 -164568 154889 -289900 403167 18283 -18262 -260299 -30587 176619
11891 -347652 -295726 -247328 51362 310588 -37836 -66001 -170291 -155670 43632 -253648 -285616
11880 -285616 -125534 67237 -30813 489125 -78749 -59196 -79999 -103051 -86402 206292 -283377
11868 71910 71594 122785 119606 -14184 -11393 164938 12093 -180008 294763 148206 -72321 62559
11855 -296868 -187152 -367152 -213154 45894 -13246 99927 -258023 357644 -198996 -9932
11844 -84339 -46935 -131408 -294770 -48711 341519 -138725 119892 -88221 -167271 -238399 -181456
11833 -181456 -331467 158230 -535115 -97391 -298157 -3274 -100689 -50137 -273302 205914
11822 60182 -175965 -83227 30606 -103906 -50252 35617 53911 -145050 130785 82627 -222265
11810 -146067 100946 -168800 -207107 -124959 157185 6229 -59219 -28225 -160445 79998 -127218
11798 255601 -354207 -31186 -183541 84730 25949 -233036 -98290 423482 112382 19694
11787 94018 107895 -401664 -10653 264678 150095 -425464 -47657 79565 286332 -51701 -93165
11776 -93165 -100403 -241960 -208799 80400 -92664 3956 -157073 54506 -40890 -108574 -7238 273152
11763 -209267 -45219 -302152 -282986 -127796 -218363 -20098 -187634 -276691 26022 36347 13864
11751 143699 -149895 77984 43897 67742 -252774 -20957 291206 -345511 3609 46075 81445
11740 81445 13545 -356409 246350 -162695 -115081 -108577 383299 -299571 60904 -115108 -77267
11729 -77267 -168694 -4621 125896 -343489 54854 -249496 70122 -1080 -114912 -188263 -218078
11718 -218078 259613 113075 173382 272302 -192654 27330 74768 -39420 43738 -250101 -310860
11707 -310860 53843 34127 -142180 -67319 297391 376164 41449 21711 1040 66070 243642
11696 243642 -47180 -227691 69112 209105 -67723 -156915 228450 62087 -15929 290607 17626
11684 -130716 -65927 -108744 -24068 -88490 -172387 91013 104102 -200644 -133658 -7602 134116
11672 -153146 94210 -179702 233622 178488 61301 147310 339164 -89659 282652 231777 -60861
11660 -29322 -60781 -86646 96347 -72960 5245 40833 -250803 216453 -58354 -84373 -118463
11649 -118463 46712 119684 -224875 28805 -40405 63429 323073 -7300 -20114 35524 -128760
11637 -131055 207536 -20539 -290424 40451 206732 34265 -38091 20539 -4838 -116829 -5026
11625 246079 -296267 227094 -98151 15283 51474 -197054 140025 96154 -200187 -276030
11615 -276030 -36442 -337918 -34964 -118905 186256 449 -117931 91307 -93579 -104151 160305
11603 53139 -19976 -365015 207811 -128829 -146180 -184919 -140479 116735 125807 -188882 51583
11591 -65044 43172 -120028 32228 330793 52117 -69904 124381 375947 -158863 -47170 57252
11579 -22697 334205 -7672 13075 -298471 376220 160958 514763 -30032 109866 471626
11569 471626 397350 62656 26801 -119249 -33647 204920 86946 384232 -182533 52329 -119068
11557 143550 -55316 161422 27258 202915 147295 15290 122977 98031 -93019 22594 134401
11546 134401 -97520 -103180 251970 79220 -56358 -165139 201422 279389 -108363 355703 170386
11534 -47277 -154167 167420 71884 249347 301424 84399 -111421 91620 -173759 -71051 4247
11522 -81591 -224197 -107639 -186181 -249742 -219088 162728 139927 -212615 128384 169051 188767
11511 188767 75836 -27611 169500 24172 -192197 79927 9911 348556 -21695 -20573 233491
11499 -187696 -88604 145867 41702 503889 241604 105525 88144 143811 305889 47967
11488 -15082 36468 244540 -333576 181176 141992 163958 157772 216691 237785 95380 88316
11477 88316 438293 96398 244456 219941 346018 -1306 29475 84830 46789 469920 72359
11465 -268490 261933 80442 81849 78948 211824 143003 -310389 306567 138119 368195 12491
11453 152688 362864 -22996 97705 12681 48565 -73764 -41057 45831 331749 104551 246049
11442 246049 -49102 114777 -371461 -11731 -209949 51817 -17976 -131306 65125 -173266
11431 432705 261024 47360 45145 -179580 -213768 50937 64942 -129479 235891 -310933 -21829
11419 -45548 93287 160305 -197300 -50058 -138468 -53740 40808 90789 -48646 -320148 125056
11407 191735 134222 -79981 -7195 60408 -210127 -146437 140485 15210 144566 185787 -95112
11395 168288 -331994 5513 173037 118128 -118959 -92202 557634 -366498 -115818 -5329 -107435
11384 -107435 -107786 575123 232649 -39399 -347995 -49233 -38058 -149160 -207086 -83360 171762
11372 254943 -189073 151770 -19180 -11033 -124822 -180862 137051 49488 129628 -18048 -65354
11361 -65354 221573 -246149 -343897 28324 -277579 24695 -9953 318305 -114897 -4251 -259042
11350 -259042 -94278 25578 261852 136325 -40289 -112603 -3253 229688 25709 58514 22625
11338 92392 269562 -40320 -160194 -291219 124431 -327378 326292 250966 -320252 -99322
11327 113628 211056 -280143 48145 -351837 21742 97322 -93490 75307 -119987 112278 -4104
11315 -60430 -141706 -16096 -83791 35324 -72842 158326 -9661 108789 134392 -64383 -88705
11304 -88705 -71527 137499 -219150 16493 -42365 117093 342 82181 -9894 -28050 -61886 30913
11291 153471 -186179 -116919 148337 51764 -187905 -211148 101638 -202368 -64545 -363396
11281 -363396 129993 -156633 12028 327508 -178345 -63344 -281899 -124395 53849 -27308
11270 250757 26425 -315919 20626 49258 -78424 -50455 74333 4520 -559920 164951 -97835
11258 -228022 142829 -359724 -5544 -32623 132057 -13485 33845 -188075 -224307 19981 -64545
11246 -74098 -252321 -59011 -113703 -10952 63787 -132985 76775 187193 -243662 -165101 413
11234 237463 -83294 10047 127068 52764 -550905 122301 -7662 -73385 160355 -195991 37503
11222 -246029 109661 -216448 104534 -162345 -341320 223541 -270011 -173669 257441 -63472
11211 -337673 -132090 -81746 -690 -110635 -67142 140718 -27455 284815 -247120 -194279 -13039
11199 -174581 78246 -85682 -29694 75925 -469510 -174702 -13199 -139455 69242 -21691 -30766
11188 -30766 109765 -88352 221769 -179700 -172943 -220308 -274311 337919 -29709 119961 -224135
11176 -230309 -46131 -230930 -65908 154647 15812 177131 -226904 3806 -96534 111165 -193571
11164 -158319 55717 -163052 74368 99332 -457721 376721 48142 97918 -19672 -4842 -66180
11153 -66180 -54925 11182 265237 74036 -344567 178474 -381526 -191286 146101 -183239
11142 128436 53966 -57286 -194792 2115 16692 128111 -178913 154773 -185694 -21029 12537
11130 -47727 -75398 95571 177461 -287285 30887 -34444 232100 -4805 84832 316083 -13660
11118 137382 -20471 76020 205721 66200 312922 159998 12752 -91395 -113955 -180698 235657
11106 -9283 -87836 80358 179312 5457 -43223 339166 -45101 129117 242530 223772 251530
11095 251530 337006 369560 46413 288815 -134855 -8078 72106 183771 118206 -128361 51889
11083 417084 -5288 -47305 -20720 334443 339306 239743 252456 329664 96404 -44524 106642
11071 402955 103575 -138729 401022 88272 398133 288996 406359 96348 239865 415628
11061 415628 248048 538905 368945 354763 670594 439016 176194 532709 937992 502918
11051 502918 312288 947887 637364 428952 524694 589367 854513 472976 802140 780379
11041 780379 1051131 468285 825906 363567 860953 1030327 574816 674285 924594 897291
11031 897291 128122 947953 1003229 579665 730950 524254 764456 696343 604343 836894
11021 836894 455932 1050473 713769 657718 696847 660427 661996 762160 379235 861355
11011 861355 549706 590046 361109 560925 654420 612506 683002 813709 223690 414917
11001 414917 324523 820097 493426 724298 837828 774203 766551 500578 606333 721995
10991 721995 734441 711437 541281 930891 677774 515404 670971 748525 771530 940420
10981 940420 602402 639654 906172 1139388 845436 1338749 1399704 1460899 1405496 1714733
10971 1714733 2128598 2223698 2526053 2453529 2917591 2586794 2806555 2433746 2562593 2217037
10961 2217037 2104737 2123656 1940559 1786864 1603056 1577229 1306285 1598741 1743610 1454012
10951 1454012 2152302 1634797 1363123 1512620 1160266 1170379 779276 671738 352891 606654
10941 606654 239378 31004 528027 501584 117806 211500 -17435 4169 200429 222968 -70375
10929 40944 261017 35856 -37654 -477628 146613 344612 99264 82600 70311 84898 -185235
10917 133777 388171 83985 -259274 113295 -293178 -123668 85096 -15955 -69206 29427
10906 -341751 161421 18436 -277607 197010 57892 66622 219315 -97667 135677 6103 -175894
10894 -149758 215246 -36587 161857 -57167 86284 -28057 229408 -43667 -103825 -319038 -70490
10882 -90250 -453920 168872 212422 -86552 -211807 185807 -60123 27502 -289057 -98992 -131568
10871 -131568 195897 -43410 79074 -186920 60930 -500439 -212440 -41880 -221733 85385
10860 -185599 -27093 -47793 94079 129273 204248 209017 -19333 -184887 231585 25894 -112492
10848 -98110 -15325 -295778 -135219 -85718 184166 581750 295850 -49386 -67193 -208878
10838 -208878 -127111 14107 -250095 -159205 -35727 -101194 49419 91283 499 188393 89113
10826 206353 11440 -184255 -105497 50049 -278299 23579 -81747 75124 -317040 -120877 -203879
10815 -203879 -93136 -265043 -350994 413957 -64519 -426683 -330385 -212012 -282221 -546433
10805 -546433 326261 -158770 -19609 -116975 -213343 8586 -30474 -294368 27817 22862 124359
10794 124359 -130319 -189609 -213997 -233843 170775 22767 -186658 -278686 -70175 69163 112276
10783 112276 407443 98080 -458453 14345 218662 -275044 -6172 108824 77114 -13672 -299707
10772 -299707 44933 82883 91593 -37880 -447434 -239196 -13024 -319404 38703 -303040 178386
10760 -146342 -332794 -1225 19186 14652 -301923 -197654 -121864 -4877 -146661 -227054 74266
10748 40318 158247 -254977 -171133 205703 -146608 48692 182704 -336709 -161800 -53888
10737 -271673 -189661 79734 -89412 -39087 225309 69561 175662 -97519 -268893 -83301 -92608
10726 -92608 38619 -17046 10741 489401 152761 61053 -174840 -62043 201453 -97975 -151667
10715 -151667 -82735 -192366 10088 177263 -139427 -125157 -129652 20966 -28932 -266356 123723
10703 -132369 278066 -223051 -163950 -265877 172596 -78226 -268781 190501 296040 -143103
10692 -223293 -347250 -266263 -23091 163504 -469555 229077 -193799 -62992 303015 -215737
10681 47431 72778 26709 -245887 78250 -32268 -168018 -134785 131626 -6827 -85112 40171
10669 282977 -370328 21973 190050 -76676 56426 -330456 15765 325236 35720 -120897
10658 -38338 101728 -260245 19371 -142428 -192043 -135783 -131836 -104229 212067 76894 129673
10647 129673 -172700 -86899 -104630 55452 54998 -323138 1922 104322 -204097 -16511 23833
10635 -82986 -94916 -65438 15920 125474 -107785 64119 3693 -82892 -59247 -247924 358717
10623 43713 24099 -323003 71662 31409 -395614 -28245 40524 5029 -37167 86550 225207
10612 225207 198437 -446347 -54526 42815 -229224 40736 -111157 77660 -116290 -103839 -30142
10600 -17716 -183843 -117703 -158836 -233783 -117979 -101621 -311254 144296 -89603 -203045 228781
10588 -154260 -24544 96455 -194388 -142116 120727 61491 -471850 -10919 -68268 -19290 2035
10576 -1058 -16433 312259 52146 -62676 -129462 -287530 20498 -131130 -104026 -28912 -126585
10565 -126585 38726 966 206693 54942 -70980 -87247 234055 -450518 -391931 -158872 203565
10553 -86497 352409 -424134 22317 -90816 313795 140634 33074 -153772 121237 184429
10543 184429 -36616 -118621 -27217 110333 -89522 84383 -219128 -9805 37098 -326222 -259861
10532 -259861 152754 -70743 68681 95145 -111062 28999 -289390 13740 -129495 103289
10521 126258 -95621 -74095 -2059 180736 -48383 274337 -156760 -88384 -276017 307806 -88465
10509 -86153 -47150 -5050 7818 7365 30438 60114 203772 120686 36369 246564 87722 -37726
10496 -98426 -73821 101670 -128466 -23468 -549 128695 -51450 149143 38840 56823 -207953
10484 26009 -172906 -188300 -24772 71099 169180 -215116 -23038 91839 285749 186737 596040
10473 596040 423852 363781 27237 -97522 104353 153759 81974 147715 294527 -174800 66201
10461 158264 -385090 -283781 133263 107313 112474 -118777 80707 -180624 -63181 -105836 4277
10449 -239268 -394373 200398 68820 90642 -320483 226707 168959 78519 -384967 -75469
10438 -58530 297943 151172 216252 63378 -16465 5195 -23803 -342917 -14925 -631 22495 187848
10426 187848 -121889 -138112 117263 -87118 -67331 117034 -118717 -198135 26997 -374308
10415 18575 346144 123968 -58576 -198586 157455 -236164 -160707 144570 -263070 179403
10404 -236061 -194677 53316 -176810 108926 99535 1436 168196 38950 42842 15617 -361023
10392 -185007 -54486 15674 -105817 107077 -32109 420404 148687 98367 216299 7582 35372
10381 35372 -233025 -295783 -68858 154743 278400 213244 383817 94178 159192 525699 498069
10370 498069 98208 223544 240655 313346 564059 212658 452031 346158 436505 533676
10360 533676 148483 -20397 392825 336681 172026 333568 273553 300090 78858 137421 272824
10349 272824 712574 503191 408729 479297 220712 331083 87419 420248 -59219 595455
10338 242351 340424 362911 136176 -113038 125656 642802 28149 241335 -101933 88665
10327 181864 -27764 -108875 204935 -199818 117858 238125 -40414 98400 -32850 97577 268055
10316 268055 167367 -29300 180531 406465 -40508 72328 -47395 213970 166349 -110654
10305 -136159 -343704 -198362 -210149 59085 -99839 -151971 131656 395357 195155 -39769
10294 36253 -50779 24939 459737 -113103 -108743 -50876 -115174 137104 205176 103719 -112772
10282 -27658 -169425 -62193 108814 30394 -212667 -48377 -95928 -40045 -222706 -315710 77314
10270 70102 -152185 35481 -133107 57390 115070 70689 -315610 -350904 -53780 -65677 -328799
10259 -328799 -180572 -68198 -86569 -276206 -56947 218813 -33695 79387 314639 -41229 33404
10247 331985 50839 -66906 341493 90871 -100201 78055 -9149 -117994 151922 -254160 -28242
10235 59609 144850 -72449 -237339 -118122 209192 -40964 -128732 402488 45867 -102263 121480
10223 -184611 -24327 -90750 176145 -308177 -202371 -65668 -4503 -286535 51699 174758 -5069
10211 -172994 -63345 53224 -53609 -205950 238339 -84480 125709 -85297 42872 -344109 191384
10199 -322373 113936 -93455 173413 -30588 -422589 -342 95414 -178324 144989 -52968 -174381
10188 -174381 400156 -365425 -53526 -70855 -303598 43721 147520 -81635 24449 -45354 -251465
10177 -251465 38847 66426 25617 -134587 222972 40622 134188 -25136 -223734 -161011 -176684
10166 -176684 26834 112660 72664 -104820 -50515 -29692 -61316 -208419 -78955 258653 93200
10154 114396 -87830 164129 -305656 53671 -207457 330853 -382537 -201767 -284268 -25649
10143 -138850 -404411 -52511 94907 288820 44884 -33711 55979 -232594 151655 -166470
10132 85033 -216038 -41047 -166578 207993 -84352 -91625 -236293 296393 390295 -235627 -487665
10121 -487665 -211084 -205156 -142291 161846 -1515 -217642 -219525 -17947 -239529 -187207 -324777
10110 -324777 74223 -8142 67323 -102431 -455855 -205341 -48762 -340911 3935 -132011 -245356
10099 -245356 -153530 -195611 -109187 -30440 -284123 -33947 -183715 -267209 17690 107738 -159870
10087 98430 -63205 -4067 -54417 -94058 -160526 -100332 184308 66888 105761 -136136 -223294
10076 -223294 -219583 41225 98057 -107513 -154442 74015 -30370 -20386 343036 -302505 29961
10064 -210857 162839 -320625 -200872 717 55180 -98327 96183 86696 -270149 85141 189820
10053 189820 -326572 73973 -20772 63931 -134402 26848 -274916 -434444 -170139 -160287 -208277
10042 -208277 -2667 -377741 -19969 -140505 -50507 93179 -512318 -43729 -36483 -308087 -158446
10031 -158446 -98086 78845 -191961 -108663 -15695 -224936 -147918 81318 55515 19704 132647
10020 132647 209796 146872 -270401 200149 -377067 141742 -268190 -39231 13393 -67022
10009 293307 28393 -56115 -9640 20412 90763 -313162 -302447 76476 -138037 -83143 14242
9997 -18317 -267059 -120118 -4194 -226197 31985 -23449 -44375 123484 -292582 99810 -430858
9985 -57016 264889 -39994 80007 -196949 -369881 527649 -210494 -192782 420365 -177857
9974 -328091 -46384 -230621 -268511 -240845 -256842 45502 -231929 -31398 51966 -465692 -90633
9962 -229158 165244 -184623 -43848 47100 166611 12542 -105737 -157220 -72476 -179838 70193
9950 4364 -255660 115758 9452 334706 46589 -238046 -174862 -3406 -11208 32035 -168766 -210054
9938 -210054 -36212 184725 -34016 -67047 -237425 132919 -225777 87813 -41098 -10751 21572
9926 -120792 -139375 -84993 -26544 -87586 181419 -91970 -117984 18252 181386 -172684 -239079
9915 -239079 16596 271189 -80038 38719 -89439 -340858 -224941 70741 -17157 150917 -195077
9903 -353502 -196017 214123 -125540 -286441 -328416 19551 -32237 164930 -181292 -200490
9893 -200490 61838 62537 -302998 -104545 -229441 70789 65851 -88734 -53317 -161876 14919
9881 -30320 -176388 -176711 91518 -251415 8253 -467154 22421 -137529 -157881 -167230 -60767 -161478
9869 -161478 -94842 -282754 -173460 -61728 11309 4947 -37534 -53868 5535 76396 28855 -304597
9856 62068 121880 -138667 -93210 60842 -382377 239475 -367126 -109620 -318220 -341570 -289382
9845 -289382 -8977 -64063 -41116 -10160 -216711 -198754 -53352 -356207 -265040 -8069 102856
9833 10744 -240245 -16564 -71638 -3248 -212007 -259773 -246410 -121596 -125381 -225155 65286 -251481
9820 124242 262222 -61177 28903 -130216 13011 338737 -99995 -143599 232006 -35665 77511
9808 -182785 149012 -315695 246151 10561 -78104 98565 -42105 108388 -229345 -7014 -27702
9797 -27702 -180679 91450 -132371 -64461 130068 216910 3737 -130115 -16895 -74452 62604
9785 120262 -186722 -332171 -78109 162878 -257598 23063 -47253 35976 101171 -253004 -106099
9773 -238851 -41631 -92806 55098 22186 -59457 36850 -8575 85684 -328267 -217718 16336
9761 241065 -112430 -42845 -241456 91497 113514 -162198 -377173 233076 -463509 -48864
9750 -346457 -107473 80222 -61103 -193421 -14768 -361576 -38364 -48766 -125534 -482776 90744
9738 -113003 100484 -60441 302426 -18426 233164 -419933 91592 -204192 5459 -31297 -121137
9727 -121137 166671 -236413 159800 -77285 19187 -57249 -1567 -261557 89242 -267605 13920
9715 11787 -444525 -92610 -142745 75000 -137465 99232 65413 79713 121943 -111745 -137740
9704 -137740 120104 173555 -55375 53867 -110657 170875 250040 395524 81189 -259696 -147099
9693 -147099 184626 113242 -2257 9481 -271027 -78984 -225270 -29385 -455423 100272 74538
9682 74538 -107925 142244 -140678 -117195 -22080 -201799 -87306 -42533 -44616 -376865 159390
9670 -50617 -57526 -38007 155118 47104 -215772 -178453 -174081 201740 82046 -98616 167273
9658 150419 -43517 -303575 84445 -128326 13757 -201216 189906 -68185 -106947 131362 -133548
9646 56835 -51318 -295518 21760 -105568 -265912 -338583 22507 -421713 83535 -219091 -419097
9635 -419097 -499784 -63329 -126159 -211286 -51254 -70241 -43384 209933 -46295 -141206 -28363
9623 -717784 -268359 67863 -295075 -337088 -83692 248875 131174 -183517 -233009 177146
9612 -196715 -315356 -160441 -20014 120816 -24568 206007 -168617 -207547 252070 7866 -79830
9600 -165109 -50999 -22341 176 258217 -145116 -117022 -305174 -199992 -286181 -196625 -58738
9588 -169977 -152986 -147161 5797 171266 -58671 -67204 -184171 -113312 -260059 22254 276236
9577 276236 -9738 218201 -199881 -86744 89415 -313344 -314739 428630 -31873 -93481 142188
9565 72657 -280222 -141667 163926 -218779 -143916 -206456 -310036 -209455 -173111 -49332 61384
9553 79814 92871 -250547 -217501 -8566 -212107 82177 -233098 221449 178303 -77021 -119665
9542 -119665 -100618 -31182 -19076 5530 43830 -203315 113751 -32977 -280639 81771 -82056
9530 37026 141938 -42323 -330947 -152106 -232065 301047 -228034 220627 -466595 65507
9519 -194270 -5856 -359742 232187 81487 -304354 -247519 17896 39886 -148143 -4709 500596
9507 -67108 -53761 -66478 130290 -185157 -238794 -193225 -149307 -244561 -256217 228961 -40353
9495 -29507 18700 -138518 14992 -119831 -139799 -68559 -131327 48696 17707 101524 97642 -61011
9482 38284 112427 -144763 -331271 -4818 -287246 187511 -143801 -162914 -221279 -217885 -345796
9471 -345796 -226842 98103 64877 84567 -116662 -176079 -111321 85366 -255758 350698 -161642
9459 176245 -55531 -40815 93579 -175911 169888 109819 151936 122610 -238101 215902 -259114
9447 28696 -184276 -92636 55932 -175168 -328843 -43476 -57930 -135560 245464 18084 -218236
9435 -116581 -196386 210039 212189 207955 125695 -262310 -9369 -126013 73275 17461 115475 -104838
9422 -40038 39487 -19113 -46840 66819 -52927 -214939 10157 -227874 -307495 -7603 -182181
9411 -182181 -32548 37358 -157589 -27599 -259352 190855 377582 -1124 -451797 -160236 -72573
9399 -301665 -180087 300427 -94617 -59301 -92543 -57233 -305087 -385598 150744 -179593 -134235
9388 -134235 -12531 115737 99027 -57371 -277302 -27451 -40910 17502 45943 156110 195739
9377 195739 -321729 -57463 112357 -187835 -257214 -233336 -56095 -76040 -57013 -111041 39197
9365 -245381 -91183 170782 -15534 -88486 -212065 35878 -142031 7181 177026 211682 132565
9354 132565 133164 -27566 -287103 -3487 -26293 -235963 -78435 -84994 -47396 -447009 -256572 -104155
9341 57747 -223436 145610 33319 5589 6624 64088 103411 74945 -28558 116391 257297
9330 257297 -137203 -164269 -218481 -159919 234905 190122 161973 -3416 -320045 -60744 276159
9318 -90392 -100165 77056 179316 44995 199703 70434 -256921 278964 229919 -8853 -89955
9307 -89955 -167181 -446103 155226 -285022 -26581 -216823 -175439 -106867 178854 -107741 162709
9295 -49965 2130 -336358 -127262 -130884 -130092 -207300 65542 181672 -268053 -156067 -134494 -328602
9283 -328602 -88923 -183152 -113975 -138741 -162499 -17496 -206159 -180650 -46259 -115129 182796
9271 -52981 -137851 -13877 139574 -7226 250398 396 -83679 -50336 41968 338513 28833 69492
9259 69492 4890 15848 -193176 -142839 129657 -235925 59397 17083 -181550 -41685 62697
9247 57235 12472 -15405 103734 109492 -586031 -189414 -17330 166065 -244581 -354689 201099
9235 -192275 -68381 -104762 -58747 -221312 -54783 -378281 -183203 155314 -78234 113734 169225
9224 169225 120773 257518 -32439 -110127 -139679 -122183 -288432 139311 -24286 29396 374972
9213 374972 14149 -178353 -21900 -230349 68887 -21549 -129174 -142208 130981 -234546 -45831
9201 -72490 241699 -28940 -211679 -126011 -161009 69324 -43241 244294 -42611 23407 -41373
9189 -54986 -425552 87331 -135542 -6741 -94538 -70876 302795 -14013 7218 440659 -109671
9177 -72647 -51514 -14130 -19078 -411354 16380 183002 -137600 -74657 -31946 58721 -86715
9165 -316836 66853 -42929 -43313 -581181 16001 65240 -12394 -12913 -261583 -249648 -279851 24856
9152 -133880 60848 -131368 405244 -46473 -380283 20970 374073 54976 -309882 -7815 104674
9140 -148377 240243 -186610 133686 -234563 -259695 -378110 53104 -71387 -293369 -71755
9129 -168271 42953 -71792 -56717 73113 106100 97667 -114645 19756 -52660 -148056 9584 -218200
9116 -60113 -204443 79191 -193178 129041 -26133 -267668 165953 -155770 -223141 -67183 -241383
9105 -241383 -240772 -244690 105909 -285309 -265294 -102236 -181998 -126843 -290633 -115330 -193555
9094 -193555 -176273 17134 -159677 7462 125318 50745 -113477 -145033 181560 -72680 -163965
9083 -163965 -249081 155455 -137396 -28763 -97930 -268687 29051 -51649 116334 -273080 90855
9071 -259003 45787 -47594 -209915 -211101 -128946 55983 183217 76572 -158921 59544 271416
9060 271416 200917 253957 230093 -11342 206513 66793 -161549 -122420 -182407 -176632 -110549
9049 -110549 109313 115156 242902 8730 71441 -367076 -66485 -181937 108332 -26021 53477
9037 -118328 -2706 -90887 -285257 152756 419147 58939 455560 120964 35491 -189144 -7751
9025 55710 -216886 -101310 227199 -24239 -465585 283171 -146838 -238373 32848 -154215
9014 -74264 -160086 100734 -234007 -311914 248144 219459 -39456 -313560 -158321 -34466 27616
9002 -28407 197837 -235997 62906 -171762 -354425 -144602 47566 -292357 152496 51456
8991 1938 254645 18619 -103221 -255887 -207499 -48861 34519 74300 -163543 134114 321085
8980 321085 105228 -96345 -62790 213728 -322158 164762 -221153 -417625 -271929 -31944
8969 -107359 22897 -34372 -302178 -437684 122255 -287709 -451540 149497 127898 9802 -49382
8957 -23276 -198077 -355211 -5526 -149200 -15270 -155755 6091 155537 -144441 -114954 -181209
8946 -181209 -20525 -114487 -76577 -49081 -5052 33067 -184929 -277488 9245 -461288 -142125
8934 88916 15446 111604 24650 155446 -82214 70541 -218438 140829 364165 127271 -118910
8922 159963 88695 1363183 3707033 10014748 5906507 2678180 821962 320057 231422
8913 231422 -77292 -231123 -110895 -320167 -241724 -32764 -180935 172932 -4898 -147948 -161000
8902 -161000 247951 -306439 -180232 -142272 -295737 268421 -256549 -123324 53205 -161081
8891 -202802 250969 335022 33449 -42648 -66173 -195023 81772 3549 -161934 -231936 50707
8879 126091 -331865 -279023 -217082 7639 27725 -102511 -28046 -163765 -14448 -236748 -188299
8868 -188299 -65896 -107932 -125398 -79397 -77185 475090 -84158 -268532 -423490 -225147 -5273
8856 -130537 -49000 -294005 -142351 -330993 108472 276120 -63857 -93783 -183921 -308003
8846 -308003 -142830 -207074 5084 -51557 205319 312654 -95049 -323073 59460 -32517 -30347
8835 -30347 96048 -225306 -312723 -63696 -108999 -65073 28636 -57015 62878 132728 -141641
8823 -232625 -127871 -131221 -269548 213743 -164129 -180019 -99769 -374198 -313091 78635 282553
8812 282553 -108094 3683 -122126 -39824 -57915 -24527 136836 -72707 268828 25524 -259384
8800 62720 -74867 309409 -133434 155076 -255157 -70856 -212846 -34385 66536 118889 -161191
8788 -284248 -339859 -153457 -341171 88575 84431 -264662 195950 -215628 -277991 -79115 15905
8776 -88047 149767 -102629 -65351 -98402 -101398 364709 -164319 -174282 23499 -75016 232943
8764 -227388 56996 -137130 102085 164666 -104891 161786 94755 -233158 -155416 -70470 118856
8752 -72634 -37587 -14555 -380008 -88006 16897 62564 55743 -145782 -113640 91910 -337779
8740 -274452 63391 -146703 95262 42255 -248053 -206149 17306 -328542 -51768 318946 43748
8728 119385 -321231 -130283 233890 4116 25404 33954 -138634 -32901 39615 -231474 -186332
8717 -186332 -530764 -67673 -344927 242868 -104503 -4487 -139062 -104755 -22925 -19153 -140483
8706 -140483 -53320 -94660 222174 -125515 139295 269037 138 -75976 -207447 -70683 -91507
8695 -91507 -276022 -16325 105888 -459782 -131523 -3574 -28228 22075 -21567 113534 -118785
8683 -119407 -289124 76285 35363 133533 42198 84796 317769 -147894 -1743 -45870 89931
8671 -170378 -135608 36972 205044 -119946 -168876 24947 -159665 64843 69006 34111 -126248
8659 -250372 -291308 249232 227489 31462 159865 -39906 208916 -45548 212701 268675 -121995
8647 -102704 -225832 -58481 9433 38808 -52098 -315806 323300 81322 -161149 143216 -55618
8635 -97482 -277083 -165417 -203532 -55796 -150729 73816 -70095 280982 106108 -399626 5801
8623 226383 -75390 16630 22694 -71047 -410533 -140307 96822 -200048 122568 -43334 -104736
8612 -104736 -207367 58443 74437 -158899 -180507 -89352 162862 -345308 137891 44292 -111507
8600 25204 -296729 21207 -175490 -80891 -92487 -94117 -112330 19585 114296 125972 27025 76782
8588 76782 -266834 146430 -251204 -78632 -314788 214703 -272998 46358 -89883 300214
8577 335567 -116358 -174149 311101 -127119 125843 -166761 -36752 -302574 -95470 179991
8566 249762 -110085 -224540 171683 -110040 -89037 -517963 -243207 342578 16864 -31268
8555 114332 -111134 177732 365083 19370 -370022 52881 -201628 -63165 1638 -228944 -17350
8543 130354 150757 -491166 -107256 -476360 -61846 -220429 154486 -49209 25274 -9277 92588
8531 -164124 -559 -102714 36749 -217251 -225214 -5263 -56538 63973 -141707 -409655 -98316 115503
8518 -133771 -305431 166763 -143884 -147699 -113344 -247141 56546 148205 -63089 -173315 -244339
8507 -244339 11085 -381766 -251641 48719 82067 -173605 266942 -317506 -130503 -41649
8496 80775 165083 171042 -159665 -73180 -132208 -210893 -60849 543274 -205976 -262081 -114354
8484 -16188 -122552 -167435 54989 -159982 77309 -9242 -290935 210622 -198370 -37449 -291241
8473 -291241 43272 -139957 -52077 91313 193348 -143220 126626 330190 -6692 -28429 -68656
8462 -68656 -83069 -214054 -245127 13568 -8929 137095 86476 262100 -345360 -18622 123917
8450 -624 -90771 -273859 -120768 17132 -428243 -204342 6259 118158 -243216 -124178 -145289
8439 -145289 43616 285066 -106367 268902 54403 -250096 127402 -2025 -133420 75963 353960
8428 353960 -153324 8930 215881 -96809 -134803 15115 -115567 50003 67153 92656 70851
8417 70851 -684 -193807 31269 -27811 -353046 161892 -145697 -157777 -144057 -100970 -89014
8406 -89014 7905 102912 82865 -66199 -41543 -195370 -203359 89864 43321 -103401 21033 -137438
8393 -365004 107551 -87447 107525 202464 -60606 -115745 86766 152797 -96769 132371 52679
8381 70111 25230 302728 -5963 -116511 144539 151150 -229681 8432 -220193 91954 23281
8369 38063 10433 167107 -8311 -63508 137374 -356555 94632 184467 -177853 -244060 -284797
8358 -284797 -23128 -138386 -199810 164605 -174935 -68869 39212 -298918 2250 -105573 149634
8346 -30494 -104245 6413 -46314 285716 -83011 -94294 -184358 -104997 121935 -232577 -4073 -47687
8334 -47687 -10969 -125502 -73928 -185390 -59992 -17752 -309262 -187338 129197 -247212 -99156
8322 -211348 -53311 69417 54768 106208 56296 36633 -143395 -224570 -170166 -83680 45625
8310 13965 239599 18686 -192214 -78284 -32535 386617 -286996 -1094 22382 -29269 -108503
8299 -108503 227363 -257888 43741 231250 -182562 -410019 2639 104083 36948 40135 -151174
8287 -262565 33828 6427 -165259 148572 183275 97117 2114 137104 70186 -128879 118872
8275 -108050 129598 -276855 -235784 -58401 -244977 147336 73402 -51531 -63643 -199114 -34535
8263 -18645 -48964 -6166 -178312 -7191 -144495 64613 -56194 -104455 49028 -57946 -276946 -290788
8251 -290788 78450 -61715 10347 347229 53123 -307380 -7385 179336 -73979 156052 46254
8239 -23705 -209619 -52750 196238 -64276 8889 159666 130740 215241 98502 -103902 -106862
8228 -106862 -106579 153609 179351 9596 98145 -409346 -5570 -394524 -79086 33037 356290 98643
8215 -27915 -106674 8803 -182862 -95738 -405981 -4210 -406965 -370536 -4654 71062 -137466 114886
8202 -177692 116218 -58270 154063 -139676 -28683 158119 141107 -11104 -147109 164233
8191 123618 -88962 -20617 -414619 80968 99761 -41620 -185805 -184010 -417570 231191 310589
8180 310589 -83953 100832 -17247 -93465 -110149 -264237 70188 29003 148802 -178383 -237448
8169 -237448 -340262 -281923 -53112 -86776 252807 -68116 -27981 84901 -88418 73515 81927
8158 81927 104480 191046 -79417 -117279 -291654 104245 51301 -279057 350312 125235 35422
8146 248074 -147356 -46474 -167079 -207365 283216 140257 41487 -337122 19048 84019 46782
8135 46782 -24082 108864 -315801 -106341 25409 164187 -348559 -113154 -445354 -109141
8124 103533 -51828 -251421 -260584 93162 -33841 182105 61141 85202 -86862 -106917 -62517
8113 -62517 -341082 -165750 128299 -53094 -39146 -67532 31624 -60108 276453 -171511 -148984
8102 -148984 -70095 -158326 66878 -22034 -144824 -187074 -328970 -84844 90871 -224220 74646
8090 85894 -176819 -169348 82787 -204959 359625 102623 282762 201660 -157010 141216 -59067
8078 135304 -270993 -325116 -7925 -65840 -68325 -245508 -18050 -314495 -303499 162967 -242569
8066 -26815 -37743 -164701 -132299 -23480 -287883 -4045 164896 51623 -53519 20262 -236108
8054 -51728 -18439 -27312 263842 -10266 -283721 -101942 -269484 -80217 179733 170237 -250574
8042 -231284 -186301 -387658 -11836 213148 -118283 55386 -218073 -178254 -181118 -312529 -267158
8031 -267158 -302874 -169050 22287 -37629 -90298 186800 -42647 283288 142916 202461 -117534
8019 167034 -61947 137373 167791 -319496 143439 187714 84428 -51510 -224190 -125226 -171726
8008 -171726 106138 -4968 -348154 -101083 -38936 -2660 -47229 158058 85754 -159277 35030
7996 -223184 -17734 -143402 -190884 73883 126078 -31996 -339088 -98460 -26414 2602 14408
7985 14408 -154169 25668 -140974 30617 90434 43751 23702 103597 -194276 -79917 175857
7973 -120051 7545 -121864 -118810 42424 -118599 7285 -163580 256779 -241162 -13892 -36096
7962 -36096 -316738 -70331 -116594 -367553 -151962 52058 73787 -212216 -106849 -296204 174579
7950 -230050 -64472 -148048 -112000 -300619 4120 -235273 -152538 -67291 165881 101609 105719
7939 105719 -3725 -399892 182633 -227456 -3906 -74248 96064 -35961 -116822 -200616 103452
7927 242056 144995 -71096 12488 -164949 163317 -181336 -290215 79925 -87044 -146209 -40116
7915 234506 168138 -140545 -29289 -204540 189119 55078 -209368 237316 -225877 244193
7904 -355271 67438 93619 157892 68903 195276 122521 99429 -6113 251854 -123998 -20912
7892 69566 114096 -38198 76914 5299 27843 190181 87370 -271063 54353 -151710 -80183
7881 -80183 -51733 243687 152377 -431877 136213 138755 -252815 -250446 -97061 -40365 15447
7869 -320931 -168594 3446 -267516 190800 -26483 -65665 -139354 461146 155650 -105515 228625
7857 117766 4882 17086 -148520 -324070 74542 201750 95677 148798 -113988 87868 -186966
7845 -192391 -223225 -1482 26776 -225300 82081 179010 -25635 63780 -41130 -256142 -136764
7834 -136764 -203265 175971 53067 104433 305907 -232466 -226591 -83123 -173379 -84938 -80220
7823 -80220 -25245 131354 -207768 -269482 139397 24219 -417975 47334 -44535 -151804 239333
7811 -115430 -6650 -57189 219364 -42384 -84151 -112715 202320 62376 -3008 -220151 65597
7799 147716 -388314 95606 316003 -334984 -355180 -24685 305205 -368024 -489133 221983
7788 -42989 -31463 -136015 -151793 105665 -481609 -197657 -199803 23647 149211 182924 -180726
7776 -73005 -101063 -18930 -50558 37425 38794 -92765 -282903 -108241 -284358 -20535 -165898
7765 -165898 -117781 26748 45684 -65301 1332 -152303 63832 157567 -267685 -131753 107790
7753 -197106 -43411 511115 -315458 -103645 -320581 377244 -122892 27264 -121643 -129270
7743 -129270 -10004 105938 -42776 119002 -95483 251223 -235628 261954 -213304 -41163
7732 -92221 107042 -372287 113420 -52658 -81790 -10422 -145336 -54537 142354 104958 77589
7721 77589 226291 67871 -38692 -29438 187420 76328 117586 99388 64911 -265260 -90040
7709 180474 -43901 -122517 -126062 -353684 -93185 -70245 309454 361677 -43629 -75196 131154
7697 -273137 -10728 -302870 -94930 397402 62579 -206914 -23041 28186 -71202 -42113 65140
7685 -37576 7692 240174 12451 53471 -98813 -139837 -92100 -182034 65759 -159691 48929 -81955
7672 178604 54170 175944 -276046 -245480 -101837 -353673 -96642 324754 58176 155049 -35594
7660 -161602 -311078 -45015 211442 151156 -55370 -231242 -65222 -110270 1179 -22818 29705
7648 -151909 236839 -399568 -119947 83425 252735 15823 33135 -179527 88011 -413883
7637 43866 -30430 -101697 -99058 -150416 325578 66657 23615 79388 216705 65994 313138
7626 313138 -145458 -334625 -26938 213339 131789 126327 -73478 66101 -17389 -217166 149081
7614 -278263 -155637 -307503 -176096 169723 -15471 109427 373176 202484 -20334 -166566
7604 -166566 -148869 -373647 18946 -215572 -15496 -223943 -249753 -253590 21095 18284 -104797
7592 -90853 -90273 -303219 -126674 -60157 37187 -63518 -45196 352745 -42759 140739 -148434
7580 -198823 188962 160146 -171122 -376987 -93021 -149382 -23840 151902 -170887 -178081 -493702
7569 -493702 -8196 231395 -93864 155356 -378254 48055 -47623 -24450 79071 187010 -106660
7557 -139936 -109960 77295 52120 -449338 176463 70894 -237144 212986 69575 117426 -352198
7545 1596 -399540 238254 36046 -406095 -98663 71626 -144834 -134473 50850 262207 -162340
7533 44119 -160883 -20233 -115628 -229432 22646 87844 -196434 -237154 -16838 78610 309592
7522 309592 43548 -241385 124410 -5639 130764 165711 -150037 210536 -77496 200310 -362827
7510 -249560 168860 -190904 -52589 193881 -70892 -271521 -135326 210285 -9194 210383
7499 -29291 251659 -91560 -10745 -183318 137499 -99744 167980 -17558 -87334 40929 96041
7488 96041 287318 55059 -84381 -312805 142060 31518 -186588 2713 18138 19620 -32427
7476 -140554 -138896 4993 203416 -23179 213591 -200380 -116698 -40781 110708 -319998 -111109
7464 -86139 32840 -169503 -69207 81736 229757 -227993 -2668 -284856 133142 -62995 -10 -228791
7452 -228791 -7068 344440 -16345 -362462 101316 16702 -292263 -136104 62925 190803 -200652
7440 -45201 -332029 -92977 -60968 206917 95573 -123409 188136 -131721 -301166 -246410 168481
7428 96266 150532 324742 102074 99303 -54807 59325 -286921 -186395 21861 51463 -74424
7416 -357942 306751 35506 200310 122010 -382392 -2082 216775 -3517 102835 -11775 77055
7404 -150597 -3443 123112 -820 -6497 -111971 -25851 -332249 -89349 -173965 -73129 -203257 -308817
7392 -308817 207088 -36381 62875 -30005 10550 66323 185014 6624 -371023 49601 124545
7381 124545 81780 -190655 6963 382999 -177149 155777 -219194 17223 -162156 -35379 -31788
7370 -31788 -13394 -91920 -499033 -244838 151289 -17349 -27381 2583 -236378 -250443 113975
7358 -330817 149901 -128364 55058 -92854 81384 152475 48197 -187089 -165830 157257 -12009
7346 19628 -163284 60541 28021 -137303 -122590 -151934 51950 -521796 -64641 -241821 -77350
7334 -56673 100448 95111 196910 -60306 -365999 -24156 -176024 -257183 46294 -39734 -261954
7323 -261954 261452 274428 -338695 106410 -34172 -30484 -87727 -75526 92934 -147366 181343
7311 32368 -225444 338947 -104247 159748 -65982 -173792 116294 110356 -98544 -46557 -158397
7300 -158397 66713 -36023 298992 -211825 -170915 -136216 -102666 35112 118785 -40778 -170869
7289 -170869 -105311 72666 236371 181311 114993 159587 -225934 27968 -169955 43118 145882
7278 145882 -168255 -141329 120729 -254166 -207444 -272906 139951 153184 -217305 141847
7267 -177175 -282935 125201 176237 -125882 -660366 299930 47840 102876 17951 100176 39992
7255 -267205 -20621 9586 -302637 62106 23188 -169368 -96109 -57573 -363441 157702 46360
7243 131265 -318203 339179 13913 -189751 -48141 16336 117234 75690 -121616 -235146
7233 -235146 -201003 491353 150451 -25440 291568 -129842 124565 -36294 -250709 281094
7222 12297 -160327 -40810 392348 -102260 -261914 -238373 -127451 -174745 -102512 108588 63364
7211 63364 -119533 -191328 44884 -175938 81069 -104820 -5182 86758 -52814 253296 159728
7200 159728 -70236 -470775 -12140 -114337 -52563 187116 137766 69024 132590 365610 -41335
7188 -2564 120258 60789 258733 -227947 117570 -80060 -14291 301719 -61525 -153994 33702
7176 284441 271494 -370144 20509 27585 -350473 185014 -82069 -133604 -246620 134674 -43778
7164 154788 185394 235119 -70475 -34996 -179110 -80057 -47556 261596 -168358 111829 103609
7153 103609 -24961 -373386 -380578 -112056 76530 -114569 -328935 -75899 15217 213684 -218551
7141 -228840 154063 81775 77204 -72504 -91866 -88307 292030 276489 -325978 -155974 -43479
7129 34015 239087 -22931 -163556 -112551 -285709 -190888 -135978 229382 -263041 -143207 -222328
7118 -222328 -18991 -13771 117768 -35066 27314 -397227 -46649 -221017 140809 107818 9782
7106 -104156 -155995 70031 77815 65292 37160 -325734 -93051 -146677 83495 -225940 -185826
7095 -185826 -101582 262840 122972 -197239 60026 -163361 -103080 364941 -63122 -163568
7085 -163568 -90619 117185 -74093 16484 -154150 69205 78469 -111666 -72094 -148942 -87819
7074 -87819 -146456 142890 48383 -193702 -63045 -91281 -116460 125189 -36271 -83592 -507981
7063 -507981 120123 104310 105602 -70390 -181864 285425 268498 98085 81521 -81748 -225407
7052 -225407 -12702 -256151 -133370 260807 -118152 -177441 166264 148183 83528 313845
7042 313845 -223325 -262515 -86058 55928 85331 53311 235903 189966 325769 -216660 -16972
7030 120071 149787 -64791 180770 64326 -59536 -84032 342221 -164256 150641 184928 -6757
7018 135252 34022 -309126 218925 20661 -98961 -126730 -272494 -58509 20681 -59794 -88752
7007 -88752 218293 212266 -75152 116381 -123678 320153 109511 -69227 -47221 77126 287481
6996 287481 -159794 -90641 174866 -334749 -170300 -154713 -107759 153645 -97189 -163034 147072
6984 70660 -3833 -180437 26502 -139479 -354211 57431 56523 -42010 -130144 91563 -43240 282095
6971 26823 234265 -90595 4870 -225465 -211288 130906 90047 123196 -96418 76425 -453682
6959 116306 143446 193209 -78929 -143412 21373 -56649 168387 -85384 56467 -178860 27587
6947 -234386 -210636 -16384 10498 67766 -153540 269582 10492 -29018 172529 -152126 -282930
6936 -282930 -64402 -22509 -32943 -127167 -51567 -135039 28464 266882 -205757 -53377 -54284 -250271
6924 -250271 177935 -53417 33823 -124410 332618 -46807 -48376 -43094 -22503 14728 207814
6913 207814 18843 -39895 -109930 -100938 -262716 253063 301513 -115426 47622 21562 191920
6902 191920 -38890 -112235 243590 -261715 129607 -19410 155166 95821 49426 -122166 -148527
6891 -148527 -294007 31455 129925 -90340 -50357 -130292 54390 20521 54098 -44310 355218
6879 96788 25723 -95668 74993 -316527 -227183 -55304 -51708 -220511 -154320 23673 118605 -70516
6866 169261 -329358 77593 26061 -72824 248171 -22744 16335 -260122 -125779 77509 -143752
6854 -164401 -125248 92813 -51831 -185379 -202692 153659 -227107 -39108 -40700 22606 65631
6843 65631 -115830 -57104 -12978 -310244 -105200 136514 -62180 -25540 50645 14054 4754
6831 208640 -182728 227679 1208 -198074 183505 -42673 -186406 280069 42574 -145571
6820 35879 -375403 93891 46822 80777 67748 -139799 -111089 -109895 20076 -301964 80314
6808 -41634 161327 -44091 -59437 93284 23659 -158479 -76988 259022 -304818 75623 -134961
6796 163830 -8212 -411886 -151432 167389 121024 22489 -29216 316054 -138747 -92464 -118112
6785 -118112 -52819 9771 -250203 170486 125937 46616 -196016 135247 -69173 -10521 -117160
6774 -117160 -16912 121698 6001 275409 345842 223626 158263 -54036 -281727 -105766 -350854
6763 -350854 186651 -81406 140960 136372 157891 -249321 125888 -14102 6056 -336733 280631
6751 190144 -97087 -130681 29663 -108728 -147929 204988 285715 -22978 -484195 -216064 -177762
6740 -177762 52326 -230415 -201717 -27854 126931 -73425 -240284 1500 27756 250517 -95906
6728 302630 -2929 -193564 -28370 -238525 330313 -116258 -171348 -181802 -182139 394668 -120514
6716 -111534 -47003 -109569 -218322 373225 181305 42385 -144534 -188930 223580 -78206 -34348
6704 166294 24628 106432 -272334 -26014 140571 88948 7461 235349 143913 -216429 143622
6692 -96148 370475 305161 -63622 -158558 -139219 -102273 99481 -95843 -226942 -202089 -129849
6681 -129849 -138105 -180220 145436 -13497 -326091 79052 134243 98215 97222 216393 -299199
6669 -140073 -104869 -42654 218406 -113421 2332 225033 173993 -54590 72421 7720 13799 -30015
6656 251506 375867 -152514 5958 -109057 -194153 -184414 -75602 -292986 174992 221434 158985
6645 158985 22736 -149149 43260 20419 -428248 16136 -367599 -27448 91736 -384299 -222815
6634 -222815 246142 54098 179440 46663 220487 45200 -52448 -117220 -80575 -153057 -45821
6622 -296486 98760 -275470 -57706 -73699 16789 -266936 -268765 307263 98045 -174681 226883
6610 113488 165755 -99429 141738 -112128 -103580 22087 -114460 1753 191203 168715 -246333
6598 -41561 99873 124622 -299895 -83443 -42137 64885 19783 -94148 -126310 526 -59675 120072
6585 -102491 -84974 -49684 -51346 -221553 149405 60855 147917 -81510 -129223 -75553 -121627
6574 -121627 -256151 40791 38824 257654 -388181 -437854 -86508 -98701 68773 -61005 -209683
6563 -209683 67088 -48698 -5201 -29442 -114389 -29385 -89852 3534 90998 31003 -104848 189168
6550 88216 380384 -19534 -90827 168011 -240463 -191321 -123805 184234 170444 350086 7554
6538 161256 -204228 -833 134882 -285240 38551 -77934 76396 -115445 295243 -45076 -18197
6526 61260 38875 -284057 -88660 -153093 40350 -103885 8857 191060 -84765 -226279 -112141
6514 258707 -117909 154477 161716 -248037 379889 99296 -43509 151428 -91632 -48958 -324161
6503 -324161 -169195 -101066 -203978 -169328 218877 -132245 -83222 -22823 -89284 -175647 37648
6491 -213460 -201491 -156491 168067 230639 -7696 95589 -325453 -210822 -32017 255416 -132294
6479 -11491 -106855 -199846 -189315 33002 138840 129643 300001 -207608 166268 -149614 -104498
6468 -104498 286177 -195382 -170931 264956 -140292 -148427 -21332 -10472 391439 -199281 -55850
6456 121876 126364 -333657 34872 -409740 311139 52094 42527 -43083 68452 67875 86700 -70061
6443 -34285 84277 40469 166954 -1593 79159 95306 -248478 -54445 -342411 336596 -189070
6431 -176801 -19960 -199491 42309 -180561 168832 -133598 -91745 -64625 -188807 -111074 66626
6419 110165 61717 78222 -604 115495 58477 129004 -247839 -83473 -32176 74022 9763 127920
6407 127920 141657 -61731 272791 182320 -291378 125169 -4662 186033 191598 -214810 14010
6395 -307594 -69626 -24284 -260985 -207161 72705 -220527 199526 -150658 -472423 -68126 283226
6383 -246041 -21238 212880 -154577 -36182 -12446 41156 -42986 168246 -42761 -108843 -174617
6372 -174617 35605 -68368 -103336 -237591 22750 -58191 35476 205900 60496 89926 301165
6361 301165 32050 -85108 -124229 233941 76535 253215 141335 228934 -130863 -322241 -75322
6349 -291359 23551 246385 -151511 -116325 135543 262995 204272 -8699 258519 -66358 50101
6337 -239150 -162605 74696 -136537 -342564 134681 -108568 8772 38574 -144968 91701 495829
6326 495829 -85848 256996 116617 172084 -151513 -205688 -342930 160241 132374 -73964 -31052
6314 -121875 168654 -80122 2277 -180101 28368 17991 47448 -222640 58438 93727 156243
6303 156243 -37674 161020 -11287 -284083 434901 89315 -90911 64257 144543 334845 114477
6291 -216015 -125467 -186512 99266 -190249 249806 297378 4328 170498 27192 -53725 -184145
6280 -184145 -278445 -134153 46397 24036 -169479 -192953 -233328 402267 54183 -260645 114844
6268 -32836 259271 422586 -242151 55766 108425 245528 60831 -99046 -90899 -5612 -63088
6257 -63088 -69168 -78450 -109065 -204291 256587 -106690 -366943 -96212 27301 212906 -66896
6245 -70763 -292464 -232347 -54275 -165363 -42537 177601 -215459 -154853 -30096 190352 -306407
6233 196642 63515 -155753 -5723 106365 -153267 -296596 87363 148185 -293281 8699 -586893
6221 152274 -95814 -239780 44712 -116034 147357 -39715 190361 -69757 -178061 206708
6210 -27629 -199099 362214 17682 -127025 -39443 55846 97755 223286 182383 -12883 -73016
6199 -73016 -79434 4331 448209 168652 -83945 -261185 -126401 -385797 375849 3410 -17523
6187 137510 73296 -85341 -346878 -111739 129505 -151356 151412 -145478 254740 265906
6177 265906 165877 -72587 -224054 134578 74716 46502 -42299 -113188 49145 34041 144407
6166 144407 -211800 -16730 -202062 -44428 -298099 -88819 -271577 -45105 327648 116302
6155 6511 -123571 378648 119797 -169620 -97332 110418 -66660 162910 175645 -178100 25734
6143 -20088 -55731 4610 406892 278891 -34047 4668 -190764 8923 88437 329067 226808
6132 226808 -113362 302976 -124500 208468 -325917 -108213 157799 -180826 408368 95558
6121 153817 -81271 12056 -63991 479949 220081 -129632 -133232 -333975 -132159 38013 -25780
6109 -86451 -49099 -209111 55085 -79537 -17945 -281265 -196679 -147141 42799 14156 -12539
6097 93222 -39949 -37148 -142478 103689 184339 38674 -9840 48816 187316 63227 -378658
6085 8952 98455 -216338 18355 -63515 31573 -142885 180676 -374150 -119448 65782 -61500
6073 -31590 66465 -82665 117780 -50319 42884 53968 -236378 22879 62419 -224974 -26193
6061 -237797 45284 255282 -21866 202529 -40307 68632 -184899 260640 15717 -150432 49018
6049 88475 250612 38355 -153962 -210388 61382 -102193 27107 -242625 170158 -159432 234278
6037 46160 8259 21272 -16861 181481 -98641 -155508 -169401 -98800 -153859 236776 184152 -37023
6024 156499 183390 -48802 170645 102251 -190668 -92096 -92171 -2666 3973 -233337 17186 290327
6012 290327 93619 92541 82093 -7172 235016 -54419 121661 97795 473060 -49277 130063
6000 278245 -151746 30763 5723 22994 32251 198991 -110058 119752 -117746 208924 137621
5989 137621 147075 -98641 308010 -120437 -164509 170026 -395983 346920 -97517 -3063 48352
5977 -22791 127328 19700 324721 466425 209951 -82576 141786 -433513 228742 -82816
5966 260744 -44528 29673 251973 -115679 -17464 46258 33288 -55256 -70080 98286 -116205
5954 -483097 -31039 -182234 -256165 -32038 82860 -143079 18654 -14134 -65366 -219375 -337430
5943 -337430 206858 135414 33695 -8769 51028 -236155 -436939 -11292 39426 -324721 -2831
5931 57065 65099 111880 30421 133327 82936 58040 -115855 54010 141764 119715 -49100 -35
5918 160846 64382 -175981 215904 325777 49232 82927 150674 -76522 -28878 124719 -24949
5906 330951 -52224 440228 -111017 -125793 -77529 -64885 16097 -33864 -77321 387105 -286422
5894 -110842 -73582 155392 -5944 286997 86691 -77579 149017 34099 110431 27471 -125263
5882 -144293 51908 -173802 -82842 237116 310432 120258 -67540 117135 219689 80981 -88752
5870 -14183 -84596 -51967 -60346 177288 -55195 75504 126501 -185102 -35206 -92484 55119 24726
5857 -257031 -262221 216718 -86009 -1689 -167042 32743 150743 -5997 -135011 -82746 -98836
5846 -98836 289709 -20369 120954 69596 -231987 -70120 71102 114410 110390 -92173 -89099 -374703
5834 -374703 51265 -255211 56522 87695 264023 50623 -296934 -110461 -218728 10097 -73236
5822 -56792 366209 304185 -73029 71935 209514 -328135 -30346 -10624 97737 -7994 -341714
5811 -341714 -105439 -106241 106070 55614 175779 179454 73445 18916 207313 89149 2571 -139823
5798 -13191 -41846 -78487 169013 30564 131154 170385 269479 -46561 164310 41126 -162081
5786 -161234 -115271 -115168 -96732 125218 78613 50752 -290568 -61247 93412 106270 76779 237831
5774 237831 96485 30949 278674 -321154 -85603 193130 25004 -36174 64145 -5593 91901
5762 21093 24794 -128548 384282 179345 126527 188733 91321 -189625 -181212 -354318 -177030
5750 -84040 -29182 53544 -46717 22303 68555 -250664 -43924 -292431 -176154 -62384 -25805
5738 219392 -173023 362918 -116170 -4749 -256694 373881 -16162 -62745 75020 220390 57176
5726 -144237 136728 73474 -107173 145487 39980 193296 -270901 100716 -92366 128909
5715 -106657 158652 -86453 -108898 -151926 256590 60826 -83753 23400 96036 -109812 52175
5703 33602 80545 -40563 -25925 -65651 -218887 194151 -50356 -8914 -16202 310923 -107110
5691 -424048 -142510 -212997 150484 154202 -85776 -27388 -116961 110830 -175648 -14885 115830
5679 -189328 -221284 -96835 -30734 -19790 -93913 -203631 8699 -49798 -162240 265915 132579
5667 -325840 193691 60145 3425 -108933 -156160 21020 -114211 -190196 220308 -49333 -110365
5656 -110365 -107545 -85568 -291458 -254593 126123 84613 51397 61157 32242 173736 95272
5645 95272 -202139 168427 82950 79254 197318 93902 -212044 123471 -110655 198692 232186
5634 232186 -260446 26533 -249283 -17720 88458 -316936 60915 -39731 -117282 109106 -148626
5622 -387413 -95333 130482 -325114 184185 -272549 238569 287960 174051 -743 43395 38201
5611 38201 155865 -212267 -8259 -389192 194174 43691 -58791 -103844 -77214 -91186 -112598
5600 -112598 -206281 199384 211689 141183 -90668 321188 23284 -54633 137095 60494 -120055
5588 202831 168850 135658 415423 140901 -17850 -114687 -27994 198873 -34348 -117384 -62033
5577 -62033 3184 95483 47191 -188548 -145112 -3932 295773 244732 -108638 -35254 58033 194180
5565 194180 151865 -72979 -303262 -72238 -35980 340835 -220170 192590 -153642 107509
5554 74403 30956 -26659 65761 -195809 -121190 -232676 233830 -317239 -108192 -55992 -105394
5543 -105394 206851 -53798 -88933 -245288 136712 -53550 -101728 223038 -519765 232966
5532 -213384 -171595 114509 55720 48225 144122 -109205 31340 -253163 -425673 171185 -193925
5520 -548521 -128461 280650 63164 -65861 102491 -15263 64329 -77862 -175048 266004 -181596
5508 64951 -53118 158268 -16522 164231 -118664 -188757 116045 -323788 246305 213322 -161564
5496 -75578 59796 -40328 79157 19499 268541 -19770 222976 -131506 138276 -121916 2386
5484 123090 -34158 -248570 198496 146811 118191 40421 323876 -196698 -183740 -230486 9123
5472 45226 139325 7591 39610 160121 -77391 -233813 208127 81210 49142 147998 172744
5461 172744 46233 -143556 89854 54779 -180261 -31644 -64474 -12406 -175537 224531 28980
5449 58153 -42942 -72174 -40322 -5804 393821 76545 -110924 -267545 -300098 81596 339901
5438 339901 -10406 -271948 641515 -196706 -138814 164460 167952 52615 -101954 -30713 -312716
5427 -312716 -106301 -104753 -169847 -160592 -59937 -62819 114059 375599 -67466 -92462 -158175 -13332
5414 -124599 -145096 28098 -113239 -63743 -159961 -109857 -88290 -155100 22766 73845 -77361
5402 84787 118386 -115559 -541233 -128523 -150293 -76240 166137 -207436 240020 -162930
5391 150924 134763 59837 255490 -21016 -175458 -300732 -118241 12799 -239791 -64596 96650
5379 -34820 104441 100845 98199 170252 -110003 -290753 110579 76000 -309443 -88606 -14052
5367 -11660 12800 -246405 -169472 -53566 182955 -82003 -376023 -166851 110782 53156 -169697
5355 292804 -48619 163846 24897 -5755 132653 -36952 -47775 -197139 135123 -96148 115003
5343 33147 -210565 -217268 -184271 -36259 32851 119007 -119523 54644 -336693 -102182 -282872
5332 -282872 -42047 -136083 274757 -98110 87627 21880 170850 -249378 -60438 -286899 -220524
5321 -220524 96618 69237 -20772 -24239 99634 167345 -125007 61968 -70002 164932 -111446
5309 225355 105392 -213052 -62041 78218 -196581 10542 -22902 293647 -108834 214448
5298 -148550 436535 -77884 207059 -16680 -127850 -8856 263163 -97702 314124 -10464 -56160
5287 -56160 113849 -115399 -12701 -337048 82167 175413 -31609 236877 -200312 312063 -293696
5275 -144131 79845 -2867 200862 23830 210620 344396 -132695 71585 147085 -245405 234422
5263 -90098 293539 281603 289511 -226043 -41521 -30313 -259497 -1803 -44549 -86698 -232894
5252 -232894 -135289 135129 63653 -144196 137262 -213760 -300376 319154 124092 90129
5242 90129 -215131 -74488 3506 166671 205076 -93026 -210723 -187102 963 40770 -126648 -39613
5229 166662 132546 73819 -147638 53069 -119061 51880 -34158 -199992 -100249 187175 -63489
5217 390955 264215 -71883 -227723 154499 172866 -57388 58444 40127 -384181 -225022 108833
5205 65264 243364 67405 -24230 182957 -163236 81941 163369 -67033 36223 -39809 122366
5193 -117372 -2129 -85657 -43214 278427 -200712 76938 -232674 131383 -258911 48716 86591
5182 86591 -277339 -68244 -78611 -61481 87433 -373403 -78719 163246 -48451 -96172 272050
5170 -109399 -366356 -130545 -46405 2232 107132 -348862 340208 177652 -51491 -233515
5160 -233515 118620 74167 -49577 -333957 -381004 -46886 167159 14522 60334 76455 -119247
5148 90835 -64372 -80257 310658 -107853 -35367 -90375 119591 325759 349103 143005 347190
5137 347190 173399 -61062 163227 100960 133575 -140586 293462 160418 -25785 -22554 460537
5125 7679 -172354 -176589 175261 10914 -48501 -200891 48929 -10749 36668 202900 -333863
5113 -263397 6513 -108522 61115 -39732 -271982 355432 234330 -191659 184704 -65166 -65019
5102 -65019 -51164 -113586 180483 -28794 149193 -189192 -3417 205655 -284566 13219 297811
5091 297811 -152632 -2320 -135285 -131805 -81837 39493 207129 -79946 -31906 77238 -119000
5079 -187631 62487 -102078 -244441 -88724 -65647 -43625 -18576 -33676 63532 -9197 8920 -156800
5066 381635 -53472 -66514 12088 82298 182702 -64522 126193 178169 370230 -57091 69931
5054 49668 167194 -145360 -110593 -89877 -187814 -119976 99573 -151062 148464 143320 -19908
5042 203589 230968 -144550 145348 36840 73996 -39235 -192226 58684 -176325 -188986 106690
5030 -9027 -40422 -139679 49111 265670 339058 476433 -288271 231184 -136690 99308 -111098
5018 158044 99693 -155540 107818 -63185 -86269 -30008 -135419 -285844 34868 132777 419844
5007 419844 228730 34602 50824 148854 -166548 -193650 54573 38323 -317655 -263995 -211328
4996 -211328 -5274 -419878 224089 -395120 120810 -218850 60418 269471 -98716 211940
4985 -71197 -123606 -133003 304662 -38480 178516 -43395 -58113 -198156 -38653 14342 181014
4974 181014 -99597 59985 118701 -130593 119782 -148306 144932 -69643 -74017 200655 -90323
4962 -120041 -86620 -299332 -24840 7846 -54613 171084 -136324 -87857 194855 121336 -248851
4950 289775 245155 112157 -120336 149862 223934 315062 -28448 144264 7191 228033 10685
4938 -48251 -70717 217556 136466 199981 133542 20314 -247189 -259035 -32745 -54015 134470
4926 23133 -70135 278002 177377 -47360 -66423 97848 -46004 -127779 236555 -202106 231536
4914 -319322 26993 11408 320412 -271826 -51256 181736 60750 -10931 131784 378836 -196419
4902 317081 -133414 34065 48884 -358037 76479 -132311 63789 -55808 -390423 -7198 -79603
4891 -79603 105166 498 -94417 -69898 -70412 9794 2791 -146064 22775 -71673 -254342 244723
4878 181932 90265 216021 -237339 196376 -32493 162301 55495 98107 9566 24040 316699
4867 316699 -130412 143216 129048 -167010 -82588 -188737 -168854 239873 115733 -115757
4856 -181864 -68188 197093 82561 15957 282032 400278 210687 5077 145080 211995 35809
4844 314100 83442 -216681 -168421 -85198 -183746 224953 -169919 -13718 30474 145887 -318050
4832 -36291 -270164 180696 64683 -92920 -145667 48737 12396 28162 125207 -54661 -170521
4821 -170521 98619 115468 -149254 -269200 130837 -36458 -36239 -237097 89174 64647 158486
4810 158486 111500 305537 -147850 -276697 -252790 -289447 131492 279420 -97508 165089
4799 176022 46711 217755 -44872 245179 72080 85623 67833 110086 172124 386245 -60267
4787 319047 140101 420308 -36012 -78888 232201 66118 47872 221295 -73540 -29150 -183858
4776 -183858 196743 27986 -205563 31868 73087 -178419 -22937 49974 -174435 360040 184085
4765 184085 6984 24303 47851 -73150 -168278 -139766 -126331 136020 121717 -45483 -302798
4754 -302798 -249740 201771 -66873 -301427 -202939 -444565 -50237 -21614 168067 -57309 111584
4742 13782 -130541 212429 131642 401764 -233520 285639 -118953 -178579 -77233 -137011 166749
4730 -58367 307697 299735 -217536 -116893 -99734 -202722 244952 -263345 25350 -146162 16699
4718 -66656 18157 181591 -126707 185108 3480 65621 -12750 3737 144228 -188565 -338661
4707 -338661 92416 -19326 -54029 -417236 167958 -145349 -87859 140725 -297930 -39427 152822
4695 88947 -44095 248397 333517 -48753 92935 -354740 30371 122926 38514 -123322 138042
4683 -123409 155853 248066 -247426 -107756 -54432 3587 201274 -30031 -157477 149008 -20216
4671 129439 251926 8843 107286 63071 -52747 -110531 172343 -211043 5243 -131026 -125536
4660 -125536 300370 19910 134341 84202 488792 -10934 -238803 37095 -26211 180668 -99056
4648 -112989 -26827 87040 -120653 120799 100690 30665 -63358 92948 79824 168015 39085
4636 317578 29189 90485 -356970 50363 -46376 42372 218027 -115325 360080 243876 -86407
4624 -27742 165255 -145066 -322054 44716 -119665 -171754 206431 -35365 -142056 -180218 -74226
4612 28851 -287372 84294 -81164 360202 170146 62189 23952 -413595 -189730 301926 112106
4600 -137709 352924 180375 -29359 228591 48565 -43212 326871 -122159 217337 -135344
4589 202753 -66098 70576 -93410 325870 44745 15685 -57321 -15395 383363 -286648 -168161
4578 -168161 -19990 75758 135815 104101 20636 -97767 112764 324704 15538 -64788 193954
4566 -187241 168869 148434 -19118 19717 51163 350033 183559 -68342 239845 -49583 127801
4554 -94967 -35625 22625 -13995 -93258 277187 24721 -110491 231908 197303 112521 -129730
4542 -92227 147863 178583 -16495 32732 -265275 -173729 272345 168151 -180136 253542 126298
4530 194552 -191460 -153929 206208 -67164 386158 -280193 124816 -41700 -61393 100695
4519 16187 12250 255452 120784 -227914 -108445 125284 268310 136652 168686 73223 268282
4508 268282 22778 -42522 -11403 -15891 -136717 339928 -24559 -51675 210173 -37225 -115577
4497 -115577 74444 388974 -126021 395781 -201545 -154473 2983 -143220 -272975 122868
$$ [...]
##END NTUPLES=NMR SPECTRUM
##END=
