
##TITLE=AC1300_CHIAH12112_6614048_owvnLmB4iw
##JCAMPDX= 6.0         $$ Bruker NMR JCAMP-DX V2.0
##DATA TYPE= NMR SPECTRUM
##DATA CLASS= NTUPLES
##ORIGIN= BRUKER
##OWNER= Administrator
$$ 1.72 TOPSPIN		Version 2.1
$$ 2012-08-02 16:49:44.796 -0500  Administrator@TOPSPIN
$$ Compression mode = diff/dup
##.OBSERVE FREQUENCY= 400.02188249412
##.OBSERVE NUCLEUS= ^1H
##.ACQUISITION MODE= SIMULTANEOUS (DQD)
##.ACQUISITION SCHEME= undefined
##.AVERAGES= 64
##.DIGITISER RES= 22
##SPECTROMETER/DATA SYSTEM= spect
##.PULSE SEQUENCE= noesygpps1d.comp
##.SOLVENT NAME= COFFEE_meoh
##.SHIFT REFERENCE= INTERNAL, COFFEE_meoh, 1, 14.96262
##AUDIT TRAIL= $$ (NUMBER, WHEN, WHO, WHERE, PROCESS, VERSION, WHAT)
$$ ##TITLE= Audit trail, TOPSPIN		Version 2.1
$$ ##JCAMPDX= 5.01
$$ ##ORIGIN= Bruker BioSpin GmbH
$$ ##OWNER= Administrator
$$ $$ C:\Bruker\TOPSPIN/data/COFFEE/nmr/AC1300_CHIAH12112_6614048_owvnLmB4iw/12/pdata/1/auditp.txt
$$ ##AUDIT TRAIL=  $$ (NUMBER, WHEN, WHO, WHERE, PROCESS, VERSION, WHAT)
(   1,<2012-08-02 16:49:32.937 -0500>,<Administrator>,<TOPSPIN>,<go>,<TOPSPIN 2.1>,
      <created by zg
	started at 2012-08-02 16:37:59.875 -0500,
	POWCHK enabled, PULCHK disabled,
       configuration hash MD5:
       6B 1B 68 BB D9 2E 58 E2 7F 35 AD 54 07 DF 0E 41
       data hash MD5: 64K
       29 42 3B 57 81 C0 9A A3 47 8C 4B F7 79 33 EF A8>)
(   2,<2012-08-02 16:49:41.953 -0500>,<Administrator>,<TOPSPIN>,<proc1d>,<TOPSPIN 2.1>,
      <Start of raw data processing
       efp LB = 0.3 FT_mod = 6 PKNL = 1 PHC0 = 0 PHC1 = 0 SI = 128K 
       data hash MD5: 128K
       52 FB 6A 5C 6B 21 2F C6 B0 B8 24 2A CE A2 26 A6>)
(   3,<2012-08-02 16:49:43.203 -0500>,<Administrator>,<TOPSPIN>,<proc1d>,<TOPSPIN 2.1>,
      <pk PHC0 = 2.823486 PHC1 = 0 
       data hash MD5: 128K
       CF BB E2 09 28 D7 C7 2D 77 2E F7 94 DA 88 46 5B>)
(   4,<2012-08-02 16:49:44.234 -0500>,<Administrator>,<TOPSPIN>,<proc1d>,<TOPSPIN 2.1>,
      <abs ABSG = 1 
       data hash MD5: 128K
       8F 98 0A 1D 77 0D 6C 57 5A 3A 18 6D 7C 78 20 FC>)
(   5,<2012-08-02 16:49:44.359 -0500>,<Administrator>,<TOPSPIN>,<proc1d>,<TOPSPIN 2.1>,
      <abs ABSG = 2 
       data hash MD5: 128K
       A8 26 FF 9C 36 E1 C4 4C 8A 52 90 B1 CA AA 8D 9E>)
(   6,<2012-08-02 16:49:44.421 -0500>,<Administrator>,<TOPSPIN>,<proc1d>,<TOPSPIN 2.1>,
      <abs ABSG = 3 
       data hash MD5: 128K
       B0 0D 66 61 67 C3 63 4A 6E 7F E6 82 C0 EE F1 FD>)
(   7,<2012-08-02 16:49:44.500 -0500>,<Administrator>,<TOPSPIN>,<proc1d>,<TOPSPIN 2.1>,
      <abs ABSG = 4 
       data hash MD5: 128K
       04 AD 3A FE 56 3A 65 85 5D 2D 37 6C F8 FA 0F 6A>)
(   8,<2012-08-02 16:49:44.593 -0500>,<Administrator>,<TOPSPIN>,<proc1d>,<TOPSPIN 2.1>,
      <abs ABSG = 5 
       data hash MD5: 128K
       35 E2 D6 3D B8 35 C9 0B 0B AD F9 22 F1 EF 44 81>)
$$ ##END=
$$ 
$$ $$ hash MD5
$$ $$ 4F 59 E1 28 E4 3D 19 5E 85 C7 7B FD 88 AE C6 67
##$RELAX= 
##$RELAX= 
##$RELAX= 
##$RELAX= 
##$RELAX= 
##$RELAX= 
##$RELAX= 
##$RELAX= 
$$ Bruker specific parameters
$$ [...]
150 150 150 150 150 150 150 150
##$TP07= 0
##$TPNAME0= <>
##$TPNAME1= <>
##$TPNAME2= <>
##$TPNAME3= <>
##$TPNAME4= <>
##$TPNAME5= <>
##$TPNAME6= <>
##$TPNAME7= <>
##$TPOAL= (0..7)
0.5 0.5 0.5 0.5 0.5 0.5 0.5 0.5
##$TPOFFS= (0..7)
0 0 0 0 0 0 0 0
##$TUNHIN= 0
##$TUNHOUT= 0
##$TUNXOUT= 0
##$USERA1= <user>
##$USERA2= <user>
##$USERA3= <user>
##$USERA4= <user>
##$USERA5= <user>
##$V9= 5
##$VALIST= <valist>
##$VCLIST= <CCCCCCCCCCCCCCC>
##$VD= 0
##$VDLIST= <DDDDDDDDDDDDDDD>
##$VPLIST= <PPPPPPPPPPPPPPP>
##$VTLIST= <TTTTTTTTTTTTTTT>
##$WBST= 1024
##$WBSW= 4
##$XGAIN= (0..3)
0 0 0 0
##$XL= 0
##$YL= 0
##$YMAX_a= 17528577
##$YMIN_a= -9984564
##$ZGOPTNS= <>
##$ZL1= 120
##$ZL2= 120
##$ZL3= 120
##$ZL4= 120
##$ABSF1= 14.96262
##$ABSF2= -5.595562
##$ABSG= 5
##$ABSL= 3
##$ALPHA= 0
##$AQORDER= 0
##$ASSFAC= 0
##$ASSFACI= 0
##$ASSFACX= 0
##$ASSWID= 0
##$AUNMP= <proc_prof1d_extract.lims>
##$AXLEFT= 0
##$AXNAME= <>
##$AXNUC= <1H>
##$AXRIGHT= 0
##$AXTYPE= 0
##$AXUNIT= <>
##$AZFE= 0.1
##$AZFW= 0.1
##$BCFW= 0
##$BC_mod= 0
##$BYTORDP= 0
##$COROFFS= 0
##$CY= 15
##$DATMOD= 1
##$DC= 0
##$DFILT= <>
##$DTYPP= 0
##$F1P= 0
##$F2P= 0
##$FCOR= 0.5
##$FTSIZE= 131072
##$FT_mod= 6
##$GAMMA= 0
##$GB= 0
##$INTBC= 1
##$INTSCL= 1
##$ISEN= 128
##$LB= 0.3
##$LEV0= 0
##$LPBIN= 0
##$MAXI= 10000
##$MC2= 0
##$MEAN= 0
##$ME_mod= 0
##$MI= 0
##$NCOEF= 0
##$NC_proc= -2
##$NLEV= 6
##$NOISF1= 0
##$NOISF2= 0
##$NSP= 0
##$NTH_PI= 0
##$NZP= 0
##$OFFSET= 14.96262
##$PC= 1
##$PHC0= 2.823486
##$PHC1= 0
##$PH_mod= 1
##$PKNL= yes
##$PPARMOD= 0
##$PPDIAG= 0
##$PPIPTYP= 0
##$PPMPNUM= 2147483647
##$PPRESOL= 1
##$PSCAL= 4
##$PSIGN= 0
##$PYNMP= <proc.py>
##$REVERSE= no
##$SF= 400.0200089902
##$SI= 131072
##$SIGF1= 0
##$SIGF2= 0
##$SINO= 400
##$SIOLD= 131072
##$SPECTYP= <>
##$SREGLST= <1H.CDCl3>
##$SSB= 0
##$STSI= 131072
##$STSR= 0
##$SW_p= 8223.68421052631
##$SYMM= 0
##$S_DEV= 0
##$TDeff= 65536
##$TDoff= 0
##$TI= <>
##$TILT= no
##$TM1= 0
##$TM2= 0
##$TOPLEV= 0
##$USERP1= <user>
##$USERP2= <user>
##$USERP3= <user>
##$USERP4= <user>
##$USERP5= <user>
##$WDW= 1
##$XDIM= 131072
##$YMAX_p= 405190303
##$YMIN_p= -22464
##$CURPLOT= <Network HP LaserJet P1505>
##$CURPRIN= <$Network HP LaserJet P1505>
##$DFORMAT= <normdp>
##$LAYOUT= <+/1D_H.xwp>
##$LFORMAT= <normlp>
##$PFORMAT= <normpl>
##$SURQMSG= 1
$$ End of Bruker specific parameters
$$ ---------------------------------
##NTUPLES= NMR SPECTRUM
##VAR_NAME=  FREQUENCY,     SPECTRUM/REAL,   SPECTRUM/IMAG
##SYMBOL=    X,             R,               I
##VAR_TYPE=  INDEPENDENT,   DEPENDENT,       DEPENDENT
##VAR_FORM=  AFFN,          ASDF,            ASDF
##VAR_DIM=   131072,        131072,          131072
##UNITS=     HZ,            ARBITRARY UNITS, ARBITRARY UNITS
##FACTOR=    0.0627417313425164, 1,          1
##FIRST=     8223.62146879497, 2928,         -62031
##LAST=      0,             5394,            -61703
##MIN=       0,             -22464,          0
##MAX=       8223.62146879497, 405190303,    0
$$ Real data points
##PAGE= N=1
##DATA TABLE= (X++(R..R)), XYDATA
$$ [...]
60941A1391044j406453j223237j054791r03093p68061o49004n47141m63546l96270
60932C979448l41700k97394k61712k32194k06488j84030j64947j48117j31998
60923B010868j16656j03326r2396q3289p5838p0326o6338o2911n9680n6815n4037
60912A169256n0690m6735m2751l9076l5692l2634k9864k7013k3999k1418j9622
60901G99762j7906j5554j3133j1693j1064j0075q285o327m682l134j545j24J119
60888F97359K354L360L759L817M152M611M355L212K073J670J690J430P97K66J33
60873G35038P6o15k254m099m855m205l361l600m725n579n671n371m944m387m058
60858F77390m397m953m608k954p48J089K204K603K499K494L231M638O074P203
$$ plain form
60941 11391044 9984591 8761354 7706563 6803470 6035409 5386405 4839264 4375718 3979448
60932 3979448 3637748 3340354 3078642 2846448 2639960 2455930 2290983 2142866 2010868
60923 2010868 1894212 1790886 1698490 1615201 1539363 1469037 1402699 1339788 1280108 1223293 1169256
60912 1169256 1118566 1071831 1029080 990004 954312 921678 891814 864801 840802 819384 799762
60901 799762 781856 766302 753169 741476 730412 720337 712052 705725 701043 697909 696364 696240 697359
60888 697359 699713 703073 706832 710649 714801 719412 723767 726979 729052 730722 732412 733842 734639 734905 735038
60873 735038 735114 734499 732245 728146 723291 719086 715725 712125 707400 701821 696150 690779 685835 681448 677390
60858 677390 672993 668040 663432 660478 659730 660819 663023 665626 668125 670619 673850 678488 684562 691765
60844F91765Q216R205J0100J1083J2338J3367J3384J2445J1462J0965J0611J0027
60832H24968R368Q827Q295P684P141O743O482O498O840P055O641N720M672L299
60818I20233J283p73j697j264l91Q6n6j000k766m573n480n880p063r090j0419
60803H71150j0103r040q475q495q681r061r541r402q334p103o402n838m879l877
60789G61919l264k553j227K23J177K134L854N885P198P940R160J0947J2144J2098
60775H27635J1563J1522J2013J2417J2320J1661J0499Q977P358N940M980M598
60763I41483M525M163L190J989J193J039J277J530J445Q80J84J3N16J058J045
60748I65530O80N94J099K101L345M284M170K777P76r76k232l143l729m049m454
$$ plain form
60844 691765 699981 709186 719286 730369 742707 756074 769458 781903 793365 804330 814941 824968
60832 824968 834336 843163 851458 859142 866283 873026 879508 886006 892846 899901 906542 912262 916934 920233
60818 920233 921516 920743 919046 917782 917391 917477 917421 916421 913655 909082 903602 897722 890659 881569 871150
60803 871150 861047 852007 843532 835037 826356 817295 807754 798352 790018 782915 776513 770675 765796 761919
60789 761919 758655 756102 754875 755098 756275 758409 762263 768148 775346 783286 792446 803393 815537 827635
60775 827635 839198 850720 862733 875150 887470 899131 909630 918607 925965 931905 936885 941483
60763 941483 946008 950171 953361 955350 956543 957582 958859 960389 961834 962714 962898 962911 963427 964485 965530
60748 965530 966210 966804 967903 970004 973349 977633 981803 984580 985356 984380 982148 979005 975276 971227 966773
60733I66773n113n624n658n609o021o686o929o586o046n559n035m417l689k678
60719H91123j426n46o51j455k055k089k079k575l444m228m865n813p412r276j0392
60704H32817j0077q712p245o057m821l513k712k644k600j888p22L42J265K103
60690G85536K288J182q54k694l649l927m075m554n717p505r255j0267j0590j0773
60676G15146j0918j0485r148p402o125n680n530m870l646k695k599k704j998o91
60662F40655N1o5o6M95O34m59j945k443j776p10L56J376K006K009J973K569L510
60645F48170M077M212M187L755K659J575J371J808K034K063K550L418L950M163
60631F89992M865O361Q147R844J1439J2659J3212J3567J4399J5358J5496J4893
$$ plain form
60733 966773 961660 956036 950378 944769 938748 932062 925133 918547 912501 906942 901907 897490 893801 891123
60719 891123 889697 889151 888500 887045 884990 882901 880822 878247 874803 870575 865710 859897 852485 843209 832817
60704 832817 822740 814028 806783 800726 795905 792392 789680 787036 784436 782548 781826 782168 783433 785536
60690 785536 787824 789006 788152 785458 781809 777882 773807 769253 763536 756031 746776 736509 725919 715146
60676 715146 704228 693743 684595 677193 671068 665388 659858 654988 651342 648647 646048 643344 641346 640655
60662 640655 640706 640641 640575 641070 641704 641245 639300 636857 635081 634371 634727 636103 638109 640118 642091 644660 648170
60645 648170 652247 656459 660646 664401 667060 668635 670006 671814 673848 675911 678461 681879 685829 689992
60631 689992 694857 701218 709365 719209 730648 743307 756519 770086 784485 799843 815339 830232
60619H30232J4529J4596J4265J3249J2273J1648J0739R193P473N778L715J517
60607I49207K64K89N26J00n09o29o02j026j795k687m093o194q225r395r828r848
60591H95555r141p624o332o304p090p341o550n272m063l170k937l498m193m246
60577H17794l858l844m325m604m287l609k699j393Q0J060J419J864K983M409N370
60562H06360N656N680N770N722N105L835K418J473J017N40o0m3J216L156M544
60547H52389N034N562P065R371J1709J3874J6415J9925K4494K9835L5589M1583
60535A072845M7886N4499O0620O4368O3735N8049M8280L5852K1574O031r532k3365
60523A500842l4186m1496m5074m4918m1765l6972l1491k5390j8661j1928o000
$$ plain form
60619 830232 844761 859357 873622 886871 899144 910792 921531 930724 938197 943975 947690 949207
60607 949207 949471 949760 950286 950386 949877 949248 948646 947620 945825 943138 939045 932851 924626 915231 905403 895555
60591 895555 886414 878790 872458 866154 859064 851723 845173 839901 835838 832668 829731 826233 822040 817794
60577 817794 813936 810092 805767 801163 796876 793267 790568 789175 789255 790315 791734 793598 796581 800990 806360
60562 806360 812016 817696 823466 829188 834293 838128 840546 842019 843036 843576 843516 843473 844689 847845 852389
60547 852389 857423 862985 870050 879421 891130 905004 921419 941344 965838 995673 1031262 1072845
60535 1072845 1120731 1175230 1235850 1300218 1363953 1422002 1470282 1506134 1527708 1533739 1524207 1500842
60523 1500842 1466656 1425160 1380086 1335168 1293403 1256431 1224940 1199550 1180889 1168961 1162961
60512A162961j160K675N522P475Q926J0121J0831J0925J0899J1478J3024J5823
60500A269500K0403K6972L4949M3775N3838O5902P9959R5402J12111J30532J50809
60489B084152J72679J96025K20798K46509K72577K98991L25774L51692L73946
60480D543143L88449L89581L70561L26288K56702J66707O3116m6941j54900k50684
60470F052022l25827l76633m04027m11350m02860l83115l56239l25492k93561
60461B772918k62507k33121k05145j78749j55125j35173j18395j03640r0357p8492
60451A212214o7980n8927n1658m5929m0709l5441l0802k7511k5101k2699k0381
60440G85076j8769j7783j6773j5621j4766j4271j3657j2567j0979q954o812n304
$$ plain form
60512 1162961 1161801 1164476 1169998 1177473 1186399 1196520 1207351 1218276 1229175 1240653 1253677 1269500
60500 1269500 1289903 1316875 1351824 1395599 1449437 1515339 1595298 1690700 1802811 1933343 2084152
60489 2084152 2256831 2452856 2673654 2920163 3192740 3491731 3817505 4169197 4543143
60480 4543143 4931592 5321173 5691734 6018022 6274724 6441431 6504547 6457606 6302706 6052022
60470 6052022 5726195 5349562 4945535 4534185 4131325 3748210 3391971 3066479 2772918
60461 2772918 2510411 2277290 2072145 1893396 1738271 1603098 1484703 1381063 1290706 1212214
60451 1212214 1144234 1085307 1033649 987720 947011 911570 880768 853257 828156 805457 785076
60440 785076 766307 748524 731751 716130 701364 687093 673436 660869 649890 640936 634124 628820
60428F28820m886m989m680l896l325l248l213k853k275j629q99k40N1K4J64Q07
60412E93733J809K736L134K717J714R88J370K770M192M735M368L783L692M242
60398F35983M999N448N581N772O108O162N581M637L895L565L397L100K583J899
60384F98710J028j75j740l192l788l440l001l101l132k273j117j013j889k160
60370F69717j174k35n27j345j435q54l66J58J287K594L036K475J715J282J215
60355F77543J716K882L985M210L915M137M925N426N533O124P413Q416Q509Q406
60341G53140Q929R714R925R584R339R317Q989Q110P158O779P089P638P996Q278
60327H71985R004J0366J1944J3394J5030J7119J8837J8724J6267J2373Q068L432
$$ plain form
60428 628820 623934 618945 614265 610369 607044 603796 600583 597730 595455 593826 592927 592687 592738 592762 592926 593733
60412 593733 595542 598278 601412 604129 605843 606831 608201 610971 615163 619898 624266 628049 631741 635983
60398 635983 640982 646430 652011 657783 663891 670053 675634 680271 684166 687731 691128 694228 696811 698710
60384 698710 699738 699563 697823 694631 690843 687403 684402 681301 678169 675896 674779 673766 671877 669717
60370 669717 668543 668308 667781 666436 665001 664147 663781 663939 665226 667820 670856 673331 675046 676328 677543
60355 677543 679259 682141 686126 690336 694251 698388 703313 708739 714272 720396 727809 736225 744734 753140
60341 753140 762069 771783 781708 791292 800631 809948 818937 827047 834205 840984 848073 855711 863707 871985
60327 871985 880989 891355 903299 916693 931723 948842 967679 986403 1002670 1015043 1023111 1026543
60315A026543j796p138j1571j4533j6196j6865j6665j5869j5091j4729j4464j3596
60303H68030j1937j0029q390o926n367l955l083k442j226O42K187K646K389K203
60289H24742K146J797J161O70M54L14L44R69K283L753M750N108N102N199N756
60274H64548O791P986R050R982J0875J1707J2533J3658J5352J7481J9623K1501
60262A021087K3187K5067K7667L1189L5145L8766M1929M5321M9548N4506N9846
60251A453258O5486P1404P7406Q3505R0122R7554J05565J13714J21617J28531
60241B408162J33351J35552J35598J33953J30218J23858J15252J05279R4154Q1410
60231C596787O6846N0889L4217J7524J491j3406k6853l8213m6559n1633n4256
$$ plain form
60315 1026543 1024747 1017609 1006038 991505 975309 958444 941779 925910 910819 896090 881626 868030
60303 868030 856093 846064 837674 830748 825381 821426 818343 815901 814675 815317 817504 820150 822539 824742
60289 824742 826888 828685 829846 830516 830970 831284 831628 832597 834880 838633 843383 848491 853593 858792 864548
60274 864548 871339 879325 888375 898357 909232 920939 933472 947130 962482 979963 999586 1021087
60262 1021087 1044274 1069341 1097008 1128197 1163342 1202108 1244037 1289358 1338906 1393412 1453258
60251 1453258 1518744 1590148 1667554 1751059 1841181 1938735 2044300 2158014 2279631 2408162
60241 2408162 2541513 2677065 2812663 2946616 3076834 3200692 3315944 3421223 3515377 3596787
60231 3596787 3663633 3714522 3748739 3766263 3767754 3754348 3727495 3689282 3642723 3591090 3536834
60220C536834n5199n4185n0477m4009l5246k4560j2424L20J3157K6494M0765N5474
60208C396944O9881Q4090R8420J12161J23948J33099J39588J43041J42822J38929
60198D582923J31730J21036J06510Q8861O9515M9139K7564N111j7134l8431n8570
60187E068254p6770r1548j02101j08880j12547j13056j10098j03605r3641q0549
60177D075459o5399m9474l3096j5728K609K0839L7924N3568O7521P9048Q7428
60166D260699R2307R3314R0108Q3167P3756O2824N0485L6875K2670Q452n614j8924
60154D850119k9956l7300m0738m0895l8107l2065k2350r098O729K3760M1254N9596
60142D730949P9364J00276J21655J43547J66435J90105K13921K38213K64083K91576
$$ plain form
60220 3536834 3481635 3427450 3376973 3332964 3297718 3273158 3260734 3261054 3274211 3300705 3341470 3396944
60208 3396944 3466825 3550915 3649335 3761496 3885444 4018543 4158131 4301172 4443994 4582923
60198 4582923 4714653 4835689 4942199 5031060 5100575 5149714 5177278 5182389 5165255 5126824 5068254
60187 5068254 4991484 4899936 4797835 4688955 4576408 4463352 4353254 4249649 4156008 4075459
60177 4075459 4010060 3960586 3927490 3911762 3914371 3935210 3973134 4026702 4094223 4173271 4260699
60166 4260699 4353006 4446320 4536428 4619595 4693351 4756175 4806660 4843535 4866205 4874657 4869043 4850119
60154 4850119 4820163 4782863 4742125 4701230 4663123 4631058 4608708 4599610 4606339 4630099 4671353 4730949
60142 4730949 4810313 4910589 5032244 5175791 5342226 5532331 5746252 5984465 6248548 6540124
60132F540124L19216L45683L70718L93778M13008M26458M33451M33875M26898
60123A0103209M11478L87709L56718L19301K75431K25084J69092J09141M7086
60114A2404249j5717p8427j39816j97682k49687k94585l31855l60270l77998l84386
60104I973826l80699l68663l49171l22904k91186k55417k16355j74626j31451
60095G483354q8143m5401l715L5937P2299J04363J31102J51111J63076J66384
60085H170367J61029J47418J26631J00373P0211L7309L048l0681o2360r1411j17627
60074H514307j40636j60471j77840j93182k05958k15369k21177k23260k21152
60065F755262k14843k05440j94124j80917j65338j47751j29092j09540q8585o6266
$$ plain form
60132 6540124 6859340 7205023 7575741 7969519 8382527 8808985 9242436 9676311 10103209
60123 10103209 10514687 10902396 11259114 11578415 11853846 12078930 12248022 12357163 12404249
60114 12404249 12388532 12310105 12170289 11972607 11722920 11428335 11096480 10736210 10358212 9973826
60104 9973826 9593127 9224464 8875293 8552389 8261203 8005786 7789431 7614805 7483354
60095 7483354 7395211 7349810 7346095 7382032 7454331 7558694 7689796 7840907 8003983 8170367
60085 8170367 8331396 8478814 8605445 8705818 8776029 8813338 8816386 8785705 8723345 8631934 8514307
60074 8514307 8373671 8213200 8035360 7842178 7636220 7420851 7199674 6976414 6755262
60065 6755262 6540419 6334979 6140855 5959938 5794600 5646849 5517757 5408217 5319632 5253366
60055E253366m3417k0615K169K4832M6798O7733Q7787J06703J23176J35561J43001
60044E927094J45568J43468J36503J24374J07355Q6387O2544L6600R337j8064
60034F761166m4518o9774r4071j16908j36760j52202j62800j68650j69742j66292
60024E479449j59263j49881j38739j25742j10735r3904p5673n6528l6795j6515
60014D515674M375K5815M7769P0462R3934J17428J39803J60517J79417J95529
60004E550723K07017K12763K13087K08339J97629J79890J55767J27601R7634O6765
59994G217215L4856J706l2236o5583r6364j22849j44174j60134j70689j75703
59984F286045j74961j68473j56983j41984j24808j05829q5047o3059m0623j7589
$$ plain form
60055 5253366 5209949 5189334 5191503 5216335 5263133 5330866 5418653 5525356 5648532 5784093 5927094
60044 5927094 6072662 6216130 6352633 6477007 6584362 6670749 6733293 6769893 6779230 6761166
60034 6761166 6716648 6646874 6552803 6435895 6299135 6146933 5984133 5815483 5645741 5479449
60024 5479449 5320186 5170305 5031566 4905824 4795089 4701185 4625512 4568984 4532189 4515674
60014 4515674 4520049 4545864 4593633 4664095 4758029 4875457 5015260 5175777 5355194 5550723
60004 5550723 5757740 5970503 6183590 6391929 6589558 6769448 6925215 7052816 7150450 7217215
59994 7217215 7252071 7253777 7221541 7155958 7059594 6936745 6792571 6632437 6461748 6286045
59984 6286045 6111084 5942611 5785628 5643644 5518836 5413007 5327960 5264901 5224278 5206689
59974E206689O485L0646N2768P1780Q8402J03202J15216J23203J27129J27553
59964F053073J24577J18382J09881R9787Q7772P3547N8091M2846K8341J4637K436
59953F813370p333j4481j8935j9668j5471o491O235K2492M3001O7934R6602J28680
59941G095935J64576K04326K46995K91403L36653L81645M24639M63539M96083
59932A0105794N19599N31057N27595N06901M67444M08966L32940K42344J41166
59923A3783806L4408p1990j72042k60907l35350l93684m35745m62482m75021m74319
59913A0736674m61985m40724m13264l81163l45191l06311k65452k22925j78933
59904G720726j34373r0292m6869l821L8383P8631J16281J51188J82609K08841
$$ plain form
59974 5206689 5213174 5243820 5296588 5368368 5456770 5559972 5675188 5798391 5925520 6053073
59964 6053073 6177650 6296032 6405913 6505700 6593472 6667019 6725110 6767956 6796297 6810934 6813370
59953 6813370 6806037 6791556 6772621 6752953 6737482 6730991 6737226 6759718 6802719 6870653 6967255 7095935
59941 7095935 7260511 7464837 7711832 8003235 8339888 8721533 9146172 9609711 10105794
59932 10105794 10625393 11156450 11684045 12190946 12658390 13067356 13400296 13642640 13783806
59923 13783806 13818214 13746224 13574182 13313275 12977925 12584241 12148496 11686014 11210993 10736674
59913 10736674 10274689 9833965 9420701 9039538 8694347 8388036 8122584 7899659 7720726
59904 7720726 7586353 7496061 7449192 7445371 7483754 7562385 7678666 7829854 8012463 8221304
59894H221304K27969K38381K38652K27745K05346J71583J26648P1529R035n6650
59884I681542j21512j82452k36966k83040l19520l46009l62432l69213l67669
59875G092729l59481l45840l27550l05751k81767k56476k30478k04706j80147
59866D600533j57132j35581j15866r8720q4476p3103o4801n9738n7349n6646n7073
59855C640048n8296n9287n8599n5607n0786m4798l8019l0863k3749j6767j0180
59844C193097n157l082m139p356j2022j8200k5755l3836m1438m7746n1880n3174
59832B889312n1896m8940m4771l9409l3350k7354k1181j3685m561M918J3482K1292
59820B643857K9239L7628M6196N4816O3331P1025P6877Q0312Q1388Q0403P7586
$$ plain form
59894 8221304 8449273 8687654 8926306 9154051 9359397 9530980 9657628 9729157 9738192 9681542
59884 9681542 9560030 9377578 9140612 8857572 8538052 8192043 7829611 7460398 7092729
59875 7092729 6733248 6387408 6059858 5754107 5472340 5215864 4985386 4780680 4600533
59866 4600533 4443401 4307820 4191954 4093234 4008758 3935655 3870854 3811116 3753767 3697121 3640048
59855 3640048 3581752 3522465 3463866 3408259 3357473 3312675 3274656 3243793 3220044 3203277 3193097
59844 3193097 3187940 3184858 3180719 3173363 3161341 3143141 3117386 3083550 3042112 2994366 2942486 2889312
59832 2889312 2837416 2788476 2743705 2704296 2670946 2643592 2622411 2608726 2604165 2609083 2622565 2643857
59820 2643857 2673096 2710724 2756920 2811736 2875067 2946092 3022969 3103281 3184669 3265072 3342658
59809C342658P3141O7387O0790N3632M5531L5655K3924J1733R70p442j3476j6911
59797C677592j7181j4197q490n12R540K1215L4060M8458O5444Q5446J08021J32970
59785D142366J60993J92877K28643K67754L09558L53000L96080M35625M67304
59776F954200M85837M85560M61131M08394L26289K19553R9352k0236j27280k14346
59766I078454k77876l17578l36514l39725l31609l14931k92094k65890k38342
59757F363895k09973j80915j51959j24031r7479p2417m9081k7422o975J2517L1051
59746E487211M9090O7493Q6460J05476J24646J45106J67547J91401K16170K42639
59736F883239K71952L04266L39134L76540M16658M58990N02536N46443N89739
$$ plain form
59809 3342658 3415799 3483186 3543976 3597608 3643139 3678794 3702718 3714451 3715421 3707979 3694503 3677592
59797 3677592 3660411 3646214 3637724 3637212 3646752 3667967 3702027 3750485 3815929 3901375 4009396 4142366
59785 4142366 4303359 4496236 4724879 4992633 5302191 5655191 6051271 6486896 6954200
59776 6954200 7440037 7925597 8386728 8795122 9121411 9340964 9440316 9420080 9292800 9078454
59766 9078454 8800578 8483000 8146486 7806761 7475152 7160221 6868127 6602237 6363895
59757 6363895 6153922 5973007 5821048 5697017 5599538 5527121 5478040 5450618 5443643 5456160 5487211
59746 5487211 5536301 5603794 5690254 5795730 5920376 6065482 6233029 6424430 6640600 6883239
59736 6883239 7155191 7459457 7798591 8175131 8591789 9050779 9553315 10099758 10689497
59727A0689497O30846O67885O99138P22622P35659P35804P22263O96196O60097
59718A6960007O17506N73024N31839M98814M77806M71193M79622N02233N37221
59709B1649265N81797O31736O81731P26486P61027P79999P77954P51143O98650
59700B8039788O21493N21684M03103K72546J38695R888j06899k05778k82156l33569
59690B9078795l59717l61603l40958l00237k42208j69145q2536J6379J26109K45078
59680B7609957L71945N05478O43843P83751R20104J046367J155129J238135J286100
59671C5560809J289179J238343J127073R53018P19592M36935J21351k06685n25143
59662D0714472q13355j054990j239990j364584j430331j443439j413785j352713
$$ plain form
59727 10689497 11320343 11988228 12687366 13409988 14145647 14881451 15603714 16299910 16960007
59718 16960007 17577513 18150537 18682376 19181190 19658996 20130189 20609811 21112044 21649265
59709 21649265 22231062 22862798 23544529 24271015 25032042 25812041 26589995 27341138 28039788
59700 28039788 28661281 29182965 29586068 29858614 29997309 30007197 29900298 29694520 29412364 29078795
59690 29078795 28719078 28357475 28016517 27716280 27474072 27304927 27222391 27238770 27364879 27609957
59680 27609957 27981902 28487380 29131223 29914974 30835078 31881445 33036574 34274709 35560809
59671 35560809 36849988 38088331 39215404 40168422 40888014 41324949 41446300 41239615 40714472
59662 40714472 39901117 38846127 37606137 36241553 34811222 33367783 31953998 30601285
59654C0601285j270957j178720j086933j006897r48173r16912r15132r39413r79953
59645B1358195j022940j055910j071542j067462j044445j005633r55704q98963
59637A3235596q38094p75008p11893o50656n92149n36696m84843m36861l92230
59628G817166l50555l12337k78104k47286k18811j92331j68069j45977j25910
59619E777786j08201r3187q0443o9383o0307n4083n1084n1165n4337o0496o8641
59608E026459p7236q5452r3333j00705j06751j10779j12785j13004j11403j07869
59598D007142j02642r6286q9344q1990p4001o5176n5855m6852l8608l0741k2620
59587C303027j4218o187Q06O614J1647J6433K0941K4381K5994K6066K5754K5826
$$ plain form
59654 30601285 29330328 28151608 27064675 26057778 25109605 24192693 23277561 22338148 21358195
59645 21358195 20335255 19279345 18207803 17140341 16095896 15090263 14134559 13235596
59637 13235596 12397502 11622494 10910601 10259945 9667796 9131100 8646257 8209396 7817166
59628 7817166 7466611 7154274 6876170 6628884 6410073 6217742 6049673 5903696 5777786
59619 5777786 5669585 5576398 5495955 5426572 5366265 5312182 5261098 5209933 5155596 5095100 5026459
59608 5026459 4949223 4863771 4770438 4669733 4562982 4452203 4339418 4226414 4115011 4007142
59598 4007142 3904500 3808214 3718870 3636880 3562879 3497703 3441848 3394996 3356388 3325647 3303027
59587 3303027 3288809 3282622 3283428 3290042 3301689 3318122 3339063 3363444 3389438 3415504 3441258 3467084
59575C467084K6196K6704K7715K9613L2336L5819M0421M6461N3628O1335O9379
59564C916691P8038Q7706R8667J10948J24300J38478J53596J69893J87299K05760
59554E271376K25683K47332K69760K91213L10699L28379L44380L58129L69015
59545H015966L76661L80236L78599L71717L61142L48496L34271L18537L02128
59536A1187753K86351K71942K58585K44995K29644K12505J96122J83621J75193
59527A3246711J67677J57781J44171J25755R9980O4447J9188l3874r2769j55490
59517A3743577k19274k81356l39847l92813m37395m71299m94434n07916n12223
59508A0087020n07815m96610m80981m61676m38432m12205l84991l57538l29043
$$ plain form
59575 3467084 3493280 3519984 3547699 3577312 3609648 3645467 3685888 3732349 3785977 3847312 3916691
59564 3916691 3994729 4082435 4181102 4292050 4416350 4554828 4708424 4878317 5065616 5271376
59554 5271376 5497059 5744391 6014151 6305364 6616063 6944442 7288822 7646951 8015966
59545 8015966 8392627 8772863 9151462 9523179 9884321 10232817 10567088 10885625 11187753
59536 11187753 11474104 11746046 12004631 12249626 12479270 12691775 12887897 13071518 13246711
59527 13246711 13414388 13572169 13716340 13842095 13942075 14006522 14025710 13991836 13899067 13743577
59517 13743577 13524303 13242947 12903100 12510287 12072892 11601593 11107159 10599243 10087020
59508 10087020 9579205 9082595 8601614 8139938 7701506 7289301 6904310 6546772 6217729
59499F217729k99303k69557k41020k13978j88733j65970j45694j26889j08761
59490D457824r1328p4595n8091m1677k5789j0508M830K0697L6826N2982O9516
59479D340687Q6867J05117J24414J45135J67276J90167K13130K35910K58239K79371
59469F146313K98227L13575L23935L27672L23352L09790K85950K51423K06944
59460H787181J54050R4377K9862l6533j01110j60687k13189k57300k92243l18015
59450G686393l35145l44041l45068l39276l28425l14120k97381k79056k60037
59441D843844k40761k21165k01362j82070j64095j47621j32305j17775j03837
59432C332853r0383p7368o4954n3525m3427l4591k6505j8730j1313m480J858P887
$$ plain form
59499 6217729 5918426 5648869 5407849 5193871 5005138 4839168 4693474 4566585 4457824
59490 4457824 4366496 4291901 4233810 4192133 4166344 4155836 4160666 4181363 4218189 4271171 4340687
59479 4340687 4427554 4532671 4657085 4802220 4969496 5159663 5372793 5608703 5866942 6146313
59469 6146313 6444540 6758115 7082050 7409722 7733074 8042864 8328814 8580237 8787181
59460 8787181 8941231 9035608 9065470 9028937 8927827 8767140 8553951 8296651 8004408 7686393
59450 7686393 7351248 7007207 6662139 6322863 5994438 5680318 5382937 5103881 4843844
59441 4843844 4603083 4381918 4180556 3998486 3834391 3686770 3554465 3436690 3332853
59432 3332853 3242470 3165102 3100148 3046623 3003196 2968605 2942100 2923370 2912057 2907577 2909435 2917322
59420B917322J3374J7952K1865K5750K9735L3423L6787M0232M3801M7231N0790
59409C278262N4754N7898N8125N5477N3190N4754O0935P0502Q2574R7021J13663
59398D037155J32578J54318J78360K02083K23145K42637K64514K91996L25669
59389F052455L64539M07271M52176M97237N40512N79872O12602O36117O48794
59380A0791575O49428O36649O10184N72292N26720M76495M23700L70683L19648
59371A5377374K71182K24526J79205J35012R0655M4058n740n8287j13249j70569
59361A5974167k28678k83963l32563l71804l99775m14903m16741m06416l86004
59352A2733320l58115l26171k94089k65378k42934k29191k25272k30074k41390
$$ plain form
59420 2917322 2930696 2948648 2970513 2996263 3025998 3059421 3096208 3136440 3180241 3227472 3278262
59409 3278262 3333016 3390914 3449039 3504516 3557706 3612460 3673395 3743897 3826471 3923492 4037155
59398 4037155 4169733 4324051 4502411 4704494 4927639 5170276 5434790 5726786 6052455
59389 6052455 6416994 6824265 7276441 7773678 8314190 8894062 9506664 10142781 10791575
59380 10791575 11441003 12077652 12687836 13260128 13786848 14263343 14687043 15057726 15377374
59371 15377374 15648556 15873082 16052287 16187299 16277954 16322012 16316272 16257985 16144736 15974167
59361 15974167 15745489 15461526 15128963 14757159 14357384 13942481 13525740 13119324 12733320
59352 12733320 12375205 12049034 11754945 11489567 11246633 11017442 10792170 10562096 10320706
59343A0320706k57887k78803l01992l23870l41657l54423l61817l63242l58734
59334G378281l49266l35627l18064k97445k75554k53628k31624k09429j87707
59325D919937j67086j47504j28977j12063r7026q3288p0253n7952m6531l5898
59315C973359k6162j7589r748j574P392J6619K5644L4617M3557N2017N9757O6917
59303D224806P3292P8421Q2560Q6395Q9485R0288Q8218Q4466Q0108P4646O7323
59292E120008N8935N1326M5608M1718L9194L7835L7914M0235M5518N3498O3249
59281E635038P4470Q7645J02589J17784J31551J43074J51787J56645J56649J51479
59271F908711J41162J25720J05524Q1469N4468K5460l950l1731n6847p9646j00450
$$ plain form
59343 10320706 10062819 9784016 9482024 9158154 8816497 8462074 8100257 7737015 7378281
59334 7378281 7029015 6693388 6375324 6077879 5802325 5548697 5317073 5107644 4919937
59325 4919937 4752851 4605347 4476370 4364307 4267281 4183993 4113740 4055788 4009257 3973359
59315 3973359 3947197 3929608 3919860 3918286 3925678 3942297 3967941 4002558 4046115 4098132 4157889 4224806
59303 4224806 4298098 4376519 4459079 4545474 4634959 4725247 4813465 4897931 4978039 5052685 5120008
59292 5120008 5178943 5230269 5275877 5317595 5356789 5394624 5432538 5472773 5518291 5571789 5635038
59281 5635038 5709508 5797153 5899742 6017526 6149077 6292151 6443938 6600583 6757232 6908711
59271 6908711 7049873 7175593 7281117 7362586 7417054 7442514 7438564 7406833 7349986 7270340 7169890
59260G169890j18355j31713j39103j39632j33238j21304j06204q9689p2159n3729
59250F064764l5246j7791j864J2516K5420L7083M7854N7929O7559P7577Q9050
59239F424851J02375J17486J34853J55443J79649K07073K37274K69699L02908
59230H131611L34863L63780L87527M02402M04187L90729L62194L18796K60162
59221A1356251J87399J04044J4107p9334j72832k61549l40811m07750m60655m98106
59211I440764n19864n27633n23812n10145m88300m60724m29925l97541l64762
59202E218058l32669l01594k71057k41280k13725j89545j68336j49215j32075
59193C218562j17053j03897r2683q4097p8065p3138o8167o3600o0118n7094n3457
$$ plain form
59260 7169890 7051535 6919822 6780719 6641087 6507849 6386545 6280341 6190652 6118493 6064764
59250 6064764 6029518 6011727 6009863 6022379 6047799 6084882 6132736 6190665 6258224 6335801 6424851
59239 6424851 6527226 6644712 6779565 6935008 7114657 7321730 7559004 7828703 8131611
59230 8131611 8466474 8830254 9217781 9620183 10024370 10415099 10777293 11096089 11356251
59221 11356251 11543650 11647694 11661801 11582467 11409635 11148086 10807275 10399525 9938870 9440764
59211 9440764 8920900 8393267 7869455 7359310 6871010 6410286 5980361 5582820 5218058
59202 5218058 4885389 4583795 4312738 4071458 3857733 3668188 3499852 3350637 3218562
59193 3218562 3101509 2997612 2904929 2820832 2742767 2669629 2601462 2537862 2477744 2420650 2367193
59182B367193m9204m4924m0652l6297l2335k9004k5526k1182j6425j1917p403
59171B052324k585J771M960P846J1821J6758K1336K5058K8623L2554L6561M0358
59159B277385M4127M8067N2148N6300O0440O4530O8859P3824P9189Q4175Q8565
59148B997609R2924R7325J00831J02752J03554J03762J02862J00019R5124Q8517
59138C985279Q0498P1661O2844N4146M4956L5494K7253K1301J7346J5133J5412
59127D431323J8635K4107L1494M1889N6162P3516R2875J14356J38005J62414J86252
59116E371028K09972K34139K56894K74995K86559K91064K87243K73006K47234
59107G732134K10145J62395J05572M3469j8759p6843j27890j69329j99146k17267
$$ plain form
59182 2367193 2317989 2273065 2232413 2196116 2163781 2134777 2109251 2088069 2071644 2059727 2052324
59171 2052324 2049739 2051510 2056470 2064316 2076137 2092895 2114231 2139289 2167912 2200466 2237027 2277385
59159 2277385 2321512 2369579 2421727 2478027 2538467 2602997 2671856 2745680 2824869 2909044 2997609
59148 2997609 3090533 3187858 3288689 3391441 3494995 3598757 3701619 3801638 3896762 3985279
59138 3985279 4065777 4137438 4200282 4254428 4299384 4334878 4362131 4383432 4400778 4415911 4431323
59127 4431323 4449958 4474065 4505559 4547448 4603610 4677126 4770001 4884357 5022362 5184776 5371028
59116 5371028 5581000 5815139 6072033 6347028 6633587 6924651 7211894 7484900 7732134
59107 7732134 7942279 8104674 8210246 8253715 8234956 8158113 8030223 7860894 7661748 7444481
59097G444481k25416k25561k19361k08755j95806j81971j68399j56494j47246
59088E715472j40534j36056j34342j35675j38777j41911j44803j48051j51307
59079D444016j53494j54411j54530j53611j51065j47320j43274j38609j32290
59070C115412j24571j16886j09745j02242r3798q5002p6484o8235o0208n2508
59060B225733m4945l7452l0864k6299k3839k2866k3397k5788k9374l2872l6035
59049A892002l9527m3075m5214m5157m3669m1759l9522l6661l3206k9412k5610
59038A469190k2230j9380j6503j3133r679o686l721j3M150P771J0656J3433J6181
59025A430036J8170J8875J8319J6545J3656J0262P070M160J464n56j514j887k135
$$ plain form
59097 7444481 7219065 6993504 6774143 6565388 6369582 6187611 6019212 5862718 5715472
59088 5715472 5574938 5438882 5304540 5168865 5030088 4888177 4743374 4595323 4444016
59079 4444016 4290522 4136111 3981581 3827970 3676905 3529585 3386311 3247702 3115412
59070 3115412 2990841 2873955 2764210 2661968 2568170 2483168 2406684 2338449 2278241 2225733
59060 2225733 2180788 2143336 2112472 2086173 2062334 2039468 2016071 1990283 1960909 1928037 1892002
59049 1892002 1852475 1809400 1764186 1719029 1675360 1633601 1594079 1557418 1524212 1494800 1469190
59038 1469190 1446960 1427580 1411077 1397944 1388265 1381579 1377858 1377845 1381995 1389766 1400422 1413855 1430036
59025 1430036 1448206 1467081 1485400 1501945 1515601 1525863 1532933 1537093 1538557 1538001 1536487 1534600 1532465
59012A532465j635M04L547O823J0239J4196J7947K0168K0784K0769K0384J9057
59000A685148J6739J3927J0562O416K397q2j026j735k731l243k777j828q10M35
58986A721392J958L577N438P706R919J1638J3367J5610J7637J8589J9324K1443
58974A867598K4785K7728K9787L2110L5304L8669M1760M5020M8492N1360N3157
58963B295770N4168N4457N3805N2599N1503N0239M8162M6002M5485M7265N0537
58952B849992N4656N9618O5087P0656P7016Q5153R4461J03460J12317J22707J35117
58941C830240J48347J61916J76782J93332K10737K28851K48731K70672K93909
58932E763517L18909L47830L81699M19100M58780N01699N49145O00528O54338
$$ plain form
59012 1532465 1530830 1531234 1534781 1541604 1551843 1566039 1583986 1604154 1624938 1645707 1666091 1685148
59000 1685148 1701887 1715814 1726376 1732792 1735189 1735107 1734081 1732346 1729615 1726372 1723595 1721767 1720957 1721392
58986 1721392 1723350 1726927 1732365 1740071 1749990 1761628 1774995 1790605 1808242 1826831 1846155 1867598
58974 1867598 1892383 1920111 1949898 1982008 2017312 2055981 2097741 2142761 2191253 2242613 2295770
58963 2295770 2349938 2404395 2458200 2510799 2562302 2612541 2660703 2706705 2752190 2799455 2849992
58952 2849992 2904648 2964266 3029353 3100009 3177025 3262178 3356639 3460099 3572416 3695123 3830240
58941 3830240 3978587 4140503 4317285 4510617 4721354 4950205 5198936 5469608 5763517
58932 5763517 6082426 6430256 6811955 7231055 7689835 8191534 8740679 9341207 9995545
58923I995545P09834P66201Q21118Q71448R14456R47133R65091R63224R37181
58914A7891231Q83810Q01280O89840N52202L92951K18288L6298j43877l13960
58905B1008063m67427n99018p04992p84387q38828q70753q82601q77479q58958
58896A4123620q29699p91608p47368p00350o52643o04610n56699n10147m65698
58887H264798m23247l83226l46783l14288k85327k60391k40653k25585k12775
58878E572523k00805j90302j81387j72191j61177j49186j37831j27379j17309
58869D134956j07592r8212q8701p9207p0831o3971n7581n0930m4665l9260l3838
58858C400168k7625k1167j5060q809k055M385R824J4970K0768K7127L3677M0647
$$ plain form
58923 9995545 10705379 11471580 12292698 13164146 14078602 15025735 15990826 16954050 17891231
58914 17891231 18775041 19576321 20266161 20818363 21211314 21429602 21465900 21322023 21008063
58905 21008063 20540636 19941618 19236626 18452239 17613411 16742658 15860057 14982578 14123620
58896 14123620 13293921 12502313 11754945 11054595 10401952 9797342 9240643 8730496 8264798
58887 8264798 7841551 7458325 7111542 6797254 6511927 6251536 6010883 5785298 5572523
58878 5572523 5371718 5181416 5000029 4827838 4666661 4517475 4379644 4252265 4134956
58869 4134956 4027364 3929152 3840451 3761244 3690413 3626442 3568861 3517931 3473266 3434006 3400168
58858 3400168 3372543 3351376 3336316 3327507 3325452 3329837 3339661 3354631 3375399 3402526 3436203 3476850
58846C476850M8085N5370O2426P0217P9171Q8392R7328J06829J17654J29268J41260
58835D472850J54472J69576J85731K02014K19070K38204K59787K83652L10101
58826F495457L39497L71828M07540M47681M92426N40516N90949O43860O98850
58817A1028604P53719Q05687Q52472Q91146R17219R26021R13842Q77088Q12194
58808A8777992P17862N96356M51699K88206J12002o7879k41820m02419n44233
58799A9687766o62695p55205q22181q65500q86751q88199q74071q49012q15994
58790A2268158p76918p34211o90255o46104o02131n59238n18162m78580m40166
58781F822393m03832l70727l40841l13560k88684k65915k44433k24057k05833
$$ plain form
58846 3476850 3524935 3580305 3642731 3712948 3792119 3880511 3977839 4084668 4202322 4331590 4472850
58835 4472850 4627322 4796898 4982629 5184643 5403713 5641917 5901704 6185356 6495457
58826 6495457 6834954 7206782 7614322 8062003 8554429 9094945 9685894 10329754 11028604
58817 11028604 11782323 12588010 13440482 14331628 15248847 16174868 17088710 17965798 18777992
58808 18777992 19495854 20092210 20543909 20832115 20944117 20876238 20634418 20231999 19687766
58799 19687766 19025071 18269866 17447685 16582185 15695434 14807235 13933164 13084152 12268158
58790 12268158 11491240 10757029 10066774 9420670 8818539 8259301 7741139 7262559 6822393
58781 6822393 6418561 6047834 5706993 5393433 5104749 4838834 4594401 4370344 4164511
58772D164511j90459j77225j65339j54979j46025j37202j27681j18218j09505
58763B837878j00922r2062q3934p7178p0663o3432n6495n1041m6322m1175l6222
58752B118432l2654l0025k7236k4566k2821k1457j9514j7473j6375j5920j5229
58741A875162j4643j4947j5666j5862j5917j6803j8381j9934k1590k3574k5043
58730A672802k5327k5360k6219k7202k7129k6565k6857k7825k8334k8309k8326
58719A375349k8010k6730k5189k4424k3944k2632k0737j9172j7694j5649j3717
58708A137451j2888j2386j0745q344o779o247n532m286l327k985k914l242m237
58695A053539n268n734o456q504j1194j3017j3942j4962j5968j6015j5286j4829
$$ plain form
58772 4164511 3974052 3796827 3631488 3476509 3330484 3193282 3065601 2947383 2837878
58763 2837878 2736956 2644894 2560960 2483782 2413119 2349687 2293192 2242151 2195829 2154654 2118432
58752 2118432 2085778 2055753 2028517 2003951 1981130 1959673 1940159 1922686 1906311 1890391 1875162
58741 1875162 1860519 1845572 1829906 1814044 1798127 1781324 1762943 1743009 1721419 1697845 1672802
58730 1672802 1647475 1622115 1595896 1568694 1541565 1515000 1488143 1460318 1431984 1403675 1375349
58719 1375349 1347339 1320609 1295420 1270996 1247052 1224420 1203683 1184511 1166817 1151168 1137451
58708 1137451 1124563 1112177 1101432 1093088 1086309 1080062 1074530 1070244 1066917 1063932 1061018 1057776 1053539
58695 1053539 1048271 1042537 1036081 1027577 1016383 1003366 989424 974462 958494 942479 927193 912364
58683I12364j4658j3860j2361j0910r664q282p035o352n784m776l787l218k244
58670H09433k82J371J356O50J155K745L913M531N706P400Q455Q553Q166P016M718
58655H74886K444J859K794L847M744O131P742Q993J0711J3918J7490J9389J9872
58642I94820K1017K3414K5834K7967L1001L5326M0021M4771N0242N6422O2589
58631A413424O8975P6662Q5845R5998J07527J21429J37534J54941J73778J94603
58621B630716K16477K37684K57929K77582K94960L06537L09724L03453K86350
58612E121412K56513K13371J58280R3832K4198m4599j06986j60155k02864k33460
58602E119542k51385k59248k60546k56123k45521k30602k14644j98607j81701
$$ plain form
58683 912364 897706 883846 871485 860575 850911 842629 835594 829242 823458 818682 814895 811677 809433
58670 809433 809151 810522 811878 812528 813683 816428 820341 824872 830578 837978 846433 854986 863152 870168 874886
58655 874886 877330 879189 881983 885830 890574 896705 904447 913440 924151 938069 955559 974948 994820
58642 994820 1015837 1039251 1065085 1093052 1124053 1159379 1199400 1244171 1294413 1350835 1413424
58631 1413424 1482399 1559061 1644906 1740904 1848431 1969860 2107394 2262335 2436113 2630716
58621 2630716 2847193 3084877 3342806 3620388 3915348 4221885 4531609 4835062 5121412
58612 5121412 5377925 5591296 5749576 5843408 5867606 5823007 5716021 5555866 5353002 5119542
58602 5119542 4868157 4608909 4348363 4092240 3846719 3616117 3401473 3202866 3021165
58593C021165j64948j50615j38433j25999j12996j01503r1974q2581p2875o4576
58583A914665n7980n1109m3415l7105l3624l1734l0214k9640l0255l0691l0078
58572A508820k9246k8711k7624k5601k3497k1628j9280j6611j4900j4347j3772
58561A273603j3062j3643j5888j8309j9871k0954k1563k0824j8869j7111j6065
58550A077444j4845j3132j1520r854p429n005m213m847n149m819n186o351o888
58537I78206o576o619p044o711o108p045r219j0296r868j0128j1922j3416j3588
58524H59666j3835j5026j5918j5633j5010j4420j3009j1016j0083j0286r655p535
58512G08240n664m982m241k725j519j063k71R61J198L74L83J763K751K582K738
$$ plain form
58593 3021165 2856217 2705602 2567169 2441170 2328174 2226671 2134697 2052116 1979241 1914665
58583 1914665 1856685 1805576 1762161 1725056 1691432 1659698 1629484 1599844 1569589 1538898 1508820
58572 1508820 1479574 1450863 1423239 1397638 1374141 1352513 1333233 1316622 1301722 1287375 1273603
58561 1273603 1260541 1246898 1231010 1212701 1192830 1171876 1150313 1129489 1110620 1093509 1077444
58550 1077444 1062599 1049467 1037947 1028093 1020664 1015659 1011446 1006599 1001450 996631 991445 985094 978206
58537 978206 971630 965011 957967 951256 945148 938103 928884 918588 908720 898592 886670 873254 859666
58524 859666 845831 830805 814887 799254 784244 769824 756815 745799 735716 725430 715775 708240
58512 708240 702576 697594 693353 690628 689109 688046 687775 688736 689934 690308 690691 692454 695205 697787 700525
58497G00525L862M490M019L962M966N527M875M320M561M480L784L913N173N880
58483G64337N350M883M853M006K599K753M556N278L844K498K620K481Q56p81j475
58468H08658k747n285p065o894o634p835r165r231q958r212r004p945p565q305
58454G02813q234o557n319n814o347n458m192l362j763R66K907L260L935O019
58440F72854P898Q616R631J1338J1619R807Q348Q323P236L625jj374j835k840
58426G53245k995j403k39r01j182P59L087L883M467O153P242O412N654O626P554
58411G98362O856O408P874R242Q422O959O816O789N337L666K769Q48k963n931
58397H61454o168o081p881r431q367o569o502o684m984k941k605k430n31J261
$$ plain form
58497 700525 704387 708877 712896 716858 721824 727351 732226 736546 741107 745587 749371 753284 758457 764337
58483 764337 769687 774570 779423 783429 786028 788781 793337 798615 802459 804957 807577 810058 810914 810133 808658
58468 808658 805911 800626 793561 786667 780033 772198 763033 753802 744844 735632 726628 718683 711118 702813
58454 702813 694579 688022 682703 676889 670542 665084 660892 657530 655767 656733 659640 662900 666835 672854
58440 672854 680752 689368 698999 710337 721956 731763 740111 748434 755670 759295 759294 757920 756085 753245
58426 753245 750250 748847 748608 747707 746525 747284 750371 754254 758721 764874 772116 778528 784182 790808 798362
58411 798362 805218 811626 819500 828742 837164 844123 850939 857728 863065 866731 869500 870348 867385 861454
58397 861454 855286 849205 841324 831893 823526 816957 810455 803771 798787 795846 793241 790811 790280 791541
58383G91541Q60J45J405K819J900J96J16K08j776m094l940k364j786j418M05K202
58367G86419K087J717L210N018N127N199P144Q851Q026O983Q746J1515J2027J1314
58353H83383J2126J3537J3146J1847J1465J0589P506M266L065J881j365l920k779
58340I64747m93p98j942l13K687L488K992M152N865N455M492O041Q666R178Q642
58325A022859R741J1097J0222R226J1351J4637J5283J4389J5281J7082J7223J7142
58313A185533J9096K0494J8031J4244J3295J3587J1391Q328Q078R103Q029O769
58301A335978Q764J1555J0917Q963J0210J2981J2952J1817J3943J7571J8015J6598
58289A490264J7732K0129J9653J7950J9419K2661K3700K4426K8789L4059L5272
$$ plain form
58383 791541 792401 792546 793951 796770 798670 798866 798982 799190 797414 793320 789380 787016 785230 783812 784217 786419
58367 786419 788506 790223 793433 798451 803578 808777 815921 824772 832798 839781 848527 860042 872069 883383
58353 883383 895509 909046 922192 934039 945504 956093 963599 967865 970930 972811 971446 967526 964747
58340 964747 964254 963456 961514 961201 963888 967376 970368 974520 980385 985840 990332 996373 1005039 1014217 1022859
58325 1022859 1032600 1043697 1053919 1063145 1074496 1089133 1104416 1118805 1134086 1151168 1168391 1185533
58313 1185533 1204629 1225123 1243154 1257398 1270693 1284280 1295671 1303999 1312077 1321180 1329209 1335978
58301 1335978 1344742 1356297 1367214 1376177 1386387 1399368 1412320 1424137 1438080 1455651 1473666 1490264
58289 1490264 1507996 1528125 1547778 1565728 1585147 1607808 1631508 1655934 1684723 1718782 1754054
58278A754054L4881L8254M3236M4260M3212M5660M9685M9372M6223M6045M7648
58267B242530M5760M2005M1698M2956M0535L7126L8925M3537M4433M3663M7423
58256B710591N2933N3241N1251N4979O2462O5870O6914P3046Q1921Q5394Q5701
58245C444303R1402J00398J03758J03373J08446J17312J20723J20552J26686J37873
58235D574826J44607J48559J59449J75075J84897J91031K04611K23786K37353
58226F244194K47739K67135K93227L13048L28609L53315L85289M11055M33563
58217I277174M68238N13265N53522N92070O46233P14531P81007Q50391R43037
58208A5339468J057247J175323J305135J474205J684937J921405K198594K555500
$$ plain form
58278 1754054 1788935 1827189 1870425 1914685 1957897 2003557 2053242 2102614 2148837 2194882 2242530
58267 2242530 2288290 2330295 2371993 2414949 2455484 2492610 2531535 2575072 2619505 2663168 2710591
58256 2710591 2763524 2816765 2868016 2922995 2985457 3051327 3118241 3191287 3273208 3358602 3444303
58245 3444303 3535705 3636103 3739861 3843234 3951680 4068992 4189715 4310267 4436953 4574826
58235 4574826 4719433 4867992 5027441 5202516 5387413 5578444 5783055 6006841 6244194
58226 6244194 6491933 6759068 7052295 7365343 7693952 8047267 8432556 8843611 9277174
58217 9277174 9745412 10258677 10812199 11404269 12050502 12765033 13546040 14396431 15339468
58208 15339468 16396715 17572038 18877173 20351378 22036315 23957720 26156314 28711814
58200B8711814L002638L532915M183794N029360O117771P491296R263953J1584570
58192G8918111J4502569J7942921K1797867K5929368L0096464L4017055L7406195
58185B60610550L9576246L8904447L3273657K1791126O239585r542540k2004845
58178C68848226k9707483l3188299l3691112l2304215k9869039k7036004k4174779
58171A58877295k1392570j8725922j6241044j3971367j1898621j0030688q411803
58164E8205280p042608n869125m859126m016931l318637k704558k143116j637476
58156B6613703j164761o73029j44684L96541R43351J508843K074505K598766L064573
58147C5217808L420303L459322K884719J596694j18928j756088k933529l564038
$$ plain form
58200 28711814 31714452 35247367 39431161 44460521 50578292 58069588 67333541 78918111
58192 78918111 93420680 111363601 133161468 159090836 189187300 223204355 260610550
58185 260610550 300186796 339091243 372364900 394156026 400395611 390853071 368848226
58178 368848226 339140743 305952444 272261332 239957117 210088078 183052074 158877295
58171 158877295 137484725 118758803 102517759 88546392 76647771 66617083 58205280
58164 58205280 51162672 45293547 40434421 36417490 33098853 30394295 28251179 26613703
58156 26613703 25448942 24775913 24631229 25027770 25971121 27479964 29554469 32153235 35217808
58147 35217808 38638111 42097433 44982152 46578846 46459918 44703830 41770301 38206263
58139C8206263l761662l681708l447691l145505k826318k513931k219240j946507
58131A4663701j693217j457344j243775j056993q93813p50659o30367n34524m57224
58122E945785l93305l44151l09181k81007k55376k36267k24934k13816j97640
58113C490108j80805j67408j53733j36846j21043j09383r8057q5193p6146p4073
58103B287421p4024p2006p1053p2850p2424o6900o0919n7808n3941m7263m2707
58092A595526m3351m4479m2123l9540l9642l8948l4726l0676k9850k9135k6097
58081A196959k4090k5403k6369k4442k3136k4818k5623k2716j9816k0227k0945
58070I39374j8907j6674j6704j6205j2860r757r543r516p335n840p296q563o861
$$ plain form
58139 38206263 34444601 30762893 27315202 24169697 21343379 18829448 16610208 14663701
58131 14663701 12970484 11513140 10269365 9212372 8318559 7567900 6937533 6403009 5945785
58122 5945785 5552480 5208329 4899148 4618141 4362765 4126498 3901564 3687748 3490108
58113 3490108 3309303 3141895 2988162 2851316 2730273 2620890 2522833 2437640 2361494 2287421
58103 2287421 2213397 2141391 2070338 1997488 1925064 1858164 1797245 1739437 1685496 1638233 1595526
58092 1595526 1552175 1507696 1465573 1426033 1386391 1347443 1312717 1282041 1252191 1223056 1196959
58081 1196959 1172869 1147466 1121097 1096655 1073519 1048701 1023078 1000362 980546 960319 939374
58070 939374 920467 903793 887089 870884 858024 848267 838724 829208 821873 816033 808737 800174 793313
58057G93313m863n385o425o099o856j0131j2187j0243p522p486q103o565m720
58044F96728m991n554m264k937l296l138q39R67K63l18J450L078K311J617L264
58029F84341M653L169J235J731K684J239j061j642j660k899l729k616j945l856
58015F79644n947n508m382n158o262n327m001m674n782m952l634m109m874l567
58001F11467j643j638k581k334j911l124m618m428l993n480p533p672o588o108
57987E51816n305k612N27J956K520L913N073M403L241L479M095L525L063M184
57973E83878N011L229K21j409k144l735n353n390m952n810o898o431n471n762
57959E38984o236n240m084m697n869n603m952n721o474m948k490j938k736k299
$$ plain form
58057 793313 788450 783065 776640 770541 763685 753554 741367 731124 723602 716116 708013 701448 696728
58044 696728 691737 686183 681919 678982 675686 672548 671709 672676 672939 672621 674071 677149 679460 681077 684341
58029 684341 688994 692163 693398 695129 697813 699052 697991 696349 694689 691790 688061 685445 683500 679644
58015 679644 673697 668189 663807 658649 652387 647060 643059 638385 632603 627651 624017 619908 615034 611467
58001 611467 609824 608186 605605 603271 601360 598236 593618 589190 585197 579717 572184 564512 557924 551816
57987 551816 546511 543899 544426 546382 548902 552815 557888 562291 565532 569011 573106 576631 579694 583878
57973 583878 588889 592118 592339 590930 588786 585051 579698 574308 569356 563546 556648 550217 544746 538984
57959 538984 532748 527508 523424 518727 512858 507255 502303 496582 490108 485160 482670 480732 477996 475697
57945D75697o94N1j2O73J702J556Q16R93J309J21j686k100j562j828k631k723
57929D69682k908m522o267o094m985n338o736o865n609m668m086k605o46L63Q01
57914D09517J954L223L353L305M762O857P644P654Q693J0180J0142Q907Q339Q207
57900E02737O796M395K776J869L05j387j496n65p69k288l404l822m751o029o281
57885D88086n650n541n933n649m885m742m884m311l657l990m156k414R8P67k98
57870D32841o30N25J742K612M136O100P109P168P413P549O419M693M112M395L774
57855D99958K264J419J224K85j220j746j421j837l067l790m096n076n980n059
57841D71858l129k987n052o783o693n910n464m994m534m788n295m919m265m891
$$ plain form
57945 475697 475003 475054 475042 475715 477417 478973 479789 480782 482091 482212 480526 478426 476864 475036 472405 469682
57929 469682 466774 462252 455985 449891 444906 439568 432832 425967 420358 415690 411604 408999 408353 408716 409517
57914 409517 411471 414694 418047 421352 426114 432971 440615 448269 456962 467142 477284 486191 494530 502737
57900 502737 509533 513928 516704 518573 518878 517491 515995 515430 514661 512373 508969 505147 500396 494367 488086
57885 488086 482436 476895 470962 465313 460428 455686 450802 446491 442834 438844 434688 432274 432372 433139 432841
57870 432841 432211 432736 434478 437090 441226 447326 454435 461603 469016 476565 482984 487677 491789 496184 499958
57855 499958 502222 503641 504865 505150 503930 502184 500763 498926 495859 492069 487973 482897 476917 471858
57841 471858 468729 465742 460690 453907 447214 441304 435840 430846 426312 421524 416229 411310 407045 402154
57827D02154o216o176m956m870o300p117o553o388p442q100p361o504o520o502
57813C11149n714m978m897m683l766k656j639l95O73O19k37o15l98m57m76O83
57797B82213K484L128K589K709M107N571O637Q012R255Q873P183O183O057M816
57783C59817K052N5J24O86K24n97j034j854l428m519m482m552n614o569o274n277
57767C18758m488l760k905k487k641k607k217k283k931l116k332j017J044M676
57753B91694R163J2186J2646J1748J0776R809R022R066R457Q801P249O630P468
57740D15715Q149P741P325P592P574O752O200O505O675O282O528Q010R420R738
57726E20206R761J0365J1155J1938J3543J6000J7814J8270J8655K0043K1725K2968
$$ plain form
57827 402154 395938 389762 384806 379936 373636 366519 359966 353578 346136 338036 330675 324171 317651 311149
57813 311149 305435 300457 295560 290877 287111 284455 282816 282421 283094 283713 283476 282861 282463 282006 281530 282213
57797 282213 284697 287825 290414 293123 297230 302801 309438 317450 326705 335578 342761 348944 355001 359817
57783 359817 361869 361924 362048 362734 362958 362361 361327 359473 356045 351526 347044 342492 336878 330309 324035 318758
57767 318758 314270 310510 307605 305118 302477 299870 297653 295370 292439 289323 286991 285974 287018 291694
57753 291694 300857 313043 325689 337437 348213 358022 367044 376110 385567 394368 401617 408247 415715
57740 415715 423864 431605 438930 446522 454096 460848 467048 473553 480228 486510 493038 501048 510468 520206
57726 520206 529967 540332 551487 563425 576968 592968 610782 629052 647707 667750 689475 712443
57714G12443K4394K6419K8120K8965K9925L1770L3937L6213L9533M4071M8498
57703A084288N2450N7667O5276P3937Q2342R1571J03238J16983J31618J47291
57693B006661J64666J83265K02286K21792K41382K58696K70816K76277K74467
57684D100308K64038K43321K11682J69727J19298O4151R468m0384q2927j16268
57674D942414j38459j48890j48810j39718j22870j01004p8712o0300m9167m9522
57664C904962o5430r5812j32290j64250j85282j94096j91896j81277j66101j49686
57654B378842j33146j16461j00027q4151o8506n3441m0482l0193k0980j1279j401
57643A718775Q008J7564K7786L7855M7458N8125P0961Q4649R7700J11137J26864
$$ plain form
57714 712443 736837 763256 791376 820341 850266 882036 915973 952186 991719 1035790 1084288
57703 1084288 1136738 1194405 1259681 1333618 1415960 1507531 1610769 1727752 1859370 2006661
57693 2006661 2171327 2354592 2556878 2778670 3020052 3278748 3549564 3825841 4100308
57684 4100308 4364346 4607667 4819349 4989076 5108374 5172525 5181993 5141609 5058682 4942414
57674 4942414 4803955 4655065 4506255 4366537 4243667 4142663 4063951 4003651 3954484 3904962
57664 3904962 3839532 3743720 3611430 3447180 3261898 3067802 2875906 2694629 2528528 2378842
57654 2378842 2245696 2129235 2029208 1945057 1876551 1823110 1782628 1752435 1731455 1720176 1718775
57643 1718775 1726783 1744347 1772133 1809988 1857446 1915571 1986532 2071181 2168881 2280018 2406882
57632B406882J44600J62544J79976J97070K12923K25698K33966K36354K30677
57623D230690K15137J89697J55131J11911O1552P831m5044r4507j38617j74658
57613D519123k00821k18185k28959k33658k31822k24501k13931k01446j87556
57604B578244j73234j59382j45611j31469j18014j06594r6790q7374p8442p0826
57594A410508o4196n7669n1653m7169m3850m0348l6328l2467k9000k5825k3411
57583I58592k2062k0899j9007j6891j5366j3971j2034j0297r639r215p733n680
57571G95798m324l365j664M80J933K977M718O782P793P849Q368R727J1023J2007
57557H60102J3278J4789J6051J7547K0174K3517K6536K9569L3663L8395M2418
$$ plain form
57632 2406882 2551482 2714026 2894002 3091072 3303995 3529693 3763659 4000013 4230690
57623 4230690 4445827 4635524 4790655 4902566 4964118 4971949 4926905 4832398 4693781 4519123
57613 4519123 4318302 4100117 3871158 3637500 3405678 3181177 2967246 2765800 2578244
57604 2578244 2405010 2245628 2100017 1968548 1850534 1743940 1647150 1559776 1481334 1410508
57594 1410508 1346312 1288643 1236990 1189821 1145971 1105623 1069295 1036828 1007828 982003 958592
57583 958592 936530 915631 896624 879733 864367 850396 838362 828065 818426 809211 801478 795798
57571 795798 791474 788109 786445 786925 788858 791835 796553 803335 811128 818977 827345 837072 848095 860102
57557 860102 873380 888169 904220 921767 941941 965458 991994 1021563 1055226 1093621 1136039
57546A136039M6008N0851N7358O4440P1894Q0879R1716J03292J15080J27817J41723
57535B087097J55687J68647J80194J89404J94409J93597J86078J71055J47990
57526C674158J17543Q1225M0397l093m5797q3952j15807j41285j59897j70935
57516C192557j75430j75693j72678j65761j55357j43642j32190j20695j08678
57507A842433r6841q6058p6408o7723n9925n2446m4595l6804l0322k5372k0811
57496A245128j5774j0512n496r03K979O120R542J4375K0219K5716L0700L6264
57484A358358M2798M9671N6908O5412P5299Q5680R6425J08476J21968J35546J48140
57473B344681J59874J70592J78748J82385J80204J71256J54653J30121R8167N9755
$$ plain form
57546 1136039 1182047 1232898 1290256 1354696 1426590 1507469 1599185 1702477 1817557 1945374 2087097
57535 2087097 2242784 2411431 2591625 2781029 2975438 3169035 3355113 3526168 3674158
57526 3674158 3791701 3872926 3913323 3910230 3864433 3780481 3664674 3523389 3363492 3192557
57516 3192557 3017127 2841434 2668756 2502995 2347638 2203996 2071806 1951111 1842433
57507 1842433 1745592 1659534 1583126 1515403 1455478 1403032 1358437 1321633 1291311 1265939 1245128
57496 1245128 1229354 1218842 1213346 1212443 1215422 1221542 1231084 1245459 1265678 1291394 1322094 1358358
57484 1358358 1401156 1450827 1507735 1573147 1648446 1734126 1830551 1939027 2060995 2196541 2344681
57473 2344681 2504555 2675147 2853895 3036280 3216484 3387740 3542393 3672514 3770681 3830436
57463C830436J6801k7222o8541j05051j36029j60368j76755j85585j88845j87857
57453B610984j82584j73478j62365j50949j39647j28335j17061j05816r4707q4508
57443A271534p5926o8383o0769n3297m7156m2517l8431l4573l1354k8436k4979
57432G65713k1459j9318j8531j7487j5579j3943j3174j2329j0836r493q818q131
57420E96615p049o253o040n630m695l973l763l357k645k586l348l609k578j168
57406E39921l54Q1M10J85m41k29J213K541K663K289K417K709K518K254K496K881
57390E63554K933L051L583L939L516K707K148J886J945K658L757M171L481K542
57376F05871K147K095K148K626L487L969L782L493L292K729K057K287L354L896
$$ plain form
57463 3830436 3847237 3820015 3751474 3646423 3510394 3350026 3173271 2987686 2798841 2610984
57453 2610984 2428400 2254922 2092557 1941608 1801961 1673626 1556565 1450749 1356042 1271534
57443 1271534 1195608 1127225 1066456 1013159 966003 923486 885055 850482 819128 790692 765713
57432 765713 744254 724936 706405 688918 673339 659396 646222 633893 623057 613564 604746 596615
57420 596615 589566 583313 577273 571643 566948 562975 559212 555855 553210 550624 547276 543667 541089 539921
57406 539921 539567 539648 540058 540243 539802 539573 540786 543327 545990 548279 550696 553405 555923 558177 560673 563554
57390 563554 566487 569538 573121 577060 580576 583283 585431 587317 589262 591920 595677 599848 603329 605871
57376 605871 608018 610113 612261 614887 618374 622343 626125 629618 632910 635639 637696 639983 643337 647233
57362F47233L496L402M194M709M304M175N194O239O218O063O979Q191Q321P794
57348G26512Q026R061R777R795R567R154Q379P685P633P963Q205Q649R678J0764
57334H50848J1140J0856J0408R957R677J0019J0819J1094J0490J0034J0567J1500
57322I77409J1974J2166J2514J2740J2710J3144J4377J5471J5654J5541J5844
57311A129544J6056J5669J5539J6570J8009J8484J8037J7792J8279J9211K0277
57300A323467K1111K1249K1028K1644K3456K5250K6169K7109K9039L1228L2546
57289A603296L3315L4425L5713L6751L8109M0301M2459M3678M4686M6431M7954
57278B047118M7506M5048M1870L8349L3895K8641K3331J7893J1746N290k89m397
$$ plain form
57362 647233 650729 654131 658325 663034 667338 671513 676707 682946 689164 695227 702206 710397 718718 726512
57348 726512 734538 743599 753376 763171 772738 781892 790271 797956 805589 813552 821757 830406 840084 850848
57334 850848 861988 872844 883252 893209 902886 912905 923724 934818 945308 955342 965909 977409
57322 977409 989383 1001549 1014063 1026803 1039513 1052657 1067034 1082505 1098159 1113700 1129544
57311 1129544 1145600 1161269 1176808 1193378 1211387 1229871 1247908 1265700 1283979 1303190 1323467
57300 1323467 1344578 1365827 1386855 1408499 1431955 1457205 1483374 1510483 1539522 1570750 1603296
57289 1603296 1636611 1671036 1706749 1743500 1781609 1821910 1864369 1908047 1952733 1999164 2047118
57278 2047118 2094624 2139672 2181542 2219891 2253786 2282427 2305758 2323651 2335397 2340687 2340398 2336001
57266B336001o997p803o854n358m430l575j772N86K405L899O153R117J1785J4015
57252B347172J6513J9154K1088K2381K3959K5921K7356K8038K8878L0521L2520
57241B623501L4122L4973L5096L4914L5073L5702L6219L6393L6888L7987L8801
57230C019669L8702L8508L9077L9789L9714L9232L9044L8585L7128L5525L5024
57219C439997L5100L4304L2639L1219L0193K8890K7683K7734K9068L0677L2296
57208C779800L4449L6946L9092M1089M3557M5856M6622M5834M4770M4036M3190
57197D245241M2115M1210M0348L9127L7988L7643L7785L7721L7796L8491L8802
57186D674267L7385L4972L3538L3370L2900L1392K9691K8337K6905K5507K5052
$$ plain form
57266 2336001 2329004 2321201 2314347 2308989 2304559 2300984 2299212 2299798 2302203 2306102 2312255 2321372 2333157 2347172
57252 2347172 2363685 2382839 2403927 2426308 2450267 2476188 2503544 2531582 2560460 2590981 2623501
57241 2623501 2657623 2692596 2727692 2762606 2797679 2833381 2869600 2905993 2942881 2980868 3019669
57230 3019669 3058371 3096879 3135956 3175745 3215459 3254691 3293735 3332320 3369448 3404973 3439997
57219 3439997 3475097 3509401 3542040 3573259 3603452 3632342 3660025 3687759 3716827 3747504 3779800
57208 3779800 3814249 3851195 3890287 3931376 3974933 4020789 4067411 4113245 4158015 4202051 4245241
57197 4245241 4287356 4328566 4368914 4408041 4446029 4483672 4521457 4559178 4596974 4635465 4674267
57186 4674267 4711652 4746624 4780162 4813532 4846432 4877824 4907515 4935852 4962757 4988264 5013316
57175E013316K5734K6775K7925K9652L1866L3870L5613L7491L9061L9536L9386
57164E380225L9812M0796M1319M1278M1488M1956M1984M1810M2284M2990M2482
57153E838424M0392L7600L4559L1108K7681K4795K1686J7418J2998J0256Q903
57142F105820O987L994J199r22l173n566p229q424j0329j2661j4029j4673j6259
57129F024735j8703j9801j8391j5458j1739o876j408L067O390J0218J5268K0461
57117E987763K5094K9508L3286L5372L6451L8745M3254M9654N8966P3233R2357
57106F503683J14335J39197J69686K07927K54758L12786L86406M78177N88901
57097I155856P22110Q84934J083816J322801J605864J935737K308802K714398
$$ plain form
57175 5013316 5039050 5065825 5093750 5123402 5155268 5189138 5224751 5262242 5301303 5340839 5380225
57164 5380225 5420037 5460833 5502152 5543430 5584918 5626874 5668858 5710668 5752952 5795942 5838424
57153 5838424 5878816 5916416 5950975 5982083 6009764 6034559 6056245 6073663 6086661 6096917 6105820
57142 6105820 6112807 6116801 6118000 6117078 6113905 6108339 6101110 6092686 6082357 6069696 6055667 6040994 6024735
57129 6024735 6006032 5986231 5967840 5952382 5940643 5933767 5932359 5935426 5941816 5952034 5967302 5987763
57117 5987763 6012857 6042365 6075651 6111023 6147474 6186219 6229473 6279127 6338093 6411326 6503683
57106 6503683 6618018 6757215 6926901 7134828 7389586 7702372 8088778 8566955 9155856
57097 9155856 9877966 10762900 11846716 13169517 14775381 16711118 19019920 21734318
57089B1734318L138950L565924L972898M336304M640579M876567N032452N096925
57081E6394917N070238M953370M717345M303367L677706K882786K013407J138793
57073H5151929K61015o49378j593590k524926l370911m062857m557721m852974
57065F3800587m985055n004347m945489m819392m626723m371234m062256l713288
57057B7272803l341754k966556k603267k262426j951626j676231j437553j232931
57049I800459j058720r12000p89370o86159n97996n22288m57619m02449l55019
57040D018839l14040k78896k49147k23993k02323j83254j66409j51446j37778
57031B111553j25178j14137j04934r6677q8293q0062p3122o7559o2230n6513n1041
$$ plain form
57089 21734318 24873268 28439192 32412090 36748394 41388973 46265540 51297992 56394917
57081 56394917 61465155 66418525 71135870 75439237 79116943 81999729 84013136 85151929
57073 85151929 85412944 84763566 83169976 80645050 77274139 73211282 68653561 63800587
57065 63800587 58815532 53811185 48865696 44046304 39419581 35048347 30986091 27272803
57057 27272803 23931049 20964493 18361226 16098800 14147174 12470943 11033390 9800459
57049 9800459 8741739 7829739 7040369 6354210 5756214 5233926 4776307 4373858 4018839
57040 4018839 3704799 3425903 3176756 2952763 2750440 2567186 2400777 2249331 2111553
57031 2111553 1986375 1872238 1767304 1670627 1582334 1502272 1429150 1361591 1299361 1242848 1191807
57020A191807m6540m2989m0162l7953l5929l3540l0953k8822k7076k4932k2219
57009H20692j9648j7475j4957j1434p061k055L960J1559K1116L3053M7952O6254
56997I31956Q8106J13166J40329J68482J97569K26257K45962K39545J91977J05611
56987B648960L050q7340j48844j80755j90598j86303j74490j61006j49776j41436
56977A231462j34224j26170j16394j05022r2607p9732o6914n4648m3348l3236
56967C79167k4435j7084j1178o265j608L373Q869J4686K0302K5166K9264L2980
56955D53237L5778L5496K9849J8816N098p829j7695k3805k6473k6547k5099k3103
56943D27723k1185j9427j7313j4227j0190n781j194M042J0010J5851K0833K5382
$$ plain form
57020 1191807 1145267 1102278 1062116 1024163 988234 954694 923741 894919 867843 842911 820692
57009 820692 801044 783569 768612 757178 750117 748062 752022 763581 784697 817750 865702 931956
56997 931956 1020062 1133228 1273557 1442039 1639608 1865865 2111827 2351372 2543349 2648960
56987 2648960 2652010 2564670 2415826 2235071 2044473 1858170 1683680 1522674 1372898 1231462
56977 1231462 1097238 971068 854674 749652 657045 577313 510399 455751 412403 379167
56967 379167 354732 337648 326470 320205 318597 321970 330839 345525 365827 390993 420257 453237
56955 453237 489015 524511 554360 573176 578274 570445 552750 528945 502472 475925 450826 427723
56943 427723 406538 387111 369798 355571 345381 339600 338406 342448 352458 368309 389142 414524
56931D14524L0316L5433L9346M0081L5444K4012P140j0587k4339l2512l6565l8186
56919D84107l7930l6167l3651l0795k7520k4043k0945j8332j5824j3396j1505
56908B13999j0330r557q831p799n987l468j331n63p05n22K65J018J613K715M587
56893A75104O817R213J2012J5186J8468K2044K6193L0386L3643L5502L5562L2411
56881D52541K4621J3116J222q062j3969j7145j8253j7820j6348j4016j0813p186
56869C67888l760k61M403J0835J8541K6744L5083M3478N2054O1142P0480P8049
56857G64676Q0327P3955N7426L2236L286k2773m1209n1592n6063n6123n2265m5617
56845F86264l7833k9468k0086r938K04J0734K2973L7095N1954O7058Q2867R8958
$$ plain form
56931 414524 444840 480273 519619 559700 595144 619156 626296 615709 591370 558858 522293 484107
56919 484107 446177 410010 376359 345564 318044 294001 273056 254724 238900 225504 213999
56908 213999 203669 194112 185281 177482 171495 168027 166696 166133 165428 164906 165171 166189 167802 170517 175104
56893 175104 181921 191134 203146 218332 236800 258844 285037 315423 349066 384568 420130 452541
56881 452541 477162 490278 491500 483438 469469 452324 434071 416251 399903 385887 375074 367888
56869 367888 364128 363867 368270 379105 397646 424390 459473 502951 555005 616147 686627 764676
56857 764676 845003 918958 976384 1008620 1011906 989133 947924 896332 840269 784146 731881 686264
56845 686264 648431 618963 598877 588939 589143 599877 622850 659945 711899 778957 861824 960782
56833I60782J13562J24830J30156J24044J00236N8431P525l9802p5222r7126j07389
56822A300027j08551j03452r4982q5124p4662o3780n2368m0081k6763j2648K136
56811F39752J7713L3608M8528O1639P3421Q4095R1166Q9451P4257M5233P798k9173
56799A237488n8021p5794q3935q5363q2389p6638o9427o1493n3012m4168l5281
56788E11967k6288j6866p130K373J1389K0095K8438L6001M2315M6417M6195L9270
56776G34176K5154O182j3671l0562m2089m8016m9908m9383m6942m2973l8836l5600
56764C67532l2423k7934k2856j9347j7793j6270j3523j0496q324o647m889l608
56752A83422l441l803l699l010k232j611j172r61q57p52j080k264l651l959k970
$$ plain form
56833 960782 1074344 1199174 1329330 1453374 1553610 1612041 1619566 1579764 1504542 1407416 1300027
56822 1300027 1191476 1088024 993042 907918 833256 769476 717108 677027 650264 637616 639752
56811 639752 657465 691073 739601 801240 874661 958756 1049922 1139373 1213630 1258863 1266661 1237488
56799 1237488 1179467 1103673 1019738 934375 851986 775348 705921 644428 591416 547248 511967
56788 511967 485679 468813 461683 464056 475445 495540 523978 559979 602294 648711 694906 734176
56776 734176 759330 765512 751841 721279 679190 631174 581266 531883 484941 441968 403132 367532
56764 367532 335109 307175 284319 264972 247179 230909 217386 206890 198566 191919 187030 183422
56752 183422 179981 176178 172479 169469 167237 165626 164454 163493 162636 161884 160804 158540 154889 150930 147960
56737A47960j773j218j206j436j722j568p25j08p65j996k134j176q30j701k458
56722A27144k175j590j383j133o79o98j051m74J185K202J575O06O58J053N52n06
56706A25286j030r40p95o38m26n07p77m18O32J174O31K3J42K12n44j479j891k271
56688A16384k929k826j353J15P6q66j242j030j035j012k63O56O72M3j50J28K2
56671A05390n96j066j240j521j891j976j785j544j222r40j203k010k492k213k008
56656H1683k632l563l991m013l869l120j682n36k43J47J422K580K312J106L43
56641F5944K08L0r3M10J229J627J675J790J689J111Q24J493K245J834O55N8K52
56624H2981M22L86N96Q59O23L06Q69K165L069L153L067L267L485L433L114K515
$$ plain form
56737 147960 146187 144969 143763 142327 140605 139037 138312 138204 137439 135443 133309 132133 131303 129602 127144
56722 127144 124969 123379 121996 120863 120184 119486 118435 117961 119146 121348 122923 123529 124187 125240 125792 125286
56706 125286 124256 123316 122521 121883 121457 120950 120173 119755 120387 121561 122192 122215 122357 122569 122025 120546 118655 116384
56688 116384 113455 110629 109276 109391 109467 108601 107359 106329 105294 104282 104019 104675 105347 105390 105240 105368 105390
56671 105390 104794 103728 102488 100967 99076 97100 95315 93771 92549 91609 90406 88396 85904 83691 81683
56656 81683 79051 75488 71497 67484 63615 60495 58813 58277 58034 58181 59603 62183 64495 65601 65944
56641 65944 66152 66182 66089 66499 67728 69355 71030 72820 74509 75620 76444 77937 80182 82016 82671 82729 82981
56624 82981 83403 83789 84385 85244 85867 86173 87042 89207 92276 95429 98496 101763 105248 108681 111795 114310
56608A14310J716J167J236J750K386L029L342K822J755J193J378J225J34r14r65
56593A35564n62o15r50j114j395j889j732n43N49N83L23P27J165O93pK65J210
56576A32272J736J797J958K039J738J720K517L274L173L038L931N141N365M896
56562A74595M842N131N092N073N580N859N174M594N394O681O730N784N260N058
56548B50847M033K498J768J706J066j33r04j498k932m623n013m297m184m988n360
56533B27986m882m539m553m057l141k960l529l485k412j443j243j245j065r76
56519A88456q11j63L83j42j327j986k224k973l850l658k858l028l960l750k038
56504A56071o62n99p00j24K73k17q89j089j182j372j181p32q84j564j540m19O44
$$ plain form
56608 114310 116026 117193 118429 120179 122565 125594 128936 131758 133513 134706 136084 137309 137443 136529 135564
56593 135564 135002 134387 133437 132323 130928 129039 127307 126764 127313 127896 128219 128946 130111 130804 130797 131062 132272
56576 132272 134008 135805 137763 139802 141540 143260 145777 149051 152224 155262 159193 164334 169699 174595
56562 174595 179437 184568 189660 194733 200313 206172 211346 215940 221334 228015 234745 240529 245789 250847
56548 250847 254880 257378 259146 260852 261918 261785 260881 259383 256451 251828 246815 242518 238334 233346 227986
56533 227986 223104 218565 214012 209955 206814 203854 200325 196840 194428 192985 191742 190497 189432 188456
56519 188456 187645 187482 187865 187723 186396 184410 182186 179213 175363 171705 168847 165819 161859 158109 156071
56504 156071 155409 154810 154110 153986 154259 154042 153153 152064 150882 149510 148329 147597 146713 145149 143609 143190 143834
56487A43834P81M40K39J60L24J072J999K230J891J929K412K515K141J976J977
56472A65920J495R00J211K125K271J585J408K149K755K769K936L422L415K832
56458A97193K602K821K558J862K009L242M122L725K791K169J740J368J351J490
56444B31043J203P90J125J872J759O75j41j98l12r38j638k286l110l567k953k112
56428B21212k624m338n645o035o326o557n924m753m210m127l392k433k720l843
56414A58285l812k409j442j371o50J107K128J514N57K45%m52l92J8l23j114q22
56397A51067L26L78q11j096J50R09K01l43K77P52M72J116L470N553N724N123N232
56380A78500N567N492N946P470Q829R318J0283J2720J5374J6813J7153J6384J3413
$$ plain form
56487 143834 144615 145055 145294 145454 145778 146850 148849 151079 152970 154899 157311 159826 161967 163943 165920
56472 165920 167415 168315 169526 171651 173922 175507 176915 179064 181819 184588 187524 190946 194361 197193
56458 197193 199795 202616 205174 207036 209045 212287 216409 220134 222925 225094 226834 228202 229553 231043
56444 231043 232246 233036 234161 236033 237792 238467 238326 238128 237816 236878 235240 232954 229844 226277 223324 221212
56428 221212 218588 214250 208605 202570 196244 189687 183763 179010 174800 170673 167281 164848 162128 158285
56414 158285 154473 152064 150622 149251 148601 149708 151836 153350 153907 154152 154152 153700 153308 153326 153003 151889 151067
56397 151067 151393 151771 150960 149864 150014 150923 151124 150781 151058 151810 152282 153398 156868 162421 168145 173268 178500
56380 178500 184067 189559 195505 202975 211804 221122 231405 244125 259499 276312 293465 309849 323262
56367C23262Q429L861J227o89l034m723m857m715n382n650m475l226l373l885
56353B92770l255k135j816j799j099l21l77n85MQ31J130J525K590L303K661J488
56337B94915J112J550K350L623N043N451M764M518N391O119N935N964O843P310
56323C60888O644O175O788P162O217N069M846M745L980L451L665L311J679K37
56309D24857k9m33j860k661j501J09L81J44P78J487J079N23J250K636L442M064
56293D34266N273O452P007P765R091R736R289R569J1600J3639J4294J5050J7392
56280E70423J9986K1287K2485K4997K7462K8186K8486L0593L4129L7581M1443
56269H87058M6916N3113N8464O3544O9910P7595Q6059R6031J08015J20624J32762
$$ plain form
56367 323262 331691 335552 336779 336090 333056 328333 323476 318761 313379 307729 303254 300028 296655 292770
56353 292770 289515 287380 285564 283765 282666 282345 281968 281383 281387 282218 283348 284873 287463 290766 293427 294915
56337 294915 296027 297577 299927 303550 308593 314044 318808 323326 328717 334836 340771 346735 353578 360888
56323 360888 367532 373707 380495 387657 393874 398943 403789 408534 412514 415965 419630 422941 424620 424857
56309 424857 424828 424395 422535 419874 418373 418482 418863 419007 419785 421272 422351 422874 424124 426760 430202 434266
56293 434266 439539 445991 452998 460763 469854 479590 488879 498448 510048 523687 537981 553031 570423
56280 570423 590409 611696 634181 659178 686640 714826 743312 773905 808034 845615 887058
56269 887058 933974 987087 1045551 1109095 1179005 1256600 1342659 1438690 1546705 1667329 1800091
56258A800091J45553J59959J74405J87165J98958K10662K20616K26793K29476
56249C553678K29194K24237K13006J96657J76551J51512J20658Q6754N3509K1501
56239E027257j0103l9818o5201q6077j03353j16329j24337j29177j32857j34720
56229D085285j33699j31460j30231j29593j28453j28034j29591j31347j31155
56220B911722j30094j30107j30113j28066j24833j22335j19795j15451j10157
56211A800771j05651j01077r4749q7616q1429p5383o8067o0753n5232n0495m5072
56200I75247m0390l8037l6087l2154k7740k5453k4190k1459j8142j6459j5416
56189F79720j2890j0163r549r539p263l910k682k968j673J021K359K256K938M396
$$ plain form
56258 1800091 1945644 2105603 2280008 2467173 2666131 2876793 3097409 3324202 3553678
56249 3553678 3782872 4007109 4220115 4416772 4593323 4744835 4865493 4952247 5005756 5027257
56239 5027257 5017154 4977336 4912135 4826058 4722705 4606376 4482039 4352862 4220005 4085285
56229 4085285 3951586 3820126 3689895 3560302 3431849 3303815 3174224 3042877 2911722
56220 2911722 2781628 2651521 2521408 2393342 2268509 2146174 2026379 1910928 1800771
56211 1800771 1695120 1594043 1499294 1411678 1330249 1254866 1186799 1126046 1070814 1020319 975247
56200 975247 934857 896820 860733 828579 800839 775386 751196 729737 711595 695136 679720
56189 679720 666830 656667 647118 637579 630316 626406 623724 620756 619083 620104 622463 624719 627657 632053
56175F32053M848M664N347N873M532K917L538M967M116J667N24N41k97j144O4
56160F74210J828J244n43l09J415J823J512L105N699O343N787P061R613J0628
56146G29416J0874J3350J7401K0054K2024K6352L2300L6792M0750M7601N6524
56135A053438O3778O9859P8593Q9657R8634J04068J07948J09652J06118R7963
56125A979708Q9096Q0542P0857O1931N7486N6000N1803M3117L2680K1239P486
56114B551945o099j4801j9179k4245l1421l8354m5949n7750p2295q3891r1149
56103B066812r7250j01803j00684r4383q8242q3612p6757o7357n9902n5450n0013
56092A191359m2457l6277l2329k7552k1955j9072j8449j5613j0486p741p822o066
$$ plain form
56175 632053 636901 641565 646912 652785 657317 660234 663772 668739 672855 674522 675046 675587 675290 674146 674210
56160 674210 676038 677282 676739 676430 677845 679668 681180 684285 689984 696327 702114 709175 718788 729416
56146 729416 740290 753640 771041 791095 813119 839471 871771 908563 949313 996914 1053438
56135 1053438 1117216 1187075 1265668 1355325 1453959 1558027 1665975 1775627 1881745 1979708
56125 1979708 2068804 2149346 2220203 2282134 2339620 2395620 2447423 2490540 2523220 2544459 2551945
56114 2551945 2545846 2531045 2511866 2487621 2456200 2417846 2371897 2314147 2241852 2157961 2066812
56103 2066812 1969562 1867759 1767075 1672692 1584450 1500838 1424081 1356724 1296822 1241372 1191359
56092 1191359 1148902 1112625 1080296 1052744 1030789 1011717 993268 977655 967169 959428 951606 945540
56080I45540j817K66o65OL295M667K957K631N077O230M910N054P662Q886P990
56065A002689Q794J1569J2046J0067J0376J3385J4284J2647J3316J6420J6519
56054A142112J3379J3134J6795J8266J6046J5929J9516K1116J9038J8919K2542
56043A336792K4456K3076K3956K8580L1107K9872L0718L5257L7406L5394L5532
56032A672146M0065M3118M2617M4077M8623M9740M6201M5354M9267N0759M7634
56021B179601M7165N1608N3417N0132M9612N4768N7670N5019N4679O0396O4902
56010B778969O4854O7481P5603Q1414Q2149Q6107R6004J02637J02469J04746J13491
55999C755924J19892J20473J24735J36334J45358J48134J55241J70621J82877
$$ plain form
56080 945540 943723 943989 943324 943330 946625 951292 954249 956880 961957 968187 973097 978151 985813 994699 1002689
56065 1002689 1011483 1023052 1035098 1045165 1055541 1068926 1083210 1095857 1109173 1125593 1142112
56054 1142112 1155491 1168625 1185420 1203686 1219732 1235661 1255177 1276293 1295331 1314250 1336792
56043 1336792 1361248 1384324 1408280 1436860 1467967 1497839 1528557 1563814 1601220 1636614 1672146
56032 1672146 1712211 1755329 1797946 1842023 1890646 1940386 1986587 2031941 2081208 2131967 2179601
56021 2179601 2226766 2278374 2331791 2381923 2431535 2486303 2543973 2598992 2653671 2714067 2778969
56010 2778969 2843823 2911304 2986907 3068321 3150470 3236577 3332581 3435218 3537687 3642433 3755924
55999 3755924 3875816 3996289 4121024 4257358 4402716 4550850 4706091 4876712 5059589
55990E059589J87169J94890K11226K24960K31548K43579K66532K87668L01408
55981G208569L21132L52688L82134M03798M33299M77716N21465N57945O04966
55972A1263712O71378P40405Q04954Q85519R92978J109961J231200J383495J581919
55963B0665521J808694K062007K380201K789410L279213L864145M614694N593923
55955D7057808O832059Q408911J0481563J3160850J6419134K0160237K4275137
55948A46795699K8566556L2751203L6579129L9627083M0663154L7537840K8511869
55941C91032533J4157770k271667j6730790k6749726l2142710l3994050l3487794
55934B59813566l1548131k8912476k6088304k3288838k0567146j7980787j5585963
$$ plain form
55990 5059589 5246758 5441648 5652874 5877834 6109382 6352961 6619493 6907161 7208569
55981 7208569 7529701 7882389 8264523 8668321 9101620 9579336 10100801 10658746 11263712
55972 11263712 11935090 12675495 13480449 14365968 15358946 16468907 17700107 19083602 20665521
55963 20665521 22474215 24536222 26916423 29705833 32985046 36849191 41463885 47057808
55955 47057808 53889867 62298778 72780341 85941191 102360325 122520562 146795699
55948 146795699 175362255 208113458 244692587 284319670 324982824 362520664 391032533
55941 391032533 405190303 402918636 386187846 359438120 327295410 293301360 259813566
55934 259813566 228265435 199352959 173264655 149975817 129408671 111427884 95841921
55927I5841921j3383237j1367462r581059q059458o775120n684003m778779m053256
55919C2159547l461735k957973k536815k200910j922988j675554j464078j297880
55911A4641614j158266j025271r07364q16309p38931o60183n89266n37643m94246
55902G714135m46227m02339l73083l48462l17071k87534k70219k56442k35772
55893D776986k15892k06032j97877j81851j65916j59803j56079j44722j31725
55884C217089j25949j21653j10881r9806r6339r4305q5741p6593p4884p5169o9780
55873B185989o3920o4839o7053o2849n6888n6254n6172m9739m2034m0827m2273
55862A583141l9168l4513l4052l3920k8438k1891k0173j8848j1657l033L8R36
$$ plain form
55927 95841921 82458684 71091222 61510163 53450705 46675585 40991582 36212803 32159547
55919 32159547 28697812 25739839 23203024 21002114 19079126 17403572 15939494 14641614
55911 14641614 13483348 12458077 11550713 10734404 9995473 9335290 8746024 8208381 7714135
55902 7714135 7267908 6865569 6492486 6144024 5826953 5539419 5269200 5012758 4776986
55893 4776986 4561094 4355062 4157185 3975334 3809418 3649615 3493536 3348814 3217089
55884 3217089 3091140 2969487 2858606 2758800 2662461 2568156 2482415 2405822 2330938 2255769 2185989
55873 2185989 2122069 2057230 1990177 1927328 1870440 1814186 1758014 1708275 1666241 1625414 1583141
55862 1583141 1543973 1509460 1475408 1441488 1413050 1391159 1370986 1352138 1340481 1337448 1337486 1338422
55850A338422O199J2599J3136R208N537j78j1320k2544k7160k8344l2492l7500
55838A225563l8025l6334l7346l8650l5703l1480l0903l1172k7473k2792k2191
55827H73494k2695j8927j3607j2521j3897j2611j0324j1603j4246j3129r757q839
55815G11338r187o964l985m019m824k469M18n82k835j433J277l0l697m516l552
55800F64940n344q456q084n457n627q225r054q651j0736j4055j4199j1893j1502
55787E43657j2905j2448j0511j0507j1819j0881q022o495o203m743k868k624k289
55774D41342M04K467k79n631q285q276r219j0647r412o738o383p436o097l123
55760C62687k407l536k877q93j267l725m614l975n292q742j0996j1284j1665j1939
$$ plain form
55850 1338422 1344621 1357220 1370356 1379564 1385101 1384923 1373603 1351059 1323899 1295555 1263063 1225563
55838 1225563 1187538 1151204 1113858 1075208 1039505 1008025 977122 945950 918477 895685 873494
55827 873494 850799 831872 818265 805744 791847 779236 768912 757309 743063 729934 720177 711338
55815 711338 702151 695187 691202 687183 682359 679890 680308 679726 676891 675458 676735 676705 673008 668492 664940
55800 664940 659596 651140 643056 637599 631972 623747 614693 606042 595306 581251 567052 555159 543657
55787 543657 530752 518304 507793 497286 485467 474586 466564 460069 453866 449123 446255 443631 441342
55774 441342 441746 444213 443934 438303 430018 421742 412523 401876 392464 385726 379343 371907 365810 362687
55760 362687 360280 356744 353867 352974 351707 347982 343368 339393 334101 325359 314363 303079 291414 279475
55746B79475j0175p527o798p139n717l506l544m822l920j508j046k139j432P41
55732B20943J017m44l23J408J563p9p24l51j606m178n019m080m141n141m344j964
55716A92537j043j765j367L41Q09K1N43K378L056K768M142P010Q582Q672R521
55701B36205J0669R487O613N330N576M098O93j403j639k861n479o520n383n005
55687B50381o290o596m907l492l219k089M08K067K277L078M953N820N189M976
55673B52556N372M277J695L71J088J496N34j18K33K18k01N72J942J281j319k641
55657B67356j592o16r95j023K4L29p78j524j304j895l903n672o594p912r404r117
55641B15380p285o569p558p903o833o484p614q010o573n113m722m009k383j524
$$ plain form
55746 279475 269300 261773 254975 247836 242119 238613 235069 230247 226327 224819 223773 221634 220202 220943
55732 220943 221960 221516 221193 222601 224164 224085 223361 223010 221404 217226 212207 208127 203986 198845 194501 192537
55716 192537 191494 189729 188362 188703 189512 189533 190076 192454 195510 198278 202420 209430 218012 226684 236205
55701 236205 246874 256361 262974 268304 273880 277978 278671 277268 275629 272768 267289 260769 255386 250381
55687 250381 244091 237495 232588 229096 225877 223788 224196 226263 228540 231618 236571 242391 247580 252556
55673 252556 257928 262205 263900 264271 265359 266855 267389 267271 267504 267722 267521 268093 270035 271316 269997 267356
55657 267356 265764 265148 264153 263130 263154 263483 262705 261181 259877 257982 254079 248407 241813 233901 224497 215380
55641 215380 208095 201526 193968 186065 179232 172748 165134 157124 150551 145438 140716 136707 134324 132800
55627A32800k146k679k397k598l499l371j982j463k494l072k210j550k026k239
55613I9074j491j145j677j564l34L42j94m45R4j37j609k552k125j688j871j475
55597H1203l53k30j478k240j728j380j697j246K36R38L27R2P31N90o07p94N61
55580G2925J181L6q67k90Q9q47j397k57J071J102P86J219J628J426J665K799L459
55563H5728L002K649K839K150K72q81m71k71j290j871q45K64Q9l55j12k58j455
55546H9184k161j263j46j72m13K45R90Q60O22J064J467J309J402J961J710K80
55530I6939p05m15k73j343k621l342m451o244p132o460o073p249q403p737n989
55515B8502m614l286j079J604L929N768O678N692L326J760J854K058J374R71J629
$$ plain form
55627 132800 130654 127975 125578 122980 119481 116110 114128 112665 110171 107099 104889 103339 101313 99074
55613 99074 97583 96438 94761 93197 92863 93205 93011 92566 92660 92523 90914 88362 86237 84549 82678 81203
55597 81203 80850 80620 79142 76902 75174 73794 72097 70851 71087 72025 72352 72444 73175 73765 73158 72364 72925
55580 72925 74106 74142 73275 72985 73074 72227 70830 70573 71644 72746 73532 74751 76379 77805 79470 82269 85728
55563 85728 88730 91379 94218 96368 96640 95759 95288 95017 93727 91856 91011 91275 91364 91009 90897 90639 89184
55546 89184 87023 85760 85614 85442 85029 85274 86264 87124 87746 88810 90277 91586 92988 94949 96659 96939
55530 96939 96234 95819 95546 94203 91582 88240 83789 77545 70413 63953 57880 50631 42228 34491 28502
55515 28502 23888 20602 19523 21127 25056 30824 37502 43194 46520 48280 50134 52192 53566 54537 56166
55500E6166K145J638J040R08K94q75r54L14O71r84k524k051p64l56k05O17J023
55483E6103m1j326j376q75q82p12L55J206P76l1j85l50j093j350n45j39j106j996
55465D6433j466o73r92j452p15L02R1q45j201j095j147r07j27J13o91j159m05
55448C4064K20m64j260p81J45K23lL72P05L64L28J209J587L88r96j017m59m74
55430C4151j88J367K815K486J206O95P05J21o42o00j70j20%M91K71r97j500j55
55412C9936J104L18j223j258k76j65p28m28O54J286J417J651J585P96J88K70k92
55395D4835k237l650k819j165q02j044l06M52m53j823j350K37L87q26j009K92
55379B8719J170Q64N37N78P8r17j256q86q48j215j209j089j698k460j987m52P44
$$ plain form
55500 56166 58311 59949 60989 61897 62191 61316 60362 60676 61347 60363 57839 55788 55024 54668 54463 55080 56103
55483 56103 56062 54736 53360 52485 51603 50891 51246 52452 53228 53197 53012 52662 51569 50219 49674 49535 48429 46433
55465 46433 44967 44294 43302 41850 41135 41437 41528 40683 39482 38387 37240 36333 36206 36319 35628 34469 34064
55448 34064 34284 33820 32560 31779 31924 32147 32144 32516 33221 33585 33913 35122 36709 37097 36101 35084 34625 34151
55430 34151 33963 35330 38145 40631 41837 42532 43237 43358 42716 42116 41946 41826 41826 42317 42588 41591 40091 39936
55412 39936 41040 41358 40135 38877 38601 38436 37708 37280 37934 39220 40637 42288 43873 44669 44857 45127 44835
55395 44835 42598 38948 36129 34964 34162 33118 32812 33264 32811 30988 29638 29875 30262 29436 28427 28719
55379 28719 29889 30753 31290 31868 31946 31029 29773 28887 28039 26824 25615 24526 22828 20368 18381 17929 18673
55362A8673J188J418J197P2r43m27J072J756J250N87J26n17j020p82k71j92j09
55345B3078M60O61j36p20m9N88k56j327p18O27M99o48o37L63K19j195j747p18
55327A8344L60O57Q68J040L58o50m10R71J734J410J220J443J004r9m66J86N45
55310B8515J90K63J135J547P41m03r10p67k08N97J026O14P3K72O93L96j05J82
55292C3851O41P1q88o96K96M47k34l14K07J2p97p33J77L10n71q50JN47Lo27n72
55271C0281l22j71L32R93R93N17N34Q76M84l57k30Q70J409Q73K84M0n38j277j054
55252C4537PM65l5l78k33m78j048p66K79N05m88j210q41l53l96k94K36L68q0j42
55232B9655M20N50k12j012j330j570j668r97PJ14n38n20L44O99K29K12J029J436
$$ plain form
55362 18673 19861 21279 22476 22548 21605 21178 22250 24006 25256 25843 25969 25452 24432 23650 23379 23187 23078
55345 23078 23538 24199 24063 23343 23294 23882 23626 22299 21581 22208 22707 22059 21422 21785 22004 20809 19062 18344
55327 18344 18704 19361 20229 21269 21627 20977 20567 21538 23272 24682 25902 27345 28349 28250 27784 27970 28515
55310 28515 28705 28968 30103 31650 32391 31988 31078 30311 30103 30700 31726 32340 32413 32685 33378 33774 33669 33851
55292 33851 34492 34563 33675 32979 33275 33722 33488 33174 33381 33393 32596 31863 32040 32350 31779 30929 30930 31477 31480 30853 30281
55271 30281 29959 29788 30120 31113 32106 32623 33157 34033 34517 34160 33930 34800 36209 37082 37366 37406 36868 35591 34537
55252 34537 34544 35009 34974 34596 34363 33885 32837 32071 32350 32855 32367 31157 30316 29963 29567 29273 29509 29877 29797 29655
55232 29655 30075 30625 30413 29401 28071 26501 24833 23836 23843 23957 23419 22899 23243 23942 24171 24383 25412 26848
55214B6848R56P51J378J829J525J183R91N4j560k296j523m33J49P66J462J147
55198C3227k27j033m85K32K46L35R16R53Rn96j1O25J72p45j137j156j068l88P70
55179C0639J129J57r34j156j042j106p62J05L34n28j148n47K91K71pL15P09M73
55161B7193K23P04J303J140N42J67k40r82j421j006l18q1n8J43K05r2k24P7J91
55142B7466k78p95r11q53o62kP60O87k2p8O49P66j65p25q5O46N25L80R96J587
55122B9886J389J112J380J346L60m93j29O63N91r4l96k86k10LM53M45k76o72k
55103C5070R39J234J286J646J736J141P53J212J452M79o42l03J052J685J249R02
55087E0891J233J630J544J087M78k08q02j151j223q19K20J290J475R77R21J445
$$ plain form
55214 26848 27804 28555 29933 31762 33287 34470 35461 35515 33955 31659 30136 29703 29852 30618 32080 33227
55198 33227 33000 31967 31482 31714 31960 32295 33211 34164 34173 33577 33566 34191 34363 33618 32481 31325 30257 29869 30639
55179 30639 31768 31925 30991 29835 28793 27687 26925 27030 27364 26836 25688 25141 25432 25703 25696 26011 26720 27193
55161 27193 27416 28120 29423 30563 31105 31272 31032 30050 28629 27623 27305 27224 27166 27309 27514 27422 27198 27275 27466
55142 27466 27188 26393 25482 24629 23967 23965 24725 25412 25390 25312 25961 26727 26562 25837 25752 26398 26923 27303 28299 29886
55122 29886 31275 32387 33767 35113 35473 34980 34851 35514 36105 36011 35615 35329 35119 35122 35575 36020 35744 35072 35070
55103 35070 36009 37243 38529 40175 41911 43052 43805 45017 46469 46948 46306 46003 47055 48740 49989 50891
55087 50891 52124 53754 55298 56385 56863 56655 55853 54702 53479 52660 52880 54170 55645 56622 57543 58988
55071E8988J462O55J47M54N52j48n73L3N90k9j153j604j510j467j195l80K79K14
55053E5315M3K94K73n74j448j594j562j840j630m21N96L09m70m79j20l89q83o22
55035D4798J56O76J132J879K138J225J10J18R41J498J776K151K009Q87MO87K116
55018F4301K554K020J749J715R03m39r55m79j92n90j065j361j813k202j963j474
55002F0709j580j930j347J81J282J093R6q44j176n21R40K033J705M44m26n35n89
54985E9535r41j280j478j639j535q97r8M00Q21J464J833J448R48J275K107K362
54969F4325J832J294J287J724K387K963K999K623K747L799N000N717O574Q235
54955A13506J0102J1310J2151J3176J3872J3579J2745J1940J0450P435L627K94
$$ plain form
55071 58988 60450 61105 61252 61706 62258 62110 61537 61570 62160 62131 60978 59374 57864 56397 55202 54822 55101 55315
55053 55315 55358 55652 55925 55351 53903 52309 50747 48907 47277 46856 47452 47761 47291 46812 46692 46303 45420 44798
55035 44798 44954 45630 46762 48641 50779 52004 52114 52232 53173 54671 56447 58598 60607 61494 61498 62185 64301
55018 64301 66855 68875 70624 72339 73242 72803 71848 71369 71177 70587 69522 68161 66348 64146 62183 60709
55002 60709 59129 57199 55852 56033 57315 58408 58504 57660 56484 55963 56903 58936 60641 61085 60659 60124 59535
54985 59535 58594 57314 55836 54197 52662 51765 51667 52067 52888 54352 56185 57633 58581 59856 61963 64325
54969 64325 66157 67451 68738 70462 72849 75812 78811 81434 84181 87980 92980 98697 105271 113506
54955 113506 123608 134918 147069 160245 174117 187696 200441 212381 222831 230266 233893 234187
54943B34187k678o032r205j0987j1527j1911j2216j1720j0679j0029r609q427
54931A19167o581n271m854m494l656k662j731p76l2K47M98J181J825J838J738
54916I6437K319L233L819M628O498Q702R830J0119J0989J2484J3024J1770R488
54903B03340P044M471J708j149m322p837j0655j1621j1098j0420r985r309q535
54890A31632q265q135p164n509m326l958l687l191k749k139q66N71J091P00L91
54875H4396M66L21k44q73j545k290k421j532q01j516k853k942j745q25o15j79
54859F4802L90j49j656k292j368l58m30r52j166j423j865j665n48M21M63J69K04
54842E2577K83J56K82P66Q60K23m31n34m40m46k22L06N68L62K59N58R46J328J948
$$ plain form
54943 234187 231509 225477 216272 205285 193758 181847 169631 157911 147232 137203 127594 119167
54931 119167 112586 107315 102461 97967 94311 91649 89918 89142 89110 89357 89855 91036 92861 94699 96437
54916 96437 98756 101989 105808 110436 116934 125636 135466 145585 156574 169058 182082 193852 203340
54903 203340 210384 214855 216563 215414 211092 203255 192600 180979 169881 159461 149476 140167 131632
54890 131632 123367 115232 108068 102559 98233 94275 90588 87397 84648 82509 81643 82214 83305 84005 84396
54875 84396 84862 85183 84939 84066 82521 80231 77810 76278 75477 73961 71108 68166 66421 65596 64981 64802
54859 64802 65192 65043 63387 61095 59727 59369 58939 57987 56821 55398 53533 51868 51320 51741 52204 52373 52577
54842 52577 52860 53016 53298 54064 54924 55147 54716 54182 53742 53296 53074 53380 53948 54310 54569 55127 56073 57401 59349
54823E9349K416J934P13p4l6J18J24N40J325J591J299J506K484L181L154L411
54807H3035M505N388N223M845N392O676Q026R588J1604J3369J4033J3811J3471
54794A98966J3100J2166J0330P644M410J230j429l901o838r900j1862j2191j1550
54781A90175j0541r123p479o265n561m759l847l602m114m339l695k789k110j263
54767A20688j40M82L47N21J819L492M432M811N605P165R122J1060J2595J3359
54753A95358J3487J3595J3823J3479J1987R495O370K894l78k871m911p410j0256
54740B54662j2148j2319j1462j0579r982r862j0529j1539j1656j0374q559p131
54728A28522o010m923m145l771l239k278j507j434j642j580j271q23p4P21P68
$$ plain form
54823 59349 61765 63699 64412 64338 64302 64420 64544 65084 66409 68000 69299 70805 73289 76470 79624 83035
54807 83035 87540 92928 98151 102996 108388 115064 123090 132678 144282 157651 171684 185495 198966
54794 198966 212066 224232 234562 242206 246616 247846 246417 242516 235678 225778 213916 201725 190175
54781 190175 179634 170511 163032 156767 151206 146447 142600 138998 134884 130545 126850 124061 121951 120688
54767 120688 120548 121030 121377 121898 123717 127209 131641 136452 142057 149222 158344 169404 181999 195358
54753 195358 208845 222440 236263 249742 261729 271224 277594 280488 280110 277239 272328 264918 254662
54740 254662 242514 230195 218733 208154 198172 188310 177781 166242 154586 144212 135653 128522
54728 128522 122512 117589 113444 109673 106434 104156 102649 101215 99573 97993 96722 95899 95825 96546 97314
54713I7314j36j115j430j330j270j132p42l74k23j38j54n48j054r30q8O83Q93
54696H8226R04J018J029Q31O01K34l94o57Q6J082R45q0l04P26J500R62j9l21m5
54677I6324L87J077J820J896J453J630K602L105K648K465L325M168L989L477L511
54662A33877L620L300L347M393N418N257M413L965L794L338L017L341L640L147
54648A87867K479K532K828K430J706J697K380L034L610M388M950M821M578M903
54634B34203N128M101J924l16k138l759n169o290p554r158j0266j0056r017q134
54620A73499p414o350n202m591m295l681k879k357j882j014j68J3p9L94J233J496
54604A36723J041O70Q99J470J938J974J372L93l21o79j407k773l861l868l264
$$ plain form
54713 97314 97178 96063 94633 93303 92033 90901 90159 89785 89562 89424 89270 88722 87668 86738 86650 87333 88226
54696 88226 89130 90148 91177 92008 92609 92843 92449 91792 91878 92960 93905 93825 93521 94247 95747 96709 96690 96369 96324
54677 96324 96711 97788 99608 101504 102957 104587 107189 110294 112942 115407 118732 122900 126889 130366 133877
54662 133877 137497 140797 144144 148537 153955 159212 163625 167590 171384 174722 177739 181080 184720 187867
54648 187867 190346 192878 195706 198136 199842 201539 203919 206953 210563 214951 219901 224722 229300 234203
54634 234203 239331 243432 245356 245040 242902 239143 233974 227684 220130 210972 200706 190650 181633 173499
54620 173499 166085 159735 154533 149942 145647 141966 139087 136730 134848 133834 133666 133679 133600 133994 135227 136723
54604 136723 137764 138434 139333 140803 142741 144715 146087 146480 146159 145480 144073 141300 137439 133571 130307
54589A30307k832k510k082k049k713l303l137k814l004l013j982o72n20j481k286
54574I5909k360k128j819j354j052j193j233o46o3l67j165j396r77n64j67N75
54558H0000J170P53m27j273j404j272j087p82o64q84o96M68J650J515M11j69J17
54541G7426L30J88M44J222J571J064N54R06K000L257M325M926M859M308L708L214
54525A14302K715K140J380M00l06j28L04o57l233n295n059l562k962l463l714
54510I2862l307k922k604j870j155j308j847j601p86o10j042r29k08K9k87l5R08
54493G3288J255N09k71l68l39n35m09J24K52j92k49N00J159J063P27O57N12J68
54475G7851K82J064J656J466J081J091J084N30k50o97q44q89p35m46m76r64j464
$$ plain form
54589 130307 127475 124965 122883 120834 118121 114818 111681 108867 105863 102850 100868 100196 99676 98195 95909
54574 95909 93549 91421 89602 88248 87196 86003 84770 84124 84061 83694 82529 81133 80156 79592 79425 80000
54558 80000 81170 81923 81496 80223 78819 77547 76460 75678 75014 74130 73434 73902 75552 77067 77478 77309 77426
54541 77426 77756 77944 78388 79610 81181 82245 82799 83705 85705 88962 93287 98213 103072 107380 111088 114302
54525 114302 117017 119157 120537 120937 120631 120503 120807 120150 116917 111622 106563 103001 100039 96576 92862
54510 92862 89555 86633 84029 82159 81004 79696 77849 76248 75462 74852 73810 72881 72673 72702 72415 72380 73288
54493 73288 74543 75052 74781 74413 74074 73539 73130 73254 73506 73314 73065 73565 74724 75787 76514 77171 77683 77851
54475 77851 78133 79197 80853 82319 83400 84491 85575 86105 85855 85158 84314 83425 82690 82244 81768 80804 79340
54458G9340j648j600j295o21q9m71j501j971j420o30j77L25J098J441Q53j15p55
54441G0764j189j709j962j481m70M54R30Q88M51L5K5K33K10J05M73J125J202N28
54423G0612q3r4M6j11k85j40R0J54K26M49O56Q28J252J883K246K209K193K448
54405H4579K720K796K762K562K033J493J553K246L002L588M257M933N087M616
54391A28227M112M081M479N054N435M988L433J530L61L6l8J4L54M07o04k158k921
54374A56790k766k858l557l837l161k403k327k520k548k841l656m206l742k606
54360A13762j603r95o97o56o46l55J9L6qO26J703K054J341O37Q98J910L089M113
54342A25228M474L687K391J938K497K849K502K398L000L295K648K019K235K475
$$ plain form
54458 79340 77692 76092 74797 74176 74087 73616 72115 70144 68724 68094 67917 68242 69340 70781 71634 71519 70764
54441 70764 69575 67866 65904 64423 63953 64407 65337 66225 66676 66711 66736 66969 67179 67284 67757 68882 70084 70612
54423 70612 70529 70435 70481 70370 70085 69945 70035 70189 70415 70864 71520 72348 73600 75483 77729 79938 82131 84579
54405 84579 87299 90095 92857 95419 97452 98945 100498 102744 105746 109334 113591 118524 123611 128227
54391 128227 132339 136420 140899 145953 151388 156376 159809 161339 161700 161736 161698 161712 162066 162473 161869 159711 156790
54374 156790 154024 151166 147609 143772 140611 138208 135881 133361 130813 127972 124316 120110 116368 113762
54360 113762 112159 111164 110467 109811 109165 108810 108829 108865 108857 109483 111186 113240 114581 115218 116116 118026 121115 125228
54342 125228 129702 133389 135780 137718 140215 143064 145566 147964 150964 154259 156907 158926 161161 163636
54328A63636J698L98l53n93j000j664k442l589m942n462m730l960m329n223n337
54313A22108m732m340m242l820l169k893k920k732k434k455k518k099j540j552
54299H0662j882j632p40n0M0m8ol4l38q33j415j864j846j490j543k220k471j371
54281F0919K45P58L9n18k05J09l89j138j107k69N78R53J013R65P54L68Q3J39L43
54262F3640L02J28N18J805L214L638K963K010J311P05J66L7J79j20r50j390q63
54245G7293p2K9m49q45j091j493j828j569p93j58J6L0K07M76N40K37k42m14j0
54226F9864O17Q27M93jm01p79j061j079j044j266j400p94L37R84P31J17m76j157
54208F4512j616j148mO31M56N28J267J508N17m83j79O91O05k41m05L62Q33L36
$$ plain form
54328 163636 165334 165732 165379 164786 163786 162122 159680 156091 151149 145687 140957 136997 132668 127445 122108
54313 122108 117376 113036 108794 104974 101805 98912 95992 93260 90826 88371 85853 83754 82214 80662
54299 80662 78780 77148 76408 76358 76398 76350 76344 76310 75972 75139 73724 71860 70014 68524 66981 64761 62290 60919
54281 60919 61164 61922 61961 61443 61238 61347 60958 59820 58713 58444 59022 59975 60988 61953 62707 63075 63158 63297 63640
54262 63640 63942 64070 64588 66393 69607 73245 76208 78218 79529 80234 80400 80437 80616 80496 79546 78156 77293
54245 77293 77221 77250 76801 75956 74865 73372 71544 69975 69182 69024 69040 69070 69277 69753 70293 70530 70288 69874 69864
54226 69864 70481 71308 71801 71800 71399 70620 69559 68480 67436 66170 64770 63976 64313 65297 66028 66145 65669 64512
54208 64512 62896 61748 61744 62375 62831 63359 64626 66134 66651 66168 65989 66680 67285 67044 66639 67001 67834 68170
54190F8170m49p26m65J30R72J651J552O54k44l93J64P70P87J70m40m23j5j1n82
54171G1272j010q27m62m51p13j017j344j503j082k54K48L26O64J252J067j01q40
54154F5225j43R74J125O51O85J071Q40Q2k51j3J82L05P91J300J049K45j41Rr2
54135G3894n45n08K87R68Q45K94n2j98m62q34j061r74o21k41j10j77j01J30R5
54116G0629k59l17J42L45l15j212j428j121r91r37m03L81O65M48M16P25R02P34
54098F8404M06r5p32q46J20J427J656N57p07j189j062q41o22l55r7J72M92O19
54080F7307L04j93m25m40o01q83r39o79k15M72J264J656J416J094J216J363R14
54063G2631J97j8J65k9p28j183q15K53J592K677K987K553K149K245K295J733J078
$$ plain form
54190 68170 67721 66995 66530 66660 67632 69283 70835 71489 71245 70852 71016 71786 72573 72743 72303 71880 71865 71854 71272
54171 71272 70262 69435 68973 68522 67809 66792 65448 63945 62863 62609 62857 63183 63847 65099 66166 66065 65225
54154 65225 65082 66056 67181 67832 68517 69588 70428 70510 70259 70246 70428 70733 71524 72824 73873 74118 73977 73986 73894
54135 73894 73349 72841 73128 74096 74941 75235 75183 74985 74523 73689 72628 71654 71033 70792 70682 70505 70404 70534 70629
54116 70629 70370 70053 70195 70540 70225 69013 67585 66464 65473 64536 64133 64514 65179 65627 66043 66768 67670 68404
54098 68404 68810 68715 67983 67137 67257 68684 70340 70897 70190 69001 67939 67098 66476 66121 66024 66196 66688 67307
54080 67307 67611 67418 66993 66553 65952 65069 64130 63451 63236 63708 64972 66628 68044 69138 70354 71717 72631
54063 72631 72828 72810 72975 72946 72218 71035 70220 70473 72065 74742 77729 80282 82431 84676 86971 88704 89782
54046H9782J095J417J175M57O3J75M26Q86J761K475K361J961K381L579M572N084
54030A19650N555N803N210M236M105M894N437N303N280N689N760N196M843N133
54016A92094N254M597L781L502L330K585J569J119J458K053K160J206p71k765
54002B21172l511k854j790j135r28j151k027l241l819l263k155j271p69n30n36
53987A92192o44o36o95j145j682j606r74o27r55j501j991k642l294l205k269j453
53971A66873j532k163k607k655k373j689p56o9J49J26m2n38j163j345j002o50
53955A48564m11J86J138J672J446J128J316J752K119K725L690M273L842K971K796
53940A79207L660N023O396P682Q776R409R390Q765P759O616N415M012K370P41
$$ plain form
54046 89782 90877 92294 93469 93926 93989 94164 94590 95476 97237 99712 102073 104034 106415 109994 114566 119650
54030 119650 125205 131008 136218 140454 144559 149453 154890 160193 165473 171162 176922 182118 186961 192094
54016 192094 197348 201945 205726 209228 212558 215143 216712 217831 219289 221342 223502 224708 223937 221172
54002 221172 217661 214807 213017 211882 210954 209803 207776 204535 200716 197453 195298 194027 193258 192728 192192
53987 192192 191548 190912 190217 189072 187390 185784 184810 184183 183228 181727 179736 177094 173800 170595 168326 166873
53971 166873 165341 163178 160571 157916 155543 153854 153098 153029 153178 153304 153262 152724 151561 150216 149214 148564
53955 148564 148153 148339 149477 151149 152595 153723 155039 156791 158910 161635 165325 169598 173440 176411 179207
53940 179207 182867 187890 194286 201968 210744 220153 229543 238308 246067 252683 258098 262110 264480 265221
53926B65221p08k163l632m558m489l762k842j530L36J871K072J491J670K909L899
53911B55785L721K993K771L355M527N863O621O337N726N933O728O710N491M277
53897C26838L824L259J711j71j233j391j333j439j803k561l531m172m388m741
53883C08869n450n932n836n706o135o987p846q479q566p845o831o405o439n922
53869B14490m701l833l727l457k628k362l419m662m666l776l250l299l337l400
53855A63973l937m657m793m241l501k783k060j576j560j748j868k128k590k706
53841A23825k139j444j206j161q32l87r2K95Q08P53j30q09l27O31P05j34p08l79
53823A17269L63P78M49o10j675j590k06J042R00k9l73l3J41J72Q17J886K179J303
$$ plain form
53926 265221 264513 262350 258718 254160 249671 245909 243067 241537 241873 243744 245816 247307 248977 251886 255785
53911 255785 259506 262499 265270 268625 273152 279015 285636 291973 297699 303632 310360 317070 322561 326838
53897 326838 330662 333921 335632 335461 334228 332837 331504 330065 328262 325701 322170 317998 313610 308869
53883 308869 303419 297487 291651 285945 279810 272823 264977 256498 247932 240087 233256 226851 220412 214490
53869 214490 209789 205956 202229 198772 196144 193782 190363 185701 181035 177259 174009 170710 167373 163973
53855 163973 160036 155379 150586 146345 142844 140061 138001 136425 134865 133117 131249 129121 126531 123825
53841 123825 121686 120242 119036 117875 117043 116656 116564 116859 117667 118420 118290 117481 117154 117785 118490 118356 117648 117269
53823 117269 117632 118410 118859 118249 116574 114984 114778 115820 116720 116691 116318 116285 116426 116598 117415 119301 121480 122783
53805A22783K51q0J03K96O25J538L113M933O287O537N759M780M277M105M037M489
53789A73833N695O718O391N019M015L936L951L324K382J741J440J221J027R11
53775B21604Q33P74O31M1j286k983m240m626m356l810l228k776k574k551k596
53760A88857k659k606k181j469r88j090j547k069k697l272l153k061p26l1N0p
53744A62351k42r07j558j382l24Q32J391J147J76j080j763j404n97j51M9N67J129
53727A58234Q70k05r78n95O66K003K882L103K741K227K013K092K195K296K463
53712A82007K451K107J942K528L367L213J684j54j048p95l8O21R34Q54M11k30
53696A99854o86m96M89J719K309K006J456J279J337J223R94R14R53J018J354K106
$$ plain form
53805 122783 123034 122954 123057 123353 123978 125516 128629 133562 139849 146386 152145 156925 161202 165307 169344 173833
53789 173833 179528 186246 192637 197656 201671 205607 209558 212882 215264 217005 218445 219666 220693 221604
53775 221604 222437 223211 223842 223883 222597 219614 215374 210748 206392 202582 199354 196578 194004 191453 188857
53760 188857 186198 183592 181411 179942 178954 177864 176317 174248 171551 168279 165126 163065 162339 162308 162358 162351
53744 162351 162109 161202 159644 158262 157938 158770 160161 161308 161484 160404 158641 157237 156640 156489 156538 157105 158234
53727 158234 159104 158899 157921 157326 157992 159995 162877 165980 168721 170948 172961 175053 177248 179544 182007
53712 182007 184458 186565 188507 191035 194402 197615 199299 199145 198097 197302 197264 197885 198819 199673 200084 199854
53696 199854 199168 198672 199161 200880 203189 205195 206651 207930 209267 210490 211484 212398 213351 214369 215723 217829
53680B17829K897L374L739M144M059L065J892J740K674L539L444K603J651Q96
53666B57546L55L4o1J17O49J352J743J581J253J159J117P42J22l62n78n98m91
53649B65680n51j222k265k602j658l75n9p08j355j609j851k179k151j602r31m99
53633B44063l55m30n15k52L49P18N27J81L8k40q07r26j06P73O65R2L35J378K062
53614B47550K034J997K148J924J378J373K129K892L313L879M667N026M903N121
53600B90334N819N893M817L847M380N935O831O322N127M171L684L511L602L975
53586C58248M433M590M250L765L748M235M506M067L356K978K705K061J393J372
53572D05707J705J481O85K69O31J103J151R83Q14N14K69O06J283J213k8j466j970
$$ plain form
53680 217829 220726 224100 227839 231983 236042 239107 240999 242739 245413 248952 252396 254999 256650 257546
53666 257546 257901 257935 257874 257991 258640 259992 261735 263316 264569 265728 266845 267587 267709 267347 266769 266171 265680
53649 265680 265129 263907 261642 259040 257382 257007 256948 256240 254885 253276 251425 249246 247095 245493 244562 244063
53633 244063 243708 243278 242763 242511 242860 243578 244105 244286 244324 244084 243277 242351 242245 243018 243683 243775 244110 245488 247550
53614 247550 249584 251581 253729 255653 257031 258404 260533 263425 266738 270617 275284 280310 285213 290334
53600 290334 296153 302046 306863 310710 315090 321025 327856 334178 339305 343476 347160 350671 354273 358248
53586 358248 362681 367271 371521 375286 379034 383269 387775 391842 395198 398176 400881 402942 404335 405707
53572 405707 407412 408893 409578 409847 410478 411581 412732 413715 414529 415043 415312 415918 417201 418414 418386 416920 414950
53555D14950j508p37r8K28J37pM77J629K528K415J562O14k12q44q44O3J399K420
53537D24172K955L238L292K978K508K419K920L600L804L332K707K653L298M122
53523D67998M856N849P221Q223Q207P792Q073R016R611R596R839J0823J1866J2261
53509E91231J2302J2708J3624J4632J5296J5448J5436J6069J7768J9695K0600
53498G64809K0488K0640K1742K3045K3767K4284K5258K6410K6969K6931K7009
53487A031352K7563K8138K8073K7219K6058K5214K4802K4415K3895K3742K4338
53476A314809K5120K5274K4953K4949K5279K5078K4010K2796K2134K1910K1775
53465A578087K1648K1323K0331J8614J6739J5127J3586J1806R820P756N724L947
$$ plain form
53555 414950 413442 412705 412607 412835 412972 412965 413442 415071 417599 420014 421576 422190 421978 421134 420290 420353 421752 424172
53537 424172 427127 430365 433657 436635 439143 441562 444482 448082 451886 455218 457925 460578 463876 467998
53523 467998 472854 478703 485924 494147 502354 510146 518219 527235 536846 546442 556281 567104 578970 591231
53509 591231 603533 616241 629865 644497 659793 675241 690677 706746 724514 744209 764809
53498 764809 785297 805937 827679 850724 874491 898775 924033 950443 977412 1004343 1031352
53487 1031352 1058915 1087053 1115126 1142345 1168403 1193617 1218419 1242834 1266729 1290471 1314809
53476 1314809 1339929 1365203 1390156 1415105 1440384 1465462 1489472 1512268 1534402 1556312 1578087
53465 1578087 1599735 1621058 1641389 1660003 1676742 1691869 1705455 1717261 1727081 1734837 1740561 1744508
53453A744508K505R36j204l491n109o124p364r111j0957j2880j5252j7652j8976
53440A639829j9174j9642k1296k3334k4609k5176k5791k6650k7443k7937k7945
53429A370832k7289k6270k5538k5068k4072k2215k0159j8422j6645j4486j2350
53418A138318j0672r263p941o972o314n233l318j140O64K164L572M796O126Q323
53404A113110J1270J3659J4753J5585J7401J9864K1854K3273K4867K6862K8885
53393A331383L0774L2479L3708L4543L5879L8280M0931M2745M4078M6117M8973
53382A759890N1548N3200N4422N5869N7656N9654O1668O3195O3751O3500O3102
53371B407455O2877O2614O2068O1201N9961N8318N6380N4112N1153M7274M2813
$$ plain form
53453 1744508 1747013 1747949 1746745 1743254 1738145 1732021 1724657 1715546 1704589 1691709 1676457 1658805 1639829
53440 1639829 1620655 1601013 1579717 1556383 1531774 1506598 1480807 1454157 1426714 1398777 1370832
53429 1370832 1343543 1317273 1291735 1266667 1242595 1220380 1200221 1181799 1165154 1150668 1138318
53418 1138318 1127646 1118383 1110442 1103470 1097156 1091923 1088605 1087465 1088129 1090293 1093865 1098661 1104787 1113110
53404 1113110 1124380 1138039 1152792 1168377 1185778 1205642 1227496 1250769 1275636 1302498 1331383
53393 1331383 1362157 1394636 1428344 1462887 1498766 1537046 1577977 1620722 1664800 1710917 1759890
53382 1759890 1811438 1864638 1919060 1974929 2032585 2092239 2153907 2217102 2280853 2344353 2407455
53371 2407455 2470332 2532946 2595014 2656215 2716176 2774494 2830874 2884986 2936139 2983413 3026226
53360C026226L8320L3980K9689K5330K0660J5344R439L506k032p239j2118j6419
53348C164686k0302k4415k8907l2992l6132l8931m2232m6030m9960n4071n8202
53337B732512o1256o2186o1376o0166n9304n8625n7962n7407n6831n5921n4634
53326B086844n3086n1225m9094m7110m5523m3947m1950l9742l7666l5549l3077
53315A608875l0413k7751k4877k1864j9712j9270j9911k0168j9473j8379j7344
53304A369713j6124j4394j2245j0004q047o655n635m410k767j237j78Q96K565
53291A291478M514O053P098P981Q707R171R764J1009J2869J4993J7318J9828K2180
53278A442963K4136K5953K7769K9088K9517K9449K9432K9381K9089K8762K8397
$$ plain form
53360 3026226 3064546 3098526 3128215 3153545 3174205 3189549 3198988 3202494 3200462 3193223 3181105 3164686
53348 3164686 3144384 3119969 3091062 3058070 3021938 2983007 2940775 2894745 2844785 2790714 2732512
53337 2732512 2671256 2609070 2547694 2487528 2428224 2369599 2311637 2254230 2197399 2141478 2086844
53326 2086844 2033758 1982533 1933439 1886329 1840806 1796859 1754909 1715167 1677501 1641952 1608875
53315 1608875 1578462 1550711 1525834 1503970 1484258 1464988 1445077 1424909 1405436 1387057 1369713
53304 1369713 1353589 1339195 1326950 1316946 1308899 1302244 1296609 1292199 1289432 1288195 1288017 1288913 1291478
53291 1291478 1295992 1302045 1309143 1317124 1325831 1335002 1344766 1355775 1368644 1383637 1400955 1420783 1442963
53278 1442963 1467099 1493052 1520821 1549909 1579426 1608875 1638307 1667688 1696777 1725539 1753936
53267A753936K7402K5656K4074K3165K1931J9346J6083J3491J1516R132O265L799
53255A955796J943Q3j986l983o143q962j2126j4917j7451k0259k2876k4374k5084
53242A799661k6305k8340l0241l1508l2568l3440l3500l2879l2678l3377l4235
53231A450590l4563l4412l3831l2704l1537l1088l0946k9868k7810k6140k5431
53220A112260k4619k3045k1715k1506k1524k0483j8692j7390j6869j6454j5791
53209H94172j5076j4367j3655j3382j4071j5438j6528j6684j5993j5000j4249
53198G29729j3957j3880j3656j3306j3041j2686j1836j0651r836r716r960j0364
53186E86840j1162j2335j3286j3561j3303j2773j2029j1265j0846j0729j0469
$$ plain form
53267 1753936 1781338 1806994 1831068 1854233 1876164 1895510 1911593 1925084 1936600 1945732 1951997 1955796
53255 1955796 1957739 1957822 1955836 1951853 1945710 1936748 1924622 1909705 1892254 1871995 1849119 1824745 1799661
53242 1799661 1773356 1745016 1714775 1683267 1650699 1617259 1583759 1550880 1518202 1484825 1450590
53231 1450590 1416027 1381615 1347784 1315080 1283543 1252455 1221509 1191641 1163831 1137691 1112260
53220 1112260 1087641 1064596 1042881 1021375 999851 979368 960676 943286 926417 909963 894172
53209 894172 879096 864729 851074 837692 823621 808183 791655 774971 758978 743978 729729
53198 729729 715772 701892 688236 674930 661889 649203 637367 626716 616880 607164 597204 586840
53186 586840 575678 563343 550057 536496 523193 510420 498391 487126 476280 465551 455082
53175D55082j0042r977j0359j0411r545q157o984o232n721n385n230n138n060
53162C56841n005m760m092l361l292l927m441m242l603k968k292j521j016j083
53148C11238j432j511j138n71k29l67o41k06J219K596K683J785J358J857K205
53133C18846J605O88K84K40J33J02J60m56k254m402n547n318m382l505l151l514
53117B89529m212m383l750l161l468m374n011n142n058m745m079l492l557m017
53103B31080m011l332k695k700l080l225k947k564k437k622k875k910k669k304
53089A90709j984j815j841j897j624r84n45q12j437j697j637j887k388k269j243
53074A66649k08j3m28q30j074j174q92l15j69q00j431j193m44j90n71q04m53O6
$$ plain form
53175 455082 445040 435063 424704 414293 404748 396591 389607 383375 377654 372269 367039 361901 356841
53162 356841 351836 347076 342984 339623 336331 332404 327963 323721 320118 317150 314858 313337 312321 311238
53148 311238 309806 308295 307157 306586 306357 305990 305349 305143 306362 308958 311641 313426 314784 316641 318846
53133 318846 320451 321139 321423 321663 321796 321898 322058 321602 319348 314946 309399 304081 299699 296194 293043 289529
53117 289529 285317 280934 277184 274023 270555 266181 261170 256028 250970 246225 242146 238654 235097 231080
53103 231080 227069 223737 221042 218342 215262 212037 209090 206526 204089 201467 198592 195682 193013 190709
53089 190709 188725 186910 185069 183172 181548 180564 180019 179207 177770 176073 174436 172549 170161 167892 166649
53074 166649 166441 166428 166000 165170 164096 162922 162030 161715 161546 160746 159315 158122 157678 157488 156917 156113 155660 155726
53056A55726K39P1j48k54k63k91m38o04n62l41k03j27J87P01Q83N38J53N8j25
53037A55200o96j145j005q08j326k206k345j520o44l34j80L01P26M70k70o84m69
53020A43065k03m83j018r22J34J380J803J303O89O15R93J398J577J398Q60L46
53004A52935M52J250K157K744L209L763M031L626K898K576K811L162L337L448
52990A92399L543L388K846K181J778J739J795J608J163P70N92K98n17j603k197
52975B09783k015j691j973k749l272l118k634k418k602k758k489j933j606j671
52961A76854j705j382j034j137j530j621j236o85j50M11Q06O53J4n24n36j27L66
52944A67437O26L91k78q40q73o42n59m14J10M73m5r02p88L42J003L64n43m32M63
$$ plain form
53056 155726 155965 156036 155888 155634 155371 155080 154642 154038 153476 153135 152932 152805 152992 153693 154576 155114 155267 155325 155200
53037 155200 154504 153359 152354 151546 150220 148014 145669 144149 143505 143171 142991 143292 144018 144488 144218 143534 143065
53020 143065 142862 142379 141361 140439 140573 141953 143756 145059 145748 146363 147356 148754 150331 151729 152589 152935
53004 152935 153387 154637 156794 159538 162747 166510 170541 174167 177065 179641 182452 185614 188951 192399
52990 192399 195942 199330 202176 204357 206135 207874 209669 211277 212440 213210 213802 214100 213583 211980 209783
52975 209783 207768 206077 204104 201355 198083 194965 192331 189913 187311 184553 182064 180131 178525 176854
52961 176854 175149 173767 172733 171596 170066 168445 167209 166524 166374 166785 167591 168244 168258 167734 167198 167071 167437
52944 167437 168063 168454 168176 167336 166463 165821 165262 164848 164958 165431 165386 164484 163696 164038 165041 165405 164862 164430 164893
52925A64893J035R10N29K78K56N56J102J512J532J249P22o6p27o18J38O08L91
52908A74300K36P97J611J907J668J291Q23K78R4N46J185J465J491J594J665J507
52892A92458J286J123P58J30k93k52j51k69j76M16J083J497K084L086L810L657
52876B10247L176L094L117K676K241K585L278L246K564K411L230M125M189L511
52862B53690K691K121J965K106K036J350M00p5K4M2n33j501k330k708k734k744
52846B53800k929l006k610k014j930k430k774k549k179j900j219o3M84m21j997
52831B26263k846k732k436k371k407k535k788k821k475k340k875l461l255k461
52817A88460j785j237n22p2l83q37m91K85L14n12j216j420j608j815j490p66n01
$$ plain form
52925 164893 165928 166838 167367 167645 167901 168457 169559 171071 172603 173852 174574 174508 173781 173163 173301 173909 174300
52908 174300 174536 175333 176944 178851 180519 181810 182633 182911 183005 183551 184736 186201 187692 189286 190951 192458
52892 192458 193744 194867 195625 195755 195462 195210 195059 194790 194614 195030 196113 197610 199694 202780 206590 210247
52876 210247 213423 216517 219634 222310 224551 227136 230414 233660 236224 238635 241865 245990 250179 253690
52862 253690 256381 258502 260467 262573 264609 265959 266359 266284 266308 266350 265817 264316 261986 259278 256544 253800
52846 253800 250871 247865 245255 243241 241311 238881 236107 233558 231379 229479 228260 228197 228681 228260 226263
52831 226263 223417 220685 218249 215878 213471 210936 208148 205327 202852 200512 197637 194176 190921 188460
52817 188460 186675 185438 184916 184844 184461 183624 183133 183418 183732 183220 182004 180584 178976 177161 175671 174905 174404
52800A74404q64j091q21n00l18J9K74k97j564k333k017j412j326j499j372j064
52784A58219r05p81m33J1K69J93k75j025j593j640j516j712j934j511o14q1j87
52767A44485n12q99j461j731j085q4m3j060j843j737j537j825j974j472q84o39
52751A25699j86P40J167L19r89j566j576j876k309k007j001k28j77m68p19q74
52735A13949p47j26O64J008Q39O79Q25J099J375J772K262K604K706K726K700K491
52719A36826K137J939K033K131J870J287P71O02O69O43L04m53j712l299m416m147
52703A37185k657j385j564k826l816l905l584l388l227k884k469k149j922j796
52689I9613j793j738j463j153j108j136p65PO59Q98Q81P43L71k58r36j443j550
$$ plain form
52800 174404 173540 172449 171628 171128 170810 170829 171103 170806 169242 166909 164892 163480 162154 160655 159283 158219
52784 158219 157314 156533 156100 156111 156380 156573 156298 155273 153680 152040 150524 148812 146878 145367 144753 144672 144485
52767 144485 143973 143074 141613 139882 138797 138713 138670 137610 135767 134030 132493 130668 128694 127222 126338 125699
52751 125699 125513 126253 127420 127739 126750 125184 123608 121732 119423 117416 116415 116187 116010 115542 114823 113949
52735 113949 113202 113076 113740 114748 115587 116266 117091 118190 119565 121337 123599 126203 128909 131635 134335 136826
52719 136826 138963 140902 142935 145066 146936 148223 148994 149596 150265 150908 151212 150759 149047 145748 141332 137185
52703 137185 134528 133143 131579 128753 124937 121032 117448 114060 110833 107949 105480 103331 101409 99613
52689 99613 97820 96082 94619 93466 92358 91222 90457 90464 91123 92021 92902 93645 94016 93758 92822 91379 89829
52672H9829j081l21m3n43j051q21l97p81j692j810p27N07Q98N19j20o90q52m25
52654H0399P5nk99J24J083J327M87l86n82o81j116j207m76K62J86j79P0P14R52
52635H0748P75O99P39O92Q99J723K584K524J523L98m17j134j841k222k097j605
52619H3988r43l18m8k50n77o41n18m71m69k85P8M32O24N26Q6l66l20K66Q80J195
52599H2869J347J329Q17r2o78n79l10l46l27J61P55Q91P17O94P68O11L82N36J095
52580I0640J651J930J902J602J201R23O64J00n60n74K18R13P64K40K77R92J770
52563A04653K112J789P27n99j143m47O00R27P23Q84J503J845J693J662K159K757
52547A21845K768K007R27L46Q20J948K568K071J116O42O30M90K22L47R24J406
$$ plain form
52672 89829 88748 88427 88384 87841 86790 85969 85572 84791 83099 81289 80562 81069 81967 82486 82366 81676 80824 80399
52654 80399 80474 80469 80170 80294 81377 82704 83191 82805 82223 81542 80426 79219 78743 79005 79191 79012 79082 79796 80748
52635 80748 81523 82222 82961 83653 84552 86275 88859 91383 92906 93304 92887 91753 89912 87690 85593 83988
52619 83988 83045 82727 82679 82429 81852 81211 80693 80222 79753 79468 79546 79978 80602 81128 81214 80848 80528 80794 81674 82869
52599 82869 84216 85545 86362 86270 85592 85013 84703 84357 84030 84191 84946 85837 86554 87248 88016 88627 89009 89545 90640
52580 90640 92291 94221 96123 97725 98926 99849 100513 100613 100053 99479 99697 100610 101374 101614 101891 102883 104653
52563 104653 106765 108554 109281 108682 107539 107092 107692 108619 109342 110226 111729 113574 115267 116929 119088 121845
52547 121845 124613 126620 127547 127893 128713 130661 133229 135300 136416 137058 137688 138178 138400 138747 139671 141077
52531A41077J440J166P26J14m97p81o34k62Q5J99j8l15k37K20M79K12j38j11N0
52512A42775o8k65j20K20K62r6o05j101j362r45K28J487K129K191J959J314K23
52495A48226o10m55L69R18Q48M98R2l51n77l18J54M07N47R38J444J638J481J152
52477A56401O10l2j30O59J621J936J949K420L003K685J505N86M34M91M38O95J397
52460A76668J996K170K242K325K080J576J475J973K435K462K518L006L479L280
52446B09685K418J426P79P12J087J305Q41O3j84J35J22o74j594j901j693j326
52430B11201p80j62j12r83k076k407j926j371j238j463j865k315k584k533k421
52415A86965k572k765k374j249j25N7q00j747j781r31j37m6l27l90k96m32o27
$$ plain form
52531 141077 142517 143683 144409 144523 144026 143245 142611 142349 142434 142633 142615 142300 142063 142283 142762 142974 142836 142725 142775
52512 142775 142707 142442 142322 142542 142804 142708 142103 141002 139640 138695 138923 140410 142539 144730 146689 148003 148226
52495 148226 147616 147161 147530 148448 149296 149794 149886 149535 148958 148640 148794 149201 149748 150686 152130 153768 155249 156401
52477 156401 157011 156979 156849 157508 159129 161065 163014 165434 168437 171122 172627 173213 173647 174138 174576 175271 176668
52460 176668 178664 180834 183076 185401 187481 189057 190532 192505 194940 197402 199920 202926 206405 209685
52446 209685 212103 213529 214308 215020 216107 217412 218253 218316 218132 218267 218389 217715 216121 214220 212527 211201
52430 211201 210421 210259 210147 209164 207088 204681 202755 201384 200146 198683 196818 194503 191919 189386 186965
52415 186965 184393 181628 179254 178005 177880 177937 177137 175390 173609 172678 172541 172495 172168 171778 171482 171050 170423
52398A70423l26M15Q34M98j56n58o33n21j41M88R43Q83O01O67J103J273P37m5
52380A76485j13Q02J778J665N17m10j68Q80J804K262K414K285J884J629J790J824
52364A97328J059j4j55R11K101K469K276K189K281K314K461K991L655L909L625
52349B29400L121K661K270K012K041K368K735K879K858K987L381L629L250K394
52335B67986J723J488J223O73L84Q54J575J739J494J676K392K853K653K352K532
52320B93597K976L184L108K990K917K898L027L298L433L240K955L027L638M535
52306C38823N299N707N911O156O439O686P239Q569J0372J1553J1595J1278J1443
52293D47070J1733J1432J1013J1767J3965J6430J7927J8194J7636J6893J6729
$$ plain form
52398 170423 170097 170512 171346 171844 171688 171130 170497 169976 169835 170323 171266 172149 172750 173417 174520 175793 176530 176485
52380 176485 176372 177174 178952 180617 181134 180724 180556 181436 183240 185502 187916 190201 192085 193714 195504 197328
52364 197328 198387 198373 198218 199129 201230 203699 205975 208164 210445 212759 215220 218211 221866 225775 229400
52349 229400 232521 235182 237452 239464 241505 243873 246608 249487 252345 255332 258713 262342 265592 267986
52335 267986 269709 271197 272420 273093 273477 274331 275906 277645 279139 280815 283207 286060 288713 291065 293597
52320 293597 296573 299757 302865 305855 308772 311670 314697 317995 321428 324668 327623 330650 334288 338823
52306 338823 344122 349829 355740 361896 368335 375021 382260 390829 401201 412754 424349 435627 447070
52293 447070 458803 470235 481248 493015 506980 523410 541337 559531 577167 594060 610789
52282F10789J7508J8630J9165J9036J8880J8860J8510J7768J7133J6745J6196
52271H09220J5432J4908J4623J3972J2803J1694J0852R714Q027O408N331M407
52259I37391L216K008J019j26j645k942l406l317l302l412l466l741m560n479
52245I08238n714n165m429l923l490k769j515K97K338M027N100N935P097Q703
52231I14730J0388J1731J2487J2639J2422J2154J1931J1695J1545J1638J1755
52220A045115J1428J0589R654Q828P792O247M378K592J062l41j861l615n332o526
52206A090010p287q481j0559j2620j3500j3481j3829j4800j5371j5088j4810j5190
52194I34994j5590j5160j4061j2994j2309j2106j2354j2411j1313r156p350o857
$$ plain form
52282 610789 628297 646927 666092 685128 704008 722868 741378 759146 776279 793024 809220
52271 809220 824652 839560 854183 868155 880958 892652 903504 913218 921245 927653 932984 937391
52259 937391 940607 942615 943634 943508 941863 938921 935515 932198 928896 925484 922018 918277 913717 908238
52245 908238 902524 897359 892930 889007 885517 882748 881233 881530 883868 887895 892995 898930 906027 914730
52231 914730 925118 936849 949336 961975 974397 986551 998482 1010177 1021722 1033360 1045115
52220 1045115 1056543 1067132 1076786 1085614 1093406 1099653 1104031 1106623 1107685 1107344 1105483 1101868 1096536 1090010
52206 1090010 1082723 1074242 1063683 1051063 1037563 1024082 1010253 995453 980082 964994 950184 934994
52194 934994 919404 904244 890183 877189 864880 852774 840420 828009 816696 807540 800190 793333
52182G93333o973o551n581m801m497m465m574m632m279l695l619m062l862k397
52168G29345q35o08j335j565j023q25j641k933l942m391m238l607l026k982l235
52153F93159l235l019l025l213l169k936k931l149l179l023l087l419l609l521
52139F48644l409l341l092k682k442k475k576k627k683k664k478k305k316k298
52125F11256j982j651j822k477l154l589l719l287k175j009p28j417k119j941
52111E80186q79M34J385J755J813K044K552L016L398M216N668O977P356P216P672
52096F34809R101J0951J2717J4269J5451J6177J6908J8157J9631K0621K1163K1888
52084H31843K2791K3131K2753K2485K2878K3377K3170K2202K0922J9647J8497
$$ plain form
52182 793333 786360 779809 774228 769427 764930 760465 755891 751259 746980 743285 739666 735604 731742 729345
52168 729345 728510 727902 726567 725002 723979 723154 721513 718580 714638 710247 706009 702402 699376 696394 693159
52153 693159 689924 686905 683880 680667 677498 674562 671631 668482 665303 662280 659193 655774 652165 648644
52139 648644 645235 641894 638802 636120 633678 631203 628627 626000 623317 620653 618175 615870 613554 611256
52125 611256 609274 607623 605801 603324 600170 596581 592862 589575 587400 586391 585663 584246 582127 580186
52111 580186 579307 579741 581126 582881 584694 586738 589290 592306 595704 599920 605588 612565 619921 627137 634809
52096 634809 643910 654861 667578 681847 697298 713475 730383 748540 768171 788792 809955 831843
52084 831843 854634 877765 900518 923003 945881 969258 992428 1014630 1035552 1055199 1073696
52073A073696J7525J6503J5018J3011J0831Q689O596M851L913L469K329k18l501
52060A172712o293q103r242j0001j0396j0526j0696j1126j1803j2614j3458j4117
52048A044337j4134j2957j0559p914o427o489o892o200m378k479j066K08J551
52035I66601K625L389M444O057P573Q338Q588Q922R387R688R933J0469J1147J1344
52021A078505J0756R696Q630P668O686N679M913M598M487L953K647Q67q87k563
52007A145635m361o161p704r287j1549j4444j7064j8771j9884k1003k2188k3301
51995I69918k4552k6078k7391k7822k7343k6479k5610k4878k4464k4416k4251
51984F86634k3423k2158k1304k1249k1487k1360k0771j9897j8729j7257j5788
$$ plain form
52073 1073696 1091221 1107724 1122742 1135753 1146584 1155273 1161869 1166720 1170633 1174102 1176431 1176213 1172712
52060 1172712 1166419 1158316 1149074 1139073 1128677 1118151 1107455 1096329 1084526 1071912 1058454 1044337
52048 1044337 1030203 1017246 1006687 998773 992346 985857 978965 972765 968387 965908 964842 965050 966601
52035 966601 969226 972615 977059 983116 990689 999027 1007615 1016537 1025924 1035612 1045545 1056014 1067161 1078505
52021 1078505 1089261 1098957 1107587 1115255 1121941 1127620 1132533 1137131 1141618 1145571 1148218 1149085 1148198 1145635
52007 1145635 1141274 1135113 1127409 1118122 1106573 1092129 1075065 1056294 1036410 1015407 993219 969918
51995 969918 945366 919288 891897 864075 836732 810253 784643 759765 735301 710885 686634
51984 686634 663211 641053 619749 598500 577013 555653 534882 514985 496256 478999 463211
51973D63211j4676j3858j3017j2002j0906r817q821q110p740p404o832o309o281
51960C37438o534o322n483m788m787m954m534l739l316l328l205k872k921l537
51946B77118m085m048l599l038k329j641j568k277k977k856k124j524j225r31
51932B42896p52j197k244l072k881j716l26N45P70P47P65N75q2o76l59O91J226
51915B34910N59n65j239j658k322k773k232j084n65j101k008k646k935k767k073
51900B09501j492j923l055l392k187n38j6q33j917k319j986j443j192j326j522
51885A84360j447j185j004q32l75K30M65K04r9j22qJ19M37R26J133P78J82k37
51867A83525m92q05j103j105o17L38J469K131J758O07k62o4R43J891K201J839
$$ plain form
51973 463211 448535 434677 421660 409658 398752 388935 380114 372004 364264 356860 350028 343719 337438
51960 337438 330904 324582 319099 314311 309524 304570 300036 296297 292981 289653 286448 283576 280655 277118
51946 277118 273033 268985 265386 262348 260019 258378 256810 254533 251556 248700 246576 245052 243827 242896
51932 242896 242144 240947 238703 235631 232750 231034 230708 231253 232023 232770 233535 234110 234028 233352 232993 233684 234910
51915 234910 235469 234904 233665 232007 229685 226912 224680 223596 223031 221930 219922 217276 214341 211574 209501
51900 209501 208009 206086 203031 199639 197452 196914 196898 196065 194148 191829 189843 188400 187208 185882 184360
51885 184360 182913 181728 180724 179892 179517 179747 180212 180416 180317 180195 180187 180306 180743 181669 182802 183580 183762 183525
51867 183525 183033 182228 181125 180020 179403 179741 181210 183341 185099 185706 185444 185380 186323 188214 190415 192254
51851A92254J113N25N39J103J640J711J452J150P63K16j56O4P78J509K035K440
51835B09136K570K026Q87QJ92J116J583R10k53p93n37l38q14j562j839j515r51
51818B09826k90N48J364J708J497J144R54P86L92j15l51o1N85J071R81M59J02
51801B20600K84P78J161J280J146P22J85L7M63Q77N72l66j263j739j799j368m17
51784B21153M74N08k97j008q84j11O47R56P39K31j34o5J95K21N6J38O00J114J473
51765B26006J798K106K149J792J212O49K89L10O64Q77N59N9Q9P71J531J942K068
51748B44871K066K068K392L289M280M470L617K425J661J552K049K992L935M398
51734B86065M507M878N710O594P138P227O690N587M771N210O514P089O091M335
$$ plain form
51851 192254 193367 193892 194431 195534 197174 198885 200337 201487 202250 202466 202310 202374 203152 204661 206696 209136
51835 209136 211706 213732 214619 214627 214819 215935 217518 218428 218175 217382 216845 216507 215693 214131 212292 210777 209826
51818 209826 209536 210084 211448 213156 214653 215797 216751 217537 217929 217814 217463 217402 217987 219058 220039 220498 220600
51801 220600 220884 221662 222823 224103 225249 225971 226156 226193 226656 227533 228105 227739 226476 224737 222938 221570 221153
51784 221153 221627 222135 221838 220830 219946 219835 220482 221438 222177 222408 222274 222209 222404 222625 222681 222819 223419 224533 226006
51765 226006 227804 229910 232059 233851 235063 235712 236001 236311 236975 237852 238411 238470 238559 239330 240861 242803 244871
51748 244871 246937 249005 251397 254686 258966 263436 267053 269478 271139 272691 274740 277732 281667 286065
51734 286065 290572 295450 301160 307754 314892 322119 328809 334396 339167 344377 350891 357980 364071 368406
51720C68406K870J669L05r15j446j492j676k034k072j607j012p76j223k339l575
51705C53083m141l865l404l347l545l640l707l963m252m346m311m165l557k358
51691C00482j132n43n48o93q59j166j412j218o09O3P06J542K633L660M173L784
51675C08863K291o0k476l967l989k771j176j52L7L0N13J280J640J614J976K980
51659C06633L906M290M772O080P667Q198P156N280L473J900K81j349k488k811
51645C52988k770l210m319n292n452n205n297n524n135m310m079m709n222m935
51631B87529m350m118m075l887l775l874l736l163k850l369m172m325l758k974
51617B35103k180j401r91j183j510j379q61l38K19Q94J289R55J02p81j550k105
$$ plain form
51720 368406 371276 372945 373250 372335 370889 369397 367721 365687 363615 362008 360996 360220 358997 356658 353083
51705 353083 348942 345077 341673 338326 334781 331141 327434 323471 319219 314873 310562 306397 302840 300482
51691 300482 299350 298807 298259 297566 296707 295541 294129 292911 292302 292365 293071 294613 297246 300906 305079 308863
51675 308863 311154 311094 308618 304651 300662 297891 296715 296563 296600 296630 297143 298423 300063 301677 303653 306633
51659 306633 310539 314829 319601 325681 333348 341546 348702 353982 357455 359355 359636 358287 355799 352988
51645 352988 350218 347008 342689 337397 331945 326740 321443 315919 310784 306474 302395 297686 292464 287529
51631 287529 283179 279061 274986 271099 267324 263450 259714 256551 253701 250332 246160 241835 238077 235103
51617 235103 232923 231522 230531 229348 227838 226459 225598 225260 225479 226373 227662 228617 228719 227938 226388 224283
51601B24283k056j349o89n54m10K68Q82O59J01K54R37J052M86K80Q68J444J464
51584B27920J543K325L383L929L909L806L825L840L861M114M669N313N754N920
51570B84111N993O106O006N312M150L185K780K558K084J463R12K66n73j148j147
51555C22058j112j750k755l129k481j333k98L98O85O75Q31J540K479K926K661
51540C21395K110J754J842K516L677M821N420N359M816M029L484L755M600M859
51526C74437L881K501J857J875J804J616J789K155K114J741J538J417J025Q18
51512D00568J439K301K137R97J56J1m25j567k372k153j796k296l198l543l520
51497C86739m020n098n840n594m616l621l188l411l878m103m074m052l868l097
$$ plain form
51601 224283 222227 220878 220189 219635 219225 219493 220375 221034 221135 221389 222326 223378 223864 224144 225012 226456 227920
51584 227920 229463 231788 235171 239100 243009 246815 250640 254480 258341 262455 267124 272437 278191 284111
51570 284111 290104 296210 302216 307528 311678 314863 317643 320201 322285 323748 324660 324926 324353 323205 322058
51555 322058 320946 319196 316441 313312 310831 309498 309200 309598 310283 310958 311789 313329 315808 318734 321395
51540 321395 323505 325259 327101 329617 333294 338115 343535 348894 353710 357739 361223 364978 369578 374437
51526 374437 378318 380819 382676 384551 386355 387971 389760 391915 394029 395770 397308 398725 399750 400568
51512 400568 402007 404308 406445 407442 407598 407609 407184 405617 403245 401092 399296 397000 393802 390259 386739
51497 386739 382719 377621 371781 366187 361571 357950 354762 351351 347473 343370 339296 335244 331376 328279
51483C28279k052j770k636l680l738k794j667r12n01k24J42P57J439J692J366
51468C13701R70J049J531J994K288K636L233L998M582M617M183L918M345N136
51454C58181N528N345N081N012M887M617M541M842N204N356N358N132M333K952
51440D26369J575P18L09R3P7L50P81J108J059M21o11j262r67k57j04m58k84P38
51422D29655J581J270O7j190k098k561k472k109k252l184m190m528m315l973l409
51407C96292k511j763j605j621j202n87m50p16o53p9L74K09l65r23j366j837k398
51390C78799k886k955k417j587j085j056r90n16J2R3k68q92j896l234m211m236
51374C50675l791l902m712n387n410n225n414n945o518p102p722q167q278q264
$$ plain form
51483 328279 326227 324457 321821 318141 314403 311609 309942 309030 308529 308305 308447 309204 310643 312335 313701
51468 313701 314671 315720 317251 319245 321533 324169 327402 331400 335982 340599 344782 348700 353045 358181
51454 358181 363709 369054 374135 379147 384034 388651 393192 398034 403238 408594 413952 419084 423417 426369
51440 426369 427944 428662 428971 429064 429141 429491 430272 431380 432439 432860 432249 430987 430020 429763 429659 429201 428917 429655
51422 429655 431236 432506 432573 431383 429285 426724 424252 422143 419891 416707 412517 407989 403674 399701 396292
51407 396292 393781 392018 390413 388792 387590 387003 386553 385837 385184 385105 385479 385688 385323 384400 383034 381197 378799
51390 378799 375913 372958 370541 368954 367869 366813 365823 365307 365319 365412 365144 364252 362356 359122 354911 350675
51374 350675 346884 342982 338270 332883 327473 322248 316834 310889 304371 297269 289547 281380 273102 264838
51360B64838q322q156p308n922m812m548m803m750m038l042k308k015k090k488
51346B00236l059l391l129k453j885j722j835j975j966j675j121o19m86n97n06
51331A73817l5N39Q11N76o4o42n67J53P05M88P8M98J634K284J862J275J601K698
51313A87711L563L662L316L028K958L040L257L718M437N092N243M949M814N067
51299B43855N044M189L120K843L162K869J563J41o20q81q65k86P01J048K4j745
51283B64162l184m060m749n277n345m973m466m041l825l902m023l803l408l497
51269B05609m104m438m183m075m540m721l830k614k322k761k710j923j411j775
51255A60202k418k608k328j813j152o29p30j398j836j434m54M23Q84J014R70Q84
$$ plain form
51360 264838 256516 248360 241052 235130 230318 225770 220967 216217 212179 209137 206829 204814 202724 200236
51346 200236 197177 193786 190657 188204 186319 184597 182762 180787 178821 177146 176025 175406 174920 174323 173817
51331 173817 173782 174321 175132 175708 175644 175002 174435 174588 175293 175781 175859 176357 177991 180275 182137 183412 185013 187711
51313 187711 191274 194936 198252 201280 204238 207278 210535 214253 218690 223782 229025 233974 238788 243855
51299 243855 248899 253088 256208 259051 262213 265082 266645 266786 266166 265285 264420 264134 264835 265883 265907 264162
51283 264162 260978 256918 252169 246892 241547 236574 232108 228067 224242 220340 216317 212514 209106 205609
51269 205609 201505 197067 192884 188809 184269 179548 175718 173104 170782 168021 165311 163388 161977 160202
51255 160202 157784 155176 152848 151035 149883 149254 148524 147126 145290 143856 143402 143825 144709 145723 146693 147577
51239A47577Q73Q94P44M00J88L90P54O32k56j345j685r90J5M15Q0m73q84j177
51221A46152j290j023m63KK55M62N94L84j01m54n72o94p58m26J03K05p3J00R36
51202A43339J498J041Q1m99n99n03j50M61Q06O12M71Q90J275P92k92r83r03m52
51184A46885K1L30K43j39j75L87P86L48l56m60l05q52j916k261j418k49K73j9
51166A41123q00j482j283K2J427J716J052N91O94O79L06J95M99M24m15j213j154
51149A42381n63k30l28o14j053j582j729j119j77K54j13p72j174j362j729k236
51133A27854k146r28P41J464Q50L9P0N16N07L42Q96J923K239J568R11R45J222
51116A39013J267J353J735K010J807J406J201J060P02J83l26p68r45n30L50J014
$$ plain form
51239 147577 148450 149344 150088 150488 150676 151066 151820 152452 152196 150851 149166 148176 148191 148606 148686 148213 147329 146152
51221 146152 144862 143839 143376 143378 143633 144095 144689 145073 144972 144518 143946 143252 142494 142068 142171 142376 142303 142403 143339
51202 143339 144837 145878 145959 145460 144861 144358 144208 144669 145475 146087 146558 147448 148723 149515 149223 148240 147337 146885
51184 146885 146906 147236 147479 147340 147165 147552 148338 148686 148330 147870 147565 146713 144797 142536 141118 140869 141142 141123
51166 141123 140323 138841 137558 137580 139007 140723 141775 142366 143060 143739 144045 144240 144739 145163 144748 143535 142381
51149 142381 141818 141588 141260 140646 139593 138011 136282 135163 134986 135240 135127 134355 133181 131819 130090 127854
51133 127854 125708 124780 125521 126985 127835 127874 127944 128460 128967 129309 130205 132128 134367 135935 136846 137791 139013
51116 139013 140280 141633 143368 145378 147185 148591 149792 150852 151554 151737 151411 150643 149698 149168 149518 150532
51100A50532R95N29P6j57j35J39M50N39N21O94R25P44J29m46p65j055j289j082
51082A51344m08K18N25P11P06M7j188k012j692o71R6K83J60n3l59p09r59q77j62
51063A45000J134K191K018P16m66n91oM14L81J80Q6J84M60O96P26Q46J497K345
51045A57811K452J630Q62R38J425J565J498J825K524L060L297L506L658L411K766
51030A92228K140J794J636J561J591J654J547J127M78j65o50j183k181l478l990
51015A94109k839p71M39J84k60K76J236J396P47K99N43J148J940L031M030M195
50999B09703L510K819K657K670K532K693L632M893N555N453N348N881O867P766
50985B71979Q459R242J0254J1326J2315J3241J4084J4767J5542J6980J9297K1953
$$ plain form
51100 150532 151527 152056 152132 151975 151840 151979 152429 152968 153489 154183 155108 155852 155981 155535 154770 153715 152426 151344
51082 151344 150936 151154 151679 152390 153096 153143 151955 149943 148251 147580 147676 147959 148119 148066 147707 146998 146039 145162 145000
51063 145000 146134 148325 150343 151059 150593 150002 149996 150410 150791 150971 151057 151241 151701 152397 153123 153969 155466 157811
51045 157811 160263 161893 162755 163693 165118 166683 168181 170006 172530 175590 178887 182393 186051 189462 192228
51030 192228 194368 196162 197798 199359 200950 202604 204151 205278 205756 205591 204941 203758 201577 198099 194109
51015 194109 191270 190499 190938 191122 190862 191138 192374 193770 194517 194816 195359 196507 198447 201478 205508 209703
50999 209703 213213 216032 218689 221359 223891 226584 230216 235109 240664 246117 251465 257346 264213 271979
50985 271979 280438 289680 299934 311260 323575 336816 350900 365667 381209 398189 417486 439439
50973D39439K4351K6591K9230L2439L5971L9760M4011M8723N3539N8148O2417
50962H94619O6154O9181P1531P3178P3764P3010P1204O8608O4680N8654N0853
50951A635436M2455L3959K4818J4848M951l942j1874j9244k5899l1271l4892l6466
50939A592879l6053l4510l3087l2230l1420l0403k9715k9592k9373k8642k8075
50928A249779k8445k9557l0927l2724l5106l7386l8849l9825m0934m1770m1493
50917H52763m0331l9248l8269l6430l3438l0247k7730k5660k3403k0855j8360
50906E18792j6150j4179j2198r993p797o337n887n554m137j680N29J587J837K037
50892D40870K362K560K609K694K855K959K910K749K596K528K473K374K500L269
$$ plain form
50973 439439 463790 490381 519611 552050 588021 627781 671792 720515 774054 832202 894619
50962 894619 960773 1029954 1101485 1174663 1248427 1321437 1392641 1461249 1525929 1584583 1635436
50951 1635436 1677891 1711850 1736668 1751516 1756467 1752525 1740651 1721407 1695508 1664237 1629345 1592879
50939 1592879 1556826 1522316 1489229 1456999 1425579 1395176 1365461 1335869 1306496 1277854 1249779
50928 1249779 1221334 1191777 1160850 1128126 1093020 1055634 1016785 976960 936026 894256 852763
50917 852763 812432 773184 734915 698485 665047 634800 607070 581410 558007 537152 518792
50906 518792 502642 488463 476265 466272 458475 452138 446251 440697 436560 434880 435409 436996 438833 440870
50892 440870 443232 445792 448401 451095 453950 456909 459819 462568 465164 467692 470165 472539 475039 478308
50878D78308M522N376N322N059N679P273R006J0392J1676J2988J3983J4565J5209
50865E99358J6321J7763J9420K1680K4946K8977L3111L7029M1038M5687N1305
50854I36635N7816O4980P2810Q1606R1416J01711J11943J22150J32515J42499
50844A916081J51156J58252J64244J68929J70904J68897J62912J53419J39947
50835C354741J21498R8258P2140M5453J9617m681k6867m6519o3623p8033q8848
50824C403136r4919r6181r3967q9750q3933p6323o7518n9242n3217n0089m9548
50813B588449n1062n4203n8503o3387o8391p3316p8162q2869q7106r0354r2309
50802A788787r2981r2312q9860q5337p9311p2950o7028o1484n5927n0072m3629
$$ plain form
50878 478308 482830 488206 493528 498587 504266 511539 520545 530937 542613 555601 569584 584149 599358
50865 599358 615679 633442 652862 674542 699488 728465 761576 798605 839643 885330 936635
50854 936635 994451 1059431 1132241 1213847 1305263 1406974 1518917 1641067 1773582 1916081
50844 1916081 2067237 2225489 2389733 2558662 2729566 2898463 3061375 3214794 3354741
50835 3354741 3476239 3574497 3646637 3692090 3711707 3707026 3680159 3633640 3570017 3491984 3403136
50824 3403136 3308217 3212036 3118069 3028319 2944386 2868063 2800545 2741303 2688086 2637997 2588449
50813 2588449 2537387 2483184 2424681 2361294 2292903 2219587 2141425 2058556 1971450 1881096 1788787
50802 1788787 1695806 1603494 1513634 1428297 1348986 1276036 1209008 1147524 1091597 1041525 997896
50791I97896l6425k8938k2259j7067j2918q835m312M34M859Q408J0720J1924J2531
50778I16018J2786J2389J1061R098P049N023K755J89k369m604o510q329j0289
50765I44267j2246j3679j4269j4402j4720j5221j5327j4851j4226j3601j2399
50754G89326j0177p269m173r30K388N246P420R628J2621J6055J9069K1639K4580
50741H85423K8290L2358L6363M0458M5121N0748N7465O4834P2000P8574Q5198
50730A476832R2645J00549J07653J13049J16505J17728J16236J11982J05354R6322
50720B554855Q4350O9407N2473L4585J5971l485k3132m1514n7305o9943p9312
50709B536950q5150q7156q5635q1649p6215o9681o2282n5004m8999m4235l9716
$$ plain form
50791 997896 961471 932533 910274 893207 880289 871454 867142 867576 872435 880843 891563 903487 916018
50778 916018 928804 941193 952254 961352 968401 973424 976179 976368 973999 969395 962885 954556 944267
50765 944267 932021 918342 904073 889671 874951 859730 844403 829552 815326 801725 789326
50754 789326 779149 771880 767707 766777 769165 774411 781831 791459 804080 820135 839204 860843 885423
50741 885423 913713 946071 982434 1022892 1068013 1118761 1176226 1241060 1313060 1391634 1476832
50730 1476832 1569477 1670026 1777679 1890728 2007233 2124961 2241197 2353179 2458533 2554855
50720 2554855 2639205 2708612 2761085 2795670 2811641 2808156 2785024 2743510 2686205 2616262 2536950
50709 2536950 2451800 2364644 2279009 2197360 2121145 2051464 1989182 1934178 1885179 1840944 1801228
50698A801228l5383l2730l2939l5338l8448m1837m5831n0110n3748n6353n8028
50687A320483n8451n7082n4228n0843m7235m2955l7955l2893k8179k3572j8927
50676H68163j4454j0063n245J51N677J1002J6181K1133K5585K9603L3457L6786
50664A017976L8774L9263L8936L8187L6732L4481L1866K8995K5454K1436J8028
50653A370128J5707J3494J0389O900M287K857K028J574J886L109M876O967R510
50640A453712J2572J6086K0203K5127L0530L5608L9870M3452M6532M8790M9662
50629A822144M8911M6690M3231L8752L3636K8465K3666J9329J5468J2370J0351
50618B143013R274Q724Q805J0282J3693J8494K3370K7140K9237K9704K8992K7470
$$ plain form
50698 1801228 1765845 1733115 1700176 1664838 1626390 1584553 1538722 1488612 1434864 1378511 1320483
50687 1320483 1262032 1204950 1150722 1099879 1052644 1009689 971734 938841 910662 887090 868163
50676 868163 853709 843646 838401 838552 844229 855231 871412 892545 918130 947733 981190 1017976
50664 1017976 1056750 1096013 1134949 1173136 1209868 1244349 1276215 1305210 1330664 1352100 1370128
50653 1370128 1385835 1399329 1409718 1416618 1420905 1423762 1425790 1427364 1429250 1432359 1437235 1444202 1453712
50640 1453712 1466284 1482370 1502573 1527700 1558230 1593838 1633708 1677160 1723692 1772482 1822144
50629 1822144 1871055 1917745 1960976 1999728 2033364 2061829 2085495 2104824 2120292 2132662 2143013
50618 2143013 2152287 2161011 2169816 2180098 2193791 2212285 2235655 2262795 2292032 2321736 2350728 2378198
50606B378198K4877K0687J5103R070K922m107j2480k1314k9598l7676m6346n5103
50594B244233o2600o8552p3718p8208q1200q2402q2405q1445p9121p5585p1694
50583A407303o7681o3034n8001n3768n0534m6869m1831l6438l2092k8683k5338
50572I03034k2007j9069j6131j2551q605n073k067P79L425N762Q366J1866J5791
50559H63520J8947K0912K2315K3924K6124K9045L2424L5519L7843L9807M2047
50548A192427M4456M6549M8345N0008N0993N0481M8522M5850M2670L8640L4102
50537A693043L0334K8344K8064K8924L0515L2487L4371L5908L7273L8920M1342
50526B059525M4955M9765N5291O1086O7159P3473P9328Q3812Q6690Q8267Q8548
$$ plain form
50606 2378198 2403075 2423762 2438865 2447935 2450857 2446750 2434270 2412956 2383358 2345682 2299336 2244233
50594 2244233 2181633 2113081 2039363 1961155 1879955 1797553 1715148 1633703 1554582 1478997 1407303
50583 1407303 1339622 1276588 1218587 1164819 1114285 1067416 1025585 989147 957055 928372 903034
50572 903034 881027 861958 845827 833276 824671 819598 817531 818310 821735 827497 835863 847729 863520
50559 863520 882467 903379 925694 949618 975742 1004787 1037211 1072730 1110573 1150380 1192427
50548 1192427 1236883 1283432 1331777 1381785 1432778 1483259 1531781 1577631 1620301 1658941 1693043
50537 1693043 1723377 1751721 1779785 1808709 1839224 1871711 1906082 1941990 1979263 2018183 2059525
50526 2059525 2104480 2154245 2209536 2270622 2337781 2411254 2490582 2574394 2661084 2749351 2837899
50515B837899Q7221Q4226P9578P2680O2736M9996L5800K1154O029r649k5075l9207
50503C263388n1760o2878p2141p8576q1619q1530p8738p3167o4534n3254m0571
50492B524620k7687j4946k283R693J9625K6561L0676L2517L1951K8261K0943J0047
50480B689978l911j9850l6249n1980o6752q0350r1709r9514j03615j05089j04947
50469A926012j03317j00033r5368q9963q4343p8660p2704o6170n9163n2280m5908
50458A078103l9747l3478k7606k2920j9263j5628j1470p277l686o64K198N175
50446I03737Q369J1698J4747J7123J9084K1285K3774K5833K7083K8094K9570L1416
50434A161813L3079L4377L5452L6304L6766L6879L6798L6517L5913L4965L3660
$$ plain form
50515 2837899 2925120 3009346 3088924 3161604 3224340 3274336 3310136 3331290 3337319 3327670 3302595 3263388
50503 3263388 3211628 3148750 3076609 2998033 2916414 2834884 2756146 2682979 2618445 2565191 2524620
50492 2524620 2496933 2481987 2479704 2489397 2509022 2535583 2566259 2598776 2630727 2658988 2679931 2689978
50480 2689978 2686067 2666217 2629968 2577988 2511236 2430886 2339177 2239663 2136048 2030959 1926012
50469 1926012 1822695 1722662 1627294 1537331 1452988 1374328 1301624 1235454 1176291 1124011 1078103
50458 1078103 1038356 1004878 977272 954352 935089 919461 907991 900714 897028 896364 898562 903737
50446 903737 912106 923804 938551 955674 974758 996043 1019817 1045650 1072733 1100827 1130397 1161813
50434 1161813 1194892 1229269 1264721 1301025 1337791 1374670 1411468 1447985 1483898 1518863 1552523
50423A552523L1885K9679K7436K5558K4028K2507K0757J8855J7135J6117J6278
50412A802758J7585J9445K1266K2947K4642K6249K7446K8132K8522K8772K8712
50401B076476K7978K6328K3784K0543J6695J2047O301m74p807j5373k3440l2464
50389B130594m2256n1786n9920o6227p0915p4123p5573p5048p2861o9548o5125
50378A407212n9080n1260m2451l3709k5337j6958q489n51O177J1519J5498J7806
50366A220377J7989J6026J2357P388J338n417j2207j8474k4074k9010l3003l5710
50354A117580l7198l7846l7760l6727l4869l2811l0944k8911k6321k3607k1526
50343G69060k0011j8211j5729j3116j0964r170p386n648m174k938j784o26P55
$$ plain form
50423 1552523 1584408 1614087 1641523 1667081 1691109 1713616 1734373 1753228 1770363 1786480 1802758
50412 1802758 1820343 1839788 1861054 1884001 1908643 1934892 1962338 1990470 2018992 2047764 2076476
50401 2076476 2104454 2130782 2154566 2175109 2191804 2203851 2210152 2209678 2201871 2186498 2163058 2130594
50389 2130594 2088338 2036552 1976632 1910405 1839490 1765367 1689794 1614746 1541885 1472337 1407212
50378 1407212 1348132 1296872 1254421 1220712 1195375 1178417 1169928 1169377 1175554 1187073 1202571 1220377
50366 1220377 1238366 1254392 1266749 1274137 1275475 1270058 1257851 1239377 1215303 1186293 1153290 1117580
50354 1117580 1080382 1042536 1004776 968049 933180 900369 869425 840514 814193 790586 769060
50343 769060 749049 730838 715109 701993 691029 681859 674473 668825 664651 661713 659929 659303 660058
50330F60058K645M882O818Q134R288J0785J2483J4020J5405J6664J7393J7349
50318G95924J7122J7545J8650J9833K0807K1649K2249K2482K2717K3324K3756
50307A026058K2984K1022J9083J8015J7313J5986J3771J1074Q261N513K993Q77
50295A182950p57j947k993m440o505q644j0175j1294j2800j4858j6815j8402k0209
50282A053111k2604k4960k6516k7296k7656k7526k6816k6022k5647k5325k4350
50271G68393k2872k1721k1086k0191j8451j6317j4692j3880j3407j2617j1161
50260E81998r193p247n883n250n023m772m224l276j965n72M22O42J86m29o33j78
50244E34603P03J483J755J575J367J400J424R94J69l42o8M69K54r31k201k739
$$ plain form
50330 660058 662703 667585 674403 682537 691825 702610 715093 729113 744518 761182 778575 795924
50318 795924 813046 830591 849241 869074 889881 911530 933779 956261 978978 1002302 1026058
50307 1026058 1049042 1070064 1089147 1107162 1124475 1140461 1154232 1165306 1173567 1179080 1182073 1182950
50295 1182950 1182193 1180246 1177253 1172813 1166308 1157664 1147489 1136195 1123395 1108537 1091722 1073320 1053111
50282 1053111 1030507 1005547 979031 951735 924079 896553 869737 843715 818068 792743 768393
50271 768393 745521 723800 702714 682523 664072 647755 633063 619183 605776 593159 581998
50260 581998 572805 565558 559675 554425 549402 544630 540406 537130 535165 534593 535015 535657 535843 535414 534781 534603
50244 534603 535306 536789 538544 540119 541486 542886 544310 545304 545473 545131 545063 545532 545786 544855 542654 539915
50228E39915k753k895l178l102k655k455k829l319l328k829k229j813j581j375
50214E03574r43j15R26J722J987J861J656J572J681J935K071J769J092N64P20
50199E22072J591K675L192K589J056m02q27k76L61N14M12L13r5j173k597l683
50183E25722m190m371m436m400m424m845n779o878p556p394o393m983l730k929
50169D53414k473k191k056k016j809j252m93J71O38Q43N01o35k218l429l841l874
50153D29280m199m820n130m755m029l408k827k027j370j619k722l401k534o12
50139C85827P64P28j12p19p48m71j88p1j46j57K46R53J390J339J303J774K520
50122C94232L047L427M075M927N443N421N258N382N787O205O368O043N223M303
$$ plain form
50228 539915 537162 534267 531089 527987 525332 522877 520048 516729 513401 510572 508343 506530 504949 503574
50214 503574 502631 502516 503442 505164 507151 509012 510668 512240 513921 515856 517927 519696 520788 521352 522072
50199 522072 523663 526338 529530 532119 533175 532773 531946 531670 532031 532545 532957 533270 533175 532002 529405 525722
50183 525722 521532 517161 512725 508325 503901 499056 493277 486399 478843 471449 465056 460073 456343 453414
50169 453414 450941 448750 446694 444678 442869 441617 441124 441295 441933 442776 443277 442642 440424 436995 433154 429280
50153 429280 425081 420261 415131 410376 406347 402939 400112 398085 396715 395096 392374 388973 386439 385827
50139 385827 386591 387319 387207 386488 385740 385269 385081 385010 384864 384707 384953 385906 387296 388635 389938 391712 394232
50122 394232 397279 400706 404781 409708 415151 420572 425830 431212 436999 443204 449572 455615 460838 465141
50108D65141L739L465L012K279J757J746J830J461P45J63j49m09n93m51p2J18
50092D83782N4K23Q69J544J828K008K537L169L294L028L204M244N604O520O756
50077E28664O496O077O079P034Q635R774R863R612R978J0733J0864J0047Q992
50064F42848Q350Q003P509O717N830N188N041N160M854L808K787K840L804M378
50050G17117L825K858K555K937L177K810K177J812J783J666R93k74j636k480k667
50035G36653k561k625l124m055n127n858o067o075o201o268o087o046o593p290
50021F62676p196o212n213m760m457l891l334l110k977k610k138j712j041J22
50007F14147J468K561L386M067M505M761N303O350P349P669P482P418P733Q340
$$ plain form
50108 465141 468880 472345 475357 477636 479393 481139 482969 484430 485175 485338 485189 484780 484187 483736 483664 483782
50092 483782 483836 484059 484928 486472 488300 490308 492845 496014 499308 502336 505540 509784 515388 521908 528664
50077 528664 535160 541237 547316 554350 562985 572759 582622 592234 602212 612945 623809 633856 642848
50064 642848 651198 659201 666710 673427 679257 684445 689486 694646 699500 703308 706095 708935 712739 717117
50050 717117 720942 723800 726355 729292 732469 735279 737456 739268 741051 742717 743710 743436 741800 739320 736653
50035 736653 734092 731467 728343 724288 719161 713303 707236 701161 694960 688692 682605 676559 669966 662676
50021 662676 655480 649268 644055 639295 634838 630947 627613 624503 621526 618916 616778 615066 614025 614147
50007 614147 615615 618176 621562 625629 630134 634895 640198 646548 653897 661566 669048 676466 684199 692539
49993F92539R373J1058J3184J5282J7207J9152K1297K3854K7132L1050L4743L7231
49981I53102L8346L8591L8307L7393L5602L2657K8332K3034J7988J4306J2057
49970A269715J0804J0630J1788J3558J4477J3799J1807Q608L579l570j2009k0569
49958A332617k8779l6600m3614m9081n2563n4047n3721n2019m9708m7438m5237
49947H19810m2646l9384l5632l1792k8199k5038k2370k0149j8273j6648j5200
49936E24479j3861j2582j1322j0015q638p196n685m140k774j932j692j736j725
49923D41181j702j826j893j491n83L25O72L21m02r43q41p9P96J180J014P38O73
49906D37140P06N89L50K95P48J750K933L743L929L769L717L994M640N696O995
$$ plain form
49993 692539 701912 712970 726154 741436 758643 777795 799092 822946 850078 881128 915871 953102
49981 953102 991448 1030039 1068346 1105739 1141341 1173998 1202330 1225364 1243352 1257658 1269715
49970 1269715 1280519 1291149 1302937 1316495 1330972 1344771 1356578 1365186 1368765 1365195 1353186 1332617
49958 1332617 1303838 1267238 1223624 1174543 1121980 1067933 1014212 962193 912485 865047 819810
49947 819810 777164 737780 702148 670356 642157 617119 594749 574600 556327 539679 524479
49936 524479 510618 498036 486714 476699 468061 460865 455180 451040 448266 446334 444642 442906 441181
49923 441181 439479 437653 435760 434269 433686 434011 434683 435004 434602 433659 432818 432739 433535 434715 435729 436467 437140
49906 437140 437846 438435 438785 439080 439828 441578 444511 448254 452183 455952 459669 463663 468303 473999 480994
49891D80994P990Q236Q029Q178R080J0347J1350J1861J2137J2685J3950J5919
49879F10756J7982J9488K0503K1703K3585K6152K9383L3460L8237M3021M7335
49868I31605N1653N6823O2695O7799P0633P1049P0119O8620O6154O2001N6599
49857A635750N1543M7988M5652M3727M2227M1677M1862M1677M0176L7008L1771
49846B101058K3841J3318J507j0190k1437l2466m2890n1700n8373o3328o7080
49835A792260o9548p0491p0296o9892o9816o9599o8219o5182o1128n7226n4073
49824A066790n1288m8223m4764m1226l7746l4169l0516k7153k4288k1622j8783
49813F87012j5953j3794j2678j2278j1997j1626j1372j1344j1187j0400q971p592
$$ plain form
49891 480994 488984 497220 505249 513427 522507 532854 544204 556065 568202 580887 594837 610756
49879 610756 628738 648226 668729 690432 714017 740169 769552 803012 841249 884270 931605
49868 931605 983258 1040081 1102776 1170575 1241208 1312257 1382376 1450996 1517150 1579151 1635750
49857 1635750 1687293 1735281 1780933 1824660 1866887 1908564 1950426 1992103 2032279 2069287 2101058
49846 2101058 2124899 2138217 2139724 2129534 2108097 2075631 2032741 1981041 1922668 1859340 1792260
49835 1792260 1722712 1652221 1581925 1512033 1442217 1372618 1304399 1239217 1178089 1120863 1066790
49824 1066790 1015502 967279 922515 881289 843543 809374 778858 751705 727417 705795 687012
49813 687012 671059 657265 644587 632309 620312 608686 597314 585970 574783 564383 555412 547820
49801E47820p108p631q267p990o790n693n526n972o082n455m516l805l501l643
49787D65841m187m705m464l212j627o96p74j437k019k111j717j085m41K03Q33
49772D38402J212J230J303J899K656K737K158K031K992M235M733M735N180O141
49758D81644O926P487Q619J0718J3216J5496J7618J9885K2460K5613K9675L4380
49746F93737L8854M2551M5750M8755N1214N2593N2889N2265N0425M6931M2021
49735A217985L6602L1504K7105K3551K0946J9295J8563J8795J9817K0786K0341
49724A475290J7402J1788M059n118j5345k6293l7296m7286n5201o0403o2727o2417
49712A136453o0180n7106n4046n0986m7277m2627l7612l3077k9345k6178k3296
$$ plain form
49801 547820 540712 533081 524814 516824 510034 504341 498815 492843 486761 481306 476790 472985 469484 465841
49787 465841 461654 456949 452485 449273 447646 446950 446176 444739 442720 440609 438892 437807 437366 437569 438402
49772 438402 439614 440844 442147 444046 446702 449439 451597 453628 456620 460855 465588 470323 475503 481644
49758 481644 488570 496057 504676 515394 528610 544106 561724 581609 604069 629682 659357 693737
49746 693737 732591 775142 820892 869647 920861 973454 1026343 1078608 1129033 1175964 1217985
49735 1217985 1254587 1286091 1313196 1336747 1357693 1376988 1395551 1414346 1434163 1454949 1475290
49724 1475290 1492692 1504480 1508539 1503421 1488076 1461783 1424487 1377201 1322000 1261597 1198870 1136453
49712 1136453 1076273 1019167 965121 914135 866858 824231 786619 753542 724197 698019 674723
49701F74723k0624j8145j5841j3823j2263j1083r857q251o458n009m113l461k749
49688E43046k094j673j243n19O9k82j521k528k473j814j488j638j786j779j766
49673E20511j461m20R95J718J347O63N49J007J499J722J610J032P4o74n66L48
49657E29954J291J445O95k62m65L89J599K229K146J928J869J603Q77J30p5K44
49641E45597O78R81J096R83P95R89J824K835L274K993K586K577K829K877K604
$$ plain form
49701 674723 654099 635954 620113 606290 594027 582944 573087 564836 558378 553369 549256 545795 543046
49688 543046 540952 539279 538036 537517 537586 537304 535783 533255 530782 528968 527480 525842 524056 522277 520511
49673 520511 519050 518630 519625 521343 522690 523353 523902 524909 526408 528130 529740 530772 530846 530172 529606 529954
49657 529954 531245 532690 533385 533123 532658 533047 534646 536875 539021 540949 542818 544421 545298 545428 545353 545597
49641 545597 546275 547256 548352 549335 550130 551119 552943 555778 559052 562045 564631 567208 570037 572914 575518
$$ [...]
##END NTUPLES=NMR SPECTRUM
##END=
