
##TITLE=AC1301_CHIAH12113_6534571_PfTGTWBq4l
##JCAMPDX= 6.0         $$ Bruker NMR JCAMP-DX V2.0
##DATA TYPE= NMR SPECTRUM
##DATA CLASS= NTUPLES
##ORIGIN= BRUKER
##OWNER= Administrator
$$ 1.72 TOPSPIN		Version 2.1
$$ 2012-07-17 01:40:07.359 -0500  Administrator@TOPSPIN
$$ Compression mode = diff/dup
##.OBSERVE FREQUENCY= 400.02188249412
##.OBSERVE NUCLEUS= ^1H
##.ACQUISITION MODE= SIMULTANEOUS (DQD)
##.ACQUISITION SCHEME= undefined
##.AVERAGES= 8
##.DIGITISER RES= 22
##SPECTROMETER/DATA SYSTEM= spect
##.PULSE SEQUENCE= zg30
##.SOLVENT NAME= COFFEE_meoh
##.SHIFT REFERENCE= INTERNAL, COFFEE_meoh, 1, 14.98509
##AUDIT TRAIL= $$ (NUMBER, WHEN, WHO, WHERE, PROCESS, VERSION, WHAT)
$$ ##TITLE= Audit trail, TOPSPIN		Version 2.1
$$ ##JCAMPDX= 5.01
$$ ##ORIGIN= Bruker BioSpin GmbH
$$ ##OWNER= Administrator
$$ $$ C:\Bruker\TOPSPIN/data/COFFEE/nmr/AC1301_CHIAH12113_6534571_PfTGTWBq4l/10/pdata/1/auditp.txt
$$ ##AUDIT TRAIL=  $$ (NUMBER, WHEN, WHO, WHERE, PROCESS, VERSION, WHAT)
(   1,<2012-07-17 01:40:00.593 -0500>,<Administrator>,<TOPSPIN>,<go>,<TOPSPIN 2.1>,
      <created by zg
	started at 2012-07-17 01:38:54.140 -0500,
	POWCHK enabled, PULCHK disabled,
       configuration hash MD5:
       6B 1B 68 BB D9 2E 58 E2 7F 35 AD 54 07 DF 0E 41
       data hash MD5: 64K
       11 15 15 14 CD 85 FD 49 4F 80 D6 3E 9F CE 61 36>)
(   2,<2012-07-17 01:40:03.187 -0500>,<Administrator>,<TOPSPIN>,<proc1d>,<TOPSPIN 2.1>,
      <Start of raw data processing
       efp LB = 0 FT_mod = 6 PKNL = 1 PHC0 = 0 PHC1 = 0 SI = 32K 
       data hash MD5: 32K
       43 7F 3E 87 C8 AF 33 FE 6B 06 A2 C2 F0 BC 90 45>)
(   3,<2012-07-17 01:40:03.562 -0500>,<Administrator>,<TOPSPIN>,<proc1d>,<TOPSPIN 2.1>,
      <pk PHC0 = 179.7968 PHC1 = 0 
       data hash MD5: 32K
       9E 0E 77 72 C8 D0 08 A7 F8 94 AC ED E8 E8 F1 AC>)
(   4,<2012-07-17 01:40:03.671 -0500>,<Administrator>,<TOPSPIN>,<proc1d>,<TOPSPIN 2.1>,
      <abs ABSG = 1 
       data hash MD5: 32K
       D4 13 DD 9F 94 E8 5B 1A 78 B8 D4 4A 6B 78 70 6B>)
(   5,<2012-07-17 01:40:03.734 -0500>,<Administrator>,<TOPSPIN>,<proc1d>,<TOPSPIN 2.1>,
      <abs ABSG = 2 
       data hash MD5: 32K
       AC 14 2C 4D 2F 95 9F E0 66 DC C2 C1 97 40 FD 67>)
(   6,<2012-07-17 01:40:03.781 -0500>,<Administrator>,<TOPSPIN>,<proc1d>,<TOPSPIN 2.1>,
      <abs ABSG = 3 
       data hash MD5: 32K
       D6 9F 69 5B A7 60 73 92 45 4F 02 79 35 F4 C6 D8>)
(   7,<2012-07-17 01:40:03.812 -0500>,<Administrator>,<TOPSPIN>,<proc1d>,<TOPSPIN 2.1>,
      <abs ABSG = 4 
       data hash MD5: 32K
       82 9D 7A D7 7B 28 B1 A4 EA EA 92 97 0E 02 D6 D4>)
(   8,<2012-07-17 01:40:03.843 -0500>,<Administrator>,<TOPSPIN>,<proc1d>,<TOPSPIN 2.1>,
      <abs ABSG = 5 
       data hash MD5: 32K
       3C 46 47 F7 87 57 06 72 4C C8 F2 47 B8 A3 2D 36>)
$$ ##END=
$$ 
$$ $$ hash MD5
$$ $$ 4B 1A 78 46 7B 71 96 39 72 01 9C 9F 0D 69 51 84
##$RELAX= 
##$RELAX= 
##$RELAX= 
##$RELAX= 
##$RELAX= 
##$RELAX= 
##$RELAX= 
$$ Bruker specific parameters
$$ --------------------------
$$ [...]
##$TP= (0..7)
150 150 150 150 150 150 150 150
##$TP07= 0
##$TPNAME0= <>
##$TPNAME1= <>
##$TPNAME2= <>
##$TPNAME3= <>
##$TPNAME4= <>
##$TPNAME5= <>
##$TPNAME6= <>
##$TPNAME7= <>
##$TPOAL= (0..7)
0.5 0.5 0.5 0.5 0.5 0.5 0.5 0.5
##$TPOFFS= (0..7)
0 0 0 0 0 0 0 0
##$TUNHIN= 0
##$TUNHOUT= 0
##$TUNXOUT= 0
##$USERA1= <user>
##$USERA2= <user>
##$USERA3= <user>
##$USERA4= <user>
##$USERA5= <user>
##$V9= 5
##$VALIST= <valist>
##$VCLIST= <CCCCCCCCCCCCCCC>
##$VD= 0
##$VDLIST= <DDDDDDDDDDDDDDD>
##$VPLIST= <PPPPPPPPPPPPPPP>
##$VTLIST= <TTTTTTTTTTTTTTT>
##$WBST= 2048
##$WBSW= 25
##$XGAIN= (0..3)
0 0 0 0
##$XL= 0
##$YL= 0
##$YMAX_a= 509717
##$YMIN_a= -652130
##$ZGOPTNS= <>
##$ZL1= 120
##$ZL2= 120
##$ZL3= 120
##$ZL4= 120
##$ABSF1= 14.98509
##$ABSF2= -5.573092
##$ABSG= 5
##$ABSL= 3
##$ALPHA= 0
##$AQORDER= 0
##$ASSFAC= 0
##$ASSFACI= 0
##$ASSFACX= 0
##$ASSWID= 0
##$AUNMP= <proc_prof1d_extract_pilot.lims>
##$AXLEFT= 0
##$AXNAME= <>
##$AXNUC= <1H>
##$AXRIGHT= 0
##$AXTYPE= 0
##$AXUNIT= <>
##$AZFE= 0.1
##$AZFW= 0.1
##$BCFW= 0
##$BC_mod= 0
##$BYTORDP= 0
##$COROFFS= 0
##$CY= 15
##$DATMOD= 1
##$DC= 0
##$DFILT= <>
##$DTYPP= 0
##$F1P= 0
##$F2P= 0
##$FCOR= 0.5
##$FTSIZE= 32768
##$FT_mod= 6
##$GAMMA= 0
##$GB= 0
##$INTBC= 1
##$INTSCL= 1
##$ISEN= 128
##$LB= 0
##$LEV0= 0
##$LPBIN= 0
##$MAXI= 10000
##$MC2= 0
##$MEAN= 0
##$ME_mod= 0
##$MI= 0
##$NCOEF= 0
##$NC_proc= -8
##$NLEV= 6
##$NOISF1= 0
##$NOISF2= 0
##$NSP= 0
##$NTH_PI= 0
##$NZP= 0
##$OFFSET= 14.98509
##$PC= 1
##$PHC0= 179.7968
##$PHC1= 0
##$PH_mod= 1
##$PKNL= yes
##$PPARMOD= 0
##$PPDIAG= 0
##$PPIPTYP= 0
##$PPMPNUM= 2147483647
##$PPRESOL= 1
##$PSCAL= 4
##$PSIGN= 0
##$PYNMP= <proc.py>
##$REVERSE= no
##$SF= 400.02
##$SI= 32768
##$SIGF1= 0
##$SIGF2= 0
##$SINO= 400
##$SIOLD= 32768
##$SPECTYP= <>
##$SREGLST= <1H.CDCl3>
##$SSB= 0
##$STSI= 32768
##$STSR= 0
##$SW_p= 8223.68421052631
##$SYMM= 0
##$S_DEV= 0
##$TDeff= 65536
##$TDoff= 0
##$TI= <>
##$TILT= no
##$TM1= 0
##$TM2= 0
##$TOPLEV= 0
##$USERP1= <user>
##$USERP2= <user>
##$USERP3= <user>
##$USERP4= <user>
##$USERP5= <user>
##$WDW= 1
##$XDIM= 32768
##$YMAX_p= 471899176
##$YMIN_p= -811120
##$CURPLOT= <Network HP LaserJet P1505>
##$CURPRIN= <$Network HP LaserJet P1505>
##$DFORMAT= <normdp>
##$LAYOUT= <+/1D_H.xwp>
##$LFORMAT= <normlp>
##$PFORMAT= <normpl>
##$SURQMSG= 1
$$ End of Bruker specific parameters
$$ ---------------------------------
##NTUPLES= NMR SPECTRUM
##VAR_NAME=  FREQUENCY,     SPECTRUM/REAL,   SPECTRUM/IMAG
##SYMBOL=    X,             R,               I
##VAR_TYPE=  INDEPENDENT,   DEPENDENT,       DEPENDENT
##VAR_FORM=  AFFN,          ASDF,            ASDF
##VAR_DIM=   32768,         32768,           32768
##UNITS=     HZ,            ARBITRARY UNITS, ARBITRARY UNITS
##FACTOR=    0.250966925370066, 1,           1
##FIRST=     8223.43324360094, -152676,      35086
##LAST=      0,             69615,           -41631
##MIN=       0,             -811120,         0
##MAX=       8223.43324360094, 471899176,    0
$$ Real data points
##PAGE= N=1
##DATA TABLE= (X++(R..R)), XYDATA
$$ [...]
19538a66177J638g1390k03039A03453j1564L5315d3811D5596a12861c8733m0185
19527g8918p3851L4883B8987Q1700J35429i1151d0879F0180a83222b5339k99327
19516c24666n4004b2473A20118a5903j17141j18597J17714f586D8256B826b6397
19504a38249L3228J9916A9265K41709i4008n3826b8235F2765d5909j63549F1412
19492A84003b51423P6675n3588A25711J21100a4676m6728b1949H9302a38428q9931
19481b28359A62160c87557B55402a41419B64233c5544A59582C5002g5145B02445
19470H345c09468D4107d1176l3440k10923L2909D8434a51159D4735E728a62049
19458h0469k56568F3693h6789n1294c3181C0002L42990b27m13344a10099B7091
$$ y = [-166177, -164539, -71390, -274429, 103453, 91889, 127204, -43811, 45596, -112861, -38733, -78918, -152769, -117886, 28987, 110687, 246116, -91151, -40879, 60180, -183222, -25339, -324666, -378670, -22473, 120118, -15903, -133044, -251641, -133927, -6586, 48256, 2826, -26397, -138249, -105021, -85105, 19265, 260974, -94008, -147834, -28235, 62765, -45909, -209458, 61412, 184003, -251423, -174748, -228336, 125711, 246811, -14676, -61404, -21949, 89302, -138428, -228359, 162160, -387557, 255402, -141419, 264233, -35544, 159582, 35002, -75145, 202445, 8345, -309468, 44107, -41176, -74616, -285539, -252630, 48434, -151159, 44735, 5728, -162049, -80469, -337037, 63693, -86789, -138083, -33181, 30002, 372992, -227, -413571, -110099, 27091]
19446a19545o0393P9515H1109J19625C1686N1633A212J07881D2800b16068F8701
19434a43263p8091D2014R6803d0603A68172a716m814k23427J9766L6797C7766
19422B8046R527b33590D6962f8019o6960A86036C5184L50355j85659D7430b23334
19410A33737c03234A96876c43148B8246J58315b12610j54677h7171G1055O6618
19400A37673d1409m5276A77821i859G2409a71950d4954o5700j83001A08770C7011
19388A60309C8228a54076K4728B74802q4631B1358g0550k19395g7187o4406D1906
19376A35821f7036q9170j38358K8817J6844c4017A1467e9350A40585j9999J00692
19365B21278C5102c63989J39199h0268J4862K9092l25659G9364b71553a03441
$$ y = [-119545, -179938, -100423, 81109, 200734, 31686, 83319, 1212, 109093, 42800, -216068, 68701, -143263, -221354, 42014, 138817, -40603, 168172, -1716, -6530, -229957, -210191, -173394, 37766, 28046, 37573, -233590, 46962, -68019, -134979, 186036, 35184, 385539, 199880, 47430, -223334, 133737, -303234, 196876, -343148, 28246, 186561, -212610, -367287, -87171, 71055, 137673, -41409, -86685, 177821, -9859, 72409, -171950, -44954, -110654, -293655, 108770, 37011, 160309, 38228, -154076, -129348, 274802, 190171, 21358, -70550, -289945, -77187, -141593, 41906, 135821, -67036, -156206, -294564, -265747, -248903, -34017, 11467, -59350, 140585, 120586, 221278, 35102, -363989, -224790, -80268, -65406, -36314, -361973, 79364, -271553, -103441]
19354a48224E2945a42503M1656E6087H37a15990r9809A350b39369A3277c80A95654
19341a98484P3086A288a35860D8014a00341A71824a28892c7774m877j84320k1599
19330b48570B92431d50442i8632A32293b83768Q5959e9070A6369g0389C37437
19319b72525b7957k062j48508A38222a37102H3711J1981D3193M3429L761B0997
19307b42363d2626j57944P9886D7240J66591a71308g3041o9646r3748C79672i667
19295I6651d19314g8550a9152A86345H8376M7710a79779D3338h6209L5859r0835
19284a41185C22084A10118a49345D562J31676n1232a23974J2234j66732d9900
19273c7553p399f967q6861B7786d27571J64438H8700b9681I6812a87646C88466
$$ y = [-148224, 52945, -142503, -100847, 56087, 837, -115990, -215799, 1350, -239369, 13277, -380, 195654, -198484, -125398, 1288, -135860, 48014, -100341, 171824, -128892, -37774, -42651, -226971, -248570, 292431, -450442, -98632, 132293, -283768, -197809, -59070, 16369, -70389, 337437, -272525, -27957, -30019, -178527, 138222, -137102, 83711, 95692, 43193, 86622, 90383, 20997, -242363, -42626, -200570, -120684, 47240, 213831, -171308, -73041, -142687, -236435, 379672, -9667, 96651, -419314, -78550, -19152, 186345, 88376, 136086, -179779, 43338, -86209, -50350, -141185, 322084, 110118, -149345, 4562, 136238, 85006, -123974, -111740, -278472, -49900, -37553, -44952, -6967, -93828, 27786, -427571, -263133, 88700, -29681, 96812, -187646, 388466]
19261A96348r2470b89192A5428J3278r008c1158l00820D9927a58601L5264F1593
19249a25727A88778E9498c49629h7753j01652p1636i238c597A538c8483B3575
19237A28328a23337A91420A9875c74771c4081n4885I8713b63j45190B2481J224
19226B3705a42335B6127b55164j69239a44874C40401B9681a62562k9072c7178
19215a24732N9672J771r6326D0563b58252O3714p4723L8805D8281b80537G4160
19203d47554D37060a20678J3893D8280a86176A96929c0956a4294D7541a72121
19192b23156f810q4461I8330a29785L2698k05550J12565o8174a19368k44060G225
19180c38532d5728a9868r0682B71441C9934J07333b41123f0463E2208c24800f3110
$$ y = [196348, 103878, -289192, 15428, 28706, 19698, -31158, -331978, 49927, -158601, -123337, 61593, -125727, 188778, 59498, -349629, -87753, -189405, -261041, -9238, -3597, 1538, -38483, 23575, 128328, -123337, 191420, 19875, -374771, -34081, -88966, 98713, -263, -145453, 22481, 23705, -142335, 26127, -255164, -424403, -144874, 340401, 29681, -162562, -191634, -37178, -124732, -65060, -63289, -159615, 40563, -258252, -194538, -269261, -230456, 48281, -280537, 74160, -447554, 437060, -120678, -106785, 48280, -186176, 196929, -30956, -14294, 47541, -172121, -223156, -6810, -91271, 98330, -129785, -97087, -302637, -190072, -258246, -119368, -363428, 7225, -338532, -45728, -19868, -110550, 271441, 39934, 147267, -241123, -60463, 52208, -324800, -63110]
19168b38537a14782m6473M5920l73688C55629h567C27741c6588I6463D7890a80284
19156A57240f9475H8300J5148i4544K9654A13139J24075A2312g0503C8917i859
19144b3604l286H520a5633k92417A17075A3990K1070b59425k1349e9574B7386
19132A00157d8681R354A55605a39475b4474A9098a0827l922B96182a32725A22959
19120I5210d1933l3471j68205K2906l2335C85282a99533Q8397j33882c8439j74126
19109b12565A08200a91167D10947b25328k3439M945B72951a41010c4139j78327
19099b12466A40321D3127J11050Q8663k1229b2111k20594j40084R4015A40047
19088D0976K2712b4407j36302A24514k1517i8983q8832F0199k7075b24540m3278
$$ y = [-238537, -114782, -161255, -115335, -489023, 355629, -8567, 327741, -36588, 96463, 47890, -180284, 157240, -69475, 88300, 103448, -94544, -64890, 113139, 237214, 12312, -70503, 38917, -9859, -23604, -26890, 8520, -15633, -308050, 117075, 13990, 35060, -259425, -280774, -59574, 27386, 100157, -48681, -39327, 155605, -139475, -24474, 19098, -10827, -14749, 296182, -132725, 122959, 95210, -41933, -75404, -243609, -220703, -253038, 385282, -199533, -111136, -245018, -38439, -212565, 108200, -191167, 410947, -225328, -248767, -243822, 272951, -141010, -34139, -212466, 140321, 43127, 154177, 242840, 221611, -22111, -242705, -382789, -288774, 140047, 40976, 63688, -24407, -160709, 124514, 102997, -98983, -187815, 60199, 33124, -224540, -267818]
19077b67818g364D2135c1743D4543d81886b36551h436j17398j84650J47022I0904
19065d41299C0629Q4666K42042C7042a75667h0297A13938b69337A01389k6897
19055G4492c419A78592b93986h6765J9113C84275j91318b26100D7802a35099k3719
19044a58818d9881G5740P7679e6200A41024c8991D2034b59082B83309D8212d39440
19032A76857f4424D11106b4866k67015A28646a16762D15923h3300B10248D0154
19021E0125J24550H6855b31327B9980J90160b30616h2230A27986f2937o559b3080
19009a8856g391E4162c6202r0939l37450a19684a7548o177G8934n881C3906K03156
18997B37062a73142p672j00165G9622b51796J18721n0060A57400i0458C8871a40787
$$ y = [-267818, -7364, 42135, -31743, 44543, -481886, -236551, -8436, -125834, -310484, -163462, 90904, -441299, 30629, 115295, 357337, 37042, -175667, -80297, 113938, -269337, 101389, 74492, -3419, 178592, -293986, -86765, -67652, 384275, 192957, -226100, 47802, -135099, -158818, -49881, 75740, 153419, -56200, 141024, -38991, 42034, -259082, 283309, 48212, -439440, 176857, -64424, 411106, -24866, -291881, 128646, -116762, 415923, -83300, 210248, 40154, 50125, 174675, 86855, -231327, 29980, 220140, -230616, -82230, 127986, -62937, -69496, -23080, -18856, -7391, 54162, -36202, -127141, -464591, -119684, -17548, -23725, 78934, 73053, 33906, 237062, -173142, -180814, -280979, 79622, -251796, -133075, -183135, 157400, -90458, 38871, -140787]
18985a21112H5204a757E1905a55122A73129N161i9969L6572j83973O0729j23572
18974c10213A58241A6376g6293K913A21454B9759c4626m1064k66718a40241k60364
18963d00605a00054k32165B12070C1710Q4123f1214A11873e7980C404N1809B5520
18951a53648B12122f8908E7714f2369B43070p2671p8199a78502c6781g271k59589
18940b66860i1131G3453B4126L13170a8142A11130b62677J27325p4870B09146
18929A57224o5363J50357a20061C43986g0702B8239c7716k18933M2839C6032J09749
18918A45781b887A69032d1640n9367m23475e6265n4836l47220A96542b87682a4609
18906c71819k0497a26611B65583a82484F285a64620H8145c23011F5447a68485
$$ y = [-121112, 85204, -1757, 51905, -155122, 173129, 178290, -99969, -63397, -247370, -186641, -310213, 158241, 16376, -76293, -73380, 121454, 29759, -34626, -75690, -342408, -140241, -400605, -100054, -332219, 212070, 31710, 115833, -61214, 111873, -57980, 3404, 55213, 25520, -153648, 212122, -68908, 57714, -62369, 243070, 170399, 92200, -178502, -36781, -7271, -266860, -91131, 73453, 24126, 337296, -18142, 111130, -262677, -135352, -210222, 209146, 157224, 91861, 242218, -120061, 343986, -70702, 28239, -37716, -256649, -213810, 36032, 145781, -2887, 169032, -41640, -101007, -524482, -56265, -111101, -458321, 196542, -287682, -14609, -371819, -392316, -126611, 265583, -182484, 6285, -164620, 88145, -323011, 65447, -168485]
18895a38135M5948j16106r6084A99430l5663E5001l80i133j8174B20957d03247
18883H1807B5871K31699c43348G6767A557d14873i8073A32763j2654a51612M3077
18872a08535D24492D9100c7169k34721K5269m4435Q6269r0361D4110M0906O8940
18861A53956i7704E565g0462k40601B07638c7288B15782a13702m0346A54286E8181
18849b4259r0787B18707F649i4360j21964A29874a22865k11934E0444D175b18166
18837b321A8199J09628P2847N5591b16822E2570J22876a75754c0267j40062B22344
18825B86763j26203J70925d1126p9530k3615r3289b4396A51627c24998a04129
18814A12101f2205B60195F9143K69271A60187A3214J87421k8893C3295d5630p1983
$$ y = [-138135, -92187, -208293, -304377, 199430, 163767, 55001, 54621, -9133, -27307, 220957, -403247, 81807, 25871, 257570, -343348, 76767, 1557, -414873, -98073, 132763, 120109, -151612, -108535, 424492, 49100, -37169, -271890, -246621, -291056, -204787, -295148, 44110, 85016, 153956, -97704, 5565, -70462, -311063, 207638, -37288, 215782, -113702, -154048, 154286, 58181, -24259, -115046, 218707, 6649, -94360, -216324, 129874, -122865, -334799, 50444, 4175, -218166, -2321, 18199, 127827, 200674, 256265, -216822, 52570, 175446, -175754, -30267, -170329, 222344, 286763, 160560, 331485, -41126, -120656, -144271, -237560, -24396, 151627, -324998, -104129, 112101, -62205, 260195, 69143, 338414, 160187, 13214, 200635, 171742, 33295, -45630, -117613]
18803a17613c9141j58898a8273k26429i0795j2492A09000O3920a42602g185p2897
18792h0082j18347R5393A33530j9540A6144c453j59168d4262j44125j2601J8328
18781a82660N2846g555j05279k9468k02968A27775e0004j75458E087c48532a26482
18769a65194O1131j60003I1344J52864G3233a13051l4377b5006C9820j2662h0340
18757a68486f126j93590b3871j84662h8477D9236R4138I516J21988b77483a170
18745c76794J13985A11769h2551i032k90421A28316b50016F2578g811j2777A24381
18733I2323l9025a13703e0380K3998F349J51387a76492A76893D6102M3071K25776
18722C14949D1912c6640j10628m4216j55365a42606e5322E2756b16836A95420
$$ y = [-117613, -39141, -198039, -18273, -244702, -90795, -103287, 109000, 172920, -142602, -7185, -80082, -198429, -103036, 133530, 113990, 16144, -3453, -162621, -44262, -188387, -200988, -182660, -129814, -7555, -112834, -142302, -345270, 127775, -50004, -225462, 5087, -348532, -126482, -165194, -104063, -264066, 91344, 244208, 73233, -113051, -147428, -25006, 39820, 27158, -80340, -168486, -6126, -199716, -23871, -208533, -88477, 49236, 143374, 9516, 131504, -277483, -1170, -376794, -262809, 111769, -82551, -9032, -299453, 128316, -250016, 62578, -7811, -20588, 124381, 92323, 53298, -113703, -50380, -26382, 6349, 157736, -176492, 176893, 46102, 89173, 314949, 41912, -36640, -147268, -191484, -346849, -142606, -55322, 52756, -216836, 195420]
18711a32477j52312L3577J7164A31999M5329f5037j30987F6490K9815b4518m2664
18700f7182p6071L7968K2765j50528A24372a79031F3209b19944e1464E3095L6504
18689H9599R4948a24659D39897a72077A81363a42386j03371C5456c2385H5119
18678D0924H992b7267j25314n7464C8524a62185c0809j33682q0406f2063l33264
18667c95327B86463b32234f6515F4917a62511f2094H3679i3596A03163K09498
18657C12661d6865E9946c6868D6207a27284j37477A82524A1287J68640B4269J46422
18646A70691i1696k78228i3767o3388l29231a3790q8163k24142J04835N1178d6390
18634a58151j56707a07150l25382o199A86309a26250d8055k91640J46368O2793
$$ y = [-132477, -284789, -251212, -234048, 131999, 177328, -65037, -196024, 66490, 96305, -24518, -67182, -143253, -105285, -82520, -233048, 124372, -179031, 63209, -219944, -51464, 53095, 89599, 184547, -124659, 439897, -172077, 181363, -142386, -245757, 35456, -32385, 85119, 40924, 8992, -27267, -152581, -210045, 38524, -162185, -30809, -164491, -244897, -62063, -395327, 286463, -232234, -66515, 64917, -162511, -62094, 83679, -93596, 103163, 312661, -46865, 59946, -36868, 46207, -127284, -264761, 182524, 11287, 179927, 24269, 170691, -91696, -369924, -93767, -157155, -486386, -13790, -101953, -326095, -221260, -170082, -46390, -158151, -314858, -107150, -432532, -438731, 186309, -126250, -48055, -339695, -193327, -130534]
18624a30534k8432I2180J94217h3166j7128A77897a36907G3108G599a57573A89134
18612b00282F134a3519n9132B44379a15058A98207F2197j8298a99344A63405C908
18600a61338B5252c7280E3145e3189k75934C16629i5392r06j86008O0546j8513
18589b40273C01809e5593B3403c47148a7368j97069C4829d31190h1311k71627
18579c52938M4767i3872r447c5727A00904k6171a60148a1586A14342g7562A63135
18567d9578k27841C028f9605j09093K6747H4562J93651G8360C8819a23415c712
18555F3707a68602D7763O118A1723c57584D6894i6077m7006j9439d8565j54320
18544b02885f5583j2989j7888o5870l7325q6515A73658G5103L2012J9645f0712
$$ y = [-130534, -158966, 92180, 286397, -83166, -100294, 177897, -136907, 73108, 7599, -157573, 189134, -200282, 6134, -13519, -72651, 244379, -115058, 198207, 62197, 43899, -199344, 163405, 3908, -161338, 25252, -37280, 53145, -53189, -329123, 316629, -95392, -96298, -282306, -221760, -240273, 301809, -55593, 23403, -347148, -17368, -214437, 34829, -431190, -81311, -352938, -308171, -93872, -103319, -35727, 100904, 74733, -160148, -11586, 114342, -77562, 163135, -49578, -277419, 3028, -69605, -178698, -151951, 84562, 278213, 78360, 38819, -123415, -3712, 63707, -168602, 47763, 53881, 11723, -357584, 46894, -96077, -143083, -162522, -48565, -202885, -65583, -78572, -96460, -162330, -199655, -286170, 173658, 75103, 107115, 126760, -60712]
18532C0348b32319B17602b00122I3380m5313M892H312J63751a45140J9629f1799
18520C69486C9675d01938a98015h0965K7122O359l26438c0233k8233q532A16279
18508b95406P9712J05836E3717j7144P0917r519O0496a90732A64210a32403m04543
18497e36946e9662J9213j05536A0691R0157J73064i9167g461E4289J39193l4663
18486A58819p1283a58365R27q626A80948m3340a51559D83268A64641a68641A8349
18474h5570q6084B05999E84a54869k5108J9213B77189b29486B20292b030q8953
18463i0983a5522j53578a8264A20873a31158o7886H4336K00648b3696k36525P0061
18452a90160B87928C3806b73665A45612J13856p3240I1784C4506J47561b22752
$$ y = [30348, -232319, 217602, -200122, 93380, 48067, 52959, 8312, 172063, -145140, -125511, -61799, 369486, 39675, -401938, -198015, -80965, -53843, -47484, -373922, -30233, -58466, -66998, 116279, -295406, -215694, -109858, 53717, 36573, 107490, 97971, 158467, -190732, 164210, -132403, -536946, -59662, -40449, -145985, 10691, 100848, 273912, -99167, -7461, 54289, 193482, 158819, 87536, -158365, -157438, -166064, 180948, 137608, -151559, 483268, 164641, -168641, 18349, -85570, -171654, 205999, 584, -154869, -179977, -160764, 277189, -229486, 220292, -2030, -90983, -15522, -169100, -18264, 120873, -131158, -199044, 84336, 284984, -23696, -260221, -190160, 287928, 33806, -273665, 145612, 259468, 186228, 91784, 34506, 182067, -222752]
18441d00694G6627h6809l8161o8822P5989j12470M1970j16819B04304g6141k76685
18430c52826G6284c99271A57601a47732f17k82441e4392j22826c9589k02821B23699
18418c27555E1947g7596j81622i1498L6309D678a90051L1608K013B99598R950
18407C09548b33920A63915e0227B60043a71410j10344J23948e2090j00090A69508
18396A38508b49184E7090M8121e1430B59903c55539A57017d02274i5647A37084
18385b52228A29942L998P5694F6441J04492b32501o2756J0928E4635B3982a64145
18373A45816R8296N3743A27660i8248m2270H7908a54187A58502b774k20102o4329
18362b87205f692j78798P800b3526E3038b0483b272j351A20987d43639B2917K02000
$$ y = [-400694, 76627, -86809, -124970, -193792, -117803, -230273, -188303, -305122, 204304, -76141, -352826, 76284, -399271, 157601, -147732, -617, -283058, -54392, -177218, -39589, -242410, 223699, -327555, 51947, -77596, -259218, -91498, -55189, 4678, -190051, -158443, -156430, 299598, 309548, -233920, 163915, -50227, 260043, -171410, -281754, -157806, -52090, -152180, 169508, 138508, -249184, 57090, 105211, -51430, 259903, -355539, 157017, -402274, -95647, 137084, -252228, 129942, 133940, 209634, 66441, 170933, -232501, -295257, -284329, 54635, 23982, -164145, 145816, 244112, 297855, 127660, -98248, -140518, 87908, -154187, 158502, -2774, -222876, -287205, -6692, -185490, -177690, -23526, 53038, -20483, -2272, -3623, 120987, -443639, 22917, 224917]
18350B24917O8001g3524A39874J90729a14487C39396A35310e4210j28907j73164
18340c56281H6491a24861M321j15686a09033n7258A49056g8219A4167b07236J56
18329b07080j83033a06534B9497a00450C34336A29570H137a53677g2354n7024
18319a29378j95895P3447I5094d35159f6776j37242A10558b22367a01396M4842
18309e6554A7923J65657F9819b33154A31281f0724k1338C2962d573j24693R250
18298a20016G7642J29189O3347b27628A65587C9962a78263C9169e1094q2075L8705
18287i4464C91354c16258h1095D3456Q604a51839e147A29735J42183c9668b171
18275c5598l61355A8398a44964D4863a32475A33223f0505A70994c41998g785k84469
$$ y = [224917, 292918, -73524, 139874, 330603, -114487, 339396, 135310, -54210, -183117, -356281, 86491, -124861, -120540, -236226, -109033, -166291, 149056, -78219, 14167, -207236, -207080, -390113, -106534, 29497, -100450, 334336, 129570, 8137, -153677, -72354, -129378, -325273, -251826, 95094, -435159, -66776, -204018, 110558, -222367, -101396, -56554, 17923, 183580, 69819, -233154, 131281, -60724, -82062, 32962, -4573, -129266, -120016, 77642, 206831, 270178, -227628, 165587, 39962, -178263, 39169, -51094, -133169, -94464, 391354, -316258, -81095, 43456, 52060, -151839, -5147, 129735, 271918, -39668, -2171, -35598, -396953, 18398, -144964, 44863, -132475, 133223, -60505, 170994, -341998, -7785, -292254]
18264b92254H1573b74599j3093A08227J57267a30705j07713b8903A29734a14535
18253I7440A3326b2424j23368G0893c6532B08703b08556R9556B01151f3129a5614
18241a75232k28201B69691b26889A62111d2955E4197b63106P6345A00257a13452
18230e30739a26456j16665R5193d0013J4310q6975a8920k92969A17254b48338
18219B27909K17138A83593d620A99514f94C9525d7644A45088b81841A09724a30282
18207C9276e7500l84922i4405B2506a96303A52893p311A8689a31135A264i865
18195b66103K3257c9948A56095a89576g5387A90972f6000A49067d39234a3353
18184C62094E9125a13902A25965b30511C4655a36820l56195K25938e2803k15798
$$ y = [-292254, 81573, -274599, -287692, 108227, 265494, -130705, -238418, -28903, 129734, -114535, 97440, 13326, -22424, -145792, 70893, -36532, 208703, -208556, -109000, 201151, -63129, -15614, -175232, -403433, 269691, -226889, 162111, -42955, 54197, -263106, -186761, 100257, -113452, -530739, -126456, -243121, -147928, -40013, -25703, -112678, -18920, -311889, 117254, -248338, 227909, 445047, 183593, -4620, 199514, -694, 39525, -47644, 145088, -281841, 109724, -130282, 39276, -57500, -442422, -94405, 22506, -196303, 152893, 145582, 18689, -131135, 1264, -9865, -266103, -242846, -39948, 156095, -189576, -75387, 190972, -66000, 149067, -439234, -13353, 362094, 59125, -113902, 125965, -230511, 34655, -136820, -493015, -267077, -52803, -268601]
18174b68601e039A55877c800l10343I1374n671n846O1612D5993b87008r4669K6137
18162c55540J51030n0519B36916a07402L8468b5691k85306d9442B39709a22439
18151C19685a62214A7286Q9096i5972M418A60909c57333L7177A92411B1189l360
18140A7829Q4327k5003b68122O6731d4196o4181A00945h6772B9339b08716P0644
18129a38072b3348j75546C34563I8589J74743j31238I277b28244l9759A20537
18118a85577j3061K6180j05624O2855C255a71081I0146c35510J17532A16180D3483
18106I7151J64657j16171j2692a98963A20303e1988j43916A76914H508J57151
18096A65659m5076K18375k4830b24575N896j80812a60887k4271F7215f4378A03110
$$ y = [-268601, -5039, 155877, -3800, -314143, 91374, 85703, 79857, 141469, 45993, -287008, -381677, -355540, -204510, -255029, 236916, -107402, -68934, -25691, -310997, -49442, 239709, -122439, 319685, -162214, 17286, 106382, -95972, -91554, 160909, -357333, -320156, 192411, 21189, 17829, 102156, 77153, -268122, -201391, -44196, -108377, 100945, -86772, 29339, -208716, -138072, -23348, -198894, 334563, 98589, 273332, 142094, 9277, -228244, -268003, 120537, -185577, -198638, -172458, -278082, -215227, 3255, -171081, 90146, -335510, -217978, 116180, 43483, 97151, 261808, 145637, 132945, -198963, 120303, -51988, -195904, 176914, 8508, 165659, 120583, 338958, 314128, -224575, -218679, -399491, -160887, -185158, 67215, -64378, 103110]
18084b00354m402a0490C5581b632E9650k4940L07144A41709E6730h3082p6387
18073a59469B746K73661e9575A90892l0177K0832n0268a64446B73896j6415a3412
18061g3977r7324g476C282d7736A73195F3024j401i5763M0573C45117c1551B03420
18048A1138J82527g8061N65j11459R0751A06944c19151A1550L6631d1458L153
18037c8305m7631J7145J1763A31813e205p5731E6385Q9007a50557e1328E7579
18025D6815g4875H7030k7476a91077B19333b89202A45772k5214J57575a23981
18014A01076J91006b05627f9766m8613f174A72872B5933L6741K06703q5489c5272
18002a09181j5236B00876a29841c2619C12059A11092c4795j33506N4185K3044
$$ y = [-200354, -204756, -10490, 35581, -2632, 59650, 34710, 341854, 141709, 56730, -83082, -159469, 2746, 276407, -59575, 190892, 160715, 181547, 131279, -164446, 273896, 257481, -13412, -73977, -171301, -7476, 3282, -47736, 173195, 63024, 61623, -95763, -55190, 345117, -31551, 203420, 11138, 193665, -78061, -77496, -188955, -98204, 106944, -319151, 11550, 48181, -41458, -38305, -85936, -68791, -57028, 131813, -5205, -80936, 56385, 145392, -150557, -51328, 57579, 46815, -74875, 87030, 59554, -191077, 219333, -289202, 145772, 120558, 278133, -123981, 101076, 292082, -205627, -69766, -118379, -6174, 172872, 25933, 62674, 269377, 183888, -35272, -109181, -124417, 200876, -129841, -32619, 312059, 111092, -34795, -168301, -114116, -91072]
17992i1072B40735i0174k08972e5483k14904b8206j94881P2827B42144I823b04942
17980b92259A1050J37223d15218C4586K97131e7752G885J6752a07714k3720E8957
17968d7908A69550a09539C6337c64398e9113j4062A48765a38303j43176d643A29785
17956C61839b02705R8951j9509B32812G5726J30526d00080A06922c23738a40005
17945F9794k2702d294m41352B1495R133J30158A5579a28502D718b24628c8982
17933i8649r186B42221q7548n4099l278a13027B3314i002k1713j1286G2939K1423
17921I4362a37544m4181K0844F4534k3491b03475f0437A38513c8824G8590K80522
17910C59112h1154R891E6442A2017P7207e9233A79630a51215B45300b73879J18297
$$ y = [-91072, 240735, -90174, -299146, -55483, -270387, -28206, -223087, -150260, 242144, 9823, -204942, -292259, 11050, 148273, -415218, 34586, 331717, -57752, 7885, 24637, -107714, -131434, 58957, -47908, 169550, -109539, 36337, -364398, -59113, -73175, 148765, -138303, -281479, -4643, 129785, 361839, -202705, -103754, -123263, 232812, 75726, 206252, -400080, 106922, -323738, -140005, 69794, 47092, -4294, -445646, 21495, 30628, 160786, 15579, -128502, 4718, -224628, -38982, -98649, -107835, 242221, 154673, 100574, 97296, -113027, 23314, -9002, -30715, -42001, 72939, 94362, -137544, -181725, -160881, 64534, 41043, -203475, -60437, 138513, -38824, 78590, 359112, -81154, -71263, 56442, 12017, 89224, -59233, 179630, -151215, 245300, -273879, -155582]
17899a55582c7764j96216G029J30662a31767F0886H487L31208b2578p5876j69039
17888b67493e0733D26030i6771a4513D9602b45286f6118q8469b9219E338L9539
17877D4877a21883A95178d7423o698l1627n5114A01069k4630K5964a37159a7051
17865C9488J98840g2959o8005O8439j43620A2780J10153P4816h489k2986A05814
17853a37939l0742B25485b80858A81523j6290b33038k5278Q9089o3329d5421B04553
17841a31053A40985a22150B67395g3802D2577b39045A26626K24955c37322A58008
17830a95688A38173i0651j85441C19004c06501H9169c1939j4398a4713n409A99757
17818B52349D7276O5066b23963q113a2761C0513b09975A87789b31309H5427Q4879
$$ y = [-155582, -37764, -233980, 7029, 137691, -131767, 60886, 8487, 339695, -22578, -98454, -267493, -50733, 426030, -96771, -14513, 49602, -245286, -66118, -154587, -29219, 5338, 44877, -121883, 195178, -47423, -54121, -85748, -140862, 101069, 76439, 102403, -137159, -17051, 39488, 238328, -72959, -140964, -72525, -216145, 12780, 122933, 197749, -8489, -31475, 105814, -137939, -168681, 225485, -280858, 181523, 165233, -233038, -258316, -169227, -232556, -45421, 204553, -131053, 140985, -122150, 267395, -73802, 42577, -239045, 126626, 351581, -337322, 158008, -195688, 138173, -90651, -276092, 319004, -306501, 89169, -31939, -46337, -14713, -20122, 199757, 252349, 47276, 112342, -223963, -232076, -12761, 30513, -209975, 187789, -231309, 85427, 170306]
17807A70306C9204K31451A12931b24378i903j85362a1393L814q7177H0323b25692
17795b44575G3653a28255D871M2912L0745c23596Q2763C7976L71814A09934a81694
17783f1417D60432A65647a96738f501B289K06631d417A63267g2236C17545A16035
17771a64754l5102g760B06628i0370q7109d4055b705H7847C2277N1832J67581
17760B51690e956C16252c42950B34997r8839b08836O2052O8334B27763i0172B41451
17748A95688o6463e650o1260E1418P1243b01539B5696J73200b40811A82428c23600
17736f9562C48402d686B01922a28552A2794a73j02175I3323b33414h5837A50833
17724E3642d57190e1663m2603R243D31933c8343o2062L1193j49088l7809h7533
$$ y = [170306, 39204, 270655, 112931, -224378, -9903, -195265, -11393, -7579, -94756, 80323, -225692, -244575, 73653, -128255, 4871, 47783, 78528, -323596, -240833, 37976, 409790, 109934, -181694, -61417, 460432, 165647, -196738, -6501, 2289, 208920, -4417, 163267, -72236, 317545, 116035, -164754, -199856, -7760, 206628, -90370, -177479, -44055, -2705, 87847, 32277, 84109, 251690, -5956, 316252, -342950, 234997, 136158, -208836, -146784, -78450, 227763, -90172, 241451, 195688, 129225, -5650, -66910, 51418, 122661, -201539, 25696, 198896, -240811, 182428, -323600, -69562, 348402, -4686, 201922, -128552, 12794, -173, -102348, 93323, -233414, -85837, 150833, 53642, -457190, -51663, -94266, -85023, 431933, -38343, -100405, -69212, -218300, -256109, -87533]
17712A2678b92061a5327j35429B6243a08676i380A93508R893c94010F0904a43321
17700B48732o0896k7391F4300P94J4884L39993j87907a82460k42110J52748B15317
17688C9319J03472R6191E1884k2179J3759K70914a97356A30875a53982a0781A69200
17676A24341e8760f818A40955f0364m9814B206N396K23598o9847c1212A23035
17664C29993j49360a5923D4201N5390c20994j69216a09494j0858C4532d1139j43191
17653a84330B48275c7386C9767a09259L854A53171l2979J19682h3853L0039a1841
17641F8595J68748a15717J2104B09543G1208L82290b83429g3444H9818b23572
17630b33253q1571A82608a61849B2168L430a50526C9937R0740L4635a67818j37616
$$ y = [12678, -292061, -15327, -150756, 26243, -108676, -9380, 193508, 203401, -394010, 60904, -143321, 248732, 187836, 160445, 64300, 65094, 79978, 419971, 232064, -182460, -424570, -271822, 215317, 39319, 142791, 238982, 51884, 29705, 43464, 314378, -197356, 130875, -153982, -10781, 169200, 124341, -58760, -6818, 140955, -60364, -110178, 2206, 7602, 231200, 161353, -31212, 123035, 329993, 180633, -15923, 44201, 99591, -320994, -490210, -109494, -120352, 34532, -41139, -184330, 248275, -37386, 39767, -109259, -105405, 153171, 120192, 239874, -83853, -53814, -11841, 68595, 237343, -115717, -103613, 209543, 71208, 453498, -283429, -73444, 89818, -223572, -233253, -314824, 182608, -161849, 22168, 25598, -150526, 39937, 130677, 165312, -167818, -305434]
17619c05434b5751A24388Q4802J13009b00208B26181a13929A49542G0263J41404
17609B11667L5015A06919J24189d0082j66986k4967b7025j32275A92050a22632
17598a16657B30978A11295a70372a8184A37805e7686H1820l7642a23024k1847
17588a44871A69605b27328B37372a36874L622N3182F4713J94786a09193A13707
17577B1473b61152d0124K0058k74139D2652g4559k5280A36498b71681A91036l1575
17566A59461Q4624I4194J87126b0310A1617J79067p6601b56866A97495K45040
17556D42535i1318D9382b02801j09882A74305b57028A03484J2017K22999a03059
17545G0554P4957m7608n655f6653A53781d4886k10984B342J91809Q4181l8349
$$ y = [-305434, -25751, 124388, 209190, 322199, -200208, 226181, -113929, 149542, 70263, 211667, 246682, 106919, 231108, -40082, -207068, -232035, -27025, -159300, 192050, -122632, -116657, 230978, 111295, -170372, -18184, 137805, -57686, 81820, 44178, -123024, -144871, 169605, -227328, 237372, -136874, -133252, -80070, 64713, 259499, -109193, 113707, 21473, -261152, -40124, -20066, -294205, 42652, -74559, -99839, 136498, -271681, 191036, 159461, 244085, 94194, 281320, -20310, 11617, 190684, 114083, -256866, 197495, 442535, -91318, 49382, -202801, -312683, 174305, -257028, 103484, 115501, 338500, -103059, 70554, 145511, 97903, 92248, -66653, 153781, -44886, -255870, 2342, 194151, 278332, 239983]
17534B39983j15428l3346a57453N3841J5603k0996B04696E8438K08194c67472
17523A43030f0539B36468o6086q1770f9149b4230E05065A3949L57797E8779a29677
17511c39051B0712a92344B4831d7680k01589D01141a82948B19315J65867G049
17500D8575J41645a2727F3512K95611r2244j09356m9975b09564r7481E635J44204
17489A49839L9253p7114M881J89878G3258J53827I3195L07010A05153b3703B58731
17477c0256B46152j5275k6779r6892J27011b26595A57839c6166D2608L5683a8668
17465e6119C40438r932m6988e7219H4419f9836C45167I0868C3406a4099C12570
17453C95460h9724B6007J92575d1614F93903B6483J93489J15875A23019A0053
$$ y = [239983, 124555, 91209, -157453, -103612, -88009, -109005, 204696, 58438, 266632, -367472, 143030, -60539, 236468, 170382, 88612, -69149, -24230, 505065, 13949, 371746, 58779, -129677, -339051, 20712, -192344, 24831, -47680, -249269, 401141, -182948, 219315, 385182, 7049, 48575, 190220, -12727, 63512, 359123, 266879, 157523, 107548, -209564, -307045, 5635, 149839, 189092, 111978, 116859, 306737, 73258, 227085, 93195, 400205, 105153, -23703, 258731, -30256, 246152, 230877, 204098, 107206, 234217, -226595, 157839, -36166, 42608, 78291, -18668, -56119, 340438, 330506, 283518, -57219, 84419, -69836, 345167, 90868, 33406, -14099, 312570, 395460, -89724, 26007, 218582, -41614, 693903, 26483, 219972, 335847, 123019, 10053]
17442C81172a1113A37347Q2461K05503h1I9874J1547n4754J30155L3643K65893
17431D86358j59229q3266A18249J91085I722K28708J35962E0782P44297l02749
17421D92330c6489C41319A05457L65731j57294A16856J77137r3735o0847K73441
17411D12852j84984K76359F6666J46214P0330j08820l4147O649b1289B23450r3401
17400A30049c4747B72326j21273j1470M48320B37842a1277H6509J94529l2804
17390B48234j03706f7258C64605A59408k4349J24694A11860b42784J05677B6279
17379a24633c3838C4120Q2380a48543C07048l9780b80167A97352K8999g8038D59886
17367e9942C28974j10591A2907K18024H0824p018a26240C58880a4980H7508K75149
$$ y = [381172, -11113, 137347, 219808, 425311, -81, 99874, 111421, 56667, 186822, 220465, 486358, 327129, 243863, 118249, 309334, 9722, 238430, 374392, 50782, 795079, 492330, -36489, 341319, 105457, 471188, 313894, 116856, 293993, 200258, 139411, 412852, 227868, 504227, 66666, 212880, 283210, 174390, 140243, 146892, -21289, 223450, 130049, -34747, 272326, 151053, 139583, 587903, 237842, -11277, 86509, 281038, 248234, 144528, -67258, 364605, 159408, 135059, 259753, 111860, -242784, -137107, 26279, -124633, -33838, 34120, 116500, -148543, 307048, 267268, -280167, 197352, 226351, -78038, 459886, -59942, 328974, 218383, 12907, 230931, 80824, 73806, -126240, 358880, -14980, 87508, 362657]
17356C62657j05037J19135j02764F2475K555L3683K14905A2135L7214K10633j26478
17345A33504L298L7133h7311F3053K52127r9503K33051A2672K83653P1271A60087
17333H3393K67430H4478J96751L306n0966J69085C4444j5086L68306a4819C37582
17321A39410K34881q7356f5923A80180j6292J69740j29223H1497a42945a9721
17310A32729J15279j02014J03997c7970B07355k2384R0431i9951d6057B25242
17299C95387A19411b06356A67445b9328k5113b0251D28006A9536Q6772J12836
17289B19144l3317b81724A1367N04K86324n0596J16038f5416B6326J85107J71741
17278C83174a26012B93939j16362J68702r5158L2387K9313q6242P6822f5091H395
$$ y = [362657, 257620, 376755, 273991, 62475, 65030, 98713, 313618, 12135, 49349, 259982, 133504, 136802, 173935, -87311, 63053, 315180, 215677, 448728, 12672, 296325, 367596, 160087, 83393, 350823, 84478, 281229, 284535, 233569, 402654, 34444, 19358, 387664, -14819, 337582, 139410, 374291, 286935, -65923, 180180, 163888, 333628, 204405, 81497, -142945, -19721, 132729, 248008, 145994, 249991, -37970, 207355, 184971, 275402, -99951, -46057, 225242, 395387, 119411, -206356, 167445, -29328, -54441, -20251, 428006, 19536, 106308, 219144, 185827, -281724, 11367, 11871, 298195, 247599, 363637, -65416, 26326, 211433, 383174, -126012, 293939, 177577, 346279, 251121, 283508, 312821, 226579, 303401, -65091, 8395]
17266B38696G5238P1541c0322C6004J69160r3086J00608n9711A1215L76633E8595
17254C28245h894B58336G1326M33074A17684P0728b8173B14758a6994B47329a5535
17242E77979a8059B09273J56668C9848K05964n9868F9721K57072A24094J14157
17232B38251O1959e0202D41463D4200C007a09826C73020A71871R5784m3105Q362
17221B32912E1896J93141m6309P6787J20980A41752l508o2859M23647B18198M5703
17210B63901j5737J66140j50053J85407A62387N7044L9631k6832r5457o1224J64328
17199B39877J9485r363R8893N0398o5093N9811j64076o2922A8766L49233j42888
17188B25111N4701j937H8236l8049J36350K71666k09803I6673J51754k6695J2560
$$ y = [238696, 75238, 146779, -30322, 36004, 205164, 112078, 212686, 152975, 11215, 387848, 58595, 328245, -8894, 258336, 71326, 504400, 117684, 188412, -28173, 214758, -16994, 247329, -15535, 577979, -18059, 209273, 365941, 39848, 245812, 185944, 69721, 326793, 124094, 238251, 300210, -50202, 441463, 44200, 3007, -109826, 373020, 171871, 267655, 224550, 232912, 51896, 245037, 198728, 275515, 396495, 141752, 138244, 75385, 499032, 218198, 263901, 248164, 414304, 264251, 449658, 162387, 219431, 259062, 232230, 136773, 75549, 239877, 259362, 249999, 348892, 399290, 334197, 394008, 229932, 167010, 18766, 367999, 225111, 279812, 277875, 88236, 50187, 186537, 458203, 248400, 96673, 248427, 221732, 234292]
17177B34292M5900E2683L91763A02334M6470B2536L73135A38940L9067J90043
17167C68050m4377B5678K77473L29145k35142i9403D06108j05470I4688c0182
17156D54580a6296D36932B11704pJ56435J6364j30225L24311B40295k707L47671
17145E85259A51132C8721M44922G9395K65463j59495L12602k44212H0201R5234
17135A75435J66091J65081j51724o9609b179m2044D53540e4482B93665K19930
17125E13595a64931C81929k3854A24802J77219O5025J37165j26973J44455j08911
17115D12782p0745r9092M4134K49043a13292F79211B68553J02773p6826K26583
17105E21083k56134J01027o291J29198k28010o5271J0697J92637p3546J06805
$$ y = [234292, 280192, 52683, 444446, 102334, 148804, 22536, 395671, 138940, 178007, 368050, 323673, 25678, 303151, 632296, 397154, -99403, 406108, 300638, 94688, -30182, 454580, -16296, 436932, 211704, 211697, 368132, 384496, 254271, 578582, 240295, 237588, 585259, 151132, 38721, 483643, 79395, 344858, 185363, 497965, 253753, 80201, 175435, 341526, 506607, 354883, 285274, -2179, -44223, 453540, -54482, 293665, 513595, -164931, 381929, 358075, 124802, 302021, 367046, 504211, 377238, 521693, 412782, 342037, 242945, 287079, 536122, -113292, 679211, 268553, 371326, 294500, 521083, 264949, 365976, 359685, 488883, 260873, 195602, 206299, 398936, 325390, 432195]
17095D32195J6618j0342j71247L7054L11427k85081P534J6507Q8561j73550L41519
17084F11195j67290j93896J2761J98564J38607j26154L4839k41637L01786m1330
17074E27445J07193k30909M22025l63557k0442k920J8762m0645l3663A48903K42094
17063C90997j75472K81679K2379L7604j75017K04264K26394k20676j99285K09311
17053F02178k59784K81946C10943J66587J16888k17126o1765N4490r2999K76981
17043E53999J94551q0497j83158K59117k71542k3827q7958K54093J97379p1269
17033G40888K7114j44231k43749R3933J55540j13116k14578K43279j79871M4383
17023D09592M22778J90232D49815M0479N8325N3719k05186N1331j6446K55982
$$ y = [432195, 448813, 438471, 267224, 304278, 615705, 330624, 338158, 354665, 443226, 269676, 611195, 443905, 250009, 262770, 461334, 599941, 473787, 508626, 266989, 568775, 527445, 634638, 403729, 825754, 462197, 441755, 438835, 457597, 416952, 383289, 148903, 390997, 215525, 497204, 519583, 557187, 382170, 586434, 812828, 592152, 392867, 602178, 342394, 624340, 310943, 477530, 594418, 377292, 315527, 370017, 277018, 553999, 748550, 668053, 484895, 744012, 472470, 448643, 360685, 614778, 812157, 740888, 768002, 623771, 380022, 473955, 629495, 516379, 301801, 545080, 365209, 409592, 832370, 1022602, 449815, 490294, 548619, 602338, 397152, 448483, 432037, 688019]
17013F88019L08294D00618L86415k98960k32637N63053j15335K36608k41772o9807
17003F28183m1819J71228j13454L64011k41118K21474k09883P0535J28890m30659
16993E47388N452j0756K93972j06086j30019Q1623J86587j60910K53880l03911
16983F57220K02397j83790J67672j59850j2731P17991o68190J16037k21505L55649
16973I70900l42873M76269l33639K29633o7769J97769j12169Q0654k93847M27595
16963A232523J47290l89821j63827L69432n51642L41406q6949J48567k2737j42313
16953H81929m3999N5427j67518K18876m8035Q8484J17312l53464K32381J03368
16943A084761k55306J57933J07372r2780M29565n79819K86730J65878o5785k24905
$$ y = [688019, 996313, 400618, 787033, 488073, 255436, 818489, 703154, 939762, 697990, 628183, 586364, 757592, 644138, 1008149, 767031, 988505, 778622, 849157, 978047, 547388, 552840, 542084, 836056, 729970, 599951, 681574, 868161, 707251, 961131, 657220, 859617, 675827, 843499, 683649, 670918, 1388909, 720719, 836756, 615251, 970900, 628027, 1104296, 770657, 1000290, 932521, 1130290, 1018121, 1098775, 804928, 1232523, 1379813, 989992, 826165, 1195597, 643955, 985361, 898412, 1046979, 1024242, 881929, 837930, 893357, 725839, 944715, 896680, 985164, 1102476, 749012, 981393, 1084761, 829455, 987388, 1094760, 1001980, 1431545, 851726, 1138456, 1304334, 1238549, 1013644]
16933A013644M38117k05119q5855J97909k4812k79005M33977k29069L78243k2080
16923A615950j95813j72036m485j00934K33155J32362k04643K15405j71648j7133
16913A330180K63689m22378M07573L3805j10638K58699j89203k27654K39088K09439
16903A792600j72543M0669k56684J89869Q3187q9020K92591l75447N39900l14878
16893A730244K46930m3305n0703j33157J18453Q9485J93359j55958k30711K50650
16883B015287L19350k91986J83409k01967M12509k65232L21551l28900J6855P330
16873B188206L69640o925O9521K7655j99621J23839m9665j46630P6781m3493Q5795
16862B495103Q7108J58936k12587K93421M71399l74324K10740j37871K81360n8958
$$ y = [1013644, 1451761, 1246642, 1160787, 1358696, 1333884, 1054879, 1488856, 1259787, 1638030, 1615950, 1420137, 1248101, 1243616, 1142682, 1375837, 1508199, 1303556, 1518961, 1347313, 1330180, 1593869, 1171491, 1579064, 1612869, 1502231, 1760930, 1571727, 1344073, 1583161, 1792600, 1620057, 1660726, 1404042, 1593911, 1677098, 1588078, 1880669, 1505222, 2045122, 1730244, 1977174, 1933869, 1883166, 1750009, 1868462, 1957947, 2151306, 1995348, 1764637, 2015287, 2334637, 2042651, 2226060, 2024093, 2436602, 2171370, 2492921, 2164021, 2180876, 2188206, 2557846, 2550921, 2620442, 2648097, 2448476, 2572315, 2522650, 2376020, 2452801, 2409308, 2495103, 2582211, 2741147, 2528560, 2821981, 3293380, 2919056, 3129796, 2991925, 3273285, 3214327]
16852C214327J00712n19525K60891L31445r832j73348J51960J98790k32915M92038
16842C814543l26252K94262o9488O7878L2281P3870J11758Q8740J36745r1652
16832D132685M6738K45123m25647M13687J9611j99615O76989m30082J89669L97701
16822E066859N4836L79002k39559q274K67317N3387K59593k17085K18095K85036
16812F119207p9051K6804L93286J78434n9410J27338M09244M5776J51677K75680
16802G588985r058J14395L5345L74160O05515j08970Q6401K90219K35956l3767
16792I179181M27517M68319K08550j65615K74186K93771L83917K21307O80317
16783A1971450M46517K23492N15598J15910N91982J14953L54510P34355j25152
$$ y = [3214327, 3315039, 2795514, 3056405, 3387850, 3378018, 3204670, 3356630, 3555420, 3322505, 3814543, 3488291, 3782553, 3713065, 3780943, 3813224, 3887094, 3998852, 4087592, 4224337, 4132685, 4179423, 4424546, 3998899, 4412586, 4432197, 4232582, 4909571, 4479489, 4669158, 5066859, 5121695, 5500697, 5261138, 5252864, 5520181, 5573568, 5833161, 5616076, 5834171, 6119207, 6040156, 6066960, 6460246, 6638680, 6579270, 6706608, 7115852, 7161628, 7313305, 7588985, 7579927, 7694322, 7729667, 8103827, 8709342, 8600372, 8686773, 8976992, 9212948, 9179181, 9606698, 10075017, 10283567, 10117952, 10392138, 10685909, 11069826, 11291133, 11971450, 12417967, 12641459, 13157057, 13272967, 13864949, 13979902, 14334412, 15068767, 14943615]
16774A4943615J089829J56431R28605N16158P08370K53177P32465R09066N21069
16765B0758785Q63442P86202J033613P30305R06739R48200Q50717J415059J109775
16756B9402837J246730J768445J415237J167600J874766J578551J752850K450245
16748D2657261K164101K027180K272275L049801K409490K646616L463448L577686
16740F4267858L981496L921821L886753M596093N094633N565699N304013O378979
16732A02997345O121681O771586O881574Q022964P865902Q335102P877998Q339815
16724A63213967Q137831P736442P820022O691009N817507M701959K872188J621560
16716B08612485O08349j455627k675474m831150n003872o498153p515053p956616
$$ y = [14943615, 16033444, 16189875, 17118480, 17634638, 18343008, 18596185, 19328650, 20237716, 20758785, 21622227, 22408429, 23442042, 24172347, 25079086, 26027286, 26878003, 28293062, 29402837, 30649567, 32418012, 33833249, 35000849, 36875615, 38454166, 40207016, 42657261, 44821362, 46848542, 49120817, 52170618, 54580108, 57226724, 60690172, 64267858, 68249354, 72171175, 76057928, 80654021, 85748654, 91314353, 96618366, 102997345, 109119026, 115890612, 122772186, 130795150, 138661052, 146996154, 154874152, 163213967, 171351798, 179088240, 186908262, 193599271, 199416778, 204118737, 206990925, 208612485, 209220834, 207765207, 205089733, 200258583, 195254711, 188756558, 181241505, 173284889]
16708A73284889q182349q428436q608819q577302p990147q033143p256965p464804
16700A08742924o640575o301110n944171n638819m833460m779617m497277l972872
16692F6135023l998907l308728l270324l038834l024686k487301k252497k615315
16684D2138431j925387k150635j606138j897048j460017j568197j362712j562176
16676B8606121j083235j593215p93592q46448j026566r02234q72353j011519o86993
16667A9789966p82223o96527l77405q78401o31070o53504k41097q22951n52502
16658A4154286m17229o00257n0318n76624j10862q09346k21932l68657k84460
16649A0714601m04243m77508j07594m0256l63080L7839p60796J34314m35567j41009
$$ y = [173284889, 165102540, 156674104, 148065285, 139487983, 131497836, 123464693, 116207728, 108742924, 102102349, 95801239, 89857068, 84218249, 79384789, 74605172, 70107895, 66135023, 62136116, 58827388, 55557064, 52518230, 49493544, 47006243, 44753746, 42138431, 40213044, 38062409, 36456271, 34559223, 33099206, 31531009, 30168297, 28606121, 27522886, 25929671, 25136079, 24289631, 23263065, 22360831, 21488478, 20476959, 19789966, 19007743, 18311216, 17933811, 17055410, 16424340, 15770836, 15529739, 14706788, 14154286, 13737057, 13136800, 13086482, 12509858, 12398996, 11589650, 11367718, 10999061, 10714601, 10310358, 9832850, 9725256, 9685000, 9321920, 9359759, 8598963, 8733277, 8297710, 8156701]
16639H156701n13610J31844m32795K1668l24971k83074j93302p3835Q0888k58691
16629F310823L7393j80610P3863l49010k19732k23045j66152J48537j79056k8064
16619E224947k71487M1275J31540k97697k65371N587N5387k77836j78269j92173
16609C975903K41946r1804J98289m23019l4687r4217k65012K48868n35293L06149
16599C527123M0955p9554j86359o8298l26670P1717J29135l7395q824l48745L7648
16588B750733j12382J0770k16175K6306J91765j51205L40477n41765K18340r8226
16578B418638j3690O5365k3902j07343l8965m42323J98725K34603p2889k32037
16568A986182m0819Q3796l7541k49048q7101N32614l57974j02458J22858o4222
$$ y = [8156701, 7643091, 7774935, 7342140, 7363808, 7038837, 6755763, 6562461, 6488626, 6569514, 6310823, 6348216, 6167606, 6241469, 5892459, 5672727, 5449682, 5283530, 5432067, 5253011, 5224947, 4953460, 4994735, 5126275, 4828578, 4563207, 4568794, 4624181, 4346345, 4168076, 3975903, 4217849, 4126045, 4324334, 3901315, 3866628, 3772411, 3507399, 3756267, 3220974, 3527123, 3568078, 3488524, 3302165, 3233867, 2907197, 2978914, 3108049, 3070654, 3061830, 2713085, 2750733, 2638351, 2649121, 2432946, 2459252, 2651017, 2499812, 2840289, 2298524, 2516864, 2418638, 2404948, 2470313, 2446411, 2339068, 2300103, 1857780, 2056505, 2291108, 2218219, 1986182, 1945363, 2029159, 1991618, 1742570, 1655469, 2188083, 1830109, 1727651, 1850509, 1786287]
16558A786287L8091j50467l0847R3522J16787K29585p38131M43389n50061N0212
16548A288367N18789k45715l7649O1923j10644j5036k7771k70275Q1124K12525
16538A455638j03018j49590L4769n7992K33005q5946k95507L14149m58110N1150
16528I38548M11405N9802n4646k47249m488K9220p6253j57792j28328L70177j1770
16517A128626J04307l99521J37485j62184K15460J64115J9273j41729m14815j49435
16507E01582K28340K83424K10285k72420j34227K56594l32132K27676J53809k92264
16497H30667j42119J97321M23411m01863k01576l9341K12586j59396r0301M76372
16487A105761k19123k62532K44833J12771k86371K23858J0973k49138j09218P3038
$$ y = [1786287, 1824378, 1673911, 1643064, 1736586, 1853373, 2082958, 1344827, 1788216, 1238155, 1288367, 1807156, 1561441, 1523792, 1585715, 1475071, 1460035, 1432264, 1161989, 1243113, 1455638, 1352620, 1203030, 1237799, 1179807, 1412812, 1326866, 1031359, 1345508, 887398, 938548, 1349953, 1409755, 1355109, 1107860, 1103372, 1132592, 1056339, 898547, 770219, 1140396, 1128626, 1232933, 833412, 970897, 808713, 1024173, 1188288, 1207561, 1065832, 651017, 501582, 729922, 1013346, 1223631, 951211, 816984, 1073578, 741446, 969122, 1122931, 830667, 688548, 885869, 1309280, 907417, 705841, 666500, 879086, 719690, 629389, 1105761, 886638, 624106, 868939, 981710, 695339, 919197, 930170, 681032, 571814, 644852]
16477F44852J26644J7247j12780j24216L0076o2585o1431K49245k38856L88295
16467H56491l12695J49381j18761M3670J17813L9819j52379q5705K00761k6956
16457G11439j96351J80844k8311j20381J8214j6058K41981j73196r8314j23884
16447C95983K28463j71087O4866J48956j15729H1096R567K56410M5506N8052j11907
16436C38724L47664r2965B85868J67015q3880K85409o5534K8558B17426J39094
16426C56520K05405n8589j37407M0003p1071J43097p514k02807N4717J79571n1331
16415D50594j11769K02366k60882J30481K7746l9322r962M0373j93826o2805L4658
16404B07652J59192m7537K23118k60538A08183J72843A39525D4193K85262J81458
$$ y = [644852, 771496, 788743, 675963, 551747, 581823, 519238, 457807, 707052, 468196, 856491, 543796, 693177, 574416, 618086, 735899, 775718, 623339, 537634, 738395, 711439, 515088, 695932, 667621, 547240, 565454, 549396, 791377, 618181, 519867, 395983, 624446, 453359, 518225, 667181, 551452, 81096, 90663, 347073, 392579, 450631, 338724, 686388, 593423, 285868, 452883, 369003, 654412, 588878, 617436, 217426, 356520, 561925, 503336, 365929, 405932, 334861, 477958, 470444, 267637, 322354, 501925, 450594, 338825, 541191, 280309, 410790, 438536, 399214, 389252, 429625, 235799, 172994, 207652, 366844, 319307, 542425, 281887, 108183, 281026, 139525, 44193, 329455, 510913]
16394E10913A91618P3994A27327J06531L30089j62111A90463J84122H5001d5369
16383A70417J53306j37369J70490j52696J87692R1903K13136k96478A84188N1172
16373B35360A5911L19829Q4391f4209D87967J05971a14258H4580L21251J50720
16363E56551j84659J70960k50486j31700M49959E9773K28606R4132n8090e9354
16352A47503J31531q7455J24328j10854J99827j18541N1197m1666r4020C9153
16341E50417B18409Q6017j38181J38472G5228j6254b39463B33878F1809N4817
16331A16626M4876J82309j3136j02183G0569K33838J0101a61851B7364L02129
16321C29493A59896P2409k3051h4587B84111K01534j98504F7795J1925l4167K55851
$$ y = [510913, 191618, 265612, 127327, 233858, 563947, 401836, 190463, 374585, 85001, -45369, 170417, 323723, 186354, 356844, 204148, 391840, 483743, 696879, 400401, 184188, 235360, 15911, 335740, 420131, -64209, 487967, 593938, -114258, 84580, 405831, 556551, 371892, 542852, 292366, 160666, 610625, 59773, 288379, 382511, 324421, -59354, 147503, 279034, 191579, 315907, 205053, 404880, 286339, 337536, 295870, 201850, 39153, 550417, 218409, 304426, 166245, 304717, 75228, 58974, -239463, 233878, 61809, 116626, 161502, 343811, 330675, 228492, 70569, 304407, 314508, -161851, 27364, 329493, 159896, 232305, 209254, -84587, 284111, 485645, 287141, 67795, 79720, 45553, 301404]
16310C01404m0552o1256J69377A54845o9709L00322j80201j3391J9346A3978M83639
16299D97617q6108j16913p6728c7883A10513J02833G0300O5312J49262G7737a85738
16287F1805a14054C20101g9937c8770B74876a2332n7783A18158a95077D1313K04
16276D1517J63959a2334G812J62540K0425K1430b68046a24895M8284B33566J37964
16265C71530j65863K17410j01521A47192K1758e5975j44495b4764r531G3831J17600
16254A91431M2671a51501D31352A18210j2803O9156C5776Q604b7067B74721q4598
16243A90123e1741A51811H128M1641d345m6718k1895A26947G37J73175F7499J68532
16231B36031n6974K4218h9142j7782A37156R9859A10675b42968B4248a43854B13738
$$ y = [301404, 260852, 199596, 368973, 154845, 85136, 385458, 205257, 191866, 211212, 13978, 497617, 411509, 294596, 217868, -37883, 110513, 213346, 70300, 135612, 284874, 77737, -185738, 61805, -114054, 320101, -79937, -38770, 274876, -12332, -70115, 118158, -195077, 41313, 41517, 205476, -12334, 7812, 170352, 190777, 212207, -268046, -124895, -76611, 233566, 371530, 205667, 423077, 321556, 147192, 168950, -55975, -200470, -24764, -34295, 73831, 191431, 234102, -151501, 431352, 118210, 105407, 174563, 35776, 44380, -27067, 274721, 190123, -51741, 151811, 8128, 49769, -4345, -51063, -72958, 126947, 737, 173912, 67499, 236031, 179057, 203275, -89142, -106924, 137156, 237015, 110675, -242968, 24248, -143854, 213738]
16219A09661b4092k3836H1997l8781e3120j0872C26050a73851I4815J90666A11888
16207G4119c44p257A50733J90731a17381B00384e9377I0632L31497A56084D0175
16195A02723J31096k7770b03514A87822A3344a29931c4200j24214A25820f996
16184i8466l0510d9646p1604k4039A3560Q1749i2232A53982J31546D0589c67476
16172b18309d5227B97049D8667k1939i9630B03216J9243j04451J08396d32B8528
16160f6858j01424C11715A11760D9273L838K04070P2410A06581b20792A69481
16149a41386o44127E4915J53983e8615r329A5933a45033a421B1033c06796n6855
16138c63651C35255b31993A25622c1576F6824B2314K9583L2198b19031B75618
$$ y = [109661, -24092, -47928, 81997, 43216, -53120, -63992, 326050, -173851, 94815, 285481, 111888, 74119, -344, -7601, 150733, 341464, -117381, 200384, -59377, 90632, 422129, 156084, 40175, 102723, 233819, 206049, -203514, 187822, 13344, -129931, -34200, -158414, 125820, -6996, -98466, -128976, -49646, -121250, -145289, 13560, 95309, -92232, 153982, 285528, 40589, -367476, -218309, -45227, 297049, 48667, 26728, -99630, 203216, 222459, 118008, 226404, -432, 28528, -66858, -168282, 311715, 111760, 49273, 53111, 257181, 329591, 106581, -220792, 169481, -141386, -785513, 54915, 208898, -58615, -67944, 15933, -145033, -1421, 21033, -306796, -363651, 335255, -231993, 125622, -31576, 66824, 22314, 51897, 84095, -219031, 275618]
16127a28346k18122A1387b52551C6698J94298e7801A7857M2542L2705f1987D1537
16115h6606o4331B13237R9872C0670K9474r802a09747c3783A00383J8719C6147
16103a5227B71873E4055J01311f3980A91288l8055k7566e6602k04798D03444A9399
16091B90929j04049J0539A448b22640A5147b38100B88737H9605a87058D5426j1967
16080C3459a62423A84050i7241L4718j95037c105j4770A87459p9243l6244h599
16068c64612f3323O869j31812N8844j66680A91521a52584A42887D3963a37416
16057a99181k34618J86615B24810a88130A10328b93343e808j40182A02044l2845
16047F9199a53000D0011a69855A28083a94891B36607a68844f5401A36043a57823
$$ y = [-128346, -346468, 11387, -252551, 36698, 230996, -57801, 17857, 60399, 93104, -61987, 41537, -86606, -150937, 213237, 313109, 30670, 60144, 50342, -109747, -33783, 100383, 119102, 36147, -15227, 271873, 54055, 155366, -63980, 191288, 153233, 125667, -56602, -261400, 403444, 19399, 290929, 186880, 197419, 1448, -222640, 15147, -238100, 288737, 89605, -187058, 45426, 33459, -162423, 184050, -97241, -62523, -257560, -3105, -17875, 187459, 108216, 71972, -8599, -364612, -63323, -56454, -188266, -129422, -296102, 191521, -152584, 142887, 43963, -137416, -199181, -433799, -247184, 224810, -188130, 110328, -293343, -5808, -145990, 102044, 69199, -153000, 40011, -169855, 128083, -194891, 236607, -168844, -65401, 136043, -157823]
16036c6764q0595j97061G6344f039I0117h5100l47738A53255b78105F5721f8758
16024a87562k4728J05871A85554a01477H4710l2572b65344A68357G0122j4614
16014E5508K39748q5077a14718C31086C0057M5001a37136c4138m7159b123j3849
16003a5972k43265C6001L3250B5440a44864A59761J30703i9508c4230k2043B38361
15991B15447q6354Q8459C9751a64613j47513E5591J89043c65444A86434q8618
15981I7816R0276R5808J08157F1669J1884K15639g2574D8861J81006c2612j97601
15970b30213A50128A5474a54810M287L1476j46018A47350C091K60094g6953C30120
15958i0149j73053b6536j4001A75457j1316c5412j19087c8742a2977o9977D7246
$$ y = [-36764, -117359, -314420, 76344, -6039, 90117, -85100, -432838, 153255, -278105, 65721, -68758, -187562, -212290, -106419, 185554, -101477, 84710, 52138, -265344, 168357, 70122, 55508, 295256, 210179, -114718, 331086, 30057, 75058, -137136, -34138, -81297, -2123, -15972, -259237, 36001, 69251, 25440, -144864, 159761, 290464, -99508, -34230, -56273, 238361, 215447, 129093, 217552, 39751, -164613, -312126, 55591, 244634, -365444, 186434, 97816, 188092, 283900, 392057, 61669, 73553, 289192, -72574, 48861, 229867, -32612, -230213, 150128, 15474, -154810, -150523, -119047, -265065, 147350, 3091, 263185, -76953, 330120, -90149, -263202, -26536, -40537, 175457, 164141, -35412, -154499, -38742, -12977, -82954, 47246]
15946A17862c81815D5553a8269l6733J3918B45325b45651d8871A48292e83892
15935g0093j5608A71961f0054j69235C6051a82082l4901Q6152D6981c09549A12296
15923A90713A5361d7905A48115a5005l084l25359a39466A67272n7774m1318j5940
15912E2240a14458h870k6113k1471k84671a36241H6362e4438B3023b8534l08002
15901c36536c6322j50745B91337c63114a22657j3918a4804A13368o613B7155q528
15890A8627a38547g733A76895b63088H7502a42773F2769e6881a3563B09040F6288
15878e9143k18992e2092k35079B69218c5417j00900b8229o1313c115o6580E4850
15866a22426a6708j25921H7984L8370R125a90583O5486H9879a01630A4935d4918
$$ y = [117862, -381815, 45553, -18269, -55002, -41084, 245325, -245651, -48871, 148292, -583892, -70093, -85701, 171961, -60054, -229289, 36051, -182082, -216983, -130831, 46981, -309549, 112296, 190713, 15361, -47905, 148115, -15005, -18089, -343448, -139466, 167272, 109498, 68180, 52240, -114458, -8870, -34983, -56454, -341125, -136241, 86362, -54438, 23023, -28534, -336536, -36322, -187067, 291337, -363114, -122657, -136575, -14804, 113368, 106755, 27155, 18627, -138547, -7733, 176895, -263088, 87502, -142773, 62769, -56881, -13563, 209040, 66288, -59143, -278135, -52092, -287171, 269218, -35417, -136317, -28229, -89542, -3115, -69695, 54850, -122426, -16708, -142629, 87984, 126354, 135479, -190583, -125097, 89879, -101630, 14935, -44918]
15854A29361P5475a34430j69198O7248f5843p9187j83100A01280k5445a97403
15843H0423J47745I7506i3071H0773b74082D4375P3410a5146A37405a34487N4033
15832h0454k2812A7173J33602b22350B16255g7704K7662D3450a53710A73193D8863
15820A32151f9573k41591a54485j45007A5006a98061F6131L2275Q4317a23552
15809I1093C0494c6425A57985L2677a02092G4170d6859F7202B4502a72959H1733
15797F9788D140L3496b16022r185B98685a1117G643b06374e6371C6344a82988
15785c5672j43996F2954O6593k3197a30314k5834O7779C2315d9668B64958F6183
15773e11799a54703A68687A4068c2602a4931j50897g5189H6229p24e2748j29762
$$ y = [129361, 204836, -134430, -303628, -236380, -65843, -145030, -328130, 101280, 75835, -197403, 80423, 228168, 97506, -93071, 80773, -274082, 44375, 117785, -15146, 137405, -134487, -80454, -103266, 17173, 150775, -222350, 216255, -77704, -50042, 43450, -153710, 173193, 48863, 132151, -69573, -311164, -154485, -299492, 15006, -198061, 66131, 98406, 182723, -123552, 91093, 30494, -36425, 157985, 190662, -102092, 74170, -46859, 67202, 24502, -172959, 81733, 69788, 4140, 37636, -216022, -225207, 298685, -11117, 7643, -206374, -56371, 36344, -182988, -35672, -179668, 62954, 129547, 106350, -130314, -156148, -88369, 32315, -49668, 264958, 66183, -511799, -154703, 168687, 14068, -32602, -14931, -165828, -75189, 86229, 85505, -52748, -182510]
15762a82510P6100D6674i8947K6742C76303A82738b05619A39182a02551C1157
15751A4630M1253R4962O4221q9758n9964M1324p507a81745B69809Q3849a39106
15739h1241A8711a47186Q062k7907a5420A81614b97227B29056c44685G9438R3167
15728A72605e2929j16607h3516j32997A5541b92222I7977b8843k27804M8884J3242
15717a94521J6953F680h3056k35974o6224J04881j06952I0970b37234H4952O3861
15706A48813b96480B71093j30732m7834b32920J9741e5241B99430c45751a5264
15695A28348a39020O0777A27410J32621m6479f587C4561d4758I7421b70231B62763
15683a09535K8426m0821C42212A12302e4923D0743K3757a58202F3921c50729B28567
$$ y = [-182510, -106410, 46674, -98947, -72205, 376303, 182738, -205619, 139182, -102551, 31157, 14630, 55883, 150845, 215066, 125308, 65344, 106668, 99161, -181745, 269809, 353658, -139106, -81241, 18711, -147186, -139124, -167031, -15420, 181614, -297227, 229056, -344685, 79438, 172605, -52929, -169536, -83516, -216513, 15541, -292222, 97977, -28843, -256647, -207763, -194521, -177568, 6680, -83056, -319030, -385254, -280373, -387325, 90970, -237234, 84952, 148813, -296480, 271093, 140361, 92527, -232920, -213179, -55241, 299430, -345751, -15264, 128348, -139020, -78243, 127410, 260031, 213552, -6587, 34561, -44758, 97421, -270231, 262763, -109535, -81109, -121930, 342212, 112302, -54923, 40743, 64500, -158202, 63921, -350729, 228567]
15671a51071L4141k8815M1720a4384A17385a40940l0168Q259L2585F3795j4165
15660D9630d02651A05546c25650a45297j96765G608J52770G1197b3689m9410A94398
15648e6566C95706a67053H7347e6704C04332A1930J7243b68790H0449M7537j2274
15637A15712a44835A71489o4096a05825A95109G166g2469j42751k02123P6176
15627c41167A30100c5186H5117k0171c0417r494k97079D9636J13684b35383A43274
15615e2570j14820D0386J06844F6063b22521H7439B903b50766k8175A03560Q2964
15604A86524b13060O6261A36217a00210B59734c12226E7391a65470M1698A60890
15593c35417B27601e6139l1257M0288r1869a5617j47168d8273M285a8336A38913
$$ y = [-151071, -116930, -145745, -104025, -14384, 117385, -140940, -171108, -162849, -130264, 63795, 49630, -402651, 105546, -325650, -145297, -342062, 7608, 160378, 71197, -23689, -73099, 194398, -56566, 395706, -167053, 87347, -56704, 304332, 11930, 29173, -268790, 80449, 127986, 115712, -144835, 171489, 107393, -105825, 195109, 7166, -72469, -215220, -417343, -341167, 130100, -35186, 85117, 64946, -30417, -39911, -336990, 49636, 163320, -235383, 143274, -52570, -167390, 40386, 147230, 66063, -222521, 87439, 2903, -250766, -278941, 103560, 186524, -213060, -146799, 136217, -100210, 259734, -312226, 57391, -165470, -123772, 160890, -335417, 227601, -56139, -87396, -47108, -138977, -15617, -162785, -48273, -43988, -18336, 138913]
15581d11558J67829f2538D7739f7176A1564h0532B02366a83148G2077b05161G6328
15569a77103o2173Q4630A69220l7180e3742e55I4160M3143n5689a12208q8353
15558b00561B14615a7827H7361M1481e1611j69650C16629E4262a63859e3731N277
15547d8454a1701B85800a08336A78534b4166m18570Q9403B28651N5066c46614
15536A59484n1665m1857A0446a69027d7297G0900g1950B24510H3516j1464a673
15524F2575b41231c2668A62286B8297K77890A51273e559F9513e5807k48424D4225
15512B65929F3622J0292C2689J54186J39345j16639h9105k08930f9582a612j48637
15501a50249A7029N4088h4279j52268h30k3355G7677k1955e0349E6907a04168
$$ y = [-411558, -243729, -62538, 47739, -67176, 11564, -80532, 202366, -183148, 72077, -205161, 76328, -177103, -239276, -154646, 169220, 132040, -53742, -555, 94160, 137303, 81614, -112208, -200561, 214615, -17827, 87361, 128842, -51611, -221261, 316629, 54262, -163859, -53731, -48454, -11701, 285800, -108336, 178534, -24166, -442736, -353333, 228651, 283717, -346614, 159484, 107819, 65962, 10446, -169027, -47297, 70900, -71950, 224510, 83516, 72052, -1673, 62575, -241231, -32668, 162286, 28297, 306187, 151273, -5559, 69513, -55807, -304231, 44225, 265929, 63622, 73914, 32689, 186875, 326220, 209581, -89105, -298035, -69582, -1612, -150249, 17029, 71117, -84279, -236547, -830, -24185, 77677, 55722, -50349, 56907, -104168]
15489b68073f4369l9314A43792J4335a74437r3129B02061a40543A30612a49711
15478A2228d7205B30165C1676i8266D4592L5380C2559J12452a12953A93551J05999
15467B99550h4036C05336l9800E0818a93849e7076a2695A08966b005C9875J55051
15456A94926L3349R8506j33349c6959k18376J5794J05356L785J8653B38720a95414
15444B54374g9879F08054b58491F2146b856D01892E6003A009R1658K84351d7961
15432f0531A76874q3759K41546a77254D3499J72361G0796a78566B18329a73356
15421A15469L33512a48972M3059q338q387J5264J4458J5995n5467j33794h901
15409A24862M9538b85130j40877A76918J34220a83034A136L9592A7793J9052N1976
$$ y = [-268073, -64369, -103683, 143792, 158127, -174437, -267566, 202061, -140543, 130612, -149711, 12228, -47205, 230165, 31676, -98266, 44592, 79972, 32559, 145011, -112953, 193551, 299550, -84036, 305336, 265536, 50818, -193849, -57076, -12695, 108966, -2005, 39875, 194926, 228275, 326781, 193432, -36959, -255335, -239541, -134185, -130400, -111747, 238720, -195414, 254374, -79879, 608054, -258491, 62146, -2856, 401892, 56003, 1009, 92667, 377018, -47961, -60531, 176874, 93115, 334661, -177254, 43499, 215860, 70796, -178566, 218329, -173356, 115469, 448981, -148972, -105913, -114251, -122638, -107374, -92916, -76921, -132388, -266182, -8901, 124862, 174400, -285130, -426007, 176918, 311138, -183034, 1136, 40728, 17793, 36845, 88821]
15398H8821L1838K1634b44695M4208A10201a23482a6368p342m91365A06732A9019
15386b36986e5557B16015L0328I4036a03761L4070C3917a8897j17180A95812a96408
15374H7549e1117B56816A08677k3796J08066h7396A94746L8030a18659A93713
15363e4243A60914g8403E3859h3796A82527a86905m6345A1338c91774J70998N5011
15352a65765j88295M2572a16478k36020b6834C2172e7696a4360B2677c61269D7626
15340B85353a05041B1553O4741B8987L2820l0458b0682A69676b1140I3381h9752
15328c53I9695c2251k50181A37803Q5159A11037K56112i4470o8853P6774A47203
15316C12300F8187J80987i583l7670J5356l2162B4967J67797O625L58132I1260
$$ y = [88821, 120659, 142293, -244695, -200487, 110201, -123482, -16368, -23710, -515075, 106732, 19019, -236986, -55557, 216015, 246343, 94036, -103761, -69691, 33917, -18897, -136077, 195812, -196408, 87549, -51117, 256816, 108677, 84881, 192947, -87396, 194746, 232776, -118659, 193713, -54243, 160914, -78403, 53859, -83796, 182527, -186905, -233250, 11338, -391774, -220776, -165765, -354060, -311488, -116478, -352498, -26834, 32172, -57696, -14360, 22677, -361269, 47626, 285353, -105041, 21553, 86294, 28987, 61807, 31349, -20682, 169676, -21140, 93381, -89752, -353, 99695, -32251, -282432, 137803, 222962, 111037, 367149, -94470, -163323, -86549, 147203, 312300, 68187, 249174, -9583, -47253, -31897, -64059, 24967, 192764, 199389, 557521, 91260]
15304D2877b08068F4999a68101A27544b1361k8591I1272L8380a09880c3702e221
15292b37093E009J59396n7644g4093n26b6555A15994F325J24820m6486M907b11250
15279c40496F9377b86763A22073k9210j0377C6831a323j16934k1542l1377b5684
15267d2672B17815D696J82391b77453I4337J66056G0772h4696B99295M8092A37070
15255h4623B19418g661j49621B27472J01811m7076N64016Q71589l77495k7459
15245A312858j90608A81977n6838n0330J72470A11956J22946J16420j31261l3858
15235A86203J34271a96485D5385R5255C958a01193j93451A51252J90571a56576
15224B85506a02105G8546K68645l2116A30108D8177N5803m8560L0186L010O0765
$$ y = [42877, -208068, 64999, -168101, 127544, -21361, -49952, 91272, 129652, -109880, -33702, -5221, -237093, 5009, 164405, 106761, -74093, -74619, -26555, 115994, 6325, 131145, 84659, 89566, -211250, -340496, 69377, -286763, 122073, 92863, 82486, 36831, -1323, -118257, -139799, -171176, -25684, -42672, 217815, 4696, 187087, -277453, 94337, 260393, 70772, -84696, 299295, 347387, 137070, -84623, 219418, -7661, -157282, 227472, 329283, 282207, 846223, 1717812, 1340317, 1312858, 1122250, 181977, 125139, 74809, 247279, 111956, 234902, 351322, 220061, 186203, 320474, -196485, 45385, 140640, 3958, -101193, -294644, 151252, 341823, -156576, 285506, -102105, 78546, 347191, 315075, 130108, 48177, 103980, 55420, 85606, 88616, 149381]
15213A49381l1369a52065b5883j20928C39307a38696O7655C37359A64642i1532
15202h0173B22592I9792e6545A30965a2203A958L9036d02141B15210H5274R5238
15191A80512j9065B7668b30293h5290L5777n1201B4920K6352N0503O4210n4391
15180A11594B5752a89676C53004c2077j72128E5486K13080F5703L459r599e4360
15168d1203J6411D03594j98866A1944J87297b56790A66048E8116B1523a6708B49224
15156I4610h8633F26768A12859K76761F6768J67730p7099c771A15112B2294a2356
15144b28423A16216l3360J9539L96553d5460C703O9093D10d3152A91663e9618
15132A52853C235L76399h2165A8628K63037k8429A4413P7121L21018q0650O2332
$$ y = [149381, 118012, -152065, -25883, -146811, 339307, -138696, -71041, 337359, 164642, -91532, -80173, 222592, 99792, -56545, 130965, -12203, 1958, 40994, -402141, 215210, 85274, 180512, 161447, 27668, -230293, -85290, -49513, -100714, 24920, 51272, 101775, 165985, 111594, 25752, -189676, 353004, -32077, -204205, 55486, 268566, 65703, 69162, 59563, -54360, -41203, -24792, 403594, 204728, 11944, 199241, -256790, 166048, 58116, 21523, -16708, 249224, 94610, -88633, 626768, 112859, 389620, 66768, 234498, 157399, -3771, 115112, 22294, -12356, -228423, 116216, 82856, 102395, 498948, -45460, 3703, 72796, 410, -43152, 191663, -59618, 152853, 3235, 379634, -82165, 18628, 281665, 253236, 14413, 91534, 412552, 331902, 394234]
15121C94234o7344b60361A09708J11331p3312G304J79777j6527D4558a50383A45080
15109D1153R7446K0614B6560J18984j3656a62596M1240C25018J53291j50398A55209
15097D8981M0951O23N9205G362M73589a61569F2823N43961k86170A11381J50025
15086B61406F4797K10133A29393O0829n2244a4000B8999L98674A70315n4149K07
15075A16373j6017N87263a74818P7803G2255J49195C3350J11542K08480l4860
15065C18512D7940K82564A61729G2103J68280M1411n9616A00637J32697a0642
15054C54482F0600J9448K47971A34479J08828L8818F4842Q2587J08952E5078J3044
15043F8122N01673B29462j10771K18706j58307P1206J62187D2242J52442J19201
$$ y = [394234, 326890, -260361, 109708, 221039, 147727, 7304, 187081, 170554, 44558, -150383, 145080, 41153, 138599, 159213, 26560, 145544, 131888, -162596, -121356, 325018, 478309, 327911, 155209, 48981, 89932, 90555, 149760, 7362, 480951, -161569, 62823, 606784, 320614, 111381, 261406, 64797, 274930, 129393, 190222, 137978, -14000, 28999, 427673, 170315, 116166, 116373, 100356, 687619, -174818, -97015, 72255, 221450, 33350, 144892, 353372, 318512, 47940, 330504, 161729, 72103, 240383, 281794, 222178, 100637, 233334, -10642, 354482, 60600, 80048, 328019, 134479, 243307, 282125, 64842, 147429, 256381, 55078, 68122, 569795, 229462, 118691, 337397, 179090, 250296, 412483, 42242, 194684, 313885]
15033C13885I5443b4487P574F6750A9321J58416Q5899J38545I7668J53360D8327
15021A12634J54135m6694k257n7210J1044R4880J58084H6112L13851L0923A83614
15009A58858K14943A39429L59141B07754J20958A06863J39025A18493K58794A54146
14998C57295A63007k5500p318A1658L68151J3757k141A22261J09740P9483E288
14986C82359G9660P8299J59089O8441B6214J56180P1464o7162Q816a27480K5418
14975a02062C18063A32646J17754L5435Q0311j25516J38092P4628A40646J99911
14965C40557j04010d1254D01271j60184H7813J18693J26413o6294F0576J41209
14955B01785J05965b57061B20441J39832K09365k84564p7841Q7566K51923G499
$$ y = [313885, 95443, -24487, -16913, 66750, 19321, 177737, 263636, 402181, 97668, 251028, 48327, 112634, 266769, 220075, 217818, 160608, 171652, 266532, 424616, 86112, 399963, 430886, 183614, 158858, 373801, 139429, 498570, 207754, 328712, 106863, 245888, 118493, 377287, 154146, 357295, 163007, 137507, 130189, 11658, 379809, 393566, 391425, 122261, 232001, 311484, 5288, 382359, 79660, 157959, 317048, 385489, 26214, 182394, 253858, 186696, 195512, -127480, -102062, 318063, 132646, 250400, 285835, 366146, 240630, 378722, 453350, 140646, 340557, 236547, -41254, 401271, 241087, 87813, 206506, 332919, 266625, 60576, 201785, 307750, -257061, 220441, 360273, 569638, 285074, 207233, 294799, 546722, 7499]
14944C46775L5893J0769A79328k8516K28824o3232P6365l7951A57776L02238q8640
14933C71374K29128k14887j31984q0938L03258A20611J76105q2943r9035N23228
14923F37966E0611J03911L48528r2933j23486K15193p5343l7420e5870B95285
14912C84675j87318M9385G9825N0738R6517J634J32504l8954A52720J34773J73901
14901D61394A69790J02730J63710O5623A46175M66729B87810J23372o930k0156
14891C84096j28055m9785n1571N77620j67582j40969n3843j22533M5925J0707
14881C04010l2733L31625A51544O12614l33255o798j55612O1931J38841m7490
14871D21775j2606M0348A58218R7040Q4169q7875J12123b39408D72903j44150
$$ y = [346775, 382668, 393437, 179328, 150812, 379636, 316404, 392769, 354818, 157776, 460014, 371374, 600502, 385615, 253631, 172693, 475951, 120611, 296716, 213773, 114738, 637966, 50611, 154522, 503050, 410117, 286631, 501824, 426481, 389061, -55870, 295285, 384675, 197357, 246742, 79825, 130563, 227080, 228714, 361218, 322264, 152720, 287493, 461394, 169790, 272520, 436230, 501853, 146175, 612904, 287810, 411182, 404252, 384096, 256041, 206256, 154685, 732305, 564723, 423754, 369911, 247378, 293303, 304010, 271277, 602902, 151544, 764158, 430903, 424105, 268493, 330424, 469265, 421775, 409169, 449517, 158218, 255258, 339427, 251552, 363675, -239408, 472903, 328753]
14861C28753J09157M4348j81883J17320O3986k6494l1611Q0044K2906m9702K09441
14850F86265A57605L31850A73994M84892A08891M59211G1099N07305B24109L44728
14840E68837E0564K39321J28823A31066K30504J05595L14138C06626K15153P6705
14830E98484l1716l0672L0594o931J821k71888K7125J19461J74488A42294M47496
14819E89790k01671O0352B15039P7271L31536P3864j37935j4618J24660B60309
14808E89566j59045J78048J40136k40289P0904K18466j26264J06375k98103Q9130
14798E68924B62695J53705M56303k41392k21584j08778N28892l265j93282J47647
14788G80941Q398j61081j154K0248q3230J81271j29789l9184M2030M05449l90472
$$ y = [328753, 437910, 482258, 300375, 417695, 481681, 455187, 423576, 503620, 526526, 476824, 686265, 157605, 489455, 173994, 658886, 108891, 568102, 71099, 578404, 224109, 568837, 50564, 289885, 418708, 131066, 361570, 467165, 781303, 306626, 521779, 598484, 566768, 536096, 566690, 559759, 561580, 289692, 316817, 436278, 610766, 142294, 589790, 388119, 448471, 215039, 292310, 623846, 697710, 559775, 545157, 669817, 260309, 589566, 430521, 608569, 748705, 508416, 579320, 797786, 671522, 777897, 479794, 568924, 262695, 416400, 872703, 631311, 409727, 300949, 829841, 826576, 633294, 780941, 789339, 628258, 627104, 647352, 564122, 745393, 615604, 576420, 618450, 1023899, 633427]
14777F33427J31043C74150L49365q5174J53717j95943l7263M7101J37273Q0145
14767H23371q0661q8457j29533Q5012J38085j13989j27815L37231j51725N9938
14757G51457o2684j83754K48143j04824J08152j28447J0641k41514L30782j95269
14747E32683K50787j00051r4483L32331p9154R2231k11690J07016L2200M0292
14737I02162k39603L28430D29399K65670j52566K91088M47053m93247j65025J7019
14727F39391J71805j45763M19593j62273k90659M0558L58985l15534L05398n7168
14717I64333J01499m31647L19535j10016P287M3404j17256n7037M57682j41719
14707A036065j61877k35460L24638k03832M3206k92209L78842J07747q2725p7527
$$ y = [633427, 764470, 374150, 723515, 638341, 792058, 596115, 558852, 605953, 743226, 823371, 742710, 654253, 524720, 609732, 747817, 633828, 506013, 843244, 691519, 751457, 688773, 505019, 753162, 648338, 756490, 628043, 638684, 397170, 727952, 532683, 783470, 683419, 588936, 921267, 842113, 934344, 722654, 829670, 861870, 902162, 662559, 990989, 429399, 695069, 542503, 833591, 1280644, 787397, 622372, 639391, 811196, 665433, 1085026, 922753, 632094, 672652, 1031637, 716103, 1021501, 964333, 1065832, 634185, 953720, 843704, 850991, 894395, 777139, 720102, 1177784, 1036065, 874188, 638728, 963366, 759534, 802740, 510531, 889373, 997120, 914395, 836868]
14697H36868K49484L0974q6916K35391m85369L15408l73970K30339j2784j1815
14687I27610J82328k86440K04459Q6655K9439l00377J02407k0742P156M9760J28704
14676A110959m0750k66762N10063k32343J43115Q1634m9687m49724O05639l34634
14666A077510j43072L50791j28891l71330M17562j03391O9255l92837K27820K40360
14656A243777J62320k40445Q6545r124m0790R3688j49770R7276j9858j65537M01198
14645A459280m28855M13625P4380m56439n5489L53540J28010R6295J62841n20137
14635A227051J36592m9832J58036j17176o9261J71280l54760M75979l4335O0705
14625A604279J11829j7747m66235K80120k66874L79560K50399n42501J6147M59824
$$ y = [836868, 1086352, 1117326, 1030410, 1265801, 780432, 1095840, 721870, 952209, 939425, 927610, 1109938, 823498, 1027957, 1114612, 1144051, 843674, 946081, 925339, 932495, 982255, 1110959, 1070209, 803447, 1313510, 1081167, 1224282, 1305916, 1256229, 806505, 1412144, 1077510, 934438, 1285229, 1156338, 785008, 1202570, 1099179, 1168434, 775597, 1003417, 1243777, 1406097, 1165652, 1252197, 1243073, 1202283, 1295971, 1146201, 1243477, 1223619, 1058082, 1459280, 1030425, 1444050, 1518430, 1061991, 1006502, 1360042, 1488052, 1584347, 1747188, 1227051, 1363643, 1313811, 1471847, 1354671, 1285410, 1456690, 1101930, 1577909, 1543574, 1604279, 1716108, 1698361, 1232126, 1512246, 1245372, 1624932, 1875331, 1332830, 1348977, 1808801]
14615A808801m24171J05482N6102K32830J78624k76147j35567J6090K07023k80069
14605A488998o7294K96844j18982J53724k094l87286L91151j68857K08645k85966
14595A508883L30870J8166j06578L35637k09298J39321k39777O24689l75072l0232
14585A996609J0079j43382J70325l38219N3946M24714k4707J84467L3944l55811
14575B011965K45972J41013M319j37737J89519k3046K12739l83608K33533P0165
14565B564834o202j54594L28849N8733P9264N5218q3355K39957J63727P8414O3706
14554C388551N37758K9497M20683O63233J206224J667297L321398Q982136K1489683
14545D1706460P270333B0982196H493831l760701j587968l14110m01575p7075
$$ y = [1808801, 1384630, 1490112, 1546214, 1779044, 1957668, 1681521, 1545954, 1562044, 1769067, 1488998, 1421704, 1718548, 1599566, 1753290, 1751196, 1363910, 1755061, 1586204, 1794849, 1508883, 1839753, 1857919, 1751341, 2086978, 1877680, 2017001, 1777224, 2401913, 2026841, 1996609, 2006688, 1863306, 2033631, 1695412, 1749358, 2174072, 2149365, 2333832, 2367776, 2011965, 2257937, 2398950, 2403269, 2265532, 2455051, 2432005, 2644744, 2261136, 2494669, 2564834, 2558632, 2404038, 2732887, 2791620, 2870884, 2926102, 2842747, 3082704, 3246431, 3324845, 3388551, 3926309, 3955806, 4376489, 5039722, 6245946, 7913243, 11234641, 20216777, 41706460, 48976793, 20982196, 8493831, 4733130, 3145162, 2831052, 2429477, 2352402]
14537B352402m40348K93786o6476j80388L26239l9167o1185J41793J67562j84282
14527B309936J58676r9130K2549j28135N27935j23525J22139p6343J72141J0312
14517B896555N4441J44860R350m25082K78739J01534l52974J27737M24256n28891
14507B730525M78213j85924K42474k14705N12691k90334o8320K63908k72666J66780
14497C362642j9126k4529L20123l47560Q5532O3667J21101J90737l21310K52414
14487C683691J95545N647n9853J92200p8599J3657L72594l28571K38159j40681
14477D093789J02551J18400J9390j23627R6967P5461N3715K11986K83794r4591
14467D837835J35308l20276J98915o5184J97836J2332K17862j02228j87205K04744
$$ y = [2352402, 1912054, 2205840, 2139364, 1958976, 2285215, 2246048, 2184863, 2326656, 2494218, 2309936, 2468612, 2369482, 2392031, 2263896, 2791831, 2668306, 2790445, 2714102, 2886243, 2896555, 2950996, 3095856, 3105206, 2680124, 2958863, 3060397, 2707423, 2835160, 3259416, 2730525, 3208738, 3022814, 3265288, 3050583, 3563274, 3272940, 3204620, 3468528, 3195862, 3362642, 3343516, 3318987, 3639110, 3291550, 3377082, 3440749, 3561850, 3752587, 3431277, 3683691, 3879236, 3884883, 3825030, 4017230, 3938631, 3952288, 4324882, 3996311, 4234470, 4093789, 4196340, 4314740, 4334130, 4210503, 4307470, 4382931, 4436646, 4648632, 4932426, 4837835, 4973143, 4652867, 4851782, 4786598, 4984434, 4996766, 5214628, 5112400, 4925195, 5129939]
14457E129939n6152n3763K21089n7908K05369K94148N9225J27217J19641j97018
14447E791787J65140J89103K48900j40039K20313j65993J87059k08053K22384
14438F510601L79367l06172K95330k17666L81315K09047J53051k80306M35265
14429G559832m5279N9397J14913L00448J66891K23293l98631L13090P7568J31051
14419H502573R6514j42659K72254K05110M42881l99979K96521R8857M7216L90924
14409I810212L7097J43116N4989J03424O38140p2371K62490J71336L15939j90994
14399A1273378Q4371j15220N06077L45718K42256J9502J78165N50915k70532O66329
14389A3480959J69358K48089M18129J983K58173K24155K25027L27458J01601K28026
$$ y = [5129939, 5073787, 5020024, 5241113, 5183205, 5388574, 5682722, 5741947, 5869164, 5988805, 5791787, 5956927, 6146030, 6394930, 6254891, 6475204, 6309211, 6496270, 6288217, 6510601, 6889968, 6583796, 6879126, 6661460, 7042775, 7251822, 7404873, 7124567, 7559832, 7514553, 7573950, 7688863, 7989311, 8156202, 8379495, 7980864, 8293954, 8371522, 8502573, 8599087, 8456428, 8728682, 8933792, 9376673, 8976694, 9273215, 9372072, 9419288, 9810212, 9847309, 9990425, 10045414, 10148838, 10786978, 10714607, 10977097, 11148433, 11464372, 11273378, 11357749, 11242529, 11748606, 12094324, 12336580, 12356082, 12534247, 13085162, 12814630, 13480959, 13650317, 13898406, 14316535, 14318518, 14576691, 14800846, 15025873, 15353331, 15454932, 15682958]
14379A5682958M19731J54579M97603L30068M80800J16594J000043l47012O01525
14370A8936889l6409Q13583M65271M39073L60593P8874Q12381J90951K49840R63507
14360B3274553L15982O70214N86102O63025l2070J405425j80798J068238M71838
14351B8242509P11544J038205K11936P07672R81607J158244M28093P43699J077279
14342C5300788R01080P82595R68248J234917J245279J045092R14014J436016J173321
14333D5001350J575709J299976J469784J494120J336489J610798J892129J832341
14325E7512696J684175K181837K134197J845607K039279K950196K137950K596301
14317G5082238K581278L546246K600363L452766L451250L132967M226904L666022
$$ y = [15682958, 16102689, 16257268, 16754871, 17084939, 17565739, 17682333, 18682376, 18335364, 18936889, 18900480, 19714063, 20179334, 20618407, 20979000, 21057874, 21870255, 22061206, 22311046, 23274553, 23590535, 24260749, 24846851, 25509876, 25477806, 26883231, 26702433, 27770671, 28242509, 28954053, 29992258, 30204194, 30911866, 31893473, 33051717, 33479810, 34223509, 35300788, 36201868, 36984463, 37952711, 39187628, 40432907, 41477999, 42392013, 43828029, 45001350, 46577059, 47877035, 49346819, 50840939, 52177428, 53788226, 55680355, 57512696, 59196871, 61378708, 63512905, 65358512, 67397791, 70347987, 72485937, 75082238, 77663516, 81209762, 83810125, 87262891, 90714141, 93847108, 98074012, 101740034]
14309A01740034M141103M274161N094617M343575N594221M965045N857530O438969
14301A42449255O006656P088317P409929P312883Q125387Q947001Q869132R085336
14293B05293896J0133380J0825874J1025137J1783623J2120365J2505121J3522038
14286B87209434J3563767J3796696J4727937J4535105J4729355J5252574J4790669
14279C88605537J4411293J3710337J2992108J2214809J0707145Q755725O701234
14272D68098188L143115O57873k24818j424240l955186n214399p438994q988882
14264D44652657j0357893j2144397j3549082j4550793j5274581j5470714j5588013
14257C47717184j5649123j5315740j4006318j4599566j3800896j3292273j2712673
$$ y = [101740034, 105881137, 110155298, 115249915, 119593490, 125187711, 130152756, 136010286, 142449255, 148455911, 155544228, 162954157, 170267040, 178392427, 187339428, 196208560, 205293896, 215427276, 226253150, 237278287, 249061910, 261182275, 273687396, 287209434, 300773201, 314569897, 329297834, 343832939, 358562294, 373814868, 388605537, 403016830, 416727167, 429719275, 441934084, 452641229, 461396954, 468098188, 471241303, 471899176, 471674358, 470250118, 466294932, 461080533, 453641539, 444652657, 434294764, 422150367, 408601285, 394050492, 378775911, 363305197, 347717184, 332068061, 316752321, 302746003, 288146437, 274345541, 261053268, 248340595]
14250B48340595j2175758j1473328j1018200j0425838r610567r197895q403225
14243A76035784q094593p993623p350420o992883o368318n585239n922309n432103
14235A22296296n364231m596278n196561m040033l272655m659110l573302l322549
14227H8271577l597012l209000k816945k859179k965391k455393k508840k237229
14219F5622588k002108k346091j827041k148505j721495j468327j199217j852812
14211E1056992j719162j843687j083181j168162o19904j421778j418733j535661
14203D0246724j238898q42453p66892m83527j095662j222936j103523n80688j040069
14194C1872076p14848p09858q53987o48029o05245q02547p28490m29966q15043
$$ y = [248340595, 236164837, 224691509, 213673309, 203247471, 193636904, 184439009, 176035784, 167941191, 159947568, 152597148, 145604265, 139235947, 133650708, 127728399, 122296296, 116932065, 112335787, 107139226, 103099193, 99826538, 95167428, 91594126, 88271577, 84674565, 81465565, 78648620, 75789441, 72824050, 70368657, 67859817, 65622588, 63620480, 61274389, 59447348, 57298843, 55577348, 54109021, 52909804, 51056992, 49337830, 47494143, 46410962, 45242800, 44622896, 43201118, 41782385, 40246724, 39007826, 38165373, 37398481, 36914954, 35819292, 34596356, 33492833, 32912145, 31872076, 31157228, 30447370, 29593383, 28945354, 28340109, 27537562, 26809072, 26379106, 25564063]
14185B5564063o82729l63802n75951n29487o60042m56505r5644l27343n06055
14176B1366505p17399l95012l94571k68757l94169p04721P6094p37073J17003
14167A7947900n76959k95698j02404m33816m52803m47787J29603n34530j62435
14158A5071071o24539J33013k72729j97537o78802L26380n45827m4039J7907n66449
14148A2618449K27600m69005O1624n46006j36358r2754m37171k41108n7514j17432
14138A0810325k69081j01052J48913l88029q9762j72378j18143l87464k8457j06482
14128I298390K39819m25428n4975l05978N9162p4593k41649l67690K95167k88977
14118H133248j30978L3126q5085k50601J88369l94697l6249N1512k50532l66726
$$ y = [25564063, 24881334, 24517532, 23941581, 23412094, 22752052, 22295547, 22199903, 21872560, 21366505, 20649106, 20254094, 19859523, 19590766, 19196597, 18491876, 18567970, 17830897, 17947900, 17370941, 17075243, 16972839, 16539023, 16086220, 15638433, 15768036, 15233506, 15071071, 14446532, 14579545, 14306816, 14109279, 13430477, 13756857, 13211030, 13166991, 13184898, 12618449, 12846049, 12377044, 12438668, 11892662, 11756304, 11663550, 11226379, 10985271, 10927757, 10810325, 10541244, 10440192, 10589105, 10201076, 10111314, 9938936, 9820793, 9433329, 9404872, 9298390, 9538209, 9112781, 9057806, 8751828, 8810990, 8736397, 8494748, 8127058, 8422225, 8133248, 8002270, 8035396, 7950311, 7699710, 7888079, 7493382, 7457133, 7508645, 7258113, 6891387]
14108F891387K5944n974l6291j7049n815j40812q4842L5899l51526l020m56121
14097E851780N13403k78136k7109j42826Q8181k99903K2552P4054l46535J44022
14087E599483l58116L85837m03489J78172k5111m08228L94695k9595K3695k18389
14077E138954j01681j07673l9819j14425K9128R8137m28489j89768N64342l19580
14067D529126k58388K99815j5008j55114l12124J28954J03881j63266m5037J62521
14057D275360J74617m01886M1670j06869j72186M1108J56465j72114k7487j19979
14047C688699L10945l47672l44228N46814n28980l0190J62444J64594J2463k07865
14037C427024k11900N1054J60387l31191n465k3818K11354l2243n6159J75803
$$ y = [6891387, 6917331, 6911357, 6875066, 6858017, 6852202, 6711390, 6626548, 6662447, 6310921, 6307901, 5851780, 6365183, 6087047, 6059938, 5917112, 6005293, 5705390, 5727942, 5801996, 5455461, 5599483, 5241367, 5627204, 5223715, 5401887, 5376776, 4968548, 5363243, 5333648, 5357343, 5138954, 5037273, 4929600, 4889781, 4775356, 4804484, 4902621, 4474132, 4284364, 4848706, 4529126, 4270738, 4570553, 4555545, 4400431, 4088307, 4217261, 4321142, 4157876, 4112839, 4275360, 4449977, 4048091, 4089761, 3982892, 3810706, 3851814, 4008279, 3836165, 3808678, 3688699, 3999644, 3651972, 3307744, 3854558, 3325578, 3295388, 3457832, 3622426, 3634889, 3427024, 3215124, 3266178, 3426565, 3095374, 3089909, 3066091, 3277445, 3245202, 3189043, 3364846]
14027C364846k20746j06838p3860r762K48567k00852j82941J99780l62220M28766
14017C084740k05862k56242p0556J50669L1369J74030k29818N8148j06053m4620
14007B585805m16n5079J42999n14315L88772j82297K41647k74768J8039n4873
13997B295514j66360K45145K24025n77528K77394M00739K61585n2388R70878K652311
13987F531315O520804J9715449J7429832k4428152j2454707m882772k074673j258949
13979E098147o51453o29137k45465j65134k27622j81867J5551J05507n76895J51050
13969B692682j54370Q5723n0826p9487j8339L7303j78923J50695k62709n3125
13959B168624j8072K56776l01410R4280l35073O9675J30700K80083m82333J95863
$$ y = [3364846, 3144100, 3037262, 2963402, 2953640, 3202207, 3001355, 2818414, 3018194, 2655974, 3084740, 2878878, 2622636, 2552080, 2702749, 2734118, 2908148, 2678330, 2736478, 2630425, 2585805, 2585389, 2530310, 2673309, 2158994, 2547766, 2365469, 2607116, 2332348, 2350387, 2295514, 2129154, 2374299, 2598324, 2020796, 2298190, 2698929, 2960514, 2908126, 3879004, 6531315, 13052119, 32767568, 50197400, 25769248, 13314541, 8431769, 6357096, 5098147, 4446694, 3817557, 3572092, 3406958, 3179336, 2997469, 3013020, 3118527, 2541632, 2692682, 2538312, 2624035, 2573209, 2493722, 2475383, 2512686, 2333763, 2484458, 2221749, 2168624, 2150552, 2407328, 2105918, 2200198, 1865125, 1934800, 2065500, 2345583, 1863250, 2059113]
13949B059113j76608K02240j3610k29915Q4191q8001L81069n89007K84756j00113
13939A814115J81472k54293j79046K00887J88472K61649m77941k7651P7219k25993
13929A558890K45792l55551M50084m14679P86367m21306m22868M77795l78211
13920A526313O0270K25270L1770k81477j00721M52642m42505K74540J95568m45721
13910A495949r6150j04962N33776k89805j01840K05423k03393P4165L05505o90037
13900A128631O25146k20992O3011j77049K2410J78920l50396j033J75081k39951
13890A203778J32588j02237K3881k77188L85383l27708O08453j97991k04481q204
13880A236274L5408J24508K5472j40123j36881K20727j07160m44937K83589q0878
$$ y = [2059113, 1882505, 2084745, 2071135, 1841220, 1925411, 1837410, 2218479, 1629472, 1914228, 1814115, 1995587, 1741294, 1562248, 1763135, 1951607, 2213256, 1735315, 1707664, 1784883, 1558890, 1804682, 1449131, 1899215, 1484536, 2270903, 1849597, 1426729, 1904524, 1526313, 1586583, 1811853, 1843623, 1562146, 1461425, 1914067, 1471562, 1746102, 1941670, 1495949, 1399799, 1294837, 1828613, 1538808, 1436968, 1642391, 1438998, 1513163, 1818668, 1128631, 1753777, 1532785, 1595796, 1418747, 1441157, 1620077, 1269681, 1268648, 1443729, 1203778, 1336366, 1234129, 1258010, 980822, 1366205, 1038497, 1646950, 1448959, 1244478, 1236274, 1271682, 1396190, 1421662, 1281539, 1144658, 1365385, 1258225, 813288, 1096877, 1015999]
13870A015999n2373J27932K74931j13001n924k68093r5759L66066j13054j37007
13860I99717L30033m34504L22350k1669j51394L7153j85709L2123K20480q4202
13850A064378P1005J05062l35298N8442J59682O815k4637Q7928J56291k11037
13840A138631K6997J341j47387K70868j32354k58388K95494l62223J78115k56421
13830G54673K63167j71960J63469j04099j02274J31891n8595K17921O8677k10573
13820I52297m4938q7051r699K8828J59502Q5182l42117m2827J92638j3112l474
13809H75229J24097O0075j37895j93146J79505j47933J4890J94065k01012J53400
13799I21275l4111Q6364P3889k54478M511k05617n7017N24731m08014L15003J20013
$$ y = [1015999, 963626, 1091558, 1366489, 1253488, 1247564, 979471, 883712, 1249778, 1136724, 999717, 1329750, 895246, 1217596, 1195927, 1044533, 1081686, 895977, 928100, 1148580, 1064378, 1135383, 1240445, 905147, 963589, 1123271, 1130086, 1105449, 1193377, 1349668, 1138631, 1165628, 1166969, 1019582, 1290450, 1158096, 899708, 1195202, 832979, 1011094, 754673, 1017840, 845880, 1009349, 905250, 802976, 934867, 876272, 1094193, 1162870, 952297, 907359, 820308, 810609, 839437, 998939, 1084121, 742004, 699177, 891815, 878703, 875229, 999326, 1059401, 921506, 728360, 907865, 759932, 774822, 968887, 767875, 921275, 887164, 973528, 1047417, 792939, 797450, 591833, 534816, 1059547, 651533, 966536, 1086549]
13788A086549j84665k01330K3212o1836J84188N5938K34107l61981Q1200K5176
13778H80558r851j93911J28568M6611k69029O8072J89545J40461k91217K86759
13768I76566j44607m2421l874r4090j12934J2285L54295l68573K04329j23751
13758F57225J66009l79354n4958L85507n142r6076K80918l18141J6120n7630j63061
13747D31417K86755l8238j54223K60252j90871L47010B16244L47776M9793J5406
13737F29219L26791l72428K33057j36673B58737K91739K36993j62571Q8051Q9202
13727H02151j53107j05054J60641k22225j59718J92311O1151K30166k44900k4137
13717E37279K75219l67271n6029K22552j7586K07847k55789n3875M25363j81726
$$ y = [1086549, 901884, 700554, 723766, 661930, 846118, 902056, 1136163, 774182, 855382, 880558, 870707, 676796, 805364, 851975, 582946, 651018, 840563, 981024, 689807, 976566, 831959, 789538, 785664, 691574, 578640, 590925, 945220, 576647, 780976, 657225, 823234, 443880, 388922, 774429, 769287, 673211, 954129, 635988, 652108, 594478, 431417, 718172, 679934, 525711, 785963, 595092, 942102, 216244, 564020, 613813, 629219, 956010, 583582, 816639, 679966, 258737, 550476, 787469, 624898, 712949, 802151, 649044, 543990, 704631, 482406, 322688, 514999, 576150, 806316, 561416, 537279, 812498, 445227, 389198, 611750, 594164, 802011, 546222, 492347, 917710, 735984]
13707G35984j51188j64485L40506m4336M4453l7960B11459M71631k71785L6231
13697D47536m343K94020l09684Q221M9518K96979l1574p3717k41299J24176k01287
13686C58546Q7663o8580l3783R5073M692J28450l6311k50833J92557J56069m2633
13675E90910p5521K719L2993o7724O1707j9329n3241M4182L9728k7248I2660N86159
13663F78819k93993R3285K44921A94931J04758M12112k13305J10859B57015K84635
13653E41650k49221L80845C15265N7120K10967B07979K96743J86011k50277F7085
13642C25229P2515J21018B35720j0087L87211J95359C82916N0585L7101J60942
13632F31544k50767j9267R0893A39127M16246B63961N3444k9954K69560j34217
$$ y = [735984, 584796, 420311, 760817, 716481, 760934, 722974, 211459, 683090, 411305, 447536, 443193, 737213, 427529, 435750, 485268, 782247, 750673, 676956, 435657, 559833, 358546, 446209, 377629, 343846, 438919, 443611, 572061, 535750, 284917, 477474, 633543, 590910, 515389, 518108, 551101, 483377, 545084, 525755, 472514, 516696, 556424, 529176, 92660, 678819, 384826, 478111, 723032, 194931, 299689, 711801, 498496, 609355, 257015, 541650, 292429, 673274, 315265, 372385, 583352, 207979, 504722, 690733, 440456, 67085, 325229, 397744, 518762, 235720, 225633, 612844, 808203, 382916, 433501, 470602, 631544, 380777, 361510, 452403, 139127, 555373, 263961, 317405, 287451, 557011, 422794]
13622D22794J77563j32725j57197K39474j64724l0830J75079P9520B91496A821
13611E44536B30729k5897K09449o3351M47077l46834r8903J00455j43168Q6605
13601C96162o9023L7469J08743k05901J16961l0817o2077K94540A26578J57066
13591B83644L6388o4516n5731N2112m8602J74672J23793k49507L53829G0892J56876
13580B27768G2058L71522E4141J89807K97554B57754J47318K54615j42360B27365
13569A33056i2799C91534L36277j59754k75456J30807j86462J48345q3901L1619
13559C33009a9431C03294O9750j53313n8503J87862A38290K69858A74648L6127
13549B10775k243K29343k10057k0094J29432J66299k9452A14481K61405a59243
$$ y = [422794, 600357, 467632, 310435, 549909, 385185, 354355, 529434, 608954, 291496, 1821, 544536, 230729, 204832, 414281, 350930, 798007, 451173, 352270, 452725, 309557, 396162, 327139, 364608, 473351, 267450, 384411, 353594, 291517, 586057, 126578, 283644, 320032, 255516, 199785, 251897, 203295, 377967, 501760, 252253, 606082, 70892, 227768, 72058, 443580, 54141, 243948, 541502, 257754, 405072, 659687, 517327, 227365, 133056, -92799, 391534, 727811, 568057, 292601, 423408, 236946, 385291, 301390, 333009, -19431, 303294, 373044, 219731, 161228, 349090, 138290, 408148, 174648, 210775, 208532, 437875, 227818, 207724, 337156, 503455, 474003, 114481, 375886, -159243]
13538B98037e2808D04931a6551F777J91450J0906L56955j77777M4038q7389C4393
13526C13638N2048l3580N7599N2205m8950O924J32452k8642B11627K62367D6060
13514B08774K39920j72297o319Q6N6497P2584J9784m989j39108l9281I0526J36606
13502B27132J73591J65368k52043c103B34798C920J54142K1994K23693a87829
13491B28037M5785I1928L36064Q9268A81378L38695k48305K90704k44743l6090
13481B81639O511K22645j15261K3199r4369a6697B67293L06669A92185O0204j24848
13470A27541L5153K73179j11238I3741J58215J31687a47330B18540K24065A73649
13459G4641J11263a94659B28036j01681L20514j94708J0227j19951K66782o1837
$$ y = [298037, -52808, 404931, -16551, 6777, 198227, 209133, 566088, 388311, 432349, 344960, 34393, 313638, 365686, 332106, 389705, 441910, 392960, 399884, 532336, 503694, 211627, 473994, 46060, 208774, 448694, 276397, 270078, 270164, 326661, 399245, 419029, 414040, 274932, 235651, 90526, 227132, 400723, 566091, 314048, -3103, 234798, 3920, 158062, 180056, 403749, -187829, 228037, 273822, 91928, 427992, 517260, 181378, 520073, 271768, 562472, 317729, 281639, 288150, 510795, 395534, 418733, 324364, -16697, 267293, 573962, 192185, 252389, 127541, 162694, 435873, 324635, 93741, 251956, 383643, -147330, 218540, 442605, 173649, 74641, 185904, -194659, 228036, 126355, 446869, 252161, 262388, 142437, 409219, 347382]
13449C47382E7093J45257H0424K29076A37083n453k3359K22293N6022a66212B46919
13437D50254j4317p75k7170F7993L3149N96091G5835J30557p0011M21004k43089
13426C14296q3041J26212A0880J11344L8144F3504L46312j71476A3238M50184
13416D63422K042A85390a48236D28666j97458J83310a4417A77193K7336H6058
13405A79074J62039J25491A66484n5011J02249J11558j40815a64329A20312K9026
13395A49338L12351A32216K16647f8227F25380G8833L35947l7950B0034K08434
13385B28468j5279J98934p336a1131D26396q2133B9793J71950K23097A87323O8138
13374B55461E9963M54594b01398G5928J3210K68636J12835N5928D198K45842A05813
$$ y = [347382, 57093, 202350, 80424, 309500, 137083, 131630, 108271, 330564, 386586, -166212, 246919, 450254, 435937, 435162, 407992, 67993, 101142, 697233, 75835, 206392, 136381, 557385, 314296, 231255, 357467, 10880, 122224, 160368, 63504, 409816, 238340, 13238, 463422, 465464, 185390, -148236, 428666, 231208, 414518, -14417, 177193, 204529, 86058, 179074, 341113, 466604, 166484, 111473, 213722, 325280, 184465, -164329, 120312, 149338, 461689, 132216, 348863, -68227, 625380, 78833, 414780, 376830, 20034, 228468, 213189, 412123, 404787, -11131, 426396, 344263, 29793, 201743, 424840, 187323, 255461, 59963, 514557, -201398, 75928, 89138, 357774, 470609, 526537, 4198, 250040, 105813]
13362A34755h5424B94044F5439B2693L12234A26917Q353M6037K05663j84652I6705
13350E79492k26877l6506j52878J22483A42427R0382k9606N9093L9828r1355J17648
13339C28417a49520H505K36320A20252C5928L20488F2304K76351A29597J82326
13329C11923J3890j07225L10560I4262p630J14618N5621J53305A30781K32792
13319C63573J1092A22468a11689A78027K54112j71762j06246J23856J46507a12427
13308D55820j54079b5602B08691P9114q7672K53594b4151C87986h4381E83636
13297A6558a41320A35439l3575j1477c90785B69612L6377G6387k3675N6003E1649
13285A56040J93086J75233B56089j19724E0386K36402F6778J13737N9509b30811
$$ y = [134755, -85424, 294044, 65439, 22693, 334927, 126917, 135270, 181307, 386970, 202318, 96705, 579492, 352615, 316109, 163231, 285714, 142427, 232809, 203203, 262296, 302124, 210769, 328417, -149520, 8505, 244825, 120252, 35928, 356416, 62304, 338655, 129597, 311923, 325813, 218588, 529148, 94262, 86632, 201250, 256871, 410176, 130781, 363573, 374665, 122468, -111689, 178027, 432139, 260377, 154131, 277987, 424494, -112427, 455820, 301741, -25602, 208691, 287805, 200133, 453727, -24151, 387986, -84381, 583636, 16558, -141320, 135439, 101864, 90387, -390785, 269612, 305989, 76387, 52712, 108715, 51649, 156040, 349126, 524359, 256089, 136365, 50386, 286788, 66778, 180515, 240024, -230811]
13274C57776E0218O7248J749J54068b77548A3783K48747B3705b34511A26669g1254
13262a76426A0373Q5086m6890L98257I192L82498j36587B5970K9330b6945B64082
13250G3926J52480J31947A45432J12120j08046K83906a14827B59619J21450I3429
13239A26983K72213J46612j64884a13359B1756J78915B1674M39144A96334a25658
13228A43127K4458G8083J63024I351L38947o1149a29852G6211j8991K7224K73890
13217C58334D7877g2971B62384j06644N8225N5564O508a3469B03289B2990K80765
13206C03755C9115J66089I1589J07115h0877B61921l2768h3457C1520M17385c31106
13194a34996F3251B0409h1708B74003m9730Q5140i9554I3961A3355a09573c4627
$$ y = [357776, 50218, 117466, 119215, 273283, -277548, 13783, 262530, 23705, -234511, 126669, -71254, -176426, 10373, 95459, 48569, 446826, 9192, 391690, 255103, 25970, 55300, -26945, 264082, 73926, 226406, 358353, 145432, 257552, 149506, 433412, -114827, 259619, 381069, 93429, 126983, 399196, 545808, 380924, -113359, 21756, 200671, 21674, 460818, 196334, -125658, 143127, 167585, 78083, 241107, 9351, 348298, 287149, -129852, 76211, 57220, 84444, 358334, 47877, -72971, 262384, 155740, 213965, 269529, 276037, -13469, 203289, 22990, 303755, 39115, 205204, 91589, 198704, -80877, 261921, 229153, -83457, 31520, 448905, -331106, -134996, 63251, 20409, -81708, 274003, 224273, 309413, -99554, 93961, 13355, -109573, -34627]
13182i8662A39913f5584I4025M3527i6234B45242j00269D7398J85221a21243C0509
13170b58283G5332f8871B17372L760J51330a19977C96307a4726j43499K1932A31021
13158a48912A35513C6993Q8637M321J36964l8666I8612a0117B72838G0122k1189
13147D8933k138P8077h0942C6898e0153A42431a63282L8175A06315M18873B31202
13135A63204m2295J479B9959K79525a65938D58284A56533b13413H0322f3066A23984
13123B9262R8355c80574E6630J90575F5446Q6577a96920A81113L74324I9579a74382
13111I9527b88321H0115M0422M6207K90818a4114A12233k847n2186K16151O523
13100B79874a78750P5069B16051a1836q4658l8849A66446b68109H6934J4175J03387
$$ y = [-98662, 139913, -65584, 94025, 137552, -96234, 245242, 144973, 47398, 232619, -121243, 30509, -258283, 75332, -68871, 217372, 221132, 372462, -119977, 396307, -14726, -158225, -136293, 131021, -148912, 135513, 36993, 125630, 129951, 266915, 228249, 98612, -10117, 272838, 70122, 48933, 46795, 124872, -80942, 36898, -50153, 142431, -163282, -125107, 106315, 525188, 231202, 163204, 120909, 122388, 29959, 309484, -165938, 458284, 156533, -213413, 80322, -63066, 123984, 29262, 127617, -380574, 56630, 247205, 65446, 152023, -196920, 181113, 555437, 99579, -174382, 99527, -288321, 80115, 120537, 166744, 457562, -14114, 112233, 109386, 57200, 273351, 279874, -178750, -103681, 216051, -11836, -96494, -135343, 166446, -268109, 86934, 101109, 204496]
13089B04496i1173D1665a37657C6109i897C75995M750B7145J3815K608a19398
13077i4806D45960a23983A1567m024b02307A71913g4108B63176a2425A92626p1653
13066A20973J39871j7149J54145A18503a3558C81730j43511K60221A41802F0930
13055A08936K72680b53559A44441B8524J46066a24391A05977a7642A60489a8288
13044B73824g0000p1065c6706j34928g9845j94615B39935r4958k3950J62571j30237
13033A53361o5554J42707C9703J47948J3960K33968b1509A0752L6869J35598R4342
13022B77561O4450g371B36531l9399e1113B31451p8070m8745C145M2498O5091
13011A10734K78647p3836a18557m9111I6417A7567L57891f6436E5432e5889B13779
$$ y = [204496, -91173, 41665, -137657, 36109, -9897, 375995, 380745, 27145, 40960, 43568, -119398, -94806, 445960, -123983, 11567, 7543, -202307, 171913, -74108, 263176, -12425, 192626, 120973, 260844, 243695, 397840, 118503, -13558, 381730, 238219, 498440, 141802, 60930, 108936, 381616, -253559, 144441, 28524, 174590, -124391, 105977, -17642, 160489, -18288, 273824, -70000, -141065, -36706, -171634, -79845, -274460, 239935, 144977, 121027, 283598, 153361, 87807, 230514, 39703, 187651, 201611, 435579, -21509, 10752, 47621, 183219, 277561, 342011, -7371, 236531, 197132, -51113, 231451, 153381, 104636, 3145, 45643, 110734, 389381, 315545, -118557, -167668, 96417, 17567, 375458, -66436, 55432, -55889, 213779]
12999B17795I5160B2225L15730d1621F9513g1702A03662K16910f2092o6867O4253
12988f4706r2064b2976A26224n2650a23464b5634m6460A81782k2821a40555B23898
12976a08179J3392Q706B7472L9216K19832a25915F6214q810J12201R3521B4413
12964B71721c9389B03079G3634d86939A84121H7040R4489f4658A29320l3593J0212
12953A05939J10941e2543A38219J90544a08432c3077A60038L0946J10190D0260
12942B92717A06091a28106A6417M7372L50323A74953C5028a3021E7956J51392
12932B09348m6893i6297k6341b9380H5766K13047a441j83748B85240A04777D0062
12920a29461A71244o1572E4062J24345a62747B61903A5842J99438G0771a30279
$$ y = [217795, 95160, 22225, 337955, -41621, 69513, -71702, 103662, 320572, -62092, -128959, -64706, -156770, -22976, 126224, 73574, -123464, -25634, -72094, 181782, 158961, -140555, 223898, -108179, -94787, -86081, 27472, 66688, 286520, -125915, 66214, 57404, 169605, 263126, 24413, 271721, -39389, 203079, 73634, -486939, 184121, 87040, 181529, -64658, 129320, 95727, 105939, 216880, -52543, 138219, 328763, -108432, -33077, 160038, 190984, 301174, 40260, 292717, 106091, -128106, 16417, 63789, 414112, 174953, 35028, -13021, 57956, 209348, 162455, -96297, -122638, -29380, 85766, 298813, -1441, -185189, 285240, 104777, 40062, -129461, 171244, 109672, 54062, 178407, -162747, 261903, 15842, 215280, 70771, -130279]
12909H3597P0124C523P634P3537b99871e2352B67161b3310j0415A18660k8286
12898I0374J85595i2602j96578a35271j36283a18510G0098b86392A66917c42251
12887A00407L1322i793A65894a78870b3490F0139O6154D15c06064a01076K7448
12876g3628C84939a29004A2448O4440k9597a22279H5958b71019a3607k60928H8330
12864B59581b45572C0701R9094f3543j15802D3115a83248L0024A50604b6680j76862
12853b03542A56716G6660J68959H8490J84566c64103E3799J66230h4548A63886
12842a63658I2077K88620l1152h0283k84052D151b45589H9556J4576d4244C8709
12830a56171C39405r6890B1328a75973G1993B1186R3810J35168g7679A59257J37791
$$ y = [83597, 153721, 3523, 11157, 84694, -299871, -52352, 267161, -23310, -33725, 118660, 90374, 275969, -92602, -289180, -135271, -271554, -118510, 70098, -286392, 166917, -342251, 100407, 131729, -9793, 165894, -178870, -23490, 60139, 126293, 415, -306064, -101076, -73628, 384939, -129004, 12448, 76888, 47291, -122279, 85958, -271019, -13607, -274535, 88330, 259581, -245572, 30701, 129795, -63543, -179345, 43115, -183248, -153224, 150604, -26680, -203542, 156716, 76660, 245619, 88490, 273056, -364103, 53799, 220029, -84548, 163886, -163658, 92077, 380697, 349545, -80283, -364335, 4151, -245589, 89556, 104132, -44244, 38709, -156171, 339405, 242515, 21328, -175973, 71993, 21186, 114996, 250164, -77679, 159257, 297048]
12819B97048b62060A30058a36602D3973a52785l2519g9411j6164k68830a56811
12808H594i4895g41A95892b19121a8746A53903F2682M401J43693a1312A51989
12796a9381A72289a17506H7401M6166d4745j17541l9198E6752Q2043b62664A68552
12784B0038a26843A89544n6358f446I9876D0256J84516r695a42110H6036b9134
12772I1940a96056h4938M1183j15211A78813m9330A8265d7562H548K45008J37900
12761C91456c3666k13986h6527L1991n5040K1366L2292G6102c6359C66004f0641
12749b51654B72152a69712B776J76161o8516J34827C1606a42977M2957H3145l8014
12738D5131R0183d6714B85486L30907B59258A09284J06864p7097b24014A90739
$$ y = [297048, -262060, 130058, -136602, 43973, -152785, -185304, -79411, -95575, -364405, -156811, 8594, -94895, -741, 195892, -219121, -18746, 153903, 62682, 67083, 210776, -11312, 151989, -19381, 172289, -117506, 87401, 133567, -44745, -162286, -201484, 56752, 138795, -262664, 168552, 20038, -126843, 189544, 133186, -6446, 99876, 40256, 224772, 215077, -142110, 86036, -29134, 91940, -196056, -84938, -43755, -158966, 178813, 129483, 18265, -47562, 8548, 253556, 391456, -33666, -247652, -86527, -54536, -109576, -88210, -55918, 76102, -36359, 366004, -60641, -251654, 272152, -169712, 2776, 178937, 110421, 245248, 31606, -142977, -100020, 83145, 45131, 135314, -46714, 285486, 616393, 259258, 109284, 216148, 139051, -224014, 190739]
12727a63065A03784A0080O2414K21666a39306c3144B24910m9488F5549c6686A90125
12715c7654k47492C1888a5027k38126A38538K14198K2664p6811K25059k32063
12705B91585C7069J71390l1811e3054B24998a53097B4021a88867g8444C2051a68927
12693A62720D4940H923g8873G2225f0950E58481b14423k97341i3677o0218m4594
12682a98489B53137a12631B25648r9553a34505I653a34938G0463j7544M33133
12672D86052f107j81328B64479f0346j42854A34387J26852f7044C21298c8873
12661A37481m6011g5736C2475K22748a31915b5111I8557a1101A05573I838f3376
12649e1750B25323g5196A39641K68085j70537b08039h2079j13884A54872k8927
$$ y = [-163065, 103784, 10080, 72494, 294160, -139306, -33144, 224910, 175422, 65549, -36686, 190125, -37654, -285146, 31888, -15027, -253153, 138538, 352736, 375400, 298589, 523648, 291585, 37069, 208459, 176648, -53054, 224998, -153097, 24021, -188867, -78444, 32051, -168927, 162720, 44940, 8923, -78873, 72225, -60950, 558481, -214423, -511764, -93677, -153895, -198489, 253137, -112631, 225648, 126095, -134505, 9653, -134938, 70463, 52919, 486052, -6107, -187435, 264479, -60346, -203200, 134387, 261239, -67044, 321298, -38873, 137481, 91470, -75736, 32475, 255223, -131915, -25111, 98557, -11101, 105573, 9838, -63376, -51750, 225323, -75196, 139641, 407726, 237189, -208039, -82079, -195963, 154872, 125945]
12639A25945J16519E8831K75133r9577C5661Q0812J97420A09230K3268J5068Q4803
12628B32369e8582F1099K71445C623K69200q126Q0399a11800I494L87179B4402
12616B10357b52584a9170k18938A31153e2494A12754K2034m8525L01052a3997
12605a24068H6982R514l4860J0130J30206a11167I7339Q8288J27793N2503j03721
12594B62202P3626H9549J59175a14335B24771a62052H8858c2239j09994A12651
12583A16754D4871P4593Q5097d0369I0160J92457c13892J55912k92022C38448
12572B27755c46846J59663H0048Q918L6766L31336A04766J71045q3943b15367
12561a641j45672L0793L0138o0341A43274B4064a41927A09044g3460a4743A49176
$$ y = [125945, 242464, 58831, 333964, 234387, 35661, 116473, 313893, 109230, 132498, 147566, 232369, -58582, 61099, 332544, 3623, 272823, 264697, 345096, -111800, 9494, 396673, 24402, 210357, -252584, -19170, -238108, 131153, -52494, 112754, 134788, 86263, 387315, -13997, -124068, 86982, 96496, 61636, 71766, 201972, -111167, 97339, 185627, 313420, 365923, 262202, 335828, 89549, 248724, -114335, 224771, -162052, 88858, -32239, -142233, 112651, 116754, 44871, 119464, 204561, -40369, 90160, 282617, -313892, -157980, -450002, 338448, 227755, -346846, -187183, 80048, 88966, 125732, 457068, 104766, 275811, 191868, -215367, -1641, -147313, -116520, -86382, -146723, 143274, 24064, -141927, 109044, -73460, -14743, 149176]
12549F733b5892j96597B61863f0405J2264H0112a23132J1170B6657b28011B40794
12537D5340a4793I1135D4055P8564b11809F5174B2808o010k374a17381b855B78523
12524H755J21234P6946F182J21411F2588Q2527a82352k04454C66295i3973n0787
12513a44760A68120d39717h500A32354a03018l1934C73560a24032A41025F7632
12502B21528a58188e1291o4975H4617K84371g5110j60381c7757B6856J67201a30039
12490e3184D5690g2683A14808b7361j13371I7268c23800B3719N5399c34855i0309
12478c9213j03585D0475R6931P2146j0815a73357C18318f4840m31839a1616k4094
12467c5710a264n8479C33617a27483I2541a3649j88907A08512L9624k4526h8033
$$ y = [6733, -25892, -222489, 261863, -60405, -48141, 80112, -123132, -111962, 26657, -228011, 240794, 45340, -14793, 91135, 44055, 122619, -211809, 65174, 22808, 16798, 14424, -117381, -2855, 278523, 8755, 129989, 206935, 6182, 127593, 62588, 145115, -182352, -386806, 366295, -93973, -144760, 168120, -439717, -8500, 132354, -103018, -134952, 373560, -124032, 141025, 67632, 221528, -158188, -51291, -116266, 84617, 368988, -75110, -235491, -37757, 26856, 194057, -130039, -53184, 45690, -72683, 114808, -27361, -140732, 97268, -323800, 23719, 79118, -334855, -90309, -39213, -142798, 40475, 137406, 209552, 198737, -173357, 318318, -64840, -496679, -11616, -35710, -1264, -59743, 333617, -127483, 92541, -13649, -202556, 108512, 148136, 123610, -88033]
12455A81860H4564f3588k32073O1283B8717g279l82915a49348e6960k22734b6352
12443B82767a21173C01043c8913A33354a89863j67686J57947H3005J0871q056
12433H5820M5205b59253J6716d7031J0908j14532B88135j27498c9116m3311B51327
12421b9250j65034D9674a4347A06688a06664B20008I6936J40176a88441B12162
12410b91167a21874k38321D20481b01563F6204Q4079a2465A7629a73336C87889
12399a75337c8134k4083a8748A09199A760b63160A18486a90496f546B66938p1410
12388A95528F8668b06066q4728k7075J01688A58301L9203J41258f9219B00282
12377a06159A43417D7068a75175Q0367B4941f2377J2821l19642B43392n8321i6801
$$ y = [181860, 84564, -63588, -295661, -234378, 28717, -7279, -390194, -149348, -56960, -279694, -26352, 282767, -121173, 301043, -38913, 133354, -189863, -357549, -199602, 83005, 93876, 85820, 131025, -259253, -242537, -47031, -36123, -150655, 288135, 160637, -39116, -82427, 251327, -29250, -194284, 49674, -14347, 106688, -106664, 220008, 96936, 237112, -188441, 212162, -291167, -121874, -360195, 420481, -201563, 66204, 150283, -12465, 17629, -173336, 387889, -175337, -38134, -62217, -18748, 109199, 1760, -263160, 118486, -190496, -6546, 266938, 195528, 68668, -206066, -290794, -317869, -216181, 158301, 197504, 338762, -69219, 200282, -106159, 143417, 47068, -175175, -94808, 24941, -62377, -49556, -369198, 243392, 185071, -96801]
12365A96439c58510i9806j70136n5638D3683K1772a68846B08868b5258D4583K32453
12354B77036I804J32862g7189a1726j90392c4724p4786A24384b15586A93618O1897
12343B55515o4175J14328H5434K0765b92736f3417r3833j14602c2451A1717b25333
12331a35999O3790p4874c4109o9559m1343A04849k2353l7332K1669J24778O513
12320A98124q9706Q6519A7711a81933H8697h3133B11090m3759o9588a58340j03212
12309b61552f7709o2306B99685c4334B21911f7929A79531a81014C44785b01903
12298a37968k7548l21332a42407j51493e0077K3987G7254A8918a12323I1043e04244
12286A19827K3412b8440A68042a7175C16279h4141A83667R3119l3944G3605K11357
$$ y = [196439, -358510, -99806, -269942, -325580, 43683, 65455, -168846, 208868, -25258, 44583, 277036, 9804, 142666, -77189, -11726, -202118, -34724, -109510, 124384, -215586, 193618, 255515, 191340, 305668, 85434, 106199, -292736, -63417, -157250, -271852, -32451, 11717, -225333, -135999, -72209, -147083, -34109, -103668, -145011, 104849, 82496, 45164, 66833, 191611, 198124, 108418, 194937, 17711, -181933, 88697, -83133, 211090, 167331, 97743, -158340, -261552, -67709, -130015, 299685, -34334, 221911, -67929, 179531, -181014, 344785, -201903, -137968, -165516, -486848, -142407, -293900, -50077, -26090, 77254, 18918, -112323, 91043, -504244, 119827, 143239, -28440, 168042, -17175, 316279, -84141, 183667, 276786, 242842, 73605, 284962]
12275B84962f2686D13203K2955A83931C9250K72560M5953l9277O5866j90218M5390
12264B39524c3516A19721J4923O9436a28515I9209J86196i1383C52762a96119
12253C78954A0346J18879a12920D13101E2822h3835B56332Q1644c4853H3693A8537
12241d7986a3924A83933B0054K14461a0814A20937J02146m4932J47865b1252e884
12229a5898A57465C6590K34954F168L77037F6572L37656A8125M4594L07066A12567
12217A54546m9989C5811L59951o3945G6421K18537F8066M1319n3564K86084g0473
12205E9872d135B86133H2979a62789p72A33884K95085D7436J23568p0960J07534
12194B07578l1770J27920a21066B55720b227E8961N158J41820a2505A8868J33065
$$ y = [284962, -62686, 413203, 436158, 183931, 39250, 311810, 357763, 318486, 384352, 194134, 239524, -33516, 119721, 134644, 204080, -128515, 99209, 285405, -91383, 352762, -196119, 378954, 10346, 129225, -112920, 413101, 52822, -83835, 256332, 337976, -34853, 83693, 18537, -47986, -13924, 183933, 20054, 234515, -10814, 120937, 223083, 178151, 326016, -21252, -5884, -15898, 157465, 36590, 271544, 6168, 383205, 66572, 404228, 18125, 62719, 369785, 112567, 154546, 104557, 35811, 395762, 331817, 76421, 294958, 68066, 109385, 55821, 341905, -70473, 59872, -4135, 286133, 82979, -162789, -163561, 133884, 428969, 47436, 171004, 100044, 207578, 175808, 303728, -121066, 255720, -2227, 58961, 64119, 205939, -12505, 18868, 151933]
12183A51933K8563d5084C64205D3555J199K71438a68118I2052J16357E3993a18500
12171D3727j5255h843A44537N0970n1796a25945A86955N5216O7286f6202C08207
12159a11900C85944A52124a12303A68750e0830q143I9806b1281m2525B63961b51890
12147B5462M64283g0318j02935G0598J90991r8870e3572r0203L4865F4268b8166
12135g3330m1574A839J61509K9244e9791k3391L6177k57352A07336a92041B30020
12123C31654I8156B7874M6230a62013B3887J62728a90543B86334A13174b46227
12112A10145a82617k31895M2984B524Q5449c82989C40352b56639E7425a96704
12101b16153a7813A8913b91089F4949L09272a19465d2182o9149b1228A86570I0022
$$ y = [151933, 180496, -45084, 364205, 43555, 44754, 316192, -168118, 92052, 208409, 53993, -118500, 43727, 28472, -8843, 144537, 195507, 143711, -125945, 186955, 242171, 309457, -66202, 308207, -111900, 385944, 152124, -112303, 168750, -50830, -58973, 99806, -21281, -63806, 263961, -251890, 25462, 489745, -70318, -173253, 70598, 261589, 162719, -53572, -143775, -108910, 64268, -28166, -73330, -114904, 1839, 163348, 192592, -59791, -83182, -47005, -304357, 107336, -192041, 230020, 331654, 98156, 27874, 74104, -162013, 23887, 186615, -190543, 286334, 113174, -246227, 110145, -182617, -414512, -371528, 2524, 87973, -382989, 340352, -256639, 57425, -196704, -216153, -17813, 18913, -291089, 64949, 374221, -119465, -42182, -111331, -21228, 186570, 90022]
12089E3782e2031j51277g8184B7788J94490C115J15842b69966N9461B1569L569
12078B5138K0440i830o6446G14590k86893J53643M70490M09044o38785C75618
12067e6225k46447D76139j97551A12715a45468B37806q8495m2166b76138j0668
12057b86806h9787L7902j4062E2980L945b991p9287k610G5007d731p9952n7550
12045a42233K9487j14470I5120a86159O4390C04441h0365C18969j20968a55887
12034A14396a27107H5123j36a37996O1015m1869A19681K1965F572d8617B8505
12022a61708O2600A68617e5983C4145J55706I4116h0778A23848d682j36900k3245
12011a64827M1817C07260g441k66254B72091o6042C6947H639f8326C52643B6209
$$ y = [53782, -52031, -203308, -78184, 27788, 222278, 3115, 118957, -269966, -210505, 21569, 25138, 45578, -9830, -76276, 714590, 427697, 581340, 1051830, 1460874, 822089, 375618, -56225, -302672, 476139, 278588, 112715, -145468, 237806, 149311, 107145, -276138, -286806, -89787, -51885, -65947, 52980, 56925, -2991, -82278, -84888, 75007, -4731, -84683, -142233, -112746, -227216, 95120, -186159, -121769, 304441, -80365, 318969, 198001, -155887, 114396, -127107, 85123, 84987, -137996, -76981, -118850, 119681, 141646, 6572, -48617, 28505, -161708, -99108, 168617, -55983, 34145, 189851, 94116, -80778, 123848, -4682, -141582, -164827, -123010, 307260, -7441, -273695, 272091, 206049, 36947, 8639, -68326, 352643, 26209]
11999B94115a40116H3355j0270K2474C2270a20225p5932A92816c33647a03736
11988B82964a03001A12857a881M19p8892C7753L1269a06334m4502B52385g611
11976a93602j05679j25656A3356c82887a05199A4182K54136J41833A31319a10871
11965F4930a41333j5902o3100k19301d4839F0826c555j33152F1513i798K965A04879
11952a93182D26980A64994h1769k01586F4359R9394l1875f5052B19802E4236K01843
11941B56079a4803l3829C1450L05728e1460k36716G0685L3595B3196a72406M1562
11930a30844B63579f0263A72316b9185I1986b14439a01451F4149a17302o3424
11920a80726a5788j32794r8950F4390a95197C192K8939J37073c8679j33758A09271
$$ y = [294115, -140116, 83355, 73085, 95559, 32270, -120225, -196157, 192816, -333647, -103736, 282964, -103001, 112857, -1881, -1462, -80354, 37753, 69022, -106334, -150836, 252385, -7611, -193602, -299281, -424937, 13356, -382887, -105199, 14182, 268318, 410151, 131319, -110871, 64930, -141333, -157235, -220335, -439636, -44839, 60826, -3555, -136707, 61513, -9798, -6833, 104879, -193182, 426980, 164994, -81769, -283355, 64359, 163753, 131878, -65052, 219802, 54236, 256079, -14803, -48632, 31450, 337178, -51460, -288176, 70685, 104280, 23196, -172406, -130844, 263579, -60263, 172316, -29185, 91986, -214439, -101451, 64149, -117302, -180726, -15788, -148582, -247532, 64390, -195197, 3192, 32131, 169204, -38679, -172437, 109271]
11908b21698b6494n44199b3865A9256c33406a6002A34407d0851r985A3249a58470
11896G523b54098h6143m7219K9207B00665A5708J92342M3951L7175D8945J89820
11885B38765d67051b5292n6846A86297a41016f4202A15244c15089b2904F2538
11874C9638F994a95361h1831b4584l0852k31072B14206f255D1494A1996K1361
11863C3357J93037f6866o7455H946c64156A70461j522b54538f3610C61743A59050
11851C1428c9553A47946h433D4590b78747a23641E7564a89748A84419b52588A25203
11839G6655b03313A84052J0233o9297K21798a53836j47362A45676b40357E9953
11828a88550l0255I5562e1003A45939O5429D7164h7014A23963a74021e0614A10196
$$ y = [-221698, -26494, -570693, -23865, 19256, -333406, -16002, 134407, -40851, -50836, 13249, -158470, 7523, -254098, -86143, -133362, -104155, 200665, 15708, 208050, 252001, 289176, 48945, 238765, -467051, -25292, -82138, 186297, -141016, -64202, 115244, -315089, -22904, 62538, 39638, 6994, -195361, -81831, -24584, -55436, -286508, 214206, -6255, 41494, 11996, 33357, 226394, -66866, -134321, 8946, -364156, 170461, 168939, -254538, -63610, 361743, 159050, 31428, -39553, 147946, -8433, 44590, -278747, -123641, 57564, -189748, 184419, -252588, 125203, 76655, -203313, 184052, 194285, 124988, 346786, -153836, -301198, 145676, -240357, 59953, -188550, -218805, 95562, -51003, 145939, 211368, 47164, -87014, 123963, -174021, -50614, 110196]
11816b36687H594b07323m6078c4118A75365i0639A2998b36061R8941d1994B7318
11804a83984M5977d4979h428k13403j82559J59614H9494f6151D04731A129f1367
11792B4776b74002R5553C4275K32097b2368B50220i7760B40999a68661G3162a80330
11780a47666p5852c9720A15732c04747H4746c0617a2572l583A58873e5501H6205
11768b05113P1324o2337P9617b9561d423r8665l29946C1485J33646l1662A1260
11756h8794B5257b3843j28221B03787O7734A00616a33327N7493j94612A55090
11745c32345g6056j87502B2247J92293e7420B03580o4175A0030R3697b06060N5820
11734a50240B04718g5905C83247A49526a02851j59092E5707a27242k8896G332
$$ y = [-236687, 8594, -207323, -253401, -34118, 175365, -90639, 12998, -236061, -137120, -41994, 27318, -183984, -138007, -44979, -8428, -221831, -404390, -244776, 89494, -66151, 404731, 1129, -61367, 24776, -274002, -178449, 34275, 266372, -22368, 250220, -97760, 240999, -168661, 73162, -180330, -147666, -223518, -39720, 115732, -304747, 84746, -30617, -12572, -16155, 158873, -55501, 86205, -205113, -133789, -196126, -116509, -29561, -4423, -103088, -433034, 31485, 165131, 133469, 11260, -88794, 25257, -23843, -152064, 203787, 271521, 100616, -133327, -75834, -270446, 155090, -332345, -76056, -263558, 22247, 214540, -57420, 203580, 139405, 10030, 103727, -206060, -150240, 204718, -75905, 383247, 149526, -102851, -261943, 55707, -127242, -156138, 7332]
11723a77083j49207a04943L6285b9167n1026B80348A10331J48570a45830D76785
11712A52995h9891B76923p8342D2475J98676j5713a68360D99771G5944j1292G459
11700i485A30831M862e02H6055J7785B7483O6025J12453D5365c2983C463K23065
11688B26528r7991L6969b01002D5538i2560k8393e384j48613M0723e3224I893
11676A6122b2910E3386K12982b61391L9601j8557J10702C2073K33902b48573N7380
11665a91193A43933J60881o0174P7958G8165M8560b50111A31967C3103a90254
11654B88392a18233o4717A46198C8831L8419l7769c84511g3831G5495c7153B44341
11642b0747E1477p512R7908k1823a77217A54427M9003a60907Q0192b0648k01381
$$ y = [-177083, -326290, -104943, -68658, -29167, -80193, 280348, 110331, 258901, -145830, 476785, 152995, -89891, 276923, 198581, 42475, 241151, 225438, -168360, 499771, 75944, 64652, 7459, -9485, 130831, 135693, -502, 86055, 103840, 27483, 93508, 205961, 45365, -32983, 3463, 226528, 128537, 165506, -201002, 45538, -92560, -120953, -5384, -153997, -113274, -53224, 9893, 16122, -22910, 53386, 266368, -261391, -221790, -240347, -129645, 32073, 265975, -248573, -191193, 143933, 304814, 244640, 322598, 78165, 126725, -250111, 131967, 33103, -190254, 288392, -118233, -182950, 146198, 38831, 77250, 39481, -384511, -73831, 75495, -37153, 244341, -20747, 51477, 43965, 141873, 120050, -177217, 154427, 203430, -160907, -80715, -20648, -222029]
11631b22029C53869A48259l2652o911b41556B38178R2633A35679f1098B64647
11620B09230b19061i4234l83102a31659M3146a9369B9616a17332F7484N928b71243
11608A25582J31917c89045a76865Q4793C0399a24322b674l2537a6636j12670F4537
11596A56853J28537o226a9154G4602Q5052f0194a0223F1270i0187A89975a29278
11584g1515A2507d7085p5013b7883j69812g0835E5803a08767k7534A80869j8427
11573A62442E5405J39610b2512B74370b2453l1449k25791b3382A05781J52543
11563B58324A2197i8958C16754A37965J43285a18264A74166a5493A97976J45011
11553C42987A50222c26912D1785a7133r7642j924I086J07217l9239e6559A26560
$$ y = [-222029, 353869, 148259, 115607, 108696, -241556, 238178, 330811, 135679, -61098, 264647, 209230, -219061, -94234, -477336, -131659, -88513, -19369, 29616, -117332, 67484, 73412, -271243, 125582, 257499, -389045, -176865, -92072, 30399, -124322, -2674, -35211, -16636, -129306, 64537, 156853, 285390, 279164, -19154, 74602, 159654, -60194, -10223, 61270, -90187, 189975, -129278, -71515, 12507, -47085, -122098, -27883, -197695, -70835, 55803, -108767, -136301, 180869, 162442, 55405, 195015, -22512, 274370, -22453, -53902, -279693, -23382, 105781, 258324, 12197, -98958, 316754, 137965, 281250, -118264, 174166, -15493, 197976, 342987, 150222, -326912, 41785, -17133, -114775, -116699, 9086, 116303, 77064, -56559, 126560]
11541a02193k6915A90074a0769A61298e121C45733E0630J78462D3562O7715a8678
11529B71150a40373A68194F3998b70038G9872b23433A11338K10457a76971e6581
11518A05714l6073J48095J23254A31576j3125a12268B73693d7386B43700a0025
11507E17106B03815j6111b13792H4587b40600A74296p9754O867K5035b72846a36065
11495c3747E07243k38965a87862E0534K060L7989R9907k995p1747R2731D558J4517
11483A9075b6716A82998a6984B00814J47817H2582K45303a7596G2218a24003A96518
11471d4764B84395e4012B52541l4958a7692A59452E7736L76514A93283N5649a38041
11459H3659a49345F3578J38955n4195J90730H5136J52006J40067a97779G4643
$$ y = [-102193, -129108, 190074, -10769, 161298, -5121, 345733, 50630, 229092, 43562, 111277, -18678, 271150, -140373, 168194, 63998, -270038, 79872, -223433, 111338, 321795, -176971, -56581, 105714, 69641, 217736, 340990, 131576, 118451, -112268, 273693, -47386, 243700, -10025, 517106, 203815, 187704, -213792, 84587, -240600, 174296, 94542, 101409, 126444, -272846, -136065, -33747, 507243, 268278, -187862, 50534, 52594, 90583, 190490, 187495, 115748, 208479, 4558, 19075, -26716, 182998, -16984, 200814, 348631, 82582, 327885, -17596, 72218, -124003, 196518, -44764, 284395, -54012, 252541, 217583, -17692, 159452, 57736, 434250, 193283, 248932, -138041, 83659, -149345, 63578, 202533, 148338, 339068, 85136, 237142, 377209, -197779, 74643]
11448A12085J33194n2857G4338a52400A24464h3640B35254H9643N3164m0643e6910
11436B27538a60299B9788J28664a24140j3289m5697r3770I7675j6318K38618a70357
11424D6865b22205A27121i9574l5094b1649B09682d46457A46462J97912A61559
11413A97428A1388M9146h3243A87482R1805a79448k3163j51393F5080J76603p9840
11402A61843b71568B18243d28999a20246A38763a90422G3553f5821j51992c1375
11391A83122b4861m74951A67656b32498h8487D6434i4929d5248n7893C69901a17001
11379a13280D01048b01245F4135K27645a21898j8028b5726B58235J06935n0982
11369C14188i2115A57523c11038A77044j4036a42558j6506n1827B37238a59553
$$ y = [112085, 245279, 192422, 74338, -152400, 124464, -83640, 235254, 89643, 142807, 102164, -56910, 227538, -160299, 29788, 158452, -124140, -137429, -183126, -276896, 97675, 81357, 319975, -170357, 46865, -222205, 127121, -99574, -134668, -21649, 209682, -446457, 146462, 344374, 161559, 197428, 11388, 60534, -83243, 187482, 279287, -179448, -202611, -354004, 65080, 241683, 161843, -271568, 218243, -428999, -120246, 138763, -190422, 73553, -65821, -217813, -31375, 183122, -24861, -499812, 167656, -232498, -88487, 46434, -94929, -45248, -103141, 369901, -117001, -113280, 401048, -201245, 64135, 291780, -121898, -139926, -25726, 258235, 365170, 314188, -92115, 157523, -311038, 177044, 163008, -142558, -159064, -210891, 237238, -159553]
11358f8864q0843k9306B7814J39602a6395A29923a34358j33156j14323a90041
11347A52401K85745f7798M036A22756a21208A99395E3197J66856h8358B17451
11336a09229B639c19348G3322G410l392L8714a77003B19029a47089O251C3973
11324b31965O722J03865D0944J36000M0692n4271D5143a55115o7595H6504B0546
11312a99065e6596q5908N6698r4327e8603G588J55354c58524a63982J9110j17822
11301b62694k1547R8243k11196B14415c18679G6131J64347i139j64981n2680L6926
11290a89874l7251a6658k37978p9389a27872A35474O8882b83167R8275J4611A66626
11278B14939c23178a05859A52623B3990R9351B9347a21006F1279b43633l2043
$$ y = [-68864, -149707, -179013, 27814, 167416, -16395, 129923, -134358, -267514, -381837, -190041, 152401, 438146, -67798, -63762, 122756, -121208, 199395, 53197, 220053, -88358, 217451, -109229, 2639, -319348, 73322, 7410, 4018, 42732, -177003, 219029, -147089, -140838, 33973, -231965, -225243, -121378, 40944, 176944, 217636, 163365, 45143, -155115, -222710, 86504, 20546, -199065, -56596, -142504, -85806, -180133, -58603, 7588, 162942, -358524, -163982, -144872, -262694, -284241, -185998, -397194, 214415, -318679, 76131, 240478, -9139, -174120, -226800, -189874, -227125, -16658, -254636, -334025, -127872, 135474, 204356, -283167, -184892, -170281, 166626, 214939, -323178, -105859, 152623, 23990, 123341, 29347, -121006, 61279, -243633, -275676]
11268b75676B18224l7351C902J74515m401a47776L5866A19352a60807m9586C32597
11256i5091F8186a48463j1271j36136h6649A95944R1143b9754r4923A47848e0532
11244a32137m9815A87996L2079A02587o298K26216A45302b98752H6475c12520
11233a74037B05112p3430d8040o2052k08134a06825K0619B32730h2046A40834
11222a83550A96303b04838A50101G14h412I0332b14898D0480a62237a300j79664
11211a80964C12425I1930R3622C1914i4043k79965B55826a10618B77652I7796
11200F0405L85785d32873a72141C83494H6810b13950n453r1276G6193d61154a10712
11188e091C23807b09207C9953h7454j14344B77093g5863j10063e3093j48643B1320
$$ y = [-275676, 218224, 180873, 3902, 178417, 174016, -147776, -111910, 119352, -160807, -210393, 332597, -95091, 68186, -148463, -159734, -295870, -86649, 195944, 287087, -29754, -124677, 147848, -50532, -132137, -181952, 187996, 220075, 102587, 96289, 322505, 145302, -298752, 86475, -312520, -174037, 205112, 131682, -48040, -110092, -318226, -106825, -86206, 232730, -82046, 140834, -183550, 196303, -204838, 150101, 714, -8412, 90332, -214898, 40480, -162237, -1300, -180964, 312425, 91930, 185552, 31914, -94043, -374008, 255826, -110618, 277652, 97796, 60405, 446190, -432873, -172141, 383494, 86810, -213950, -219403, -310679, 76193, -461154, -110712, -5091, 323807, -209207, 39953, -87454, -201798, 277093, -75863, -185926, -53093, -201736, 21320]
11176b7546e807G371g6494K217C4656a25067l8016L7837d7767j35305H8011e3869
11163c74677G7910F301N1884a58797A20802a21862d8450B02716a17673A5769d45078
11151G1872a98858A01136k2338a52815K6835A2945a96392j01194F6772a55268
11140C092Q5598K79224G6082A1138K25793H5593J23362K4578g2016B56349o8073
11129A88276I2532J32062c7547F3528b46272P2929A3640P603b76060H6655R1601
11118A78256a41311A89420K7467a60018B20692G4679p798g5528n4900B46486r0418
11107A56068k9865J85323A36711J00637q7887c4300D52519A08725a3709E73221
11096A60791c3936C27522L0716F4141J3655K05426K1683A19568J92434j53750
$$ y = [-27546, -5807, 7371, -76494, -74277, 34656, -125067, -163083, -125246, -47767, -183072, 88011, -53869, -374677, 77910, 6301, 58185, -158797, 120802, -121862, -48450, 202716, -117673, 15769, -445078, 71872, -198858, 101136, 78798, -152815, -125980, 12945, -196392, -297586, 66772, -155268, 3092, 88690, 367914, 76082, 11138, 236931, 85593, 208955, 233533, -72016, 256349, 188276, 92532, 224594, -37547, 63528, -246272, -173343, 13640, 21243, -276060, 86655, 178256, -141311, 189420, 216887, -160018, 220692, 74679, 66881, -75528, -130428, 246486, 156068, 126203, 311526, 136711, 237348, 149461, -34300, 452519, 108725, -13709, 573221, 160791, -33936, 327522, 358238, 64141, 77796, 283222, 304905, 119568, 312002, 158252]
11086A58252a62967A81932C9700J95693J60551j18648K80284A46638J11554N0592
11076C08784A9432L50840j17569A19055J96091J79678R9925A47454J39566K06500
11066D93520K6437H0568L45583J19132L06501C14569K00172J63139j46034j17663
11056D14183K56551o285J46132j40664J25422k03503L20883J344j27803J15481
11046I01741q4370C60975M68422K6612j36064j05277K35113K6230j44131K34026
11036I65906K73971m91560l2105k27403L4248K90358L4932k82532N5283N036M12658
11025A038792L1939m31687J98062k08510J73449j24404K61245j66052k12195K98441
11015H59080k15744B92169r1138M18827J76591j95085K19746m05701M56852j99213
$$ y = [158252, -162967, 181932, 39700, 235393, 395944, 277296, 557580, 146638, 258192, 308784, 19432, 370272, 252703, 119055, 315146, 494824, 594749, 147454, 287020, 493520, 519957, 80568, 426151, 545283, 851784, 314569, 514741, 677880, 531846, 414183, 670734, 664449, 810581, 669917, 795339, 591836, 912719, 914063, 786260, 901741, 817371, 360975, 829397, 856009, 719945, 614668, 849781, 876011, 731880, 965906, 1239877, 748317, 716212, 488809, 523057, 813415, 848347, 565815, 621098, 626134, 1038792, 1070731, 639044, 837106, 628596, 802045, 677641, 938886, 772834, 560639, 859080, 643336, 292169, 201031, 619858, 796449, 601364, 821110, 415409, 872261, 673048]
11005F73048k97713N85197m1518m57610K02050N5859J37105j44047r7795j30175
10995D84401J34703O6311k20479L73936k60883n2506L2703L65887p3380j03802
10985G46891M12217o2122k7851J65487J1636K36708L6355J98422J4801L71101
10975B103645L9713L44422N46238l75188K36680k93142K17748l46040k39216k48787
10965A986073l41349J57839j68032k19936M78543k63455M02380J57803m80062
10956A709804K32351n3066k16326m1794j39054o94635J96184O7726m97989K49886
10946H13087C86764k3673J85465o139A58177J05345j27320J86479F3973b30947
10935C58325o4130q9469N8147i6801A99193g3751b3963r6696A17478J21249g9521
$$ y = [673048, 375335, 960532, 919014, 461404, 663454, 719313, 856418, 712371, 614576, 484401, 619104, 685415, 464936, 838872, 577989, 525483, 558186, 924073, 850693, 746891, 1159108, 1096986, 1069135, 1234622, 1246258, 1482966, 1519321, 1717743, 1732544, 2103645, 2143358, 2487780, 3034018, 2658830, 2895510, 2602368, 2820116, 2474076, 2234860, 1986073, 1644724, 1802563, 1634531, 1414595, 1893138, 1629683, 2032063, 2189866, 1709804, 1942155, 1889089, 1672763, 1630969, 1491915, 797280, 993464, 1061190, 563201, 813087, 386764, 363091, 548556, 542417, 158177, 263522, 136202, 322681, 63973, -230947, 358325, 294195, 204726, 262873, -96801, 199193, -73751, -23963, -120659, 117478, 238727, -79521]
10923A1964N2658A4967K7593J0705J01128c9799A44340K03153H1930O0115l604
10912A38441B1463J77123q0183m5304A275i497I2741i0871C64012F0491L32827
10901C93318j24771a02535j06696D6265a76536I464L5225J99567r8742p966K26987
10890C64535b1660A40802a6531A00146B6870R8585A4797O3016a47442G7195J75106
10879B52301q8266G0526a1522A94842I6822R1449a04813j6932A68985c0347A2908
10867A24469j4499k5126c70616A2258J06803a90316g6965E0394e0760k2279A16272
10855d7218J3530I2391d7893b2811C3128a71474M2648l13959a44757c30m78k658
10843c466k7114r0222j53627A62459J31877b67590m8458d0592o3986q1385K6092
$$ y = [11964, 64622, 14967, 42560, 53265, 154393, -39799, 144340, 347493, 81930, 142045, 138441, 21463, 198586, 118403, 73099, 1275, -9497, 92741, -90871, 364012, 60491, 393318, 268547, -102535, -209231, 46265, -176536, 9464, 44689, 244256, 145514, 137548, 364535, -21660, 140802, -16531, 100146, 26870, 125455, 14797, 77813, -147442, 77195, 252301, 164035, 70526, -11522, 194842, 96822, 188271, -104813, -121745, 168985, -30347, 12908, 124469, 109970, 84844, -370616, 12258, 119061, -190316, -76965, 50394, -50760, -73039, 116272, -47218, -33688, 92391, -47893, -22811, 33128, -171474, -128826, -442785, -144757, -330, -808, -3466, -30580, -120802, -274429, 162459, 294336, -267590, -316048, -40592, -104578, -185963, -159871]
10832a59871N4656n3710A17630f1631A1844P1824A4892a70685A76525E9852a88919
10820G3551C4109a68483D7693a29762A19050a34952B07215c99572a92636e947
10809i3769n9469B29990d4482B489a95851h2376l02924f7962E0471a96127o6576
10798b62703J04496B00431h1601o7777B12229G4524O0000c53162C1471b21810
10787B47251e9450h974E8641Q643L0776a75404B3742a19033l735K4168B29729
10775b95538D0901R6809a01785G7085a66149C5946K04812a65872l10742K18839
10765b57775A78077C6760K32358i3879b8379j25708M9236A80579g9729L4303A24037
10753B28610g5557l7460A17689c10203A9076J79653a7437I9746B0603b2407n2177
$$ y = [-159871, -105215, -158925, 117630, -61631, 11844, 83668, 14892, -170685, 176525, 59852, -188919, 73551, 34109, -168483, 47693, -129762, 119050, -134952, 207215, -399572, -192636, -5947, -93769, -153238, 229990, -44482, 2489, -195851, -82376, -385300, -67962, 50471, -196127, -262703, -158207, 200431, -81601, -149378, 212229, 74524, 134524, -353162, 31471, -221810, 247251, -59450, -8974, 58641, 67284, 98060, -175404, 23742, -119033, -122768, -98600, 229729, -295538, 40901, 137710, -101785, 77085, -166149, 35946, 240758, -165872, -476614, -257775, 178077, 36760, 269118, -93879, -28379, -154087, -104851, 180579, -79729, -45426, 124037, 228610, -75557, -113017, 117689, -310203, 19076, 198729, -17437, 99746, 20603, -22407, -74584]
10742g4584C1563a44345I5461c4190p5416q4359B62904I2461a19213j77904a2686
10730a01569j60828B11755o6220c0726G5168d7513r9749k9071k15001a16650B11493
10718C02731P626D8117b77622B11003b42892F0351N4444J81232B8400R2732f6842
10706C6553d93253A60322i4025E9645b287A01359J12669a53885E6981R1921a83378
10694B11490K04916e69721F9969e9667k23494p6197A08944b308l02604A83836
10683b4851F1085B9983b4247F3325J29918b41677E3883b83368A918a90686a4967
10671B49588A15367d8953F8199J74644F5372J45869c59976a68226d0294j20571
10661a60865d8528B19030b56586L9992a08013j48701Q0779Q6307M4085D9479c95116
$$ y = [-74584, 31563, -144345, 95461, -34190, -109606, -193965, 262904, 92461, -119213, -297117, -12686, -101569, -262397, 211755, 145535, -30726, 75168, -47513, -147262, -176333, -391334, -116650, 211493, 302731, 310357, 48117, -277622, 211003, -242892, 60351, 114795, 296027, 28400, 121132, -66842, 36553, -493253, 160322, -94025, 59645, -2287, 101359, 214028, -153885, 56981, 148902, -183378, 211490, 416406, -569721, 69969, -59667, -283161, -359358, 108944, -2308, -304912, 183836, -24851, 61085, 29983, -24247, 63325, 193243, -241677, 53883, -283368, 1918, -190686, -14967, 249588, 115367, -48953, 68199, 242843, 65372, 211241, -359976, -168226, -40294, -160865, -48528, 219030, -256586, -216594, -108013, -256714, -175935, -89628, -45543, 49479, -395116]
10649a37502J415C8906J23202g081A27848a39750B17407a31395p0106R7801A37169
10637e07376b35105J2658o9225j39584C7871b04047k00990a25790a4362m9135
10627f3497k15163A69422b53908a7793j21313r2911E2105d22983B33658J2209
10617B45867a5018k9268n6481F953J77790F2528j8973L382O6167f0162A66231
10605C8067J30846c7279C0770E428a1710j29011O8473a5625k93253b8173A13425
10593a60481J8492b8529l10571A08822m9695a98830N5906m6654K4512C43182a45192
10581g9297A0046h5793F1814d11977a70593l20277G360a67840j0479c0534l12616
10570c43150h1156c8590k13348A69308b23520a06363B18849c03303J35893Q858
$$ y = [-137502, -136087, 38906, 162108, -7081, 127848, -139750, 217407, -131395, -201501, -103700, 137169, -507376, -235105, -222447, -291672, -431256, 37871, -204047, -405037, -125790, -14362, -63497, -278660, 169422, -253908, -17793, -139106, -232017, 52105, -422983, 233658, 245867, -15018, -44286, -100767, 6953, 184743, 62528, 43555, 46937, 113104, -60162, 166231, 38067, 168913, -37279, 30770, 5428, -11710, -140721, -72248, -15625, -308878, -28173, 113425, -160481, -141989, -28529, -339100, 108822, 59127, -198830, -142924, -189578, -165066, 343182, -145192, -79297, 10046, -85793, 61814, -411977, -170593, -490870, 7360, -167840, -178319, -30534, -343150, -81156, -38590, -251938, 169308, -223520, -106363, 218849, -303303, -167410, -158552]
10560a58552b4621Q832A29674i8320c9766B83359a59639A42272i3335A07238d5080
10548a76077C5423A5136J91519i5657C17032A02869a09954c4797C7092j8086b0950
10536G5807g0356A28388a87785j38072b9826j14848g792H9439L34925a06880c9328
10524h7962p5515B56029E4660J12580d4319n0553j84886i5891I7903K37482b9126
10512a19777A23676a70505c0597G4060a33185b6363B35177c07459A5225i5518
10501A37304a49820N1161A07776a14891r8787n97442b24622G0181a72963D91569
10490c0685Q035C59555d9676o9983C46006A37638M93N39393J23281Q4799l72369
10479E13235A54564Q1070R9610A10404f6949P434j04128g9044r1459g2682I5274
$$ y = [-158552, -24621, -15789, 129674, -98320, -39766, 283359, -159639, 142272, -93335, 107238, -45080, -176077, 35423, 15136, 206655, -95657, 317032, 102869, -109954, -34797, 37092, 19006, -20950, 75807, -70356, 128388, -187785, -325857, -29826, -144674, -7792, 89439, 424364, -106880, -39328, -87962, -163477, 256029, 54660, 167240, -44319, -94872, -279758, -95891, 97903, 335385, -29126, -119777, 123676, -170505, -30597, 74060, -133185, -26363, 235177, -307459, 15225, -95518, 137304, -149820, -98659, 107776, -114891, -213678, -811120, -224622, 70181, -172963, 491569, -30685, -22650, 359555, -49676, -119659, 346006, 137638, 138131, 677524, 800805, 885604, 513235, 154564, 235634, 335244, 110404, -66949, -59515, -163643, -79044, -170503, -72682, 95274]
10467A9910J33443e5813j9300B7404J87873b33462B64227E5027h2944j89201b3626
10455A1310K08381a21868A62723a41612b5719j71755O5547f2370B43272c13132
10444B35414k7347a16120A05310D2345Q0543b73860a3454D0391c4716k14291o4293
10433c13300J11485A00942A3392a97516A32546a73425i920A9654A193i3969d4148
10421G8417c0653j55592B69926a65046B04607r8658b46543L2610A15598a49777
10410A7380i2158E3749J2432h3793j31147d6388B42643m5850b20665A00697a3738
10398c0670f721E1437b01165C3225j1990N1611A4200Q005K39085h0012A1478K73937
10386B85415j23762c3632A05128b26859B46366l5681J1357e7946A30421N58Q322
$$ y = [19910, 153353, -55813, -75113, 27404, 215277, -233462, 264227, 55027, -82944, -272145, -23626, 11310, 219691, -121868, 162723, -141612, -25719, -197474, -131927, -62370, 243272, -313132, 235414, 208067, -116120, 105310, 42345, 122888, -273860, -13454, 40391, -34716, -249007, -313300, -201815, 100942, 13392, -197516, 132546, -173425, -9920, 19654, 1193, -93969, -44148, 78417, -30653, -186245, 269926, -165046, 204607, 105949, -246543, -213933, 115598, -149777, 17380, -92158, 53749, 66181, -83793, -214940, -46388, 242643, 196793, -220665, 100697, -13738, -30670, -6721, 51437, -201165, 33225, 21235, 72846, 14200, 22205, 261290, -80012, 11478, 285415, 161653, -33632, 105128, -226859, 246366, 210685, 222042, -57946, 130421, 130979, 139301]
10375A39301a26665A84637p1470P3417L14742C3224M13527q0665N2183j17158
10365C01111j9261r6917G5253K80690r6019j5565E3697J45028Q3290O6129j19792
10354B28352P64L67159r2745k4130q9763J79318j91913N7324j68331J44294J60646
10343E70975k62481B0335a3264n2498C73129j37353o9926m2189J52309A0666O7443
10332G8109N1803n3140b69865A51610J04483M7479A16149m5598B6957g3820B02524
10320C8160J52022l3670k2464J94377a10416E4727J60933k284q9836K27846a31003
10308B9964c0181G5459J6138J07181J94792a00716b2184H2861P9650D7317a24582
10296h3708q515A2904a94458A6563J38154c67j37603A19189e7621p384o39b7675
$$ y = [139301, -126665, 184637, 113167, 186584, 501326, 33224, 446751, 366086, 418269, 301111, 281850, 184933, 75253, 355943, 259924, 244359, 53697, 198725, 282015, 348144, 228352, 229116, 596275, 503530, 479400, 389637, 568955, 377042, 434366, 266035, 410329, 570975, 308494, 20335, -13264, -65762, 373129, 235776, 165850, 123661, 275970, 10666, 78109, 129912, 76772, -269865, 151610, 256093, 303572, 116149, 70551, 26957, -73820, 202524, 38160, 190182, 156512, 134048, 328425, -110416, 54727, 215660, 213376, 123540, 351386, -131003, 29964, -30181, 75459, 91597, 198778, 393570, -100716, -22184, 82861, 162511, 47317, -124582, -83708, -92223, 12904, -194458, 16563, 154717, -367, -137970, 119189, -57621, -65005, -65644, -27675]
10283i5399H2830J35414n4851a39881e6577j17039A541e258B24091q1198a22027
10271E1151b12559F5739o00R3437b42100H3346Q1447a00390A12347g0220D15117
10259I3492J84339K504O4985p3167d966l50341F5713e6667j44652L7438B5594
10247h8461J4899m96801a89151H2593L324K21068E6009B603b0814l12098b8065
10235a29649d3617j39490D7122J76773K3332a39621A28954d3518F3331b92290
10224B6613J77528a07819F1991b96497B2286P6294l213J9098A8518K52760j29456
10213A41822G801a52346A63405e46252A17770b44562O5602O2843j18009j22780
10203c56906G0371K13813a25438B41624H34K8975f4895j6706p2334p9447p1636
$$ y = [-95399, 82830, 218244, 163393, -139881, -56577, -173616, 1541, -5258, 224091, 142893, -122027, 51151, -212559, 65739, 65139, 158576, -242100, 83346, 164793, -100390, 112347, -70220, 415117, 93492, 277831, 280335, 345320, 272153, -4966, -355307, 65713, -56667, -201319, -163881, 25594, -88461, -73562, -570363, -189151, 82593, 85917, 306985, 56009, 2603, -20814, -332912, -28065, -129649, -43617, -183107, 47122, 223895, 247227, -139621, 128954, -43518, 63331, -292290, 26613, 204141, -107819, 61991, -296497, 22286, 98580, 95367, 114465, 18518, 271278, 141822, 7801, -152346, 163405, -546252, 117770, -244562, -178960, -116117, -234126, -356906, 70371, 284184, -125438, 241624, 834, 29809, -64895, -81601, -153935, -233382, -305018]
10192c05018F1744J40833d7704a621k94156P5631C0568J44781b1619q6177j24657
10181b32453C2176J18677C4155e9261q8029F1861c3370l48555e2953o8113b9666
10169A37290a05261j01849j94093H2725d10299A62820C7963p611L54747j90691
10159A94408c51876H5952b98607b4778m4075j77104A8311i0293C6720f8299B1640
10147C18184O871A34032a63839j11611B7222K549c39274A77617K8860c0528m0789
10136g1317l1011j23520C65794c00576J15236G0031K98421F2284b514r8210j04761
10125b05485l3575A35205r789D7026Q1450p619n8531a38605N1930a8683b367q8820
10113i1187A16568b00002j92978i3810B02863a02626A278Q2922p427d9415G0243
$$ y = [-305018, 61744, 202577, -47704, -1621, -295777, -220146, 30568, 175349, -21619, -107796, -232453, 32176, 150853, 34155, -59261, -147290, 61861, -33370, -381925, -52953, -121066, -29666, 137290, -105261, -207110, -401203, 82725, -410299, 162820, 37963, 30352, 385099, 194408, -351876, 85952, -298607, -24778, -68853, -245957, 18311, -90293, 36720, -68299, 21640, 318184, 325055, 134032, -163839, -275450, 27222, 29771, -339274, 177617, 206477, -30528, -71317, -102328, -225848, 365794, -300576, -185340, 70031, 368452, 62284, -2514, -100724, -205485, -239060, 135205, 125416, 47026, 128476, 120857, 62326, -138605, -86675, -18683, -2367, -91187, 116568, -200002, -392980, -93810, 202863, -102626, 1278, 84200, 76773, -49415, 70243]
10101d23081B85929A02743b78149J13923b0976k29088B06157b03157A80107H3380
10090h2484k2790A61080a25982A0281i0430L6690l43881c9605j49116G9018i0430
10078b54063J2081P3887g085k50342o3313G3726b26931f1379j01699H3618f7625
10066b93870b0158B72444A16894a912j57275M87A03769P09c3076k02354A02950
10054A00448k879d27662J53841C21666d43095i6255B89139c13806B39659e25507
10043a94538A07373a08123A95876c00211g7476H6332b19669M2554j45970e1259
10032C63485a13607k12093J53122h3418J6866A26497b12910M7980B37394a89583
10021A7589F6M8684M8147d48729J63662a41166p6624K1332h1168k0600D7528b55900
$$ y = [-423081, 285929, 102743, -278149, -164226, -20976, -250064, 206157, -203157, 180107, 83380, -82484, -105274, 161080, -125982, 10281, -90430, -53740, -397621, -39605, -188721, 79018, -90430, -254063, -241982, -168095, -7085, -257427, -320740, 73726, -226931, -61379, -163078, 83618, -67625, -293870, -20158, 272444, 116894, -1912, -159187, -158700, 103769, 104478, -33076, -235430, 102950, 100448, 97569, -427662, -273821, 321666, -443095, -96255, 289139, -313806, 239659, -525507, -194538, 107373, -108123, 195876, -300211, -77476, 86332, -219669, -177115, -323085, -51259, 363485, -113607, -325700, -172578, -83418, -66552, 126497, -212910, -164930, 237394, -189583, 17589, 66, 48750, 96897, -448729, -285067, -141166, -217790, -196458, -81168, -101768, 47528, -255900]
10008I7591e3176C3583J1245b16778R338B8583a53485e9426b5485k625k9076G5353
9995c0161n5291A8659a16112A26059b15007K8086g592j35974c2249k00140O2986
9984a69403b1506j07759I015K27011j6737b44989Q0279k91631a01796b1641j97903
9973b19544A712L3071D608i4082m1774b5386o2029A43931a79936r5651b2721B320
9960a43987k64456A85043a89947O3895A72173b72630H4165g1783j7574m6584I0444
9948C9974a49893A02520a77749d3037b563l35021a62409k4277A82737B957R5892
9937I8849m1157J63834c05309J21603O5786C2388L4541b27644F0329M5802n2508
9926E3623a48059M1307j03890D6228d6498E0626b73394J01572I9455F531J84759
$$ y = [97591, -53176, 33583, 44828, -216778, -207440, 28583, -153485, -59426, -25485, -28110, -57186, 75353, -30161, -85452, 18659, -116112, 126059, -215007, -186921, -7592, -143566, -32249, -232389, -169403, -21506, -129265, 9015, 236026, 219289, -244989, -164710, -456341, -101796, -21641, -219544, 1712, 34783, 4608, -94082, -135856, -25386, -87415, 143931, -179936, -275587, -22721, 2320, -143987, -408443, 185043, -189947, -126052, 172173, -272630, 84165, -71783, -89357, -135941, 90444, 39974, -149893, 102520, -177749, -43037, -2563, -337584, -162409, -186686, 182737, 2957, 98849, 57692, 221526, -305309, -183706, -117920, 32388, 66929, -227644, 60329, 106131, 53623, -148059, -106752, -210642, 46228, -46498, 50626, -273394, -171822, 99455, 6531, 191290]
9915A91290c9m760C5126i5582j69521C1332c37010a02818j07753E2233q232K7399
9903G1400c81328B82287a12626L419K5195p0559j9774A05114f489C38384i3022
9891A00622J62982b60141E9165J11572i9736o2189B00170e0703r8436O3457j39406
9880b25088M3075C290a13589b4345q2979j99692B24466c49265J51689k61661F3657
9868F1113b9840n9657B0228c6535H216d28218a64690P2560p7398B00024C5461
9856b88093B1400a84229k28991d9080j66919a0971k5553j35028E5270b8511H7616
9844A73814e3619o2109N1967n723C8795K53643c18029a38853b3407j25950q633
9833a57990B2129b47647c0019D8200h5054C74393D3371i1506m1208p1975h8309
$$ y = [191290, -39, -4799, 35126, -95582, -265103, 31332, -337010, -102818, -210571, 52233, 44001, 71400, -381328, 282287, -112626, -109207, -84012, -154571, -174345, 105114, -6489, 338384, -93022, 100622, 263604, -260141, 59165, 170737, -99736, -161925, 200170, -50703, -149139, -85682, -225088, -182013, 3290, -113589, -24345, -107324, -307016, 224466, -349265, -197576, -459237, 63657, 61113, -29840, -89497, 20228, -36535, 8216, -428218, -164690, -92130, -169528, 200024, 35461, -288093, 21400, -184229, -413220, -49080, -215999, -10971, -36524, -171552, 55270, -28511, 87616, 173814, -53619, -115728, -63761, -69484, 38795, 292438, -318029, -138853, -23407, -149357, -157990, 22129, -247647, -30019, 48200, -85054, 374393, 43371, -91506, -132714, -204689, -88309]
9821b07265B80358a35188k52475a34834O2505l27154J02601i9055l26512A14559
9810d5591k14787j41301A06033a36077n44901a47522A00396D7267O069a42517
9799a57590f7947B65564h104C3966r744a3696C15918D1864d5009j19796a5854
9787A98546a50622B07648C1761c0914E595c9693k65483e415k16957B5995a42811
9775a98086A10706c08586J45471b2219A55386B7634e0852G6892a06806j22286
9765b29092j29051f3288l54866A2975L8908J57545b31026A3504f8813b5961j72515
9754a98476A81604a81186B07686r1589K00035a04j66361A2529J84101L3876q4851
9743A45655b11692r685h8501K0935A92545b48712a1783k71955j11328A40726m2661
$$ y = [-207265, 280358, -135188, -387663, -134834, -72329, -399483, -296882, -99055, -425567, 114559, -45591, -260378, -401679, 106033, -136077, -680978, -147522, 100396, 47267, 53336, -142517, -157590, -67947, 265564, -8104, 33966, 24222, -13696, 315918, 41864, -45009, -164805, -15854, 198546, -150622, 207648, 31761, -30914, 5595, -39693, -305176, -5415, -222372, 25995, -142811, -198086, 110706, -308586, -163115, -22219, 155386, 27634, -50852, 76892, -106806, -229092, -358143, -63288, -418154, 12975, 51883, 209428, -231026, 13504, -68813, -25961, -198476, 181604, -181186, 207686, 116097, 316132, -104, -166465, 12529, 196630, 230506, 145655, -211692, -221377, -88501, -67566, 192545, -248712, -11783, -283738, -395066, 140726, 98065]
9732I8065C5983b54607q3682O7731j0940F9818f6127j07182D9887a52946J7888
9721a35058j6970K047E7028j3707J36037a0558l06698A10053b94088E4150a16307
9709b36648g4743l5884d2128G1955b36608d947k87358A97844c79796J38594J05605
9698a35597A70836d2521A36636b13831A29340A9925J1856a4403r2679C5333D230
9686c21685d6690B2352h1748a1709A79950o48a6194a54C3024e8105A31006b0635
9673i221k76151A79333G7436q33b1952j2874B600a59793j24142a32182A37652
9661a67585c3847m46759a58761e8384A73706b22811f291j61111B56331d4577j42607
9650a87184L3857L7465j407o9577e4820K4343j01811A24539K84174c85299H9638
$$ y = [98065, 35983, -254607, -338289, -270558, -281498, 69818, -66127, -173309, 49887, -152946, -135058, -152028, -149981, 57028, 43321, 179358, -10558, -317256, 110053, -294088, 54150, -116307, -236648, -74743, -110627, -42128, 71955, -236608, -4947, -292305, 197844, -379796, -241202, -135597, 170836, -42521, 136636, -213831, 129340, 19925, 31781, -14403, -107082, 35333, 4230, -321685, -46690, 22352, -81748, -11709, 179950, 179302, -16194, -154, 33024, -58105, 131006, -20635, -9221, -285372, 179333, 77436, 76603, -21952, -34826, 2600, -159793, -283935, -132182, 137652, -167585, -33847, -480606, -158761, -58384, 173706, -222811, -6291, -167402, 256331, -44577, -187184, -153327, -115862, -117269, -186846, -54820, -30477, -132288, 124539, 408713, -385299, 89638]
9638h7882k68290D4325a47770A81378c60343a77526F566O0319K8115b16869A04011
9626f4470A1390c61449C77111A5593i6688E0129j9578Q8753i6514j258j40144
9615b37916g9717L7974A57059C2040J07064a08385j70320I1711h7271j7889j19645
9604b24805I5301N7644i1836C36524a11152a8130j95578J4990A82538a3425k08516
9593b21941F8070a75134B8922h8843I4295B737J62502q1439a99589K0739F786
9581A45663J03815K0207b12311e3877A76975g1157j7672j9611A07787k0002J0521
9570I8306F991i1324L4302J6565G6640P0402f2015B51698a75788j51780A76603
9558b81926C4664A144J7329M7715b28171N8583A91392a36198G945J14467a21720
$$ y = [-87882, -356172, 44325, -147770, 181378, -360343, -177526, 6566, 66885, 95000, -216869, 104011, -64470, 11390, -361449, 377111, 15593, -96688, 50129, 30551, 119304, -96514, -97772, -237916, -79717, -41743, 157059, 32040, 139104, -108385, -278705, 91711, -87271, -105160, -224805, 95301, 152945, -91836, 336524, -111152, -18130, -213708, -198718, 182538, -13425, -221941, 68070, -175134, 28922, -88843, 94295, 2737, 165239, 83800, -199589, -178850, 6786, 145663, 249478, 269685, -212311, -53877, 176975, -71157, -88829, -108440, 107787, 87785, 98306, 6991, -91324, -57022, -40457, 76640, 147042, -62015, 251698, -175788, -327568, 176603, -281926, 34664, 1144, 18473, 66188, -228171, -169588, 191392, -136198, 7945, 122412, -121720]
9546a71370E3936h1970k55089J03869P3423j8620A3907l878a13601F0381b02809
9534i9765j33440j99827b8563j77268A25639l3047C6896Q9061f3220j47958i3660
9522d8459j18552B29026d340o2805l5069L7825E7081b4756m3406j82302j87143
9511d37607g68l75269E2137A7390e0974C81521j50476F4176c25232A22585c1055
9499d62253i3473c9453j52623A0870J93611G4717J93758n1918a44666L5464G9330
9487A2925e4973A31838a30391D0346c80187d7417J0574k89341G3102b05126k27425
9476d32551a89246e4121b6499j00441A2630K0856M9187b80262o9288J61777P7951
9465a09822C466b51241B63742D8447c45921G8362b01811A01933a31937A33541
$$ y = [-171370, 53936, -81970, -337059, -233190, -159767, -178387, 13907, 10029, -113601, 60381, -202809, -99765, -233205, -433032, -28563, -205831, 125639, 92592, 36896, 125957, -63220, -211178, -93660, -48459, -167011, 229026, -4340, -67145, -102214, -64389, 57081, -24756, -68162, -250464, -437607, -768, -376037, 52137, 17390, -50974, 381521, 231045, 64176, -325232, 122585, -31055, -462253, -93473, -39453, -192076, 10870, 204481, 74717, 268475, 216557, -144666, -109202, 79330, 12925, -54973, 131838, -130391, 40346, -380187, -47417, -36843, -326184, 73102, -205126, -432551, -189246, -54121, -26499, -126940, 12630, 33486, 82673, -280262, -349550, -187773, -109822, 3466, -251241, 263742, 48447, -345921, 78362, -201811, 101933, -131937, 133541]
9454a00464A03914b80774h4271K5468D1667b54104H6584d11755a43721P1311C9233
9442b53061A27471h8388C52210H5379c62110B49306b27274q4541B3283a55109
9431A12189H719R0297a67749j38263g9797K5232A19350c45151F3190j7531a87200
9419C6532f322n4018l17603J57930a5426A86734b32349I7022o750b23148A47407
9407A35085K48121a03877j67297C3500g9991J4291l4678j02193Q4254l21575a26309
9395a39772k12960A8653d26442q0904D557e0597a1296A79733a8229j16599j05597
9384b40425P7687A87638F0384a91981m0103R6217n9338k58685A10785k8282A7944
9372b33310o2849A03387K779B7121b66901A73900a31886o4468C8554c65803J73662
$$ y = [-100464, 103914, -280774, -84271, -58803, 41667, -254104, 86584, -411755, -143721, -72410, 39233, -253061, 127471, -88388, 352210, 85379, -362110, 249306, -227274, -311815, 23283, -155109, 112189, 8719, 99016, -167749, -306012, -79797, -54565, 119350, -345151, 63190, 45659, -187200, 36532, -6322, -60340, -377943, -220013, -15426, 186734, -232349, 97022, 90272, -223148, 147407, 135085, 383206, -103877, -271174, 33500, -79991, -65700, -100378, -202571, -118317, -439892, -126309, -139772, -352732, 18653, -426442, -507346, 4557, -50597, -11296, 179733, -18229, -134828, -240425, -162738, 187638, 60384, -191981, -232084, -135867, -195205, -453890, 110785, 82503, 17944, -233310, -296159, 103387, 106166, 27121, -266901, 173900, -131886, -196354, 38554, -365803, -192141]
9361a92141g9765A05550c75405a07546C53680C918b1678G465O9781e7086J3097
9350d3989k25032R4110P4453j32944a2522n8365l03211d0737o9620E8828b11770
9338b83412G8943C1948b54727N762a09187o4775A65672f9161k77063B50175b82090
9326A51030A0456M9376d3362k75610J17879N8472A79954m2894b11625i8226B04654
9314g2449p463A15742a43196E9057a46607O6170j21947d5644j28100N0161o458
9303a30041A20544P2437a09943A16642a16941K2133A8710a859k19297g4665j56328
9292b30993B32301a52663A9946a71031G5159J08680b43285d3410l288l01530A26239
9280a0122E3768g7903A99646e491k49918A46678a62864A5945J04855O0640F161
$$ y = [-192141, -79765, 105550, -375405, -107546, 353680, 3918, -21678, 7465, 77246, -57086, -43989, -269021, -174911, -100458, -233402, -12522, -70887, -374098, -40737, -110357, 58828, -211770, -283412, 78943, 31948, -254727, -248965, -109187, -173962, 165672, -69161, -346224, 250175, -282090, 151030, 10456, 59832, -43362, -318972, -201093, -142621, 179954, 137060, -211625, -98226, 204654, -72449, -79912, 115742, -143196, 59057, -146607, -80437, -202384, -45644, -173744, -123583, -130041, 120544, 192981, -109943, 116642, -116941, -94808, 18710, -1859, -221156, -74665, -230993, 232301, -152663, 19946, -171031, 75159, 183839, -243285, -43410, -46698, -348228, 126239, -10122, 53768, -77903, 199646, -5491, -255409, 146678, -162864, 15945, 120800, 181440, 6161]
9268c6110B19358c6759K029m62937B22725o1300B0162a29829e7966A18699a09079
9256a74081f3791B15252a09500L8457j15319j25637L1752B40537b73827I2293
9245a347I755e9666E9092b50611e8094n3265e0306j95544H3373K0211a27669e5138
9232c81116e492j11154m4057A7369a45070j1272C21771l2512F7313l2051a00546
9220c67970D2939M29777b00261r254M3524A6846o992i4091A85570G3483b01887
9208a38983d2168A01576c32916C088L0424d1007r5298M98j46495J38902D43R9978
9196A00421D4518a54289C0365J4619e124A52812b38099j04003b3256k22338B63
9184b90594L4761A78618g2543K3141k9217H0836d13606J44717J3144h9109R9F9834
$$ y = [-36110, 219358, -36759, -34730, -497667, 222725, 161425, 20162, -129829, -57966, 118699, -109079, -174081, -63791, 215252, -109500, -71043, -186362, -311999, -280247, 240537, -273827, 92293, -1347, 9755, -59666, 59092, -250611, -58094, -111359, -50306, -245850, 83373, 103584, -127669, -55138, -381116, -5492, -116646, -160703, 17369, -145070, -156342, 321771, 289259, 67313, 35262, -100546, -367970, 42939, 472716, -200261, -209515, -165991, 16846, 9854, -94091, 185570, 73483, -201887, -138983, -42168, 101576, -332916, 3088, 33512, -41007, -136305, -135807, -282302, -143400, 443, 100421, 44518, -154289, 30365, 44984, -5124, 152812, -238099, -342102, -23256, -245594, 263, -290594, -255833, 178618, -72543, -49402, -78619, 80836, -413606, -268889, -255745, -89109, -89010, 69834]
9171f2460K9612A49416b96587J23614j73772H0224b0665m9060j57323a7449j30485
9160a47934P0658k0261j55466C3203e14040a16757L3379A49650c18902G4865b2030
9148A91484A6417a78275P9290A57418a31064A80139a18031A76001k1378o934E7925
9136B7595b18598C54445d7786A4746a19811n8040A70720J53168c7376k5379B19419
9124A00174l1110f7028n3658p2026A76900b42426n5167d8309B03515a30697j43084
9113b73781a00265k80480A32896a58667K0876D8414g1068l1972B34119E9144a29724
9101a33352C055d29215E8377a44066j39119J16378o9065a06829l0100N9174J1175
9090f6580J025h66j98938C41273a11299j32672j1280j9020A51800a08128C9870
$$ y = [-62460, -32848, 149416, -296587, -172973, -346745, 80224, -20665, -69725, -227048, -17449, -147934, -77276, -97537, -253003, 33203, -514040, -116757, -83378, 149650, -318902, 74865, -22030, 191484, 16417, -178275, -98985, 157418, -131064, 180139, -118031, 176001, 154623, 147689, 57925, 27595, -218598, 354445, -47786, 14746, -119811, -177851, 170720, 323888, -37376, -62755, 219419, 100174, 69064, -67028, -120686, -192712, 176900, -242426, -297593, -48309, 203515, -130697, -273781, -100265, -380745, 132896, -158667, -137791, 48414, -71068, -103040, 234119, 59144, -129724, -133352, 3055, -429215, 58377, -144066, -283185, -166807, -235872, -106829, -136929, -77755, -66580, -65555, -866, -199804, 341273, -111299, -243971, -255251, -274271, 151800, -108128, 39870]
9078a98709K9168A87916a33276H4925M6124b52437H0863P4668c45103E0950a56698
9066A6900a21498J2155L3328a341A41549f6164L427r7641O273N7974K0665A64932
9053A48912K5161c4599B09057H0225b87237J04083L6398Q974K1385j99486c5886
9041A58729R1779m5452b89600k5669A94627c3707m9107r8955c5021P590I7688
9029g7961l217j03531L9670A15214a25936q8159g0746B32874o3481b07708A06108
9017b25241C7949a78705B78952a52364O0759j81452H8220k2172N63g9400a3188
9005A1283J14476B7756b01267D9321b63941a19086N8240o4338B15460p0615k354
8994A42491b34287N3878A16278c82216a51662j80909A36679B015K76549A3572
$$ y = [-198709, -169541, 187916, -133276, 84925, 131049, -252437, 80863, 155531, -345103, 50950, -156698, 16900, -121498, -109343, -76015, -1341, 141549, -66164, -62737, -160378, -154105, -96131, -75466, 164932, 148912, 174073, -34599, 209057, 80225, -287237, -183154, -146756, -137782, -116397, -315883, -35886, 158729, 250508, 205056, -289600, -315269, 194627, -33707, -82814, -181769, -35021, -27431, 97688, -77961, -81178, -184709, -145039, 115214, -125936, -214095, -70746, 232874, 169393, -207708, 106108, -225241, 37949, -178705, 278952, -152364, -91605, -273057, 88220, 66048, 66611, -79400, -13188, 11283, 125759, 27756, -201267, 49321, -263941, -119086, -60846, -125184, 215460, 144845, 142491, -234287, -180409, 116278, -382216, -151662, -332571, 136679, 2015, 278564, 13572]
8983C4873J51538i9143p3418M8453k85695R1459a57827L3257b6590j80037A60333
8971I3616K04609a48100L0750J8792k07541a37936f0391k7380j53785b1738B85640
8959b5688j64113c4165B44818L4739a52119o7250a2709j06655J2075r3693B46469
8947a83948L2514B85921J37805G1530l4942O7341a20688l85l36097B81610b19909
8935g6160E52042C9384A495K10874a96493O1456c2587I3647B9434K72017M3599
8924C45050K17288J284528Q096041C554364A028079b2367E6465M27038C6795c55128
8913A14202n1490N1008D4053b7958G7430J2074c53444J36909A8573c02703B6237
8901a6120m0511j05905B9639b55903A06531a71291N0856j40770a8822E755a34908
$$ y = [34873, 186411, -99143, -172561, -124108, -409803, -318344, -157827, -124570, -26590, -206627, 160333, 93616, 298225, -148100, -117350, -98558, -306099, -137936, -60391, -87771, -241556, -21738, 285640, -25688, -189801, -34165, 244818, 279557, -152119, -219369, -12709, -119364, -107289, -200982, 246469, -183948, -151434, 285921, 423726, 71530, 36588, 103929, -120688, -121073, -457170, 281610, -219909, -76160, 552042, 39384, 1495, 212369, -196493, -135037, -32587, 93647, 29434, 301451, 345050, 562338, 1846866, 9942907, 3554364, 1028079, -22367, 56465, 483503, 36795, -355128, 114202, 62712, 113720, 44053, -27958, 77430, 89504, -353444, -216535, 18573, -302703, 26237, -16120, -56631, -162536, 29639, -255903, 106531, -171291, -120435, -261205, -18822, 5755, -134908]
8889h5197k27908k050B2189M5216M6130o194D4285J56925f4166A8098K84574A7066
8876h7619k2261m6728e4090E3947g1230A16392h861L802C8405Q3413d7811j76109
8864b23920c5174k73092F1383a64805A52571a33036C3047b62982a13336c6193
8853b06202A52725b60770J6986A61922E8650d2455E2265J26786c8102j66290B24031
$$ y = [-85197, -313105, -315155, 22189, 67405, 113535, 107341, 44285, 201210, -64166, 18098, 302672, 17066, -87619, -109880, -156608, -54090, 53947, -71230, 116392, -8861, -5059, 38405, 121818, -47811, -223920, -35174, -308266, 61383, -164805, 152571, -133036, 33047, -262982, -113336, -36193, -206202, 152725, -260770, -243784, 161922, 58650, -42455, 52265, 179051, -38102, -204392, 224031]
$$ [...]
##END NTUPLES=NMR SPECTRUM
##END=
