
##TITLE=AC1301_CHIAH12113_6534571_PfTGTWBq4l
##JCAMPDX= 6.0         $$ Bruker NMR JCAMP-DX V2.0
##DATA TYPE= NMR SPECTRUM
##DATA CLASS= NTUPLES
##ORIGIN= BRUKER
##OWNER= Administrator
$$ 1.72 TOPSPIN		Version 2.1
$$ 2012-07-17 01:53:14.562 -0500  Administrator@TOPSPIN
$$ Compression mode = diff/dup
##.OBSERVE FREQUENCY= 400.02188249412
##.OBSERVE NUCLEUS= ^1H
##.ACQUISITION MODE= SIMULTANEOUS (DQD)
##.ACQUISITION SCHEME= undefined
##.AVERAGES= 64
##.DIGITISER RES= 22
##SPECTROMETER/DATA SYSTEM= spect
##.PULSE SEQUENCE= noesygpps1d.comp
##.SOLVENT NAME= COFFEE_meoh
##.SHIFT REFERENCE= INTERNAL, COFFEE_meoh, 1, 14.9607
##AUDIT TRAIL= $$ (NUMBER, WHEN, WHO, WHERE, PROCESS, VERSION, WHAT)
$$ ##TITLE= Audit trail, TOPSPIN		Version 2.1
$$ ##JCAMPDX= 5.01
$$ ##ORIGIN= Bruker BioSpin GmbH
$$ ##OWNER= Administrator
$$ $$ C:\Bruker\TOPSPIN/data/COFFEE/nmr/AC1301_CHIAH12113_6534571_PfTGTWBq4l/12/pdata/1/auditp.txt
$$ ##AUDIT TRAIL=  $$ (NUMBER, WHEN, WHO, WHERE, PROCESS, VERSION, WHAT)
(   1,<2012-07-17 01:53:09.828 -0500>,<Administrator>,<TOPSPIN>,<go>,<TOPSPIN 2.1>,
      <created by zg
	started at 2012-07-17 01:41:39.468 -0500,
	POWCHK enabled, PULCHK disabled,
       configuration hash MD5:
       6B 1B 68 BB D9 2E 58 E2 7F 35 AD 54 07 DF 0E 41
       data hash MD5: 64K
       18 96 56 26 52 89 D8 71 CE 41 32 60 1A C0 81 29>)
(   2,<2012-07-17 01:53:12.671 -0500>,<Administrator>,<TOPSPIN>,<proc1d>,<TOPSPIN 2.1>,
      <Start of raw data processing
       efp LB = 0.3 FT_mod = 6 PKNL = 1 PHC0 = 0 PHC1 = 0 SI = 128K 
       data hash MD5: 128K
       AE 7F A3 D7 86 AD A7 0F B5 34 50 15 A7 BB F8 FD>)
(   3,<2012-07-17 01:53:13.796 -0500>,<Administrator>,<TOPSPIN>,<proc1d>,<TOPSPIN 2.1>,
      <pk PHC0 = 2.367554 PHC1 = 0 
       data hash MD5: 128K
       98 77 F8 FA A7 F9 3D BC BE 4D C9 0F 50 1B E8 40>)
(   4,<2012-07-17 01:53:14.062 -0500>,<Administrator>,<TOPSPIN>,<proc1d>,<TOPSPIN 2.1>,
      <abs ABSG = 1 
       data hash MD5: 128K
       82 FB B8 3F C9 F0 7A D0 27 0A 5F 64 AD 45 05 30>)
(   5,<2012-07-17 01:53:14.125 -0500>,<Administrator>,<TOPSPIN>,<proc1d>,<TOPSPIN 2.1>,
      <abs ABSG = 2 
       data hash MD5: 128K
       32 B9 E3 4B 11 80 87 7C 82 3B 79 E0 95 28 5C 49>)
(   6,<2012-07-17 01:53:14.187 -0500>,<Administrator>,<TOPSPIN>,<proc1d>,<TOPSPIN 2.1>,
      <abs ABSG = 3 
       data hash MD5: 128K
       AA 48 E7 50 98 2D 0C 06 6D 64 65 A4 33 0F 9E 7C>)
(   7,<2012-07-17 01:53:14.421 -0500>,<Administrator>,<TOPSPIN>,<proc1d>,<TOPSPIN 2.1>,
      <abs ABSG = 4 
       data hash MD5: 128K
       D3 9F 99 72 C9 04 BD 72 6E 4C F6 38 AF 0A 5C 61>)
(   8,<2012-07-17 01:53:14.468 -0500>,<Administrator>,<TOPSPIN>,<proc1d>,<TOPSPIN 2.1>,
      <abs ABSG = 5 
       data hash MD5: 128K
       E2 1E E5 6C 93 B4 D2 AC 27 00 92 1B 22 23 8C 62>)
$$ ##END=
$$ 
$$ $$ hash MD5
$$ $$ 0E AD 9F C4 93 BA 91 AA D6 33 02 D5 35 75 CE 4E
##$RELAX= 
##$RELAX= 
##$RELAX= 
##$RELAX= 
##$RELAX= 
##$RELAX= 
##$RELAX= 
##$RELAX= 
$$ Bruker specific parameters
$$ [...]
150 150 150 150 150 150 150 150
##$TP07= 0
##$TPNAME0= <>
##$TPNAME1= <>
##$TPNAME2= <>
##$TPNAME3= <>
##$TPNAME4= <>
##$TPNAME5= <>
##$TPNAME6= <>
##$TPNAME7= <>
##$TPOAL= (0..7)
0.5 0.5 0.5 0.5 0.5 0.5 0.5 0.5
##$TPOFFS= (0..7)
0 0 0 0 0 0 0 0
##$TUNHIN= 0
##$TUNHOUT= 0
##$TUNXOUT= 0
##$USERA1= <user>
##$USERA2= <user>
##$USERA3= <user>
##$USERA4= <user>
##$USERA5= <user>
##$V9= 5
##$VALIST= <valist>
##$VCLIST= <CCCCCCCCCCCCCCC>
##$VD= 0
##$VDLIST= <DDDDDDDDDDDDDDD>
##$VPLIST= <PPPPPPPPPPPPPPP>
##$VTLIST= <TTTTTTTTTTTTTTT>
##$WBST= 2048
##$WBSW= 25
##$XGAIN= (0..3)
0 0 0 0
##$XL= 0
##$YL= 0
##$YMAX_a= 12106339
##$YMIN_a= -9233101
##$ZGOPTNS= <>
##$ZL1= 120
##$ZL2= 120
##$ZL3= 120
##$ZL4= 120
##$ABSF1= 14.9607
##$ABSF2= -5.597482
##$ABSG= 5
##$ABSL= 3
##$ALPHA= 0
##$AQORDER= 0
##$ASSFAC= 0
##$ASSFACI= 0
##$ASSFACX= 0
##$ASSWID= 0
##$AUNMP= <proc_prof1d_extract.lims>
##$AXLEFT= 0
##$AXNAME= <>
##$AXNUC= <1H>
##$AXRIGHT= 0
##$AXTYPE= 0
##$AXUNIT= <>
##$AZFE= 0.1
##$AZFW= 0.1
##$BCFW= 0
##$BC_mod= 0
##$BYTORDP= 0
##$COROFFS= 0
##$CY= 15
##$DATMOD= 1
##$DC= 0
##$DFILT= <>
##$DTYPP= 0
##$F1P= 0
##$F2P= 0
##$FCOR= 0.5
##$FTSIZE= 131072
##$FT_mod= 6
##$GAMMA= 0
##$GB= 0
##$INTBC= 1
##$INTSCL= 1
##$ISEN= 128
##$LB= 0.3
##$LEV0= 0
##$LPBIN= 0
##$MAXI= 10000
##$MC2= 0
##$MEAN= 0
##$ME_mod= 0
##$MI= 0
##$NCOEF= 0
##$NC_proc= -2
##$NLEV= 6
##$NOISF1= 0
##$NOISF2= 0
##$NSP= 0
##$NTH_PI= 0
##$NZP= 0
##$OFFSET= 14.9607
##$PC= 1
##$PHC0= 2.367554
##$PHC1= 0
##$PH_mod= 1
##$PKNL= yes
##$PPARMOD= 0
##$PPDIAG= 0
##$PPIPTYP= 0
##$PPMPNUM= 2147483647
##$PPRESOL= 1
##$PSCAL= 4
##$PSIGN= 0
##$PYNMP= <proc.py>
##$REVERSE= no
##$SF= 400.020009756335
##$SI= 131072
##$SIGF1= 0
##$SIGF2= 0
##$SINO= 400
##$SIOLD= 131072
##$SPECTYP= <>
##$SREGLST= <1H.CDCl3>
##$SSB= 0
##$STSI= 131072
##$STSR= 0
##$SW_p= 8223.68421052631
##$SYMM= 0
##$S_DEV= 0
##$TDeff= 65536
##$TDoff= 0
##$TI= <>
##$TILT= no
##$TM1= 0
##$TM2= 0
##$TOPLEV= 0
##$USERP1= <user>
##$USERP2= <user>
##$USERP3= <user>
##$USERP4= <user>
##$USERP5= <user>
##$WDW= 1
##$XDIM= 131072
##$YMAX_p= 448674964
##$YMIN_p= -12147
##$CURPLOT= <Network HP LaserJet P1505>
##$CURPRIN= <$Network HP LaserJet P1505>
##$DFORMAT= <normdp>
##$LAYOUT= <+/1D_H.xwp>
##$LFORMAT= <normlp>
##$PFORMAT= <normpl>
##$SURQMSG= 1
$$ End of Bruker specific parameters
$$ ---------------------------------
##NTUPLES= NMR SPECTRUM
##VAR_NAME=  FREQUENCY,     SPECTRUM/REAL,   SPECTRUM/IMAG
##SYMBOL=    X,             R,               I
##VAR_TYPE=  INDEPENDENT,   DEPENDENT,       DEPENDENT
##VAR_FORM=  AFFN,          ASDF,            ASDF
##VAR_DIM=   131072,        131072,          131072
##UNITS=     HZ,            ARBITRARY UNITS, ARBITRARY UNITS
##FACTOR=    0.0627417313425164, 1,          1
##FIRST=     8223.62146879497, -2299,        -56742
##LAST=      0,             -818,            -58016
##MIN=       0,             -12147,          0
##MAX=       8223.62146879497, 448674964,    0
$$ Real data points
##PAGE= N=1
##DATA TABLE= (X++(R..R)), XYDATA
$$ [...]
61661C41445L41q9p18q45l19M46J130J695K001J805J226P87Q12J100J332J391
61645C53540J252R23P04J013J712K058J705J386J940K954L095J855K50n81p86
61630C73020j212j892k044j489j145j691k515k583j916j472j797k451k748k470
61616C45595j803j057n87n21m95q3M93M97l41j540k598l497m256m564m242l601
61600C17400l020k532k128k036k283k449k231j935j972k189k222k126k180k247
61586B85850j984j493j206j173j049p92p29r28r78o98n17q04j178r30o4N31R2
61569B71950j120k125k264j678q21KN89P25N17N02R77J499J503J170J051J074
61553B73551O84o3m66l01r0RN84J758K483J833L77n21k92O41J766K729L061K488
$$ plain form
61661 341445 341786 341697 340979 340134 339815 340261 341391 343086 345087 346892 348118 348905 349717 350817 352149 353540
61645 353540 354792 355715 356419 357432 359144 361202 362907 364293 366233 369187 372282 374137 374387 373806 373020
61630 373020 371808 369916 367872 366383 365238 363547 361032 358449 356533 355061 353264 350813 348065 345595
61616 345595 343792 342735 342148 341627 341132 341049 341542 342039 341698 340158 337560 334063 329807 325243 321001 317400
61600 317400 314380 311848 309720 307684 305401 302952 300721 298786 296814 294625 292403 290277 288097 285850
61586 285850 283866 282373 281167 279994 278945 278153 277424 276496 275518 274820 274303 273499 272321 271391 271327 271858 271950
61569 271950 270830 268705 266441 264763 263942 263944 264533 265258 265775 266277 267254 268753 270256 271426 272477 273551
61553 273551 274235 274172 273706 273405 273315 273324 273908 275666 278149 279982 280359 279838 279546 280187 281953 284682 287743 290231
61535B90231J467Q14P68R61J106J203J180Q78L24l21r30j222q51q0J30p17j800
61518B93141k004j417j023j182j376j278j099q89l47M10Q05O99P00J184J623J265
61502B89212N7j332k136k023j343r18j182j593j309m15J86R3j1N95J672K426K412
61485B84391J727O81l22q48o96q8N09P33N02J41K28J008J996K473K303J877J387
61468B98002O98n7m35l65l20n63p34m95k4L90P89J139R77M1j020j211m42L48L96
61449B97114np8L71Q77J081J070Q85K86o17r60j6J639K654K657K609L175L681
61432C16423L306K517K332K684K603J761Q18K36j89n42m37J75P00P57P73J307
61416C35224K256L053L245K760J922J416J671K181J993R56n8m14m52p26j153j441
$$ plain form
61535 290231 291698 292512 293280 294241 295347 296550 297730 298608 298932 298611 297681 296459 295608 295528 295658 294941 293141
61518 293141 291137 289720 288697 287515 286139 284861 283762 282873 282526 282936 283741 284440 285140 286324 287947 289212
61502 289212 289269 287937 285801 283778 282435 281517 280335 278742 277433 277018 277204 277297 277286 277881 279553 281979 284391
61485 284391 286118 286799 286477 285629 284933 284845 285354 286087 286589 286730 286958 287966 289962 292435 294738 296615 298002
61468 298002 298700 298643 298208 297843 297523 296960 296226 295731 295707 296097 296886 298025 299002 299043 298023 296812 296370 296718 297114
61449 297114 297109 297031 297402 298279 299360 300430 301315 301601 300984 300024 300008 301647 304301 306958 309567 312742 316423
61432 316423 319729 322246 324578 327262 329865 331626 332444 332680 332491 331949 331512 331687 332387 333144 333917 335224
61416 335224 337480 340533 343778 346538 348460 349876 351547 353728 355721 356677 356619 356205 355753 355027 353874 352433
61400C52433j731k247k716k704k247j711j269r68r69j305j599j472j071p75o17
61385C29032l85q2J62M79J039J529J385O12o8mO85J371J608J422J120R61R93J122
61367C42981J304J533J666J383O06j89k94M95J637K420K638K571K474K319K165
61352C65709K416L393M725N551N539N376N920P005P513O620M676K757J615J272
61338D30087J426J970K957M200N104N056M020K658J757J535J537J206M50l11p11
61323D62941q90j203j522j250k49P07R09P75J233K276L042L296L831N140O647
61308D85683P753Q695R796J0719J1224J1855J2954J3661J2915J0958Q769O469
61296F11451L479K5k791m413n246n617n451n187n807p463r017r443q995q484q118
$$ plain form
61400 352433 350702 348455 345739 343035 340788 339077 337808 336840 335871 334566 332967 331495 330424 329649 329032
61385 329032 328647 328565 328727 329206 330245 331774 333159 333771 333703 333699 334384 335755 337363 338785 339905 340866 341859 342981
61367 342981 344285 345818 347484 348867 349473 349284 348990 349485 351122 353542 356180 358751 361225 363544 365709
61352 365709 368125 371518 376243 381794 387333 392709 398629 405634 413147 419767 424443 427200 428815 430087
61338 430087 431513 433483 436440 440640 445744 450800 454820 457478 459235 460770 462307 463513 463963 463652 462941
61323 462941 462051 460848 459326 458076 457827 458534 459443 460218 461451 463727 466769 470065 473896 479036 485683
61308 485683 493436 502131 511927 522646 533870 545725 558679 572340 585255 596213 604982 611451
61296 611451 614930 614955 612164 607751 602505 596888 591437 586250 580443 572980 563963 554520 545525 537041 528923
61281E28923p656p148o875o771o331n070k977o65R16J322J171J435K258K898K848
61266D98278K376J951J725J779K215K856L388M007N237O942Q136Q150P435O760
61252E61235O135N100L704K598K201K245K217K016J940K103K103J514O00N1o1
61237E95701m74j506k357k225j574j442j927k228j969j455q20J42J265K166L047
61222E84344M376N764O229N735N385N771O264O293O256O573O816O517O026N776
61208F68125N367M164K439J089N40M96O09Q20J201J780K574L632M991O607Q209
61193G12643R490J0630J2134J3780J4274J2785J0234Q095O345L965J211l20p9
61180H15187N64L74k61o38j128k298l710m608n035n335n321m871m662n332o434
$$ plain form
61281 528923 521267 514119 507244 500473 494142 489072 486095 485430 486346 487668 488839 490274 492532 495430 498278
61266 498278 500654 502605 504330 506109 508324 511180 514568 518575 523812 530754 538890 547040 554475 561235
61252 561235 567370 572470 576174 578772 580973 583218 585435 587451 589391 591494 593597 595111 595711 595762 595701
61237 595701 595227 593721 591364 589139 587565 586123 584196 581968 579999 578544 577724 577866 579131 581297 584344
61222 584344 588720 594484 600713 606448 611833 617604 623868 630161 636417 642990 649806 656323 662349 668125
61208 668125 673492 677656 680095 681184 681724 682220 682829 683649 684850 686630 689204 692836 697827 704434 712643
61193 712643 722133 732763 744897 758677 772951 785736 795970 804065 810410 814375 815586 815266 815187
61180 815187 815751 816125 815864 815226 814098 811800 808090 803482 798447 793112 787791 782920 778258 772926 766492
61165G66492p081p267p673q521r386r929j0164j0172j0064j0054j0226j0375j0279
61152F45301r786q583o547m329k910k282j419J03J278R16j023l729o383q187q480
61137E83940p479o328n812n545m864l810k722j545j72J109J982K532K962L480
61123E57728M525O372Q424R812J0813J2574J5215J7505J8777J9784K1100K2164
61111G24793K2613K3216K4496K5672K5926K5531K4926K3897K2566K1800K1502
61100I86938J9992J6254J1555P463L721m81m493p306r500j2138j4688j5977j6477
61087I64863j7611j9338k0348k0360k0326k0618k0695k0445k0235j9760j8329
61076G46798j6234j4481j3270j2056j0820r988r299q148o786n858n035l533j697
$$ plain form
61165 766492 759411 752144 744471 735950 726564 716635 706471 696299 686235 676181 665955 655580 645301
61152 645301 635515 626932 620385 616056 613146 610864 609445 609548 610826 611742 610719 606990 600607 592420 583940
61137 583940 576461 570133 564321 558776 553912 550102 547380 545835 545663 546772 548754 551286 554248 557728
61123 557728 562253 568625 577049 586861 597674 610248 625463 642968 661745 681529 702629 724793
61111 724793 747406 770622 795118 820790 846716 872247 897173 921070 943636 965436 986938
61100 986938 1006930 1023184 1034739 1042202 1045923 1045442 1040949 1033643 1024143 1012005 997317 981340 964863
61087 964863 947252 927914 907566 887206 866880 846262 825567 805122 784887 765127 746798
61076 746798 730564 716083 702813 690757 679937 669949 660650 652502 645716 639858 634823 631290 629593
61063F29593n84j40P37K326L707M278M409M638N224O419Q085R318R426R027R189
61048G05652J0041J1228J2972J5403J7577J8669J9445K1134K3457K5356K6923
61037I07857K8847L0699L1641L2297L3987L6605L9083M1440M4397M7394M9082
61026A323329M9340M8938M7847M6017M5149M7304N2255N8453O5825P4999Q4538
61015A943994R2025R7584J03566J11579J22856J40510J67550K03536K47228L01470
61005C531898L70792M56151N58867O88593Q59273J078780J352473J688662K065763
60996A2651252K371994K408997K019523J247843L58275l34024o59301o32497l47334
60987A9084728J02959N86959Q85821P75502K01091o46362j451662j981060k183292
$$ plain form
61063 629593 629009 628869 629606 631932 635639 639917 644326 648964 654188 660607 668692 678010 687436 696463 705652
61048 705652 715693 726921 739893 755296 772873 791542 810987 832121 855578 880934 907857
61037 907857 936704 967403 999044 1031341 1065328 1101933 1141016 1182456 1226853 1274247 1323329
61026 1323329 1372669 1421607 1469454 1515471 1560620 1607924 1660179 1718632 1784457 1859456 1943994
61015 1943994 2036019 2133603 2237169 2348748 2471604 2612114 2779664 2983200 3230428 3531898
61005 3531898 3902690 4358841 4917708 5606301 6465574 7544354 8896827 10585489 12651252
60996 12651252 15023246 17432243 19451766 20699609 21057884 20723860 20064559 19432062 19084728
60987 19084728 19187687 19774646 20660467 21435969 21637060 20990698 19539036 17557976 15374684
60978A5374684k136150j943254j683447j411999j165264r56864p83586o40112
60970D654008n24366m32323l57071k94531k44644k06431j76579j53043j35540
60961B129480j22246j10022r8282q8848q1659p4245o5695n7492n0069m2202l4557
60950A304163l0097k9750l0888l1309l1661l2565l2427l0029k6834k4661k3111
60939I80831k1070j9055j8151j7997j7621j7183j7391j7995j8206j7931j7607
60928G80624j7407j7312j7239j6597j4690j2112j0579j0755j1329j0951r915r215
60916F22523r012q956q977q906q221o983o157o165o024m815l163k304k371k555
60902E37914k315j583l48J064J764J235J72l69k23J43N89J204J595J207J89q65
$$ plain form
60978 15374684 13238534 11295280 9611833 8199834 7034570 6077706 5294120 4654008
60970 4654008 4129642 3697319 3340248 3045717 2801073 2594642 2418063 2265020 2129480
60961 2129480 2007234 1897212 1798930 1710082 1628423 1554178 1488483 1430991 1380922 1338720 1304163
60950 1304163 1274066 1244316 1213428 1182119 1150458 1117893 1085466 1055437 1028603 1003942 980831
60939 980831 959761 940706 922555 904558 886937 869754 852363 834368 816162 798231 780624
60928 780624 763217 745905 728666 712069 697379 685267 674688 663933 652604 641653 631738 622523
60916 622523 613511 604555 595578 586672 578451 571468 565311 559146 553122 548307 545144 542840 540469 537914
60902 537914 535599 534016 533668 534732 536496 537731 537903 537534 537311 537454 538043 539247 540842 542049 542238 541373
60886E41373j929l481n410o731o661n500m250l644l748m233m761n135n257n097
60872D75536m686m078l247k186j172p47j171k079k825l066k739j763j89J362J983
60857D48933J330kj077j486j561j800k128j914q94K58P13O45Q06J109O90n04j316
60840D41802j091o35p91j214j436j994l290m325m061l236l225l772l508k376j646
60825D05202j663j404m93Q2k37o59m75j59l41q28j257j791k510k951k775k238
60809C85503j679j243j231j880k570k275j058j45j92n75p12r37j474j703j136
60794C66693l31l8k61o94j295j851j776j015m47o94j292j615j805k128k198j737
60778C47516j297j399j528r11J49P41O48L86K17M2L7N23J298J810J919J845J521
$$ plain form
60886 541373 539444 535963 530553 523822 517161 511661 507411 503767 500019 495786 491025 485890 480633 475536
60872 475536 470850 466772 463525 461339 460167 459420 458249 456170 453345 450279 447540 445777 445588 446950 448933
60857 448933 450263 450261 449184 447698 446137 444337 442209 440295 439401 439659 440372 441017 441823 442932 443622 443118 441802
60840 441802 440711 440076 439285 438071 436635 434641 431351 427026 422965 419729 416504 412732 409224 406848 405202
60825 405202 403539 402135 401642 401724 401487 400828 400353 400194 399853 399025 397768 395977 393467 390516 387741 385503
60809 385503 383824 382581 381350 379470 376900 374625 373567 373422 373230 372655 371943 371006 369532 367829 366693
60794 366693 366362 366324 366063 365369 364074 362223 360447 359432 358985 358291 356999 355384 353579 351451 349253 347516
60778 347516 346219 344820 343292 342381 342530 343271 343919 344305 344522 344564 344601 345124 346422 348232 350151 351996 353517
60761C53517P29j82m29K31J161J603J392Q47L08m4j51j8L24P28R05P52O59J147
60743C63479K119K846K819K202J309J28j396l012m422n439n778n149l858k800
60729C43048k477k492k360k233k380k486k124j522j153r40n05pL5l22m72k58k49
60712C21103p34j103p17N5K39l99j032q74j88J95K9k07j43P9L68R51J723K004
60694C21349J494R77J316K179K562K272J943J699R56k93j061o51N05J664K655
60679C39566L476L734L186K309J738J505J304J102J038J075J213J664K344K520
60665C67774J537k63j857k540k392j897j524j546j848j991j683j157q36p96p11
60650C48270k43O35J633K357K673K832L098L324L137K419J333l2j593k920l432
$$ plain form
60761 353517 354246 354064 353635 353866 355027 356630 358022 358869 359177 359133 358982 358964 359288 360016 360921 361673 362332 363479
60743 363479 365598 368444 371263 373465 374774 374902 373506 370494 366072 360633 354855 349706 345848 343048
60729 343048 340571 338079 335719 333486 331106 328620 326496 324974 323821 322881 322376 322369 322404 322082 321610 321352 321103
60712 321103 320369 319266 318549 318604 318843 318444 317412 316538 316350 316545 316574 316367 316224 316303 316671 317622 319345 321349
60694 321349 322843 323820 325136 327315 329877 332149 334092 335791 336747 336454 335393 334742 335247 336911 339566
60679 339566 343042 346776 349962 352271 354009 355514 356818 357920 358958 360033 361246 362910 365254 367774
60665 367774 369311 369048 367191 364651 362259 360362 358838 357292 355444 353453 351770 350613 349777 348981 348270
60650 348270 348027 348662 350295 352652 355325 358157 361255 364579 367716 370135 371468 371436 369843 366923 363491
60635C63491l054k313j863k138l258m626n011l780j931j010j095r28o9M68P4k98
60619C32659L15J252J291N16M3L10P26P45L88j79p07o74J63J099J159M26l0L80
60601C39882J132J558J761K103K398K218J759J751K476L354L687L462L077K576
60587C73194J696N96j45m06p54j491k051j895j358r52m08P35K037K707K947L683
60571C78135N031O199O931P913R488J1161J2624J4203J5843J6637J5884J3749
60559E13798J0438N811K97m698q082r999j0988j1107j0420r452q353o454l480
60546D47311m21J635K852M027N294O313P168Q175R303J0614J2740J5967J9340
60533E50318K1560K2402K2393K1484J9033J4882R613L916j623o342r822j2198
$$ plain form
60635 363491 360437 358124 356261 354123 350865 346239 341228 337448 335517 334507 333412 332484 332415 332883 332957 332659
60619 332659 332974 334226 335517 336033 336076 336386 337112 337857 338245 338066 337359 336685 336848 337947 339106 339532 339502 339882
60601 339882 341014 342572 344333 346436 348834 351052 352811 354562 357038 360392 364079 367541 370618 373194
60587 373194 374890 375486 375341 374935 374181 372690 370639 368744 367386 366434 366026 366761 368798 371505 374452 378135
60571 378135 383166 389365 396296 404209 413697 424858 437482 451685 467528 484165 500049 513798
60559 513798 524236 530047 530344 525646 517564 507565 496577 485470 475050 465598 457245 450791 447311
60546 447311 446890 448525 451377 455404 460698 467011 474179 482354 491657 502271 515011 530978 550318
60533 550318 571878 594280 616673 638157 657190 672072 681685 685601 683978 677636 667814 655616
60521F55616j3639j3912j3045j1848j0982j0039q329o115m204k837j858j461j654
60508E55693j461Q1K393M041M808N884Q085J1139J4789J9285K4453K9412L3752
60495G12354L8101M2976M7687N0872N1567M9530M5110L9164L2683K6218J9871
60484A156133J3813Q240K872k984r769j7440k5778l4305m2006m7773n1267n2834
60472H96902n2679n0801m7592m3763l9579l4960l0297k6415k3484k0809j7916
60461E08607j5183j3075j1487j0217r374q901q262p111n884n224n140n151m954
60448C98644m543l885k947j944j324j392k056k764k766j690l7J069Q60l87j630
60433C73208k041j672j221j160j235r67m81l45o31p51m26j48k79l43J34P19O68
$$ plain form
60521 655616 641977 628065 615020 603172 592190 582151 573822 567707 563503 560666 558808 557347 555693
60508 555693 554232 554313 556706 560747 565555 571439 579524 590663 605452 624737 649190 678602 712354
60495 712354 750455 793431 841118 891990 943557 993087 1038197 1077361 1110044 1136262 1156133
60484 1156133 1169946 1178186 1181058 1178074 1168305 1150865 1125087 1090782 1048776 1001003 949736 896902
60472 896902 844223 793422 745830 702067 662488 627528 597231 570816 547332 526523 508607
60461 508607 493424 480349 468862 458645 449271 440370 432108 424997 419113 413889 408749 403598 398644
60448 398644 394101 390216 387269 385325 384001 382609 380553 377789 375023 373333 373296 374365 375225 374838 373208
60433 373208 371167 369495 368274 367114 365879 364912 364431 364086 363455 362704 362278 362130 361851 361508 361642 362361 363029
60416C63029P7l35k18L07J178K138K335J217l66r75m55P9O2J24P13J241J187J008
60398C72346J323J929K268K286K186J877J291Q67J094J822K474K687K376J534
60384C98360M91N1P75K124K879K415J278M45L44P25J151J414J552J674J886K243
60368D19807K634K725K182J110N6n25o48n63l41K1L27K82j11m32j49R31K321L080
60350D32707K784K249K737M304N584N507M438L198J839J86j143j415j047j114
60336D60814j751k179k137k208k582k675k237j882k079k468k597k629k787k745
60322D27858k175j461j278j688k042j732q03J40O15R02J797L484N089N855O373
60307D40934P830J0265J2625J4611J7295K1379K5647K7816K6494K1920J5379Q329
$$ plain form
60416 363029 363106 362771 362553 362860 364038 366176 368511 369728 369362 368387 367932 368011 368073 368197 368910 370151 371338 372346
60398 372346 373669 375598 377866 380152 382338 384215 385506 386373 387467 389289 391763 394450 396826 398360
60384 398360 398851 398902 399677 401801 404680 407095 408373 408818 409162 409887 411038 412452 414004 415678 417564 419807
60368 419807 422441 425166 427348 428458 428514 427989 427341 426778 426437 426458 426785 427067 426956 426524 426375 427306 429627 432707
60350 432707 435491 437740 440477 444781 450365 455872 460310 463508 465347 465533 464390 462975 461928 460814
60336 460814 459063 456884 454747 452539 449957 447282 445045 443163 441084 438616 436019 433390 430603 427858
60322 427858 425683 424222 422944 421256 419214 417482 416679 416819 417434 418336 420133 423617 428706 434561 440934
60307 440934 448764 459029 471654 486265 503560 524939 550586 578402 604896 626816 642195 650524
60295F50524J601n056j2277j9596k5090k6974k5291k1636j7524j3558r851o690
60283D68582m544l614l422l061k028q08j97k16k08m9m50j743l059l394k954k731
60267D36104l047l246k880k402k411k717k605j875j154j069j459j637j268o49
60253D07685j67J13J94r7p58j300j166l21Q06J798K389K416J972J413Q96J51q98
60236D15126j630j399n15P1m2l23r3Q20K173L512M277M146L386K585K030J598
60220D35722J151P14M66P30J723L073L989M293M681N528O138N924N626O270P392
60205D93420P630O759N923N889O379P117Q237R301R243P818O117N077M416L545
60191E86871K639K129J884J534J087P24L97K9l50r04j899l098l939m454n297o514
$$ plain form
60295 650524 652125 647069 634792 615196 590106 563132 537841 516205 498681 485123 475272 468582
60283 468582 464038 460424 457002 453941 451913 451105 450908 450692 450484 450435 449985 448242 445183 441789 438835 436104
60267 436104 433057 429811 426931 424529 422118 419401 416796 414921 413767 412698 411239 409602 408334 407685
60253 407685 407518 407631 407825 407728 406970 405670 404504 404183 404989 406787 409176 411592 413564 414977 415873 416024 415126
60236 415126 413496 412097 411582 411653 411611 411288 411195 412015 414188 417700 421977 426123 429509 432094 434124 435722
60220 435722 436873 437587 438053 438783 440506 443579 447568 451861 456542 462070 468208 474132 479758 486028 493420
60205 493420 501050 507809 513732 519621 526000 533117 541354 550655 559898 567716 573833 578910 583326 586871
60191 586871 589510 591639 593523 595057 596144 596868 597265 597294 596944 596040 594141 591043 587104 582650 577353 570839
60175E70839p145o507n176m153l680l395l137l002l008l104l212l058k387j533
60161E18342j215j537j832j692j434j290r05j21N10N38L90P69J673K521K847K531
60145E20095J753J078J105J761K362K579K771L198L672M204N241O793Q111Q673
60131E73396Q822Q978Q961Q636Q392Q350P743N908L325R81q25k311l355l571k988
60116F30442k023r95j04M36P40J254K066K563K275J607J225J090O93r9r54j640
60100F38576k235k972m049n342o174n923m935m227m122l870k917j699p41Q4R23
60085E90377J382J330J464K312L305L629L373L172L203L311L513L709L326K023
60071F29429K39j557l601o158q683j0456j1467j1969j1768j0752r579q841q187
$$ plain form
60175 570839 563694 557187 552011 547858 544178 540783 537646 534644 531636 528532 525320 522262 519875 518342
60161 518342 517127 515590 513758 512066 510632 509342 508437 508316 508826 509364 509754 510523 512196 514717 517564 520095
60145 520095 521848 522926 524031 525792 528154 530733 533504 536702 540374 544578 549819 556612 564723 573396
60131 573396 582218 591196 600157 608793 617185 625535 633278 639186 642511 643492 642667 640356 637001 633430 630442
60116 630442 628419 627424 627320 627756 628496 629750 631816 634379 636654 638261 639486 640576 641269 641170 640216 638576
60100 638576 636341 633369 629320 623978 617804 611881 606946 602719 598597 594727 591810 590111 589370 589454 590377
60085 590377 591759 593089 594553 596865 600170 603799 607172 610344 613547 616858 620371 624080 627406 629429
60071 629429 629668 628111 624510 618352 609669 599213 587746 575777 564009 553257 543678 534837 526650
60058E26650p121o202o292p049p228o371n136m103l168k121j054j26N76J026J491
60043D73772K434L765M666M701M503M769N208N273N187N318N206M298L133K580
60029E34813K329J394k17j547k228k720l192l385l564m395n707o549o590o491
60015D91951o764p207p613p994q019p215n903m993m665m194l325k747k865l032
60001D15415k531j556p35k84k8K52P62J527K097J937J274R49J340K012K606L323
59985D28360M298N108N309M997M505L936L245K503J907J630J687J674R19p31k450
59970D66897l244l028k434j828j162n56k70j06M42J542L064N023P268Q943R239
59955D89790Q522P812P152N646L108N98j066k242l419m224m127l506l180l334
$$ plain form
60058 526650 519529 513327 507035 499986 492758 486387 481251 477148 473980 471859 470805 470679 471255 472281 473772
60043 473772 476206 479971 484637 489338 493841 498610 503818 509091 514278 519596 524802 529100 532233 534813
60029 534813 537142 538536 538319 536772 534544 531824 528632 525247 521683 517288 511581 505032 498442 491951
60015 491951 485187 477980 470367 462373 454354 447139 441236 436243 431578 427384 424059 421312 418447 415415
60001 415415 412884 411328 410593 410309 410281 410533 411295 412822 414919 416856 418130 419079 420419 422431 425037 428360
59985 428360 432658 437766 443075 448072 452577 456513 459758 462261 464168 465798 467485 469159 470078 469347 466897
59970 466897 463653 460625 458191 456363 455201 454645 454375 454269 454711 456253 459317 464340 471608 480551 489790
59955 489790 498312 506124 513276 518922 522030 522628 521562 519320 515901 511677 507550 504044 500864 497530
59941D97530l405k899j887q80m51q07j655k502l010k906j986o35J44o3k88O00
59925D74900K179L075L060L295M370N434N657N419N419N603N608N560N696N824
59911E41099N747N668N667N312M417L656L838M855N874O190N519L909J880L09
59897F03940m09p97j520k473l163l639m379n319n621m604k551l48J475L009M386
59882E77987N235N155M500M239M810N615N958N967O074O124N683M963M488M073
59868F50871K999J234l29j085j349j628j937k169k461k867l143l172l137l055
59854F28772k661j964j457j388j244l24J436L420M808M907L391N55k702n325o593
59839F23631o281m623k193K49J734J225j606n493q212q670p831p114o588n536
$$ plain form
59941 497530 494125 491226 489339 488459 488008 487201 485546 483044 480034 477128 475142 474507 474651 474588 474300 474900
59925 474900 477079 480154 483214 486509 490879 496313 501970 507389 512808 518411 524019 529579 535275 541099
59911 541099 546846 552514 558181 563493 567910 571566 575404 580259 586133 592323 597842 601751 603631 603940
59897 603940 603531 602734 601214 598741 595578 591939 587560 582241 576620 572016 569465 569117 570592 573601 577987
59882 577987 583222 588377 592877 597116 601926 607541 613499 619466 625540 631664 637347 642310 646798 650871
59868 650871 653870 655104 654775 653690 652341 650713 648776 646607 644146 641279 638136 634964 631827 628772
59854 628772 626111 624147 622690 621302 620058 619734 621170 624590 629398 634305 637696 638251 635549 630224 623631
59839 623631 617350 612727 610534 610783 612517 613742 612136 606643 598431 589761 581930 574816 568228 562692
59825E62692m063k917k153j280m97n02j083j220p63p07j467k147k035j681j814
59810E38363k122j905j236p63q48j385k091k613k777k937l560m352m496l886l321
59795E00071l205k986k283j654j645j865j697j244q80m51L07R79R14K33l08l36
59779D83950j21L3J46K64K31k0j69K16J090J796J811J481J544J939J859J225J188
59762D98463K456M069M754M719M876N025M357L342L379M600N799O563P758R513
59748E69673J0584J0418J0215J1002J2091J2385J1954J1306J0255Q605O960N792
59736F91240M552K710P86n87j808l381m715m989m643m798n580o106n864n154m407
59721F47256l872l778m109m482m680m929n237n074m256l438l114k847k196j670
$$ plain form
59825 562692 558629 555712 553559 552279 551782 551280 550197 548977 548214 547507 546040 543893 541858 540177 538363
59810 538363 536241 534336 533100 532337 531489 530104 528013 525400 522623 519686 516126 511774 507278 503392 500071
59795 500071 496866 493880 491597 489943 488298 486433 484736 483492 482612 482161 482468 483447 484361 484594 484286 483950
59779 483950 483829 483862 484008 484272 484503 484483 484314 484530 485620 487416 489227 490708 492252 494191 496050 497275 498463
59762 498463 500919 504988 509742 514461 519337 524362 528719 532061 535440 540040 545839 552402 560160 569673
59748 569673 580257 590675 600890 611892 623983 636368 648322 659628 669883 678488 685448 691240
59736 691240 695792 698502 699288 698701 696893 693512 688797 683808 679165 674367 668787 662681 656817 651663 647256
59721 647256 643384 639606 635497 631015 626335 621406 616169 611095 606839 603401 600287 597440 595244 593574
59707E93574j898k469k559k136j621r30J55J135J374J191J375J930K283K450K988
59692E96842L946M801N295N425M777K830P9k088k794k445j977j913k196k520k629
59677F05433k559k560k672k681k675l168m366n721o630p052p084o547n521m724
59663E41473m652m825m510l711k772j603o0J356K037K161K330K615K785L015L555
59648E39194L987L744L086K755K788K540J747P18m01j714k977l697l946m288m909
59633E38627n395n414n027m304l248k182j633j718k067k358k595k874l206l531
59619D93075l602l089k131j572k138l481m489m496l905l574l849m110l279j008
59605D48352J635L109L045K394J936J503Q67L94K48j22r24j314n91N90J109R54
$$ plain form
59707 593574 591676 589207 586648 584512 582891 581961 582116 583251 584625 585816 587191 589121 591404 593854 596842
59692 596842 600788 605589 610884 616309 621086 623916 623995 621907 619113 616668 614691 612778 610582 608062 605433
59677 605433 602874 600314 597642 594961 592286 589118 584752 579031 572401 565349 558265 551718 546197 541473
59663 541473 536821 531996 527486 523775 521003 519400 519340 520696 522733 524894 527224 529839 532624 535639 539194
59648 539194 543181 546925 550011 552766 555554 558094 559841 560559 560158 558444 555467 551770 547824 543536 538627
59633 538627 533232 527818 522791 518487 515239 513057 511424 509706 507639 505281 502686 499812 496606 493075
59619 493075 489473 486384 484253 482681 480543 477062 472573 468077 464172 460598 456749 452639 449360 448352
59605 448352 449987 453096 456141 458535 460471 461974 462841 463235 463483 463361 462437 461123 460532 461122 462231 463185
59589D63185R19J225J410J291J103Q55L21m42j190j894k494k608k096j555j597
59574D56433k069k504k915l449l753l452k833k304j666o52K62M75K21R0P7l4J02
59557D32029P97J417J197N94O78J384J579Q61J87N04J663K855L524L620L476L487
59541D59852L810M519O014Q593J1599J4201J7217K2274K8004K9017K1068O551
59529F32719p276j5194j7346j6362j3898j0546o895l384j62K257L145K754K265
59516E52077K194J895R50j19r06j776k967m037m791n771p221q390q471p675o802
59501D98190o266n954n610n013m092l087k301j697j133q41j075j397j065j10N92
59486D59141M48j80m95PJ202K391K879K873L309M467N423N529N529O236O963O562
$$ plain form
59589 463185 464104 465329 466739 468030 469133 469988 470309 469867 468677 466783 464289 461681 459585 458030 456433
59574 456433 454364 451860 448945 445496 441743 438291 435458 433154 431488 430836 431098 431573 431794 431884 431961 431927 432029
59557 432029 432826 434243 435440 436034 436712 438096 439675 440536 440723 441227 442890 445745 449269 452889 456365 459852
59541 459852 463662 468181 474195 482788 494387 508588 525805 548079 576083 605100 626168 632719
59529 632719 625443 610249 592903 576541 562643 552097 545202 541818 541656 543913 547058 549812 552077
59516 552077 554271 556166 557116 556997 556091 554315 551348 547311 542520 536749 529528 521138 512667 504992 498190
59501 498190 491924 485970 480360 475347 471255 468168 465867 464170 463037 462196 461121 459724 458659 458549 459141
59486 459141 459589 459409 458914 458921 460123 462514 465393 468266 471575 476042 481465 486994 492523 498759 505722 512284
59470E12284N325M428L980L180J997J161O97N4m66k4J019J344Q41P97J756K768
59454E41141L267M047N749P693Q929R428R656R911J0433J1248J1606J0530Q101
59441F51739N242K282j130m746p649r505j0587j0616r162p139o156o239n971n086
59427E75277m886n625n672m060j931l89J122L269N447P196R323J2386J5567J8176
59413F25200K0659K3212K5346K7976L3231L9879M1321L1580J2493p546k1380k7244
59401H24727k6589k1435j4199o760J451J2060K3109K8058K1477M970j3839k7596
59389H05434l3639l3407k9640k4612j9764j5736j2495r721p382n771m935m286
59377F04046l214j936j142p91o0J385K715L019K406J615J113J053J534K309K694
$$ plain form
59470 512284 517609 522037 526017 529197 531194 532355 533052 533106 532640 532616 533635 534979 535820 536617 538373 541141
59454 541141 544408 548455 554204 561897 570826 580254 589910 599821 610254 621502 633108 643638 651739
59441 651739 656981 659263 658133 653387 645738 636233 625646 615030 605868 598729 592573 586334 580363 575277
59427 575277 570391 564766 559094 555034 553103 552714 553836 557105 562552 569748 579071 591457 607024 625200
59413 625200 645859 669071 694417 722393 755624 795503 836824 868404 880897 873351 851971 824727
59401 824727 798138 776703 762504 755744 757195 769255 792364 820422 841899 846869 833030 805434
59389 805434 771795 738388 708748 684136 664372 648636 636141 626420 619038 613267 608332 604046
59377 604046 600832 598896 597754 596963 596903 598288 601003 604022 606428 608043 609156 610209 611743 614052 616746
59362F16746K279J461R01Q68J441K670M117M831M493M041M570O005P476Q567R550
59347F80016J0711J2063J3547J5040J6346J7402J8226J8478J7664J6004J4469
59336H49966J3553J2584J0667P698M022j08m258p639r950j1763j3501j4655j4763
59323H21853j4452j4604j4953j4504j3093j1606j0737j0282r721q837p703o523
59311F84838n566m940m461l881l169k355j306K42K542N721R653J3826J7451J9405
59297G28000J8024J1865J643r137j6713k0152k1064k0753j9242j6790j4434j2398
59285F08849r808o622m324l755l725k778j090M33J709L027M087M739N668P338
59271F03748R086J0322J1603J3458J5162J5856J5903J5843J5050J2876J0199Q292
$$ plain form
59362 616746 619025 620486 621387 622255 623696 626366 630483 635314 639807 643848 648418 654423 661899 670466 680016
59347 680016 690727 702790 716337 731377 747723 765125 783351 801829 819493 835497 849966
59336 849966 863519 876103 886770 894468 898490 898382 894124 886485 876535 864772 851271 836616 821853
59323 821853 807401 792797 777844 763340 750247 738641 727904 717622 707901 699064 691361 684838
59311 684838 679272 674332 669871 665990 662821 660466 659160 659402 661944 667665 677318 691144 708595 728000
59297 728000 746024 757889 759532 750395 733682 713530 692466 671713 652471 635681 621247 608849
59285 608849 599041 592419 588095 584340 580615 577837 576747 577180 578889 581916 586003 590742 596410 603748
59271 603748 612834 623156 634759 648217 663379 679235 695138 710981 726031 738907 749106 757398
59259G57398O747M155L61l396o232q079q818q424p685p522p642p103n896m832
59245F93032m171l563l032k793k389j281o7K45k2M36J877L178L544L292K804J973
59229F93063R08J68L4K84P47J198R29n83k658m103m834n648o528o463n209l992
59213F57313l978n029o322p349p853p647o962o434o277n964n002l596k387j852
59199E80661k033k499k594k119j602j530j493p08Q14K220K858K806K458K138K070
59184E81447K291K628L059L793M780N562N966O298O461N728M095K922L290M375
59170F42695M629L932L361L383L615L977M708N347N085M063L187K704K118J420
59156F94224J057P32m18k298l858m811o095q166j0063j0755j0424r866r432r112
$$ plain form
59259 757398 764145 768300 768661 765265 759033 750954 742136 733712 726027 718505 710863 703760 697864 693032
59245 693032 688861 685298 682266 679473 677084 675803 675736 675981 675959 676395 678272 681450 684994 688286 691090 693063
59229 693063 693971 694139 694173 694457 695204 696402 697331 696748 694090 689987 685153 679505 672977 666514 661305 657313
59213 657313 653335 648306 641984 634635 626782 619135 612173 605739 599462 593498 588496 584900 582513 580661
59199 580661 578628 576129 573535 571416 569814 568284 566791 566083 566897 569117 571975 574781 577239 579377 581447
59184 581447 583738 586366 589425 593218 597998 603560 609526 615824 622285 628013 632108 635030 638320 642695
59170 642695 647324 651256 654617 658000 661615 665592 670300 675647 680732 684795 687982 690686 692804 694224
59156 694224 695281 696013 695595 693297 689439 684628 678533 670367 660304 649549 639125 629259 619827 610715
59142F10715q903q591p779o533n497n035m790m382l974l848l868l696l201k476
59128E38142j713j111o36L5J082K242L263M313N484O348O632O932P957R358J0158
59113E98486J0058R584R109Q639Q387Q583Q758Q112O660N318M733M676M496L710
59099F99309K247O82q9M9Q7p64j935k514k686l140l618l327k350j426o32L88J111
59082F81392N33j226l040m443n829p055p361o869o719p394q163q430q355p919
59068E99122o682m954l908m015m419m391m279m541m836m635l938l017k225k237
59054E41045l400m619m166k050l11l66j228j257n08k13p27j181q93j34M66O60
59038E21118P07J051J835K621K789K284J652J408J748K711M075N234N790O194
$$ plain form
59142 610715 601812 593221 585442 578909 573412 568377 563587 559205 555231 551383 547515 543819 540618 538142
59128 538142 536429 535318 534682 534717 535799 538041 541304 545617 551101 557449 564081 571013 578970 588328 598486
59113 598486 608544 618128 627237 635876 644263 652846 661604 669716 676376 681694 686427 691103 695599 699309
59099 699309 701556 702238 702149 702198 702285 701521 699586 697072 694386 691246 687628 684301 681951 680525 679893 680281 681392
59082 681392 681925 680699 677659 673216 667387 660332 652971 646102 639383 631989 623826 615396 607041 599122
59068 599122 592440 587486 583578 579563 575144 570753 566474 561933 557097 552462 548524 545507 543282 541045
59054 541045 537645 533026 528860 526810 526499 526133 524905 523648 523140 522927 522200 521019 520126 519992 520458 521118
59038 521118 521825 522876 524711 527332 530121 532405 534057 535465 537213 539924 543999 549233 555023 561217
59024E61217P224Q946J0879J2944J5411J8015J9988K1027K1380K1038J9674J7349
59012G55092J4300J0220M726j383o472r787j1842j3009j2925j1537r646p908o157
58999F93672m065j719O53K824M307M655M134L320K217O57o60q35m05q71k459l704
58983G01721l676l200l359m029m529m588m044k600m91J442K877M334O031P443
58969F93332Q401R531J1005J1966J1834J1259J1084J1274J1490J1812J2157J1812
58957H26957J0332Q280O273L993Q23k981o480r109j1020j2631j4151j5320j5555
58944G69411j4754j3722j3236j2860j1564r442p669o749n922m573l131k150j506
58931F62133j004p78o87j71Q34J666K009K364L038L469L061J984P48l75j245j829
$$ plain form
59024 561217 568441 577387 588266 601210 616621 634636 654624 675651 697031 718069 737743 755092
59012 755092 769392 779612 784338 782955 776483 766696 754854 741845 728920 717383 707737 699829 693672
58999 693672 689607 687888 688541 691365 695672 700327 704461 707781 709998 710655 709995 709160 708755 707884 705425 701721
58983 701721 698045 694845 691486 687457 682928 678340 674296 671696 671205 672647 675524 679858 685889 693332
58969 693332 701733 711264 722269 734235 746069 757328 768412 779686 791176 802988 815145 826957
58957 826957 837289 845569 851842 855835 856658 853677 847197 838088 827068 814437 800286 784966 769411
58944 769411 754657 740935 727699 714839 703275 693833 686164 679415 673493 668920 665789 663639 662133
58931 662133 661129 660351 659664 659493 660327 661993 664002 666366 669404 672873 675934 677918 678666 678291 677046 675217
58915F75217k430l346m228m443m047l598l132k226r32L33J614L100M279M736N442
58900F66339P674J0793J2819J3223J3256J3444J2829J1128R606Q998Q463P617
58888G96189P658R459J2032J4118J5849J7693J9043J9157J8305J6934J4641J1121
58876I72199P108L503M11k250m261n965q396j1649j4313j5344j5389j5299j4637
58863H75718j2768j0383q718q040p822p736p663p546p696q454r131q525o844n697
58849G58695n625n315l973k664k263j867o11N37L16r18k345m389p552j0690j2257
58834F99079j2440j2449j2413j1605j0144q898q044p025n620m071k549j280o99
58821F01842o77l34P12J807K488L216M085M208L291K542K870L475L331K803K523
$$ plain form
58915 675217 672787 669441 665213 660770 656723 653125 649993 647767 646835 647168 648782 651882 656161 660897 666339
58900 666339 674013 684806 697625 710848 724104 737548 750377 761505 771111 780109 788572 796189
58888 796189 803847 813306 825338 839456 855305 872998 892041 911198 929503 946437 961078 972199
58876 972199 979307 982810 983221 980971 976710 970745 962349 950700 936387 921043 905654 890355 875718
58863 875718 862950 852567 843849 835809 827987 820251 812588 805042 797346 788892 779761 771236 764392 758695
58849 758695 753070 747755 743782 741118 738855 736988 736377 736914 737230 736312 733967 729578 722026 711336 699079
58834 699079 686639 674190 661777 650172 640028 631130 623086 616061 610441 606370 603821 602541 601842
58821 601842 601165 600831 601543 603350 605838 609054 613139 617347 620638 623180 626050 629525 632856 635659 638182
58806F38182K031R17O9J60J10j254l101l875l762m053m892n430n684o355p214
58791E95849p325o630n903n327m449l305k413j869j397r64m98M63K040L551M506
58776E66329N278O026O000M855L552K806J869m7k146l271l666m195m742m784m635
58761E69229m732m552l558k320j464n52P52J559J254R82K011L695M644M833M898
58746E76679M424K807Q65k02o27j162j262m0J859L218M197N436O113N058L104
58731F10467K186K579K992K958L091L399L236K756K647K695K198J408R35L85q01
58716F43131j706r41J167L131M422N415N914N551N004M987M655K962P84l41q69
58701F83266k412m868o753p955r686j1967j3451j3774j3886j4052j3619j2743
$$ plain form
58806 638182 640213 641130 641199 641359 641469 640215 637114 633239 629477 625424 620532 615102 609418 603063 595849
58791 595849 588524 581894 575991 570664 566215 562910 560497 558628 557231 556267 555769 556232 558272 561823 566329
58776 566329 571607 577633 583633 588488 592040 594846 596715 596668 594522 591251 587585 583390 578648 573864 569229
58761 569229 564497 559945 556387 554067 552603 552051 552803 554362 555616 556598 558609 562304 566948 571781 576679
58746 576679 581103 583910 584775 584573 583946 582784 581522 581482 583341 586559 590756 596192 602305 607363 610467
58731 610467 612653 615232 618224 621182 624273 627672 630908 633664 636311 639006 641204 642612 643547 643932 643131
58716 643131 641425 640484 641651 644782 649204 654619 660533 666084 671088 676075 680730 683692 684476 684135 683266
58701 683266 680854 675986 669233 661278 651592 639625 626174 612400 598514 584462 570843 558100
58689E58100j2261j1892j0522q331o625n666m597l512l437m235m505l789l031
58676D75697k684k175j428j096j161q68j65L21O59J502K782L980N347P276Q926
58661D96913R251Q822Q817Q760P259M481J778n83l051m775m499l154k945l996
58647E23078m429l758l446l957l960k918j938j549r64j01m2q38j073k33N59P69
58631D95200J304K472L079K354J104K56k26m61k67J6k86q87q82l10M0K13P91J428
58613E04938J481J732L390N637O424N537M617M317L801L000K850L205K910K059
58599E55898J837K061J369q5p45n92j213k672l076j805n13k20P2J146K418L644
58583E57524N473P654Q914R173R641J0351J0022Q699P996Q226P880O514N566N685
$$ plain form
58689 558100 545839 533947 523425 515094 508469 502803 498206 494694 491257 487022 482517 478728 475697
58676 475697 473013 470838 469410 468314 467153 466285 466120 466441 467100 468602 471384 475364 480711 487987 496913
58661 496913 506164 514986 523803 532563 539822 544303 546081 545498 542447 537672 533173 530019 527074 523078
58647 523078 518649 514891 511445 507488 503528 500610 498672 497123 496159 496058 496016 495178 494105 493872 494431 495200
58631 495200 496504 498976 502055 504409 505513 505769 505543 505082 504815 504831 504545 503658 502776 502466 502506 502719 503510 504938
58613 504938 506419 508151 511541 517178 523602 529139 533756 538073 541874 544874 547724 550929 553839 555898
58599 555898 557735 559796 561165 561080 560335 559743 558530 555858 552782 550977 550464 550244 550316 551462 553880 557524
58583 557524 562997 570651 579565 588738 598379 608730 618752 627451 635447 643673 651553 658067 663633 669318
58569F69318N869N883O890Q945J0466J1024J2153J4596J7234J9466K2080K4985
58557H28909K6710K6897K6784K6408K4059J9314J3887Q733L076k808o831q233
58545I86905q686r188q638o644m900m486m558m935p163j1594j6085j9055k1291
58532H59682k3424k4227k2951k0783j8621j5788j2272r634q383o966m661k944
58520F89028k691k646j969j618j994j964j427k004l753m272k557p92p50j318j266
58505F58007j381k131k189j233j129k498l065j489K09J80l22K42R19O68O56J710
58489F47154K292J487J268L160N303N567N005N519O515O792P456R944J3080J4871
58475G35413J5590J6581J7645J7899J7546J6629J3864Q716K926j876o065r944
$$ plain form
58569 669318 675187 681070 687960 696905 707371 718395 730548 745144 762378 781844 803924 828909
58557 828909 855619 882516 909300 935708 959767 979081 992968 1001701 1004777 1001969 995138 986905
58545 986905 978219 969031 960393 953749 948849 944363 939805 934870 927707 916113 900028 880973 859682
58532 859682 836258 812031 789080 768297 749676 733888 721616 711982 703599 696633 691972 689028
58520 689028 686337 683691 681722 680104 678110 676146 674719 672715 668962 664690 662133 661341 660591 659273 658007
58505 658007 656626 654495 652306 651073 649944 647446 644381 642892 643101 643281 642959 643201 644120 644788 645444 647154
58489 647154 649446 650933 652201 655361 660664 666231 671236 676755 683270 690062 697518 707462 720542 735413
58475 735413 751003 767584 785229 803128 820674 837303 851167 859883 862809 860933 854868 844924
58463H44924j2141j1961j0951j0207q579n389k352o84J065M192P497R817J2081
58450H17312J4726J5874J4446J2249J0629Q053L375j594n282q898j3012j5052
58438H52826j3390j0719r913r538p133l983k721k629j374O72J684K114L572N598
58424H05066O850P888R759J1531J2051J2264J2965J2481R374N307K313m08m097
58411I03344p355q564q962j0161j0994r996q548q382q457p377o361o589o384m303
58397G90911k200j839j384J085L630L883L371M342N330M144K441K772L716K606
58383H22808O68Q05K436L166L503N377P944R247J0065J1860J3035J1584R369R254
58369I21121J0191R511P945P863Q675Q547Q516J0330J2354J2259J1630J3251J5944
$$ plain form
58463 844924 832783 820822 809871 799664 791085 785696 783344 782660 783725 787917 795414 805231 817312
58450 817312 832038 847912 862358 874607 885236 893289 896664 895070 889788 880890 867878 852826
58438 852826 839436 828717 818804 809266 802133 798150 795429 792800 791426 792098 793782 795896 799468 805066
58424 805066 811916 819804 829563 841094 853145 865409 878374 890855 900229 905536 907849 907441 903344
58411 903344 895989 887425 878463 868302 857308 847312 838764 830382 821925 814548 808187 801598 795214 790911
58397 790911 788711 786872 785488 786573 790203 794086 797457 801799 807129 811273 813714 816486 820202 822808
58383 822808 823476 824281 826717 829883 833386 838763 846707 855954 866019 877879 890914 902498 911867 921121
58369 921121 931312 940823 948768 956631 965306 973853 982369 992699 1005053 1017312 1028942 1042193 1058137
58356A058137J6749J6146J6314J6463J4602J1856J0276Q659N191J827J237J872
58344A179329J012R8J854M805N956O339Q481J0978J1166J0587J2159J4493J4780
58331A282037J4571J6758J9556J9636J8502J9472K0965J9401J6125J4815J4493
58320A476331J1950Q574P861Q503P007M793N452P442O831N039O296R653J1144
58307A576876J1593J4474J8248J8817J7542J8725K1249K1022J9485K1051K4098
58296A783180K3539K0584K0835K4052K5030K3407K3494K5436K5623K4841K6983
58285B047004L0697L1343L0030L1604L5115L5614L3946L5136L8568L9591L9321
58274B427969M2565M7586M8481M6358M7408N1332N2628N1979N4908O0403O2516
$$ plain form
58356 1058137 1074886 1091032 1107346 1123809 1138411 1150267 1160543 1169202 1174393 1176220 1177457 1179329
58344 1179329 1180341 1180439 1182293 1187098 1193054 1199393 1207874 1218852 1230018 1240605 1252764 1267257 1282037
58331 1282037 1296608 1313366 1332922 1352558 1371060 1390532 1411497 1430898 1447023 1461838 1476331
58320 1476331 1488281 1496855 1504716 1513219 1520226 1525019 1530471 1537913 1544744 1549783 1556079 1565732 1576876
58307 1576876 1588469 1602943 1621191 1640008 1657550 1676275 1697524 1718546 1738031 1759082 1783180
58296 1783180 1806719 1827303 1848138 1872190 1897220 1920627 1944121 1969557 1995180 2020021 2047004
58285 2047004 2077701 2109044 2139074 2170678 2205793 2241407 2275353 2310489 2349057 2388648 2427969
58274 2427969 2470534 2518120 2566601 2612959 2660367 2711699 2764327 2816306 2871214 2931617 2994133
58263B994133O2135O5293P1019P2981P2071P4789Q0344Q2269Q1595Q4996R0957
58252C832582R1740Q8293Q8901R3781R5787R5589J00872J10768J16821J19202
58242D834336J25998J36704J43024J45882J54328J67605J76196J80699J91099
58233F255871K07131K18748K26427K40797K61517K77635K89686L09418L36529
58224H623759L58881L77118M04749M42149M75899N06130N47560O00953O51774
58215A2988972P00289P63048Q41106R18624R97269J098344J225833J363180J512113
58206B2408778J695937J917955K158643K422588K744613L142099L610883M177948
58198D4279444M904080N824059O946199Q324959J0066600J2251251J4932554J8231242
$$ plain form
58263 2994133 3056268 3121561 3192580 3265561 3337632 3412421 3492765 3575034 3656629 3741625 3832582
58252 3832582 3924322 4012615 4101516 4195297 4291084 4386673 4487545 4598313 4715134 4834336
58242 4834336 4960334 5097038 5240062 5385944 5540272 5707877 5884073 6064772 6255871
58233 6255871 6463002 6681750 6908177 7148974 7410491 7688126 7977812 8287230 8623759
58224 8623759 8982640 9359758 9764507 10206656 10682555 11188685 11736245 12337198 12988972
58215 12988972 13689261 14452309 15293415 16212039 17209308 18307652 19533485 20896665 22408778
58206 22408778 24104715 26022670 28181313 30603901 33348514 36490613 40101496 44279444
58198 44279444 49183524 55007583 61953782 70278741 80345341 92596592 107529146 125760388
58190A25760388K2326457K7314198L3131379L9486978M5456353M8936539M6966787
58183C89379079L7426861K0919598R49426j7931309l2340898m0975704m4179312
58176C13247741m3173967l9510897l4639122k9566349k4811184k0607940j7063678
58169A03874604j4163866j1795535r851007q273895p004886n958272n074942m342309
58161C7409892l743836l237855k799819k437660k149071j904536j685909j503037
58153A7948169j358729j232570j111988j006545r19433q35470p48665o72975o14563
58144I447231n60042n02307m52370m15890l82553l48322l24426l14334l04065
58135E842922k85127k66206k53075k37552k15698j97307j87646j77906j62816
$$ plain form
58190 125760388 148086845 175401043 208532422 248019400 293475753 342412292 389379079
58183 389379079 426805940 447725538 448674964 430743655 398402757 357427053 313247741
58176 313247741 270073774 230562877 195923755 166357406 141546222 120938282 103874604
58169 103874604 89710738 77915203 68064196 59790301 52785415 46827143 41752201 37409892
58161 37409892 33666056 30428201 27628382 25190722 23041651 21137115 19451206 17948169
58153 17948169 16589440 15356870 14244882 13238337 12318904 11483434 10734769 10061794 9447231
58144 9447231 8887189 8384882 7932512 7516622 7134069 6785747 6461321 6146987 5842922
58135 5842922 5557795 5291589 5038514 4800962 4585264 4387957 4200311 4022405 3859589
58126C859589j50271j44729j38124j25952j16112j13106j09137r9516r1676r0435
58116B680531q8742q1716p5924p6138p6047p0604o5136o4044o2337n6349n1394
58105A912100n1087n0132m5053m1357m2772m3910m0680l7782l8846l9213l5433
58094A445835l2261l3233l3695k9975k6417k6622k6584k3126k0406k1553k2279
58083A149684j9370j7233j9448k1825k0388j8616k0210k2032k0629j8758j9302
58072I31873j9449j6917j5248j7078j8654j6683j4314j4721j5183j2971j0760
58061G59895j0809j0014o272l545n165q029q731r380j2071j3701j1897j0168j1514
58048F38599j2578r868o298n830o666n558l929m201m655l261k204l508m673l515
$$ plain form
58126 3859589 3709318 3564589 3426465 3300513 3184401 3071295 2962158 2862642 2770966 2680531
58116 2680531 2591789 2510073 2434149 2358011 2281964 2211360 2146224 2082180 2019843 1963494 1912100
58105 1912100 1861013 1810881 1765828 1724471 1681699 1637789 1597109 1559327 1520481 1481268 1445835
58094 1445835 1413574 1380341 1346646 1316671 1290254 1263632 1237048 1213922 1193516 1171963 1149684
58083 1149684 1130314 1113081 1093633 1071808 1051420 1032804 1012594 990562 969933 951175 931873
58072 931873 912424 895507 880259 863181 844527 827844 813530 798809 783626 770655 759895
58061 759895 749086 739072 732800 729255 724090 716061 707330 697950 685879 672178 660281 650113 638599
58048 638599 626021 616153 609855 604025 597359 591801 587872 583671 579016 575755 573551 570043 565370 561855
58034E61855k720m676o606n757m781o730r365r686r597j1709j3691j2355r492
58021D54690q348p995o276m738n533o774n919m419m460m516k787j446k721m211
58007C84547k965q89j288l053l155k041j905k298j764j168j429q67J405K740J511
57992C67381Q02L268O091N643L560L225L590J838q08j387p95j854l899m320l623
57977C78712m075n114m688l540l699m358l493j927j739k274j689p12r63j385j87
57962C38869J488J604J004J475K042J063j42K86Q14r39l663m530m005m334n028
57947C26004m099k206j364j047M11K015J779Q13J643L777M898N176O397Q089Q509
57932C60795Q387R660J1447J1136Q688O189M067J292j607l224m116n619o908o491
$$ plain form
58034 561855 559135 554459 547853 542096 537315 530585 521220 511534 501937 490228 476537 464182 454690
58021 454690 446342 438347 432071 427333 421800 415026 409107 404688 400228 395712 392925 391479 388758 384547
58007 384547 381582 380693 379405 376352 373197 371156 369251 366953 365189 364021 362592 361725 363130 365870 367381
57992 367381 368183 371451 377542 383185 386745 389970 393560 395398 394590 393203 392408 390554 386655 382335 378712
57977 378712 374637 369523 364835 361295 357596 353238 349745 347818 346079 343805 342116 341404 340441 339056 338869
57962 338869 340357 341961 342965 344440 346482 347545 347403 347689 348503 347564 343901 339371 335366 331032 326004
57947 326004 321905 319699 318335 317288 317699 319714 321493 322306 323949 327726 332624 337800 344197 352286 360795
57932 360795 369182 378842 390289 401425 410113 416302 420369 421661 420054 416830 412714 407095 400187 393696
57918C93696n398n475n897m830l232l244m148l701k288j962k368j593p0K66j59
57903C49597N55J827J412m16j358j239j867l216l568l012l139l549k381j01Q27
57888C30372oo74n66r12j736j560k86O59R41J258J077n83k495k517j098m46p04
57871C20724k22Q22O17o60r88k04k13j345j799r41j00K55J088K386K965K943L619
57854C28947M862N222M686M588M883M249K792J855J295k30k379l377l050k802
57840C51541k879k481k278l612n432n275l326k187k616k799k119k038k806k690
57826C09003j296m54q94j021Q1J217J565J898K425K027O05k36J62M52l42j481
57810C13711k314l329m667n434n203m519l672k628k041k498k993k242j070j107
$$ plain form
57918 393696 388298 382823 376926 372096 368864 365620 361472 357771 355483 353521 351153 349560 349490 349756 349597
57903 349597 350152 351979 353391 352975 351617 350378 348511 345295 341727 338715 335576 332027 329646 329545 330372
57888 330372 330366 329692 329126 328214 326478 324918 324632 325291 326232 327490 328567 327984 325489 322972 321874 321428 320724
57871 320724 320502 321324 321941 321281 320293 320089 319876 318531 316732 315791 315691 315946 317034 319420 322385 325328 328947
57854 328947 333809 339031 343717 348305 353188 357437 360229 362084 363379 363149 360770 357393 354343 351541
57840 351541 348662 346181 343903 340291 334859 329584 326258 324071 321455 318656 316537 314499 311693 309003
57826 309003 307707 307253 306359 305338 305419 306636 308201 310099 312524 314551 315156 314920 315082 315534 315192 313711
57810 313711 311397 308068 303401 297967 292764 288245 284573 281945 279904 277406 274413 272171 271101 269994
57796B69994j694q10J244K275K103K705M276M602L005J649J976K886L411M266
57782C01888N652O235N595N191N760O127N605N216N496N447M645M113M086L231
57768C74287J177n00q92j211k468l842m493n041n966o439n901n158m946m925m895
57753C18787n306n888n478l811j847J1K184M117M418L247K403K489K234J113L32
57738C19005N06P82R36J901L443L800K634J872K516L140K724K474L312L910K960
57723C55915J405P22O69L21k15n33r30j427j267l97%n75j079q92r32j806k589
57706C46390k540k421k984l652l739l519l216k425j317q35j005o92K98P42K70
57691C19355J25P90R62j37j348j542j141o80K01J380J832J574K095L801N191N640
$$ plain form
57796 269994 268300 267490 268734 271009 273112 275817 280093 284695 287700 289349 291325 294211 297622 301888
57782 301888 307540 313775 319370 324561 330321 336448 342053 347269 352765 358212 362857 366970 371056 374287
57768 374287 375464 374964 374072 372861 370393 366551 362058 357017 351051 344612 338711 333553 328607 323682 318787
57753 318787 313481 307593 302115 298304 296457 296468 298652 302769 307187 310434 312837 315326 317560 318673 319005
57738 319005 319511 320293 321229 323130 326573 330373 333007 334879 337395 340535 343259 345733 349045 352955 355915
57723 355915 357320 358042 358711 359032 358817 358284 357354 355927 354660 354263 354263 353688 352609 351717 350785 348979 346390
57706 346390 343850 341429 338445 334793 331054 327535 324319 321894 320577 319742 318737 318045 318343 319085 319355
57691 319355 319480 320270 321232 321095 319747 318205 317064 316384 316585 317965 319797 321371 323466 327267 332458 338098
57675C38098O785R840J3688J7088K0819K6122L2928M1114N1622O4495P6913Q4213
57663G83725Q1666O5381L4870l519l8350o0899p0377p0909o6107n8174m9363m1197
57651E06747l3528k6296k0785j7506j4771j1246q052o385n080k796o32r8k89L13
57637C59596Q92l7j381r65P59J455P60N01J388K138J956J523J335J012M47O1j80
57620C71260o71j185j183q33o33m65r9J2m24o61j09M19p1j097j554j445j417j396
57602C58448j003n49l52Q7R78J311M34m96j25R87J344P32j16j018j933j980o19
57585C56130R51J240N73K31L25J81K1N29J334J596J457J445J182K75l56K78J388
57568C68780J543R23P60J200J477J555J801J721Q36J64R26K340K683K026J925
$$ plain form
57675 338098 344883 354723 368411 385499 406318 432440 465368 506482 558104 622599 699512 783725
57663 783725 865391 930772 965642 962123 923773 862874 792497 721588 655481 597307 547944 506747
57651 506747 473219 446923 426138 408632 393861 382615 374563 368178 363098 360302 359670 359572 359283 359596
57637 359596 360488 360451 359070 358105 358864 360319 361079 361580 362968 365106 367062 368585 369920 370932 371379 371440 371260
57620 371260 370589 369404 368221 367388 366755 366290 366191 366203 365779 365118 365009 365428 365357 364260 362706 361261 359844 358448
57602 358448 357445 356896 356544 356631 357609 358920 359354 358858 358733 359720 361064 361796 361680 360662 358729 356749 356130
57585 356130 357081 358321 358894 359125 359450 359631 359652 360181 361515 363111 364568 366013 367195 367470 367114 367392 368780
57568 368780 370323 371246 372006 373206 374683 376238 378039 379760 380596 380760 381686 384026 386709 388735 390660
57553C90660K744L346L312L430L979M321M211L953L320J910M74K14Q79J167R49
57538D28869J392K875M412N288N734N782M918L243J736J055R68J072J205J185
57524D69734J036J296K333L643M590N316O055O292N727N312O002P124P344O662
57510E38466O095N947N799N659N608N032L601K426K560L021K124K28p77l51K49
57495E85687K53K14M93P25R19J616K700L437L708L965M100L609K765K354K473
57480F19018K724L202M017M401L794L185L763M765M533L259K621L030L317L112
57466F68741L419M575N585N838N870O066O112N964N904N604M601L673M086N489
57452G41527O219N773N305N563O041O337O705O985O626N956N916O336O101N205
$$ plain form
57553 390660 393404 396750 400062 403492 407471 411792 416003 419956 423276 425186 425660 425874 426753 427920 428869
57538 428869 430261 433136 437548 442836 448570 454352 459270 462513 464249 465304 466272 467344 468549 469734
57524 469734 470770 472066 474399 478042 482632 487948 494003 500295 506022 511334 517336 524460 531804 538466
57510 538466 544561 550508 556307 561966 567574 572606 576207 578633 581193 584214 586338 586566 585789 585438 585687
57495 585687 585940 586154 586647 587372 588291 589907 592607 596044 599752 603717 607817 611426 614191 616545 619018
57480 619018 621742 624944 628961 633362 637156 640341 644104 648869 653402 656661 659282 662312 665629 668741
57466 668741 672160 676735 682320 688158 694028 700094 706206 712170 718074 723678 728279 731952 736038 741527
57452 741527 747746 753519 758824 764387 770428 776765 783470 790455 797081 803037 808953 815289 821390 826595
57438H26595M905N660O546O968P331P694P464O812O710P147O927N732M904N593
57424I16988P343Q978R705R214P908P089P605Q475Q234P307P264Q089Q339P891
57410A030429Q126R196R602R031R094J0418J1326J0522R000Q106P717P511Q118
57397A148196R608J0541J0035R299R705J0683J0955J0603J0487J0649J0660J0746
57385A272167J1303J1985J2280J2399J2750J3205J3527J3772J3852J3482J2978
57374A413700J3052J3506J3328J2371J1618J1358J0708R511R031R917J1053J1444
57362A550597J1668J2393J2930J2617J2297J3030J4353J5125J5267J5405J5565
57351A701247J5390J4957J4493J3984J3825J4904J7056J8418J7599J5648J4757
$$ plain form
57438 826595 831500 837160 843706 850674 858005 865699 873163 879975 886685 893832 900759 906491 911395 916988
57424 916988 924331 933309 943014 952228 960136 967225 974830 983305 991539 998846 1006110 1014199 1022538 1030429
57410 1030429 1038555 1047751 1057353 1066384 1075478 1085896 1097222 1107744 1116744 1124850 1132567 1140078 1148196
57397 1148196 1157804 1168345 1178380 1187679 1197384 1208067 1219022 1229625 1240112 1250761 1261421 1272167
57385 1272167 1283470 1295455 1307735 1320134 1332884 1346089 1359616 1373388 1387240 1400722 1413700
57374 1413700 1426752 1440258 1453586 1465957 1477575 1488933 1499641 1509152 1518183 1528100 1539153 1550597
57362 1550597 1562265 1574658 1587588 1600205 1612502 1625532 1639885 1655010 1670277 1685682 1701247
57351 1701247 1716637 1731594 1746087 1760071 1773896 1788800 1805856 1824274 1841873 1857521 1872278
57340A872278J5517J6607J6789J6173J5637J5791J6411J6734J6459J6375J7305
57329B052076J8634J8926J8040J7274J7323J7479J7245J7171J7537J7733J7596
57318B247034J7919J8863J9365J8978J8796J9598K0484K0423J9856J9663J9778
57307B460757J9845K0066K0361J9936J8703J7892J8194J8707J8690J8887J9839
57296B671877K0467J9898J9316K0162K1686K2065K1095K0042J9563J9401J9550
57285B895122K0046K0259J9733J9219J9488J9860J9359J8564J8739J9707K0269
57274C110365K0264K0614K1575K2477K3049K3664K4334K4677K4755K4936K5105
57263C365815K4987K4882K5149K5396K5126K4725K4837K5232K5268K4925K4461
$$ plain form
57340 1872278 1887795 1904402 1921191 1937364 1953001 1968792 1985203 2001937 2018396 2034771 2052076
57329 2052076 2070710 2089636 2107676 2124950 2142273 2159752 2176997 2194168 2211705 2229438 2247034
57318 2247034 2264953 2283816 2303181 2322159 2340955 2360553 2381037 2401460 2421316 2440979 2460757
57307 2460757 2480602 2500668 2521029 2540965 2559668 2577560 2595754 2614461 2633151 2652038 2671877
57296 2671877 2692344 2712242 2731558 2751720 2773406 2795471 2816566 2836608 2856171 2875572 2895122
57285 2895122 2915168 2935427 2955160 2974379 2993867 3013727 3033086 3051650 3070389 3090096 3110365
57274 3110365 3130629 3151243 3172818 3195295 3218344 3242008 3266342 3291019 3315774 3340710 3365815
57263 3365815 3390802 3415684 3440833 3466229 3491355 3516080 3540917 3566149 3591417 3616342 3640803
57252C640803K3620K2270K1122K0742K0515J9702J8818J8664J8817J8396J7710
57241C861179J7610J7816J7461J6815J6833J7327J7257J6605J6371J6787J7079
57230D049140J7010J7156J7578J7624J7195J6918J6956J6835J6545J6556J6676
57219D236189J6146J4999J4112J3701J2985J1609J0249R402Q633P499O286N400
57207D367210M712L989L327K780K107J264P36J094K381M084N546O447P027P702
57193D420406Q413Q760Q895R581J1063J2551J3267J3274J2866J1888J0385Q996
57181D550345Q008O744M808L065K400K219J285n38k490m235n908p292q117q810
57167D541484r876j0957j1459j1543j1530j0879r052o832n501n036m374l223k320
$$ plain form
57252 3640803 3664423 3686693 3707815 3728557 3749072 3768774 3787592 3806256 3825073 3843469 3861179
57241 3861179 3878789 3896605 3914066 3930881 3947714 3965041 3982298 3998903 4015274 4032061 4049140
57230 4049140 4066150 4083306 4100884 4118508 4135703 4152621 4169577 4186412 4202957 4219513 4236189
57219 4236189 4252335 4267334 4281446 4295147 4308132 4319741 4329990 4339392 4348025 4355524 4361810 4367210
57207 4367210 4371922 4375911 4379238 4382018 4384125 4385389 4386125 4387219 4389600 4393684 4399230 4405677 4412704 4420406
57193 4420406 4428819 4437579 4446474 4456055 4467118 4479669 4492936 4506210 4519076 4530964 4541349 4550345
57181 4550345 4558353 4565097 4569905 4572970 4575370 4577589 4578874 4578336 4575846 4571611 4565703 4558411 4550294 4541484
57167 4541484 4531608 4520651 4509192 4497649 4486119 4475240 4466188 4459356 4453855 4448819 4444445 4441222 4438902
57154D438902k121k389k957l783m351m012k878j579m35L82L11j016l029n002p107
57139D398936r803j2770j5488j8313k1793k5390k8044k9531l0173k9674k7518
57128D150439k4089k0202j5942j1096o216k089J446M971Q228J0499J1807J2754
57116D120510J3822J5841K0263K7698L7053M7319N9200P3580Q9703J06705J25840
57105D737534J49244J77441K10233K49260K97526L57075M29351N17246O24672
57096G749582P54807R10710J096508J315348J566657J847211K153149K477883
57088A9871855K809480L133214L435228L700555L910431M045722M087807M006258
57080D9000550L749268L265717K551832J673938P36874j71391j005895j750039
$$ plain form
57154 4438902 4436781 4434392 4431435 4427652 4423301 4419289 4416411 4414832 4414397 4414779 4415090 4414074 4411045 4406043 4398936
57139 4398936 4389133 4376363 4360875 4342562 4320769 4295379 4267335 4237804 4207631 4177957 4150439
57128 4150439 4126350 4106148 4090206 4079110 4072894 4070805 4072251 4077222 4085450 4095949 4107756 4120510
57116 4120510 4134332 4150173 4170436 4198134 4235187 4282506 4341706 4415286 4504989 4611694 4737534
57105 4737534 4886778 5064219 5274452 5523712 5821238 6178313 6607664 7124910 7749582
57096 7749582 8504389 9415099 10511607 11826955 13393612 15240823 17393972 19871855
57088 19871855 22681335 25814549 29249777 32950332 36860763 40906485 44994292 49000550
57080 49000550 52749818 56015535 58567367 60241305 60978179 60806788 59800893 58050854
57072E8050854k392075k918257l317577l584981l722204l739523l655476l492317
57064C1228444l271608l013495k736825k457309k185989j930182j694906j482828
57056A2455302j294148j127877r83007q58264p51587o60510n82764n16355m59539
57047E221251m10914l69129l32526k99562k69496k42322k18026j96304j76801
57038B706171j59122j42665j26854j11532r6874q2954o9527n6057m1703k5319
57028A793564n683J7267L9905N3241M6493J5829k9752p3358j02198j14201j14154
57017A526953j06813r5197q2311p0861o1552n3595m6707m1209l6716l2422k8474
57006H71096k5730k4238k3138k1958k0934k0088j9003j7570j6174j5073j4205
$$ plain form
57072 58050854 55658779 52740522 49422945 45837964 42115760 38376237 34720761 31228444
57064 31228444 27956836 24943341 22206516 19749207 17563218 15633036 13938130 12455302
57056 12455302 11161154 10033277 9050270 8192006 7440419 6779909 6197145 5680790 5221251
57047 5221251 4810337 4441208 4108682 3809120 3539624 3297302 3079276 2882972 2706171
57038 2706171 2547049 2404384 2277530 2165998 2069124 1986170 1916643 1860586 1818883 1793564
57028 1793564 1787881 1805148 1845053 1898294 1944787 1960616 1930864 1857506 1755308 1641107 1526953
57017 1526953 1420140 1324943 1242632 1171771 1110219 1056624 1009917 968708 931992 899570 871096
57006 871096 845366 821128 797990 776032 755098 735010 716007 698437 682263 667190 652985
56995F52985j3504j2860j1907j0342q328o203m090k073l14J439L894P320J0902
56982F06919J3295J3364J0297M004m106j1593j6936k0373k2513k3084k1778j9326
56970E08170j6735j4194j1571r334p906o715m780j880J628N567R749J3594J6859
56957D82452K0155K3714K5995K4514J8096P823l823j4205k1418k4982k5713k4633
56945D87975k2254j9013j5549j2083q312m420j434J79J448L673O997J0976J5805
56932D43988K1903K8591L4049L6271L3583K5062J1483m319j8786k9362l4971l5854
56920E11638l3581l0389k7544k4762k1571j8417j5843j3537j1073q748o870n088
56908B94215l292k302k599l286l246k610k014j308k01O45N35K09J004K966M973
$$ plain form
56995 652985 639481 626621 614714 604372 596044 589841 585751 583678 583364 584803 588697 596017 606919
56982 606919 620214 633578 643875 647879 643773 632180 615244 594871 572358 549274 527496 508170
56970 508170 491435 477241 465670 456336 448430 441715 436935 435055 436683 442250 451999 465593 482452
56957 482452 502607 526321 552316 576830 594926 602749 598926 584721 563303 538321 512608 487975
56945 487975 465721 446708 431159 419076 410764 406344 404910 405089 406537 410210 417207 428183 443988
56932 443988 465891 494482 528531 564802 598385 623447 634930 630611 611825 582463 547492 511638
56920 511638 478057 447668 420124 395362 373791 355374 339531 325994 314921 306173 299303 294215
56908 294215 290923 288621 286022 282736 279490 276880 274866 273558 273357 274002 274537 274746 275750 278716 283689
56893B83689O442P727R086J0393J1755J3516J5821J8694K1978K4558K4286J9731
56881D67676J1613J992p228j4469j8412j9039j7889j6202j3601r664n594k744
56869C56439m75K793P135J1457J5718K0919K7158L3584M0240M8097N6793O3493
56857F83351O4265N6078L8246J3606j1867l2216m4876n0535n0608m6170l8849
56846E80425l0679k2736j4971p392k45O771J4237K2068L0005L8857M9883O3095
56834G29318P7320R1301J02801J06638R6098O8131K7002j7441n4949p9339r0089
56823A056791r0731q5443p6767o6098n4949m4511l4729k5106j5963p751K29R036
56811E64008J8550K8151L8342N0034O2411P2710P7495P2936N5502K5433j0473
$$ plain form
56893 283689 290131 297858 306944 317337 329092 342608 358429 377123 399101 423659 447945 467676
56881 467676 479289 481281 474053 459584 441172 422133 404244 388042 374441 364777 359183 356439
56869 356439 355964 358757 365892 377349 393067 413986 441144 474728 514968 563065 619858 683351
56857 683351 747616 803694 841940 855546 843679 811463 766587 716052 665444 619274 580425
56846 580425 549746 527010 512039 504647 504402 511173 525410 547478 577483 616340 666223 729318
56834 729318 806638 897939 1000740 1107378 1203476 1271607 1298609 1281168 1226219 1146880 1056791
56823 1056791 966060 880617 803850 737752 682803 638292 603563 578457 562494 554743 554972 564008
56811 564008 582558 610709 649051 699085 761496 834206 911701 984637 1040139 1065572 1055099
56800A055099m2196o3446p4105p6631p2936o5104n6043m7634l9694l1759k4444
56789D61107j8198j2302o098nN514J0894J6713K2979K9600L6119M0464L9294L0611
56776F56692J5446l060k1166l5217m2874m4613m3048m0197l6409l1887k7559k3885
56764C22223k0450j7346j5468j4746j3601j1117q374o702n888n055m184l754l745
56751A91793l823l771l227j878l50J35n74j359j604j880k462k630k107j727j928
56736A62608j872r51J22N00L43J4o09j245j004J32Q66N16O6M48J092J242J307
56719A63575J730J821J007J80M31J391J995K058J897J330L26k77J20Q04R75J136
56703A80499K039L025K905J887J202J184J001J09j179k367l130l169k498j657
$$ plain form
56800 1055099 1012903 949457 875352 798721 725785 660681 604638 557004 517310 485551 461107
56789 461107 442909 430607 424509 424504 430018 440912 457625 480604 510204 546323 586787 626081 656692
56776 656692 672138 669078 647912 612695 569821 525208 482160 441963 405554 373667 346108 322223
56764 322223 301773 284427 268959 254213 240612 229495 221121 214419 208531 203476 199292 195538 191793
56751 191793 187970 184199 180972 179094 178744 178879 178305 176946 175342 173462 171000 168370 166263 164536 162608
56736 162608 160736 159785 159907 160407 160750 160764 160155 158910 157906 158038 158904 159420 159486 159934 161026 162268 163575
56719 163575 165305 167126 168133 168313 168744 170135 172130 174188 176085 177415 177741 177464 177584 178388 179363 180499
56703 180499 182538 185563 188468 190355 191557 192741 193742 193851 192672 190305 187175 184006 181508 179851
56689A79851j030l37O10J208Q73K1m25j84M35J176J853K185K135K014J880J455
56673A93720R11Q39J069N63r03k046j775o49K38P89J380J728J384P14L56K04k04
56656A98318q16j313j675j834j414m42K73J93k52n09p45j183j467j279q51k91
56640A84713O79J773K055J388R02J230J555J147O38P16Q10K71l15k50j58r08j987
56623A94259k310j910j521j185n88j75o18j640k411k677k552j877p40N0Kk35k
56606A73870K84R3n2M34R60O91m2l93l25j81K11Q64R47M4p80m35N24R45R01J068
56586A79628J218Q06L63O61J199J032M67M17O99N16R3K59R38J477J975K753L076
56569A97577K058M37k31K55R13J503K697M515O214P648R313J1195J2719J3521
$$ plain form
56689 179851 178821 178484 179094 180302 181175 181196 180771 180587 181022 182198 184051 186236 188371 190385 192265 193720
56673 193720 194631 195470 196539 197102 196199 194153 192378 191729 191967 192756 194136 195864 197248 197962 198318 198522 198318
56656 198318 197502 196189 194514 192680 191266 190824 191097 191290 191038 190529 189784 188601 187134 185855 185004 184713
56640 184713 185392 187165 189220 190608 191510 192740 194295 195442 196080 196796 197606 197877 197562 197312 197154 196246 194259
56623 194259 191949 190039 188518 187333 186745 186570 185952 184312 181901 179224 176672 174795 174055 174105 174107 173872 173870
56606 173870 174154 174247 174195 174629 175589 176280 176238 175845 175520 175339 175550 176414 177361 177405 176625 176190 176714 177659 178560 179628
56586 179628 180846 181652 182015 182676 183875 184907 185374 185791 186490 187006 187099 187358 188296 189773 191748 194501 197577
56569 197577 199635 200072 199841 200096 201009 202512 205209 209724 215938 223586 232899 244094 256813 270334
56555B70334J3134J0435N070j040n155o512o345n623m409l125k593k762k871k866
56541B55672l340m110m246l464k357j379p42q87j810k374j608k92J57j02J75J039
56525B30332J302O19l8L3N83J242J777J667P22k27m85p72j978l339l530k902k771
56508B22235l032k510j290o02o27n14l75j110k284k401j446r73j376j341l46L81
56492B02389P8l98k93o4j07%L39K77j33K7Q29J108L50m62m49M3M93R55J333J178
56472B07493O86O80J219J437J054P52P94O41J79L4L08L72J04R4L93L96J09J78
56454B16923N48M71M2K08J079J669J555J345J368J316J261J589J843J159j02o96
56438B31578m50k70l43m5M67M38K55R59K061K003Q52L42R60J342Q99O59R95Q84
$$ plain form
56555 270334 283468 293903 298973 297933 292778 286266 279921 274298 269889 266764 264171 261409 258538 255672
56541 255672 252332 248222 243976 240512 238155 236776 236034 235147 233337 230963 229355 229063 229220 229118 229293 230332
56525 230332 231634 232253 232215 232248 232831 234073 235850 237517 238239 238012 237527 236755 234777 231438 227908 225006 222235
56508 222235 219203 216693 215403 214801 214174 213660 213285 212175 209891 207490 206044 205071 203695 202354 202008 202389
56492 202389 202467 202069 201776 201712 201605 201605 201944 202221 202088 202115 202944 204052 204402 203940 203491 203534 204027 204982 206315 207493
56472 207493 208179 208859 210078 211515 212569 213321 214115 214756 214935 214969 215277 215649 215753 215847 216240 216636 216745 216923
56454 216923 217471 217942 217984 218192 219271 220940 222495 223840 225208 226524 227785 229374 231217 232376 232274 231578
56438 231578 231128 230858 230515 230470 230937 231375 231630 232589 234650 236653 237505 237847 238807 240149 241048 241707 242702 243586
56420B43586J66J55J132J542O42k37p9L15K64N04J296J387K22p90n69j13n23r98
56402B47902m25O91J397J983K927L376K377O77j22N06J897L263L957L499K133
56387B76038O97m36j501k253k044j116m91l05K05R20P85k15q75r23j288j908j458
56370B63832N4P57j74j224j136o00k60O54K349L264K417J140R77J493J587J410
56354B76540J565J826J950K378L064L022K032J219J168J088O97R42J948K318J539
56339C03296R82J382J543P98M99J563K795L155L538M602N066M039K971L292M077
56324C43598L998L662L975M055K989J918K128K623J851L69l60m99r65j302o25
56309C67415M45Q04P86J213J597J181O97J263K478L363M109N305O419O625O168
$$ plain form
56420 243586 243752 243907 245039 246581 247223 246986 246907 247222 247486 247990 249286 250673 250895 250105 249536 249423 248900 247902
56402 247902 247477 248168 249565 251548 254475 257851 260228 260905 260783 261289 263186 266449 270406 273905 276038
56387 276038 276735 276299 274798 272545 270501 269385 268894 268589 268794 269714 270499 270284 269409 268486 267198 265290 263832
56370 263832 263886 264643 264469 263245 262109 261509 261249 261903 264252 267516 269933 271073 272050 273543 275130 276540
56354 276540 278105 279931 281881 284259 287323 290345 292377 293596 294764 295852 296549 297491 299439 301757 303296
56339 303296 304278 305660 307203 308001 308500 310063 312858 316013 319551 324153 329219 333258 336229 339521 343598
56324 343598 347596 351258 355233 359288 362277 364195 366323 368946 370797 371166 370806 370307 369342 368040 367415
56309 367415 367860 368664 369450 370663 372260 373441 374138 375401 377879 381242 385351 390656 397075 403700 409868
56294D09868N539M477L047K403L096L983M076M028M564N097N217N735O892P424
56280D75446O898O927Q434R790R524Q738Q971R722J0160J1184J3500J5633J6124
56267F11051J5947J6575J7616J8496K0413K4138K7883K9880L1258L3910L7422
56256H84589M0785M5085N1647N9233O6037P2889Q1623R1769J01718J11687J22700
56245A729762J33956J43956J52855J61110J67264J69718J69106J66197J59164
56236C153088J45808J26953J04764P9394N0308J9342j0726l9202o6215r0010j08679
56225C364825j23009j34632j42920j46792j47704j47499j45185j39370j31982
56216B105732j25744j19739j11600j02384r4903q8620q0829p1929o4920o0257
$$ plain form
56294 409868 415407 419884 422931 425334 428430 432413 436489 440517 445081 450178 455395 461130 468022 475446
56280 475446 482344 489271 497705 507495 517019 525757 534728 544450 554610 565794 579294 594927 611051
56267 611051 626998 643573 661189 679685 700098 724236 752119 781999 813257 847167 884589
56256 884589 925374 970459 1022106 1081339 1147376 1220265 1301888 1393657 1495375 1607062 1729762
56245 1729762 1863718 2007674 2160529 2321639 2488903 2658621 2827727 2993924 3153088
56236 3153088 3298896 3425849 3530613 3610007 3660315 3679657 3668931 3629729 3563514 3473504 3364825
56225 3364825 3241816 3107184 2964264 2817472 2669768 2522269 2377084 2237714 2105732
56216 2105732 1979988 1860249 1748649 1646265 1551362 1462742 1381913 1309984 1245064 1184807
56206A184807n5640n0491m6377m3227l9340l4936l1768k9335k5508k0760j7854
56195G89571j7252j6620j4960j3594j2944j1901j0487r728r011o790l773k127
56183F60384j873j334o55j318k676k660j511j207j629r94M60R95J023K283L927
56168F53215L553J821J714L433M280L659L801N308O214N910O070P149P836Q225
56154G22188R849J2239J3169J2642J3050J5232J7831K0489K4159K8435L2309L7268
56142I58860M5863N7432O8987P9804R1095J01618J07836J08124J02973R2008P5390
56131A889990N7557M4634L8268L6023L6638L9662M1086L5625K3746J1190J419
56120B255838o316j1976j4114j4763j9073k9055m2488n7953p5321r1089r9580
$$ plain form
56206 1184807 1129167 1078676 1032299 989072 949732 914796 883028 853693 828185 807425 789571
56195 789571 772319 755699 740739 727145 714201 702300 691813 682085 673074 666284 662511 660384
56183 660384 658511 657177 656522 655204 652528 649868 648357 647150 645521 644527 644987 645982 647005 649288 653215
56168 653215 656768 658589 660303 663736 668016 671675 675476 680784 686998 692908 698978 706127 713963 722188
56154 722188 732037 744276 757445 770087 783137 798369 816200 836689 860848 889283 921592 958860
56142 958860 1004723 1062155 1131142 1210946 1302041 1403659 1511495 1619619 1722592 1814600 1889990
56131 1889990 1947547 1992181 2030449 2066472 2103110 2142772 2183858 2219483 2243229 2254419 2255838
56120 2255838 2249522 2237546 2223432 2208669 2189596 2160541 2118053 2060100 1984779 1893690 1794110
56109A794110r9762r5561q8994p8744o5869n4483m5772l7234k8720k3208k0647
56098A155116j7272j2152q406o800m413p62J117R14K018M955O261N259N430P668
56084A138933Q740P898Q307J0407J0726Q873Q707J0925J1658J0233J0777J4110
56072A260294J5695J4036J3438J5749J7120J5855J5823J8774K0833J9968J9610
56061A447195K1521K2411K0953K0787K3210K4325K2787K2817K6022K7953K6344
56050A706325K5074K6311K6610K4530K4032K6442K7136K4322K2932K5631K8262
56039A987607K8364K9781L4420L7941L8144L9114M2625M4283M2667M3095M7620
56028B415661N0759M9949N0539N5186N8421N7215N6806O0299O2766O1636O2368
$$ plain form
56109 1794110 1694348 1598787 1509793 1431049 1365180 1310697 1264925 1227691 1198971 1175763 1155116
56098 1155116 1137844 1125692 1117286 1110486 1106073 1105311 1106428 1107342 1109360 1114315 1120576 1125835 1131265 1138933
56084 1138933 1147673 1155571 1163878 1174285 1185011 1193884 1202591 1213516 1225174 1235407 1246184 1260294
56072 1260294 1275989 1290025 1303463 1319212 1336332 1352187 1368010 1386784 1407617 1427585 1447195
56061 1447195 1468716 1491127 1512080 1532867 1556077 1580402 1603189 1626006 1652028 1679981 1706325
56050 1706325 1731399 1757710 1784320 1808850 1832882 1859324 1886460 1910782 1933714 1959345 1987607
56039 1987607 2015971 2045752 2080172 2118113 2156257 2195371 2237996 2282279 2324946 2368041 2415661
56028 2415661 2466420 2516369 2566908 2622094 2680515 2737730 2794536 2854835 2917601 2979237 3041605
56017C041605O7586P1364P0706P1658P7387Q1705Q1457Q3571R2123J00326J03295
56006C942783J06676J14489J20760J21871J24636J33238J40991J44034J49758
55997E099236J62303J73669J79204J87197K02565K16293K22522K30504K47358
55988F920851K64969K76931K91984L16804L42270L61357L83517M16313M50619
55979A0025615M79681N14193N61875O11857O56786P09750P80748Q58365R34728
55970A6133598J025180J141799J272453J409267J571186J773513K004422K259412
55962B8590830K568044K957030L422073L970185M652202N517040O578413P870947
55954F6126764R491497J1537837J4065824J7164835K1002734K5712875L1271939
$$ plain form
56017 3041605 3109191 3180555 3251261 3322919 3400306 3482011 3563468 3647039 3739162 3839488 3942783
56006 3942783 4049459 4163948 4284708 4406579 4531215 4664453 4805444 4949478 5099236
55997 5099236 5261539 5435208 5614412 5801609 6004174 6220467 6442989 6673493 6920851
55988 6920851 7185820 7462751 7754735 8071539 8413809 8775166 9158683 9574996 10025615
55979 10025615 10505296 11019489 11581364 12193221 12850007 13559757 14340505 15198870 16133598
55970 16133598 17158778 18300577 19573030 20982297 22553483 24326996 26331418 28590830
55962 28590830 31158874 34115904 37537977 41508162 46160364 51677404 58255817 66126764
55954 66126764 75618261 87156098 101221922 118386757 139389491 165102366 196374305
55947A96374305L7433810M3414998M7306867M6109165L7262069K0880440N08307
55940D29289961j8683896l2748653m0440033m2639158m1007123l7147663l2358389
55933A84265046k7527805k3101100j9227939j5955623j3275594j1098305r307353
55926F4771327p834821o641760n665578m841722m148318l581945l113291k706437
55918B6237455k357234k073827j839566j629347j443174j291293j163285j041481
55910A3398248r29109q37554p60177o84068o13961n60560n17876m74337m33916
55901G586690m05218l81648l52629l23160l02926k87003k65842k43780k29472
55892D795012k18180k01149j82921j72197j64600j51127j35086j24536j16373
$$ plain form
55947 196374305 233808115 277223113 324529980 370639145 407901214 428781654 429289961
55940 429289961 410606065 377857412 337417379 294778221 253771098 216623435 184265046
55933 184265046 156737241 133636141 114408202 98452579 85176985 74078680 64771327
55926 64771327 56936506 50294746 44629168 39787446 35639128 32057183 28943892 26237455
55918 26237455 23880221 21806394 19966828 18337481 16894307 15603014 14439729 13398248
55910 13398248 12469139 11631585 10871408 10187340 9573379 9012819 8494943 8020606 7586690
55901 7586690 7181472 6799824 6447195 6124035 5821109 5534106 5268264 5024484 4795012
55892 4795012 4576832 4375683 4192762 4020565 3855965 3704838 3569752 3445216 3328843
55883C328843j03926r2523r1503r7478j00315r9401r9969r9860r3958q5891q1939
55872B282080p9134p2004o4945o4978o8182o6083o0135n7285n6479n2113m5992
55861A594750m3575m2727l8144l2673l2562l5425l4375l0325k9051k9608k6890
55850A219395k2438k1916k4590k5510k5241k7544l0343k8858k4975k3953k4688
55839I39339k2605j9179j9120k0822j9233j5613j5037j6551j5269j2010j1590
55828G52310j3306j2303q846p455q286p851o791q555j1732j1988j0227j0777j2945
55815F21248j2462r945r685j1251j0414p454o569p727p006m405l667m723l829
55802E22111q75O35N41J930M414M485K346J642K596J990k97j225p52j657l582
$$ plain form
55883 3328843 3224917 3132394 3040891 2943413 2843098 2743697 2643728 2543868 2449910 2364019 2282080
55872 2282080 2202946 2130942 2065997 2001019 1932837 1866754 1806619 1749334 1692855 1640742 1594750
55861 1594750 1551175 1508448 1470304 1437631 1405069 1369644 1335269 1304944 1275893 1246285 1219395
55850 1219395 1196957 1175041 1150451 1124941 1099700 1072156 1041813 1012955 987980 964027 939339
55839 939339 916734 897555 878435 857613 838380 822767 807730 791179 775910 763900 752310
55828 752310 739004 726701 717855 710400 702114 694263 687472 678917 667185 655197 644970 634193 621248
55815 621248 608786 598841 589156 577905 567491 560037 553468 545741 538735 534330 530663 525940 522111
55802 522111 521236 521871 522412 524342 528756 533241 535587 537229 539825 541815 541518 540293 539541 537884 534302
55787E34302l596k233k631m058k855L52Q80k538o673r958j3581j6499j5844j2409
55773D42659r848q207m245K025P171J0606J4487J7145J3422K811q716j6287k0157
55760D42866k1458j9594j5270j1136q063m949k436k257k957j306J852K423j55
55747C57560k360k969m397p036p919o215m728m795m533l249k751l240k671j217
55733B99480j587l901m948l652k640l334m048m046m925o782p403o478o233o941
55719B32562o180l608j964k162j864j20J035Q89J581L886N724O178O855P876O882
55704B57570L519O88k51j401l941n984o472p103q577q907p375o256o646o354l992
55689A88518j551q40p40n9K73j99P2J590K356J427Q37K052L480L534L210L604
$$ plain form
55787 534302 530706 528473 525842 521784 518929 519281 520161 517623 510950 500992 487411 470912 455068 442659
55773 442659 432811 424604 420359 422384 429555 440161 454648 471793 485215 488026 479310 463023 442866
55760 442866 421408 401814 386544 375408 367345 362396 359960 357703 354746 353440 355292 357715 357560
55747 357560 355200 352231 347834 340798 332879 326664 321936 317141 312608 309359 306608 303368 300697 299480
55733 299480 297893 293992 289044 285392 282752 279418 275370 271324 266399 259617 252214 245736 239503 232562
55719 232562 226382 222774 220810 218648 216784 216664 217699 218588 220169 224055 229779 235957 242812 250688 257570
55704 257570 261089 261777 261526 260125 256184 250200 243728 236625 228048 219141 211766 205510 198864 192510 188518
55689 188518 186967 186127 185387 185328 185601 185402 185474 187064 189420 190847 191684 193736 197216 200750 203960 207564
55673B07564L663K488J298J126R08l34j634j961j851j792j211k59k60j268j485
55658B04992j85J148J498J617J856J379M09N39J842K439J666Q63L27j317l781
55643B15292m553k883j110p98q15n02j284l551n263n352n432o416o675n452m756
55628A60450n743o282m485j916q94j065r94q16j082r92M7R41Q03M68N93K50j044
55611A38239k044j936j742k218k527k262k376k982k655j256o77j492j784p73m49
55596A11066j739k257k62K050J884Lj099j003p56m29K46M86r3l03M59P71k50j038
55578A07736k34Q72P12J69O74J552J637J726K959M425M699M277M283M205L077
55563A42769J466K91r15k592l642l276k821l575m518m165l152k768k508j361j05
$$ plain form
55673 207564 211227 213715 215013 216139 217047 216713 215079 213118 211267 209475 208264 208005 207745 206477 204992
55658 204992 204807 205955 207453 209070 210926 212305 212714 213253 215095 217534 219200 220063 220390 219073 215292
55643 215292 210739 207856 206746 205948 205133 204631 203347 199796 194533 189181 183749 177333 170658 165206 160450
55628 160450 154707 148425 143940 142024 141130 140065 139071 138255 137173 136181 136228 137169 137972 138440 139033 139283 138239
55611 138239 136195 134259 132517 130299 127772 125510 123134 120152 117497 116241 115564 114072 112288 111515 111066
55596 111066 109327 107070 106808 108858 110742 110745 109646 108643 107887 107458 107704 108190 108097 107794 108253 109024 108774 107736
55578 107736 107502 108374 109086 109255 109929 111481 113118 114844 117803 122228 126927 131204 135487 139692 142769
55563 142769 144235 144526 143611 141019 137377 134101 131280 127705 123187 119022 115870 113102 110594 109233 109128
55548A09128o3o96o61j38q0k55N2M69M94P92J804K386J626O53Q10J465J507J523
55530A20816K358K995K094M16m47o77j411k441k766k541k472k299j673j435k221
55515A08296k934k510j897k317k947k468j627j807k291j530j87k17j490j975j051
55500H1048k29n22j221j406j014l02M17O05K14O9N49P09o5o23J76J353J230J19
55482H1107l54J17M12Q7k18j44J13N58J136J171L14n60n94l36o81j269j292j044
55464G8523j244j577j323p32l98q0O06J138R71N90N07K67l31k70R72K052J638
55447H1309M69j12l56j042j551j025l21p40j695j761j198j254j649r92P02J961
55431G0745K043J442M96p64j665j430m21M37J038J631J782J133M91O77J121J001
$$ plain form
55548 109128 109065 108369 107708 107570 107490 107235 107287 107756 108250 109042 110846 113232 114858 115511 116321 117786 119293 120816
55530 120816 123174 126169 128263 128679 128232 127555 126144 123703 120937 118396 115924 113625 111952 110517 108296
55515 108296 105362 102852 100955 98638 95691 93223 91596 89789 87498 85968 85781 85564 84074 82099 81048
55500 81048 80819 80297 79076 77670 76656 76354 76771 77376 77590 77659 78208 78917 78852 78229 78405 79758 80988 81107
55482 81107 80753 80870 81282 81369 81151 81007 81120 81678 82814 83985 84299 83739 83145 82809 82128 80859 79567 78523
55464 78523 77279 75702 74379 73647 73249 73169 73775 74913 75884 76474 76981 77248 76917 76647 77619 79671 81309
55447 81309 81778 81666 81310 80268 78717 77692 77371 76631 74936 73175 71977 70723 69074 68082 68784 70745
55431 70745 72788 74230 74726 73962 72297 70867 70446 70883 71921 73552 75334 76467 76958 77635 78756 79757
55415G9757Q31J324J743J120J74R7M13p3r46r54l78n52j439j732j072l53p7n7
55397G7826l74j047j291n40L17K57j76j4K90o5l21O03J865J893J092J057J701
55380H3073J465J48q01o93k97k09l45q27j648j855q33J20n90k183k491j232j30
55363G0672m7k03j10k35o31p82p60r23o98N85K039K188J290Q02R73R05N67O89
55345G6321R10K08j036j436q92m60k42M84J318J056j28r65j289j829k087q82J133
55328G0184J924J143L52J90k71j152j305n77k20n40m30L35O13J97L35J322J734
55311G3834Q00n05j298j803j960j113L29R39N58O12J503J807Q36p8J93R00R78
55294G6532O46M97M85N50Q47Q50k37j735j887n35M34j04j069j241q82m87K08J060
$$ plain form
55415 79757 80588 81912 83655 84775 84949 85046 85459 85386 84440 83486 83108 82556 81117 79385 78313 77960 77883 77826
55397 77826 77452 76405 75114 74574 74891 75148 74972 74958 75248 75183 74862 75465 77330 79223 80315 81372 83073
55380 83073 84538 84686 83885 83192 82895 82686 82341 81514 79866 78011 77178 77298 76708 74525 72034 70802 70672
55363 70672 70625 70422 70312 70077 69446 68664 67904 66981 66283 66868 68907 71095 72385 73187 74160 75065 75632 76321
55345 76321 77231 77439 76403 74967 74075 73615 73373 73857 75175 76231 76103 75138 73849 72020 69933 69051 70184
55328 70184 72108 73251 73603 73793 73522 72370 71065 70488 70268 69728 69298 69633 70246 70443 70778 72100 73834
55311 73834 74634 74129 72831 71028 69068 67955 68284 69223 69781 70393 71896 73703 74539 74461 74654 75554 76532
55294 76532 77178 77675 78160 78710 79557 80407 80170 78435 76548 76013 76447 76343 75274 74033 73151 72664 72872 73932
55276G3932R95j81j021m29Q81J747K031J945J264J29o33p44q87j323j384q44m93
55259G4985p22q50m81k02l80m95k43j09l61o62q84j159j014R1J395J623J091J249
55241G2872K062J970O51l93m98p26j439j381r2R25O13r7k13k02m27j06Q89J107
55223G5515j48j368j117j54K52M12J084J681J320M67rl60j121j702j271j42Q35
55206G4174J459J780J502P21L16O58R51O44L31M80N31Q3k74j93k62o19l61P11
55188H2632J323P21q4k05l53j126j474m65Q02P55l16j058j141j031p30k12j99
55171G7839j042j629q04R04K200K739K781K147Q89N3L79J097J172R13J044J209
55155I1891P43L7k61n31j293j885j474n85k75m51m07k65n19q41o90m71p58j051
$$ plain form
55276 73932 74927 74746 73725 73296 74177 75924 77955 79900 81164 81293 80660 79916 79029 77706 76322 75478 74985
55259 74985 74263 73413 72932 72730 72350 71855 71612 71503 71142 70480 69596 68437 67423 67514 68909 70532 71623 72872
55241 72872 74934 76904 77555 77162 76664 75938 74499 73118 73026 73951 74564 74467 74254 74052 73625 73519 74408 75515
55223 75515 75367 73999 72882 72728 72980 73392 74476 76157 77477 77944 77935 77575 76454 74752 73481 73339 74174
55206 74174 75633 77413 78915 79636 79952 80610 81561 82205 82536 83016 83547 83630 83356 83163 82901 82282 81921 82632
55188 82632 83955 84676 84592 84387 84034 82908 81434 80969 81771 82526 82210 81152 80011 78980 78250 78038 77839
55171 77839 76797 75168 74364 75268 77468 80207 82988 85135 86024 86077 86456 87553 88725 89638 90682 91891
55155 91891 92634 92671 92410 91879 90586 88701 87227 86642 86367 85916 85509 85244 84725 83884 83194 82723 81965 80914
55137H0914n80K56O03O45J000J347R76J92j55l5N5K03O39Q32L17k10O8N52J28
55118H7747q87j188m81L13O19O63N95L36J59M18Q62J079J237J563J607R43J8n36
55100I5067q06r36m32Q05J641J156J98J06O27N62j60n99n29m90m39J07P80P67
55082I7425L25N17J387J802J211L33q3j35j93l30m21j66Q37K351L119K173J90
55065A10342j260j632j617j686j538r04n6N89P40K37o96j438j675j715j708j251
55049I4732l50J04l10n65L65J725J962R35p4l03k02l49p09j072j333j355j105
55032I2096q53p27m23K40R26J394J834K126J654M48m22l91l25r98j715j479o08
55015I2777N1N53J186J342N28k77J26J109J084j03j139j278q78k39N90J023M40
$$ plain form
55137 80914 80334 80590 81193 81838 82838 84185 85161 85353 85198 85163 85218 85421 86060 86892 87209 86999 87067 87619 87747
55118 87747 86860 85672 85191 85504 86123 86786 87381 87717 87876 88294 89156 90235 91472 93035 94642 95585 95603 95067
55100 95067 94261 93325 92893 93698 95339 96495 96693 96799 97426 97988 97828 97229 96700 96210 95771 95878 96658 97425
55082 97425 97750 98267 99654 101456 102667 103000 102917 102782 102589 102259 101838 101672 102509 104860 107979 110152 110342
55065 110342 109082 107450 105833 104147 102609 101705 101649 102238 102978 103215 102519 101081 99406 97691 95983 94732
55049 94732 94382 94486 94176 93611 93976 95701 97663 98598 98524 98221 98019 97670 96961 95889 94556 93201 92096
55032 92096 91243 90516 90093 90333 91259 92653 94487 96613 98267 98715 98293 97902 97577 96579 94864 93385 92777
55015 92777 92828 93381 94567 95909 96437 96160 96286 97395 98479 98376 97237 95959 95081 94842 95432 96455 96895
54998I6895n88q39j06Q26J552K131K138J082l50q58l12K21J76o7l45r79j770j957
54980I6850j344n62o5K57M48L76K04K65N06P59J201J890K269J919J320J007O05
54963A07905k91j015p77o0J56O6M98J233J308P62N60R53J175P60l9r65j777j877
54945A08575r89K2J42l57n64m59n49n75M6Q74R86M79Q5j84n96n22N90J661J243
54926A09908n5l38O43J355J161J008J403J738J989L078N064O769P638Q322Q929
54911A58612Q468O664M695L388K067r5k769n141o745p239o530n457n161n467n109
54896A34181l787k697k643k993k910k341j450l00N54M19k94l95L04Q73J051J560
54880A19132K358K276J044O9N05J811K966L794M466M906N373O436P737P948O469
$$ plain form
54998 96895 96307 95468 95362 96188 97740 99871 102009 103091 102741 101883 101571 101792 101968 101901 101556 100577 98807 96850
54980 96850 95506 94944 94879 95136 95584 95960 96164 96429 96935 97694 98895 100785 103054 104973 106293 107300 107905
54963 107905 107614 106599 105822 105762 105918 105984 106482 107715 109023 109785 110345 111298 112473 113233 113194 112229 110452 108575
54945 108575 107586 107608 107750 107393 106829 106370 105821 105246 105292 106166 107152 107631 107716 107532 106936 106414 107004 108665 109908
54926 109908 109853 109515 110158 111513 112674 113682 115085 116823 118812 121890 126954 133723 141361 149683 158612
54911 158612 167080 173744 178439 181827 183894 183799 181030 175889 169144 161905 155375 149918 144757 139290 134181
54896 134181 130394 127697 125054 122061 119151 116810 115360 115060 115614 116033 115739 115344 115648 116521 117572 119132
54880 119132 121490 123766 124810 124879 125384 127195 130161 133955 138421 143327 148700 155136 162873 170821 177290
54865A77290M096J591j074l599m981n054n010n591o030n557m711m294m195m073
54851A28808m105m195l584k155j067j123j530j245n82m15o53o83o33j016j544
54836A04278j299k1J494K175J529J4j229j387q10m18m09k58J08J71j41l17k96
54819A03184n09p92m71K55L34l87p52j21O53O35O4m43p91r31n61J27L85J20J38
54800A00137P37J214J199J245J592J625J146Q91J087Q88p6q57q12o29q87r36k40
54783A07324M54M33L12Q33J435J286P82P09Q08M83J82P09J741K276K164K088K370
54766A26389K785L293L996M730N331O018O901P593P838P926P881O967M712J779
54752B04139q70l070n097o865q147q958r137q196o276m463l541l057k300j439
$$ plain form
54865 177290 181386 182977 181903 178304 173323 168269 163259 157668 151638 146081 141370 137076 132881 128808
54851 128808 124703 120508 116924 114769 113702 112579 111049 109804 109222 108807 108154 107471 106838 105822 104278
54836 104278 102979 102958 104452 106627 108156 108170 106941 105554 104744 104326 103917 103659 103767 103938 103797 103480 103184
54819 103184 102675 101883 101412 101667 102001 101614 100862 100741 101394 102029 102093 101650 100859 99928 99367 99494 99879 99999 100137
54800 100137 100874 102088 103287 104532 106124 107749 108895 109786 110873 111761 111685 110828 110016 109387 108500 107564 107324
54783 107324 107778 108211 108523 109356 110791 112077 112859 113568 114376 114859 115041 115750 117491 119767 121931 124019 126389
54766 126389 129174 132467 136463 141193 146524 152542 159443 167036 174874 182800 190681 197648 202360 204139
54752 204139 203269 200199 195102 188237 180090 171132 161995 153799 147523 143060 139519 136462 134162 132723
54738A32723j003r48r64j122j503j748j595j300j083p47k21K26O00J209J823J840
54722A26187J568K114L602M785M987N049N677O328O498O638O827N931L370L66
54708A89927j736l201m752n987o332o381o760o735n526m021l523l651l123j974
54694A26225j268j162q75k87o1l65p57j078j342j133k58M51J07q68j433j413j233
54677A13250p91R6P18L32m81n96q3J03k73p12j094j571j724j133l91l23o40n74
54659A04113l29m55l67Q01K263K298Q14m39l45M02Q56J050J332J626J773J689
54643A17082J010n17k198k801j960m41Q70J519J328N87J55M80Q61N01j79l84m40
54626A15473j148k092k148j329n95o7R52K143K185Q93l00m36j78k96m45j33K60
$$ plain form
54738 132723 131720 130772 129808 128686 127183 125435 123840 122540 121457 120710 120489 120715 121315 122524 124347 126187
54722 126187 127755 129869 133471 138256 143243 148292 153969 160297 166795 173433 180260 186191 189561 189927
54708 189927 188191 184990 180238 174251 167919 161538 154778 148043 142517 138496 134973 131322 128199 126225
54694 126225 124957 123795 122920 122633 122572 122207 121450 120372 119030 117897 117639 118090 118197 117329 115896 114483 113250
54677 113250 112459 112555 113273 113605 113124 112528 112445 112548 112275 111563 110469 108898 107174 106041 105650 105327 104687 104113
54659 104113 103784 103329 102962 103763 106026 108324 109138 108699 108354 108756 109612 110662 111994 113620 115393 117082
54643 117082 118092 117575 115377 112576 110616 110175 111045 112564 113892 114479 114634 115114 115975 116476 116297 115913 115473
54626 115473 114325 112233 110085 108756 108161 108094 109046 111189 113374 114267 113967 113531 113353 113057 112612 112479 112739
54609A12739K10p8k44m35p54p69k07M66O63M73L40L68L13M5k64k86J53P82J029
54590A14544P40L64J84j79r87j623j388o33k65m62o92p21p25o40k50K22L35K09
54572A08033L45Q34J342J631J589J115M52J71K79P1n99p61R3R97J071R83J534
54555A19180J884R13n76r48l86l91j077j139l24K86M75J181K302K407J193J73
54539A25153K59N85N10Q51K047K859K210R08K24m5p75j752k058j595j056q08p49
54522A26768q74j140j148o33K1L27L90O35J115J485J371N84o60j632j677j040
54506A23892n45m49k84J40L68J32k13k65mN27J206J481Q57j87o04k37L9k09l98
54487A25247j20J09k09o81o42p4N55Q52O78J65k77m47p08j238j256%J715K128
$$ plain form
54609 112739 112949 112871 112627 112192 111438 110669 110462 110928 111591 112064 112404 112772 113085 113130 112866 112580 112733 113515 114544
54590 114544 115284 115648 115832 115653 114666 113043 111655 111022 110757 110295 109603 108882 108157 107517 107267 107489 107824 108033
54572 108033 108378 109212 110554 112185 113774 114889 115341 115512 115791 115862 115263 114502 114595 115592 116663 117646 119180
54555 119180 121064 121977 121401 120453 120067 119676 118599 117460 117136 117422 117897 119078 121380 123787 124980 125153
54539 125153 125412 125997 126507 127358 129405 132264 134474 135382 135606 135561 134786 133034 130976 129381 128325 127517 126768
54522 126768 125894 124754 123606 122973 122994 123321 123711 124346 125461 126946 128317 128901 128241 126609 124932 123892
54506 123892 123347 122898 122614 122754 123122 123254 123041 122776 122772 123299 124505 125986 126843 126656 126052 125815 125854 125645 125247
54487 125247 125127 125236 125027 124346 123704 123630 124185 125037 125715 125880 125603 125156 124448 123210 121954 121954 123669 125797
54469A25797Q67n29o60K43J189J658J553R47L88N36J101J018N0p81p51m46o02
54452A31578j000j114j044j047q35o8Q64J177N59o11j528j446l76O73P16K9l45
54435A26182j60q2l37l55Q1M42M86O16R56J028O71L31K13P8P4O20J344J302N14
54416A34004O4L79P12O27N61N17k23j456j683l13J154J114j09j193j568j293k92
54399A31002J158K075J976J542J366J064M23K66J095J997K056J776J907J959J261
54384A52923M52L69K88r73k805l390k270p87n6P6J4k23m62l03K10P07J225K040
54366A47035K755K544J350M7o23o21j31O93J459J724J570J577K131L185M477N584
54350A74756N901N144L754K337Q75j015l183m853n389m861l892l261l322l663
$$ plain form
54469 125797 126664 126135 125475 125718 126907 128565 130118 131065 131453 131989 133090 134108 134158 133377 132626 132180 131578
54452 131578 130578 129464 128420 127373 126538 126470 127334 128511 129070 128459 126931 125485 125109 125782 126498 126527 126182
54435 126182 126022 125940 125603 125248 125329 125771 126257 126873 127829 128857 129528 129859 130072 130150 130224 130844 132188 133490 134004
54416 134004 134068 134447 135159 135786 136347 136864 136641 135185 133502 133189 134343 135457 135348 134155 132587 131294 131002
54399 131002 132160 134235 136211 137753 139119 140183 140606 140872 141967 143964 146020 147796 149703 151662 152923
54384 152923 153375 153744 154032 153059 150254 146864 144594 143807 143751 143827 143841 143618 143156 142853 143063 143770 144995 147035
54366 147035 149790 152334 153684 153731 153108 152487 152356 153049 154508 156232 157802 159379 161510 164695 169172 174756
54350 174756 180657 185801 189555 191892 192767 191752 188569 183716 178327 173466 169574 166313 162991 159328
54336A59328l527k816k225k221k397k214j764j371r56m18j38m94j151j376q66
54321A35394R8J049J604J650J515J534J368M16j004j704j238n37m27m47J38R40
54305A40349J062N22J27K65N62N38M4p26j220r31j12L33Q4j87M9M36N66O54P69
54286A43184L68n70r28PJ212J281M36k0L15P26P81O67L92j93o74n14j39n10j581
54267A44240k171j599n03J79L31M28P34J108J302J236J052R24Q27O61N51O45P22
54250A50667N35M91J187K172K150P88p13j279j223j217j206j010j043j467j556
54235A47276q97k92n01r53q36n10o56q49l61L66N12M13Q51J408J176O33J031K111
54217A49922K253J035j23j69J60k53j296k060k042j455r46j188k153k761j937
$$ plain form
54336 159328 155801 152985 150760 148539 146142 143928 142164 140793 139837 139419 139281 138787 137636 136260 135394
54321 135394 135492 136541 138145 139795 141310 142844 144212 144628 143624 141920 140682 140145 139718 139271 139409 140349
54305 140349 141411 141933 142060 142325 142887 143425 143469 142743 141523 140592 140480 140813 140897 140710 140759 141195 141761 142415 143184
54286 143184 143552 142982 142054 142061 143273 144554 144990 144970 145285 146011 146792 147459 147851 147658 146984 146470 146331 145821 144240
54267 144240 142069 140470 139967 140146 140477 140905 141639 142747 144049 145285 146337 147261 148088 148749 149300 149945 150667
54250 150667 151202 151693 152880 155052 157202 157990 157277 155998 154775 153558 152352 151342 150299 148832 147276
54235 147276 146379 146087 145586 144633 143797 143287 142631 141782 141421 141787 142299 142712 143563 144971 146147 146780 147811 149922
54217 149922 152175 153210 153087 152918 153078 152825 151529 149469 147427 145972 145026 143838 141685 138924 136987
54202A36987j3J617K073J530M48p47j358r05P3N16J93j87j81o2r1j86k74k59J85
54183A39359J073J668J382P72O73Q17M56m6K73J149J289M43k29q2K08P1q2O9L3
54164A49296n10j061j156j007q06l27L53O35L29Jrp2l94n18j74K48M48O71R26
54145A46873O75k14r30q50m71n97j108j207n42M65J191J350J160J090J288J335
54129A49508Q92L58K78L81J7n88n76Q2M19L6k99Q6Q34J381J714J822J367M86P9
54110A58277N89J246J183O41L00J46k09n18j91O62J292J301R97P56O08M22J48
54093A67650j81m77o15n92n84p02q02n99O7J032J774J782J186Q02J187J926K268
54076A75122K195K241K465K486K481L293N305P756R410R399P444L947J8l101n024
$$ plain form
54202 136987 136974 138591 140664 142194 142642 141895 140537 139632 139705 140221 140414 140227 140046 139984 139893 139707 139433 139174 139359
54183 139359 140432 142100 143482 144254 144927 145744 146200 146154 146427 147576 148865 149308 149079 148997 149205 149276 149194 149263 149296
54164 149296 148786 147725 146569 145562 144756 144429 144782 145417 145746 145747 145738 145666 145272 144754 144580 144828 145276 145947 146873
54145 146873 147548 147334 146404 145554 145083 144486 143378 142171 141629 142094 143285 144635 145795 146885 148173 149508
54129 149508 150400 150758 151036 151417 151434 150846 150270 150352 150771 150807 150508 150594 151428 152809 154523 156345 157712 158198 158277
54110 158277 158866 160112 161295 161936 162236 162382 162173 161655 161464 162126 163418 164719 165716 166472 167080 167502 167650
54093 167650 167469 166992 166377 165785 165201 164499 163697 163098 163165 164197 165971 167753 168939 169741 170928 172854 175122
54076 175122 177317 179558 182023 184509 186990 190283 195588 203344 212754 222153 229597 233544 233562 230461 225437
54061B25437o153o737o558n597m352l276k450j873j503r62J23J339J781J272O74
54046A91165P52J382K080K694L187L368L198K999L070L414L941M560N064N365
54032B36239N800O681P569P702P030O195N460M459L130K023J432R79L59j65l05
54017B94588j55J17M48N41j7j164k415l554m638n397n461n158n141n147m252k538
54001B50657j365j458j911j634p82J2Q36J994K971K883J539n72k921m963o000
53986B39286n790m953m240l715l144k717k754k996k824k061j125m67k47l51n14
53971B01388m64k20p1k62p76j395j663j068L07J507J775J592J919K604K670K038
53955B09881J744K179K462K069J813K401L171L222K919L144L722L739L066K499
$$ plain form
54061 225437 219284 212547 205989 200392 196040 192764 190314 188441 186938 185976 186099 187438 189219 190491 191165
54046 191165 191917 193299 195379 198073 201260 204628 207826 210825 213895 217309 221250 225810 230874 236239
54032 236239 242039 248720 256289 263991 271021 277216 282676 287135 290265 292288 293720 294699 295058 294893 294588
54017 294588 294433 294550 294998 295539 295522 294358 291943 288389 283751 278354 272893 267735 262594 257447 253195 250657
54001 250657 249292 247834 245923 244289 243507 243519 244355 246349 249320 252203 253742 253170 250249 245286 239286
53986 239286 233496 228543 224303 220588 217444 214727 211973 208977 206153 204092 202967 202500 202253 201902 201388
53971 201388 200924 200704 200633 200371 199595 198200 196537 195469 195776 197283 199058 200650 202569 205173 207843 209881
53955 209881 211625 213804 216266 218335 220148 222549 225720 228942 231861 235005 238727 242466 245532 248031
53941B48031K556L021L689M698O006P138P693P749P677P774Q079Q446Q762R155
53927C40474J0005J1735J4429J7227J8052J4794P614m09n810p686p489o497m826
53914D01613k545j60K209M715O619O635M890L092K227J456k9j567k376k967m031
53899D19781m942m725l697k988k980l337l989n089o397p528q437q985q701p718
53885C40268p171p724q420q007o770n973n904n714m925m024l594l669l902l801
53871B60670l044k069j915k847l754l564k746k487k941l262k967k336j662j054
53857B24022q02j114j632j805j585j224q22o11j167k493l479l138j941j030o33
53842B00546k96j02m51r18o48J50M13p4m08j84j91j007j952k060j362n50R7Q08
$$ plain form
53941 248031 250587 253608 257297 261995 268001 275139 282832 290581 298258 306032 314111 322557 331319 340474
53927 340474 350479 362214 376643 393870 411922 426716 434330 433921 428111 420425 412936 406439 401613
53914 401613 399068 398908 401117 405832 412451 419086 423976 427068 429295 430751 430722 429155 426779 423812 419781
53899 419781 414839 410114 406417 403429 400449 397112 393123 388034 381637 374109 365672 356687 347986 340268
53885 340268 333097 325373 316953 308946 302176 296203 290299 284585 279660 275636 272042 268373 264471 260670
53871 260670 257626 255557 253642 250795 247041 243477 240731 238244 235303 232041 229074 226738 225076 224022
53857 224022 223220 222106 220474 218669 217084 215860 215038 214427 213260 210767 207288 204150 202209 201179 200546
53842 200546 200250 200148 199697 198779 198131 198281 198694 198620 198212 198028 197837 196830 194878 192818 191456 190906 191003 191811
53824A91811J651K308K530K419K202J857J217M12oK82Q39J024R60J293K120K880
53808B15799L421M202N223N714N368M910M852M660L896L263L600M615N452N876
53794B80851N948N313L831K321J645J570J468J527K113K611K142J057M07K35l39
53779C12700j527k629l303l942m683n160n308n517n881o011n660m876l745k624
53765B51834k239k834l583l603l103k687k206j395r74j727k915l139k481k215
53751B16733k555k358j237l66o32j379j545j008k97J56N5n87j111p66K11Q98J047
53734B05259J188J451J392J079J145J574J626J168Q78Q72M19n84j063k94J100
53719B17210K175K665K502J463K5n14M19J797K365K135J816J616J411J428J951
$$ plain form
53824 191811 193462 195770 198300 200719 202921 204778 205995 206407 206401 206683 207522 208546 209506 210799 212919 215799
53808 215799 219220 223422 228645 234359 239727 244637 249489 254149 258045 261308 264908 269523 274975 280851
53794 280851 286799 292112 295943 298264 299909 301479 302947 304474 306587 309198 311340 312397 312804 313039 312700
53779 312700 311173 308544 305241 301299 296616 291456 286148 280631 274750 268739 263079 258203 254458 251834
53765 251834 249595 246761 243178 239575 236472 233785 231579 230184 229210 227483 224568 221429 218948 216733
53751 216733 214178 211820 210583 210217 209585 208206 206661 205653 205356 205512 205567 204980 203869 203103 203314 204212 205259
53734 205259 206447 207898 209290 210369 211514 213088 214714 215882 216760 217632 218051 217467 216404 216110 217210
53719 217210 219385 222050 224552 226015 226040 225526 225945 227742 230107 232242 234058 235674 237085 238513 240464
53704B40464K738L345L663L689L289K576K032J879J862J932K455L313L654L036
53690B79927K220K098K431K288J290q8j143j426r95n03o58j303j600j322j199
53675B80017j645j992j584q76o85r02p97k04L66N48M32J30l11p22r82j203j455
53658B68135j437q59M5P11Q60O15K32m5k0L25P63J035J032P56L21j5p8J09O04
53639B73089J685L197M086L381J579K32J12N73Q88J169J688K167K314K327K368
53624C00855K213J909K121L162M265M466L835L195L006L132L405L822M304M701
53610C48391M995N241N472N826O418O934O780N811M523L256J779Rj429j922j710
53595D00374j510j596j770j970k314k652k561j890j012m78m99p85r12r11j284
$$ plain form
53704 240464 243202 246547 250210 253899 257188 259764 261796 263675 265537 267469 269924 273237 276891 279927
53690 279927 282147 284245 286676 288964 290254 290166 289023 287597 286602 286099 285441 284138 282538 281216 280017
53675 280017 278372 276380 274796 273920 273235 272333 271536 271332 271698 272246 272678 272808 272497 271775 270793 269590 268135
53658 268135 266698 265839 265884 266595 267455 268070 268302 268257 268237 268562 269325 270360 271392 272148 272469 272454 272376 272485 273089
53639 273089 274774 277971 282057 285438 287017 287249 287361 287934 288822 289991 291679 293846 296160 298487 300855
53624 300855 303068 304977 307098 310260 314525 318991 322826 326021 329027 332159 335564 339386 343690 348391
53610 348391 353386 358627 364099 369925 376343 383277 390057 395868 400391 403647 405426 405435 404006 402084 400374
53595 400374 398864 397268 395498 393528 391214 388562 386001 384111 383099 382621 382122 381337 380425 379514 378230
53580C78230k203k945k644j491n75n34j013j495j981k539k819k401j293J05J231
53565C55633J544J022M09M14P03M51k39l65M03J273J652J859K095J879J086N32
53549C70351P28J070J081J407K554L545L214K177K128L421M770N261N285N357
53535D12349N265M919M967N973P575R038J0136J0992J1465J1356J1068J1394J2537
53522E29034J3757J4212J3931J3620J3738J4183J4857J5978J7591J9257K0611
53511G00769K1824K3050K3929K4318K4929K6341K7684K7462K5662K3859K3113
53500I72940K2965K2756K2665K2804K2442K1020J9130J7721J6994J6742J7043
53489A195222J7774J8158J7640J6675J5993J5635J5489J6046J7540J8882J8643
$$ plain form
53580 378230 376027 373082 370438 368947 368372 367838 366825 365330 363349 360810 357991 355590 354297 354402 355633
53565 355633 357177 358199 358608 359022 359725 360176 359937 359572 359975 361248 362900 364759 366854 368733 369819 370351
53549 370351 371079 372149 373230 374637 377191 380736 383950 386127 388255 391676 396446 401707 406992 412349
53535 412349 417614 422533 427500 433473 441048 450086 460222 471214 482679 494035 505103 516497 529034
53522 529034 542791 557003 570934 584554 598292 612475 627332 643310 660901 680158 700769
53511 700769 722593 745643 769572 793890 818819 845160 872844 900306 925968 949827 972940
53500 972940 995905 1018661 1041326 1064130 1086572 1107592 1126722 1144443 1161437 1178179 1195222
53489 1195222 1212996 1231154 1248794 1265469 1281462 1297097 1312586 1328632 1346172 1365054 1383697
53478A383697J6800J4489J2270R719O706L918J871K53j476l465n703q248j0914
53465A419917j3154j4529j5027j4893j4387j3810j3495j3714j4630j6237j8162
53454A257879j9809k0911k1703k2274k2210k1240j9917j9067j8751j8291j7170
53443A036536j5458j3449j1333r215p109m959k919j459q29o17j78O94J795L051
53429I74551M545O142P548Q674R637J0491J1191J1832J2661J3849J5406J7170
53417A103697J8799J9977K0802K1740K3057K4560K6006K7462K9040L0679L2328
53406A378147L4039L5651L6867L7881L9488M2212M5637M8878N1423N3175N4126
53395A857524N4399N4356N4352N4467N4654N4793N4580N3822N2896N2307N1691
$$ plain form
53478 1383697 1400497 1414986 1427256 1436975 1443681 1447599 1449470 1449723 1448247 1444782 1439079 1430831 1419917
53465 1419917 1406763 1392234 1377207 1362314 1347927 1334117 1320622 1306908 1292278 1276041 1257879
53454 1257879 1238070 1217159 1195456 1173182 1150972 1129732 1109815 1090748 1071997 1053706 1036536
53443 1036536 1021078 1007629 996296 987081 979972 975013 972094 970635 969806 969189 969011 969705 971500 974551
53429 974551 979096 985238 992786 1001460 1011097 1021588 1032779 1044611 1057272 1071121 1086527 1103697
53417 1103697 1122496 1142473 1163275 1185015 1208072 1232632 1258638 1286100 1315140 1345819 1378147
53406 1378147 1412186 1447837 1484704 1522585 1562073 1604285 1649922 1698800 1750223 1803398 1857524
53395 1857524 1911923 1966279 2020631 2075098 2129752 2184545 2239125 2292947 2345843 2398150 2449841
53384B449841N0015M7051M3816M1125L8519L5194L1210K6991K2365J6996J1347
53373B814470O281J885k567p690j3597k0203k7315l4513m1363m7498n2301n5063
53361B520526n5891n5933n6170n6497n6448n6060n5391n3862n1101m7852m5157
53350A930164m3085m1167l9640l9109l9330l9375l8916l8265l7266l5228l2162
53339A506621k9037k6594k4570k2360j9787j7023j4326j1992j0158q636p359o837
53327A307942p625r490j1580j3261j4226j4144j2932j1305j0210r740r259q518
53315A175652p895p485o704n100l017j205j16M11J012K282M059N545O400P353
53301A171192R195J1591J3642J5210J6889J8909K0914K2770K4708K6629K8012
$$ plain form
53384 2449841 2499856 2546907 2590723 2631848 2670367 2705561 2736771 2763762 2786127 2803123 2814470
53373 2814470 2820751 2822636 2820069 2812379 2798782 2778579 2751264 2716751 2675388 2627890 2575589 2520526
53361 2520526 2464635 2408702 2352532 2296035 2239587 2183527 2128136 2074274 2023173 1975321 1930164
53350 1930164 1887079 1845912 1806272 1767163 1727833 1688458 1649542 1611277 1574011 1538783 1506621
53339 1506621 1477584 1450990 1426420 1404060 1384273 1367250 1352924 1340932 1330774 1322138 1314779 1307942
53327 1307942 1300317 1290827 1279247 1265986 1251760 1237616 1224684 1213379 1203169 1193429 1184170 1175652
53315 1175652 1167757 1160272 1153568 1148468 1145451 1144246 1144130 1144541 1145553 1147835 1151894 1157439 1163839 1171192
53301 1171192 1180387 1191978 1205620 1220830 1237719 1256628 1277542 1300312 1325020 1351649 1379661
53290A379661K8568K8413K7643K6386K5110K4154K3026K0867J7602J4011J0726
53279A626167P836N296K903k2m019q446j1873j3709j4771j6200j8416k1177k3918
53266A509651k5974k7133k7939k8933k9730k9693k9226k9390l0232l0645l0094
53255A190662k9322k8964k8574k7560k6223k5168k4423k3780k3447k3649k3949
53244I05603k3592k2360k0734j9369j8619j8280j7673j6306j4553j3249j2558
53233G08310j1711j0023p702n454l844l247l877n451p135q236q816r472j0638
53220F12704j2230j3752j4770j5296j5655j5820j5261j3772j2068j1054j0751
53209D62275j0502j0009r521r112q540p733o868o114n726o168p507q892r382r024
$$ plain form
53290 1379661 1408229 1436642 1464285 1490671 1515781 1539935 1562961 1583828 1601430 1615441 1626167
53279 1626167 1634003 1639299 1642202 1642180 1638161 1629715 1617842 1604133 1589362 1573162 1554746 1533569 1509651
53266 1509651 1483677 1456544 1428605 1399672 1369942 1340249 1311023 1281633 1251401 1220756 1190662
53255 1190662 1161340 1132376 1103802 1076242 1050019 1024851 1000428 976648 953201 929552 905603
53244 905603 882011 859651 838917 819548 800929 782649 764976 748670 734117 720868 708310
53233 708310 696599 686576 678874 673420 669576 666329 662452 657001 649866 641630 632814 623342 612704
53220 612704 600474 586722 571952 556656 541001 525181 509920 496148 484080 473026 462275
53209 462275 451773 441764 432243 423131 414591 406858 399990 393876 388150 381982 374475 365583 356201 347177
53195C47177q414p619o468n569n754o606o726n656m373l708l391k989k646k489
53181B74769k265j959j922k031j717j150j269k161k585j756n47n4j4L62Q38O08
53165B57147k43q51r02q40r19r20q30r78j433j821j868j638j270q00l34j30l84
53148B40986r96j561j632j187o75m62l19J13N81N16Pj81L49J111J449J219O71
53131B39989J73J49O71J075O09l87p42l0Q46R51M17j03l37k70J71P83R99N74N
53112B45543j62K0K31L49K90p0m95n05k04l39j122j729j476q80q75j534k189k400
53094B32453k154j456m14M97Q22P21P57J137J493J311M28p58j488j334o59j59
53078B31197QJ50L31L58M55J077J912J930P48q58k026k598k564j677k36O84M60
$$ plain form
53195 347177 338763 331144 324676 319107 313353 306747 300021 294365 289992 286284 282893 279904 277258 274769
53181 274769 272504 270545 268623 266592 264875 263725 262456 260295 257710 255954 255407 255353 255339 255701 256539 257147
53165 257147 256904 256053 255151 254311 253392 252472 251642 250664 249231 247410 245542 243904 242634 241834 241500 241370 240986
53148 240986 239990 238429 236797 235610 234935 234473 234154 234267 234848 235364 235371 235190 235539 236650 238099 239318 239989
53131 239989 240162 240311 240982 242057 242666 242279 241537 241507 242353 243304 243721 243618 243281 243011 243182 243965 244964 245538 245543
53112 245543 245381 245401 245632 245981 246271 246201 245706 245201 244997 244658 243536 241807 240331 239451 238576 237042 234853 232453
53094 232453 230299 228843 228429 228926 229748 230469 231226 232363 233856 235167 235595 234837 233349 232015 231356 231197
53078 231197 231205 231355 231686 232044 232499 233576 235488 237418 238166 237308 235282 232684 230120 228443 228207 228891 229351
53061B29351k34m64l25m88j041j491j556j295p34L3O77R78J075J147J177J304
53045B28114J796K408K342J264j52j109j528j655j531j243j143j273j164o14j13
53030B24399l8j09l4j5j49r7J77J25l20k67Q02K040K345J788J102N36P1O1O55
53011B33072J110P11j05m42l08l16m84l50N6L25M33N44L56m00j136r97j03O95
52993B32661J032J162J108O56J05R5P20J467J960K140J962J533J288J386J288
52978B50563O42Q9M01J257J797J995K367K703K254J053k8n54p88p73k13O53J068
52961B64486Q11L88R6l23r40j350j320j012n82j46o8n47j050r33n16o35j336j877
52943B53146j951j897j707r71N4M01k52j143j579j617j384p54LJ59l93q40o59
$$ plain form
53061 229351 229117 228653 228328 227840 226799 225308 223752 222457 221723 221756 222433 223411 224486 225633 226810 228114
53045 228114 229910 232318 234660 235924 235772 234663 233135 231480 229949 228706 227563 226290 225126 224512 224399
53030 224399 224361 224252 224218 224203 224054 223957 224134 224259 223939 223672 224474 226514 228859 230647 231749 232285 232356 232417 233072
53011 233072 234182 234893 234788 234346 234038 233722 233238 232888 232944 233269 233702 234246 234602 234202 233066 232069 231966 232661
52993 232661 233693 234855 235963 236619 236724 236819 237539 239006 240966 243106 245068 246601 247889 249275 250563
52978 250563 251205 251294 251695 252952 254749 256744 259111 261814 264068 265121 265093 264539 263751 262978 262765 263418 264486
52961 264486 265297 265685 265781 265458 264518 263168 261848 260836 260254 260108 260040 259493 258443 257510 256994 256359 255023 253146
52943 253146 251195 249298 247591 246620 246674 247075 246823 245680 244101 242484 241100 240346 240349 240508 240115 239275 238616
52926B38616k84j27J57P95J108L90q82j536j132k68L40N99Q01J032R46K08q52
52909B39911j378j047o06q23j253q77K15Q05K49p21j164j043p90n60l28j18J84
52892B30656P64J342J354Q53N82Q14Q67J64q98j587j673j249m00M40M58m53j239
52875B30795r72q2M81Q16J766L290M228L860K781J917J327N77k13l24N38J652
52859B52437J986J344N23L22N87N04l57j585k549l054l240l181k894k621k683
52844B35539l040l189k678j669q72q99j650k370k335j443k17O54Q24N24L51O71
52828B18201J265J668J813K001K262K199J531M03r06k180k987k820j835q91n21
52813B19203l35J55P07Q93Q74R51Q66M21K98J290K841L393K267L47j220k175k831
$$ plain form
52926 238616 238332 238205 238362 239157 240265 240655 239773 238237 237105 236837 237177 237776 238577 239609 240555 240763 239911
52909 239911 238533 237486 236880 236057 234804 233927 234142 234947 235196 234475 233311 232268 231478 230918 230590 230472 230656
52892 230656 231420 232762 234116 234969 235551 236365 237232 237396 236498 234911 233238 231989 231589 232029 232487 232034 230795
52875 230795 229823 229741 230222 231038 232804 236094 240322 244182 246963 248880 250207 250784 250571 250247 250785 252437
52859 252437 254423 255767 256290 256612 257199 257703 257346 255761 253212 250158 246918 243737 240843 238222 235539
52844 235539 232499 229310 226632 224963 224091 223192 221542 219172 216837 215394 215177 215831 216655 217179 217530 218201
52828 218201 219466 221134 222947 224948 227210 229409 230940 231343 230437 228257 225270 222450 220615 219724 219203
52813 219203 218868 219023 219730 220623 221497 222448 223314 223735 224033 225323 228164 231557 233824 234171 232951 230776 227945
52796B27945l328l591l522k931j714k66O71P67M04J07j0j18k72k78J58J039J752
52779B16813J495L98l13K56J347J489M94l43r1O80Q44J59p11j133j042p60o28
52762B18954p68j066j321j319q48N1Q66J001O02M15O54O85K49J25Q37J554J271
52745B21942M85M76J357K103K311K571L079L184K684K327K580K811K302J316N96
52730B52124L76L21J78O0K86J006J762J671M29j137k030k258k419k554k304j838
52714B43673j630j498r67l87n44j203j330p82m45n26j69Q34J357P00j85j08P41
52697B37531J347J268P29J4n17m28J26L36j29n32j43O40R33N14q0k74J43Q86J143
52678B43507L00j087j797j555j318j617j722r96k7M27O90J370K041J786O94l00
$$ plain form
52796 227945 224617 221026 217504 214573 212859 212593 213264 214031 214435 214542 214532 214414 214142 213864 214022 215061 216813
52779 216813 218308 218706 218393 218649 219996 221485 221979 221636 221545 222225 223069 223228 222517 221384 220342 219582 218954
52762 218954 218186 217120 215799 214480 213632 213683 214549 215550 216152 216567 217221 217906 218155 218280 219117 220671 221942
52745 221942 222427 222903 224260 226363 228674 231245 234324 237508 240192 242519 245099 247910 250212 251528 252124
52730 252124 252500 252821 252999 253059 253345 254351 256113 257784 258213 257076 255046 252788 250369 247815 245511 243673
52714 243673 242043 240545 239578 239191 238647 237444 236114 235332 234887 234361 234192 235026 236383 237083 236898 236790 237531
52697 237531 238878 240146 240875 240889 240372 239944 240070 240406 240277 239745 239602 240242 241175 241689 241609 241335 241478 242364 243507
52678 243507 243807 242720 240923 239368 238050 236433 234711 233715 233688 234115 234805 236175 238216 240002 240696 240396
52662B40396p29q86q69l50O24J303J133N51N53J535K786L383L374L578M051L591
52646B64024J407j387l041l409l668m072l647k153p36j62Q8M09K41n43q54l7R09
52629B43369Q45J57j51p0n2K15J128J960J672N02m34p92j071j397j374j015p55
52612B42737o04j72N23J038J247J394J485J250O64on06o76m65j90l03o26m15M26
52594B46801R79O10j00m64p42j325j735j398p51m71l04K98R27Q76N00O48J135
52577B45484J054M02O6L47O19M88J59k49p68j001n63L0q7p06q29l14q6n63j058
52558B42425j005p05n09k71M5J06q0k2K83Q5r31j906j867q71K91J075J347J040
52540B38530K46n95j005r16n90k71m3J30L48N90O28L35QJ02N84Q97O04j36p19
$$ plain form
52662 240396 239667 238781 237912 237562 238186 239489 240622 241173 241726 243261 246047 249430 252804 256382 260433 264024
52646 264024 265431 264044 261003 257594 253926 249854 246207 244054 243318 243156 243244 243653 243894 243351 242497 242460 243369
52629 243369 244214 244371 244220 244150 244098 244313 245441 247401 249073 249575 249141 248349 247278 245881 244507 243492 242737
52612 242737 242133 241961 242484 243522 244769 246163 247648 248898 249562 249556 249050 248374 247909 247719 247416 246790 246375 246801
52594 246801 247780 248390 248290 247826 247084 245759 244024 242626 241875 241404 241100 241398 242325 243201 243701 244349 245484
52577 245484 246538 246940 247006 247353 247972 248460 248619 248370 247602 246601 246038 246068 245981 245275 244446 244132 244046 243483 242425
52558 242425 241420 240715 240206 239935 239980 240086 240006 239984 240267 240352 239421 237515 235648 234777 235068 236143 237490 238530
52540 238530 238776 238181 237176 236260 235670 235399 235356 235486 235834 236424 237052 237387 237395 237497 238081 238978 239582 239446 238727
52521B38727o48Q8R36J239R30O09Q14J423J953K146K093K038K249K847L574M019
52505B65037M151M154L806K671J091J3m21j199k778m162m331l662l057k533j759
52490B57021j167j313j727j678j531k015k582j994l51R32J181J151J561K133K400
52475B52021K332J902J028J86J63R06J465J255O43J78M9L95J309K371K963L118
52459B72284L282L318K647J373K66m48j237k097k366k004j920k611l415l598l299
52444B60175k965k688k488k485k328j345K84J259P44n15j238j141q11n70j93M66
52428B44161J174J524J235M79m0K73J036J188L77m86l43P35J751J853J053J16
52412B56086j05N60J462K071K769M256O342Q125R283J0333J1430J1648R858N917
$$ plain form
52521 238727 238079 238167 239103 240342 241272 241881 242695 244118 246071 248217 250310 252348 254597 257444 261018 265037
52505 265037 269188 273342 277148 279819 280910 280923 280502 279303 276525 272363 268032 264370 261313 258780 257021
52490 257021 255854 254541 252814 251136 249605 247590 245008 243014 242663 243595 244776 245927 247488 249621 252021
52475 252021 254353 256255 257283 257469 257632 258538 260003 261258 261901 262079 262128 262523 263832 266203 269166 272284
52459 272284 275566 278884 281531 282904 283170 282722 281485 279388 277022 275018 273098 270487 267072 263474 260175
52444 260175 257210 254522 252034 249549 247221 245876 246160 247419 248163 247648 246410 245269 244458 243888 243695 244161
52428 244161 245335 246859 248094 248573 248533 248806 249842 251030 251407 250921 250578 251313 253064 254917 255970 256086
52412 256086 255981 256541 258003 260074 262843 267099 273441 281566 290849 301182 312612 324260 334118 340035
52398C40035Q26l870o874p965q039p983p573o149m077k586k159k043j476n45L94
52383B79916J202J730J775J560J497J466J159J027J833L154L610K930K455L152
52369C08466M346N121N735O661P237O461M522K540J141J89m58p23o50l38K82J123
52353C51655J700J597J003M03P4J35O76J543K402L195M121M981N249M994M983
52338C88711N565O184O464O970Q270R947J1221J2079J3115J4611J6337J8007J9509
52325E36990K0920K2480K4234K5728K6561K7162K8225K9383K9511K8477K7349
52314H27020K6506K5025K2600K0637K0232K0297J9140J7058J5746J5674J5579
52303A045514J4393J2292R824P227M833L201K481K189J736P87p98k907n182p489
$$ plain form
52398 340035 340861 336991 330117 322152 314113 306130 298557 292408 288331 285745 283586 281543 280067 279522 279916
52383 279916 281118 282848 284623 286183 287680 289146 290305 291332 293165 296319 299929 302859 305314 308466
52369 308466 312812 317933 323668 330329 337566 344027 348549 351089 352230 352419 351961 351238 350588 350250 350532 351655
52353 351655 353355 354952 355955 356358 356432 356567 357243 358786 361188 364383 368504 373485 378734 383728 388711
52338 388711 394276 400460 406924 413894 422164 432111 443332 455411 468526 483137 499474 517481 536990
52325 536990 557910 580390 604624 630352 656913 684075 712300 741683 771194 799671 827020
52314 827020 853526 878551 901151 921788 942020 962317 981457 998515 1014261 1029935 1045514
52303 1045514 1059907 1072199 1082023 1089250 1094083 1097284 1099765 1101954 1103690 1104477 1103679 1100772 1095590 1088101
52289A088101j0074j2869j5019j5675j5022j3895j2783j1632j0263q400n682k281
52277I54506R29L394N555P944J0214J1904J3484J5589J7709J8813J8966J9114
52265A098121J9402J8985J7580J6084J5304J5005J4438J3130J0976Q339O135N117
52253A258616M907M463L494K557J711R6k703n808q245j0314j3115j7014k1169
52240A197476k4396k6044k6173k5295k4024k2813k1889k1258k0690j9913j8961
52229I46020j8119j7297j5848j3458j0866r066q072p139o053n362n173m704l377
52216H21486j698n12J58J051K628M466N650N584M559L579L429L893M163L907L500
52201H65843L220K747J843R62P34J086J397J428J547J976K278J991J407J345K090
$$ plain form
52289 1088101 1078027 1065158 1050139 1034464 1019442 1005547 992764 981132 970869 962469 956787 954506
52277 954506 955435 958829 964384 972328 982542 994446 1007930 1023519 1041228 1060041 1079007 1098121
52265 1098121 1117523 1136508 1154088 1170172 1185476 1200481 1214919 1228049 1239025 1247364 1253499 1258616
52253 1258616 1263523 1267986 1271480 1274037 1275748 1275844 1273141 1267333 1259088 1248774 1235659 1218645 1197476
52240 1197476 1173080 1147036 1120863 1095568 1071544 1048731 1026842 1005584 984894 964981 946020
52229 946020 927901 910604 894756 881298 870432 861366 853294 846155 840102 834740 829567 824863 821486
52216 821486 819788 819276 819434 820485 823113 827579 833229 838813 843372 846951 850380 854273 858436 862343 865843
52201 865843 869063 871810 873653 874615 875349 876435 877832 879260 880807 882783 885061 887052 888459 889804 891894
52186H91894L059L564L544L233K584J503L89k41o85j913m261o839q509q996q712
52171H69614p990o965n887n036m375l615k509j057N09J778K598L408M778O474
52157H51725P565P646P260O870O099M590K981K204K242K324K086J847J949K499
52143I09887L542M902O019O562O979P771Q523Q438P775P809R231J1398J3368J4983
52129A027187J6580J8264J9934K1735K4021K6948L0259L3397L5828L7408L8487
52118A330048L9384L9889L9518L8150L6057L3381L0033K6167K2329J8885J5526
52107A669367J1598O781J407l762p998j0936j2664j3562j4014j4229j4266j4203
52095A583519j4286j4792j5616j6255j6391j6359j6754j7765j9183k0833k2367
$$ plain form
52186 891894 894953 898517 902061 905294 907878 909381 909770 909529 908844 906931 902670 895831 887322 878326 869614
52171 869614 861624 854659 848772 843736 839361 835746 833237 832180 832689 834467 837065 840473 845251 851725
52157 851725 859290 866936 874196 881066 887165 891755 894736 896940 899182 901506 903592 905439 907388 909887
52143 909887 913429 918331 924350 930912 937891 945662 954185 962623 970398 978207 987438 998836 1012204 1027187
52129 1027187 1043767 1062031 1081965 1103700 1127721 1154669 1184928 1218325 1254153 1291561 1330048
52118 1330048 1369432 1409321 1448839 1486989 1523046 1556427 1586460 1612627 1634956 1653841 1669367
52107 1669367 1680965 1687746 1689153 1685391 1677393 1666457 1653793 1640231 1626217 1611988 1597722 1583519
52095 1583519 1569233 1554441 1538825 1522570 1506179 1489820 1473066 1455301 1436118 1415285 1392918
52084A392918k2900k1657j8924j5670j2241q355m311j023J481M329P946J1083
52072A312676J2612J3282J4592J6677J8567J9919K1235K2562K3192K2722K1497
52061A519533J9946J8182J6225J4023J1383Q368N600L515J747k04k115l586m955
52048A607662o791q860j0690j2782j6100k0436k4406k7162k9110l0797l2095l2705
52036A355728l2609l1802l0267k8343k6471k4481k1842j8603j5458j2843j0741
52025A102268r252q549q243p741p230p436q368r205r566r842j0098r704q385o759
52011I81890n478m718m751o051q406j0804j2669j4315j5802j6341j5639j4831
51999H52085j5151j6296j7041j7001j6820j6835j6511j5278j3274j1045q931o941
$$ plain form
52084 1392918 1370018 1348361 1329437 1313767 1301526 1293171 1288860 1287837 1289318 1293647 1301593 1312676
52072 1312676 1325288 1338570 1353162 1369839 1388406 1408325 1429560 1452122 1475314 1498036 1519533
52061 1519533 1539479 1557661 1573886 1587909 1599292 1607660 1613260 1616775 1618522 1618318 1616203 1612617 1607662
52048 1607662 1600871 1592011 1581321 1568539 1552439 1532003 1507597 1480435 1451325 1420528 1388433 1355728
52036 1355728 1323119 1291317 1261050 1232707 1206236 1181755 1159913 1141310 1125852 1113009 1102268
52025 1102268 1093016 1084467 1076224 1068483 1061253 1053817 1045449 1036244 1026678 1016836 1006738 997034 988649 981890
52011 981890 976412 971694 966943 960892 952486 941682 929013 914698 898896 882555 866916 852085
51999 852085 836934 820638 803597 786596 769776 752941 736430 721152 707878 696833 687902 680961
51987F80961n109l760l318l777m514m957n192n606o222o944q174j0308j2673j3872
51973E86535j3393j2126j1018j0100r097q123p181n743l482r28J266L174N181
51960E14965P146Q572R369R868J0241J0269R527P589M392O64k372m112n084o158
51946E74876p528q696q981p864n257j850J238L564N736Q358J1087J3181J4523
51933E92387J5520J6184J5979J4544J2143R320O320K861j492o604j1415j4673
51921F51074j6083j6372j6226j5641j4403j2572j0229p337m274j979j089j312
51909E33557k098l433n438p499q615q449p558o528n396l915j956M17K957N231
51895D81277O755P276O863N647L530K43m164q830j2354j3826j3509j2278j0649
$$ plain form
51987 680961 675852 672092 668774 664997 660483 655526 650334 644728 638506 631562 623388 613080 600407 586535
51973 586535 573142 561016 549998 539898 530801 522678 515497 509754 506272 505344 506610 509784 514965
51960 514965 522111 530683 540052 549920 560161 570430 579957 587546 591938 592602 590230 586118 581034 574876
51946 574876 567348 558652 549671 541807 536550 534700 535938 539502 545238 553596 564683 577864 592387
51933 592387 607907 624091 640070 654614 666757 676077 682397 685258 683766 677162 665747 651074
51921 651074 634991 618619 602393 586752 572349 559777 549548 542211 537937 535958 534869 533557
51909 533557 531459 528026 522588 515089 506474 498025 490467 483939 478543 474628 472672 473089 476046 481277
51895 481277 488032 495308 502171 507818 511348 511591 507427 498597 486243 472417 458908 446630 435981
51882D35981q694o611m725k995j114Q52K520L892N385P044Q381R093R337R145
51868D67491Q263O830N491M508L337J463q99l274n468p254q122p861o892n615
51854D51998l895j615P40K570L811M649N003M808M294L493J934n77l220m890n407
51839D63696n500n846o606p568q226p963o713n280m403l799k616p26J141K391
51825D01982L046L172K531J064o91k025k723l035l152k941k304j552j206j361
51811C90805j591j574j400r87K85K678N156O208N497L934K211L21j426k131j634
51796D06352r88r75j047n71j74q43k283l307l541l652m003m110l549k625j868
51781C72816j380q93j82O82J332J373Q29J11m71q98r94l54J038K581L804M906
$$ plain form
51882 435981 427287 420676 415951 412956 411842 412694 415214 419106 424491 431535 439916 449009 458346 467491
51868 467491 475754 482584 488075 492583 495920 497383 496484 493210 487742 480488 472366 464505 457613 451998
51854 451998 448103 446488 447228 449798 453609 458258 463261 468069 472363 475856 477790 477213 473993 469103 463696
51839 463696 458196 452350 445744 438176 429950 421987 415274 409994 405591 401792 399176 398450 399591 401982
51825 401982 405028 408200 410731 411795 411104 409079 406356 403321 400169 397228 394924 393372 392166 390805
51811 390805 389214 387640 386240 385253 385538 388216 393372 399580 405077 409011 411222 411543 410117 407986 406352
51796 406352 405364 404389 403342 402771 402597 401754 399471 396164 392623 388971 384968 380858 377309 374684 372816
51781 372816 371436 370543 370361 371043 372375 373748 374577 374688 374217 373319 372325 371971 373009 375590 379394 384300
51765C84300O186P519Q826J0476J2539J4153J4361J3246J1573R625P044L576o34
51752E02790n216r447j2266j3125j2613j1669j0521r006p556o856o709o146m708
51739C86952k864j107O04K406M307O469R136J1954J3875J3947J2016Q714N180
51726D71589K656J799K259L264M452N569N634L345j357o696j0467j1688j0717
51713D59642q353n311k445r05j543m046o823q224p926o827n592l889j366J336
51699C97728L156L736L327K060J53j434j637o51J60k8n04j05J251K419K205M37
51683D12273j929l651m242m135l866l415k569j556p98k75L71J240K216L431N123
51668C98218P058Q665R877J1387J3814J6788J8923J8699J5552J0274M191k043
$$ plain form
51765 384300 390486 398005 406831 417307 429846 443999 458360 471606 483179 492804 499848 503424 502790
51752 502790 497574 488127 475861 462736 450123 438454 427933 418927 411371 404515 397806 391660 386952
51739 386952 384088 382981 383585 385991 390298 396767 405903 417857 431732 445679 457695 466409 471589
51726 471589 474245 476044 478303 481567 486019 491588 497222 500567 499210 492514 482047 470359 459642
51713 459642 451289 445978 443533 442628 441085 437039 430216 421992 414066 407239 401647 397758 396392 397728
51699 397728 400884 404620 407947 410007 410160 408726 407089 406438 406598 406570 406066 405961 407212 409631 411836 412273
51683 412273 410344 406693 402451 398316 394450 391035 388466 386910 386112 385837 386208 387448 389664 393095 398218
51668 398218 405276 413941 423818 435205 449019 465807 484730 503429 518981 529255 533446 531403
51656E31403q419j4217j7548j7019j3416q952n024j483K008M835N904M775K035
51643D64882j148l794n638o971p994q587q738q738q693q328p577o782o000m782
51629C71112l116j781j151m78P80J772J505N65K85P56J039R13R12Q85J33r75j177
51612C71979l33K66r5o43p01p33j155j428j142q32q86p06K41J459K358L240M419
51595C75308N356N716O517Q762J1472J2262R904N321K45m135p194q574q351p081
51581D05528n395l727k286j065J25J416K838M628P153J0191J2666J3600J3164
51568D58836J2492J2647J3945J5990J7890J8731J8249J7056J6138J6411J8652
51557F37037K3181K9205L5052L9531M2580M4143M3051L7915K8824J7490N814n018
$$ plain form
51656 531403 522984 508767 491219 474200 460784 451832 446808 445325 447333 452168 458072 462847 464882
51643 464882 463734 459940 454302 447331 439337 430750 422012 413274 404581 396253 388676 381894 375894 371112
51629 371112 367996 366215 365064 364586 365366 367138 368643 369208 369493 370249 371288 372201 373113 373998 374131 373156 371979
51612 371979 371646 371912 371817 371174 370473 369740 368585 367157 366015 365183 364297 363591 363832 365291 367649 370889 375308
51595 375308 380664 386380 392897 401659 413131 425393 435297 440618 440863 436728 429534 420960 412609 405528
51581 405528 400133 396406 394120 393055 393180 394596 397434 402062 409215 419406 432072 445672 458836
51568 458836 471328 483975 497920 513910 531800 550531 568780 585836 601974 618385 637037
51557 637037 660218 689423 724475 764006 806586 850729 893780 931695 960519 978009 983823 978805
51545I78805j4369k2040k8454l4176l9021m2092m2853m1675l9181l5620l1183
51534F08141k6474k2208j8666j5786j3625j2342j1785j1373j0543r166p537o012
51522D42624m718l561k421j406q43r45j451j727j355n09L26Q97J141Q15l68k084
51506D24415l392l652l121k485k091k012k333k907l141k621j765j344j513j749
51492C90289j659j237n92N7L08K6k97k15n3l17o84o17o38j777l708m805m416l741
51474C65924l935m538m576m118l738l344k657k179k460k864k289r14J5j5k47o4
51458C28001J52j04n72o52j86N81J374J952K180K319K895M044N331O352P152P847
51442C68666Q228Q170Q128Q705R712J0055Q735N729J836k013n015o304n274k456
$$ plain form
51545 978805 964436 942396 913942 879766 840745 798653 755800 714125 674944 639324 608141
51534 608141 581667 559459 540793 525007 511382 499040 487255 475882 465339 456173 448636 442624
51522 442624 437906 434345 431924 430518 429675 428730 427279 425552 424197 423688 424014 424911 426052 426867 426499 424415
51506 424415 421023 417371 414250 411765 409674 407662 405329 402422 399281 396660 394895 393551 392038 390289
51492 390289 388630 387393 386801 386858 387166 387192 386895 386680 386627 386310 385626 385009 384371 382594 378886 374081 369665 365924
51474 365924 361989 357451 352875 348757 345019 341675 339018 336839 334379 331515 329226 328312 328327 328312 328065 328001
51458 328001 328153 328049 327477 326825 326639 327220 328594 330546 332726 335045 337940 341984 347315 353667 360819 368666
51442 368666 376894 385064 393192 401897 411609 421664 430399 436128 437964 435951 430936 424632 419358 416902
51428D16902K90J126j74k316m127n522o736p319o546m564k407r14j11L38N93P94
51412C79307J165J656J794J362R70J429K568L318L062K352J928J631R42J10j08
51397D03486K44L22k8J42J316K394K125J059R94K654M986O755P980R443J1534
51382D55406J4068J6862K0118K4284K9588L5576M1250M6106N0833N6324O1789
51371H52204O4383O1209N1715L8137K3885J1365Q57q850j8719k8362l6633m3006
51359I68185m7841n1436n3364n3050n0722m7484m4374m1271l7017l0960k4232
51348D86434j8878j5593j3163j0461p936o448n714n030m725n445o538o654n770
51335C74079n042m804m244l206k641k967l407l477l609l797l139j543m15o26j072
$$ plain form
51428 416902 417192 418318 418144 415828 411701 406179 399443 392124 385578 381014 378607 377693 377582 377920 378513 379307
51412 379307 380472 382128 383922 385284 386254 387683 390251 393569 396631 398983 400911 402542 403484 403594 403486
51397 403486 403730 404052 404024 404166 405482 407876 410001 411060 412054 414708 419694 426449 434429 443872 455406
51382 455406 469474 486336 506454 530738 560326 595902 637152 683258 734091 790415 852204
51371 852204 916587 977796 1029511 1067648 1091533 1102898 1103755 1094905 1076186 1047824 1011191 968185
51359 968185 920344 868908 815544 762494 711772 664288 619914 578643 541626 510666 486434
51348 486434 467556 451963 438800 428339 420403 413955 408241 403211 398486 393041 386503 379849 374079
51335 374079 369037 364233 359989 356783 354142 351175 347768 344291 340682 336885 333746 332203 331788 331162 330090
51320C30090m54O67R03K95O5O29J195J092N41K17P62K434M582N838N500M241K936
51303C61533J486l41j689j491j94N85M7j091j880k204k492l035l756m214l930
51288C37334l017k222j875j329L1J703K740L085L416L986M490M888N407N756N218
51273C69611L642J722J75q32j394j540j254m83Q01K308L406L734L526L066K177
51258C88665P08r34k269l298m092m287l719l016k851k974k797k496k682l243l449
51243C47266l009k227j303l51J50j71p97q50k92J43O6l99j252k453l280k938j811
51226C26492j084j137j268r75m87R4R85J918K179J797J675K142K356J686P92P69
51210C37934J823L256M231M254L444K625K584L095L287K992K846K980K694J817
$$ plain form
51320 330090 329636 330303 331206 331501 331566 332195 333390 334482 335023 335240 336002 338436 343018 348856 354356 358597 361533
51303 361533 363019 362678 360989 359498 359304 359889 359936 358845 356965 354761 352269 349234 345478 341264 337334
51288 337334 334317 332095 330220 328891 328922 330625 333365 336450 339866 343852 348342 353230 358637 364393 369611
51273 369611 373253 374975 375150 374318 372924 371384 370130 369647 370448 372756 376162 379896 383422 386488 388665
51258 388665 389373 388439 386170 382872 378780 374493 370774 367758 364907 361933 359136 356640 353958 350715 347266
51243 347266 344257 342030 340727 340376 340526 340355 339558 338708 338416 338559 338625 338226 336974 334521 331241 328303 326492
51226 326492 325408 324271 323003 322028 321541 321635 322620 324538 326717 328514 330189 332331 334687 336373 337165 337934
51210 337934 339757 343013 347244 351498 354942 357567 360151 363246 366533 369525 372371 375351 378045 379862
51196C79862J196J199Q17q52k986l989l529k680k334k404k405k065j323l16N76
51181C58767J074J271J288R02rr01r88k32O06Q69O43M50O12R88J150P98Q9m38
51163C66939m02Q4P04J426K386L375L708K933J540O82R23J449R89m90j580j163
51147C83503K12J159J129N76p7p97j479k020k759l965m925m520k859j373r51r47
51131C59907n24On2m86n78k95j85k64Q6J092K179K697K634K453K533K832K980
51114C77015K700K212K074K498L057L276L170K993K758K365K010K017K307K424
51100D12876K087J452Q38M13K39L66P40J102J094N66j88o64p15p53j138j530j255
51083D15530l16M46L97r6k51P0L77L84K69R6m40j356j871j180M41J782K185K283
$$ plain form
51196 379862 381058 382257 383074 382222 379236 375247 371718 369038 366704 364300 361895 359830 358507 358191 358767
51181 358767 359841 361112 362400 363302 363293 362392 361404 361172 361778 362647 363290 363740 364352 365340 366490 367288 367377 366939
51163 366939 366537 366621 367325 368751 371137 374512 378220 381153 382693 383375 384298 385747 386736 386246 384666 383503
51147 383503 383715 384874 386003 386579 386502 385705 384226 382206 379447 375482 370557 366037 363178 361805 360854 359907
51131 359907 359383 359389 359337 358851 358273 357978 357793 357529 357615 358707 360886 363583 366217 368670 371203 374035 377015
51114 377015 379715 381927 384001 386499 389556 392832 396002 398995 401753 404118 406128 408145 410452 412876
51100 412876 414963 416415 417253 417666 417905 418271 419011 420113 421207 421773 421585 420921 420206 419453 418315 416785 415530
51083 415530 415214 415660 416057 415961 415710 415780 416157 416541 416810 416906 416466 415110 413239 412059 412500 414282 416467 418750
51065D18750K945M102N166O261Q037J0501J3059J5769J9175K2340K2478J7879
51053E66462J0516M466K185L452P254J2719J8052K0557J9064J5365J2195J0212
51041G02499P730L055l572j0158j4416j5164j2867r120n695m059n232r316j4898
51028F08787j9619k1758k1184j8752j5311j1481p781m544j887J30J547K777M265
51015D95189N904P180Q043Q974J0055J0684J0489R924R528R157Q417P420O659
51002F07623O503P153Q590J0246J1172J1092J0795J0999J1262J0719R507Q624
50990G24285Q468Q226O996M953L130K282K308K750L611N393Q268J1522J4131J5689
50976H22012J6388J6380J5795J5372J6239J8795K2435K6608L1571L7659M4439
$$ plain form
51065 418750 421695 425797 430963 437224 445261 455762 468821 484590 503765 526105 548583 566462
51053 566462 576978 581444 583629 587081 594335 607054 625106 645663 664727 680092 692287 702499
51041 702499 710229 713284 709712 699554 685138 669974 657107 647987 642292 638233 633001 623685 608787
51028 608787 589168 567410 546226 527474 512163 500682 492901 488357 486470 486600 488147 490924 495189
51015 495189 501093 508273 516316 525290 535345 546029 556518 566442 575970 585127 593544 600964 607623
51002 607623 614126 621279 629869 640115 651287 662379 673174 684173 695435 706154 715661 724285
50990 724285 732753 740979 747975 752928 756058 758340 760648 763398 767009 772402 780670 792192 806323 822012
50976 822012 838400 854780 870575 885947 902186 920981 943416 970024 1001595 1039254 1083693
50965A083693N1130N7459O3634O9748P5614Q0920Q5338Q8734R1427R3775R5240
50954A936712R4451R0540Q3909P5281O4734N2282L8854K5777J3597K056q964j9157
50942B450072k8129l5289l9742m1266m1369m2378m5172m8352m9919m9203m6952
50931A982301m4221m1669l9534l7796l6355l5339l5140l6000l7723l9889m2255
50920A556380m4698m6857m8090m7956m6700m5054m3400m1348l8358l4611l0946
50909A088362k7906k5280k2689k0115j7724j5507j3460j1808j0749j0178r954
50898I02992j0090j0413j0317r358p871o591n751m945l820k465j158n4P98J432
50884H32389K033K761L479L907M037M226M801N711O682P554Q458R665J1251J2888
$$ plain form
50965 1083693 1134823 1192282 1255916 1325664 1401278 1482198 1567536 1656270 1747697 1841472 1936712
50954 1936712 2031163 2121703 2205612 2280893 2345627 2397909 2436763 2462540 2476137 2478193 2469229 2450072
50942 2450072 2421943 2386654 2346912 2305646 2264277 2221899 2176727 2128375 2078456 2029253 1982301
50931 1982301 1938080 1896411 1856877 1819081 1782726 1747387 1712247 1676247 1638524 1598635 1556380
50920 1556380 1511682 1464825 1416735 1368779 1322079 1277025 1233625 1192277 1153919 1119308 1088362
50909 1088362 1060456 1035176 1012487 992372 974648 959141 945681 933873 923124 912946 902992
50898 902992 892902 882489 872172 862814 854943 848352 842601 837656 833836 831371 830213 830159 830957 832389
50884 832389 834422 837183 840662 844569 848606 852832 857633 863344 870026 877580 886038 895703 906954 919842
50870I19842J4048J4488J4502J4645J5344J6815J9137K2185K5564K8820L1818
50859A137208L4865L8424M2729M7658N3057N9133O6409P5134Q4932R5256J06016
50848A840821J17503J29792J42630J55815J69214J82348J94320K04419K12450
50839C349312K18262K21197K20091K13564K00214J79056J50336J15970P8857M1385
50829D988244M602l1210o5187r5285j19296j36300j46680j50799j48407j39738
50819C959944j26464j10813r4292p7960o3584n3321m8295m8190n2128n9031o7289
50808C158577p5297q2739r0526r9058j07326j13937j18213j19936j18872j15168
50798B117505j09542j02599r4441q5313p6030o7297n9096n1127m3309l5580k7760
$$ plain form
50870 919842 933890 948378 962880 977525 992869 1009684 1028821 1051006 1076570 1105390 1137208
50859 1137208 1172073 1210497 1253226 1300884 1353941 1413074 1479483 1554617 1639549 1734805 1840821
50848 1840821 1958324 2088116 2230746 2386561 2555775 2738123 2932443 3136862 3349312
50839 3349312 3567574 3788771 4008862 4222426 4422640 4601696 4752032 4868002 4946859 4988244
50829 4988244 4992846 4961636 4896449 4801164 4681868 4545568 4398888 4248089 4099682 3959944
50819 3959944 3833480 3722667 3628375 3550415 3486831 3433510 3385215 3337025 3284897 3225866 3158577
50808 3158577 3083280 3000541 2910015 2810957 2703631 2589694 2471481 2351545 2232673 2117505
50798 2117505 2007963 1905364 1810923 1725610 1649580 1582283 1523187 1472060 1428751 1393171 1365411
50787A365411k0102j3387q187m395j785l72K6r4n24j456k685l515l781m162n035
50772A295957n872o288o760p713q763r591j0736j2681j4888j6567j7696j8495
50760A159907j8644j7913j6916j6208j5264j3338j0827q666o853m629j868Q05
50748A029586L038M999O847Q825J1580J5453J9754K3643K7478L2327L8389M4924
50736A266843N1512N8374O5488P2363P8719Q4608Q9981R4795R9274J03278J05851
50725B171086J06425J06097J06455J07299J06826J04035R9558R3781Q5440P2623
50715C159625N4329L0847L522k5263n2631p6267r4715j06867j12074j10940j05148
50704B564418r6207q4983p2393n9660m7670l6877k7953k1668j7954j6104j6272
$$ plain form
50787 1365411 1345309 1331922 1323735 1319340 1317555 1317183 1317209 1317115 1316591 1315135 1312450 1308935 1305154 1300992 1295957
50772 1295957 1290085 1283797 1277037 1269324 1260561 1250970 1240234 1227553 1212665 1196098 1178402 1159907
50760 1159907 1141263 1123350 1106434 1090226 1074962 1061624 1050797 1042131 1035278 1030649 1028781 1029586
50748 1029586 1032624 1037623 1044470 1053295 1064875 1080328 1100082 1123725 1151203 1183530 1221919 1266843
50736 1266843 1318355 1376729 1442217 1514580 1593299 1677907 1767888 1862683 1961957 2065235 2171086
50725 2171086 2277511 2383608 2490063 2597362 2704188 2808223 2907781 3001562 3087002 3159625
50715 3159625 3213954 3244801 3248323 3223060 3170429 3094162 2999447 2892580 2780506 2669566 2564418
50704 2564418 2468211 2383228 2310835 2251175 2203505 2166628 2138675 2117007 2099053 2082949 2066677
50693B066677j9737k7085l6894m6764n5062o1185o4957o6477o6201o4476o1197
50682A496642n6259n0066m3287l6412k9722k3321j6988j0403l601L046R377J5416
50670A254422K0866K5176K8308L0707L2357L2500L0703K7601K4222K1141J8605
50659A546608J6916J6096J5586J4841J4094J4077J5095J6626J7831J8321J8494
50648A724585J9139K0680K2889K5453K8521L2377L6869M1565M6224N0628N4313
50637B103243N7102N9527O1915O3338O2466N9361N5422N1581M7731M4063M1484
50626B707233L9911L7014K9640J6245k157k2603m1192n4431o0693o0539n5478
50615B532950m6937l6462k5869j6392q076o22N677J0326J3344J4843J4208J0517
$$ plain form
50693 2066677 2046940 2019855 1982961 1936197 1881135 1819950 1754993 1688516 1622315 1557839 1496642
50682 1496642 1440383 1390317 1347030 1310618 1280896 1257575 1240587 1230184 1226583 1229629 1239006 1254422
50670 1254422 1275288 1300464 1328772 1359479 1391836 1424336 1455039 1482640 1506862 1528003 1546608
50659 1546608 1563524 1579620 1595206 1610047 1624141 1638218 1653313 1669939 1687770 1706091 1724585
50648 1724585 1743724 1764404 1787293 1812746 1841267 1873644 1910513 1952078 1998302 2048930 2103243
50637 2103243 2160345 2219872 2281787 2345125 2407591 2466952 2522374 2573955 2621686 2665749 2707233
50626 2707233 2747144 2784158 2813798 2830043 2827886 2805283 2764091 2709660 2648967 2588428 2532950
50615 2532950 2486013 2449551 2423682 2407290 2399214 2398592 2404269 2414595 2427939 2442782 2456990 2467507
50603B467507L607n790j6909k9278m2280n4879o5931p4555q0283q3162q3678q2342
50591A852027p9360p4788o8942o2540n6372n0870m5957m1391l7292l4031l1512
50580A268972k9019k6234k3823k2354k1022j8428j4505j0657p845n589l090l52
50568A086054K265M723O946Q541R512J0650J2603J5061J7417J9650K1992K4190
50556A239604K5909K7470K9419L1600L3261L4014L4054L3555L2384L0533K8366
50545A580169K6350K4722K3499K2713K2639K3854K6841L1458L7033M3017M9346
50534A911641N6115O3293P0887P8960Q7288R5278J02493J09065J15498J22194
50524B812712J29182J35942J41530J45220J46976J46978J44764J39466J30748
$$ plain form
50603 2467507 2471114 2465324 2448415 2419137 2376857 2321978 2256047 2181492 2101209 2018047 1934369 1852027
50591 1852027 1772667 1697879 1628937 1566397 1510025 1459155 1413198 1371807 1334515 1300484 1268972
50580 1268972 1239953 1213719 1189896 1167542 1146520 1128092 1113587 1102930 1095085 1089496 1086406 1086054
50568 1086054 1088319 1093042 1099988 1108529 1118041 1128691 1141294 1156355 1173772 1193422 1215414 1239604
50556 1239604 1265513 1292983 1322402 1354002 1387263 1421277 1455331 1488886 1521270 1551803 1580169
50545 1580169 1606519 1631241 1654740 1677453 1700092 1723946 1750787 1782245 1819278 1862295 1911641
50534 1911641 1967756 2031049 2101936 2180896 2268184 2363462 2465955 2575020 2690518 2812712
50524 2812712 2941894 3077836 3219366 3364586 3511562 3658540 3803304 3942770 4073518
50515D073518J18811J03480Q4240O1417L6479J0800j5101m0720o4883q6638j06016
50504D175387j23046j36335j43694j43989j37812j26422j10783r1704p0298m7814
50494C043490k5161k746J9033L9087N5559O6715P1713P0189O1258M3856J8362
50483C461355j2576m5107p5683j01688j21624j35377j43883j47881j47340j42415
50473B387781j34495j25687j17320j09285j00703r1027q0664p0738o2131n4763
50463A440968m8019m1804l6582l2327k8099k3002j7136j1350o467k956q76J50
50451A192500P20J251K015L423N668Q235J0384J2164J4145J6172J7280J7061J6158
50438A317176J5073J3440J0938Q087N618L806K855L083M238N396O118O930Q154
$$ plain form
50515 4073518 4192329 4295809 4380049 4441466 4477945 4488745 4473644 4432924 4368041 4281403 4175387
50504 4175387 4052341 3916006 3772312 3628323 3490511 3364089 3253306 3161602 3091304 3043490
50494 3043490 3018329 3015583 3034616 3073703 3129262 3195977 3267690 3337879 3399137 3442993 3461355
50483 3461355 3448779 3403672 3327989 3226301 3104677 2969300 2825417 2677536 2530196 2387781
50473 2387781 2253286 2127599 2010279 1900994 1800291 1709264 1628600 1557862 1495731 1440968
50463 1440968 1392949 1351145 1314563 1282236 1254137 1231135 1213999 1202649 1196182 1193226 1192350 1192500
50451 1192500 1193220 1194471 1196486 1199909 1205577 1213812 1224196 1236360 1250505 1266677 1283957 1301018 1317176
50438 1317176 1332249 1345689 1356627 1364714 1370332 1374138 1376993 1380076 1384314 1389710 1395828 1402758 1410912
50425A410912R263J0016J1253J3643J6435J8491J9864K1388K3337K5615K8712
50414A608929L3275L8952M4715N0216N5810O1403O6191O9620P1767P2726P2287
50403B245891P0418O7472O3797N9544N4774M9414M3001L4771K3985J0229o211
50392B717085k4047m1507n7460p1624q3562r2174r6593r6970r3916q7698p8598
50381A892936o7424n5070m1977k8519j5474l500P365J7250K5838L2510L6456L6360
50369A836751L0965K0583P324o698k0648l4023m5722n4946o2007o7067o9127o7497
50357A467888o3549n9574n6474n3754n1094m8491m5456m1589l7609l4383l1234
50346I44681k6802k1299j6311j2454q850m965j286K142O175J0977J5274J7752
$$ plain form
50425 1410912 1420175 1430191 1441444 1455087 1471522 1490013 1509877 1531265 1554602 1580217 1608929
50414 1608929 1642204 1681156 1725871 1776087 1831897 1893300 1959491 2029111 2100878 2173604 2245891
50403 2245891 2316309 2383781 2447578 2507122 2561896 2611310 2654311 2689082 2713067 2723296 2717085
50392 2717085 2693038 2651531 2594071 2522447 2438885 2346711 2250118 2153148 2059232 1971534 1892936
50381 1892936 1825512 1770442 1728465 1699946 1684472 1680972 1688337 1705587 1731425 1763935 1800391 1836751
50369 1836751 1867716 1888299 1895623 1888925 1868277 1834254 1788532 1733586 1671579 1604512 1535385 1467888
50357 1467888 1404339 1344765 1288291 1234537 1183443 1134952 1089496 1047907 1010298 975915 944681
50346 944681 917879 896580 880269 867815 858965 854000 852714 854856 861031 872008 887282 905034
50334I05034J8119J6304J1990N753l66m456o402p309p844p762o641m493j822N99
50320I10704K216L144L913M690N039M469K943Q76j150k715l909n012n701n055
50306I14452k861l24J184J686K165L086M175N257O321P109P529Q265J0003J2311
50292I80358J4149J5245J6081J6895J7731J9113K1638K4941K7962K9575K7964
50281A211652K0470O179j1455k6464l5253l8344l7716l4500k9649k4640k0342
50270I79938j6451j2771r891p981o373m930m488n189n777n416m854m851m662l341
50256H82963j401R8J225K738M701O657Q637J0873J3051J4909J7050K0091K3338
50243A004930K5337K5600K4817K3580K1801J9486J7310J6109J6054J6381J5908
$$ plain form
50334 905034 923153 939457 951447 957200 956834 952378 945976 938667 930823 923061 916420 911927 910105 910704
50320 910704 912920 916064 919977 924667 929706 934175 937118 937994 936844 934129 930220 925208 919507 914452
50306 914452 911591 911267 912451 914137 916302 919388 923563 928820 935141 942250 949779 958044 968047 980358
50292 980358 994507 1009752 1025833 1042728 1060459 1079572 1101210 1126151 1154113 1183688 1211652
50281 1211652 1232122 1238301 1226846 1200382 1165129 1126785 1089069 1054569 1024920 1000280 979938
50270 979938 963487 950716 940825 932844 926471 921541 917053 911864 906087 900671 895817 890966 886304 882963
50256 882963 881562 881660 882885 885623 890324 896981 905618 916491 929542 944451 961501 981592 1004930
50243 1004930 1030267 1055867 1080684 1104264 1126065 1145551 1162861 1178970 1195024 1211405 1227313
50232A227313J3987J1013P593L383k637j0469j8515k4997k9395l2061l3227l2912
50220A079076l1244k8409k4573k0162j5790j1772q391o722q130j2454j7585k1387
50208H72457k3341k3874k3113k1061j8245j5334j2625j0447r279q832p953o234
50196F92119m922n172o196o287n148m012l781m193m630m782m526m087m173n115
50182F25095o036n754m427l413l466l941m002l743l755m084m142l455k213j044
50168E71620l44L9M04O99Q80J446K926M731N500M909M239M639N678O389O893P943
50152F28591R409J0393J0601J0602J0687J0377R237P531N885M768M291M134L696
50139G30202K778K042K485M482P604J1204J4892J8663K2792K7441L2192L6300
$$ plain form
50232 1227313 1241300 1252313 1259906 1263289 1260652 1250183 1231668 1206671 1177276 1145215 1111988 1079076
50220 1079076 1047832 1019423 994850 974688 958898 947126 938735 932013 923883 911429 893844 872457
50208 872457 849116 825242 802129 781068 762823 747489 734864 724417 715138 706306 698353 692119
50196 692119 687197 682025 675829 669542 664394 660382 656601 652408 647778 642996 638470 634383 630210 625095
50182 625095 619059 613305 608878 605465 601999 598058 594056 590313 586558 582474 578332 574877 572664 571620
50168 571620 571276 571315 571719 572418 573298 574744 577670 582401 587901 592810 597049 601688 607366 613755 620648 628591
50152 628591 638000 648393 658994 669596 680283 690660 699897 707428 713313 718081 722372 726506 730202
50139 730202 732980 735022 737507 741989 749593 760797 775689 794352 817144 844585 876777 913077
50127I13077L9522M2147M4018M4256M2495L9824L7844L7196L7511L8255L8894
50116A355039L8692L7075L3976K9286K2377J2925J863r181j9129k7607l4292l8984
50104A402040m2056m4083m5155m5076m3939m1813l8379l3718k9127k6074k4464
50093I88156k2981k1074j9514j8812j8229j6744j4295j1551q993o716m682k832
50081H21733j187M1O33P41P06N49l0j100k337l476m500n382n997o363o699p157
50065G80175p686q129q239p791o884n992n446n039m396l520k691k084j787j875
50051G08616k054j595r7J931L685M881N598N742N404N324O214P768R058R653R648
50036G79776Q890P200N313M518N144O137O435O006N300M468L578L020L173L854
$$ plain form
50127 913077 952599 994746 1038764 1083020 1125515 1165339 1203183 1240379 1277890 1316145 1355039
50116 1355039 1393731 1430806 1464782 1494068 1516445 1529370 1531233 1522052 1502923 1475316 1441024 1402040
50104 1402040 1359984 1315901 1270746 1225670 1181731 1139918 1101539 1067821 1038694 1012620 988156
50093 988156 965175 944101 924587 905775 887546 870802 856507 844956 835963 829247 824565 821733
50081 821733 820546 820587 821220 821961 822667 823216 823186 822086 819749 816273 811773 806391 800394 794031 787332 780175
50065 780175 772489 764360 756121 748330 741446 735454 730008 724969 720573 717053 714362 712278 710491 708616
50051 708616 706562 704967 704870 706801 710486 715367 720965 726707 732111 737435 743649 751417 760475 770128 779776
50036 779776 788666 795866 801179 805697 810841 816978 823413 829419 834719 839187 842765 845785 848958 852812
50022H52812M442M308L143J241m49r66k16J144K776N031P941J0455J1366J0930
50008I13958J0904J2780J6093J8765J9081J7210J4776J3211J2798J3170J4212
49997A076958J6194J9208K2665K5247K5402K2277J6194Q038j619j2221k2301k9906
49985A166136l4306l6424l7258l6793l5063l3206l2409l2419l2167l1318l0166
49974G94607k8501k5772k2228j8822j5988j3476j1241r548q264p018o008n692
49962F22049n658m962l668k994l536m337m190k973j268N89K492M200N576O882
49948F08202Q411J0161J2040J3964J5503J5906J4782J2477R640O779M342K793
49936G35000K299K592L079K868Q31l588r551j5222j9155k0948k0739j8855j6037
$$ plain form
50022 852812 857254 861562 864705 865946 865497 864531 864315 865459 868235 873266 881207 891662 903028 913958
50008 913958 924862 937642 953735 972500 991581 1008791 1023567 1036778 1049576 1062746 1076958
49997 1076958 1093152 1112360 1135025 1160272 1185674 1207951 1224145 1232183 1230564 1218343 1196042 1166136
49985 1166136 1131830 1095406 1058148 1021355 986292 953086 920677 888258 856091 824773 794607
49974 794607 766106 740334 718106 699284 683296 669820 658579 649031 640767 633749 627741 622049
49962 622049 616391 611429 607761 604767 601231 596894 592704 589731 588463 589052 591544 595744 601320 608202
49948 608202 616613 626774 638814 652778 668281 684187 698969 711446 721086 727865 732207 735000
49936 735000 737299 739891 742970 745838 746669 743081 733530 718308 699153 678205 657466 638611 622574
49923F22574j3285j1172r645q548p745o737m955k664q95j76P0O07J451K151K434
49908E63465K261J856J955L338N647P315P273O328O211P610R735J1633J3196J4763
49894F62586J6158J6473J4838J1357P153L434O76j105j834j687j741l304o410
$$ plain form
49923 622574 609289 598117 588472 579924 572179 565442 560487 557823 556928 556752 556822 557429 558880 561031 563465
49908 563465 565726 567582 569537 572875 578522 585837 593110 599438 605649 613259 622994 634627 647823 662586
49894 662586 678744 695217 710055 721412 728565 731999 732675 731570 729736 728049 726308 723004 716594
$$ [...]
##END NTUPLES=NMR SPECTRUM
##END=
