
##TITLE=AC1301_CHIAH12113_6615675_3NLAVWHiYS
##JCAMPDX= 6.0         $$ Bruker NMR JCAMP-DX V2.0
##DATA TYPE= NMR SPECTRUM
##DATA CLASS= NTUPLES
##ORIGIN= BRUKER
##OWNER= Administrator
$$ 1.72 TOPSPIN		Version 2.1
$$ 2012-08-02 22:49:25.968 -0500  Administrator@TOPSPIN
$$ Compression mode = diff/dup
##.OBSERVE FREQUENCY= 400.02188249412
##.OBSERVE NUCLEUS= ^1H
##.ACQUISITION MODE= SIMULTANEOUS (DQD)
##.ACQUISITION SCHEME= undefined
##.AVERAGES= 8
##.DIGITISER RES= 22
##SPECTROMETER/DATA SYSTEM= spect
##.PULSE SEQUENCE= zg30
##.SOLVENT NAME= COFFEE_meoh
##.SHIFT REFERENCE= INTERNAL, COFFEE_meoh, 1, 14.98509
##AUDIT TRAIL= $$ (NUMBER, WHEN, WHO, WHERE, PROCESS, VERSION, WHAT)
$$ ##TITLE= Audit trail, TOPSPIN		Version 2.1
$$ ##JCAMPDX= 5.01
$$ ##ORIGIN= Bruker BioSpin GmbH
$$ ##OWNER= Administrator
$$ $$ C:\Bruker\TOPSPIN/data/COFFEE/nmr/AC1301_CHIAH12113_6615675_3NLAVWHiYS/10/pdata/1/auditp.txt
$$ ##AUDIT TRAIL=  $$ (NUMBER, WHEN, WHO, WHERE, PROCESS, VERSION, WHAT)
(   1,<2012-08-02 22:49:18.843 -0500>,<Administrator>,<TOPSPIN>,<go>,<TOPSPIN 2.1>,
      <created by zg
	started at 2012-08-02 22:48:12.218 -0500,
	POWCHK enabled, PULCHK disabled,
       configuration hash MD5:
       6B 1B 68 BB D9 2E 58 E2 7F 35 AD 54 07 DF 0E 41
       data hash MD5: 64K
       1D C8 5E 55 67 2B 05 C5 2F BB 30 5A 13 5C 62 5C>)
(   2,<2012-08-02 22:49:21.843 -0500>,<Administrator>,<TOPSPIN>,<proc1d>,<TOPSPIN 2.1>,
      <Start of raw data processing
       efp LB = 0 FT_mod = 6 PKNL = 1 PHC0 = 0 PHC1 = 0 SI = 32K 
       data hash MD5: 32K
       60 CC 38 5C D5 97 4C 88 44 E8 24 49 A8 F5 90 C1>)
(   3,<2012-08-02 22:49:22.171 -0500>,<Administrator>,<TOPSPIN>,<proc1d>,<TOPSPIN 2.1>,
      <pk PHC0 = 178.3521 PHC1 = 0 
       data hash MD5: 32K
       7C F2 D0 AE 4A AC 63 65 C8 31 4D EE C1 05 AF 9D>)
(   4,<2012-08-02 22:49:22.234 -0500>,<Administrator>,<TOPSPIN>,<proc1d>,<TOPSPIN 2.1>,
      <abs ABSG = 1 
       data hash MD5: 32K
       F8 E4 0D EE 46 37 FC AC AF B8 0E 3A 40 DA 51 A1>)
(   5,<2012-08-02 22:49:22.265 -0500>,<Administrator>,<TOPSPIN>,<proc1d>,<TOPSPIN 2.1>,
      <abs ABSG = 2 
       data hash MD5: 32K
       EC 5F 98 1E DF 7F 35 D2 D6 6B 19 1F 02 E1 97 AB>)
(   6,<2012-08-02 22:49:22.312 -0500>,<Administrator>,<TOPSPIN>,<proc1d>,<TOPSPIN 2.1>,
      <abs ABSG = 3 
       data hash MD5: 32K
       88 50 58 6C 53 A8 8B 62 41 81 1D 15 38 41 86 6A>)
(   7,<2012-08-02 22:49:22.343 -0500>,<Administrator>,<TOPSPIN>,<proc1d>,<TOPSPIN 2.1>,
      <abs ABSG = 4 
       data hash MD5: 32K
       9E 5F BD CD C5 71 CE 55 5F 71 96 3B BB 2D AA F0>)
(   8,<2012-08-02 22:49:22.468 -0500>,<Administrator>,<TOPSPIN>,<proc1d>,<TOPSPIN 2.1>,
      <abs ABSG = 5 
       data hash MD5: 32K
       CB B9 61 8A 2E 57 98 3A 63 BE 6C 46 69 B5 D8 DA>)
$$ ##END=
$$ 
$$ $$ hash MD5
$$ $$ 94 D9 45 F2 B6 D8 08 BD 38 D2 47 D3 4C 19 48 E5
##$RELAX= 
##$RELAX= 
##$RELAX= 
##$RELAX= 
##$RELAX= 
##$RELAX= 
##$RELAX= 
$$ Bruker specific parameters
$$ --------------------------
$$ [...]
##$TP= (0..7)
150 150 150 150 150 150 150 150
##$TP07= 0
##$TPNAME0= <>
##$TPNAME1= <>
##$TPNAME2= <>
##$TPNAME3= <>
##$TPNAME4= <>
##$TPNAME5= <>
##$TPNAME6= <>
##$TPNAME7= <>
##$TPOAL= (0..7)
0.5 0.5 0.5 0.5 0.5 0.5 0.5 0.5
##$TPOFFS= (0..7)
0 0 0 0 0 0 0 0
##$TUNHIN= 0
##$TUNHOUT= 0
##$TUNXOUT= 0
##$USERA1= <user>
##$USERA2= <user>
##$USERA3= <user>
##$USERA4= <user>
##$USERA5= <user>
##$V9= 5
##$VALIST= <valist>
##$VCLIST= <CCCCCCCCCCCCCCC>
##$VD= 0
##$VDLIST= <DDDDDDDDDDDDDDD>
##$VPLIST= <PPPPPPPPPPPPPPP>
##$VTLIST= <TTTTTTTTTTTTTTT>
##$WBST= 1024
##$WBSW= 4
##$XGAIN= (0..3)
0 0 0 0
##$XL= 0
##$YL= 0
##$YMAX_a= 494968
##$YMIN_a= -649025
##$ZGOPTNS= <>
##$ZL1= 120
##$ZL2= 120
##$ZL3= 120
##$ZL4= 120
##$ABSF1= 14.98509
##$ABSF2= -5.573092
##$ABSG= 5
##$ABSL= 3
##$ALPHA= 0
##$AQORDER= 0
##$ASSFAC= 0
##$ASSFACI= 0
##$ASSFACX= 0
##$ASSWID= 0
##$AUNMP= <proc_prof1d_extract_pilot.lims>
##$AXLEFT= 0
##$AXNAME= <>
##$AXNUC= <1H>
##$AXRIGHT= 0
##$AXTYPE= 0
##$AXUNIT= <>
##$AZFE= 0.1
##$AZFW= 0.1
##$BCFW= 0
##$BC_mod= 0
##$BYTORDP= 0
##$COROFFS= 0
##$CY= 15
##$DATMOD= 1
##$DC= 0
##$DFILT= <>
##$DTYPP= 0
##$F1P= 0
##$F2P= 0
##$FCOR= 0.5
##$FTSIZE= 32768
##$FT_mod= 6
##$GAMMA= 0
##$GB= 0
##$INTBC= 1
##$INTSCL= 1
##$ISEN= 128
##$LB= 0
##$LEV0= 0
##$LPBIN= 0
##$MAXI= 10000
##$MC2= 0
##$MEAN= 0
##$ME_mod= 0
##$MI= 0
##$NCOEF= 0
##$NC_proc= -8
##$NLEV= 6
##$NOISF1= 0
##$NOISF2= 0
##$NSP= 0
##$NTH_PI= 0
##$NZP= 0
##$OFFSET= 14.98509
##$PC= 1
##$PHC0= 178.3521
##$PHC1= 0
##$PH_mod= 1
##$PKNL= yes
##$PPARMOD= 0
##$PPDIAG= 0
##$PPIPTYP= 0
##$PPMPNUM= 2147483647
##$PPRESOL= 1
##$PSCAL= 4
##$PSIGN= 0
##$PYNMP= <proc.py>
##$REVERSE= no
##$SF= 400.02
##$SI= 32768
##$SIGF1= 0
##$SIGF2= 0
##$SINO= 400
##$SIOLD= 32768
##$SPECTYP= <>
##$SREGLST= <1H.CDCl3>
##$SSB= 0
##$STSI= 32768
##$STSR= 0
##$SW_p= 8223.68421052631
##$SYMM= 0
##$S_DEV= 0
##$TDeff= 65536
##$TDoff= 0
##$TI= <>
##$TILT= no
##$TM1= 0
##$TM2= 0
##$TOPLEV= 0
##$USERP1= <user>
##$USERP2= <user>
##$USERP3= <user>
##$USERP4= <user>
##$USERP5= <user>
##$WDW= 1
##$XDIM= 32768
##$YMAX_p= 461101012
##$YMIN_p= -700089
##$CURPLOT= <Network HP LaserJet P1505>
##$CURPRIN= <$Network HP LaserJet P1505>
##$DFORMAT= <normdp>
##$LAYOUT= <+/1D_H.xwp>
##$LFORMAT= <normlp>
##$PFORMAT= <normpl>
##$SURQMSG= 1
$$ End of Bruker specific parameters
$$ ---------------------------------
##NTUPLES= NMR SPECTRUM
##VAR_NAME=  FREQUENCY,     SPECTRUM/REAL,   SPECTRUM/IMAG
##SYMBOL=    X,             R,               I
##VAR_TYPE=  INDEPENDENT,   DEPENDENT,       DEPENDENT
##VAR_FORM=  AFFN,          ASDF,            ASDF
##VAR_DIM=   32768,         32768,           32768
##UNITS=     HZ,            ARBITRARY UNITS, ARBITRARY UNITS
##FACTOR=    0.250966925370066, 1,           1
##FIRST=     8223.43324360094, -171605,      5406
##LAST=      0,             43775,           31221
##MIN=       0,             -700089,         0
##MAX=       8223.43324360094, 461101012,    0
$$ Real data points
##PAGE= N=1
##DATA TABLE= (X++(R..R)), XYDATA
$$ [...]
$$ plain form
19458 344038 -36245 -343400 -209407 286307 174068 187177 -268654 -2116 -297095 16034
19447 -135926 -215722 128787 -470382 -143429 -261055 183553 -158561 82220 -226519 -81215
19436 111666 -263315 -445722 37557 -42988 17214 85431 -11099 -238108 84494 -105237 -71702
19425 -71702 -62359 8756 50025 60747 -117225 287938 195371 58185 -284348 -288322 -268414 -22618
19412 -27138 22037 -412026 133969 -269473 -140974 197493 3107 -259777 -6915 -51806 -95098
19401 -95098 161 -89608 -384365 -246221 -81368 -107460 -240937 -173150 -194077 -284640 -223937
19390 -223937 43314 219118 -227429 -43657 295919 -37307 -33668 62297 -526505 -464879 -54189
19378 119250 -249001 -54166 -294771 20821 -244402 -282470 90867 -251966 -150054 -77903
$$ packed form
19458C44038c6245l07155J33993B86307j12239J3109b68654b116k94979A6034
19447a35926p9796A28787d70382a43429j17626A83553a58561H2220b26519h1215
19436A11666b63315j82407C7557d2988A7214O8217a1099k27009H4494a05237L3535
19425g1702R343H756M1269J0722a17225B87938r2567E8185b84348l974J9908b2618
19412b7138B2037d12026A33969b69473J28499A97493C107b59777f915m4891m3292
19401i5098A61h9608k94757J38144h1368k6092j33477O7787k0927r0563O0703
19390b23937D3314J75804b27429d3657B95919c7307L639F2297e26505O1626e4189
19378A19250b49001e4166k40605B0821b44402l8068I0867b51966J01912P2151
$$ plain form
19368 -77903 64035 -72077 -81592 103794 28716 125273 124044 29495 -165865 -126290 -18396 114044
19355 -341696 -161107 -254955 35210 78647 142878 -167447 -95444 112725 -45966 -40958 -227852
19344 -227852 -257647 39954 -178908 -340074 -79588 194943 61198 128725 -11433 -163277 83516
19332 -177129 59471 19359 -205696 70149 24745 -165333 226751 -91825 180106 -207727
19321 119564 44021 -234674 -262779 442516 -43081 147601 -109626 39509 -115140 136655
19310 340884 -74867 -521569 -80885 4905 245858 -199344 -179419 19916 -167986 -351465 -99271
19298 284168 -32007 -13450 48473 -159814 -263060 -131319 -52796 -87520 -81893 -21284 -35554
19287 -35554 107343 67781 -69395 7377 286874 -159682 -89260 -59114 -76859 -49652 -161360
$$ packed form
19368g7903F4035g2077r515A03794B8716R6557j229B9495a65865L9575a8396A14044
19355c41696a61107r3848C5210M3437O4231a67447P2003A12725d5966N008j86894
19344b27852k9795C9954a78908j61166g9588A94943F1198O7527a1433j51844H3516
19332a77129E9471A9359b05696G0149B4745a65333B26751i1825A80106b07727
19321A19564D4021b34674k8105D42516d3081A47601a09626C9509a15140A36655
19310C40884g4867m46702h0885D905K40953a99344J9925A9916a67986j83479i9271
19298B84168c2007a3450D8473a59814j03246a31319e2796l4724N627b1284j4270
19287c5554A07343l9562f9395G377K79497a59682P0422L0146j7745K7207j11708
$$ plain form
19276 -161360 84408 -49647 -45680 -163208 -86889 174506 -453872 -97005 -261289 -272691 -41476
19264 28543 -177245 -99142 -87267 92776 128380 132572 -277052 -116375 4398 236481 -294716
19252 -108069 -209659 -29092 -119850 -362195 297406 142896 59321 -408994 -384047 -144110
19241 179883 211284 -147960 -12521 21775 -269028 181872 -1976 -190644 257910 -302845
19230 55849 -222678 133234 -208221 94725 -147798 -167085 66924 -147181 -42750 59962 221898
19219 221898 347612 47422 -107624 -76503 -64842 281611 -102456 251393 40145 -301223
19208 -125963 251965 -130343 -50363 -108177 102530 -131101 -186978 -302633 240427 -289525
19197 -9428 -21918 -8006 -32854 -112207 -60780 -334999 -57461 116006 186423 213053 56104 196722
$$ packed form
19276a61360H4408d9647L967j17528P6319A74506d53872i7005j64284j1402d1476
19264B8543a77245P8103J1875I2776L5604M192b77052a16375D398K32083b94716
19252a08069j01590b9092r0758k42345B97406A42896E9321d08994K4947a44110
19241A79883L1401a47960a2521B1775b69028A81872a976j88668B57910c02845
19230E5849b22678A33234b08221I4725a47798j9287F6924a47181d2750E9962J61936
19219B21898J25714D7422a07624L1121J1661B81611a02456B51393D0145c01223
19208a25963B51965a30343e0363n7814A02530a31101n5877j15655B40427b89525
19197i428j2490h006k4848p9353N1427k74219e7461A16006P0417K6630E6104J40618
$$ plain form
19185 196722 -89504 44330 170725 -169593 -149666 159707 -430220 -401006 -292861 65882
19174 -104141 -190894 -260451 17204 -69557 30280 17797 64944 136562 -80672 -98010 -105589 -504044
19162 -504044 -336663 -203155 -21671 1778 105770 135202 -1489 -245695 -294974 13304 48672
19151 48672 -122511 -210886 -124010 -113067 -27059 -184871 6122 -247623 -158636 -62215 -558930
19140 -558930 -207482 -5107 258722 -269206 -115184 -164744 -30341 -68056 -57969 -377749 132124
19128 -160230 -415843 -34673 -66979 217836 -606824 59133 -335355 -32857 20699 -187136
19117 159459 56568 49934 -135050 -235535 231030 -343475 110718 -299581 -205303 106440
19106 -22847 304357 -38653 -23691 -49659 -80256 171552 -159874 -211973 -198191 -286432 -78966
$$ packed form
19185A96722h9504D4330J26395a69593J9927A59707d30220K9214J08145F5882
19174a04141q6753o9557A7204f9557C0280j2483M7147P1618h0672j7338p579l98455
19162e04044J67381J33508b1671A778J03992K9432a489k44206m9279A3304L5368
19151D8672a22511q8375Q6876J0943b7059j57812F122b47623Q8987f2215m96715
19140e58930b07482e107B58722b69206a15184m9560c0341l7715J0087l19780A32124
19128a60230k55613c4673l2306B17836f06824E9133c35355c2857B0699a87136
19117A59459E6568o634a35050j00485B31030c43475A10718b99581R4278A06440
19106b2847C04357c8653J4962k5968l0597A71552a59874n2099J3782q8241g8966
$$ plain form
19094 -292498 113344 -47828 81349 -42587 -65582 -141639 -406853 -121038 9482 -188174 -169380
19083 -169380 -161248 -363729 -194546 -191813 -23407 -19822 98905 184242 139733 -65065 58717 -58893
19070 29819 -34394 374144 47667 -127594 52697 98694 -195791 19617 15583 246503 -258909
19058 -182138 -43722 6268 185681 -135438 -113245 -158289 -253143 -121620 -102245 -183989 52796
19046 -375580 34029 267627 -50573 234632 104681 207040 235976 -291537 -248482 151958
19035 249454 -159652 -235782 67403 120426 363217 163982 -148821 221485 -34143 82437
19024 90400 211740 381397 198067 -69622 -169946 -10147 -321057 -84724 176725 -104341
19013 -124162 -299680 -68415 15221 -82874 -42546 340635 96885 179138 89216 301890 177130
$$ packed form
19094b92498A13344d7828H1349d2587k2995p6057k65214a21038I482a88174J8794
19083a69380Q132k02481J69183K733b3407L585I8905Q5337m4509f5065E8717e8893
19070B9819c4394C74144D7667a27594E2697M5997a95791A9617m034K30920b58909
19058a82138d3722F268J79413a35438K2193m5044r4854a21620J9375q1744E2796
19046c75580C4029K33598e0573B34632A04681J02359K8936b91537M3055A51958
19035B49454a59652p6130F7403N3023K42791A63982a48821B21485c4143H2437
19024I0400J21340J69657j83330f9622j00324a0147l10910h4724A76725a04341
19013a24162j75518f8415A5221h2874M0328C40635I6885Q2253H9216K12674j24760
$$ plain form
19002 177130 -61786 -188285 -108005 -53 36264 -458683 -324770 82796 -8352 -119028 -185638
18991 -185638 -53128 -21414 62602 278916 135405 -296592 227179 -15135 -37180 -36586 -46760
18980 -46760 22835 -56959 75141 239104 -46299 41570 -13505 174775 -11584 184472 403393
18969 403393 553543 378224 199093 149943 -273797 -139026 311676 85750 20257 241100
18959 241100 -273835 -110136 -287985 -97049 -53496 -253231 484549 40905 -26292 -246147
18949 -246147 97488 -28527 -54529 -203443 -52631 77411 -57745 12161 -106953 -213414 147584
18937 -80372 -62681 25180 -88821 -212812 -92282 15624 -83562 44372 -184000 207891 146143
18926 146143 81963 -107580 245998 -288903 -100918 -120269 -5840 -109705 48139 -67131 96053
$$ packed form
19002A77130f1786j26499Q0280e3C6264d58683J33913H2796h352j10676o6610
18991a85638e3128b1414F2602K16314A35405b96592B27179a5135k2045N94j0174
18980d6760B2835e6959G5141J63963d6299D1570a3505A74775a1584A84472K18921
18969D03393J50150j75319j79131m9150b73797J34771C11676H5750B0257K20843
18959B41100b73835a10136j77849i7049M3553j99735D84549D0905b6292k19855
18949b46147I7488b8527k6002j48914e2631G7411e7745A2161a06953j06461A47584
18937h0372J7691B5180h8821j23991i2282A5624h3562D4372a84000B07891o1748
18926A46143o4180a07580B45998b88903a00918j9351e840j03865D8139f7131I6053
$$ plain form
18914 -297437 234523 -144244 -63606 130550 -2959 -254811 257129 104127 470641 429323
18904 429323 11219 -78891 -66204 125066 -206605 379883 67764 -113740 436148 216952
18893 7357 10874 -236446 -225374 55394 -175953 -13834 -17924 18660 -298874 -4844 -46187 32265
18880 -98348 -27622 8244 -105197 -284236 -67438 -110782 -79279 -163744 -175895 9745 11709 -38298
18867 37388 -66282 -164873 383829 19037 -236473 -19094 229070 -416687 110756 -110701
18856 53943 250173 -166634 28333 60186 328745 -105528 76819 -204714 -16021 -49285 137141
18844 20231 246720 -202997 52388 -210250 -15327 30727 -297526 165221 -13196 -461911
18834 -461911 96480 168847 86625 -68344 -281460 37614 -6473 -315716 -489876 -10380 -200809
$$ packed form
18914b97437B34523a44244f3606A30550b959k51852B57129A04127L66514m1318
18904D29323A1219g8891J2687A25066b06605C79883F7764a13740D36148B16952
18893G357L517b36446J1072E5394a75953a3834m090A8660b98874d844m1343C2265
18880i8348b7622H244a05197j79039f7438m3344L1503q4465j2151I745J964c8298
18867C7388f6282r8591C83829A9037b36473a9094B29070d16687A10756a10701
18856E3943J96230a66634B8333L1853K68559a05528G6819b04714a6021l3264A37141
18844B0231K26489b02997E2388b10250a5327C0727b97526A65221a3196m48715
18834d61911I6480P2367q2222f8344k13116C7614f473l09243j74160a0380j90429
$$ plain form
18823 -200809 -181636 -25876 248383 431864 -327785 -64329 -186398 -140781 -121874 -77111 -132102
18812 -132102 15229 51167 132460 128635 -109137 102990 -122250 -85223 -402598 77765 45310
18801 45310 -228030 -234315 -88231 206764 -190699 -212109 -71283 -59542 -74652 -90265 -476012
18790 -476012 155548 -157806 33590 -434629 -164074 -208516 -165828 -25943 -150964 -88338
18780 -88338 51121 160648 -110795 208119 86677 203882 31874 -324361 12646 -74760 -58226
18769 -58226 -328298 7559 -286773 -207235 43512 -318355 -171921 -87295 126064 191286 -20784
18757 -198450 158828 -77301 -30162 -142610 -293543 -329802 -293259 144702 47397 -29485 -347560
18746 -347560 41754 258640 -51371 -183159 -130513 184211 -90379 311508 13855 79036 -37887
$$ packed form
18823b00809J9173b5876B48383J83481c27785f4329j22069M5617J8907M4763n4991
18812a32102A5229L5938Q1293l825a09137A02990a22250L7027l17375G7765l2455
18801D5310b28030o285h8231B06764a90699k1410g1283J1741j5110j5613l85747
18790d76012A55548a57806C3590d34629a64074m4442M2688b5943j25021O2626
18780h8338E1121J09527a10795B08119H6677J17205C1874c24361A2646g4760J6534
18769e8226k70072G559b86773P9538D3512c18355J46434Q4626A26064O5222b0784
18757a98450A58828g7301c0162j12448j50933l6259L6543A44702D7397b9485l18075
18746c47560D1754K16886e1371j31788N2646A84211i0379C11508A3855O5181c7887
$$ plain form
18734 -94870 7192 -32876 -106269 137430 -475926 -177875 -8730 143778 -102336 -286357 -72294
18722 124671 -304251 20012 52894 5284 156543 -121099 197498 -207555 196879 -17523
18711 -125760 -263665 -71151 186853 -276778 -28416 -358604 -67830 139046 45676 -208813
18700 -15713 -162399 209026 -123341 64100 -80381 -251416 -98495 -45540 -119759 -101603 32324
18688 64999 -99212 -312107 305700 54260 -52016 183973 193053 -183144 -33865 124902 36203
18676 180066 27562 -140351 -148918 -163555 -60396 -10537 -317186 -205481 231942 -257195 -612575
18665 -612575 -168820 40813 256815 -47600 23719 -52441 -426410 90237 -26705 -214983 -143511
18654 -143511 -241642 -218177 -215718 251334 183275 -149323 -190807 147075 101305 151411 280573
$$ packed form
18734i4870G192c2876p3393A37430d75926a77875h730A43778a02336j84021g2294
18722A24671c04251B0012L2882E284J51259a21099A97498b07555A96879a7523
18711a25760j37905g1151A86853b76778b8416l30188f7830A39046D5676b08813
18700a5713j46686B09026a23341F4100h0381j71035i8495d5540p4219J8156C2324
18688F4999i9212k12895C05700E4260e2016A83973R080a83144c3865A24902C6203
18676A80066B7562a40351q567j4637f0396a0537l06649J11705B31942b57195l55380
18665f12575a68820D0813K16002d7600B3719e2441l73969I0237b6705j88278P1472
18654a43511r8131K3465K459B51334o8059a49323m1484A47075m5770N0106J29162
$$ plain form
18643 280573 31828 -97340 -12870 28576 115241 -105754 15462 379232 -115330 77279 -66263
18631 -74370 -221284 -169859 128446 -279056 -45885 -345492 -14951 -155477 -297574 -419877
18621 -419877 -81757 -240680 106523 142128 104221 -313553 395125 -18341 -33166 -227077
18611 -227077 -43791 284083 -275842 -20341 -61851 82473 -49952 266764 148264 26893 155742
18600 155742 -182310 107801 -231235 -190452 72299 -136750 13618 235572 -146337 250687
18589 -2190 -258788 -228688 -299735 19665 -38460 252074 -80041 -4967 146726 -18031 39613
18577 197881 2479 -65332 -8575 234422 -177576 101903 47215 -239519 50784 -214442 77055
18565 -62769 -143866 -37817 -214853 -153561 -453773 -171974 -92465 152782 -304626 171376
$$ packed form
18643B80573C1828i7340a2870B8576Q6665a05754A5462L63770a15330G7279f6263
18631g4370j46914N1425A28446b79056d5885k99607a4951j40526j42097j22303
18621d19877h1757j58923A06523L5605l7907c13553C95125a8341j4825j93911
18611b27077d3791B84083b75842b0341m1510H2473d9952B66764j18500B6893J28849
18600A55742a82310A07801b31235M0783G2299a36750A3618K21954a46337B50687
18589b190k56598L0100p1047A9665c8460B52074h0041d967A46726a8031C9613
18577A97881B479f5332h575B34422a77576A01903D7215b39519E0784b14442G7055
18565f2769q1097c7817j77036O1292l00212a71974P9509A52782c04626A71376
$$ plain form
18554 -102591 642 2517 -152660 112974 -36085 84971 91505 17601 -52761 9915 -22519 -88686
18542 -88686 13160 -87580 -33690 140933 -98127 79684 -170895 -130150 -382873 81800 -344299
18530 -95684 -237863 111479 -175026 117429 -390091 -157596 -351005 -251708 -166460 103526
18519 251711 -26308 -199003 -131572 -137958 -58062 -487970 -212252 111204 -77175 52780 -172394
18507 75318 -152529 98805 156515 -109933 -83868 60356 147528 148677 237087 -370969 -18103
18495 -249382 361583 50110 63287 158058 -261291 -112630 101158 -83522 -188692 -163958
18485 -163958 139304 52761 -148174 -23222 106286 -16270 -35804 169933 108315 -67770 73049
18473 -7433 -181373 -57721 141017 52179 46998 -213519 -7780 -165456 80439 -377191 -194910
$$ packed form
18554a02591F42J875a52660A12974c6085H4971O534A7601e2761I915b2519o6167
18542h8686A3160h7580c3690A40933i8127G9684a70895M0745k52723H1800c44299
18530i5684j42179A11479a75026A17429c90091a57596j93409R9297Q5248A03526
18519B51711b6308j72695O7431o386e8062m29908b12252A11204g7175E2780a72394
18507G5318a52529I8805N7710a09933K6065F0356Q7172J149Q8410c70969a8103
18495b49382C61583E0110J3177R4771b61291a12630A01158h3522j05170K4734
18485a63958A39304E2761a48174b3222A06286a6270j9534A69933o1618f7770G3049
18473g433j73940e7721A41017E2179n181b13519g780j57676H0439c77191J82281
$$ plain form
18462 -194910 -165183 179808 162011 -61807 -3008 35431 15413 -460173 195399 -66355 -118315
18451 -118315 -266687 -71630 115170 -54982 -1903 29303 -116767 -220265 27992 -193472 329026
18439 -46553 -212626 283986 -162401 -323481 224059 170137 18203 -32038 -324042 -18218
18428 23913 -219725 -456784 -155193 -17231 46578 -261248 -200508 83282 -3087 -70223 22298
18416 262732 18372 -180084 -402963 -165520 59406 222820 158218 52707 -446232 -301386
18406 -301386 -254175 139661 -135659 149835 -246286 272538 3961 -177996 -182486 -36589 -39501
18395 -39501 -64004 17883 -193126 -105784 -221404 86633 -80302 -70249 -281056 -737 -29169
18384 -29169 183973 151256 -155489 25766 -111004 -355010 60889 250598 49579 -251622
$$ packed form
18462a94910K9727A79808j7797f1807c008C5431A5413d60173A95399f6355n1960
18451a18315j48372g1630A15170e4982a903B9303a16767j03498B7992a93472C29026
18439d6553j66073B83986a62401j61080B24059n3922A8203c2038k92004a8218
18428B3913b19725k37059a55193a7231D6578b61248O0740H3282c087o7136B2298
18416B62732A8372a80084k22879a65520E9406J63414o4602E2707d46232J44846
18406c01386M7211A39661a35659A49835b46286B72538C961a77996m490c6589k912
18395c9501k4503A7883a93126Q7342j15620H6633h0302J0053k10807g37k8432
18384b9169A83973l2717a55489B5766a11004k44006F0889J89709D9579b51622
$$ plain form
18373 -90082 -103317 -77317 73233 198732 -95274 119327 86621 204253 -25861 172703 205029
18362 205029 -46472 129585 -113386 -104395 -63642 359615 240781 -154810 128810 -225806
18351 280452 291211 -45736 16457 -173064 -49791 92886 -78810 -82524 198138 330106 79744
18339 -224582 -104454 -159177 -201958 141876 8685 61385 -10654 4213 -390852 -421753 367943
18327 158996 -239604 -283763 -125337 -58224 -184434 -109560 115359 -1912 225887 204695 -200250
18315 52184 77874 25058 17858 58591 -336238 -227675 -77652 91729 216455 13297 119150
18304 119150 -17561 -68949 30424 -29065 18481 294957 -2470 -302440 -314865 132120 -163684
18292 243476 -78265 -80840 -49176 121886 119665 -21255 -395234 -305859 -186541 -61554 -14170
$$ packed form
18373i0082j3235K6000G3233J25499i5274A19327l2706J17632b5861A72703L2326
18362B05029d6472A29585a13386Q991M0753C59615j18834a54810A28810b25806
18351B80452J0759d5736A6457a73064d9791I2886g8810l714A98138J31968G9744
18339b24582a04454n4723m2781A41876H685N2700a0654D213c90852l0901C67943
18327A58996b39604m4159a25337e8224j26210P4874A15359a912B25887k1192b00250
18315E2184K5690B5058p200M0733c36238J08563g7652I1729J24726A3297J05853
18304A19150a7561n1388C0424b9065A8481K76476b470k99970j2425A32120a63684
18292B43476g8265k575L1664A21886k221b1255l73979Q9375J19318f1554a4170
$$ plain form
18280 -71248 -18149 95844 -169502 177753 -72205 -41076 221659 -28834 314535 -39912 -90795
18269 -90795 -59930 -80427 -279957 -145360 12580 -82731 51039 -180974 -110906 -103477 -321388
18258 -321388 -224905 -35322 40644 -15515 -143963 72209 -227937 117865 52210 -152846 -255266
18247 -255266 154383 -109406 155633 -21400 -32199 -28078 -259504 12560 5145 -125004 -145661
18236 -145661 107860 2161 193401 -211374 -11957 31048 -128469 -278862 -28632 149967
18225 382963 -36849 29648 181315 153746 157025 177145 212523 -5642 -573277 -302544 -54879
18213 -69386 116652 -170560 -289515 -315447 60636 -170752 108354 367690 35914 -110063
18202 61961 -125608 -271723 -52762 28741 -32590 -300223 -251896 29231 -23887 58463 73429
$$ packed form
18280g1248a8149I5844a69502A77753g2205L1129B21659b8834C14535c9912n0883
18269i0795L0865k0497j99530J34597A2580h2731E1039a80974P0068P429k17911
18258c21388R6483c5322D0644a5515j28448G2209b27937A17865E2210a52846j02420
18247b55266A54383a09406A55633b1400j0799M121k31426A2560E145a25004k0657
18236a45661A07860B161J91240b11374a1957C1048a28469j50393b8632A49967
18225C82963c6849B9648J51667k7569L279K0120L5378e642n67635K70733e4879
18213f9386A16652a70560j18955k5932F0636a70752A08354K59336C5914a10063
18202F1961a25608j46115e2762B8741c2590k67633M8327B9231b3887E8463J4966
$$ plain form
18191 73429 36282 -247769 63392 -39935 28004 -193842 41059 103219 36313 -92246 -98701
18180 -98701 -72861 47833 254850 -189453 -311632 203047 -189200 245805 50175 -140403
18169 -158498 -77644 -82825 57018 -123351 -165460 301867 257214 79912 -291427 249891 103982
18157 8235 -335670 39454 38389 -18338 -119927 -155889 -104530 -40708 -305484 134823 -191779
18145 38073 -12386 -458893 155080 131604 -474222 41430 -111443 213592 -27008 442473
18134 82152 146701 -292641 9448 -41668 111870 -7310 142313 -24543 85871 -150607 -204373
18123 -204373 -18084 268543 -68754 79719 63940 -69779 116880 -17617 276936 255684 205274
18112 205274 85080 236239 362798 -260688 145389 -32519 -89046 167587 199791 19983
$$ packed form
18191G3429C6282b47769F3392c9935B8004a93842D1059O2160C6313i2246o455
18180i8701K5840D7833K07017a89453j22179B03047a89200B45805E0175a40403
18169a58498g7644n181E7018a23351m2109C01867m4653G9912b91427B49891A03982
18157H235c35670C9454j065a8338j01589l5962N1359d0708k64776A34823a91779
18145C8073a2386m46507A55080k3476d74222D1430a11443B13592b7008D42473
18134H2152O4549b92641I448d1668A11870g310A42313b4543H5871a50607n3766
18123b04373a8084B68543f8754G9719j5779f9779A16880a7617B76936k1252n0410
18112B05274H5080J51159J26559b60688A45389c2519n6527A67587L2204A9983
$$ plain form
18101 -59418 -6921 46196 -75382 61108 -165251 98971 302034 -3867 30433 111963 -76852 -147760
18089 -147760 -10528 -23505 -61745 213701 -268974 -165919 -116103 -164281 134739 203529 -194562
18077 52004 177625 -199911 25565 -293197 121901 -182340 104173 102762 -196597 -23323
18066 133717 -64441 -17695 129618 -228560 98150 -271527 214844 259166 -7 12733 203285
18055 203285 -4662 -375770 -165348 -64706 111890 112001 31709 -69470 -166429 -224263 -211961
18044 -211961 -18393 179218 27470 -113828 302275 152745 272320 214519 93651 173020
18034 173020 -36440 58147 238688 315001 -302168 380172 -224198 82108 116193 -101933
18023 60108 221348 119314 -95280 -197741 306203 -144813 -146978 -296123 -226371 117879
$$ packed form
18101e9418f921D6196g5382F1108a65251I8971K03063c867C0433Q1530g6852p0908
18089a47760a0528j2977l8240B13701b68974J03055M9816m8178A34739O8790a94562
18077E2004J25621a99911B5565b93197A21901a82340A04173j411a96597b3323
18066A33717f4441a7695A29618b28560I8150b71527B14844M4322gA2733J90552
18055B03285d662l71108a65348f4706A11890J11C1709f9470r6959n7834J2302
18044b11961a8393A79218B7470a13828C02275j49530J19575n7801I3651P9369
18034A73020c6440E8147J80541P6313c02168C80172b24198H2108L4085a01933
18023F0108J61240j02034i5280j02461C06203a44813k165j49145O9752A17879
$$ plain form
18012 206104 204413 -98744 87335 226034 -259946 37601 52166 44586 343430 -119014 338031
18000 -50090 249083 -61968 68301 -247514 101836 -283819 176901 -45411 18731 -14851 156611
17988 33172 25303 -148646 142425 -71018 291094 -16652 -198571 -19207 256690 50802 -44740
17976 -3805 170530 -22378 296519 -177666 118684 -276492 -236408 93545 83708 -232998 20809
17964 191720 -245267 -104669 101049 -15943 -118106 -20413 185530 75772 -41612 28278
17953 37100 -73873 244349 147414 76420 52182 173563 218701 106497 -418 -67477 46180
17941 80969 -13084 18781 -42071 296452 256957 115825 94044 26879 -352991 255182 138282
17930 138282 120286 175294 103875 130245 71576 -316082 193186 -122427 98567 242335 -273613
$$ packed form
18012B06104j691i8744H7335J38699b59946C7601J4565p580K98844a19014C38031
18000e0090B49083f1968F8301b47514A01836b83819A76901d5411A8731a4851A56611
17988C3172p869a48646A42425g1018B91094a6652j81919a9207B56690E0802d4740
17976c805A70530b2378B96519a77666A18684b76492M0084I3545r837b32998B0809
17964A91720b45267a04669A01049a5943j02163b0413A85530G5772d1612B8278
17953C7100g3873B44349r6935p0994k4238J21381M5138A06497d18o7059D6180
17941H0969a3084A8781d2071B96452l9495A15825k1781B6879c52991B55182j16900
17930A38282j7996N5008p1419K6370n8669c16082A93186a22427I8567J43768b73613
$$ plain form
17918 385337 -425635 -99691 -366793 348270 56893 -54325 -271792 207447 124286 34098
17907 -53826 20080 138325 106007 128809 300720 244967 -51568 84383 29736 -82644 -120278
17896 -120278 -169978 -14518 63468 -474284 74966 5729 -156044 35232 -320883 -15275 258754
17884 132365 127860 124531 -217135 -233437 177255 -177252 -249254 260952 175532 478162 160299
17872 108387 -93194 94517 -29327 64397 354028 -102460 -189013 413289 -40102 -200150 86239
17860 58403 186503 339421 231901 77845 136097 -227089 -115180 -12086 130267 108074
17850 108074 316278 260716 142228 255377 640 115491 208142 95276 -27349 -8699 172998
17838 -105761 280290 336620 -82626 303848 -195565 -257167 113344 265917 -78558 -177970
$$ packed form
17918C85337d25635i9691k67102C48270E6893e4325k17467B07447q3161C4098
17907e3826B0080J18245l2318K2802J71911n5753e1568H4383B9736h2644l7634
17896a20278m9700a4518F3468d74284G4966E729a56044C5232c20883a5275B58754
17884A32365m505l329b17135j6302A77255a77252p2002B60952q5420L02630A60299
17872A08387i3194I4517b9327F4397K89631a02460q6553D13289d0102j60048H6239
17860E8403J28100J52918j07520G7845N8252b27089J11909a2086A30267k2193
17850A08074K08204n5562j18488J13149F40J14851R2651I5276b7349h699A72998
17838a05761B80290N6330h2626C03848a95565o1602A13344J52573g8558r9412
$$ plain form
17828 -177970 -48149 115019 73914 24878 19286 -127068 -54194 77888 -226835 9709 -23576
17816 113152 148420 139242 -56266 -96630 110961 -69082 80240 -52809 182294 -47928 85481
17804 339057 -60992 294434 216056 135342 45890 237228 -16468 47809 231315 -235 162917
17792 -100547 249779 73563 -198340 332287 85382 240199 -251108 11677 205801 237478
17782 237478 53763 118259 45131 237907 18395 74022 172521 -19080 148256 164801 -54846
17770 158320 -194764 -54079 171945 144258 -164962 45726 41165 -50987 113980 301511 79878
17758 44446 127064 109669 240809 208064 -161112 -434096 107929 275738 138231 312210
17748 312210 -82671 -214466 196262 31272 204877 339440 369344 400406 111097 229303
$$ packed form
17828a77970d8149A15019m1105B4878n592a27068e4194G7888b26835I709b3576
17816A13152L5268r178e6266m0364A10961f9082H0240e2809A82294d7928H5481
17804C39057f0992B94434p8378q0714D5890J91338a6468D7809J83506b35A62917
17792a00547B49779G3563a98340C32287H5382J54817b51108A1677J94124L1677
17782B37478E3763O4496D5131J92776A8395N5627R8499a9080A48256J6545e4846
17770A58320a94764e4079A71945k7687a64962D5726m561e0987A13980J87531G9878
17758D4446Q2618j7395J31140l2745a61112k72984A07929J67809j37507J73979
17748C12210h2671j31795A96262C1272J73605J34563K9904L1062A11097J18206
$$ plain form
17738 229303 -37739 -112292 178823 684918 60696 27438 -23721 -1398 188742 66788 84928
17727 84928 12063 25990 180361 247646 128208 251680 215715 175396 469157 84338 170413
17716 170413 20252 73787 575723 159263 -250671 302662 -3369 -150350 -255964 131050
17705 -51976 1368 242633 47454 255009 -25050 -44390 81766 210907 -10252 181120 143285
17694 143285 -87123 189583 234091 84239 115139 56057 218437 -65243 58774 103754 -82045
17682 -48383 300045 250733 356301 376629 -67786 145662 -65383 -29940 167012 321198 239070
17671 239070 182265 -87830 334318 270270 -45147 -87922 222154 258188 -125373 421338 87225
17659 -153730 46750 -133513 -42130 11375 336874 295701 -86285 -33009 -77502 260158 123363
$$ packed form
17738B29303c7739p4553A78823N06095F0696B7438b3721a398A88742F6788J8140
17727H4928A2063J3927J54371O7285j19438J23472l5965m0319K93761H4338Q6075
17716A70413B0252N3535N01936A59263b50671C02662c369j46981j05614A31050
17705e1976A368K41265D7454K07555b5050j9340H1766J29141a0252A81120l7835
17694A43285h7123A89583M4508H4239L0900E6057J62380f5243E8774M4980h2045
17682d8383C00045m9312J05568K0328f7786A45662f5383b9940A67012J54186q2128
17671B39070n6805h7830C34318o4048d5147m2775B22154L6034a25373D21338H7225
17659a53730D6750a33513d2130A1375L25499m1173h6285c3009m4493B60158A23363
$$ plain form
17647 117998 29891 -255540 310308 215826 -117771 311559 396353 -247320 396404 38129
17636 306258 63592 124589 333946 106130 104160 -223680 -21546 156617 17221 137040 129847
17625 129847 175062 485571 156006 141312 251833 313882 214965 77135 -9514 110904 111476
17614 111476 216039 -13165 134585 69563 24284 -144473 102576 -368195 202530 187667
17604 187667 35427 239340 38061 178438 -9953 174938 144596 448268 -208130 240275
17593 65727 278279 78434 -134210 165820 119044 207185 -97737 136330 395670 65712 -10158
17581 164096 379925 237413 -55692 97586 139128 -90854 368376 51193 18461 316941 347673
17570 347673 138096 180862 56880 -36127 -94772 164666 128100 291589 338038 46039 8348
$$ packed form
17647A17998B9891b55540C10308r4482a17771C11559Q4794b47320C96404C8129
17636C06258F3592O0997K09357A06130j970b23680b1546A56617A7221J19819p193
17625A29847M5215L10509A56006j4694J10521O2049r8917G7135i514A10904N72
17614A11476J04563a3165A34585o5022B4284a44473A02576c68195B02530j4863
17604A87667C5427K03913C8061J40377i953A74938l0342L03672b08130B40275
17593F5727K12552G8434a34210A65820m6776Q8141i7737A36330K59340F5712a0158
17581A64096K15829j42512e5692I7586M1542i0854C68376E1193A8461K98480L0732
17570C47673A38096M2766E6880c6127n8645A64666l6566J63489M6449D6039H348
$$ plain form
17558 266031 417722 276388 229525 437617 -5538 61168 595006 380934 234146 157065
17548 157065 23728 336722 84761 79790 287227 449294 -25597 497514 144411 438992
17538 438992 174364 306798 342041 347667 373320 534211 424284 308189 536771 363166
17528 363166 699620 405537 612204 788585 1272514 1377614 1115726 555444 563942 713347
17518 713347 464409 216108 -71546 661833 330789 425086 257386 521171 711446 1129995
17508 1129995 861434 837834 951552 661449 569451 400619 489160 533937 620462 519053
17498 519053 343306 308879 297706 -96273 455059 249769 406244 392087 289483 377738
17488 377738 380183 281416 142026 286935 245608 241900 291857 361670 165483 152996 579988
$$ packed form
17558B66031J51691j41334m6863K08092e538F1168N33838k14072j46788p7081
17548A57065B3728L12994H4761m971K07437J62067b5597D97514A44411K94581
17538D38992A74364J32434L5243N626K5653J60891j09927j16095K28582j73605
17528C63166L36454k94083K06667J76381M83929J05100k61888E55444Q498J49405
17518G13347k48938B16108g1546F61833C30789R4297j67700K63785J90275M18549
17508A129995k68561k3600J13718k90103r1998j68832Q8541M4777Q6525j01409
17498E19053j75747l4427j1173i6273D55059k05290J56475j4157j02604Q8255
17488C77738K445r8767j39390J44909m1327l708M9957O9813A65483j2487M26992
$$ plain form
17477 579988 174475 162829 195046 386656 303281 319562 316526 406565 275949 266432 16003
17465 20653 -10669 347993 243548 -3223 247602 273514 323469 394757 210034 295615 396364
17454 396364 188033 532189 295128 4807 848822 500176 337716 232461 397573 549500
17444 549500 409038 320344 722643 526489 331301 539407 196102 704894 445128 144197
17433 490544 485493 490432 56144 369991 745003 143744 556663 126206 517943 370676
17423 370676 332548 623096 554899 637172 345432 304052 640004 415816 346772 280601 418994
17412 418994 613499 413123 376546 310748 313019 368736 313662 198378 175493 278788 316334
17401 316334 395668 149377 451476 778200 323931 173806 541925 135394 483374 409423
$$ packed form
17477E79988A74475j1646L2217J91610q3375J6281l036R0039j30616r517A6003
17465B0653a0669C47993j04445c223B47602K5912M9955P1288j84723Q5581J00749
17454C96364A88033L44156k37061D807Q44015l48646j62460j05255J65112J51927
17444E49500j40462q8694M02299j96154j95188K08106A96102N08792k59766A44197
17433D90544n051M939E6144L13847L75012A43744M12919A26206L91737j47267
17423C70676l8128K90548o8197Q2273k91740m1380L35952k24188o9044o6171J38393
17412D18994J94505k00376l6577o5798K271N5717n5074j15284k2885J03295L7546
17401C16334P9334A49377L02099L26724C23931j50125L68119A35394L47980p3951
$$ plain form
17391 409423 361662 263627 88287 226240 501430 103007 -98606 327927 114348 585696
17381 585696 686867 202655 374651 407310 361722 495861 298804 240856 306429 269748
17371 269748 370031 483697 722180 286096 23236 22163 646110 430303 180706 56111
17360 360314 130880 426921 507680 412924 -62116 -60461 239445 217718 379521 500347 128796
17348 532490 95475 190872 127486 166093 302151 250261 374569 -37734 552426 618271 97276
17336 363405 443655 238601 450713 187094 225985 357177 287787 396109 596875 379163
17326 379163 372765 378138 353481 179008 218872 209935 392306 300427 451967 353219 123436
17314 391942 116035 204792 223183 174966 210986 651334 203297 286307 605486 176135
$$ packed form
17391D09423m7761r8035H8287J37953K75190A03007i8606C27927A14348M71348
17381E85696J01171B02655J71996L2659m5588J34139j97057n7948O5573l6681
17371B69748J00283J13666K38483B86096B3236j073O23947k15807A80706E6111
17360C60314A30880K96041Q0759r4756f2116J655B39445k1727J61803J20826A28796
17348E32490I5475R5397o3386L8607J36058n1890J24308c7734E52426O5845I7276
17336C63405Q0250k05054K12112A87094L8891J31192o9390J08322K00766k17712
17326C79163o398N373k4657j74473L9864q937J82371r1879J51540r8748A23436
17314C91942A16035Q8757J8391m8217L6020M40348B03297Q3010L19179A76135
$$ plain form
17303 167125 594075 248906 333515 444606 321534 468750 248150 246867 446595 201653
17292 193020 271109 234956 216695 338984 363039 818678 398869 391844 304520 619889 500038
17281 500038 607060 396388 -18768 235387 327318 491103 292905 608755 412831 448358
17271 448358 411921 197596 452651 249207 297872 409792 563158 406278 354400 167649
17260 584409 110663 478068 311762 303108 413912 240912 552387 423784 321428 429474
17250 429474 351058 120557 202092 619867 517792 307468 319133 216103 316567 229366
17240 229366 457245 310021 156153 221381 531027 167551 232656 293910 341595 643156
17230 643156 351520 193773 273866 532080 584254 412230 273955 88444 220341 474575
$$ packed form
17303A67125M26950B48906Q4609J11091j23072J47216k20600j283J99728B01653
17292A93020P8089l6153j8261J22289K4055M55639C98869p025q7324L15369j19851
17281E00038J07022k10672a8768B35387R1931J63785j98198L15850j95924L5527
17271D48358l6437A97596K55055k03444M8665J11920J53366j56880n1878A67649
17260E84409A10663L67405j66306q654J10804j73000L11475j28603j02356J08046
17250D29474p8416A20557Q1535M17775j02075k10324J1665j03030J00464q7201
17240B29366K27879j47224j53868O5228L09646A67551O5105O1254M7685L01561
17230F43156k91636j57747Q0093K58214N2174j72024j38275H8444J31897K54234
$$ plain form
17220 474575 568484 594250 369271 471068 438779 282365 117737 482908 268387 577771
17210 577771 659018 385815 810669 714777 229754 514640 512764 403961 555629 465988
17200 465988 638119 441020 758470 288245 534268 525547 390880 698633 574943 749886
17190 749886 422952 564437 530246 466477 392210 445605 319566 398477 540013 718066
17180 718066 591413 782418 312117 427666 610376 420285 491327 636060 821385 372273
17169 530005 236592 417996 545656 563331 296273 605644 729124 546527 752745 634418
17159 634418 290592 903567 299340 534827 400694 436354 703721 683603 629721 416493
17149 416493 453785 757003 236464 569037 497198 729320 683176 856493 639518 487107
$$ packed form
17220D74575R3909K5766k24979J01797l2289j56414A17737L65171k14521L09384
17210E77771Q1247k73203M24854r5892B29754K84886j876j08803J51668q9641
17200D65988J72131j97099L17450B88245K46023q721j34667L07753j23690J74943
17190G49886l26934J41485l4191o3769p4267N3395j26039P8911J41536J78053
17180G18066j26653J91005C12117J15549J82710j90091P1042J44733J85325C72273
17169E30005B36592J81404J27660J7675k67058L09371J23480j82597K06218j18327
17159F34418B90592O12975B99340K35487j34133L5660K67367k0118n3882k13228
17149D16493L7292L03218B36464L32573p1839K32122m6144J73317k16975j52411
$$ plain form
17139 487107 581614 444371 668621 637585 613618 425988 380592 662520 668892 529872 602965
17128 602965 583560 533994 731175 885722 816569 956918 823998 604224 719275 979847
17118 979847 828694 646994 781756 760988 563722 670194 721743 717527 902841 794118
17108 794118 628722 695580 550838 852908 588681 467399 747090 682028 874045 492520
17098 492520 560999 950523 674902 521808 688831 672863 590471 1037108 642414 887632
17088 887632 607128 995941 884354 766347 797164 938200 1319157 942447 1009518 750131
17078 750131 681615 818391 588419 967982 826917 996906 928138 1005960 730876 1111813
17068 1111813 882951 1085076 1002851 903262 1072496 1061848 735606 953327 1164797 984096
$$ packed form
17139D87107R4507j37243K24250l1036k3967j87630m5396K81928O372j39020P3093
17128F02965j9405m9566J97181J54547o9153J40349j32920k19774J15051K60572
17118I79847j51153j81700J34762k0768j97266J06472N1549m216J85314j08723
17108G94118j65396O6858j44742L02070k64227j21282K79691o5062J92017l81525
17098D92520O8479L89524k75621j53094J67023j5968q2392M46637l94694K45218
17088H87632k80504L88813j11587j18007L0817J41036L80957l76710O7071k59387
17078G50131o8516J36776k29972L79563j41065J69989o8768P7822k75084L80937
17068A111813k28862K02125q2225r9589J69234j0648l26242K17721K11470j80701
$$ plain form
17058 984096 888680 356823 770596 639214 1249396 1137174 1007721 846622 1213492 1116732
17048 1116732 612446 826937 1103330 865553 1412732 1059706 898600 1074299 1174152 1030933
17038 1030933 878069 733720 1084999 1410066 1267020 1257765 1027106 1023249 1357411 1202040
17028 1202040 869241 1312574 1291296 1151813 1158121 929406 973538 1490766 1233125 1044445
17018 1044445 1328952 1122979 1101585 967457 877060 1636306 1298862 1257548 1513423 1061332
17008 1061332 1131778 1006032 1436195 1272292 1411665 1350783 1540970 1461237 1517339 1633554
16998 1633554 1423833 1450408 1412873 1265645 1456917 1593255 1526760 1437480 1349682 1133326
16988 1133326 1413724 1826952 2026272 1587977 1413305 1367532 1936575 1554895 1431588 1429903
$$ packed form
17058I84096r5416C56823M13773j31382O10182j12222j29453j61099L66870r6760
17048A116732n04286K14491K76393k37777N47179l53026j61106J75699R9853j43219
17038A030933j52864j44349L51279L25067j43046r255k30659l857L34162j55371
17028A202040l32799M43333k1278j39483O308k28715M4132N17228k57641j88680
17018A044445K84507k05973k1394j34128r0397P59246l37444m1314K55875m52091
17008A061332P0446j25746M30163j63903J39373o0882J90187p9733N6102J16215
16998A633554k09721K6575l7535j47228J91272J36338o6495q9280q7798k16356
16988A133326K80398M13228J99320m38295j74672m5773N69043l81680j23307j685
$$ plain form
16978 1429903 1562012 1419088 1566023 1734744 1945784 1503168 1602695 2075545 2208574 1729307
16968 1729307 1445902 1743029 1624662 1829199 1771639 1990308 1917442 2378294 2115534 1855181
16958 1855181 1655322 1840803 1687634 2152925 1952423 1914643 2148672 2009309 2215622 1868064
16948 1868064 2243170 2100438 2219732 2194521 2011085 2064574 2376920 2190173 2089933 2326240
16938 2326240 2291365 2049380 2115429 2146837 2181726 2325029 2395554 2433137 2316792 2434412
16928 2434412 2186265 2547358 2425388 2582217 2277636 2687835 2221682 2639463 2599575 2454766
16918 2454766 2569957 2868688 2745598 2686153 2747772 2785325 2751047 2819259 2996982 2714964
16908 2714964 3156577 3188548 2977883 3085592 3380781 3128716 3220266 3285173 3250919 3323017
$$ packed form
16978A429903J32109j42924J46935J68721K11040m42616R9527M72850J33029m79267
16968A729307k83405K97127j18367K04537n7560K18669p2866M60852k62760k60353
16958A855181j99859J85481j53169M65291k00502l7780K34029j39363K06313l47558
16948A868064L75106j42732J19294k5211j83436N3489L12346j86747j00240K36307
16938B326240l4875k41985O6049L1408L4889J43303P0525L7583j16345J17620
16928B434412k48147L61093j21970J56829l04581M10199m66153M17781l9888j44809
16918B454766J15191K98731j23090n9445O1619L7553l4278O8212J77723k82018
16908B714964M41613L1971k10665J07709K95189k52065R1550O4907l4254P2098
$$ plain form
16898 3323017 3130512 3585607 3300681 3418712 3400881 3431749 3799745 3424939 3693193 4237807
16888 4237807 3764823 3601125 3919918 3819417 4313073 3833564 3714220 4120950 4125900 4395768
16878 4395768 4223148 4040422 4389414 4263035 4471708 4649579 4427244 4701537 4716716 4793404
16868 4793404 5148688 4877421 5021426 5057209 4996511 5096152 4878846 5582852 5343805 5453434
16858 5453434 5606529 5900005 5580424 5429326 5754207 6053011 6132620 6451471 6701754 6340320
16848 6340320 6501591 6382285 6692584 6527070 6884949 6572348 6705000 7308655 7093769
16839 7093769 7274145 7524535 7661610 7499452 8095522 7965643 8101250 8315395 8423906
16830 8423906 8616939 8735709 8822358 9026811 9026410 9419218 9453521 9604515 10059079 10127873
$$ packed form
16898C323017j92505M55095k84926J18031j7831L0868L67996l74806K68254N44614
16888D237807m72984j63698L18793j00501M93656m79509j19344M06730M950K69868
16878D395768j72620j82726L48992j26379K08673J77871k22335K74293J5179P6688
16868D793404L55284k71267J44005L5783o0698R9641k17306P04006k39047J09629
16858E453434J53095K93476l19581j51098L24881K98804P9609L18851K50283l61434
16848F340320J61271j19306L10299j65514L57879l12601J32652O03655k14886
16839G093769J80376K50390J37075j62158N96070j29879J35607K14145J08511
16830H423906J93033J18770Q6649K04453m01L92808L4303J50994M54564O8794
$$ plain form
16820 10127873 10115605 10145910 10632778 10664111 11168813 11138368 11360712 11939207 11500921 12201621
16810 12201621 12643445 12605958 13203981 13109563 13228203 13897182 14192496 14432971 14625328 14816808
16800 14816808 15511275 15884078 16239027 16443030 16995427 17079481 17774243 18170624 18422279
16791 18422279 19059844 19846611 20168704 20478154 21013554 21456235 22435161 22983042 23161048
16782 23161048 24199325 24717427 25504977 26538260 27215036 27618989 28639105 29583486 30262051
16773 30262051 31394906 31880276 32987884 33871157 35250054 36615150 37336332 38112628 40000904
16764 40000904 41294171 42281665 44023373 45359361 46767938 48445614 50029144 52059402
16756 52059402 53693910 55370238 56901360 59374470 61010515 63040397 65345770 67415380
$$ packed form
16820A0127873j2268L0305M86868L1333N04702l0445K22344N78495m38286P00700
16810A2201621M41824l7487N98023r4418J18640O68979K95314K40475J92357J91480
16800A4816808O94467L72803L54949K04003N52397Q4054O94762L96381K51655
16791A8422279O37565P86767L22093L09450N35400M42681R78926N47881J78006
16782B3161048J038277N18102P87550J033283O76776M03953J020116R44381O78565
16773C0262051J132855M85370J107608Q83273J378897J365096P21182P76296J888276
16764D0000904J293267R87494J741708J335988J408577J677676J583530K030258
16756E2059402J634508J676328J531122K473110J636045K029882K305373K069610
$$ plain form
16748 67415380 69964471 72203146 74792882 77049155 79507297 81887466 84683116 86920479
16740 86920479 89727742 92151942 94477070 97233450 99488054 101769429 104147312 106409144
16732 106409144 108039460 109944447 111810842 113410246 114370088 115783154 116005768 116922434
16724 116922434 116822140 116932267 116414203 116068574 115270429 114056959 112524156 111273997 109268265
16715 109268265 107447153 105715694 103455157 100698080 98318269 95851863 93178632 90755148
16707 90755148 88327818 85244243 82832345 80183757 77732349 75508567 73181819 70188743
16699 70188743 67684862 65449219 63319690 61150520 59265271 56915116 55161608 53442101
16691 53442101 51628401 49796009 48261172 46376789 44785299 43165257 41928183 40585581
$$ packed form
16748F7415380K549091K238675K589736K256273K458142K380169K795650K237363
16740H6920479K807263K424200K325128K756380K254604K281375K377883K261832
16732A06409144J630316J904987J866395J599404R59842J413066K22614R16666
16724A16922434j00294J10127n18064l45629p98145j213470j532803j250159k005732
16715A09268265j821112j731459k260537k757077k379811k466406k673231k423484
16707I0755148k427330l083575k411898k648588k451408k223782k326748k993076
16699G0188743k503881k235643k129529k169170j885249k350155j753508j719507
16691E3442101j813700j832392j534837j884383j591490j620042j237074j342602
$$ plain form
16683 40585581 39450456 37817110 36824895 35833902 34373742 33353828 32251222 31625207
16675 31625207 30170403 29816174 28427201 27812064 27332074 26089782 25721195 24845479 24180054
16666 24180054 23282848 22743860 21805295 21654504 21196443 20505874 20029133 19320813 18886201
16657 18886201 17977503 17770635 17552815 16786214 16758360 16194982 15617211 15363246 15102403
16648 15102403 14798890 14389899 13865115 14106315 13445547 13122203 12784153 12680362 12053230
16639 12053230 12500815 11704527 11693690 11291891 11204402 10889567 11063305 10283870 10248707 9769807
16629 9769807 9692191 9740126 9564162 9410216 9257985 8734024 8916593 8341821 8617253 8453313
16619 8453313 8105632 7743814 7771801 7650198 7461785 7033938 7761040 7144153 7301342 7149056
$$ packed form
16683D0585581j135125j633346r92215r90993j460160j019914j102606o26015
16675C1625207j454804l54229j388973o15137m79990j242292l68587q75716o65425
16666B4180054q97206n38988r38565j50791m58061o90569m76741p08320m34612
16657A8886201r08698k06868k17820p66601k7854n63378n77771k53965k60843
16648A5102403l03513m08991n24784K41200o60768l23344l38050j03791o27132
16639A2053230M47585p96288j0837m01799q7489l14835J73738p79435l5163m78900
16629I769807p7616M7935j75964j53946j52231n23961J82569n74772K75432j63940
16619H453313l47681l61818K7987j21603j88413m27847P27102o16887J57189j52286
$$ plain form
16609 7149056 6835464 6577202 6614227 6884781 6553200 6619368 6384816 6090463 5909570 5718540
16599 5718540 5781883 5783442 5527424 5387598 5209191 5543375 5487429 5191115 5155877 4977249
16589 4977249 5482770 4905581 4906232 4938078 4525639 4721266 4727278 4463567 4489664 4193485 4391136
16578 4391136 4312017 4217453 3964328 4290409 4010488 3963316 4278092 4075032 3749284 3933377
16568 3933377 3534117 3812580 3697402 3680222 3911024 3707759 3258553 3332625 3436814 2961033
16558 2961033 3404985 3494901 3178370 3192005 3098646 3312970 2997714 2630221 3323043 3288046
16548 3288046 2806893 3093231 2921332 2978602 2976132 2946615 2395220 2899673 2839959 2723481
16538 2723481 2641558 2552325 2406534 2859360 2397153 2454384 2518492 2146840 2305361 2220900
$$ packed form
16609G149056l13592k58262L7025K70554l31581O6168k34552k94353j80893j91030
16599E718540O3343J559k56018j39826j78407L34184n5946k96314l5238j78628
16589D977249N05521n77189O51L1846m12439J95627O012k63711K6097k96179J97651
16578D391136p9119r4564k53125L26081k79921m7172L14776k03060l25748J84093
16568C933377l99260K78463j15178j7180K30802k03265m49206P4072J04189m75781
16558B961033M43952Q9916l16531J3635r3359K14324l15256l67493O92822l4997
16548C288046m81153K86338j71899N7270k470k9517n51395N04453n9714j16478
16538B723481q1923q9233j45791M52826m62207N7231O4108l71652J58521q4461
$$ plain form
16528 2220900 2782727 2493772 2170754 2095080 2058083 2554554 2597090 2094695 2368306 2333217
16518 2333217 2245402 2130159 2278871 1910441 2142468 1779275 1827166 1864142 1873787 2277072
16508 2277072 1862565 2162047 1968221 1557304 1809145 2139394 1700614 1941383 1892496 1880149
16498 1880149 2137103 1666335 1663371 1875720 1672307 1680248 1705761 1649293 1562915 1884419 1700333
16487 1700333 1393960 1538835 1797948 1343892 1773646 1217280 1525458 1471183 1340275 1408059
16477 1408059 1470769 1727264 1326859 1434034 1198769 1517444 1319416 1397387 1574801 1436100
16467 1436100 1288384 1848209 936609 1245751 1176898 1304234 1378313 1321192 1451194 1048342
16457 1048342 1483216 1187131 1159555 951383 1186509 1358586 944548 1444444 1156528 1215620
$$ packed form
16528B220900N61827k88955l23018p5674l6997M96471M2536n02395K73611l5089
16518B333217q7815j15243J48712l68430K32027l63193M7891L6976R645M03285
16508B277072m14507K99482j93826m10917K51841L30249m38780K40769m8887j2347
16498A880149K56954m70768k964K12349k03413P941K5513n6468q6378L21504j84086
16487A700333l06373J44875K59113m54056M29754n56366L08178n4275j30908O7784
16477A408059O2710K56495m00405J07175k35265L18675j98028P7971J77414j38701
16467A436100j47716N59825r11600L09142o8853J27336P4079n7121J30002m02852
16457A048342M34874k96085k7576k08172K35126J72077m14038M99896k87916N9092
$$ plain form
16447 1215620 1000320 1202926 910678 799484 1025188 1232068 1051937 1357538 1001553
16438 1001553 1131977 843689 1128795 814465 1404960 1044523 1241811 831227 985030
16429 985030 950296 1072102 820958 1028758 1132668 927897 885252 960284 971121 975925 841534
16418 841534 758165 1001333 892931 713501 953870 744664 934809 1096813 886967 675345
16408 675345 948615 728816 659881 965023 1241869 734375 1037909 1136712 1293538 800754
16398 800754 1174625 622866 900849 903867 635668 962286 733388 1024797 914924 786620
16388 786620 769824 578707 792207 616215 949106 512746 681632 551862 708473 832009
16378 832009 716875 1021219 906273 542756 923624 872008 926431 436329 673617 745480
$$ packed form
16447A215620k15300K02606k92248j11194K25704K06880j80131L05601l55985
16438A001553J30424k88288K85106l14330N90495l60437J97288m10584J53803
16429I85030l4734J21806k51144K07800J03910k04771m2645P5032J0837M804j34391
16418H41534q3369K43168j08402j79430K40369k09206J90145J62004k09846k11622
16408F75345K73270k19799o8935L05142K76846n07494L03534R8803J56826m92784
16398H00754L73871n51759K77983L018k68199L26618k28898K91409j09873j28304
16388G86620j6796j91117K13500j75992L32891m36360J68886j29770J56611J23536
16378H32009j15134L04344j14946l63517L80868n1616N4423D36329K37288P1863
$$ plain form
16368 745480 583434 674842 706677 731803 648907 814035 772875 334340 538864 548253 781503
16357 781503 341566 763540 623517 799620 743003 347902 299146 356937 612722 271920
16346 432563 366558 506466 456942 570727 562680 451972 548634 723509 399776 587545
16336 587545 565462 507642 581127 491136 564853 427973 485659 668615 396931 286585 807027
16325 807027 504741 690486 237769 300744 669977 747570 481386 718390 655545 671728
16315 671728 384818 320814 456452 180212 513660 340125 703336 461968 596091 520888
16305 520888 260655 259420 860742 383743 633101 517931 464789 354139 116013 486213
16295 486213 714907 621113 489523 591662 396557 303753 481072 344976 344074 963563
$$ packed form
16368G45480j62046R1408L1835K5126q2896J65128m1160C34340K04524R389K33250
16357G81503C41566M21974j40023J76103n6617C47902m8756N7791K55785B71920
16346D32563o6005J39908m9524J13785q047j10708R6662J74875l23733J87769
16336E87545k2083n7820P3485q9991P3717j36880N7686J82956k71684j10346N20442
16325H07027l02286J85745B37769O2975L69233P7593k66184K37004o2845J6183
16315F71728k86910o4004J35638A80212L33448j73535L63211k41368J34123p5203
16305E20888k60233j235O01322C83743K49358j15170n3142j10650A16013L70200
16295D86213K28694r3794j31590J02139j95105r2804J77319j36096r02O19489
$$ plain form
16285 963563 255960 311254 536738 76631 572432 176622 464294 510497 408235 255005
16275 255005 437582 530754 425522 309325 472468 628251 646431 256890 476101 273172
16265 273172 160171 318923 666431 410441 266157 317517 459544 357430 276589 338748
16255 338748 693151 182381 462667 358875 223545 364425 361557 426680 343864 119544
16244 371135 162514 343336 414374 361676 475106 408436 504519 356593 145862 258302
16234 258302 801485 145405 566115 632699 255885 290445 374376 291681 382211 338863 53859
16222 252032 45249 -6809 473216 136105 354980 207189 436401 14375 49873 321692
16212 321692 392255 237751 317968 330944 419781 242592 565878 222078 40892 145670
$$ packed form
16285I63563B55960N5294K25484G6631M95801A76622K87672M6203j02262j53230
16275B55005J82577R3172j05232j16197J63143J55783J8180B56890K19211k02929
16265B73172j13001J58752L47508k55990j44284N1360J42027j02114q0841O2159
16255C38748L54403A82381K80286j03792j35330J40880k868O5123q2816A19544
16244C71135A62514J80822P1038n2698J13430o6670R6083j47926A45862J12440
16234B58302N43183A45405M20710O6584B55885L4560Q3931q2695R0530m3348E3859
16222B52032D5249f809D73216A36105K18875j47791K29212A4375L5498K71819
16212C21692P0563j54504Q0217J2976Q8837j77189L23286B22078D0892J04778
$$ plain form
16202 145670 213298 167776 380791 373008 228765 111943 91480 117829 239074 566653 49439
16190 -13295 342394 443129 297885 -22486 317746 404883 131079 267463 311382 501061
16180 501061 55124 499537 -65474 180885 164218 38454 61390 383269 200210 181689 226776
16169 226776 180684 125793 -101979 580987 -9365 239413 171835 352015 54542 -26948 109075
16157 99937 -15885 380223 149733 94306 420571 479317 376854 -377879 176702 -28137
16146 88831 7391 -10406 193458 20957 136911 303545 240592 305458 313163 -89225 -38592
16134 190452 223309 182699 149935 160659 16220 262433 90428 19455 391793 -16792 4699
16122 -125601 60517 337489 57222 77234 167165 30719 147849 200049 -47234 -14599 184115
$$ packed form
16202A45670O7628m5522K13015p783j44243A11943k0463K6349J21245L27579D9439
16190a3295C42394J00735j45244b2486C17746Q7137A31079J36384M3919J89679
16180E01061E5124M44413f5474A80885j6667C8454K2936L21879j83059j8521M5087
16169B26776m6092n4891a01979E80987i365B39413o7578J80180E4542b6948A09075
16157I9937a5885C80223A49733n5427L26265N8746j02463c77879A76702b8137
16146H8831G391a0406A93458B0957J15954J66634o2953O4866P705h9225c8592
16134A90452L2857m0610l2764J0724A6220K46213I0428A9455L72338a6792D699
16122a25601F0517K76972E7222K0012Q9931C0719J17130N2200d7234a4599A84115
$$ plain form
16110 -55527 -229557 110453 44652 -8160 1745 216484 170374 -319904 86433 448059 38098
16098 395153 185274 198194 182925 -157105 246750 64073 -61231 287553 8377 -7933 54542
16086 240400 103752 217360 151655 -115393 215045 455553 169582 285533 151976 443752
16076 443752 566207 180114 118853 184062 71723 -128148 75021 289751 -15484 113143
16065 94809 -54654 22448 71880 -172328 -297478 -75448 126547 377968 37817 -30890 199066
16053 302288 -8179 295371 -347701 162252 -7344 -124522 81579 -136134 304444 46493 57362
16042 57362 112433 -182304 332536 177497 -35554 206781 -71776 9044 -19099 -264379 268936
16030 52219 232249 -61085 214784 120231 183634 -145218 126153 35210 -52836 38811 487639
$$ packed form
16110e5527j74030A10453D4652h160A745K14739m6110c19904H6433L61626C8098
16098C95153A85274J2920j5269a57105B46750F4073f1231B87553H377g933E4542
16086B40400A03752J13608o5705a15393B15045K40508A69582J15951j33557K91776
16076D43752J22455A80114o1261O5209G1723a28148G5021K14730a5484A13143
16065I4809e4654B2448M9432a72328j25150g5448A26547K51421C7817c0890A99066
16053C02288h179B95371c47701A62252g344j17178H1579a36134C04444D6493J0869
16042E7362N5071a82304C32536j55039c5554B06781g1776I044a9099k45280B68936
16030E2219J80030f1085B14784r4553O3403a45218A26153C5210e2836C8811M48828
$$ plain form
16019 487639 -249043 120869 -141068 465192 -105616 154038 218281 -98144 -112737 -38452
16008 24071 -59048 -290905 418521 -94463 -291754 92166 -88783 42119 -4698 112400 94794
15997 94794 412539 81225 -47034 156630 13597 86309 -87043 224670 53018 59659 943430
15986 943430 828985 1310258 1253862 1557159 1207717 858202 778262 402188 379017 289554
15976 289554 162729 62287 51525 -65069 4049 -163448 130129 113853 -409944 31203 97193
15965 97193 183906 111456 173020 -127609 -11312 -79702 -181700 79491 39113 -157574 48213
15953 2787 -94434 -147624 90564 14955 -162066 209789 -51950 -282165 272490 86308 -7890
15941 -47481 228686 -22964 -52204 354780 425 -379239 251084 -157033 196511 279454 -188414
$$ packed form
16019D87639b49043A20869a41068D65192a05616A54038O4243i8144j4593c8452
16008B4071e9048k31857D18521i4463j97291I2166h8783D2119d698A12400j7606
15997I4794L17745H1225d7034A56630A3597P2712h7043B24670E3018O641Q83771
15986I43430j14445M81273n6396L03297l49442l49515p9940l76074k3171q9463
15976B89554j26825F2287j0762f5069D049a63448A30129j6276d09944C1203O5990
15965I7193Q6713p2450O1564a27609a1312o8390j01998G9491C9113a57574D8213
15953B787i4434n3190I0564A4955a62066B09789e1950k30215B72490H6308g890
15941d7481B28686b2964k9240C54780D25c79239B51084a57033A96511Q2943a88414
$$ plain form
15929 -2494 40951 3919 305007 -64554 115180 261570 30563 251058 141427 72396 215554
15918 215554 -196752 111769 -44046 2149 429199 -98222 141763 46811 262997 119897
15907 -193979 147716 56049 -193612 -38847 167783 -251991 26364 -64624 174863 -105328
15896 149914 -507784 412780 214579 97076 -370762 -152782 -37551 -324827 -205859 120099
15885 68036 11422 201466 69003 278520 -263709 -94556 -142167 56892 -229487 153705 -338487
15873 -162002 157503 99253 -127805 100209 40974 -255919 -340185 -114172 -192546 25370
15862 -166915 152038 -153148 -304022 -113822 -126756 -162770 4467 -220036 127922 102497
15852 102497 -229760 -26924 -267973 -20996 -108888 393205 -262970 -89933 32337 117104 79533
$$ packed form
15929b494D0951C919L01088f4554A15180J46390C0563K20495j09631o9031J43158
15918B15554a96752A11769d4046B149M27050i8222A41763D6811K16186A19897
15907a93979A47716E6049a93612c8847A67783b51991B6364f4624A74863a05328
15896A49914e07784D12780j98201I7076c70762a52782c7551k87276J18968A20099
15885F8036A1422J90044F9003K09517b63709i4556m7611E6892b29487A53705c38487
15873a62002A57503n8250a27805A00209D0974b55919q4266a14172p8374B5370
15862a66915A52038a53148j50874a13822j2934l6014D467b20036A27922k5425
15852A02497b29760b6924k41049b0996q7892C93205b62970h9933C2337Q4767l7571
$$ plain form
15841 79533 -338310 -104193 426013 -42065 90861 32511 124086 196242 29519 31435 9481
15829 244344 -297025 -201569 137037 249013 30359 73835 235825 -1713 -169106 139281
15818 -186498 -215650 -7593 -389738 454523 -6829 -90272 199988 -65049 46398 20427 56074
15807 56074 -74259 -52504 -105793 -12825 52356 -102501 114916 -153288 51817 144396 167384
15796 167384 -295781 -51973 -165521 -162591 -118370 -49494 -173221 -53523 152756 -77546 -39035
15785 -39035 -165257 136480 -137660 205430 128818 -131214 -121604 64438 -98915 150399 59456
15773 -372333 -29015 9804 -158926 210716 -122070 -198860 9024 333441 -406261 110122 -4695
15761 143043 -14012 92857 213249 251048 146706 -190336 77196 -55632 94956 -82537 292538
$$ packed form
15841G9533c38310a04193D26013d2065I0861C2511R1575P2156B9519J916I481
15829B44344b97025R5456A37037J11976C0359M3476J61990a713j67393A39281
15818a86498k9152g593l82145D54523f829q3443A99988f5049D6398B0427L5647
15807E6074g4259K1755n3289a2825E2356a02501A14916a53288E1817R2579K2988
15796A67384b95781e1973j13548K930M4221d9494j23727e3523A52756g7546L8511
15785c9035j26222A36480a37660B05430p6612a31214R610F4438i8915A50399E9456
15773c72333b9015I804a58926B10716a22070p6790I024L24417d06261A10122d695
15761A43043a4012I2857J20392L7799j04342a90336G7196e5632I4956h2537B92538
$$ plain form
15749 67112 33000 -67027 69812 33283 311312 -60030 339341 319740 78272 -146176 -42985
15737 -102823 41264 -126078 -72553 -85957 231751 191039 -131573 435487 191241 -134037
15726 -247855 261020 -117229 -165822 -231851 5105 138428 -224365 -9619 -509139 167053 -312480
15714 134331 -314327 192411 119351 153159 -50758 17249 135285 18860 87340 232901 13110
15702 -159148 -293960 127371 -49086 -154791 -205955 -188791 39120 327566 351394 -196883
15691 186302 27925 353045 214372 102050 186419 -37575 -112109 68469 298453 -137789
15680 -180689 181123 -36772 90657 -114712 99758 -155873 -175081 -162967 41676 316075 -107448
15668 84414 -118983 -22569 -57705 -344444 -24047 289728 -36435 -110322 -255120 -267757 -42778
$$ packed form
15749F7112C3000f7027F9812C3283K78029f0030C39341j9601G8272a46176d2985
15737a02823D1264a26078N3525j3404B31751m0712a31573D35487A91241a34037
15726b47855B61020a17229m8593o6029E105J33323b24365i619m99520A67053c12480
15714A34331c14327A92411p3060L3808e0758A7249J18036A8860O8480J45561A3110
15702a59148j34812A27371d9086j05705n1164J7164C9120K88446K3828a96883
15691A86302B7925L25120j38673A02050Q4369c7575p4534F8469K29984a37789
15680a80689A81123c6772I0657a14712I9758a55873j9208J2114D1676K74399a07448
15668H4414a18983b2569l5136k86739b4047B89728c6435p3887j44798j2637d2778
$$ plain form
15656 -88717 170802 -21756 -131604 -152059 249033 -71509 -53352 -185742 134616 -219028
15645 -43952 -85208 113949 -305373 147943 43736 -262441 41539 -35557 78306 -132213 26700
15633 -7854 -23458 -13568 114014 -314016 166072 -45665 -137207 -52875 -31354 -82600 133288
15621 73133 260627 70069 113005 -344472 -132269 -289613 -411159 135339 -30174 39264
15610 113196 -237998 129453 -61127 42805 24543 113946 202966 -311054 -60168 -355354 119506
15598 42919 83578 100001 120758 -175197 -92200 -49919 -46902 -164842 -271651 27134 -95264
15586 303677 154371 115313 -14123 -140433 145487 63819 -139332 52623 -86520 142476
15575 -232543 -261937 92884 -69305 283245 -37017 20937 91932 -82221 209112 75307 -143909
$$ packed form
15656h8717A70802b1756j09848k0455B49033g1509J8157j32390A34616b19028
15645d3952m1256A13949c05373A47943D3736b62441D1539c5557G8306a32213B6700
15633g854j5604R890A14014c14016A66072d5665r1542e2875K1521n1246A33288
15621G3133J87494G0069M2936c44472a32269j57344j21546A35339c0174C9264
15610A13196b37998A29453f1127D2805j8262Q9403Q9020c11054f0168k95186A19506
15598D2919M0659J6423K0757a75197Q2997M2281L017j17940j06809B7134i5264
15586C03677j49306l9058a4123j26310A45487F3819a39332E2623h6520A42476
15575b32543k9394I2884f9305B83245c7017B0937P0995h2221B09112G5307a43909
$$ plain form
15563 -197092 -105797 -40597 78204 67997 -20858 55826 132279 85635 130945 83998 -68549
15551 357828 -76740 -51423 255273 32480 111431 140584 120187 195010 3042 71510 127162
15540 127162 57010 -90351 50975 122426 -157742 232873 100571 61667 59499 214000 31107
15528 286699 230696 -82255 287068 59672 130494 110556 230574 239369 199013 66924 257345
15517 257345 -101633 344042 409026 375021 339149 -78255 285168 128146 315556 336648
15507 336648 -143249 170058 -46042 -66201 -54177 1064 67705 -159893 89972 618420 -75198
15495 -30117 62146 -79722 -49262 -76297 45108 240606 197752 235957 99907 -87957 267630
15483 69803 204361 -235966 192743 272554 167003 38882 206022 252319 269617 739847
$$ packed form
15563a97092R1295d0597G8204j0207b0858E5826P6453m6644M5310m6947f8549
15551C57828g6740K5317B55273C2480P8951K9153k0397P4823C042O8468N5652
15540A27162E7010i0351E0975P1451a57742B32873A00571l8904k168J54501C1107
15528B86699n6003h2255B87068E9672P0822j9938J20018Q795m0356F6924J90421
15517B57345a01633C44042O4984l4005l5872g8255B85168A28146J87410K1092
15507C36648a43249A70058d6042k0159J2024A064O6641a59893H9972N28448g5198
15495c0117F2146g9722L0460k7035D5108J95498m2854L8205I9907h7957B67630
15483F9803J34558b35966A92743P9811j05551C8882J67140M6297J7298M70230
$$ plain form
15473 739847 716375 658811 378423 249469 295528 212879 168445 69680 -287236 -6647 111124
15461 -56541 119713 128063 44570 -145185 95040 -48997 118818 -137715 -101436 97027 49237
15450 49237 132923 419447 305064 236622 64390 276690 381610 582074 929381 1044452
15440 1044452 1167428 990009 727130 639466 582143 172206 432759 894 127370 -208964
15429 -135254 322054 360492 142901 30818 -105509 23439 64516 -208632 -249652 128725
15418 286395 -44428 -61478 26745 -5563 100410 113883 165965 140514 -265623 -201683 327639
15406 -40001 -46353 272990 269874 211801 114586 181681 228529 246663 23157 -41094 -130872 -175574
15394 -175574 141275 -70742 -28868 -195316 186430 -110750 -121345 157187 56586 118926
$$ packed form
15473G39847k3472n7564k80388j28954M6059q2649m4434F9680b87236f647A11124
15461e6541A19713Q350D4570a45185I5040d8997A18818a37715L6279I7027m7790
15450D9237Q3686K86524j14383o8442F4390K12300J04920K00464L47307J15071
15440A044452J22976j77419k62879q7664n7323A72206K60553H94J26476b08964
15429a35254C22054L8438A42901C0818a05509B3439M1077b08632m1020A28725
15418B86395d4428j7050B6745e563A00410J3473N2082k5451b65623O3940C27639
15406d0001o352B72990l116n8073r7215O7095M6848J8134B3157d1094q9778m4702
15394a75574A41275g0742b8868j66448A86430a10750j0595A57187E6586O2340
$$ plain form
15384 118926 138485 89001 -16375 -10464 276494 -44325 -250563 158204 222189 -1107 412171
15372 291338 314727 172454 367263 159662 -58395 99999 120226 142805 -67456 101205 348315
15361 348315 207180 41866 20658 265711 255241 429085 76156 305661 228560 109716
15350 93453 129812 114808 279707 312283 64021 185079 425885 687168 367998 428157 215773
15339 215773 412231 16818 388682 316140 53518 88629 102626 84500 -260367 -44178 196395
15327 145007 284222 185421 160319 266393 103993 110729 190828 72159 138147 157918 560749
15316 560749 249871 -139124 329625 72735 267373 171101 287969 319227 247487 174558
15306 174558 236852 298481 85231 -11296 388829 142615 115326 -98940 399764 331716 -25083
$$ packed form
15384A18926J9559m9484a6375N911B76494d4325k06238A58204O3985a107D12171
15372B91338K3389j42273J94809A59662e8395I9999K0227K2579f7456A01205K47110
15361C48315j41135D1866B0658K45053j0470J73844G6156K29505p7101A09716
15350I3453L6359j5004J64899L2576F4021J21058K40806K61283l19170O0159k12384
15339B15773J96458A6818L71864p2542E3518L5111J3997j8126b60367d4178A96395
15327A45007J39215r8801k5102J06074A03993O736Q0099G2159O5988J9771M02831
15316E60749B49871a39124C29625G2735J94638r6272J16868L1258p1740p2929
15306A74558O2294O1629H5231a1296C88829A42615k7289i8940C99764o8048b5083
$$ plain form
15294 5918 -275640 175347 8384 -99372 -25708 10233 -183331 -89329 -10591 -134820 273580
15282 -87330 125682 -195647 184224 -224694 -115902 -141140 64939 -193299 -108794 -22169
15271 195013 -153967 298054 225394 387666 -113215 229980 92347 -125889 303622 -125520
15260 118649 207482 -33350 288338 134397 -88286 -55169 212832 -94664 2365 -255655 -106275
15248 315896 151072 -37625 118075 -26805 98421 211124 537634 1610615 1790343 1288345
15238 1288345 1917684 1006776 600088 258241 61635 187608 164756 309460 33275 214835
15228 214835 285 485972 -34313 150501 223003 -295539 -11782 61559 -54844 -233323 -112695
15216 -221352 133242 188238 216853 -56428 125262 347800 54469 -70290 -125155 -93742 64792
$$ packed form
15294E918b75640A75347H384i9372b5708A0233a83331h9329a0591j24229B73580
15282h7330A25682a95647A84224b24694J08792k5238F4939a93299Q4505b2169
15271A95013a53967B98054p2660J62272a13215B29980I2347a25889C03622a25520
15260A18649Q8833c3350B88338A34397h8286L3117B12832i4664B365b55655a06275
15248C15896A51072c7625A18075b6805I8421J12703L26510J072981J79728n01998
15238A288345O29339r10908m06688B58241F1635J25973k2852J44704C3275J81560
15228B14835B85M85687c4313A50501P2502b95539a1782F1559e4844j78479a12695
15216b21352A33242N4996K8615e6428A25262K22538E4469g0290n4865L1413F4792
$$ plain form
15204 531569 56072 -74970 46690 28802 86005 -13964 86892 14508 -72198 258862 370715
15193 370715 -36805 22291 38612 213762 199372 -103488 82335 25940 -494 -250605 -78381
15181 181682 243251 -143220 217532 148067 -100592 104700 26260 -95040 202917 41051
15170 177920 148361 245069 -203759 464512 355575 113108 196722 43592 224129 -26338
15159 -157381 91373 198810 118607 205652 352113 273115 216823 22455 40152 -24256 159293
15147 219937 -155298 42899 169548 219421 81112 57056 153026 -94155 -141757 301438 103016
15135 379005 141860 43137 155206 -54441 119750 134554 436036 144868 -11145 428565
15124 263896 36649 -108915 41782 145310 27090 -78655 159743 402446 434212 643306
$$ packed form
15204E31569E6072g4970D6690j7888N7203a3964H6892A4508g2198B58862J11853
15193C70715c6805B2291J6321J75150j4390a03488H2335B5940d94k50111g8381
15181A81682O1569a43220B17532o9465a00592A04700B6260i5040B02917D1051
15170A77920k9559R6708b03759D64512j08937A13108Q3614D3592J80537b6338
15159a57381I1373J07437q0203Q7045J46461p8998n6292B2455J7697b4256A59293
15147B19937a55298D2899J26649M9873H1112k4056R5970i4155m7602C01438A03016
15135C79005A41860D3137J12069e4441A19750J4804L01482A44868a1145D28565
15124B63896C6649a08915D1782J03528B7090g8655A59743K42703L1766K09094
$$ plain form
15114 643306 453235 397134 55121 62257 282237 123345 475821 656358 203789 337274
15104 337274 48663 657090 173282 65598 242544 -40705 23341 109548 200459 280052 115222
15092 57616 112213 430218 486638 74939 185343 -320209 68668 245324 149359 166880 144888
15081 144888 -192865 8991 492046 303695 67335 -84061 429963 225737 185702 273676 277003
15070 277003 47888 167149 -92402 131736 557083 61348 92974 222344 277611 287015 216978
15059 216978 348720 406181 210166 395410 102959 426449 39781 249714 29861 380811
15049 380811 579466 428640 72528 177094 397532 343908 235043 377045 16303 525706
15039 525706 431950 549575 237947 505127 269706 171174 514044 698941 463242 569523
$$ packed form
15114F43306j90071n6101E5121P136K19980A23345L52476J80537B03789J33485
15104C37274D8663O08427A73282F5598J76946d0705B3341Q6207R0911P9593A15222
15092E7616N4597L18005N6420G4939J10404c20209F8668J76656r5965J7521k1992
15081A44888a92865H991M83055j88351F7335h4061D29963k04226m0035Q7974L327
15070B77003D7888J19261i2402A31736M25347F1348L1626J29370N5267R404p0037
15059B16978J31742N7461j96015J85244A02959L23490C9781K09933B9861L50950
15049C80811J98655j50826G2528J04566K20438n3624j08865J42002A6303N09403
15039E25706r3756J17625B37947K67180k35421r8532L42870J84897k35699J06281
$$ plain form
15029 569523 746031 1019721 890841 1073793 913311 620874 207857 554813 366853 515112
15019 515112 447525 735205 492949 532698 468993 160118 502725 491030 588767 -5515 823153
15007 601001 400531 484852 168906 210450 225004 291771 324071 499036 588564 443101 654818
14996 654818 543061 411169 438732 570718 318227 234341 582583 694427 356974 533318
14986 533318 253325 -33067 884800 205256 745110 853464 927492 990773 769828 654432
14976 654432 538093 668022 630412 373693 854920 662955 638614 871621 180949 537896
14966 537896 478894 305188 368092 539171 416818 421809 157712 374900 156926 300569
14956 300569 560523 537298 407108 361315 306377 334491 340740 103807 510991 423107 433924
$$ packed form
15029E69523J76508K73690j28880J82952j60482k92437B07857L46956j87960J48259
15019E15112o7587K87680k42256L9749o3705A60118L42607j1695R7737e515H23153
15007F01001k00470Q4321A68906M1544J4554O6767L2300J74965Q9528j45463K11717
14996F54818j11757j31892K7563J31986k52491q3886L48242J11844l37453J76344
14986E33318B53325c3067H84800B05256N39854J08354P4028O3281k20945j15396
14976F54432j16339J29929l7610k56719M81227j91965k4341K33007A80949L56947
14966E37896n9002j73706O2904J71079j22353M991A57712K17188A56926J43643
14956C00569K59954k3225j30190m5793n4938K8114O249A03807M07184q7884J0817
$$ plain form
14945 433924 414624 670296 716805 688439 839530 482798 583596 851018 395895 466730
14935 466730 364513 722869 769038 498002 584127 804621 1129077 1255490 1213229 1447080
14925 1447080 1910687 1771230 2136842 1810914 1557172 1603243 1830589 2281519 2403269 2309351
14915 2309351 1973528 1650243 1455335 1616978 979044 937537 848113 337121 361029 664852
14905 664852 500904 556309 570182 478654 512394 225598 457820 467266 497271 441777 323758
14894 323758 247194 600942 652088 569496 312187 700178 434542 473657 643677 846611
14884 846611 1109872 983089 1040487 820675 925346 1043857 573930 822316 700404 642386
14874 642386 75080 537839 458112 752050 400364 580152 481558 441583 893909 373469
$$ packed form
14945D33924j9300K55672M6509k8366J51091l56732J00798K67422C95895P0835
14935D66730j02217L58356M6169k71036Q6125K20494L24456J26413m2261K33851
14925A447080M63607j39457L65612l25928k53742M6071K27346M50930J21750r3918
14915B309351l35823l23285j94908J61643o37934m1507q9424C37121K3908L03823
14905F64852j63948N5405J3873r1528L3740B25598K32222R446L0005n5494j18019
14894C23758p6564L53748N1146q2592k57309L87991k65636L9115J70020K02934
14884H46611K63261j26783N7398k19812J04671J18511m69927K48386j21912n8018
14874F42386G5080M62759p9727K93938l51686J79788r8594l9975M52326C73469
$$ plain form
14863 778312 935718 686021 527549 696870 570306 443032 520124 825333 589437 371865
14853 371865 566739 519937 424149 1076040 121412 350719 799229 709697 750363 1091104
14843 1091104 1012829 927385 1508677 1316186 1567199 976483 785667 1181147 1090689 958825
14833 958825 879446 810392 861235 492951 569156 652312 777835 590034 504153 531026 708126
14822 708126 820748 580243 634547 1150656 595027 879065 1067714 807454 665650 893833
14812 893833 702831 158505 878197 878502 1014569 654998 820144 829676 1052317 1074909 862149
14801 862149 719467 568368 500861 968911 848603 1111356 489236 876698 775581 528378
14791 528378 892179 820473 687102 794805 566593 887819 659738 1005512 798550 456046
$$ packed form
14863G78312J57406k49697j58472J69321j26564j27274P7092L05209k35896k17572
14853C71865J94874m6802r5788O51891A21412K29307M48510q9532M0666L40741
14843A091104p8275q5444N81292j92491K51013n90716j90816L95480r0458j31864
14833I58825p9379o9054N0843l68284P6205Q3156J25523j87801q5881K6873J77100
14822G08126J12622k40505N4304N16109n55629K84038J88649k60260j41804K28183
14812H93833j91002A58505P19692L05J36067l59571J65146R532K22641K2592k12760
14801H62149j42682j51099o7507M68050j20308K62753D89236L87462j01117k47203
14791E28378L63801p1706j33371J07703k28212L21226k28081L45774k06962l42504
$$ plain form
14781 456046 717231 938669 730824 1198829 958146 888581 954186 1119074 681988 671834
14771 671834 841257 1002738 531331 872551 489688 419172 802474 753369 541554 652801
14761 652801 764486 711208 634877 745528 887782 717707 636199 549553 924100 647474
14751 647474 621155 698667 799854 672259 976033 620557 953144 915470 647514 698426
14741 698426 910011 830884 640713 954887 804487 972707 927055 1359770 942392 1219869
14731 1219869 1256854 991329 1588862 1830560 1902313 1621684 2046642 1723794 1202988 1343921
14721 1343921 1013521 1235506 967575 817701 749328 818735 922712 1414288 817206 995017
14711 995017 878660 1201474 1225788 987233 1162205 1471440 1180527 1240105 1463831 1821737
$$ packed form
14781D56046K61185K21438k07845M68005k40683o9565O5605J64888m37086j0154
14771F71834J69423J61481m71407L41220l82863p0516L83302m9105k11815J11247
14761F52801J11685n3278p6331J10651J42254j70075q1508q6646L74547k76626
14751F47474k6319P7512J01187j27595L03774l55476L32587l7674k67956N0912
14741F98426K11585p9127j90171L14174j50400J68220m5652M32715m17378K77477
14731A219869L6985k65525N97533K41698P1753k80629M24958l22848n20806J40933
14721A343921l30400K21985k67931j49874o8373O9407J03977M91576n97082J77811
14711I95017j16357L22814K4314k38555J74972L09235k90913N9578K23726L57906
$$ plain form
14701 1821737 2187930 2323611 2139719 1643197 1363517 1615603 1174744 1080881 1155105 1178175
14691 1178175 1201221 1040822 909697 726201 1331329 821338 920971 1008943 997780 1000325
14681 1000325 1238903 1178008 1295452 908731 953916 959793 1141086 990077 971435 1075205
14671 1075205 1280185 736219 1136135 866023 990646 1091284 1093401 1097360 1256249 1373854
14661 1373854 947449 1168479 1044044 1220851 1385852 1111474 1730801 1462954 1592036
14652 1592036 1504363 1422096 1399881 1611240 1266985 1160647 1259391 1641400 1108748 1103351
14642 1103351 1440762 1503100 1386070 1381369 1296204 1324983 1225310 1204378 1299136 923440 1253391
14631 1253391 1648701 1455552 1578693 1123196 1318406 1663555 1533168 1283420 1479368
$$ packed form
14701A821737L66193J35681j83892m96522k79680K52086m40859r3863P4224K3070
14691A178175K3046j60399j31125j83496O05128n09991R9633Q7972j1163K545
14681A000325K38578o0895J17444l86721M5185N877J81293j51009j8642J03770
14671A075205K04980n43966L99916k70112J24623J00638K117L959J58889J17605
14661A373854m26405K21030j24435J76807J65001k74378O19327k67847J29082
14652A592036q7673q2267k2215K11359l44255j06338R8744L82009n32652n397
14642A103351L37411O2338j17030m701q5165K8779r9673k0932R4758l75696L29951
14631A253391L95310j93149J23141m55497J95210L45149j30387k49748J95948
$$ plain form
14622 1479368 1560481 1569994 1466759 1696402 1378399 1518085 1607014 1645173 1469904 1620449
14612 1620449 1422187 1460008 1196054 1874538 1384276 1252690 1521490 1531137 1567744 1519360
14602 1519360 1361015 1748364 1341123 1701005 1748099 1971420 1854430 1840622 1815870 1724972
14592 1724972 1973735 1752813 1572184 2038301 1979375 1839436 2315073 2346646 2016521 1949452
14582 1949452 2220938 1882971 1991666 2235521 2131670 2062786 2371103 2298280 2343383 2201378
14572 2201378 2244583 2532344 2424799 2121152 2453362 2379332 2443882 2443300 2625783 2820278
14562 2820278 2681990 3040662 2967987 2999472 2518648 3226519 3350783 3634673 3739051 4088145
14552 4088145 4487850 5158969 5796901 7709983 11276984 18961998 39542962 46268736
$$ packed form
14622A479368Q1113R513j03235K29643l18003J39686Q8929L8159j75269J50545
14612A620449j98262L7821k63954O78484m90262j31586K68800R647L6607m8384
14602A519360j58345L87349m07241L59882M7094K23321j16990j3808k4752r0898
14592A724972K48763k20922j80629M66117n8926j39939M75637L1573l30125o7069
14582A949452K71486l37967J08695K43855j03851o8884L08317p2823M5103j42005
14572B201378M3205K87761j07545l03647L32210p4030O4550n82J82483J94495
14562B820278j38288L58672p2675L1485m80824P07871J24264K83890J04378L49094
14552D088145L99705O71119O37932J913082L567001P685014K0580964O725774
$$ plain form
14544 46268736 19216000 8136358 4728678 3230797 2835859 2829248 2662263 4185153 5758680
14535 5758680 3311656 2695885 2344759 2188716 1992154 2302172 2368616 2324583 2564925 2404833
14525 2404833 2448237 2332499 2277946 2655446 2655856 2554754 2747276 2660799 2720209 2946000 2785742
14514 2785742 2792568 2743780 2739374 2686161 3218956 2792466 2880943 3319752 2944156 2881784 3217321
14503 3217321 3271706 3317945 3291337 3484258 3320729 3199736 3383881 3133691 3383209 3656436
14493 3656436 3593139 3446826 3957454 3680937 3624630 3867993 4052380 4131662 4134827 3649692
14483 3649692 3816369 3983914 3920027 3988142 4260775 4127444 4186702 4344554 4506475 4429095
14473 4429095 4577767 4778030 4547609 4334603 4468736 4809532 4793685 4966295 4788460 4910368
$$ packed form
14544D6268736A9216000H136358l407680j497881l94938o611j66985J522890J573527
14535E758680k447024o15771l51126j56043j96562L10018O6444m4033K40342j60092
14525B404833M3404j15738n4553L77500M10j01102J92522q6477N9410K25791j60258
14514B785742O826m8788m406n3213N32795m26490Q8477M38809l75596o2372L35537
14503C217321N4385M6239k6608J92921j63529j20993J84145k50190K49518K73227
14493C656436o3297j46313N10628k76517n6307K43363J84387P9282L165m85135
14483C649692J66677J67545o3887O8115K72633j33331N9258J57852J61921p7380
14473D429095J48672K00263k30421k13006J34133L40796j5847J72610j77835J21908
$$ plain form
14463 4910368 5133571 5115213 4774590 5096747 5352197 5190837 5081192 5474273 5491572 5533593
14453 5533593 5237012 5352935 5725320 5880387 5673752 5814457 5958829 6201671 6393086
14444 6393086 6307475 6172457 5975681 6428082 6478911 6344757 6627397 6385173 6751810 6908092
14434 6908092 6713548 7011338 7231428 7174188 7508117 7509054 7518293 7892046 7732631 8070252
14424 8070252 8260125 8243553 8318700 8785642 8880652 8588800 9099543 8832208 9093850 9270736
14414 9270736 9277979 9333815 9415989 9692318 9947650 10057608 10008456 10378984 10839060 10924760
14404 10924760 10882088 11055740 10950772 11138001 11546158 11497468 11600196 11810548 11870969 12336365
14394 12336365 12379112 12289587 12919960 13054504 13464306 13254260 13595618 14064300 14101828 14855881
$$ packed form
14463D910368K23203j8358l40623L22157K55450j61360j09645L93081J7299M2021
14453E533593k96581J15923L72385J55067k06635J40705J44372K42842J91415
14444F393086q5611j35018j96776M52401N0829j34154K82640k42224L66637J56282
14434F908092j94544K97790K20090n7240L33929R37R239L73753j59415L37621
14424H070252J89873j6572P5147M66942R5010k91852N10743k67335K61642J76886
14414I270736P243N5836Q2174K76329K55332J09958m9152L70528M60076Q5700
14404A0924760m2672J73652j04968J87229M08157m8690J02728K10352O0421M65396
14394A2336365M2747q9525O30373J34544M09802k10046L41358M68682L7528P54053
$$ plain form
14384 14855881 14506687 15177996 15651675 15569027 16157702 16306746 16253373 16817218 16773785 17595445
14374 17595445 17619835 17874575 18177013 18573748 19262754 19308067 19792982 20480648 20769140 21372269
14364 21372269 21786300 22096699 22230832 22902308 23365648 23895798 24597516 25103314 25551571
14355 25551571 26096957 26951412 27204455 28078396 28912064 29439795 30230677 30994302 31533488
14346 31533488 32428968 33265887 33960184 35095738 36030068 36865198 37514098 38987103 40086022
14337 40086022 41282550 42731203 43786530 44881980 46321399 47712074 49163266 50745572
14329 50745572 52249237 53830983 55679472 57443278 59343452 61388597 63664601 65861974
14321 65861974 68291784 70832498 73081857 75451876 78285156 81163406 84181698 86867336
$$ packed form
14384A4855881l49194O71309M73679q2648N88675J49044n3373N63845m3433Q21660
14374A7595445K4390K54740L02438L96735O89006M5313M84915O87666K88492O03129
14364B1372269M14031L10399J34133O71476M63340N30150P01718N05798M48257
14355B5551571N45386Q54455K53043Q73941Q33668N27731P90882P63625N39186
14346C1533488Q95480Q36919O94297J135554R34330Q35130O48900J473005J098919
14337D0086022J196528J448653J055327J095450J439419J390675J451192J582306
14329E0745572J503665J581746J848489J763806J900174K045145K276004K197373
14321F5861974K429810K540714K249359K370019K833280K878250L018292K685638
$$ plain form
14313 86867336 90096280 93999263 97830128 101628928 105886487 110316406 114474366 119592226
14305 119592226 124632785 130401320 136283497 142161244 148378408 155462582 162672560 170114752
14297 170114752 178052886 186753957 195390924 204876106 214741694 224926653 236185628 247193108
14289 247193108 259506476 271776374 284609890 297815862 311565237 325174534 339611233
14282 339611233 353582078 367896269 382013304 395381698 408691731 421111268 432326042
14275 432326042 442498903 451153917 457102455 459529738 460965739 461101012 460069713 453984684
14267 453984684 448757268 441667585 432134403 421915445 410196978 397479594 384043747
14260 384043747 369639725 355191550 340149774 325023381 310128481 295641751 281397400
$$ packed form
14313H6867336L228944L902983L830865L798800M257559M429919M157960N117860
14305A19592226N040559N768535N882177N877747O217164P084174P209978P442192
14297A70114752P938134Q701071Q636967R485182R865588J0184959J1258975J1007480
14289B47193108J2313368J2269898J2833516J3205972J3749375J3609297J4436699
14282C39611233J3970845J4314191J4117035J3368394J3310033J2419537J1214774
14275D32326042J0172861Q655014N948538K427283J436001J35273j031299o085029
14267D53984684n227416p089683r533182j0218958j1718467j2717384j3435847
14260C84043747j4404022j4448175j5041776j5126393j4894900j4486730j4244351
$$ plain form
14253 281397400 268190177 254995905 242636173 230282061 219340328 208388990 199826171
14246 199826171 190609648 181131336 172928794 164842265 157178445 150015855 143412821 136612577
14238 136612577 131254078 125822952 120045378 114625382 110000539 105456156 101300838 97956783
14230 97956783 93807313 89913330 86355940 83090243 80226439 76914380 74207773 71647180
14222 71647180 69131380 66747290 64555375 62488607 60394173 58656779 56282841 54666587
14214 54666587 53156956 51968893 49804022 48165058 47119927 45823935 44204475 43743089
14206 43743089 42333614 40862297 39881591 38614352 37658646 36857748 35864129 34734702 33912092
14197 33912092 32970499 31978780 31406976 30804154 30176940 29345106 28520397 27732382 27144735
$$ packed form
14253B81397400j3207223j3194272j2359732j2354112j0941733j0951338q562819
14246A99826171r216523r478312q202542q086529p663820p162590o603034o800244
14238A36612577n358499n431126n777574n419996m624843m544383m155318l344055
14230I7956783m149470l893983l557390l265697k863804l312059k706607k560593
14222G1647180k515800k384090k191915k066768k094434j737394k373938j616254
14214E4666587j509631j188063k164871j638964j045131j295992j619460m61386
14206D3743089j409475j471317r80706j267239r55706q00898r93619j129427q22610
14197C3912092r41593r91719n71804o02822o27214q31834q24709p88015n87647
$$ plain form
14188 27144735 26559941 25819370 25159559 24770982 24276144 23919240 23068065 22912730 22011847
14179 22011847 21983598 21537257 20734562 20464764 19946208 19226847 19176375 18735483 18751758 17906629
14169 17906629 17932941 16951878 17237212 16513832 16381241 16131623 15865297 15727027 15573141
14160 15573141 15105617 14908645 14799066 14273314 14053530 13888334 13765939 13172454 12937537
14151 12937537 13257679 12495856 12435624 12182830 11982729 12095829 11707134 11533968 11486314 10850656
14141 10850656 10876908 11066086 10639193 10777199 10125890 10147284 9983822 9745948 9887862 9823626
14131 9823626 9510654 9448650 9251030 9235169 9163934 8705842 8960659 8667696 8432562 8664084
14121 8664084 8377708 8404785 8179118 8213196 7836325 7738749 7681568 7818069 7656581 7261530
$$ packed form
14188B7144735n84794p40571o59811l88577m94838l56904q51175j55335r00883
14179B2011847k8249m46341q02695k69798n18556p19361n0472m40892J6275q45129
14169A7906629K6312r81063K85334p23380j32591k49618k66326j38270j53886
14160A5573141m67524j96972j09579n25752k19784j65196j22395n93485k34917
14151A2937537L20142p61823o0232k52794k00101J13100l88695j73166m7654o35658
14141A0850656K6252J89178m26893J38006o51309K1394j63462k37874J41914o4236
14131I823626l12972o2004j97620j5861p1235m58092K54817k92963k35134K31522
14121H664084k86376K7077k25667L4078l76871r7576n7181J36501j61488l95051
$$ plain form
14111 7261530 7378417 7170448 7253238 7409609 6771994 7233278 6717927 6651772 6659349 6451061
14101 6451061 6142243 6417590 6151039 6090370 6314989 5907529 5593924 5929405 5805984 6113158
14091 6113158 5641528 5597318 5635265 5612086 5764411 5642229 5524771 4871174 5027665 5159305
14081 5159305 5339173 5039543 5108382 5161713 4820066 4868434 4651626 4644928 4680109 4750907 4759981
14070 4759981 4571285 4789817 4523528 4433548 4638145 4491004 4358004 4741568 4633317 4557101
14060 4557101 4571741 4035569 4321991 4129014 4111412 4163218 4281825 4200319 3824233 3878325
14050 3878325 3992931 3723478 3910146 3548677 3504422 3713962 3647094 3799533 3690742 3531508
14040 3531508 3345972 3544150 3741826 3224972 3434846 3159220 2988873 3073726 3304399 3501531
$$ packed form
14111G261530J16887k07969Q2790J56371o37615M61284n15351o6155P577k08288
14101F451061l08818K75347k66551o0669K24619m07460l13605L35481j23421L07174
14091F113158m71630m4210L7947k3179J52325j22182j17458o53597J56491J31640
14081E159305J79868k99630O8839N3331l41647M8368k16808o698L5181P0798R074
14070D759981j88696K18532k66289q9980K04597j47141j33000L83564j08251p6216
14060D557101J4640n36172K86422j92977j7602N1806J18607q1506l76086N4092
14050C878325J14606k69453J86668l61469m4255K09540o6868J52439j08791j59234
14040C531508j85536J98178J97676n16854K09874k75626j70347Q4853K30673J97132
$$ plain form
14030 3501531 3287029 3605734 3003537 3135031 2938802 2960322 2971730 2940133 2862784 2887513
14020 2887513 3005493 2600244 2906808 2527924 2707142 2540383 2954533 2666326 2331072
14011 2331072 2370290 2525365 2372577 2414590 2674152 2506596 2560204 2275262 2625856 2157053
14001 2157053 2354638 2186563 1986260 2682099 2348430 2069183 2276429 2410572 2430384 2530538
13991 2530538 3050337 2957374 3718089 5831706 11232423 29032816 50807138 27208213
13983 27208213 13695309 8651515 6423610 5247221 4560506 3989615 3549253 3229153
13975 3229153 3100116 2902361 2967701 2984039 2801062 2533921 2238230 2533035 2299881 2675189
13965 2675189 2292397 2473454 2397353 2213949 2271372 2241234 2180343 2229150 1883157 2452333
$$ packed form
14030C501531k14502L18705o02197J31494j96229K1520J1408l1597p7349K4729
14020B887513J17980m05249L06564l78884J79218j66759M14150k88207l35254
14011B331072L9218J55075j52788M2013K59562j67556N3608k84942L50594m68803
14001B157053J97585j68075k00303O95839l33669k79247K07246J34143J9812J00154
13991B530538N19799r2963P60715K113617N400717J7800393K1774322k3598925
13983B7208213j3512904n043794k227905j176389o86715n70891m40362l20100
13975C229153j29037j97755O5340J6338j82977k67141k95691K94805k33154L75308
13965B675189l82792J81057p6101j83404N7423l0138o0891M8807l45993N69176
$$ plain form
13955 2452333 2144880 1925029 2480930 2153110 1983724 1761705 2062910 1895275 2098274
13946 2098274 2042171 1790254 2050957 1677233 1844281 1795886 1992974 1827892 1746973 1894091
13936 1894091 1825579 1761655 2097313 1654589 1738881 1555228 1524658 1994371 1758565 1627149
13926 1627149 1760257 2097222 1647180 1659514 1673624 1751683 1644126 1690830 1421607 1277392
13916 1277392 1827320 1587805 1603963 1591337 1823850 1508096 1335595 1390055 1540991 1504226
13906 1504226 1511743 1346843 1080108 1455280 1563957 1504149 1413104 1350050 1351479 1278519 1447457
13895 1447457 1573954 1213140 1490291 1624680 1086856 1290338 1450402 1437679 1596607 1483251
13885 1483251 1033326 1153911 1367952 1525210 1388825 1227128 1056401 1064691 1452170 1054822
$$ packed form
13955B452333l07453k19851N55901l27820j69386k22019L01205j67635K02999
13946B098274n6103k51917K60703l73724J67048m8395J97088j65082q0919J47118
13936A894091o8512o3924L35658m42724Q4292j83653l0570M69713k35806j31416
13926A627149J33108L36965m50042J2334J4110P8059j07557M6704k69223j44215
13916A277392N49928k39515J6158j2626K32513l15754j72501N4460J50936l6765
13906A504226P517j64900k66735L75172J08677n9808r1045o3054J429p2960J68938
13895A447457J26497l60814K77151J34389n37824K03482J60064j2723J58928j13356
13885A483251m49925J20585K14041J57258j36385j61697j70727Q290L87479l97348
$$ plain form
13875 1054822 1398168 1413649 1160486 1393057 1081891 1078238 1388193 1178276 1190940 965249
13865 965249 1165341 792862 1149243 1244561 1281464 1290781 1287624 892925 917600 1059433 945414
13854 945414 863978 1073188 1255426 827661 1040383 1151817 921952 1056052 1192168 965478
13844 965478 873432 789961 1089395 1200245 1075303 1323934 776266 1088292 782645 999976
13834 999976 789847 920848 1027629 986886 1113823 1065979 915737 871317 1051995 705630
13824 705630 936884 893976 842394 836688 920896 742486 837296 709806 1129375 529692 939565
13813 939565 1170629 942399 763201 895399 801634 775275 660386 774430 1230231 1152412
13803 1152412 927903 923581 823615 557633 1053575 721342 766504 733116 925491 925257 1009509
$$ packed form
13875A054822L43346J5481k53163K32571l11166l653L09955k09917J2664k25691
13865I65249K00092l72479L56381R5318L6903R317l157l94699K4675J41833j14019
13854I45414q1436K09210J82238m27765K12722J11434k29865J34100J36116k26690
13844I65478r2046q3471K99434J10850j24942K48631n47668L12026l05647K17331
13834I99976k10129J31001J06781m0743J26937m7844j50242m4420J80678l46365
13824G05630K31254m2908n1582n706Q4208j78410R4810j27490M19569E29692M09873
13813I39565K31064k28230j79198J32198r3765k6359j14889J14044M55801p7819
13803A152412k24509m322r9966k65982M95942l32233M5162l3388J92375k34Q4252
$$ plain form
13792 1009509 865879 674052 805778 711856 680771 868237 841647 579763 798369 478964
13782 478964 653307 468759 657984 763509 986378 784052 1030030 969850 860928 631896
13772 631896 168407 805842 918631 613292 768941 877854 808950 847869 659441 945808
13762 945808 661775 549308 657024 614959 714081 881387 766392 945148 840551 549363
13752 549363 681712 299709 1011317 719073 561979 467269 845258 528643 522509 648225
13742 648225 749484 992544 518343 361603 767662 686667 726141 825156 387706 680201
13732 680201 802348 782438 535370 176949 524484 688260 341933 572402 482512 488110
13722 488110 707419 570182 823425 422883 372221 245637 125847 180798 581596 733010
$$ packed form
13792A009509j43630j91827J31726r3922l1085J87466k6590k61884K18606l19405
13782D78964J74343j84548J89225J05525K22869k02326K45978o0180j08922k29032
13772F31896A68407O37435J12789l05339J55649J08913o8904L8919j88428K86367
13762I45808k84033j12467J07716m2065R9122J67306j14995J78756j04597k91188
13752E49363J32349B99709P11608k92244j57094r4710L77989l16615o134J25716
13742F48225J01259K43060m74201j56740M06059q0995L9474R9015C87706K92495
13732F80201J22147j9910k47068A76949L47535J63776C41933K30469q9890N598
13722D88110K19309j37237K53243m00542n0662j26584j19790N4951M00798J51414
$$ plain form
13712 733010 554876 294939 773103 605980 222716 740714 546327 374213 553216 333489
13702 333489 735342 582007 448045 351795 317614 397574 252268 589501 306984 637752
13692 637752 418864 701038 165710 647113 633315 593550 811545 283625 551726 422251
13682 422251 420411 204347 303578 842190 544298 530246 297528 279174 166641 476019
13672 476019 515009 664346 418035 527071 520839 412029 593557 583169 463477 386017
13662 386017 430262 603673 648557 765710 160441 773933 607543 420450 200813 524878
13652 524878 391830 306637 454629 342028 783459 400397 388597 258685 627537 228210
13641 642800 314914 329448 524459 465257 335191 525667 745187 718229 874893 206952
$$ packed form
13712G33010j78134k59937M78164j67123B22716N17998j94387j72114J79003k19727
13702C33489M01853j53335j33962r6250l4181P9960j45306L37233k82517L30768
13692F37752k18888K82174A65710M81403j3798l9765K17995B83625K68101j29475
13682D22251j840B04347R9231N38612k97892j4052k32718j8354j12533L09378
13672D76019L8990J49337k46311J09036o232j08810J81528j0388j19692p7460
13662C86017M4245J73411M4884J17153A60441O13492j66390j87093B00813L24065
13652E24878j33048q5193J47992j12601M41431l83062j1800j29912L68852B28210
13641F42800C14914J4534J95011n9202j30066J90476K19520k6958J56664B06952
$$ plain form
13630 406982 445187 559016 566154 535572 359276 398346 279237 742593 490331 259973
13620 259973 569443 368326 447212 158074 397946 201716 445837 307551 304814 541658
13610 541658 398358 522328 426596 432361 607213 451524 604211 210494 324073 44645
13599 395013 165102 250347 247327 337258 962476 280034 188490 251216 470521 332215 547884
13588 547884 301409 -98778 564746 247734 374141 420926 381183 335227 682782 255418
13577 241605 231665 444514 152137 69798 355202 460197 374196 191615 313591 350242
13567 350242 225575 719509 392273 388996 435253 208185 134473 49643 332561 496469
13557 496469 114776 796467 324913 281722 492159 371837 216763 30059 678421 579704
$$ packed form
13630D06982L8205J13829P138l0582j76296L9070j19109M63356k52262k30358
13620B59973L09470k01117P8886A58074K39872j96230K44121j38286k737K36844
13610E41658j43300J23970r5732N765J74852j55689J52687B10494J13579D4645
13599C95013A65102Q5245l020Q9931O25218B80034r1544O2726K19305j38306K15669
13588E47884k46475i8778E64746B47734J26407M6785l9743m5956L47555B55418
13577B41605r940K12849A52137F9798K85404J04995q6001j82581J21976L6651
13567C50242j24667M93934l27236l277M6257B08185p3712D9643K82918J63908
13557D96469A14776O81691C24913m3191K10437j20322j55074C0059O48362r8717
$$ plain form
13547 579704 173399 297332 375618 134634 238155 406696 -32317 440179 414623 190908
13536 168240 258814 45939 308520 303886 275562 358722 264752 410178 101649 137646 204417
13525 204417 335743 231252 73441 154518 315192 155934 127391 173355 303958 99836
13514 103728 81832 145945 85091 282145 74371 507500 531944 29905 253760 261686 49664
13502 300063 398190 298819 367121 129817 305475 276313 198255 277420 97383 263513 203317
13491 203317 350083 236014 313042 399985 330050 15256 420307 11587 41122 424011 424280
13480 424280 -64948 23976 280539 305948 128338 109573 390296 496159 303936 328487
13470 328487 200671 148804 -36461 253774 -122201 499702 -21376 399134 290623 -159515
$$ packed form
13547E79704A73399J23933P8286A34634J03521J68541c2317D40179k5556A90908
13536A68240R0574D5939K62581m634k8324Q3160r3970J45426A01649L5997O6771
13525B04417J31326j04491G3441Q1077J60674A55934k8543M5964J30603I9836
13514A03728k1896O4113o0854J97054G4371M33129K4444B9905K23855P926D9664
13502C00063R8127r9371O8302A29817J75658k9162p8058P9165I7383J66130o0196
13491B03317J46766j14069P7028Q6943o9935A5256M05051A1587K9535L82889K69
13480D24280f4948B3976K56563K5409A28338j8765K80723J05863j92223K4551
13470C28487j27816n1867c6461B53774a22201D99702b1376C99134j08511a59515
$$ plain form
13459 549515 124137 297188 361623 -54331 -77509 566258 169939 238042 217559 166525 449728
13448 449728 315185 -30812 411514 230233 112093 452587 -80063 211062 159539 106599
13438 106599 253371 301127 270873 80229 444465 182988 219004 249018 486117 259743
13428 259743 123908 -140444 355407 220835 218522 204640 -45730 -234361 144039 134940 -27867
13416 150488 223014 303342 7606 73744 73092 348877 320452 239346 -60940 250089 538819
13405 538819 79949 -59765 208211 292479 -55451 155238 319107 439729 153298 347892
13395 347892 306187 111496 -172528 118381 271373 518292 -68111 520121 147934 147632
13385 147632 150242 83651 89822 275461 -107086 85942 79942 198490 290081 103621 322119
$$ packed form
13459E49515A24137J73051O4435e4331k3178E66258A69939O8103k0483n1034K83203
13448D49728j34543c0812D11514j81281A12093L40494h0063B11062n1523n2940
13438A06599J46772M7756l0254H0229L64236A82988L6016L0014K37099k26374
13428B59743A23908a40444C55407j34572k313j3882d5730j88631A44039r099b7867
13416A50488P2526Q0328G606O6138o52K75785k8425q1106f0940B50089K88730
13405E38819G9949e9765B08211Q4268e5451A55238J63869J20622A53298J94594
13395C47892m1705A11496a72528A18381J52992K46919f8111E20121A47934l02
13385A47632K610o6591O171J85639a07086H5942o000J18548R1591A03621K18498
$$ plain form
13374 322119 249759 91935 314749 131027 296243 -159089 323413 347747 267019 179683
13364 179683 -91820 303734 302641 32382 530979 489490 138534 178259 220235 117686 162961
13353 162961 238930 341235 217910 40622 331107 114410 336142 -17152 245737 228107
13343 228107 529784 652407 355175 402634 67877 301689 544254 112541 84195 8932
13332 71282 168012 118621 97705 29906 -276620 -83166 237338 -47473 -49632 -26929 126062
13320 163991 362107 -254745 220611 197613 369291 718151 51701 238198 9953 85817
13310 85817 140278 61934 360895 235004 308354 139714 341317 -32241 84078 -118785 25241
13298 239902 267565 385229 44915 103695 314663 329669 60676 93328 102499 473752 192098
$$ packed form
13374C22119p2360I1935K22814A31027J65216a59089C23413K4334q0728q7336
13364A79683i1820C03734j093C2382M98597m1489A38534L9725M1976j02549M5275
13353A62961P5969J02305j23325D0622K90485A14410K21732a7152B45737j7630
13343B28107L01677J22623k97232M7459F7877K33812K42565A12541k8346H932
13332G1282R6730m9391k0916B9906b76620h3166B37338d7473k159K2703A26062
13320A63991J98116b54745B20611k2998J71678L48860E1701J86497I953P5864
13310H5817N4461F1934K98961j25891P3350A39714K01603c2241H4078a18785B5241
13298B39902K7663J17664D4915N8780K10968J5006F0676L2652R171L71253A92098
$$ plain form
13286 -84464 288504 153261 270722 -210866 -166025 170482 35082 231016 30610 104508
13276 104508 -140958 181113 226925 -152356 136595 -104444 -90399 -222058 99514 -133084
13265 -195008 122622 39112 302746 43975 91306 -84607 227970 261594 -150729 130180
13254 -7630 243972 220037 177676 65036 -253997 332847 -29994 -60554 168212 199598 411614
13243 411614 253736 243937 152611 292394 317029 -253622 -115262 114562 -125174 97563
13232 30121 369502 215035 209068 -7935 -115484 27160 172969 -7820 -202263 -314759 40209
13220 123014 429699 -86985 182228 46185 163673 -12392 -294446 4850 125059 76057 -150629
13208 191735 118913 -183618 -245258 -78757 205817 300105 -21312 46170 303127 62169 293840
$$ packed form
13286h4464B88504j35243J17461b10866M4841A70482C5082J95934C0610P3898
13276A04508a40958A81113M5812a52356A36595a04444J4045j31659I9514a33084
13265a95008A22622C9112K63634D3975M7331h4607B27970L3624a50729A30180
13254g630B43972k3935m2361F5036b53997C32847b9994l0560A68212L1386K12016
13243D11614j57878r799r1326J39783K4635b53622a15262A14562a25174I7563
13232C0121L39381j54467n967g935j07549B7160J45809g820j94443j12496D0209
13220A23014L06685h6985A82228D6185J17488a2392k82054D850J20209m9002a50629
13208A91735p2822a83618o1640g8757B05817R4288b1312D6170K56957F2169K31671
$$ plain form
13197 293840 1534 110140 92927 531967 136075 -167058 90016 185616 76479 266457 -655040
13185 175104 -91364 -18619 -39375 -48444 -3563 -6812 -19514 -151218 -48244 150932 -37556 59186
13172 -91558 -49934 216539 147449 -11584 85828 297589 46538 297439 374968 -31513 34528
13160 270874 260691 207980 -116404 36574 186590 13028 146892 -10207 109185 91299 321367
13149 321367 22704 158498 231819 8088 38257 57292 236552 -230928 -31266 29190 145767
13138 145767 30414 -214890 -150559 -91381 276569 104203 -8649 -78767 89020 203461 223990
13127 223990 -37370 -137896 46473 -87618 78049 269943 -97129 22089 -118462 134226 -115339
13115 -19811 48056 225365 45370 188665 105137 110495 44770 294661 78842 364643 315725
$$ packed form
13197B93840A534J08606j7213M39040A36075a67058I0016R5600G6479J89978f55040
13185A75104i1364a8619k0756r069c563l249j2702j31704d8244A50932c7556E9186
13172i1558M1624B16539o9090a1584H5828K11761D6538K50901P7529c1513C4528
13160B70874j0183n2711a16404C6574J50016A3028J33864a0207A09185j7886K30068
13149C21367B2704J35794P3321H088L0169J9035J79260b30928c1266B9190J16577
13138A45767C0414b14890O4331N9178B76569A04203h649p0118H9020J14441K0529
13127B23990c7370j00526D6473h7618G8049J91894i7129B2089a18462A34226a15339
13115a9811D8056J77309D5370J43295q3528N358D4770K49891G8842K85801m8918
$$ plain form
13104 315725 156036 -122793 27391 -106517 -49558 157541 61059 294930 1569 113881
13094 113881 239063 13154 280718 -73325 40356 114079 354842 223509 459443 -132729
13083 232907 76368 101285 235874 -99416 -125818 -176659 154982 27296 42524 60756 -95461
13071 -171012 -174620 -233019 -178986 -52837 148485 119323 15113 143353 150389 -4299 343990
13059 164232 -96646 4643 -89435 41621 -18102 174634 26293 -528352 128893 92808 402466
13048 402466 213116 182738 -243892 188494 217561 -149328 80388 218742 164822 281933
13038 281933 -34312 4983 -2569 3639 23723 185993 154516 -396138 -240467 348248 -11700
13026 146002 44704 -24956 -88561 21996 -6445 -42473 234168 4787 294534 257519 171873
$$ packed form
13104C15725A56036a22793B7391a06517d9558A57541F1059K33871A569J12312
13094A13881J25182A3154K67564g3325D0356P3723K40763j31333K35934a32729
13083B32907G6368K4917J34589i9416k6402n0841A54982B7296J5228J8232i5461
13071a71012l608n8399N4033e2837A48485k9162A5113J28240P036d299C43990
13059A64232i6646D643h9435D1621a8102A74634B6293e28352A28893l6085L09658
13048D02466j89350l0378b43892A88494K9067a49328H0388J38354n3920J17111
13038B81933c4312D983b569C639K0084J62270l1477c96138J55671C48248a1700
13026A46002D4704b4956o3605B1996f445l6028B34168D787K89747l7015q5646
$$ plain form
13015 171873 60420 336137 282124 136441 105044 -130358 -138454 61367 128852 450218 -234917
13003 79075 133202 -153035 133362 51158 -16387 -89427 -158447 89369 -307778 289414 -69084
12991 109933 89138 2502 -157389 -154714 306019 988 -178479 45600 173066 -7157 46418 130073
12979 130073 147860 64556 35683 27270 103497 64277 -448327 102488 -3124 -6942 -115109
12968 -115109 390645 285671 -10803 -110424 156979 170606 31142 279390 159812 92780
12958 92780 -124695 40239 213311 -54566 -312808 -18528 -152135 168116 162017 -72456 24844
12946 -19108 5851 134660 93770 3547 -113183 -19889 59031 -92943 -143639 -10421 83700 -142010
12933 24675 -97892 19265 35855 -153213 229032 102117 -124698 115675 -161440 93987
$$ packed form
13015A71873F0420K75717n4013A36441l1397a30358q096F1367O7485L21366b34917
13003G9075N4127a53035A33362E1158a6387p3040o9020H9369c07778B89414f9084
12991A09933k0795B502a57389K675C06019I88a78479D5600J27466g157D6418Q3655
12979A30073J7787F4556k8873q413P6227l9220d48327A02488c124l818j08167
12968a15109C90645j04974a0803r9621A56979J3627C1142K48248j19578o7032
12958I2780a24695D0239J73072e4566k58242a8528j33607A68116o099g2456B4844
12946a9108E851J28809m0890C547a13183a9889E9031i2943n0696a0421H3700a42010
12933B4675i7892A9265J6590a53213B29032A02117a24698A15675a61440I3987
$$ plain form
12922 34188 -34666 187048 210965 64761 378315 32218 242104 -146711 41454 -155955 200960
12910 271682 -161348 -160838 47468 -240397 104727 -17502 -359622 90950 78585 -462135 201655
12898 -17349 -36140 -20900 45 296253 -38372 -103105 -355443 59275 -372521 -19467 -5703 58291
12885 265079 -18456 -261894 -448310 -350271 -128459 -19221 198495 -350073 1512 124609
12875 124609 270413 224363 329051 34327 -57051 174219 24421 113273 256375 -198215
12864 -24017 -64966 -106144 161445 -374735 169041 209439 -33177 114060 45842 -238888 -963
12852 179103 163807 -88712 -379047 -188292 41018 169900 116143 53262 -141792 -190195 -13845
12840 169433 -13685 175075 -292471 87967 -110389 186172 -153536 36254 -172591 262210
$$ packed form
12922C4188c4666A87048K3917F4761L13554C2218K09886a46711D1454a55955B00960
12910B71682a61348N10D7468b40397A04727a7502l42120I0950j2365d62135B01655
12898a7349j8791J5240D5K96208c8372o4733k52338E9275c72521a9467e703E8291
12885B65079a8456k43438j86416R8039a28459a9221A98495c50073A512J23097
12875A24609J45804m6050J04688C4327e7051A74219B4421Q8852J43102a98215
12864b4017m0949m1178A61445c74735A69041M0398c3177A14060D5842b38888i63
12852A79103j5296h8712k90335a88292D1018J28882n3757E3262a41792m8403a3845
12840A69433a3685A75075b92471H7967a10389A86172a53536C6254a72591B62210
$$ plain form
12829 193419 -12014 458266 -149910 -62239 -54821 375899 93055 -4953 54041 33129 247587
12818 247587 233881 -111018 4805 11167 54407 -154430 43250 367628 102632 -147404 -34648
12806 -20984 -142872 -221578 -256418 94067 222509 117739 286668 57681 -238070 105175
12795 -165032 -190931 -26378 -36893 -8833 123688 -171249 -24709 -326727 69320 -154693 136058
12783 -283587 -161545 81227 128649 -145831 133770 136440 -194309 219593 44507 -179787
12772 -167302 201316 -135444 99736 -13289 68682 176804 -329264 -155295 243849 957 -30194
12760 -11600 -54578 -139064 78623 -151792 68769 -210569 82677 315924 -181484 -166036 -192608
12749 -192608 -4943 95172 -20581 210196 -54669 94563 -213242 173572 -92940 -249743 260147
$$ packed form
12829A93419a2014D58266a49910f2239P418C75899I3055d953E4041k0912K14458
12818B47587j3706a11018D805O362M3240a54430D3250L24378A02632a47404c4648
12806b0984j21888p8706l4840I4067J28442j04770J68929E7681b38070A05175
12795a65032k5899b6378j0515h833A23688a71249b4709l02018F9320a54693A36058
12783b83587J22042H1227M7422a45831A33770K670a94309B19593D4507a79787
12772a67302B01316a35444I9736a3289F8682J08122c29264a55295B43849I57c0194
12760a1600m2978q4486G8623a51792F8769b10569H2677K33247a81484J5448k6572
12749a92608d943I5172b0581B10196e4669I4563b13242A73572i2940j56803B60147
$$ plain form
12737 -21099 -96493 68521 172494 100322 -158303 -109751 -104752 -4658 296629 -107733 -131234
12726 -131234 4720 -168426 -37170 -316595 -137222 35017 1929 -84559 96246 30453 63345
12715 63345 -145857 272957 48155 -51769 -373491 197828 200742 457135 582235 234622
12704 335649 188397 -81146 336112 -127164 73768 49231 196103 26446 309683 -141470
12693 -83101 68447 -91112 125317 -14506 -35164 -174872 9784 -8393 -241963 -43927 189890
12681 411009 5055 -48049 -32930 -43546 262614 -231543 78895 150478 125795 -309669 -455414
12670 -455414 -89886 162820 -199117 4877 225380 60876 -14171 96216 -34487 -96060 -30913
12658 309547 42945 -210835 84400 180369 -46935 -83595 178064 -157908 233066 39196 94793
$$ packed form
12737b1099p5394F8521J03973p2172a58303M8552M999d658B96629a07733k3501
12726a31234D720a68426c7170k79425a37222C5017A929h4559I6246C0453L2892
12715F3345a45857B72957D8155e1769l21722A97828K914K56393J25100B34622
12704C35649j47252h1146C36112a27164G3768k4537J46872B6446K83237a41470
12693h3101F8447i1112A25317a4506k0658j39708I784h393k33570d3927A89890
12681D11009E055d8049J5119j0616B62614b31543G8895P1583k4683c09669j45745
12670d55414h9886A62820a99117D877K20503F0876a4171I6216c4487o1573c0913
12658C09547D2945b10835H4400R5969d6935l6660A78064a57908B33066C9196N5597
$$ plain form
12647 94793 182148 175027 106190 -74943 -2084 -129169 -149266 -114256 -129926 868 44004 245322
12635 245322 -226308 72028 159485 137231 -75123 375631 175786 158568 -34229 45618 214534
12624 214534 -80018 61009 5180 225210 22418 160167 178868 -72253 -11420 271177 35230
12612 -95656 -287998 -286009 158844 -56872 -281379 -95975 132091 89619 -177881 -45668 22348
12600 22992 -24283 -60979 31844 67413 299050 -83687 -294477 17130 13365 -279667 -26413
12588 -145660 -61588 -74185 -200401 79875 60519 -294033 -228787 -122006 -40066 -54636 -59873
12577 -59873 174127 26195 133022 -84698 73575 -64350 -17459 -53210 -16124 -3519 141455
12565 -91631 -12733 115660 75827 -253124 231926 274081 -227751 -142828 102336 -52966 178532
$$ packed form
12647I4793Q7355p121o8837g4943b084j27085k0097L5010j5670H68M3136K01318
12635B45322b26308G2028Q7457k2254g5123C75631A75786j7218c4229D5618J68916
12624B14534h0018F1009E180K20030B2418J37749J8701g2253a1420B71177C5230
12612i5656j92342J989A58844e6872k24507i5975A32091m2472a77881d5668B2348
12600B2992b4283l6696C1844L5569K31637h3687k10790A7130l765b79667b6413
12588a45660f1588j2597j26216G9875j9356b94033O5246J06781d0066j4570n237
12577e9873A74127B6195J06827h4698G3575f4350a7459l5751a6124c519A41455
12565i1631a2733A15660l9833b53124B31926M2155b27751Q4923A02336e2966A78532
$$ plain form
12553 -643283 -39093 247226 184496 66031 -208405 77853 -131304 -53766 35006 -149310 -177928
12542 -177928 28426 111787 -136491 -284092 34678 -40340 -136882 213693 176327 -50795 133951
12530 -1614 -172301 -86740 -163097 118917 -322930 -67855 -121690 -63520 -26273 261430 -157620
12518 287191 2545 101678 71102 238834 53155 -82075 -119515 173413 60988 118813 -114777
12506 163292 179145 -12664 150532 204912 293747 -6532 246364 -134601 -183852 -145551 -81445
12495 -81445 -11434 -362993 72510 105088 94662 260011 87912 -136941 14716 -70830 53771
12483 499 -142565 146347 56582 -109064 -47721 -89374 -109627 -208936 291933 -321268 -30402
12471 41568 26322 -163507 -21648 -204847 198181 -177439 163442 -16340 367286 210999
$$ packed form
12553f43283c9093B47226o2730F6031b08405G7853a31304e3766C5006a49310k8618
12542a77928B8426Q3361a36491j47601C4678d0340r6542B13693l7366e0795A33951
12530a614j70687Q5561p6357A18917c22930f7855n3835N8170b6273B61430a57620
12518B87191B545R9133l0576J67732E3155h2075l7440A73413F0988N7825a14777
12506A63292J5853a2664A50532N4380Q8835f532B46364a34601m9251L8301O4106
12495h1445a1434l51559G2510L2578j0426J65349H7912a36941A4716g0830E3771
12483D99a42565A46347E6582a09064d7721m1653k0253r9309B91933c21268c0402
12471D1568j5246a63507b1648j83199A98181a77439A63442a6340C67286j56287
$$ plain form
12461 210999 -34804 -223738 -23932 -128803 -65636 52100 34253 -209125 -219588 -121283 221783
12449 -59264 82232 -227658 -381672 -377092 111816 -87029 -84988 240260 60709 -55324 71998
12437 213924 -47902 97869 -282852 -146272 -222401 -257418 -158204 -222016 -137880 32841 -72765
12425 -376198 -81082 -130320 199918 314297 286605 -6398 -174353 -172832 502842 -245783 -241355
12414 -241355 84560 88613 -191179 -97850 -228879 277042 -239972 14696 110826 -25457 -302957
12403 -302957 249105 -123823 -148712 127338 21866 -115844 542871 -251137 9064 -42863
12392 -99724 210908 254974 -52552 47927 265514 -93963 77454 -123341 110394 -159858 66202
12380 149059 269036 170711 -81055 243642 112170 -253948 8226 -76061 117360 106649 -67463
$$ packed form
12461B10999c4804j88934b3932j04871O3167E2100j7847b09125j0463R8305B21783
12449e9264H2232b27658j54014M580A11816h7029K041B40260F0709e5324G1998
12437B13924d7902I7869b82852J36580p6129l5017R9214o3812Q4136C2841g2765
12425c76198h1082m9238A99918J14379k7692f398j67955J521E02842b45783M428
12414b41355H4560M053a91179R3329j31029B77042b39972A4696R6130b5457k77500
12403c02957B49105a23823k4889A27338B1866a15844E42871b51137I064d2863
12392i9724B10908M4066e2552D7927K17587i3963G7454a23341A10394a59858F6202
12380A49059J19977r8325h1055B43642A12170b53948H226g6061A17360j0711f7463
$$ plain form
12368 171256 -7278 -170342 -317724 86789 -271212 -23351 108666 6540 152001 300896 230125
12357 230125 -167861 -145638 151783 -76315 -1152 288085 -104036 -82020 -12759 71555 21492
12345 160774 56863 461441 -133811 142150 16784 -84588 238406 237486 -40219 124702 -230114
12333 -91030 63044 -134759 150516 -55823 157513 51427 283036 -232088 -155230 61083 18934
12321 -6510 36439 192816 -109475 52184 241835 -204931 270062 221199 315530 2643 -30127
12309 -19627 673369 16808 -165950 353597 208733 320746 -189622 -18787 396776 52635
12298 92355 443497 126132 247674 97117 194352 217248 175931 187713 54109 173752 -74995
12286 207964 348535 60207 283582 -133255 227418 70192 98048 -150546 -145122 132596
$$ packed form
12368A71256g278j63064j47382H6789b71212b3351A08666F540J45461J48895p0771
12357B30125a67861K2223A51783g6315a152B88085a04036K2016a2759G1555B1492
12345A60774E6863M04578a33811A42150A6784h4588B38406r20d0219A24702b30114
12333i1030F3044a34759A50516e5823A57513E1427K31609b32088P6858F1083A8934
12321f510C6439J56377a09475E2184J89651b04931B70062m8863R4331B643c0127
12309a9627F73369A6808a65950C53597j44864J12013a89622a8787C96776E2635
12298I2355L51142A26132J21542I7117R7235K2896m1317J1782E4109J19643g4995
12286B07964J40571F0207K23375a33255B27418G0192K7856a50546N424A32596
$$ plain form
12275 -387037 105905 57835 -9403 230421 306424 -133028 51214 -105374 -105935 248508 395614
12264 395614 90428 51078 188846 160070 44721 62692 164596 391411 186455 428825
12254 428825 -210161 -95331 22847 74718 130629 -224792 76490 54307 374105 66962 251671
12243 251671 -87873 126988 121888 177646 -230029 105101 609043 -120675 290687 18839
12232 142295 275765 20089 329582 179671 97584 259696 17709 225607 183151 86156
12221 -80312 292946 262498 152602 134513 140212 -12342 121246 458165 58793 -44235 220503
12209 -27972 275259 133753 185208 -32430 -32985 430278 -74927 -127836 220562 152250 271078
12198 271078 341276 203593 282976 152560 -279553 472051 174296 3358 152591 139755
$$ packed form
12275c87037A05905m8070i403B30421P6003a33028E1214a05374n61B48508J47106
12264C95614I0428l9350J37768k8776D4721J7971J01904K26815A86455K42370
12254D28825b10161i5331B2847N1871N5911b24792G6490k2183L19798F6962J84709
12243B51671h7873A26988n100N5758b30029A05101N03942a20675B90687A8839
12232A42295J33470B0089L09493j49911q2087J62112A7709K07898m2456H6156
12221h0312B92946l0448j09896j8089N699a2342A21246L36919E8793d4235B20503
12209b7972B75259A33753N1455c2430n55D30278g4927n2909B20562o8312J18828
12198B71078P0198j37683P9383j30416b79553D72051A74296C358J49233j2836
$$ plain form
12188 139755 467741 444015 340536 323009 125372 101342 155933 119147 120295 564548 -32123
12176 91310 110371 181494 12627 403610 188112 67675 -93291 64224 156205 61774 190806
12165 190806 436475 552644 202076 392751 -237386 315455 526737 -80276 70621 100030
12155 100030 420269 14976 -55463 -118088 281682 -84716 75783 60985 -50977 -59204 -245778
12144 -245778 257590 -99532 33980 455589 81776 6613 341135 293642 30550 21165 329513
12133 329513 82537 194691 -86970 56129 110853 77113 76969 209560 219010 -77469 407187
12121 425505 256162 208174 -23596 2298 -23853 60252 80167 -46353 421782 21505 139670
12110 139670 -2869 532112 404049 111029 267310 24126 151966 7357 37377 556378 229934
$$ packed form
12188A39755L27986k3726j03479j7527A25372k4030N4591l6786J148M44253c2123
12176I1310J9061P1123A2627L90983A88112F7675i3291F4224R1981F1774J29032
12165A90806K45669J16169B02076J90675b37386C15455K11282h0276G0621K9409
12155A00030L20239A4976e5463o2625B81682h4716G5783j4798e0977q227j86574
12144b45778B57590i9532C3980M21609H1776F613L34522m7493C0550r385L08348
12133C29513H2537J12154h6970E6129N4724l3740j44J32591R450g7469D07187
12121D25505j69343m7988b3596B298b3853F0252J9915d6353D21782B1505J18165
12110A39670b869E32112j28063A11029J56281B4126J27840G357L0020N19001B29934
$$ plain form
12098 140789 331937 201967 295389 -15136 375583 -180645 189441 14265 471091 8780
12087 20506 81497 382749 317264 49945 -61773 -247282 -121689 138505 223906 -195233 179299
12075 134219 25485 -7932 13498 253204 271099 63540 173717 32086 94736 -111628 55651
12063 -206282 334546 5600 96928 157561 340242 251546 -80001 -154996 139780 -315628 49462
12051 357085 361356 -85427 15671 214615 133356 53728 116892 59373 498018 178881 28834
12039 -73085 -228899 -35181 -163551 56937 352792 155040 26360 6626 -126089 -157848 -201270
12028 -201270 40364 112169 292141 -151671 -95293 213370 -224552 -74124 75745 293784
12018 293784 -30276 327645 95874 68091 -19071 329738 87108 -203247 71761 -4514 229373
$$ packed form
12098A40789J91148j29970R3422a5136C75583a80645A89441A4265M56826H780
12087B0506O0991L01252o5485D9945f1773j85509a21689A38505Q5401a95233A79299
12075A34219B5485g932A3498K39706J7895F3540J10177C2086O2650a11628E5651
12063b06282C34546E600R1328O0633J82681q8696h0001p4995A39780c15628D9462
12051C57085M271h5427A5671J98944q1259E3728O3164n7519M38645A78881B8834
12039g3085j55814c5181j28370E6937K95855A55040B6360F626a26089l1759m3422
12028b01270D0364P1805J79972a51671N6378B13370b24552g4124G5745K18039
12018B93784c0276C27645I5874k7783a9071C29738H7108b03247G1761d514B29373
$$ plain form
12006 -338759 252033 340788 25025 -115465 -413615 136544 -347228 279339 5243 152288
11996 152288 -116466 -189269 -115211 -203650 5121 -350543 30550 -88206 -254285 126047 -24035
11984 -109345 -251332 -91866 187775 320514 39259 105268 -18811 319875 -292753 22668
11973 156171 -198403 306618 51258 215 -58436 -151463 -47681 -277251 51797 -220670 -36339
11961 -266497 185659 -322741 131029 185751 185786 180164 -63108 -138179 -130212 -303439 17492 -113123
11948 41027 109773 201999 -37126 -16993 -47957 -116689 99993 94285 46644 158299 -183094
11936 -342580 -217345 -117129 60954 41922 128490 -212990 23350 -251506 -200083 -114949 -177130
11925 -177130 233005 281222 -12702 36982 119883 -181509 -102956 186591 -137757 -82411 -30675
$$ packed form
12006c38759B52033Q8755B5025a15465k98150A36544c47228B79339E243J47045
11996A52288a16466p2803P4058q8439E121c50543C0550h8206j66079A26047b4035
11984a09345j41987i1866A87775J32739C9259O6009a8811C19875b92753B2668
11973A56171a98403C06618E1258B15e8436r3027d7681k29570E1797b20670c6339
11961b66497A85659c22741A31029N4722L5n622f3108p5071P967j73227A7492a13123
11948D1027O8746R2226c7126a6993l0964o8732I9993n708D6644J11655a83094
11936c42580J25235J00216F0954j9032Q6568b12990B3350b51506N1423Q5134o2181
11925a77130B33005M8217a2702C6982Q2901a81509P8553A86591a37757N5346c0675
$$ plain form
11913 3711 47809 -195930 16463 -174201 -267099 203987 -37920 -33229 -173533 -158655 -72942
11901 -32519 -168338 -94753 -399799 -32388 -29467 -224541 35605 34375 -156873 48328 -332606
11889 29137 -66253 -386356 72551 -276420 -160765 -197607 124185 -88090 -199718 77154 -161629
11877 13916 22341 270252 -195894 -206583 295105 -182409 -173837 47112 -132687 -245571 60171
11865 96933 -57517 -114190 -249488 -122831 23162 -199273 192841 -252201 19043 286408
11855 286408 -30446 -19243 -283724 -243683 -294816 -289481 268396 -49774 369658 160720 -43907
11843 220218 19777 322736 -104432 -109456 7398 95963 -85459 -216474 -37365 -66564 158642
11831 -39838 -163964 -28408 226 124844 -36478 -133779 -90690 -211974 -78925 -394734 -126094
$$ packed form
11913C711M4098a95930A6463a74201r2898B03987c7920M691j40304J4878g2942
11901c2519j35819P3585l05046c2388K921j95074C5605j230a56873D8328c32606
11889B9137f6253l20103G2551b76420J15655l6842A24185h8090j11628G7154a61629
11877A3916Q425K47911a95894j0689B95105a82409Q572D7112a32687j12884F0171
11865I6933e7517n6673j35298a22831B3162a99273A92841b52201A9043K67365
11855B86408c0446J1203k64481M0041n1133N335B68396d9774C69658A60720d3907
11843B20218A9777L02959a04432n024G398Q8565h5459j31015c7365k9199A58642
11831c9838j24126b8408B26J24618c6478r7301M3089j21284g8925l15809a26094
$$ plain form
11819 -18453 -93771 236942 130148 -17500 -75523 -106152 -231842 183433 217840 120293 368871
11808 368871 -89040 -44269 -278849 18960 46058 -97671 110412 174787 261415 -106647 -187980
11797 -187980 -268845 -46726 99199 -104539 -76564 96514 115140 267 84637 -190007 -13453
11785 210078 44218 164431 -23533 -116262 255047 -34270 135771 -83608 -269365 222218
11774 154889 -106192 -77395 -127159 279065 126758 -248556 -163748 -151157 222266 138213
11764 138213 -31829 8797 -194105 55982 -84956 -30377 131040 -162719 58075 -249489 -73657
11752 -27003 25343 -49503 -24199 -56031 -148911 -398313 -108739 54220 -185215 241035 118471
11740 136681 -176799 -11473 -46165 49315 -208895 -233918 -134725 373735 -116807 -103257 260488
$$ packed form
11819a8453p5318B36942j06794a7500n8023l0629j25690A83433L4407r7547K48578
11808C68871h9040d4269k34580A8960K7098i7671A10412O4375Q6628a06647q1333
11797a87980q0865d6726I9199a04539K7975I6514J8626B67Q4370a90007a3453
11785B10078D4218J20213b3533r2729B55047c4270A35771h3608j85757B22218
11774A54889a06192K8797m9764B79065A26758b48556Q4808J2591B22266q4053
11764A38213c1829H797a94105E5982h4956c0377A31040a62719E8075b49489g3657
11752b7003B5343d9503b4199l1832r2880k49402a08739E4220a85215B41035A18471
11740A36681a76799a1473l4692D9315b08895k5023R9193C73735a16807J3550B60488
$$ plain form
11728 -178333 33979 -130753 246930 21281 226386 -1931 13834 -233887 -75858 478254 -97124
11716 79344 132272 10031 320217 88233 261364 -357528 106666 156934 258664 295826 110877
11704 -25088 28067 106657 307700 259417 -116606 -90348 323565 -122982 -58461 -132127 -24039
11692 13129 -37873 40042 -353138 -82285 6675 301016 223612 164549 249070 -526540 261325
11680 97333 270846 98444 -118927 -191594 240015 -263414 239151 63562 52233 237414
11670 237414 -244217 209736 -86727 94849 -192035 -187444 104382 152277 327855 -177175
11659 -58442 90480 184792 311137 -52997 110465 -330583 48496 -78132 5617 95887 239 -94982
11646 -85916 -328108 257771 304957 195223 204603 -144893 -14270 -70794 246163 39591 -314272
$$ packed form
11728a78333C3979a30753B46930B1281K05105a931A3834b33887g5858D78254i7124
11716G9344N2928A0031L10186H8233J73131c57528A06666N0268J01730L7162A10877
11704b5088B8067P8590K01043m8283a16606K6258C23565a22982e8461p3666b4039
11692A3129c7873D0042c53138h2285F675K94341p7404n9063Q4521e26540B61325
11680I7333J73513I8444a18927p2667B40015b63414B39151F3562j1329J85181
11670B37414b44217B09736h6727I4849a92035M591A04382M7895J75578a77175
11659e8442I0480R4312J26345e2997A10465c30583D8496g8132E617R0270B39i4982
11646h5916k42192B57771M7186j09734R380a44893a4270n6524B46163C9591c14272
$$ plain form
11634 84065 111349 -88097 -137994 -112572 -95245 33544 30281 5548 -160899 -48949 242342 -76531
11621 305539 160080 119023 -73473 140574 123323 144315 13692 -105599 194903 -17161 143125
11609 110312 342940 -62854 -204889 59679 14933 -98096 83046 26888 -10672 83575 -54614
11597 153427 -65112 120769 -218110 -168881 -52843 49120 147576 360442 -70640 115941 -116684
11585 191228 301286 171308 291235 172072 55831 -251024 342238 -31016 465199 172023
11574 -70714 -314800 296506 -157301 135660 131423 -156258 289342 240995 281739 62532 -116413
11562 65509 220912 101674 -880 261441 160753 75916 194538 31629 10809 176028 -240518
11550 -181450 175442 -201924 -92418 -184103 169985 105361 68479 118833 95054 71838 -102820
$$ packed form
11634H4065K7284h8097m9897K5422J7327C3544l263E548a60899d8949B42342g6531
11621C05539j45459m1057g3473A40574j7251K0992A3692a05599A94903a7161A43125
11609A10312K32628f2854j42035E9679A4933i8096H3046B6888a0672H3575e4614
11597A53427f5112A20769b18110M9229e2843D9120R8456K12866g0640A15941a16684
11585A91228J10058j29978J19927j19163E5831b51024C42238c1016D65199A72023
11574g0714k44086B96506a57301A35660m237a56258B89342m8347M0744F2532a16413
11562F5509J55403A01674h80B61441j00688G5916J18622C1629A0809J65219b40518
11550a81450A75442b01924i2418r1685A69985o4624l6882N0354k3779k3216a02820
$$ plain form
11538 -110940 -176854 240809 71369 39523 -65662 45665 93497 -50075 423103 -98036 -2698
11526 13888 -121279 25814 231338 -26468 270492 -153729 -181993 106778 14569 -152792
11515 133482 261359 -124224 62508 38304 -10411 -94635 78497 -86622 168784 65102 -146164
11503 -39771 256958 7246 57086 208145 -28866 248003 189962 -179224 115029 34750 -28931
11491 -44941 134358 -9373 155393 198668 -31432 104062 138259 -108202 237230 -65688 226478
11479 83501 45106 -121835 263902 339485 108819 309717 41895 131090 143355 -210105 275065
11467 -90814 -105418 377463 11361 -159460 346013 152298 325154 199584 -122197 94508
11456 15281 -8754 116164 80227 -145495 393779 97245 117717 92924 29542 59669 308039
$$ packed form
11538a10940o5914B40809G1369l1846f5662D5665M7832e0075D23103i8036b698
11526A3888a21279B5814K05524b6468B70492a53729k8264A06778A4569a52792
11515A33482J27877a24224F2508k4204a0411q4224G8497h6622A68784F5102a46164
11503c9771B56958G246M9840J51059b8866B48003n8041a79224A15029C4750b8931
11491d4941A34358i373A55393M3275c1432A04062L4197a08202B37230f5688B26478
11479H3501l8395a21835B63902P5583A08819K00898D1895Q9195J2265b10105B75065
11467i0814j4604C77463A1361a59460C46013A52298J72856j25570a22197I4508
11456A5281h754A16164l5937a45495C93779I7245K0472k4793B9542L0127K48370
$$ plain form
11445 308039 -131087 -13491 289560 368411 -235449 249817 -231115 297791 163919 22843
11434 -279236 106882 -7147 -117978 344456 -49396 180686 209014 -39514 226301 -21973 -118166
11423 -118166 -74656 285087 100736 -53242 -34560 -301659 -192150 107804 -222576 340262
11412 77743 -44114 -170794 -227262 -217056 222217 -25691 -121079 -145192 130413 22274 285221
11401 285221 168494 -144490 380866 -13421 43619 355343 -90449 80571 -14096 -257058
11391 -257058 222867 -256900 244288 -21348 38526 367624 100849 -118055 76209 -106053
11380 -69957 -167589 -31381 22332 -167020 -270564 -92491 -10721 12455 -50971 113065 108658
11369 108658 315528 97411 353788 154944 -302043 -19196 -17407 177174 -46300 -143501 -24549
$$ packed form
11445C08039a31087a3491B89560P8851b35449B49817b31115B97791j33872B2843
11434b79236A06882g147j10831C44456d9396A80686K8328c9514B26301b1973r6193
11423a18166M3510B85087A00736e3242J8682k67099J09509A07804b22576C40262
11412G7743d4114j26680n6468J0206B22217b5691r5388k4113A30413B2274K62947
11401B85221j16727a44490C80866a3421D3619L11724i0449H0571a4096k42962
11391b57058B22867b56900B44288b1348C8526L29098A00849a18055G6209a06053
11380f9957r7632c1381B2332a67020j03544i2491a0721A2455e0971A13065m407
11369A08658K06870I7411K56377A54944c02043a9196J789A77174d6300r7201b4549
$$ plain form
11357 -118081 -110893 365950 -331535 -146035 128472 -114496 -93693 -384541 -17905 -76320
11347 -76320 183016 -106969 15376 53115 -276019 119244 33092 -35636 -54229 43908 57639
11336 57639 85036 6548 -108649 100911 -197601 -25702 350861 -194688 -114184 -3924 32329
11324 -268930 -103686 -349718 -16046 277381 -87291 22301 138114 97289 -191847 -32519
11313 126349 37582 16344 92376 -76480 8939 -10648 259321 -421100 166400 19790 148731
11302 148731 -144706 -11092 -41558 -118087 -59460 -181112 -382799 158698 -125454 176933
11291 38430 57099 -230330 -189141 -55928 -40335 -214328 -259960 -135788 284239 -40855 -115206
11280 -115206 -86420 -223256 -280243 167278 -146195 -81802 6896 10043 54623 -446396 -180509
$$ packed form
11357a18081P188C65950c31535a46035A28472a14496K0803k90848a7905n8415
11347g6320A83016a06969A5376L7739b76019A19244C3092c5636j8593D3908J3731
11336E7639K7397F548a08649A00911a97601b5702C50861a94688Q0504c924C2329
11324b68930a03686k46032a6046B77381h7291B2301J15813m0825a91847c2519
11313A26349C7582A6344P6032g6480H939a0648B59321d21100A66400A9790J28941
11302A48731a44706a1092l0466p6529N8627j21652k01687A58698a25454A76933
11291C8430J8669b30330M1189e5928J5593j73993m5632J24172B84239d0855p4351
11280a15206K8786j36836n6987A67278a46195O4393F896L147M4580d46396a80509
$$ plain form
11268 -360281 -324460 -87043 -54194 28336 122464 53270 162517 382219 -61574 89293 -87853
11256 -78213 -186504 -138513 -138460 -307424 28848 -65136 -65117 -4672 -36354 63294 -62798 178852
11243 -104131 165014 -140068 129934 10981 -113961 206285 36994 39471 25426 -117632
11232 -64623 157373 -42742 -48044 -128268 92587 -149891 957 -287065 -263671 -218427 -145406 220670
11219 36245 1644 101481 -126059 89607 -237069 -153282 9031 12363 -143529 -34428 -435088
11208 -435088 -51493 -191396 -272219 6740 34849 -225181 82275 27210 -110538 -305272 -246993
11197 -246993 -154573 162703 -160063 -348390 33560 -247062 -54422 -292305 356912 -18417
11186 176363 -28733 72318 -421032 -287599 108523 3038 -91415 -184001 254254 52822 -18337
$$ packed form
11268c60281L5821h7043L2849B8336R4128E3270J09247K19702f1574H9293h7853
11256g8213j08291M7991N3j68964B8848f5136J9d672l1682F3294f2798A78852
11243a04131A65014a40068A29934A0981a13961B06285C6994K477j4045a17632
11232f4623A57373d2742n302q0224I2587a49891I57b87065K3394M5244P3021B20670
11219C6245A644R9837a26059H9607b37069Q3787I031L332a43529c4428m00660
11208d35088e1493j39903q0823F740K8109b25181H2275B7210a10538j94734N8279
11197b46993R2420A62703a60063j88327C3560b47062e4422k37883C56912a8417
11186A76363b8733G2318d21032J33433A08523C038i1415r2586B54254E2822a8337
$$ plain form
11174 -447808 35084 -31476 35622 -280416 -191449 84963 172948 -192683 152780 -196131 47567
11162 71786 43454 -352500 22778 120747 -327384 -54265 -131798 -76865 -151987 -380954 -3403
11150 99454 55385 227221 -65004 -49741 314973 -212949 -120767 -230723 -6770 284651 413790
11139 413790 35639 -159449 54377 106421 58190 -138880 187754 209945 -155341 206759
11128 57990 -259005 164817 -238532 156066 40322 -248750 261110 -40424 164138 73614
11117 59892 197231 -47405 490329 -215366 169318 -4448 -310363 -370899 253329 -111252
11106 761224 172240 294591 184688 -20085 272336 102126 249216 237096 -58417 308657
11095 38261 94248 -204767 -15567 155166 -10765 -82592 175235 368434 223890 443993
$$ packed form
11174d47808C5084c1476C5622b80416Q8967H4963Q7985a92683A52780a96131D7567
11162G1786k8332c52500B2778R7969c27384e4265p7533N4933p5122k28967c403
11150I9454m4069J71836f5004J5263C14973b12949R2182j09956f770B84651J29139
11139D13790C5639a59449E4377N2044m8231a38880A87754K2191a55341B06759
11128E7990b59005A64817b38532A56066D0322b48750B61110d0424A64138G3614
11117E9892J37339d7405D90329b15366A69318d448l05915o0536B53329a11252
11106G61224A72240J22351j09903b0085B72336A02126J47090j2120e8417C08657
11095C8261N5987b04767a5567A55166a0765p1827A75235J93199j44544K20103
$$ plain form
11085 443993 481161 -6585 481306 268415 115128 247547 337117 49147 218310 271476 -11359
11073 272215 318927 392413 -37348 151558 91387 247535 156866 -59953 248541 408747 640279
11062 640279 527333 307895 249672 742374 400440 520658 406451 619412 352181 531028
11052 531028 458768 787841 720514 426249 949536 923459 807816 550027 423464 848972
11042 848972 825637 800058 639371 921103 450800 686407 550970 590760 654060 968779
11032 968779 707998 959475 867993 783840 600355 623527 853474 497140 1020782 424803
11021 1041201 801938 717442 681926 536366 600344 689707 665080 539726 728974 723843 709528
11010 709528 726476 424709 614401 577649 561331 339986 491565 990376 681241 803139
$$ packed form
11085D43993L7168f585D81306k12891A15128J32419Q9570D9147J69163N3166a1359
11073B72215M6712P3486c7348A51558o0171J56148r0669e9953B48541J60206K31532
11062F40279j12946k19438n8223M92702l41934J20218j14207K12961k67231J78847
11052E31028p2260L29073o7327k94265N23287k6077j15643k57789j26563M25508
11042H48972k3335k5579j60687K81732D50800K35607j35437L9790O3300L14719
11032I68779k60781K51477r1482q4153j83485K3172K29947l56334N23642D24803
11021A041201k39263q4496l5516j45560O3978Q9363k4627j25354J89248n131j4315
11010G09528J6948l01767J89692l6752j6318k21345J51579M98811l09135J21898
$$ plain form
11000 803139 477649 724072 693105 421410 501078 950376 1028025 787298 635981 847494
10990 847494 368526 958626 608738 464272 698177 683970 872285 789424 690223 1112913
10980 1112913 1274531 1155262 959103 1013557 1086445 771791 1412727 1407159 1694134 1764599
10970 1764599 1799903 2459630 2661571 2514316 2849338 2602214 2391424 2268510 2312401 2357578
10960 2357578 2120817 1666386 1756801 1427775 1547173 1956736 1703477 1435328 1726343 1992435
10950 1992435 1888934 1898456 1651033 1495578 1018845 859705 865694 658096 646647 684716
10940 684716 269930 667298 291607 314586 -4297 151304 222368 114708 170387 -132129
10929 377534 203946 -1735 70570 220695 -123623 288964 63026 -152720 72366 -232555
$$ packed form
11000H03139l25490K46423l0967k71695P9668M49298P7649k40727j51317K11513
10990H47494C68526N90100l49888j44466K33905j4207J88315q2861r9201M22690
10980A112913J61618j19269j96159N4454P2888l14654O40936n568K86975P0465
10970A764599L5304O59727K01941j47255L35022k47124k10790j22914M3891M5177
10960B357578k36761m54431R0415l29026J19398M09563k53259k68149K91015K66092
10950A992435j03501R522k47423j55455m76733j59140N989k07598j1449L8069
10940F84716B69930L97368B91607K2979d297A51304P1064j07660N5679a32129
10929C77534j73588a735G0570J50125a23623B88964F3026a52720G2366b32555
$$ plain form
10918 -132230 -188942 63624 -276330 -194003 24914 63069 -130890 146631 75281 44938 90176
10907 90176 -51535 67053 -155237 69903 -115496 26418 -83580 -21840 97562 242670 -73337
10895 -4509 -161247 -124627 -45731 91741 70073 151624 -20515 137863 280328 -203624 195939
10883 -235851 87220 14192 -26838 -180768 -76846 -139074 239133 -132202 20240 -40885 -96455
10872 -96455 -355811 112693 -152277 -18487 197705 -306874 -61078 -199670 -196074 11754 -283308
10860 -138604 20407 -183982 -99703 -28017 -19194 85202 -158240 71977 95094 -192819 125019
10848 18937 203331 156219 -40419 135201 -76983 -117292 19650 -264748 -61163 -102149 -143313
10837 -143313 134772 143798 -104109 242702 972 148316 1017 41775 -71085 -294551 -43721
$$ packed form
10918a32230n6712F3624b76330Q2327B4914L8155a30890A46631p1350l0343M5238
10907I0176e1535F7053a55237F9903a15496B6418h3580b1840I7562J45108g3337
10895d509j56738L6620d5731I1741k1668Q1551b0515A37863J42465b03624A95939
10883b35851H7220A4192b6838j53930g6846o2228B39133a32202B0240d0885n5570
10872i6455k59356A12693a52277a8487A97705c06874f1078j38592L596A1754b83308
10860a38604B0407a83982Q4279b8017Q823H5202a58240G1977K3117a92819A25019
10848A8937J84394m7112d0419A35201g6983m0309A9650b64748f1163m0986m1164
10837a43313A34772R026a04109B42702I72J47344A017M0758g1085k23466d3721
$$ plain form
10825 -138359 -124846 -66901 -102563 -169423 -283232 -51585 -33354 136673 143803 95094 -145433
10813 122213 179809 -264927 267514 94611 194071 -84006 282812 -34756 139150 -1560 -119771
10802 -119771 29768 62480 9646 42788 -165526 64411 -23346 -133422 -105144 -205360 -54892
10790 93820 79671 70213 -273972 -236878 -137284 22888 21678 -57218 12214 -263179 -100583
10778 397838 -270681 -322872 -70349 -414470 -273569 61712 -98678 -67106 -12028 -232891 -68639
10766 -34802 -200829 251748 224457 129186 -29880 -129268 -115342 -40938 -314544 -70223 -120507
10755 -120507 40302 -142565 -182002 -108258 -190801 -209910 -289280 -236077 -275581 131020 -134324
10743 238343 -109729 -55697 -96778 -207535 32565 -88158 -140817 -200661 -48884 -119380 -99302
$$ packed form
10825a38359J3513N7945l5662o6860j13809e1585J8231A36673P130m8709a45433
10813A22213N7596b64927B67514I4611R9460h4006B82812c4756A39150a560j18211
10802a19771B9768L2712I646L3142a65526F4411b3346j10076K8278j00216e4892
10790I3820j4149r458b73972L7094R9594B2888j210e7218A2214b63179a00583
10778C97838b70681n2191g0349l44121J40901F1712i8678L1572a2028k20863f8639
10766c4802j66027B51748k7291r5271b9880r9388J3926d0938k73606g0223n0284
10755a20507D0302a42565l9437P3744q2543j9109p9370N3203l9504A31020a34324
10743B38343a09729N4032m1081j10757C2565h8158n2659n9844d8884p0496K0078
$$ plain form
10732 -99302 -95071 28022 -65536 121831 -140350 91161 60360 137864 -252487 -555678 125904
10720 -7760 110647 -133856 -170759 64841 -241240 -234763 -239210 -177254 -14120 -421917 -131976
10708 -94234 301065 -288533 -411751 -24746 -275914 -185962 -71782 -434620 278289 224529
10698 224529 -380677 -113062 -88476 -120037 -30238 -54331 -151350 222723 -49902 -161823 -65
10686 -91192 72185 -119400 -85190 71953 27627 -23253 13737 12893 94220 79942 -94067 -19808
10673 -8576 -8642 75747 -401769 166923 129531 -317701 -61806 77924 -436275 141409 -191181
10661 153484 78947 -159206 -28354 -140477 -167313 164408 -183553 96940 296297 -88129
10650 183748 -207317 -124163 -343910 -216633 -5390 352116 -196899 -364173 -77085 -606686
$$ packed form
10732i9302M231B8022f5536A21831a40350I1161l0801P7504b52487l03191A25904
10720g760A10647a33856l6903F4841b41240O477m447O1956a4120m07797a31976
10708i4234C01065b88533j23218b4746k51168Q9952g1782l62838B78289n3760
10698B24529c80677a13062K4586l1561c0238k4093r7019B22723d9902j11921f5
10686i1192G2185a19400L4210G1953B7627b3253A3737q44Q1327j4278i4067a9808
10673h576o6G5747d01769A66923l7392c17701f1806G7924d36275A41409a91181
10661A53484p4537a59206b8354j12123k6836A64408a83553I6940J99357h8129
10650A83748b07317Q3154k19747J27277e390C52116a96899j67274g7085n29601
$$ plain form
10640 -606686 -120587 -206551 18530 -17067 -136042 -212796 -52617 -54152 21086 2789 -110696
10628 -87487 74219 109976 209038 72978 -5861 -96469 -413855 -253098 -41875 27149 -128192
10616 -347384 84728 -48001 -288523 76940 62603 169934 -19685 -68923 14652 232609 -15734
10604 78924 20532 6615 -102309 -307525 69746 181718 229773 -213592 -410546 -166922 -94747
10593 -94747 237443 -160958 -180438 -111440 4794 126040 -44132 -75216 -175498 -93958 -162797
10582 -162797 -66911 42229 46395 25755 -275868 -168505 -121671 82073 -440219 160785 -66526
10570 -151035 137152 -352661 372067 136251 -42668 -137300 135089 18422 238045 -185079
10559 177090 -135686 9000 -174850 -82934 -113555 39675 -110125 47752 -180433 -48629 74182
$$ packed form
10640f06686a20587q5964A8530a7067j18975p6754e2617j535B1086B789a10696
10628h7487G4219L5757R9062G2978e861r0608l17386J60757d1875B7149a28192
10616c47384H4728d8001k40522G6940j4337J07331a9685m9238A4652K17957a5734
10604G8924B0532F615a02309k05216F9746J11972M8055b13592j96954a66922P2175
10593i4747B37443a60958j9480O8998D794J21246d4132l1084j00282Q1540o8839
10582a62797f6911D2229M166k0640b75868J07363M6834H2073d40219A60785f6526
10570a51035A37152c52661C72067A36251d2668r4632A35089A8422K19623a85079
10559A77090a35686I000a74850h2934l0621C9675a10125D7752a80433d8629G4182
$$ plain form
10547 -123589 -153226 -32399 148436 162579 -15680 -8869 180262 -87556 -52697 -2516 53524
10535 -29721 61657 203785 60482 -34657 255048 16904 -5856 -331760 -258205 -127492 82233
10523 -162511 -114759 -373248 -20337 -203751 58405 -83138 -269586 -109879 372185 -292239
10512 -161183 -45754 81981 211694 -60710 5253 -266016 58793 -173664 -107936 -204829 -182517
10501 -182517 32497 155513 -249532 -27647 59923 -375150 -64849 384380 64937 -45563 261788
10489 -80005 -215748 -278428 90952 -475711 -190633 -305816 -127327 26057 99099 57079 -13783
10477 300870 118883 114089 564504 400086 851468 596838 590487 99316 -111919 430564
10466 -41498 -221337 112342 258594 -316664 -10133 35018 16818 61667 -79873 -250337 102159
$$ packed form
10547a23589k9637c2399A48436J4143a5680O811A80262h7556L4859b516E3524
10535b9721F1657J42128F0482c4657B55048A6904e856l25904P3555a27492H2233
10523a62511M7752k58489b0337j83414E8405h3138j86448a09879C72185b92239
10512a61183d5754H1981J29713f0710E253b66016E8793a73664O5728r6893K2312
10501a82517C2497J23016b49532b7647E9923c75150f4849C84380F4937d5563B61788
10489h0005j35743o2680I0952d75711a90633j15183a27327B6057P3042m2020a3783
10477C00870A18883m794M50415j64418M51382k54630o351I9316a11919D30564
10466d1498j79839A12342J46252c16664a0133C5018A6818M4849g9873j70464A02159
$$ plain form
10454 16229 -281378 -188641 51428 147806 -117205 -321464 -66977 -52660 -44645 -212621 -313037
10443 -313037 226197 -109414 66761 -7909 23687 -75804 -55299 -292244 37738 -20643 37424
10431 28066 -347418 215205 40192 -504715 71355 2549 -16587 -181872 -97936 240196 61445
10419 35174 44637 -145346 -8401 -14059 235366 40382 -273937 218129 -7863 80554 -486598
10407 -23951 25823 172990 250746 -111253 -291638 -196607 164377 237676 -212979 -3545 1990
10395 -69762 55004 -187176 11926 270616 86798 271970 61362 177532 117481 12045 203085
10384 203085 -34476 263496 -253675 42735 -315534 29602 -40108 49279 129379 35443 -37035
10372 363379 56131 89576 7300 355918 410886 239996 644280 323135 324743 418221 451433
$$ packed form
10454A6229b81378R2737E1428R6378a17205k04259f6977J4317Q015j67976j00416
10443c13037B26197a09414F6761g909B3687g5804K0505k36945C7738b0643C7424
10431B8066c47418B15205D0192e04715G1355B549a6587j65285Q3936B40196F1445
10419C5174R463a45346h401n658B35366D0382b73937B18129g863H0554d86598
10407b3951B5823J47167P7756a11253j80385R5031A64377P3299b12979c545A990
10395f9762E5004a87176A1926K58690H6798J85172F1362J16170o0051A2045J91040
10384B03085c4476B63496b53675D2735c15534B9602d0108D9279Q0100C5443c7035
10372C63379E6131L3445G300L48618N4968j70890M04284l21145J608R3478L3212
$$ plain form
10361 451433 354597 324769 563617 377837 498704 386030 531297 221417 -88322 309299
10350 -48963 322159 189477 440589 441559 597823 225600 260066 247376 220831 162516 493889
10339 493889 256873 349174 -137160 449395 51202 352488 -55320 20729 57630 476757
10329 476757 -14029 -93010 9936 -124403 150020 71904 -242248 179438 120573 581153 531283
10318 531283 349048 629430 187774 -72729 113774 38977 299637 -96180 -4391 295965
10307 -4053 -79523 -157832 199729 -11806 -77979 78730 218664 -65608 -169432 109303 34102
10295 -30773 127903 36176 20641 -146849 26394 -458470 34733 -164318 267909 -154427
10284 -84133 -277926 -298854 -231437 -203383 30546 210315 -243870 -198217 225362 -136331 -178022
$$ packed form
10361D51433r6836k9828K38848j85780J20867j12674J45267B21417h8322C09299
10350d8963C22159j32682K51112R70J56264B25600L4466j2690k6545n8315L31373
10339D93889k37016R2301a37160D49395E1202L01286e5320B0729L6901M19127
10329D76757a4029p8981I936a24403A50020G1904b42248A79438n8865M60580m9870
10318E31283j82235K80382A87774g2729A13774C8977K60660i6180d391B95965
10307d053p5470p8309A99729a1806o6173G8730J39934f5608j03824A09303C4102
10295c0773A27903C6176j5535a46849B6394d58470C4733a64318B67909a54427
10284h4133j93793k0928O7417K8054C0546J79769b43870M5653B25362a36331m1691
$$ plain form
10273 -178022 26350 -38257 143554 -126621 129144 -172184 -173486 209591 161576 112623 -515580
10261 198550 -363824 -264513 -233601 -144912 39003 67731 -295934 47313 -88209 -21311 22637
10249 306044 109224 88871 170232 209129 -217653 19268 107841 -86358 -84620 38970 108468
10238 108468 80119 131856 74411 -199852 193866 245907 -187188 -330213 -86435 -195523
10228 -195523 260122 -105344 3293 -332048 -28772 127673 -230596 -229731 -182577 85258 -178310
10216 -148207 -314132 -129953 -244033 -477149 190798 -79615 -235772 155324 78099 79591
10206 79591 1651 -158297 -81374 -344387 41317 -5228 -95872 90198 -29761 233224 -250694
10194 57535 -269789 50704 149677 74255 77852 -25012 -209645 113117 -145945 -69713 -93714
$$ packed form
10273a78022B6350c8257A43554a26621A29144a72184j302B09591m8015m8953e15580
10261A98550c63824R9311L0912Q8689C9003K8728b95934D7313h8209b1311B2637
10249C06044A09224k0353Q1361L8897b17653A9268Q8573h6358J738C8970O9498
10238A08468k8349N1737n7445a99852A93866N2041a87188j43025h6435j09088
10228a95523B60122a05344C293c32048b8772A27673b30596Q65M7154H5258a78310
10216a48207j65925a29953j14080k33116A90798g9615j56157A55324p7225J492
10206G9591A651a58297P6923k63013D1317e228r0644I0198b9761B33224b50694
10194E7535b69789E0704R8973G4255L597b5012j84633A13117a45945f9713k4001
$$ plain form
10183 -93714 108078 -187612 -375373 -86523 -73123 -48787 -114827 7701 -430044 124451 -37160
10171 176025 -168765 -134348 -232876 68961 -47808 -280469 56997 -46777 100645 -181423 163191
10159 -105251 -163811 17788 -268513 -149745 -138839 72881 73135 -45110 -232147 34133 -55214
10147 45528 -80878 -194241 -75609 -113702 -149921 -267411 -97173 198598 113532 -23238 -337454
10136 -337454 -58319 -68872 -251413 -255824 54824 -410299 -227004 -204623 -217723 -64960 222273
10124 59603 -60095 138100 -148537 21328 20401 -237101 -116430 388243 -110601 -148470 -13983
10112 -85906 -285252 -402607 -173344 -348181 -29362 127912 -33822 -328989 205388 106520
10102 106520 -35503 -22510 -169364 -142877 382612 -118278 -148394 -40109 58043 12279 191183
$$ packed form
10183i3714A08078a87612j87761h6523J3400K4336o6040G701d30044A24451c7160
10171A76025a68765L4417r8528F8961d7808k32661E6997d6777A00645a81423A63191
10159a05251n8560A7788b68513J18768J0906G2881K54d5110j87037C4133e5214
10147D5528h0878j13363g5609l8093l6219j17490i7173A98598q5066b3238l14216
10136c37454e8319j0553j82541m411E4824d10299J83295K2381j3100f4960B22273
10124E9603f0095A38100a48537B1328r27b37101a16430C88243a10601l7869a3983
10112h5906j99346j17355a73344j74837b9362A27912c3822k95167B05388r8868
10102A06520c5503J2993j46854K6487C82612a18278l0116d0109E8043A2279J78904
$$ plain form
10091 191183 -93135 -224628 -199841 -104958 -379948 -391021 -5276 23433 -513849 106108 -212594
10079 -167286 56837 54679 76179 44404 15317 -142067 -91047 -111361 144555 -107150 -197153
10068 -197153 147951 74889 -139211 -129625 -21806 -255874 -382308 50535 -123140 136462
10057 125245 -181835 5394 -232553 21069 213008 -300404 -423276 215562 34225 -325082
10046 -163223 52211 -75625 -601 -214700 147627 173085 -112491 97840 -94770 -167637 93440
10034 141838 -510927 -213440 -127404 195763 -11414 -270164 -128058 131813 66082 -98964
10023 -245242 -118908 -387519 301461 -19630 222257 -116652 19442 -67227 -3102 139240
10012 -12005 43155 -161361 79761 -133059 108458 -139540 -313270 44864 -68821 -205707
$$ packed form
10091A91183i3135j31493K4787R4883k74990j1073e276B3433e13849A06108b12594
10079a67286E6837k158K1500l1775A5317a42067N1020k0314A44555a07150r0003
10068a97153A47951p3062a39211R586b1806k34068j26434E0535a23140A36462
10057A25245a81835E394b32553B1069J91939c00404j22872B15562C4225c25082
10046a63223E2211g5625f01k14099A47627K5458a12491I7840i4770p2867I3440
10034A41838e10927b13440Q6036A95763a1414k58750a28058A31813o5731i8964
10023b45242a18908k68611C01461a9630B22257a16652A9442f7227c102A39240
10012a2005D3155a61361G9761a33059A08458a39540j73730D4864f8821j36886
$$ plain form
10002 -205707 345704 127788 -260383 -149706 -185085 -143445 -73044 275629 176852 -75208
9991 -406720 -48483 32777 -201283 70603 -165742 -95866 211217 -92938 -204584 -73732 -118768
9980 -118768 -123281 -106699 -36816 -366225 -21263 156769 -288826 -358039 -344790 -320567 103527
9968 -48601 192897 -31135 -122804 -57494 -125847 -158778 -584843 -61350 -284333 35793 -43590
9956 -156795 -2426 225887 -315317 -345524 -95600 192452 -147840 -5060 -56568 -27896 -186040
9945 -186040 -147000 -232227 -135760 143546 186213 -153390 -419664 368973 -262928 -104397
9934 153873 -312915 -27598 -169102 129360 85059 -89031 43643 -73700 -303298 323608 110460
9922 -74055 -316763 -179767 134086 13889 -130816 57170 -160539 -60494 -100675 -194352 17189
$$ packed form
10002b05707C45704A27788b60383J10677l5379M1640P0401B75629r8777g5208
9991d06720d8483C2777b01283G0603a65742O9876B11217i2938j11646g3732m5036
9980a18768m513J6582c6816l29409b1263A56769b88826o9213J3249K4223A03527
9968d8601A92897c1135r1669e7494o8353l2931m26065f1350k22983C5793d3590
9956a56795b426B25887c15317l0207i5600A92452a47840e060n1508b7896j58144
9945a86040L9040q5227R6467A43546M2667a53390k66274C68973b62928a04397
9934A53873c12915b7598j41504A29360m4301h9031D3643g3700k29598C23608A10460
9922g4055k42708J36996A34086A3889a30816E7170a60539f0494m0181r3677A7189
$$ plain form
9910 -105512 -215074 -161587 -207343 187479 -43120 217849 -46330 -103879 -9303 -45437 -43701
9899 -43701 -124891 -45756 -29964 111653 -45584 -12900 -213070 -145607 -381263 -210610 1885
9887 38446 -270048 -254436 -327787 137438 -18574 -259680 -26427 -7256 -52543 -85574 19413
9875 -333561 20058 -112168 24469 -188430 -252689 197135 -363975 -237922 -176567 65806 44238
9864 44238 -255441 -423813 14731 -64437 59727 -255358 -126325 -4556 81373 17061 -361957
9852 -114844 85751 -73106 -106508 167384 9036 36028 -75642 -427171 -40155 66324 -192656
9840 97667 -245861 -259931 -171773 72264 -122873 173890 -256538 251298 -208248 -542008
9830 -542008 224470 26320 42151 -251842 192090 -91108 3500 -156121 -47155 -273999 268807
$$ packed form
9910a05512j09562N3487m5756A87479d3120B17849d6330n7549i303l6134J736
9899d3701q1190d5756J5792A11653d5584a2900k00170O7463k35656J70653A885
9887C8446b70048J5612p3351A37438a8574k41106b6427g256m5287l3031A9413
9875c33561B0058a12168B4469a88430o4259A97135c63975J26053O1355F5806k1568
9864D4238b55441j68372A4731f4437E9727b55358a26325d556H1373A7061c61957
9852a14844H5751g3106l3402A67384I036K6992g5642l51529d0155F6324a92656
9840I7667b45861j4070Q8158G2264a22873A73890b56538B51298b08248l33760
9830e42008B24470B6320J5831b51842A92090i1108C500a56121d7155k26844B68807
$$ plain form
9818 -6615 -84787 280864 -14235 112439 -80354 -147804 278964 -269032 14914 -188525 -10958
9806 -480372 -444886 -387033 -101185 -123686 -277646 135916 -207589 -149126 -8483 -5007 -69787
9795 -69787 -193794 68753 -70384 -331734 55586 21361 52879 343910 -96828 23404 -416239
9783 121547 -276601 21327 -79684 926 159295 -400780 -300335 -283986 -181197 240761 -205054
9771 51080 -205834 -66258 -305781 -197964 -154713 -82546 -65865 150666 -214076 -267400 82969
9759 66203 -48024 232433 143298 213545 -109083 -148552 151069 231094 -113772 147454 -25535
9747 116907 109365 -103012 -218414 -137651 -74974 -49720 112468 234598 -17672 -27432 132742
9735 -185758 -45920 -195919 84225 -53127 -280869 -23414 -151438 -230779 -337604 -202254 152661
$$ packed form
9818f615p8172B80864a4235A12439h0354o7450B78964b69032A4914a88525a0958
9806d80372L5486N7853a01185k2501j53960A35916b07589N8463h483L476o4780
9795f9787j24007F8753g0384k61350E5586B1361L1518K91031i6828B3404d16239
9783A21547b76601B1327g9684I26J58369d00780J00445J6349J02789B40761b05054
9771E1080b05834f6258k39523J07817M3251P2167J6681A50666b14076n3324H2969
9759F6203d8024B32433q9135P0247a09083l9469A51069Q0025a13772A47454b5535
9747A16907p542a03012j15402Q0763O2677K5254A12468J22130a7672r760A32742
9735a85758d5920j49999H4225e3127k27742b3414j28024p9341j06825J35350A52661
$$ plain form
9723 184516 -131271 -387199 -18967 -363452 -219900 73263 -104055 -6772 -238418 113802
9712 72111 -7740 10453 -115534 -137917 -81108 -102721 -147910 235201 -45487 167907 -117635
9700 -63176 4478 63489 -65818 40386 -235007 -84666 -120373 44549 -100069 -55353 167991
9688 -115204 -24294 -100564 -143625 -286439 -194964 -151299 -4337 -327141 -79076 -5035 -101854 -263522
9676 -263522 -107418 138534 14377 99436 -22239 -182857 57119 -130482 -108611 -217630 -177361
9665 -177361 -6515 153156 -212299 343830 -30425 -161655 -251215 5220 68739 -179121 -299697
9654 -299697 -82210 2101 -97180 81387 303911 -42690 -246316 -186552 -99863 223550 -170969
9642 25782 144666 221347 -338395 6361 23485 194366 107199 -41546 91347 -281076 224281
$$ packed form
9723A84516a31271k55928a8967l44485J43552G3263a04055f772k31646A13802
9712G2111g740A0453a15534k2383N6809k1613m5189B35201d5487A67907a17635
9700f3176D478N9011f5818D0386b35007h4666l5707D4549a00069M4716A67991
9688a15204b4294p6270m3061j42814R1475M3665d337l22804g9076e035r6819j61668
9676b63522a07418A38534A4377Q5059b2239j60618E7119a30482K1871j09019M0269
9665a77361f515A53156b12299C43830c0425j31230q9560E220O3519a79121j20576
9654b99697h2210B101i7180H1387K22524d2690k03626N9764Q6689B23550a70969
9642B5782J18884P6681c38395F361J7124J70881q7167d1546I1347b81076B24281
$$ plain form
9630 -251398 -68275 -14623 -158642 -189065 -171511 52958 -51042 47740 -215444 -297144 80168
9618 -298598 -158442 -281010 -57273 146402 -60088 153970 -274112 -88089 -26387 -276214
9608 -276214 59554 46771 4218 -184590 -175691 -273287 -146045 -176770 -230898 -34935 -99618 -117167
9596 -117167 -89008 -90761 -40613 233659 13747 -224352 26612 -336521 8760 -38701 -99653
9585 -99653 -240763 -90466 -44434 166851 251067 72378 253820 -334763 213595 -221585 -435283
9574 -435283 9007 -116629 38608 -116179 -92138 15129 -23775 -150695 -79052 -88468 208636
9562 -159683 -4130 -36266 -171155 -126698 179949 -154810 154833 -136159 -49943 270705 109697
9550 166342 -61131 215093 -90083 -89500 -36735 -132791 128204 -344411 -116472 109192 61427
$$ packed form
9630b51398f8275a4623j44019l0423J7554E2958e1042D7740b15444q1700H0168
9618b98598J40156j22568e7273A46402f0088A53970b74112h8089b6387k49827
9608b76214E9554j2783D218a84590Q899r7596J27242l0725n4128c4935o4683j7549
9596a17167K8159j753d0613B33659A3747b24352B6612c36521H760c8701o0952
9585i9653j41110i0466d4434A66851Q4216G2378J81442c34763B13595b21585k13698
9574d35283I007a16629C8608a16179K4041A5129b3775j26920P1643r416B08636
9562a59683d130l2136j34889M4457A79949a54810A54833a36159d9943B70705A09697
9550A66342f1131B15093i0083N83c6735r6056A28204c44411a16472A09192m7765
$$ plain form
9539 61427 -109521 107100 138526 -253489 -58565 -69378 -149962 -230285 -348846 157161 -88575
9527 260425 -394493 -184994 -186767 -37393 92123 234056 74078 -87642 -123927 -15233 440264
9515 -226688 -175180 81091 -240468 9005 -128376 -334867 -159727 -95263 37904 -12539 -361351
9504 -361351 -32602 -296961 290402 -125350 -364809 -118986 -220721 -122567 114481 47120
9493 98347 -145822 36915 -37157 -232376 277509 -221817 51961 -118315 -140653 53262 -83020
9481 -240792 -251829 -132806 -48790 -290410 -51951 -321664 -175120 72475 -266385 39475 -160320
9469 187214 -205462 18362 343239 -244836 -91244 131380 -155894 263847 -206190 87772
9458 33749 285697 -6513 -88875 -169519 -19998 -52752 -94671 -293890 322814 -382195 -32216
$$ packed form
9539F1427a09521A07100L1426b53489e8565j0813q0584q0323j18561A57161h8575
9527B60425c94493a84994j773c7393I2123J41933G4078h7642l6285a5233D40264
9515b26688N1508H1091b40468I005a28376k06491a59727O4464C7904a2539l48812
9504c61351c2602k64359B90402a25350k39459a18986j01735R8154A14481D7120
9493I8347a45822C6915c7157j95219B77509b21817E1961a18315k2338E3262h3020
9481b40792j1037J19023d8790k41620e1951k69713J46544G2475b66385C9475a60320
9469A87214b05462A8362L24877b44836i1244A31380a55894B63847b06190H7772
9458C3749K51948f513q2362q0644a9998l2754m1919j99219C22814c82195c2216
$$ plain form
9446 96578 -250301 -286748 -62070 -172592 -326377 -131654 -188420 -106775 42211 96027 -413426
9434 -169654 -89838 -201648 -52358 13602 -139107 68742 81219 50106 98093 127841 36499
9422 -27440 3907 -198022 266000 -104757 -114809 -154731 -178258 -86334 -267252 170268 -273988
9410 126096 -47086 -189094 -46407 190791 326196 45421 29032 131009 77331 -148588 -121135
9399 -121135 -199680 -233352 -159580 -474966 69328 -12344 -212994 126980 5761 -154356 -36313
9387 84689 161696 -239807 -28944 38985 -209472 137965 -427359 -54701 -44057 222030 90849
9375 -40575 32619 -81888 -198304 -202274 -150648 68553 -113085 94585 -187039 -280077 -182362
9364 -182362 28164 -43082 -41136 47096 269653 170384 -256788 -255866 -84966 -62395 -45958 -283664
$$ packed form
9446I6578b50301l6447f2070j10522j53785a31654n6766Q1645D2211N3816d13426
9434a69654P9816j11810e2358A3602a39107F8742J2477l1113M7987K9748C6499
9422b7440C907a98022B66000a04757j0052l9922k3527h6334j80918A70268b73988
9410A26096d7086j42008d6407A90791J35405D5421j6389J01977n3678a48588K7453
9399a21135p8545l3672P3772l15386F9328a2344k00650A26980E761a54356c6313
9387H4689P7007b39807b8944C8985b09472A37965d27359e4701J0644B22030I0849
9375d0575C2619h1888j16416l970N1626F8553a13085I4585a87039r3038R7715
9364a82362B8164d3082J946D7096K22557r9269b56788R22h4966K2571J6437k37706
$$ plain form
9352 -283664 29486 -214257 -211092 -59839 83143 87374 -97636 -75636 193951 -248778 -14836
9340 -109980 -351471 -13930 -194851 -92878 -255068 -11043 -200892 175582 -88402 126026
9329 -219289 -17293 -17766 3280 -128592 -101130 -203820 75088 137813 222043 152926 140758 -132563
9316 38322 -232558 -204441 30822 281572 44231 -263526 -258822 105092 -331962 -243733 -261380
9305 -261380 412930 153056 -9709 -97224 -41425 -215513 -111710 -204321 251223 -131890 -205978
9294 -205978 -88900 -63347 323183 -193962 140090 42914 -144686 -22267 -88156 -226064 158964
9282 -9835 -243601 -313361 -152436 -87431 -433780 36892 -67724 106041 291882 -71740 -64660
9271 -64660 -168114 -175667 10370 -291357 -181264 27210 135066 360527 -63324 -39243 -70378
$$ packed form
9352b83664B9486b14257L165e9839H3143M231i7636K2000A93951b48778a4836
9340a09980k41491a3930j80921i2878j62190a1043j89849A75582h8402A26026
9329b19289a7293m73C280a28592K7462j02690G5088O2725Q4230o9117j2168a32563
9316C8322b32558K8117C0822K50750D4231b63526M704A05092c31962Q8229j7647
9305b61380D12930A53056i709q7515d1425j74088J03803r2611B51223a31890p4088
9294b05978h8900K5553C23183a93962A40090D2914a44686b2267o5889j37908A58964
9282i835k33766o9760a52436O5005l46349C6892f7724A06041J85841g1740P080
9271f4660j03454p553A0370b91357J10093B7210J07856K25461f3324K4081l1135
$$ plain form
9260 -70378 -321749 -303312 -378242 -92635 -247374 -126991 -213590 76 198387 -85526 -227848
9249 -227848 -110197 87166 -213922 25873 -14640 -386326 116092 -32249 202150 -18952 -337708
9238 -337708 -41399 -274789 -292036 32547 58583 -43299 -167456 75682 -147521 -42332 -236159
9227 -236159 41834 -203565 -9578 176990 -116323 11044 -41812 155891 -406537 185646 -424538
9215 201780 -124317 -6868 392361 -301540 -57024 -525023 -35149 -447 117042 -291014 -166204
9204 -166204 -46639 48179 -83125 -115102 -182986 -279315 3509 -135515 -81779 -226057 -81865
9192 -43070 -256067 -8810 -196314 -188037 161 63635 -210780 -202064 -114952 340150 258607 -131777
9179 -4931 308489 313728 -127761 -41979 126794 -54332 -45484 -36113 -402289 161716 172979 -26701
$$ packed form
9260g0378k51371J8437p4930i2635j54739J20383q6599G6J98311h5526j42322
9249b27848a10197H7166b13922B5873a4640l71686A16092c2249B02150a8952l18756
9238c37708d1399k33390j7247C2547K6036d3299j24157G5682a47521d2332j93827
9227b36159D1834b03565i578A76990a16323A1044d1812A55891d06537A85646d24538
9215B01780a24317f868C92361c01540e7024m67999c5149d47A17042b91014J24810
9204a66204d6639D8179h3125l1977o7884r6329C509a35515N3736j44278h1865
9192d3070k12997h810j87504Q277A61O3474b10780Q716Q7112C40150q1543a31777
9179d931C08489N239a27761d1979A26794e4332Q848R371l66176A61716J1263b6701
$$ plain form
9166 8140 -72125 63502 111681 22193 -251286 129459 2656 -98759 130695 -36691 -100637 -223734
9154 -223734 250185 53387 -322745 102570 -44097 16887 -50162 -166418 -78667 -163 -536595
9143 -536595 -327130 -40240 -23978 -215 -278747 12331 -247432 -175514 141820 269982 -190583
9131 -80270 -81381 75981 1968 121024 -256193 -100448 65256 124059 -285759 -102274 33619
9119 123480 -74502 -207925 -269089 117232 78556 -440063 -238951 -230955 135742 286188 324187
9108 324187 -7542 27015 89456 -313164 -107951 -38185 -197359 -305234 36218 -12060 -140860
9097 -140860 -175505 -4465 -357527 -129911 186405 -149718 126882 236254 118101 -68455
9086 -11319 -186104 -311868 -19319 -16206 -336083 129894 417000 -77655 -343567 -92858 76816
$$ packed form
9166H140g2125F3502M8179B2193b51286A29459B656i8759A30695c6691o3946j23097
9154b23734B50185E3387c22745A02570d4097A6887e0162j16256g8667a63n36432
9143e36595K09465d0240J6262b15k78532A2331b47432P1918A41820J28162a90583
9131h0270j111G5981A968J19056b56193a00448F5256N8803b85759a02274C3619
9119A23480g4502j33423o1164A17232l8676d40063K01112P996A35742J50446L7999
9108C24187g542B7015O2441c13164a07951c8185j59174j07875C6218a2060j28800
9097a40860l4645d465l53062a29911A86405a49718A26882J09372A18101f8455
9086a1319j74785j25764a9319L113l19877A29894K87106g7655k65912i2858G6816
$$ plain form
9074 120165 -178035 -60613 -8048 -79646 213431 222030 -223385 135965 -140617 -62560 -21231
9062 145026 3957 -204233 -284661 -201578 -292551 52019 -261249 279766 -139359 -92275 169294
9050 -42420 -118731 -277390 207182 -261396 -236870 -78899 -245974 -201017 -270497 -311992 -190518
9039 -190518 25476 150148 56425 433995 -437959 136306 57536 42353 -224577 13446 -66509
9027 -284176 -207142 -310356 -71293 -225590 -239623 -63817 155257 206017 -45971 -377755 -153948
9015 -7734 -125660 -96620 59551 29872 78798 -424958 517593 -325026 -365175 -9091 -95693
9004 -95693 238225 -261529 -51963 91213 -202663 -290253 -212245 -173846 211430 -290574 -250855
8993 -250855 -167394 204280 -29698 -157994 -185932 -35180 23565 -12234 -212480 -140060 -19039
$$ packed form
9074A20165a78035f0613h048p1598B13431Q599b23385A35965a40617f2560b1231
9062A45026C957b04233q0428Q3083r0973E2019b61249B79766a39359M7084A69294
9050d2420p6311j58659B07182b61396K4526g8899j67075M4957o9480m1495J21474
9039a90518B5476J24672E6425L77570d37959A36306E7536j5183b24577A3446f6509
9027b84176P7034j03214g1293j54297j4033f3817A55257N0760d5971l31784a53948
9015g734j17926K9040E9551k9679M8926d24958E17593c25026m0149i091q6602
9004i5693B38225b61529e1963I1213b02663q7590P8008L8399B11430b90574L9719
8993b50855Q3461B04280b9698j28296k7938c5180B3565a2234k00246P2420a9039
$$ plain form
8981 -52428 -339775 -77267 60927 -210418 131886 -115790 -309255 -278627 -89404 -199178 -247087
8970 -247087 -411297 -145820 -132356 -408846 -22008 98300 -139896 -44259 -39384 -31653 -39006
8959 -39006 16315 4615 -346010 -170651 -26543 -106624 124071 -14609 146741 -87783 -50392
8948 -50392 -122588 -146323 -60143 -301792 178843 13103 -104877 -226200 -7478 -142377 200699
8936 193071 -56179 -145452 -132739 17586 -69905 -136601 -237612 -164769 -70611 -123917 65452
8924 90069 209827 -4727 111886 358339 1083984 3136928 5209721 1165464 238403 313637
8914 313637 326481 169561 77880 -15555 42849 -169662 -8035 -328033 163165 -189690 -198054
8903 -198054 455 -133797 251351 -91879 75031 -75625 219948 12230 27614 150577 92297
$$ packed form
8981e2428k87347g7267F0927b10418A31886a15790j93465L0628h9404j09774m7909
8970b47087j64210a45820J3464k76490b2008I8300a39896d4259M875P731p353
8959c9006A6315D615c46010a70651b6543q0081A24071a4609A46741h7783L7391
8948e0392p2196k3735f0143k41649A78843A3103a04877j21323g478j34899B00699
8936A93071e6179q9273J2713A7586f9905o6696j01011P2843g0611n3306F5452
8924I0069J19758d727A11886K46453P25645K052944K072793A165464B38403P5234
8914C13637J2844j56920G7880a5555D2849a69662h035l19998A63165a89690q364
8903a98054D55a33797B51351i1879G5031g5625B19948A2230J5384J22963n8280
$$ plain form
8892 92297 -439441 -30510 -64300 301886 -184518 -247828 -196372 -120438 -56169 292432 244304
8881 244304 -48334 3381 -152590 -330048 116723 52616 -87355 203486 -12247 7379 -95256
8869 -109785 -243505 223377 -288872 118986 111137 146031 109990 137335 241121 -281838 86928
8857 14021 -219751 -164591 23268 -166600 -85068 -96169 -27350 -89578 -92200 -91387 8727 116937
8845 116937 -133050 115356 -300522 -353403 192104 198107 110566 -34691 27172 -140710 108819
$$ packed form
8892I2297d39441c0510l3790C01886a84518o3310N1456P5934e6169B92432m8128
8881B44304d8334C381a52590j77458A16723E2616h7355B03486a2247G379i5256
8869a09785j33720B23377b88872A18986p849L4894l6041K7345J03786b81838H6928
8857A4021b19751N5160B3268a66600Q1532j1101b7350o2228k622Q13H727J08210
8845A16937a33050A15356c00522n2881A92104O003q7541c4691B7172a40710A08819
$$ [...]
##END NTUPLES=NMR SPECTRUM
##END=
