
##TITLE=AC1301_CHIAH12113_6615675_3NLAVWHiYS
##JCAMPDX= 6.0         $$ Bruker NMR JCAMP-DX V2.0
##DATA TYPE= NMR SPECTRUM
##DATA CLASS= NTUPLES
##ORIGIN= BRUKER
##OWNER= Administrator
$$ 1.72 TOPSPIN		Version 2.1
$$ 2012-08-02 23:02:30.468 -0500  Administrator@TOPSPIN
$$ Compression mode = diff/dup
##.OBSERVE FREQUENCY= 400.02188249412
##.OBSERVE NUCLEUS= ^1H
##.ACQUISITION MODE= SIMULTANEOUS (DQD)
##.ACQUISITION SCHEME= undefined
##.AVERAGES= 64
##.DIGITISER RES= 22
##SPECTROMETER/DATA SYSTEM= spect
##.PULSE SEQUENCE= noesygpps1d.comp
##.SOLVENT NAME= COFFEE_meoh
##.SHIFT REFERENCE= INTERNAL, COFFEE_meoh, 1, 14.96284
##AUDIT TRAIL= $$ (NUMBER, WHEN, WHO, WHERE, PROCESS, VERSION, WHAT)
$$ ##TITLE= Audit trail, TOPSPIN		Version 2.1
$$ ##JCAMPDX= 5.01
$$ ##ORIGIN= Bruker BioSpin GmbH
$$ ##OWNER= Administrator
$$ $$ C:\Bruker\TOPSPIN/data/COFFEE/nmr/AC1301_CHIAH12113_6615675_3NLAVWHiYS/12/pdata/1/auditp.txt
$$ ##AUDIT TRAIL=  $$ (NUMBER, WHEN, WHO, WHERE, PROCESS, VERSION, WHAT)
(   1,<2012-08-02 23:02:25.812 -0500>,<Administrator>,<TOPSPIN>,<go>,<TOPSPIN 2.1>,
      <created by zg
	started at 2012-08-02 22:50:55.578 -0500,
	POWCHK enabled, PULCHK disabled,
       configuration hash MD5:
       6B 1B 68 BB D9 2E 58 E2 7F 35 AD 54 07 DF 0E 41
       data hash MD5: 64K
       F0 C3 FF FF 39 DF BA 54 B2 E3 14 05 2C BC FB B3>)
(   2,<2012-08-02 23:02:28.593 -0500>,<Administrator>,<TOPSPIN>,<proc1d>,<TOPSPIN 2.1>,
      <Start of raw data processing
       efp LB = 0.3 FT_mod = 6 PKNL = 1 PHC0 = 0 PHC1 = 0 SI = 128K 
       data hash MD5: 128K
       10 5C 4F 0A C9 42 E0 3B F8 EE FB 1E 08 A6 CF 71>)
(   3,<2012-08-02 23:02:29.734 -0500>,<Administrator>,<TOPSPIN>,<proc1d>,<TOPSPIN 2.1>,
      <pk PHC0 = 1.142578 PHC1 = 0 
       data hash MD5: 128K
       94 04 5C F2 C9 A3 CA BD 62 91 37 D2 0B F4 D3 96>)
(   4,<2012-08-02 23:02:29.953 -0500>,<Administrator>,<TOPSPIN>,<proc1d>,<TOPSPIN 2.1>,
      <abs ABSG = 1 
       data hash MD5: 128K
       E6 DA EB B2 93 51 5F 12 51 B3 56 94 3C 82 14 CA>)
(   5,<2012-08-02 23:02:30.031 -0500>,<Administrator>,<TOPSPIN>,<proc1d>,<TOPSPIN 2.1>,
      <abs ABSG = 2 
       data hash MD5: 128K
       4A 39 36 36 11 C8 E7 66 FC ED 02 CF A0 9B 62 8E>)
(   6,<2012-08-02 23:02:30.125 -0500>,<Administrator>,<TOPSPIN>,<proc1d>,<TOPSPIN 2.1>,
      <abs ABSG = 3 
       data hash MD5: 128K
       48 4C 5C AE D3 9E 81 95 F8 9A 9A C3 35 74 2E AC>)
(   7,<2012-08-02 23:02:30.328 -0500>,<Administrator>,<TOPSPIN>,<proc1d>,<TOPSPIN 2.1>,
      <abs ABSG = 4 
       data hash MD5: 128K
       B2 1A 2B AB 31 F6 99 4C B3 D3 54 65 30 D8 D8 ED>)
(   8,<2012-08-02 23:02:30.375 -0500>,<Administrator>,<TOPSPIN>,<proc1d>,<TOPSPIN 2.1>,
      <abs ABSG = 5 
       data hash MD5: 128K
       56 59 55 84 A9 D9 4A DD BF E9 3B 93 64 DC 7A A7>)
$$ ##END=
$$ 
$$ $$ hash MD5
$$ $$ 2E 42 8D AD 9B 65 A1 B6 ED E9 0D 1C 7F 25 ED 27
##$RELAX= 
##$RELAX= 
##$RELAX= 
##$RELAX= 
##$RELAX= 
##$RELAX= 
##$RELAX= 
##$RELAX= 
$$ Bruker specific parameters
$$ [...]
##$TP07= 0
##$TPNAME0= <>
##$TPNAME1= <>
##$TPNAME2= <>
##$TPNAME3= <>
##$TPNAME4= <>
##$TPNAME5= <>
##$TPNAME6= <>
##$TPNAME7= <>
##$TPOAL= (0..7)
0.5 0.5 0.5 0.5 0.5 0.5 0.5 0.5
##$TPOFFS= (0..7)
0 0 0 0 0 0 0 0
##$TUNHIN= 0
##$TUNHOUT= 0
##$TUNXOUT= 0
##$USERA1= <user>
##$USERA2= <user>
##$USERA3= <user>
##$USERA4= <user>
##$USERA5= <user>
##$V9= 5
##$VALIST= <valist>
##$VCLIST= <CCCCCCCCCCCCCCC>
##$VD= 0
##$VDLIST= <DDDDDDDDDDDDDDD>
##$VPLIST= <PPPPPPPPPPPPPPP>
##$VTLIST= <TTTTTTTTTTTTTTT>
##$WBST= 1024
##$WBSW= 4
##$XGAIN= (0..3)
0 0 0 0
##$XL= 0
##$YL= 0
##$YMAX_a= 17711245
##$YMIN_a= -10388880
##$ZGOPTNS= <>
##$ZL1= 120
##$ZL2= 120
##$ZL3= 120
##$ZL4= 120
##$ABSF1= 14.96284
##$ABSF2= -5.595342
##$ABSG= 5
##$ABSL= 3
##$ALPHA= 0
##$AQORDER= 0
##$ASSFAC= 0
##$ASSFACI= 0
##$ASSFACX= 0
##$ASSWID= 0
##$AUNMP= <proc_prof1d_extract.lims>
##$AXLEFT= 0
##$AXNAME= <>
##$AXNUC= <1H>
##$AXRIGHT= 0
##$AXTYPE= 0
##$AXUNIT= <>
##$AZFE= 0.1
##$AZFW= 0.1
##$BCFW= 0
##$BC_mod= 0
##$BYTORDP= 0
##$COROFFS= 0
##$CY= 15
##$DATMOD= 1
##$DC= 0
##$DFILT= <>
##$DTYPP= 0
##$F1P= 0
##$F2P= 0
##$FCOR= 0.5
##$FTSIZE= 131072
##$FT_mod= 6
##$GAMMA= 0
##$GB= 0
##$INTBC= 1
##$INTSCL= 1
##$ISEN= 128
##$LB= 0.3
##$LEV0= 0
##$LPBIN= 0
##$MAXI= 10000
##$MC2= 0
##$MEAN= 0
##$ME_mod= 0
##$MI= 0
##$NCOEF= 0
##$NC_proc= -2
##$NLEV= 6
##$NOISF1= 0
##$NOISF2= 0
##$NSP= 0
##$NTH_PI= 0
##$NZP= 0
##$OFFSET= 14.96284
##$PC= 1
##$PHC0= 1.142578
##$PHC1= 0
##$PH_mod= 1
##$PKNL= yes
##$PPARMOD= 0
##$PPDIAG= 0
##$PPIPTYP= 0
##$PPMPNUM= 2147483647
##$PPRESOL= 1
##$PSCAL= 4
##$PSIGN= 0
##$PYNMP= <proc.py>
##$REVERSE= no
##$SF= 400.020008900009
##$SI= 131072
##$SIGF1= 0
##$SIGF2= 0
##$SINO= 400
##$SIOLD= 131072
##$SPECTYP= <>
##$SREGLST= <1H.CDCl3>
##$SSB= 0
##$STSI= 131072
##$STSR= 0
##$SW_p= 8223.68421052631
##$SYMM= 0
##$S_DEV= 0
##$TDeff= 65536
##$TDoff= 0
##$TI= <>
##$TILT= no
##$TM1= 0
##$TM2= 0
##$TOPLEV= 0
##$USERP1= <user>
##$USERP2= <user>
##$USERP3= <user>
##$USERP4= <user>
##$USERP5= <user>
##$WDW= 1
##$XDIM= 131072
##$YMAX_p= 449597520
##$YMIN_p= -12056
##$CURPLOT= <Network HP LaserJet P1505>
##$CURPRIN= <$Network HP LaserJet P1505>
##$DFORMAT= <normdp>
##$LAYOUT= <+/1D_H.xwp>
##$LFORMAT= <normlp>
##$PFORMAT= <normpl>
##$SURQMSG= 1
$$ End of Bruker specific parameters
$$ ---------------------------------
##NTUPLES= NMR SPECTRUM
##VAR_NAME=  FREQUENCY,     SPECTRUM/REAL,   SPECTRUM/IMAG
##SYMBOL=    X,             R,               I
##VAR_TYPE=  INDEPENDENT,   DEPENDENT,       DEPENDENT
##VAR_FORM=  AFFN,          ASDF,            ASDF
##VAR_DIM=   131072,        131072,          131072
##UNITS=     HZ,            ARBITRARY UNITS, ARBITRARY UNITS
##FACTOR=    0.0627417313425164, 1,          1
##FIRST=     8223.62146879497, 606,          -61644
##LAST=      0,             1189,            -61299
##MIN=       0,             -12056,          0
##MAX=       8223.62146879497, 449597520,    0
$$ Real data points
##PAGE= N=1
##DATA TABLE= (X++(R..R)), XYDATA
$$ [...]
60918A527785n9735n8987n7636n5842n3310m9377m4802m1041l7922l4154k9894
$$ 1527785 1468050 1409063 1351427 1295585 1242275 1192898 1148096 1107055 1069133 1034979 1005085
60907A005085k6538k4318k2210k0026j8507j7448j5864j3914j2695j2125j1021
$$ 1005085 978547 954229 932019 911993 893486 876038 860174 846260 833565 821440 810419
60896H10419r274q025p628p290o776o636o669n970m676l881l742l399k882l243
$$ 810419 801145 793120 785492 778202 771426 764790 758121 752151 747475 743594 739852 736453 733571 730328
60882G30328m585n702o013o135o329o075n464n312n582n309m380l702l416k674
$$ 730328 725743 720041 714028 707893 701564 695489 690025 684713 679131 673822 669442 665740 662324 659650
60868F59650j432o42l10O91K405L410L198L132M162N473O194O716P375P617P436
$$ 659650 658218 657576 657266 657957 660362 663772 666970 670102 674264 679737 685931 692647 700022 707639 715075
60853G15075P932R318J0004Q978P620P731R015R951J0125J0203J0420J0436J0223
$$ 715075 723007 732325 742329 751307 758927 766658 775673 785624 795749 805952 816372 826808 837031
60840H37031R930R295P958O020L746J344o68j708k165l183m885n995n742m981
$$ 837031 846961 856256 864214 870234 873980 875324 874656 872948 870783 867600 862715 856720 850978 845997
60826H45997m698m639m240l798l743l778l660l877m648n236n160n089n534n687
$$ 845997 841299 836660 832420 828622 824879 821101 817441 813564 808916 803680 798520 793431 787897 782210
60812G82210m725l368k923l372l618l080k038q55K41R62J370K031L146M066M256
$$ 782210 777485 774117 771194 767822 764204 761124 759086 758231 758472 759434 760804 762835 765981 770047 774303
60797G74303M072M049M128M322N226P070Q984J0077J0586J1185J1879J2365J2810
$$ 774303 778375 782424 786552 790874 796100 803170 812154 822231 832817 844002 855881 868246 881056
60784H81056J3369J3553J2963J2141J1826J1881J1592J0520Q530N660K623O71
$$ 881056 894425 907978 920941 933082 944908 956789 968381 978901 987431 993091 995714 996385
60772I96385K53M17J19o79j703l088m581n125m311l429l903n358o307o148n467
$$ 996385 996638 997055 997174 996495 994792 991704 987123 981998 977687 974258 970355 964997 958690 952542 947075
60757I47075m924m868n566o804p713p760p461p420p314o564n330l983k377n60
$$ 947075 942151 937283 931717 924913 917200 909440 901979 894559 887245 880681 875351 871368 868991 868431
60743H68431M83n2j575k888l608l932l653k558j257n23k28K04P16R73J235J951
$$ 868431 868914 868862 867287 864399 860791 856859 853206 850648 849391 848868 848640 848844 849560 850533 851768 853719
60727H53719K848L348L431L306K726J537L28k52l34k96p1J39o17k798n246o402
$$ 853719 856567 859915 863346 866652 869378 870915 871243 870991 870657 870361 870290 870429 869812 867014 861768 855366
60711H55366o116n430n225n948p791j0090j1340j0930j0071j0003j0249r861r289
$$ 855366 849250 843820 838595 832647 824856 814766 803426 792496 782425 772422 762173 752312 743023
60698G43023r458r894r521q562p939p443o322n154n159n949n923m809l886l686
$$ 743023 733565 723671 714150 705588 697649 690206 683884 678730 673571 667622 661699 656890 653004 649318
60684F49318l355k524j995k148k248j838j407j170n72N15J298J352J378K133L425
$$ 649318 645963 643439 641444 639296 637048 635210 633803 632633 632061 632576 633874 635226 636604 638737 642162
60669F42162M565N145N090M627M265M170L780K792K170L014M660N328M617L956
$$ 642162 646727 651872 656962 661589 665854 670024 673804 676596 678766 681780 686440 691768 696385 700341
60655G00341M306M929M885M528M723N511O334O929P480Q197R145J0105J0518R925
$$ 700341 704647 709576 714461 718989 723712 729223 735557 742486 749966 758163 767308 777413 787931 797856
60641G97856Q553P073N868M963M458M405M483M327M066M050M308M704N170N275
$$ 797856 806409 813482 819350 824313 828771 833176 837659 841986 846052 850102 854410 859114 864284 869559
60627H69559M274K249M61k61p29j951l436m123m277m888n830o174n913n871o139
$$ 869559 873833 876082 876543 876282 875553 873602 870166 866043 861766 856878 851048 844874 838961 833090 826951
60612H26951o116n787n497m816l221j462n33L69K771O079Q003Q028Q134R570J1120
$$ 826951 820835 815048 809551 804735 801514 800052 799519 799888 802659 808738 816741 824769 832903 842473 853593
60597H53593J1326J0510R422P720M990J964m38k196l448l731k937j964j545j277
$$ 853593 864919 875429 884851 892571 897561 899525 899087 896891 893443 889712 886775 884811 883266 881989
60583H81989o17J09L68K78P1m34j162j431r65m37m30o39p40j113k002k785k892
$$ 881989 881372 881481 881849 882127 882198 881764 880602 879171 878206 877769 877339 876700 875960 874847 872845 870060 867168
60566H67168k818l372m472n385n790o012o457p166p734p517o407n300n204n828
$$ 867168 864350 860978 856506 851121 845331 839319 832862 825696 817962 810445 804038 798738 793534 787706
60552G87706n870m710l034j615m98M71J158J585K040K549L010L860N682Q028R781
$$ 787706 781836 777126 774092 772477 771979 772450 773608 775193 777233 779782 782792 786652 792334 800362 810143
60537H10143J0974J3061J7005K2109K7291L2491L8255M4730N1585N8198O3479
$$ 810143 821117 834178 851183 873292 900583 933074 971329 1016059 1067644 1125842 1189321
60526A189321O6084O5076N9926N0085L5573J8111N03j5235k8236l7541m2017m1847
$$ 1189321 1255405 1320481 1380407 1430492 1466065 1484176 1484679 1469444 1441208 1403667 1361650 1319803
60514A319803l8654l3680k7160j9743j2995p823l854r72J8q22j749j365k60N16
$$ 1319803 1281149 1247469 1220309 1200566 1187571 1179748 1175894 1174922 1174940 1174118 1172369 1171004 1170744 1171260
60500A171260J376L285O036Q836J1887J6020K1270K7034L3215M0207M8066N6553
$$ 1171260 1172636 1175921 1181957 1190793 1202680 1218700 1239970 1267004 1300219 1340426 1388492 1445045
60488A445045O5546P4551Q2231Q7282Q9602R0007Q9321Q8490Q9195R3510J02981
$$ 1445045 1510591 1585142 1667373 1754655 1844257 1934264 2023585 2112075 2201270 2294780 2397761
60477B397761J18457J40419J69055K04193K45312K91081L38391L82059M15267
$$ 2397761 2516218 2656637 2825692 3029885 3275197 3566278 3904669 4286728 4701995
60468D701995M29904M17377L71506K92278J86453O4331o3340j85482k90494l68729
$$ 4701995 5131899 5549276 5920782 6213060 6399513 6463844 6400504 6215022 5924528 5555799
60458E555799m15906m33855m28424m06825l75679l39847l02536k66286k33204
$$ 5555799 5139893 4706038 4277614 3870789 3495110 3155263 2852727 2586441 2353237
60449B353237k04072j78249j55083j34785j17498j02526q9164p7520o7779n9376
$$ 2353237 2149165 1970916 1815833 1681048 1563550 1461024 1371860 1294340 1226561 1167185
60439A167185n1626m4686l9138l5056l1957k9291k6607k3718k0991j9003j7743
$$ 1167185 1115559 1070873 1031735 996679 964722 935431 908824 885106 864115 845112 827369
60428H27369j6722j5818j5169j4350j2774j1010j0296j0557j0302q888p320o304
$$ 827369 810647 794829 779660 765310 752536 741526 731230 720673 710371 701483 694163 687859
60416F87859n148l460k270k382k942k843k377k256k115j277o9Q15J399J849J782
$$ 687859 682711 679251 676981 674599 671657 668814 666437 664181 662066 660789 660720 661535 662934 664783 666565
60401F66565J244J283K346L177K604J486J384K222K770K748K826L078K979K583
$$ 666565 667809 669092 671438 674615 677219 678705 680089 682311 685081 687829 690655 693733 696712 699295
60387F99295K341K022J120Mn32o30j051j828k357k572k893l242l151k695k315
$$ 699295 701636 703658 704778 704782 704250 703620 702569 700741 698384 695812 692919 689677 686526 683831 681516
60372F81516j965j331o06j84J04N60Q67O73M74Q92J507J481J016J052J708K146
$$ 681516 679551 678220 677614 677430 677534 678094 678961 679634 680108 681000 682507 683988 685004 686056 687764 689910
60356F89910J890J390J253J640K402L147L483L520L854M533M817M501M589N788
$$ 689910 691800 693190 694443 696083 698485 701632 705115 708635 712489 717022 721839 726340 730929 736717
60342G36717P148P387O738O307O204N731N022M985N646N875M963L516K629K805
$$ 736717 743865 751252 757990 764297 770501 776232 781254 786239 791885 797760 802723 806239 808868 811673
60328H11673L732M508M333L398K832L338M429N436O424P375P441O127M421L521
$$ 811673 815405 819913 824246 827644 830476 833814 838243 843679 850103 857478 864919 871046 875467 878988
60314H78988L030J659o90k863m147m848n371n786o170o419n999m719l421k966
$$ 878988 882018 883677 882987 880124 875977 871129 865758 859972 853802 847383 841384 836665 833244 830278
60300H30278k954k489j678j298j274p18O57K200L361M141M613M757M673M347L524
$$ 830278 827324 824835 823157 821859 820585 819867 820524 822724 826085 830226 834839 839596 844269 848616 852140
60285H52140K346J592J626J790J581J621K542L692M101L988M237M940N667O499
$$ 852140 854486 856078 857704 859494 861075 862696 865238 868930 873031 877019 881256 886196 891863 898362
60271H98362P658Q700R290J0125J1856J3703J4559J4810J5630J7033J8204J9323
$$ 898362 906020 914720 924010 934135 945991 959694 974253 989063 1004693 1021726 1039930 1059253
60259A059253K1480K4845K8400L1385L3842L6010L8319M1634M6326N1523N6376
$$ 1059253 1080733 1105578 1133978 1165363 1199205 1235215 1273534 1315168 1361494 1413017 1469393
60248A469393O1450O7571P4136Q0081Q5842R2531R9818J06501J12641J19071J25063
$$ 1469393 1530843 1598414 1672550 1752631 1838473 1931004 2030822 2137323 2249964 2369035 2494098
60237B494098J28622J29101J27530J24378J18955J11226J02133R1858P9568O5325
$$ 2494098 2622720 2751821 2879351 3003729 3122684 3233910 3336043 3427901 3507469 3572794
60227C572794N0449L5608K0261M518j0148k2620l3092m1772m8068n1549n2426
$$ 3572794 3623243 3658851 3679112 3683630 3673482 3650862 3617770 3575998 3527930 3476381 3423955
60216C423955n0656m5927l8889l1007k2732j3127j616J1138K4394L7999N1665
$$ 3423955 3373299 3327372 3288483 3257476 3234744 3221617 3220001 3231139 3255533 3293532 3345197
60205C345197O4920P8098R1911J05752J17867J27399J34723J39543J40438J36886
$$ 3345197 3410117 3488215 3580126 3685878 3803745 3931144 4065867 4205410 4345848 4482734
60195D482734J29953J20331J07308R0519P1203N0806K9634P741j4076l5020n4857
$$ 4482734 4612687 4733018 4840326 4930845 5002048 5052854 5082488 5090229 5076153 5041133 4986276
60184D986276p3005q8141r9442j07252j11905j12938j09986j03392r3482q0415
$$ 4986276 4913271 4825130 4725688 4618436 4506531 4393593 4283607 4180215 4086733 4006318
60174D006318o5146m9203l3055j6025J783J9052L5324N1656O8245Q2993R3686
$$ 4006318 3941172 3891969 3858914 3842889 3844672 3863724 3899048 3950704 4018949 4101942 4195628
60163D195628J00198J03251J02443R7023Q7644P5803O2227M7191L1720J7117L661
$$ 4195628 4295826 4399077 4501520 4598543 4686187 4761990 4824217 4871408 4903128 4920245 4923906
60152D923906q952k0175k8560l2994l3179k9164k1254j0203L030J7660L2926M8093
$$ 4923906 4914954 4894779 4866219 4833225 4800046 4770882 4749628 4739425 4742455 4760115 4793041 4841134
60140D841134O2958P8007R3784J10620J29088J49935J73204J98172K24434K52318
$$ 4841134 4904092 4982099 5075883 5186503 5315591 5465526 5638730 5836902 6061336 6313654
60130F313654K81781L11670L40449L66903L89773M07628M19667M25888M25942
$$ 6313654 6595435 6907105 7247554 7614457 8004230 8411858 8831525 9257413 9683355
60121I683355M18522M02326L77103L43360L01848K53679K00246J42493Q0919J6602
$$ 9683355 10101877 10504203 10881306 11224666 11526514 11780193 11980439 12122932 12203851 12220453
60111A2220453m8488j12434j73819k30981k81664l23766l55730l76201l84383
$$ 12220453 12171965 12059531 11885712 11654731 11373067 11049301 10693571 10317370 9932987
60102I932987l81113l68490l48100l20599k87293k50710k12854j73995j33915
$$ 9932987 9551874 9183384 8835284 8514685 8227392 7976682 7763828 7589833 7455918
60093G455918r3522n4428j7809J5622M5176P0354R0835J05989J15129J18488J16908
$$ 7455918 7362396 7307968 7290159 7305781 7350957 7421311 7512146 7618135 7733264 7851752 7968660
60082G968660J10240R7332P8185N4962L0093M455k1740m7379p1064r2649j13086
$$ 7968660 8078900 8176232 8254417 8309379 8339472 8343927 8322187 8274808 8203744 8111095 7998009
60071G998009j32946j51814j68745j82815j93498k00913k05297k06195k02786
$$ 7998009 7865063 7713249 7544504 7361689 7168191 6967278 6761981 6555786 6353000
60062F353000j95171j84503j71671j56828j40397j23501j06830q9939p2187n3550
$$ 6353000 6157829 5973326 5801655 5644827 5504430 5380929 5274099 5184160 5111973 5058423
60052E058423l4178j4055O553K7090M7459O7866Q7642J05314J20137J32416J41879
$$ 5058423 5024245 5010190 5016743 5043833 5091292 5159158 5246800 5352114 5472251 5604667 5746546
60041E746546J46917J46037J39091J26634J09255Q8038O4523L9456J2498j6247
$$ 5746546 5893463 6039500 6178591 6305225 6414480 6502518 6567041 6606497 6618995 6602748
60031F602748m5357p3154r8715j21347j40198j54808j65109j70478j70026j64256
$$ 6602748 6557391 6484237 6385522 6264175 6123977 5969169 5804060 5633582 5463556 5299300
60021E299300j55179j44350j31882j17665j02092q5162o6477m6738k7627r513
$$ 5299300 5144121 4999771 4867889 4750224 4648132 4562970 4496493 4449755 4422128 4412615
60011D412615R130K9236M9816O9971R0375J11566J32435J51855J70151J87364
$$ 4412615 4421745 4450981 4500797 4570768 4661143 4772709 4905144 5056999 5227150 5414514
60001E414514K01394K09666K11570K07706J97714J80659J57081J29156R9076O8161
$$ 5414514 5615908 5825574 6037144 6244850 6442564 6623223 6780304 6909460 7008536 7076697
59991G076697L6933N088k7878o1124r2188j18907j40636j56956j66574j68695
$$ 7076697 7113630 7118718 7090840 7029716 6937528 6818621 6677985 6521029 6354455 6185760
59981F185760j64341j55128j41805j25008j06121q5983o3965l9827j5510O468
$$ 6185760 6021419 5866291 5724486 5599478 5493357 5407374 5343409 5303582 5288072 5294540
59971E294540K5580M2762N8184P1107Q1356Q9483R5849J00670J04421J07079J07661
$$ 5294540 5320120 5362882 5421066 5492173 5573529 5663012 5758861 5859531 5963952 6071031 6178692
59960F178692J05478J01162R5440Q7818P7663O5670N3116M0455K7902J6489P240
$$ 6178692 6284170 6385332 6480772 6568590 6646253 6711923 6765039 6805494 6833396 6849885 6857125
59949F857125J28m934o801m011L691J5873L2565N3801P9027J08052J41493J79038
$$ 6857125 6857253 6852319 6845518 6841507 6845198 6861071 6893636 6947437 7026464 7134516 7276009 7455047
59937G455047K18478K57985K98118L39893L81968M21465M56430M85313N04785
$$ 7455047 7673525 7931510 8229628 8569521 8951489 9372954 9829384 10314697 10819482
59928A0819482N10352M99044M69817M21849L54528K69331J70381O3254m5761j49954
$$ 10819482 11329834 11828878 12298695 12720544 13075072 13344403 13514784 13578038 13532277 13382323
59918A3382323k43543l22945l86127m31626m59375m71551m70915m58862m36358
$$ 13382323 13138780 12815835 12429708 11998082 11538707 11067156 10596241 10137379 9701021
59909I701021m05831l70399l31823k90860k48856k07189j65739j23768q1970m1913
$$ 9701021 9295190 8924791 8592968 8302108 8053252 7846063 7680324 7556556 7474586 7432673
59899G432673l837L3248O9524J04085J36333J66001J91914K12138K25110K29369
$$ 7432673 7428836 7462084 7531608 7635693 7772026 7938027 8129941 8342079 8567189 8796558
59889H796558K22844K03906J72776J30586P8044J6683m9416j15175j77349k34070
$$ 8796558 9019402 9223308 9396084 9526670 9604714 9621397 9571981 9456806 9279457 9045387
59879I045387k82590l19867l45164l59883l65076l61128l49586l32950l12625
$$ 9045387 8762797 8442930 8097766 7737883 7372807 7011679 6662093 6329143 6016518
59870F016518k88993k63378k37804k12873j88018j63841j42061j23063j05800
$$ 6016518 5727525 5464147 5226343 5013470 4825452 4661611 4519550 4396487 4290687
59861D290687r0367p8447p0768o6108o3327o2350o2619o2578o1391n9528n7035
$$ 4290687 4200320 4121873 4051105 3984997 3921670 3859320 3796701 3734123 3672732 3613204 3556169
59850C556169n2907m6757l9510l1957k4165j6804j1386q597p914r338j3808k1299
$$ 3556169 3503262 3456505 3416995 3385038 3360873 3344069 3332683 3324086 3316172 3306834 3293026 3271727
59838C271727l0035l8307m5659n1709n5364n6088n4648n1807m7390m1329l4499
$$ 3271727 3241692 3203385 3157726 3106017 3050653 2994565 2939917 2888110 2840720 2799391 2764892
59827B764892k7787k1209j4482p618n96O738J4184K1470K9151L8103M8015N7262
$$ 2764892 2737105 2715896 2701414 2693796 2693200 2699938 2714122 2735592 2764743 2802846 2850861 2908123
59815B908123O4426O9107P1497P2314P2927P4166P5066P4004P0735O5910N9052
$$ 2908123 2972549 3041656 3113153 3185467 3258394 3332560 3407626 3481630 3552365 3618275 3677327
59804C677327M8979L6160K2793J0444m54q786j2691j1977q619m064K230J1044
$$ 3677327 3726306 3762466 3785259 3795703 3795249 3786463 3773772 3761795 3753176 3749112 3751342 3762386
59792C762386K1879L4077M7818O3228P9868R7872J18308J41708J67547J95709
$$ 3762386 3784265 3818342 3866160 3929388 4009256 4107128 4225436 4367144 4534691 4730400
59782D730400K27196K62693L01658L43299L86936M30434M68969M95507N01501
$$ 4730400 4957596 5220289 5521947 5865246 6252182 6682616 7151585 7647092 8148593
59773H148593M77762M17605L21499J98667O4083o5905j76958k60016l13543l41799
$$ 8148593 8626355 9043960 9365459 9564126 9628209 9562304 9385346 9125330 8811787 8469988
59763H469988l50089l42347l22576k95780k66062k35374k04894j76033j49175
$$ 8469988 8119899 7777552 7454976 7159196 6893134 6657760 6452866 6276833 6127658
59754F127658j23241r7750p3864n2427l2508j2987N870K3645M1119N9063P6947
$$ 6127658 6004417 5906667 5832803 5780376 5747868 5734881 5740751 5764396 5805515 5864578 5941525
59743E941525R4252J11967J31396J52401J74115J96626K20694K46545K74159L04135
$$ 5941525 6035777 6147744 6279140 6431541 6605656 6802282 7022976 7269521 7543680 7847815
59733G847815L37155L72998M11021M51138M93423N37146N80938O23408O62938
$$ 7847815 8184970 8557968 8968989 9420127 9913550 10450696 11031634 11655042 12317980
59724A2317980O97117P22955P37481P38245P24109O96148O57385O11720N63676
$$ 12317980 13015097 13738052 14475533 15213778 15937887 16634035 17291420 17903140 18466816
59715A8466816N18849M83087M60549M53068M61175M84296N19740N62848O08679
$$ 18466816 18985665 19468752 19929301 20382369 20843544 21327840 21847580 22410428 23019107
59706B3019107O52619O89295P12506P17006O99514O57859N90798M99651L89097
$$ 23019107 23671726 24361021 25073527 25790533 26490047 27147906 27738704 28238355 28627452
59697B8627452K65875J37480J2199j01522j96995k70350l19635l44188l45084
$$ 28627452 28893327 29030807 29043006 28941484 28744489 28474139 28154504 27810316 27465232
59688B7465232l24803k85730k29800j59584p8246J2023J10267K15318L25628M40702
$$ 27465232 27140429 26854699 26624899 26465315 26387069 26399092 26509359 26724677 27050305 27491007
59678B7491007N60830O84566Q07802R25659J033442J124848J190713J220452J203689
$$ 27491007 28051837 28736403 29544205 30469864 31503306 32628154 33818867 35039319 36243008
59669C6243008J130686R94022P92349N32669K29209r8568m27305p32845r95237
$$ 36243008 37373694 38367716 39160065 39692734 39921943 39823375 39396070 38663225 37667988
59660C7667988j201636j345412j425193j445792j417485j352046j259758j150618
$$ 37667988 36466352 35120940 33695747 32249955 30832470 29480424 28220666 27070048
59652B7070048j036376r29874q43289p87392p69752p90807q41585r06425r68270
$$ 27070048 26033672 25103798 24260509 23473117 22703365 21912558 21070973 20164548 19196278
59643A9196278j012980j032284j025315r96709r52075q95643q31661p65134o99670
$$ 19196278 18183298 17151014 16125699 15128990 14176915 13281272 12449611 11684477 10984807
59634A0984807o36246n75452n19216m68944m23716l81978l43647l09093k77544
$$ 10984807 10348561 9773109 9253893 8784949 8361233 7979255 7635608 7326515 7048971
59625G048971k48139k21244j97192j75029j53928j34565j17560j01947q6884p3634
$$ 7048971 6800832 6579588 6382396 6207367 6053439 5918874 5801314 5699367 5612483 5538849
59615E538849o4091n8316n5176n4388n6234o0141o5223p1559p9467q8167r6404
$$ 5538849 5474758 5416442 5361266 5306878 5250644 5190503 5125280 5053721 4974254 4886087 4789683
59604D789683j03589j09194j12061j11596j08782j04773r9530r2846q5482p7940
$$ 4789683 4686094 4576900 4464839 4353243 4244461 4139688 4040158 3947312 3861830 3783890
59594C783890o9462n9722n0199m2247l4982k6828j8102j0260l496L051R380J4688
$$ 3783890 3714428 3654706 3604507 3562260 3527278 3500450 3482348 3472088 3468592 3471643 3481023 3495711
59582C495711J8876K2465K5511K7821K9662L1078L1309L0111K8807K8909L0476
$$ 3495711 3514587 3537052 3562563 3590384 3620046 3651124 3682433 3712544 3741351 3770260 3800736
59571C800736L3021L6884M2444M8992N5834O3509P2722Q3011R3759J05389J18249
$$ 3800736 3833757 3870641 3913085 3962077 4017911 4081420 4154142 4237153 4330912 4436301 4554550
59560D554550J31553J44822J59125J75404J92801K10197K28106K47335K66969
$$ 4554550 4686103 4830925 4990050 5165454 5358255 5568452 5796558 6043893 6310862
59551F310862K85446L02408L17760L30084L37940L41612L41728L37253L26951
$$ 6310862 6596308 6898716 7216476 7546560 7884500 8226112 8567840 8905093 9232044
59542I232044L11825K94160K74904K53930K32012K10735J91191J74142J60172
$$ 9232044 9543869 9838029 10112933 10366863 10598875 10809610 11000801 11174943 11335115
59533A1335115J47847J33511J15506R7525Q5421Q1535Q4272R1635J01920J11577
$$ 11335115 11482962 11616473 11731979 11829504 11914925 11996460 12080732 12172367 12274287 12385864
59523A2385864J15773J11399R7479P2978L6840r877o4197j23562j85929k47930
$$ 12385864 12501637 12613036 12710515 12783493 12820333 12810456 12746259 12622697 12436768 12188838
59513A2188838l05346l55511l97384m29592m50660m61074m62927m57560m45453
$$ 12188838 11883492 11527981 11130597 10701005 10250345 9789271 9326344 8868784 8423331
59504H423331m28029m07252l83573l56488l27146k98086k70388k43223k16301
$$ 8423331 7995302 7588050 7204477 6847989 6520843 6222757 5952369 5709146 5492845
59495E492845j90612j66622j43849j22505j03478q6455o9912n3211l6989k1400
$$ 5492845 5302233 5135611 4991762 4869257 4765779 4679324 4609412 4556201 4519212 4497812
59485D497812n792R903K5288M0966N8049P6188R4060J11731J30610J51019J71762
$$ 4497812 4492020 4501923 4527211 4568177 4626226 4702414 4796474 4908205 5038815 5189834 5361596
59474E361596J92123K12342K32079K50355K66890K81465K91956K95172K89732
$$ 5361596 5553719 5766061 5998140 6248495 6515385 6796850 7088806 7383978 7673710
59465G673710K76024K53428K20111J75944J23335O4834K223o1519j21870j75556
$$ 7673710 7949734 8203162 8423273 8599217 8722552 8787386 8789609 8728090 8606220 8430664
59455H430664k21891k60722k90897l11516l23017l26291l22253l12754l00180
$$ 8430664 8208773 7948051 7657154 7345638 7022621 6696330 6374077 6061323 5761143
59446E761143k85540k68455k49408k30301k12330j94957j77550j60476j44180
$$ 5761143 5475603 5207148 4957740 4727439 4515109 4320152 4142602 3982126 3837946
59437C837946j28700j14446j01949r0569p9006o7332n6872m8002l9727l1583k4057
$$ 3837946 3709246 3594800 3492851 3402282 3323276 3255944 3199072 3151070 3111343 3079760 3055703
59426C055703j7017r684k340L861Q982J4142J9181K2773K5048K7728L1166L3806
$$ 3055703 3038686 3029002 3026662 3030523 3039505 3053647 3072828 3095601 3120649 3148377 3179543 3213349
59414C213349L5186L6938M0098M4027M8818N5648O3144O6394O2212N3676M7323
$$ 3213349 3248535 3285473 3325571 3369598 3418416 3474064 3537208 3603602 3665814 3719490 3766813
59403C766813M7179N3311O4358P8912R5371J12912J32426J54656J77552J97232
$$ 3766813 3813992 3867303 3931661 4010573 4105944 4218856 4351282 4505938 4683490 4880722
59393D880722K11956K24306K39312K60927K90088L25344L64837M07470M52216
$$ 4880722 5092678 5316984 5556296 5817223 6107311 6432655 6797492 7204962 7657178
59384G657178M97063N39447N77202O08034O28702O36290O30270O12019N82619
$$ 7657178 8154241 8693688 9270890 9878924 10507626 11143916 11774186 12386205 12968824
59375A2968824N42731M94605M42273L89293L37670K88924K44400K04027J66307
$$ 12968824 13511555 14006160 14448433 14837726 15175396 15464320 15708720 15912747 16079054
59366A6079054J29981R4254N7347J6680k8846p8207j30036j83206k35137k81460
$$ 16079054 16209035 16303289 16360636 16377316 16348470 16270263 16140227 15957021 15721884 15440424
59356A5440424l18252l43487l56252l56587l46857l31480l14357k97829k84321
$$ 15440424 15122172 14778685 14422433 14065846 13718989 13387509 13073152 12775323 12491002
59347A2491002k76923k77278k84373k96200l11162l27204l41365l51360l56494
$$ 12491002 12214079 11936801 11652428 11356228 11045066 10717862 10376497 10025137 9668643
59338I668643l56412l50494l39017l23394l04480k82169k57334k32464k09429
$$ 9668643 9312231 8961737 8622720 8299326 7994846 7712677 7455343 7222879 7013450
59329G013450j88037j67654j48781j32128j17579j05053r5227q8421q3863q0763
$$ 7013450 6825413 6657759 6508978 6376850 6259271 6154218 6058991 5970570 5886707 5805944
59319E805944p9074p8707p9154q0321q2440q4736q5655q4786q3066q0818p7290
$$ 5805944 5726870 5648163 5569009 5488688 5406248 5321512 5235857 5151071 5068005 4987187 4909897
59308D909897p2539o7880o3724n8780n2180m4762l7506l0325k3133j6376r772
$$ 4909897 4837358 4769478 4705754 4646974 4594794 4550032 4512526 4482201 4459068 4442692 4432920
59297D432920k200O453J4966K3004L1829M2064N2706O3179P4416Q6903R9557J11664
$$ 4432920 4430720 4437173 4452139 4475143 4506972 4549036 4601742 4664921 4739337 4826240 4925797 5037461
59285E037461J24097J37423J50551J62509J73894J85289J95768K04106K09906
$$ 5037461 5161558 5298981 5449532 5612041 5785935 5971224 6166992 6371098 6581004
59276F581004K12477K10092K01621J87397J67621J41563J09492P3733L6619j048
$$ 6581004 6793481 7003573 7205194 7392591 7560212 7701775 7811267 7885000 7921619 7920571
59266G920571l8503p3998j06676j37782j68201j95991k17745k31434k36904k34951
$$ 7920571 7882068 7808070 7701394 7563612 7395411 7199420 6981675 6750241 6513337 6278386
59256F278386k27201k15771k01952j85997j68596j51075j33747j15725r7026p8995
$$ 6278386 6051185 5835414 5633462 5447465 5278869 5127794 4994047 4878322 4781296 4702301
59246D702301o1992m4689k6424q108J0071K9513N0701P2220R3567J16554J42417
$$ 4702301 4640309 4595620 4569196 4561088 4571159 4600672 4651373 4723593 4817160 4933714 5076131
59235E076131J69929J97981K27768K60458K94814L28990L62566L94765M22456
$$ 5076131 5246060 5444041 5671809 5932267 6227081 6556071 6918637 7313402 7735858
59226G735858M42053M51663M49524M32447L98138L47575K83071K05759J17205
$$ 7735858 8177911 8629574 9079098 9511545 9909683 10257258 10540329 10746088 10863293
59217A0863293K1861p4531j67764k54444l30140l90762m34885m62926m75272m73178
$$ 10863293 10885154 10810623 10642859 10388415 10058275 9667513 9232628 8769702 8294430 7821252
59207G821252m59971m39123m12244l80679l47451l15311k84196k52995k22556
$$ 7821252 7361281 6922158 6509914 6129235 5781784 5466473 5182277 4929282 4706726
59198D706726j94805j70089j47719j28010j11449r6940q3177p0825o1157n3549
$$ 4706726 4511921 4341832 4194113 4066103 3954654 3857714 3774537 3703712 3642555 3589006
59188C589006m6515m0218l5571l1770k7110k1587j6529j2211p856l372R10N470
$$ 3589006 3542491 3502273 3466702 3434932 3407822 3386235 3369706 3357495 3349639 3346267 3347177 3352647
59176C352647J0700J5544J8832K1097K3352K5128K5658K5735K6245K5996K3321
$$ 3352647 3363347 3378891 3397723 3418820 3442172 3467300 3492958 3518693 3544938 3570934 3594255
59165C594255J8924J4795J1149O709J290m162r387j4520j8738k1306k3246k5797
$$ 3594255 3613179 3627974 3639123 3645832 3647122 3642960 3633573 3619053 3600315 3579009 3555763 3529966
59153C529966k8071k8395k7087k5697k4264k1741j8370j5261j2283q718n308l251
$$ 3529966 3501895 3473500 3446413 3420716 3396452 3374711 3356341 3341080 3328797 3320079 3314771 3311520
59141C311520j798P07M057O922R742J4180K0119K5854L1032L6907M3778N0701
$$ 3311520 3309722 3310429 3314486 3321408 3331150 3345330 3365449 3391303 3422335 3459242 3503020 3553721
59129C553721N7706O5887P5194Q4337R3054J02329J12396J22464J32439J43016
$$ 3553721 3611427 3677314 3752508 3836845 3929899 4032228 4144624 4267088 4399527 4542543
59119D542543J54045J64616J74566J84183J92844J99794K05842K12274K18492
$$ 4542543 4696588 4861204 5035770 5219953 5412797 5612591 5818433 6030707 6249199
59110F249199K22611K23785K21786K14772J99917J76046J43605J02537N2732l549
$$ 6249199 6471810 6695595 6917381 7132153 7332070 7508116 7651721 7754258 7806990 7803441
59100G803441o2084j19477j73516k21106k58623k84755l00958l08881l09304l03628
$$ 7803441 7741357 7621880 7448364 7227258 6968635 6683880 6382922 6074041 5764737 5461109
59090E461109k94229k82769k69686k55438k40685k25459k09587j93772j78808
$$ 5461109 5166880 4884111 4614425 4358987 4118302 3892843 3683256 3489484 3310676
59081C310676j64275j49617j35671j23429j12168j00936r0807q3277p7240p0284
$$ 3310676 3146401 2996784 2861113 2737684 2625516 2524580 2433773 2350496 2273256 2202972
59071B202972o2362n5473n0182m5134l9760l4641k9433k3170j6571j1290o979
$$ 2202972 2140610 2085137 2034955 1989821 1950061 1915420 1885987 1862817 1846246 1834956 1827977
59060A827977j798M135Q695J1199J2990J4300J3450R723M385j808r569j8835k7895
$$ 1827977 1826179 1830314 1839009 1850208 1863198 1877498 1890948 1900671 1905056 1903248 1893679 1874844 1846949
59047A846949l5366m1035m4460m4954m3281m1080l8393l4047k8620k4394k2022
$$ 1846949 1811583 1770548 1726088 1681134 1637853 1596773 1558380 1524333 1495713 1471319 1449297
59036A449297j9824j6834j3862j1052p170k180K129N046Q005J1768J4921J6268
$$ 1449297 1429473 1412639 1398777 1387725 1380555 1378375 1380504 1385550 1393555 1405323 1420244 1436512
59024A436512J6469J6152J4526J1144P239M085J591n31j807k063j944j570j30
$$ 1436512 1452981 1469133 1483659 1494803 1502042 1506127 1507718 1507187 1505380 1503317 1501373 1499803 1499673
59011A499673K595N706Q612J1518J4218J5993J7020J8228J9426J9229J7083J3867
$$ 1499673 1502268 1507974 1516586 1528104 1542322 1558315 1575335 1593563 1612989 1632218 1649301 1663168
58999A663168J0328O596L193P48j240l576n471n525m228l306k787j201J442L476
$$ 1663168 1673496 1680092 1683285 1684033 1682793 1679217 1673746 1668221 1663993 1660687 1657900 1656699 1658141 1661617
58985A661617M521N906Q026R839J1259J3289J5522J6350J6155J7378K0764K4330
$$ 1661617 1666138 1672044 1680070 1689909 1701168 1714457 1729979 1746329 1762484 1779862 1800626 1824956
58973A824956K6823K9341L2647L5779L8394M1816M6472N0830N4043N7198O0673
$$ 1824956 1851779 1881120 1913767 1949546 1987940 2029756 2076228 2127058 2181101 2238299 2298972
58962B298972O2683O1761N8646N4497M9430M3906L9353L6289L3807L1959L2436
$$ 2298972 2361655 2423416 2482062 2536559 2585989 2629895 2669248 2705537 2739344 2771303 2803739
58951B803739L5948M1071M6656N3088O0269O6838P2614P9468Q8446R8291J07972
$$ 2803739 2839687 2880758 2927414 2980502 3040771 3107609 3180223 3259691 3348137 3446428 3554400
58940C554400J18322J29902J41563J52717J64768J78767J93693K08672K24862
$$ 3554400 3672722 3802624 3944187 4096904 4261672 4440439 4634132 4842804 5067666
58931E067666K43537K64136K85942L09978L37534L68237M01060M36036M73766
$$ 5067666 5311203 5575339 5861281 6171259 6508793 6877030 7278090 7714126 8187892
58922H187892N14343N57603O03208O49812O95564P39815P82429Q20944Q50375
$$ 8187892 8702235 9259838 9863046 10512858 11208422 11948237 12730666 13551610 14401985
58913A4401985Q66305Q66042Q46320Q02513P31518O33603N10814L66014K04587
$$ 14401985 15268290 16134332 16980652 17783165 18514683 19148286 19659100 20025114 20229701
58904B0229701L4929j34052k94580m39297n61866o59417p32350p81309q06845
$$ 20229701 20264630 20130578 19835998 19396701 18834835 18175418 17443068 16661759 15854914
58895A5854914q12227q03139p83254p53039p13889o70069o25008n78925n31922
$$ 15854914 15042687 14239548 13456294 12703255 11989366 11319297 10694289 10115364 9583442
58886I583442m86384m44321m05242l68847l37155l11655k90844k72795k57842
$$ 9583442 9097058 8652737 8247495 7878648 7541493 7229838 6938994 6666199 6408357
58877F408357k46455k36828k26897k16692k06536j95057j81325j67067j54372
$$ 6408357 6161902 5925074 5698177 5481485 5274949 5079892 4898567 4731500 4577128
58868D577128j42853j31105j19287j08201r7548q7027p7616o9865o2528n4548
$$ 4577128 4434275 4303170 4183883 4075682 3978134 3891107 3813491 3743626 3681098 3626550
58858C626550m6738l9967l3545k6892k0849j5719j0156l620K358P087J2553K0253
$$ 3626550 3579812 3539845 3506300 3479408 3458559 3442840 3432684 3429064 3431422 3438509 3451062 3471315
58846C471315K8612L5636M2056M9452N7398O4856P2516Q1397R0715R9415J08208
$$ 3471315 3499927 3535563 3577619 3627071 3684469 3749325 3821841 3903238 3993953 4093368 4201576
58835D201576J18013J28218J38452J50247J64768J80682J96431K12861K31444
$$ 4201576 4319589 4447807 4586259 4736506 4901274 5081956 5278387 5491248 5722692
58826E722692K51688K72672K95509L21967L52056L85012M21143M60772N02878
$$ 5722692 5974380 6247052 6542561 6864528 7216584 7601596 8022739 8483511 8986389
58817H986389N46646N92681O40837O88579P33279P74024Q09160Q34083Q43621
$$ 8986389 9533035 10125716 10766553 11455132 12188411 12962435 13771595 14605678 15449299
58808A5449299Q34737Q04839P49920O67091N57490M24690K72405J06210o4599
$$ 15449299 16284036 17088875 17838795 18505886 19063376 19488066 19760471 19866681 19802082
58799A9802082k29926l82589n17423o29204p14470p73889q10331q25961q23231
$$ 19802082 19572156 19189567 18672144 18042940 17328470 16554581 15744250 14918289 14095058
58790A4095058q06648p80782p47985p10123o70535o31709n92971n53141n13682
$$ 14095058 13288410 12507628 11759643 11049520 10378985 9747276 9154305 8601164 8087482
58781H087482m76702m41779m07677l75250l45828l18463k91833k67284k46929
$$ 8087482 7610780 7169001 6761324 6386074 6040246 5721783 5429950 5162666 4915737
58772D915737k30218k15201k01749j90532j80238j68929j57034j46219j36362
$$ 4915737 4685519 4470318 4268569 4078037 3897799 3728870 3571836 3425617 3289255
58763C289255j26280j16279j07332r8904r0051q1488p4236o7616o0804n4738n0200
$$ 3289255 3162975 3046696 2939364 2840460 2750409 2668921 2594685 2527069 2466265 2411527 2361327
58752B361327m5813m0426l5572l2895l1128k8411k5588k4280k3696k2433k1456
$$ 2361327 2315514 2275088 2239516 2206621 2175493 2147082 2121494 2097214 2073518 2051085 2029629
58741B029629k2115k3085k2649k2075k3300k5127k5351k4877k5901k7584k7491
$$ 2029629 2007514 1984429 1961780 1939705 1916405 1891278 1865927 1841050 1815149 1787565 1760074
58730A760074k6041k5617k6372k6690k6802k8149l0065l0752l0707l1638l2877
$$ 1760074 1734033 1708416 1682044 1655354 1628552 1600403 1570338 1539586 1508879 1477241 1444364
58719A444364l2379l0427k8840k7471k5004k2276k1184k1072j9818j7630j6328
$$ 1444364 1411985 1381558 1352718 1325247 1300243 1277967 1256783 1235711 1215893 1198263 1181935
58708A181935j5760j4479j3023j2872j3064j1578r196q230q343p551o461p338
$$ 1181935 1166175 1151696 1138673 1125801 1112737 1101159 1091963 1083733 1075390 1067839 1061378 1054040
58696A054040r696j1005j1257j2603j4759j5064j3180j1612j1401j1086j0186
$$ 1054040 1044344 1033339 1022082 1009479 994720 979656 966476 954864 943463 932377 922191
58685I22191r853r875q674o628n911o674o716n208l563k456j112L53R39J091K090
$$ 922191 912338 902463 893789 887161 881250 874576 867860 862652 859089 856633 855521 855874 856813 857904 859994
58670H59994L308L079J970K060L352M094M340N839Q580J0645J1298J1226J0154
$$ 859994 863302 866381 868351 870411 873763 877857 882197 888036 896616 907261 918559 929785 939939
58657I39939P436M505L545M183M510M609N821P497Q050Q322J0201J2777J3725
$$ 939939 947375 951880 955425 959608 964118 968727 974548 982045 990095 998417 1008618 1021395 1035120
58644A035120J3683J5118J7732J9243K0094K2883K7482L1243L3854L7538M2395
$$ 1035120 1048803 1063921 1081653 1100896 1120990 1143873 1171355 1202598 1236452 1273990 1316385
58633A316385M6067M8281N1483N6592O2168O8036P5767Q5392R5411J06045J18689
$$ 1316385 1362452 1410733 1462216 1518808 1580976 1649012 1724779 1810171 1905582 2011627 2130316
58622B130316J32459J45411J58804J75641J95218K13706K29983K45951K60921
$$ 2130316 2262775 2408186 2566990 2742631 2937849 3151555 3381538 3627489 3888410
58613C888410K70613K72307K66118K50640K22373J80808J29774P2851J1674n0427
$$ 3888410 4159023 4431330 4697448 4948088 5170461 5351269 5481043 5553894 5565568 5515141
58603E515141j07663j55985j94468k22145k37686k42722k41231k35013k23690
$$ 5515141 5407478 5251493 5057025 4834880 4597194 4354472 4113241 3878228 3654538
58594C654538k09175j95349j82819j68823j52992j38422j26267j14253j01561
$$ 3654538 3445363 3250014 3067195 2898372 2745380 2606958 2480691 2366438 2264877
58585B264877r0381q1484p2975o4564n8393n4443m9881m4136l9982l8264l6366
$$ 2264877 2174496 2093012 2020037 1955473 1897080 1842637 1792756 1748620 1708638 1670374 1634008
58574A634008l3219l1072l0728k9829k7363k5313k4290k2142j8502j6107j5980
$$ 1634008 1600789 1569717 1538989 1509160 1481797 1456484 1432194 1410052 1391550 1375443 1359463
58563A359463j5773j4473j4163j5556j6394j5893j6222j7965j8749j7936j7911
$$ 1359463 1343690 1329217 1315054 1299498 1283104 1267211 1250989 1233024 1214275 1196339 1178428
58552A178428j9074j8433j5120j2389j2151j2205j0990j0243j0808j0561q814
$$ 1178428 1159354 1140921 1125801 1113412 1101261 1089056 1078066 1067823 1057015 1046454 1037640
58541A037640q190r781j0912r969r027r459r385p729o454o551o143m631m285n752
$$ 1037640 1029450 1019669 1008757 998788 989761 980302 970917 963188 956734 950183 944040 939409 935124 929372
58527I29372o518n821o346q951j0607r838r252j0307j0491q420o799p430p952
$$ 929372 922854 917033 910687 901736 891129 881291 872039 861732 851241 842821 836022 828592 820640
58514H20640o426m686m357l891k254j265j669j215R64K464K330L007N319O404
$$ 820640 814214 809528 805171 801280 799026 797761 796092 794877 795841 798305 800635 803642 808961 815365
58500H15365N032M075N126N700M330L398M171M178K273J138J950J856m15j865
$$ 815365 820397 824472 829598 835298 839628 843026 847197 851375 853648 854786 856736 858592 858177 856312
58486H56312j053j116l682n503m547l826n497o720n251l726m418n065l913l587
$$ 856312 855259 854143 850461 844958 840411 836585 831088 824368 819117 815391 810973 805908 801995 798408
58472G98408n790p411o111m666n534o328m967m040n583o684m859k851l426m311
$$ 798408 792618 785207 779096 774430 768896 762568 757601 753561 747978 741294 736435 733584 730158 725847
58458G25847k958j434j958k363o44P53k52j052P05K628K475K506M527N830M612
$$ 725847 722889 721455 719497 717134 716490 717243 716991 715939 716644 719272 721747 724253 728780 734610 739222
58443G39222M110O530Q357O741N055O679Q751P687N705N994O407L916N71p11j699
$$ 739222 743332 749862 758219 764960 770015 776694 785445 793132 798837 804831 811238 815154 815725 815014 813315
58428H13315m501o570n620m718o696q388o311l194k772l054q61J693J574R33K663
$$ 813315 808814 802244 796624 791906 785210 776822 770511 767317 764545 761491 760630 762323 763897 764830 767493
58413G67493M438L448K388M445P042O877O392Q679J0850R152O072N486N439K559
$$ 767493 771931 775379 777767 782212 789254 796131 802523 811202 822052 831204 837276 842762 848201 850760
58399H50760q81j279o40k303m166l012j143j833k677l90K376J931O58K187M216
$$ 850760 849879 848600 847960 845657 841491 838479 837336 835503 832826 832436 834812 836743 837401 839588 843804
58384H43804L209J446K199K910N15j575N03L278K126j7J832N471O274O036Q530
$$ 843804 847013 848459 850658 853568 854083 852508 853011 856289 858415 858398 860230 865701 871975 878011 886541
58369H86541J1138R739P251Q404J0677R298O638P504R744Q675O403P386R260P485
$$ 886541 897679 907418 914669 923073 933750 943048 949686 957190 966934 975609 982012 989398 998658 1006143
58355A006143M678N798Q531P996O469Q521J1201R125M914M293N294K758q40J79
$$ 1006143 1010821 1016619 1025150 1033146 1039615 1048136 1059337 1068462 1073376 1077669 1082963 1085721 1084881 1085060
58341A085060L633L677J988L899P425P090M767N844Q532P920O495R408J3623J3163
$$ 1085060 1088693 1092370 1094358 1098257 1105682 1112772 1117539 1123383 1131915 1139835 1146330 1155738 1169361 1182524
58327A182524J0762J2610J6009J4485J0748J1944J6152J6448J4348J6157J9830
$$ 1182524 1193286 1205896 1221905 1236390 1247138 1259082 1275234 1291682 1306030 1322187 1342017
58316A342017J8865J5529J6766K0415J9198J4853J4526J6599J4209R511R975J3694
$$ 1342017 1360882 1376411 1393177 1413592 1432790 1447643 1462169 1478768 1492977 1502488 1512463 1526157
58304A526157J2912R128J0044J4403J4769J2470J4695J9589J9528J6425J8311
$$ 1526157 1539069 1548197 1558241 1572644 1587413 1599883 1614578 1634167 1653695 1670120 1688431
58293A688431K3496K3892K1195K3580K9026K8634K4083K4907L0636L2468L0540
$$ 1688431 1711927 1735819 1757014 1780594 1809620 1838254 1862337 1887244 1917880 1950348 1980888
58282A980888L2494L7144L6828L3754L6557M3027M3930M1190M4099N0485N0572
$$ 1980888 2013382 2050526 2087354 2121108 2157665 2200692 2244622 2285812 2329911 2380396 2430968
58271B430968M6487M8217N3345N1272M4647M5400N2104N3083M9545N3024O1977
$$ 2430968 2477455 2525672 2579017 2630289 2674936 2720336 2772440 2825523 2875068 2928092 2990069
58260B990069O4228O0934O4348P3278P5092P0856P3538Q2353Q4392Q0886Q5477
$$ 2990069 3054297 3115231 3179579 3252857 3327949 3398805 3472343 3554696 3639088 3719974 3805451
58249C805451R7002J01084R8338J03316J15600J20531J18681J25179J39436J45856
$$ 3805451 3902453 4003537 4101875 4205191 4320791 4441322 4560003 4685182 4824618 4970474
58239D970474J45116J53494J70454J79135J79868J89860K08673K18758K21462
$$ 4970474 5115590 5269084 5439538 5618673 5798541 5988401 6197074 6415832 6637294
58230F637294K36155K62040K78595K85861L04973L36380L58683L71780L98218
$$ 6637294 6873449 7135489 7414084 7699945 8004918 8341298 8699981 9071761 9469979
58221I469979M38433M69495M91919N30797N86440O33348O72424P32007Q12624
$$ 9469979 9908412 10377907 10869826 11400623 11987063 12620411 13292835 14024842 14837466
58212A4837466Q86139R54628J050978J175992J298532J423712J592509J807907
$$ 14837466 15723605 16678233 17729211 18905203 20203735 21627447 23219956 25027863
58204B5027863K036479K290188K625227L052800L541912M118995M863659N796267
$$ 25027863 27064342 29354530 31979757 35032557 38574469 42693464 47557123 53353390
58196E3353390O884050Q170631R774677J1760405J4170597J7188601K1058013
$$ 53353390 60237440 68408071 78182748 89943153 104113750 121302351 142360364
58189A42360364K5822378L1367864L7588636M3813921M7701811M5459837L4414966
$$ 142360364 168182742 199550606 237139242 280953163 328654974 374114811 408529777
58182D08529777J5845114n139035k2870903l4336868l9630699m0330934l8085589
$$ 408529777 424374891 419235856 396364953 362028085 322397386 282066452 243980863
58175B43980863l4255521k9900656k5647187k1719357j8208661j5208716j2722059
$$ 243980863 209725342 179824686 154177499 132458142 114249481 99040765 86318706
58168H6318706j0643128q894256p465494o312507n338397m493047l787087l199885
$$ 86318706 75675578 66781322 59315828 53003321 47664924 43171877 39384790 36184905
58160C6184905k669079k173511j736164j344496r49706n36649j14457L46783Q91458
$$ 36184905 33515826 31342315 29606151 28261655 27311949 26775300 26660843 27007626 27899084
58151B7899084J518110K218341K999742L718567L936704L176106J419692p52649
$$ 27899084 29417194 31635535 34635277 38353844 42290548 45466654 46886346 46133697
58143D6133697k604469l749920m221417m215420l914236l472782l010818k578392
$$ 46133697 43529228 39779308 35557891 31342471 27428235 23955453 20944635 18366243
58135A8366243k179416j826625j538023j303274j099385r26020p91618o83141
$$ 18366243 16186827 14360202 12822179 11518905 10419520 9493500 8701882 8018741
58127H018741n82161m93608m29542l81796l36804k99669k78947k65117k46931
$$ 8018741 7436580 6942972 6513430 6131634 5794830 5495161 5216214 4951097 4704166
58118D704166k31454k26487k21032k03844j83734j71670j60310j40506j20666
$$ 4704166 4472712 4246225 4025193 3821349 3637615 3465945 3305635 3165129 3044463
58109C044463j10489j02252q7084p3771p2945p7759p7692p6849q1613q4743p8556
$$ 3044463 2933974 2831722 2744638 2670867 2597922 2520163 2442471 2365622 2284009 2199266 2120710
58098B120710p0301o8507o7378n9751n2171n2041n2894m7194m1041m1781m3444
$$ 2120710 2050409 1981902 1914524 1854773 1802602 1750561 1697667 1650473 1609432 1567651 1524207
58087A524207l8682l3004l3313l4180k9274k4707k7395l1290k8697k4403k5535
$$ 1524207 1485525 1452521 1419208 1385028 1355754 1331047 1303652 1272362 1243665 1219262 1193727
58076A193727k7784k4698k0577k1519k3301k0245j6647j7752j8870j4868j0819
$$ 1193727 1165943 1141245 1120668 1099149 1075848 1055603 1038956 1021204 1002334 987466 976647
58065I76647j2063j3344r107m847o829j0053q026n160p805j1839j0928q744j1305
$$ 976647 964584 951240 942133 937286 930457 920404 912378 907218 899413 887574 876646 867902 856597
58052H56597j5098j4192j1519j2207j3114r720n977o764q002m613q43k219m674
$$ 856597 841499 827307 815788 803581 790467 780747 774770 768006 760004 755391 754548 752329 747655
58039G47655k293J374L96k101k90L176K870J147K631M301J456k419j825M19r82
$$ 747655 745362 746736 747132 745031 744741 747917 750787 751934 754565 758866 760322 757903 756078 756497 755515
58024G55515l488k195J05j583m360k921J01p58l340k483k17j481m216l582j709
$$ 755515 752027 749832 749937 748354 743994 741073 741174 740416 737076 734593 734376 732895 728679 725097 723388
58009G23388l503o845o571m352n099p254o079l120l169m962l960j346j536l657
$$ 723388 719885 713040 706469 702117 697018 689764 683685 680565 677396 672434 668474 667128 665592 661935
57995F61935l845l074m507o167m398j493j820l556k344J76l21k252j179J548J545
$$ 661935 658090 655016 650509 644342 639944 638451 636631 633075 630731 630907 630586 628334 627155 628703 630248
57980F30248m8R36L259K621J31K25K328K422R54J348K663J327j566k131r85j602
$$ 630248 630200 631136 634395 637016 637147 637372 639700 642122 643076 644424 647087 648414 646848 644717 643732 642130
57964F42130l309k960j547k185l625k748j241k719n491n365l415l621n023l715
$$ 642130 638821 635861 634314 632129 628504 625756 624515 621796 616305 610940 607525 603904 598881 595166
57950E95166o27K35m66R76L582L289Q59O57K533K412J53n27O47L29j771k751k617
$$ 595166 594539 594774 594308 595284 598866 602155 603014 603671 606204 608616 608769 608242 608889 609218 607447 604696 602079
57933F02079m032o416o697n377n770p729q222p417q123r879r617p513o392o069
$$ 602079 598047 591631 584934 579557 573787 566058 557836 550419 542296 532417 522800 515287 508895 502826
57919E02826m127j380o91j308k38J770J621J88J083M021N521N369O327Q216Q437
$$ 502826 498699 497319 496628 495320 495082 496852 498473 498661 499744 503765 509286 514655 520982 529198 537635
57904E37635P556Q273R618Q395N571M997O401O093L992L477M573L866J119m30
$$ 537635 545191 553464 563082 571477 577048 582045 588446 594539 598531 602008 606581 610447 611566 611136
57890F11136m29j738m330n083l933m063n686n651l664k867l747l431j593j176
$$ 611136 610707 608969 604639 599556 595623 591560 585874 580223 576559 573692 569945 566514 564921 563745
57876E63745k557k711j018l08j365j663l55P12J450L705O566O841M765L953N129
$$ 563745 561188 558477 557459 557151 555786 554123 553768 554480 555930 559635 566201 573042 577807 581760 586889
57861E86889N294L611K658L133K766J237Q61J603P21j820k886j936j864l355l716
$$ 586889 592183 595794 598452 601585 604351 605588 606449 608052 608773 606953 604067 602131 600267 596912 593196
57846E93196k396k166l649l982k169p57r09p87J6m95k194k351q70q81k950l896
$$ 593196 590800 588634 584985 581003 578834 578077 577168 576381 576397 575902 573708 571357 570487 569606 566656 562760
57830E62760k735k489m506o165o073o432q301r342q396p714q528q861p685o987
$$ 562760 560025 557536 553030 546865 540792 534360 526059 516717 508321 500607 492079 483218 475533 468546
57816D68546p652p503n456l634l489l607l027k943l626l453k338k211k997k252
$$ 468546 460894 453391 447935 444301 440812 437205 434178 431235 427609 424156 421818 419607 416610 414358
57802D14358J98J578J285J948M177N078L709L071M762O354O270O545Q437R646
$$ 414358 414556 416134 417419 419367 423544 428622 432331 435402 440164 446518 452788 459333 467770 477416
57788D77416Q541O985O596O070M463L282L078J882p91k302j410m87j207j992j897
$$ 477416 485957 492942 499538 505608 510071 513353 516431 518313 517522 515220 513810 513323 512116 510124 508227
57773E08227k747n067o087m457k897l452m079k751j069p28j51K170M352M360L454
$$ 508227 505480 500413 494326 489869 486972 483520 479441 476690 475621 474893 474742 476912 481264 485624 489078
57758D89078L389L303K240J792L204M671M398L674M136M723M069L328L914M922
$$ 489078 492467 495770 498010 499802 503006 507677 512075 515749 519885 524608 528677 532005 535919 540841
57744E40841N264N908P527Q497P665O636O970P640P424P239P883Q093P067O323
$$ 540841 546105 552013 559540 568037 575702 582338 589308 596948 604372 611611 619494 627587 634654 640977
57730F40977O907P453P026P097Q584R861R850J0158J1891J3407J3492J3749J5430
$$ 640977 647884 655337 662363 669460 678044 687905 697755 707913 719804 733211 746703 760452 775882
57717G75882J7089J7748J9197K2540K5661K6907K8047L0642L2847L2991L3208
$$ 775882 792971 810719 829916 852456 878117 905024 933071 963713 996560 1029551 1062759
57706A062759L5976L9936M2741M5384N0061N6137O1854O7941P5951Q5029R3820
$$ 1062759 1098735 1138671 1181412 1226796 1276857 1332994 1394848 1462789 1538740 1623769 1717589
57695A717589J03615J16193J30359J44064J58136J74477J92155K08624K23350
$$ 1717589 1821204 1937397 2067756 2211820 2369956 2544433 2736588 2945212 3168562
57686C168562K36790K46992K50437K45239K30832K05854J69443J23755P2841K0210
$$ 3168562 3405352 3652344 3902781 4148020 4378852 4584706 4754149 4877904 4950745 4970955
57676D970955l0363p3641j05626j26223j36835j36920j25615j04867p7761m5260
$$ 4970955 4940592 4866951 4761325 4635102 4498267 4361347 4235732 4130865 4053104 4007844
57666D007844q435K6170M6278M0063L065n8098j26684j83259k16370k26800k21458
$$ 4007844 3999409 4025579 4071857 4111920 4114985 4056887 3930203 3746944 3530574 3303774 3082316
57655C082316k05810j83492j58979j36027j14943r4647p6041o0578m7238l4142
$$ 3082316 2876506 2693014 2534035 2398008 2283065 2188418 2112377 2051799 2004561 1970419
57645A970419k1779j1629l020N704J4240K1558K8715L7488M7438N7219O7581Q0072
$$ 1970419 1948640 1937011 1933991 1939695 1953935 1975493 2004208 2041696 2089134 2146353 2213934 2294006
57633B294006R4019J07724J21496J36533J51959J66008J78957J91729K02464K07541
$$ 2294006 2388025 2495749 2617245 2753778 2905737 3071745 3250702 3442431 3644895 3852436
57623C852436K05261J95639J77504J48967J10473O4888J5252l5199q2089j21977
$$ 3852436 4057697 4253336 4430840 4579807 4690280 4755168 4770420 4735221 4653132 4531155
57613D531155j54761j81471k00776k10508k11593k07374j99740j88878j76064
$$ 4531155 4376394 4194923 3994147 3783639 3572046 3364672 3164932 2976054 2799990
57604B799990j63448j51291j38390j25095j13223j03215r3911q4973p7163p0405
$$ 2799990 2636542 2485251 2346861 2221766 2108543 2005328 1911417 1826444 1749281 1678876
57594A678876o3831n7491n2032m7179m2400l8282l5335l2441k8615k5120k3452
$$ 1678876 1615045 1557554 1505522 1458343 1415943 1377661 1342326 1309885 1281270 1256150 1232698
57583A232698k2526k0415j7719j6385j6124j5022j2910j1255j0220q642o508m843
$$ 1232698 1210172 1189757 1172038 1155653 1139529 1124507 1111597 1100342 1090122 1081480 1074972 1070129
57571A070129l542j724K48J429K245L561M755N038N556P625J0013J0812J0744
$$ 1070129 1066587 1064863 1065111 1066540 1068785 1072346 1077101 1082139 1087695 1095320 1105333 1116145 1126889
57558A126889J1780J3644J4888J6195J9157K2691K4349K4594K6176K9651L3143
$$ 1126889 1138669 1152313 1167201 1183396 1202553 1225244 1249593 1274187 1300363 1330014 1363157
57547A363157L6220M0351M5611N0545N5396O2007P0256P8080Q5344R4221J05194
$$ 1363157 1399377 1439728 1485339 1535884 1591280 1653287 1723543 1801623 1886967 1981188 2086382
57536B086382J16023J25489J35030J45723J56330J65119J71137J72959J68608
$$ 2086382 2202405 2327894 2462924 2608647 2764977 2930096 3101233 3274192 3442800
57527C442800J57309J39358J14203Q1180M2254J542l8052p5247j07714j32166
$$ 3442800 3600109 3739467 3853670 3934850 3977104 3978646 3940594 3865347 3757633 3625467
57517C625467j47695j56358j59888j58359j52287j43441j32979j21203j09382
$$ 3625467 3477772 3321414 3161526 3003167 2850880 2707439 2574460 2453257 2343875
57508B343875r9315r0801q2026p2699o4227n6789m9060m1134l4788l0396k6316
$$ 2343875 2244560 2153759 2071733 1999034 1934807 1878018 1828958 1787824 1753036 1722640 1696324
57497A696324k1819j7850j4458j0283n236q54K611O712J1762J6157J9456K3433
$$ 1696324 1674505 1656655 1642197 1631914 1626678 1625824 1628435 1635147 1646909 1663066 1682522 1705955
57485A705955K9061L5132M0759M6699N3277N9530O5523P3057Q2987R3957J04727
$$ 1705955 1735016 1770148 1810907 1857606 1910883 1970413 2035936 2108993 2191980 2285937 2390664
57474B390664J15595J26730J37238J46602J54884J60796J61701J56105J44015
$$ 2390664 2506259 2632989 2770227 2916829 3071713 3232509 3394210 3550315 3694330
57465C694330J24702R6802O1312K1951j8089n7285r3386j22952j44396j58902
$$ 3694330 3819032 3915834 3977146 3999097 3981008 3923723 3830337 3707385 3562989 3404087
57455C404087j67457j69695j66422j60259j52555j42447j30165j18384j08701
$$ 3404087 3236630 3066935 2900513 2740254 2587699 2445252 2315087 2196703 2088002
57446B088002r9515q9144p8725p0159o3326n7072n1126m5569m0106l5028l1286
$$ 2088002 1988487 1899343 1820618 1750459 1687133 1630061 1578935 1533366 1493260 1458232 1426946
57435A426946k8624k5559k1957j9421j8325j6909j4362j2207j1391j0586q840
$$ 1426946 1398322 1372763 1350806 1331385 1313060 1296151 1281789 1269582 1258191 1247605 1238765
57424A238765p390p115o647m793k833k418l094l543l550l155j676P27K290K049
$$ 1238765 1231375 1224260 1217613 1212820 1209987 1207569 1204475 1200932 1197382 1194227 1192551 1193278 1195568 1197617
57410A197617J379J771K695L100L355M111M829M872M724M908N080N162N787O763
$$ 1197617 1198996 1200767 1203462 1206562 1209917 1214028 1218857 1223729 1228453 1233361 1238441 1243603 1249390 1256153
57396A256153O877O026N634O110O104N221N079O415P560P257O705P227Q131Q482
$$ 1256153 1263030 1269056 1274690 1280800 1286904 1292125 1297204 1303619 1311179 1318436 1325141 1332368 1340499 1348981
57382A348981Q813R460R318Q005P148P818Q722Q659Q572R363R914R298Q777R506
$$ 1348981 1357794 1367254 1376572 1384577 1391725 1399543 1408265 1416924 1425496 1434859 1444773 1454071 1462848 1472354
57368A472354J0288R863R398J0342J1634J1584J0815J0863J1323J0941J0244J0643
$$ 1472354 1482642 1492505 1501903 1512245 1523879 1535463 1546278 1557141 1568464 1579405 1589649 1600292
57356A600292J1940J2927J3500J4112J4244J3442J2815J3493J4654J4938J4752
$$ 1600292 1612232 1625159 1638659 1652771 1667015 1680457 1693272 1706765 1721419 1736357 1751109
57345A751109J5207J5950J5974J5586J5643J5862J5755J6079J7502J8859J8709
$$ 1751109 1766316 1782266 1798240 1813826 1829469 1845331 1861086 1877165 1894667 1913526 1932235
57334A932235J7658J7269J7743J8407J9422K1020K2087K1550K0350K0125K0760
$$ 1932235 1949893 1967162 1984905 2003312 2022734 2043754 2065841 2087391 2107741 2127866 2148626
57323B148626K1074K1064K1568K2445K2922K3216K4102K5401K6364K7017K7842
$$ 2148626 2169700 2190764 2212332 2234777 2257699 2280915 2305017 2330418 2356782 2383799 2411641
57312B411641K8803K9725L0790L1764L1832L1162L1192L2353L3212L3022L3271
$$ 2411641 2440444 2470169 2500959 2532723 2564555 2595717 2626909 2659262 2692474 2725496 2758767
57301B758767L5134L7335L8413L9230M1184M3599M5073M5946M7250M8621M9350
$$ 2758767 2793901 2831236 2869649 2908879 2950063 2993662 3038735 3084681 3131931 3180552 3229902
57290C229902N0172N1908N3657N4408N5015N6414N7396N6389N4106N2037M9674
$$ 3229902 3280074 3331982 3385639 3440047 3495062 3551476 3608872 3665261 3719367 3771404 3821078
57279C821078M5727M0750L6003L0909K4271J6958J0791N728P34l496n433n553
$$ 3821078 3866805 3907555 3943558 3974467 3998738 4015696 4026487 4032215 4032949 4029453 4024020 4018467
57267D018467n705o235o155n371m365k447J156N244Q083J0138J2970J6293J8777
$$ 4018467 4012762 4006527 4000372 3995001 3990636 3988189 3989345 3994589 4002672 4012810 4025780 4042073 4060850
57254D060850K0843K3892K7444K9879L1427L3527L5774L6386L5462L4865L5103
$$ 4060850 4081693 4105585 4133029 4162908 4194335 4227862 4263636 4300022 4335484 4370349 4405452
57243D405452L5071L4733L5262L6519L7150L7210L8136M0061M1734M3112M5444
$$ 4405452 4440523 4475256 4510518 4547037 4584187 4621397 4659533 4699594 4741328 4784440 4829884
57232D829884M8649N1045N1945N2208N2154N1242M9843M9006M8323M6333M3142
$$ 4829884 4878533 4929578 4981523 5033731 5085885 5137127 5186970 5235976 5284299 5330632 5373774
57221E373774M0441L8890L7736L6947L7387L8816M0084M1379M3972M7759N1407
$$ 5373774 5414215 5453105 5490841 5527788 5565175 5603991 5644075 5685454 5729426 5777185 5828592
57210E828592N4838N9114O3738O6641O7137O6554O5804O4613O3273O2582O1902
$$ 5828592 5883430 5942544 6006282 6072923 6140060 6206614 6272418 6337031 6400304 6462886 6524788
57199F524788N9742N6529N4254N3146N1343M8253M5524M4041M2602M0358L8235
$$ 6524788 6584530 6641059 6695313 6748459 6799802 6848055 6893579 6937620 6980222 7020580 7058815
57188G058815L6994L6113L5293L5081L5320L4922L3812L3110L2972L2257L0718
$$ 7058815 7095809 7131922 7167215 7202296 7237616 7272538 7306350 7339460 7372432 7404689 7435407
57177G435407K9410K8609K7481K6196K6052K7107K7971K8330K9281L0743L1097
$$ 7435407 7464817 7493426 7520907 7547103 7573155 7600262 7628233 7656563 7685844 7716587 7747684
57166G747684K9989K8846K7927K5509K0975J6092J2149Q221L508j023m601q058
$$ 7747684 7777673 7806519 7834446 7859955 7880930 7897022 7909171 7917392 7920900 7919877 7915276 7907218
57154G907218j1869j4863j6221j6927j8047j9345k0738k3074k6306k8743k9438
$$ 7907218 7895349 7880486 7864265 7847338 7829291 7809946 7789208 7766134 7739828 7711085 7681647
57143G681647k9595l0444l1568l2563l4526l8432m3551m8806n4389o0794o7463
$$ 7681647 7652052 7621608 7590040 7557477 7522951 7484519 7440968 7392162 7337773 7276979 7209516
57132G209516p3411p7955q0054p8272p2279o3012n0913l5711j8542k480R894J7765
$$ 7209516 7136105 7058150 6978096 6899824 6827545 6764533 6713620 6677909 6659367 6656887 6666781 6684546
57120F684546K0488J7082Q557j268q731j2553j2366p103L536J7897L4268N2712
$$ 6684546 6705034 6722116 6730673 6729405 6720674 6708121 6695755 6688652 6692188 6710085 6744353 6797065
57108F797065P3758R6832J21469J48841J80752K18462K63773L20030L90754M78522
$$ 6797065 6870823 6967655 7089124 7237965 7418717 7637179 7900952 8220982 8611736 9090258
57098I090258N86317P18539Q79165J069987J292035J547255J836838K158428K506263
$$ 9090258 9676575 10395114 11274279 12344266 13636301 15183556 17020394 19178822 21685085
57089B1685085K872846L248270L617739L961347M256565M479738M605210M606484
$$ 21685085 24557931 27806201 31423940 35385287 39641852 44121590 48726800 53333284
57081E3333284M463787M174814L757656L238801K634811J946207J171147L24738
$$ 53333284 57797071 61971885 65729541 68968342 71603153 73549360 74720507 75045245
57073G5045245n55217j418387k215510k906981l467543l887618m169068m318287
$$ 75045245 74490028 73071641 70856131 67949150 64481607 60593989 56424921 52106634
57065E2106634m343975m259794m084952l840745l548445l229966k906086k591803
$$ 52106634 47762659 43502865 39417913 35577168 32028723 28798757 25892671 23300868
57057B3300868k295317k022094j776944j561442j372991j208614j067388r47857
$$ 23300868 21005551 18983457 17206513 15645071 14272080 13063466 11996078 11048221
57049A1048221q45884p57127o79510o11748n51775m98385m52230m13371l79694
$$ 11048221 10202337 9445210 8765700 8153952 7602177 7103792 6651562 6238191 5858497
57040E858497l49238l22122k98599k77293k56911k37839k20486k03952j87714
$$ 5858497 5509259 5187137 4888538 4611245 4354334 4116495 3896009 3692057 3504343
57031C504343j72718j59461j46902j34594j23736j14868j06662r8283r0720q4406
$$ 3504343 3331625 3172164 3025262 2890668 2766932 2652064 2545402 2447119 2356399 2271993
57021B271993p8007p0958o4793o0344n6126n1067m6268m2425l8188l2959k8589
$$ 2271993 2193986 2123028 2058235 1997891 1941765 1890698 1844430 1802005 1763817 1730858 1702269
57010A702269k6267k4349k1299j8074j5453j1886o268l2N995J3850K5077L8274
$$ 1702269 1676002 1651653 1630354 1612280 1596827 1584941 1578673 1578641 1584636 1598486 1623563 1661837
56998A661837N2766P1383R6494J26879J61456K00223K34717K42004J98974J05922
$$ 1661837 1714603 1785986 1882480 2009359 2170815 2371038 2605755 2847759 3046733 3152655
56988C152655q876j09787j76291k07138k10855j97228j74654j50020j28672j13848
$$ 3152655 3143779 3033992 2857701 2650563 2439708 2242480 2067826 1917806 1789134 1675286
56978A675286j05392r9796r3274q4884p5730o6214n5933m5500l6175k8126k0904
$$ 1675286 1569894 1470098 1376824 1291940 1216210 1149996 1094063 1048563 1012388 984262 963358
56967I63358j5054j1343q894o026k434J215M989R283J3636J7872K3200K9780L4142
$$ 963358 948304 936961 928067 922041 919607 920822 925811 935094 948730 966602 989802 1019582 1053724
56954A053724L1664K1365O428r163k2425l1011l4080l3456l1756k9557k6099k1885
$$ 1053724 1085388 1106753 1113181 1104018 1081593 1050582 1016502 983046 951290 921733 895634 873749
56942H73749j8316j5379j1914p751l616N44N155R685J3607J8022K4382L2249L9731
$$ 873749 855433 840054 828140 820389 816773 817317 822472 832157 845764 863786 888168 920417 960148
56929I60148M4769M4419L5025J6249o341k5475l8113m5138m7257m4774m0069l6268
$$ 960148 1004917 1049336 1084361 1100610 1094269 1068794 1030681 985543 938286 893512 853443 817175
56917H17175l3597l0072k5401k1183j7867j4615j1788j0438r796q356o922p291
$$ 817175 783578 753506 728105 706922 689055 674440 662652 652214 642418 634062 627140 619849
56905F19849q530p954n577l937l656k885j231m61p74r3K144L884M133M535O371
$$ 619849 611319 603365 597788 593851 590195 587310 586079 585618 584844 584751 586895 590779 594912 599447 605818
56890F05818Q923J1752J5747K0933K5786K9487L2165L2356K7206J6503L868o985
$$ 605818 614741 626493 642240 663173 688959 718446 750611 782967 810173 826676 830544 823559
56878H23559j4889j9598k0568j8552j5835j3494j0499o383k519K83L065O655J0514
$$ 823559 808670 789072 768504 749952 734117 720623 710124 703741 701222 701505 704570 711225 721739
56865G21739J4664K0432K8158L6280M3926N2309O1957O9991P1317O1858M0787
$$ 721739 736403 756835 784993 821273 865199 917508 979465 1049456 1120773 1182631 1223418
56854A223418J1750j7718m0131n2702n7323n6520n1488m3667l5198k6970j8425
$$ 1223418 1235168 1217450 1177319 1124617 1067294 1010774 959286 915619 880421 853451 835026
56843H35026r728j959N138J3165K2422L1780M1592N3959O9539Q6619J03403J17626
$$ 835026 825298 823339 828477 841642 864064 895844 937436 991395 1060934 1147553 1250956 1368582
56831A368582J22987J10348P5916K6666k4120o5403r2098j04013j04330r7897
$$ 1368582 1491569 1601917 1677833 1704499 1680379 1614976 1522878 1418865 1314535 1216638
56821A216638q8382p6967o4157n1327l9647k8967j8861r543q98Q041J7949K8704
$$ 1216638 1128256 1051289 987132 935805 896158 867191 848330 838787 837889 845930 863879 892583
56809H92583M0526N4134O8975Q2065Q8570Q2919O1103K4943j6040n0118p1575
$$ 892583 933109 987243 1056218 1138283 1226853 1309772 1370875 1395818 1379778 1329660 1258085
56798A258085q2013q4551q0495p1732o1962n3410m5091l5973k7282k0198j3779
$$ 1258085 1176072 1091521 1011026 939294 877332 823922 778831 742858 715576 695378 681599
56787F81599o980m25N332J1330J8414K5949L3340M0586M5828M4708L4257J6153
$$ 681599 674619 674194 679526 690856 709270 735219 768559 809145 854973 899681 933938 950091
56775I50091m906k4438l9125m7140m9269m8194m5521m1041l5267l0244k6792k3432
$$ 950091 945185 920747 881622 834482 785213 737019 691498 650457 615190 584946 558154 534722
56763E34722j9238j5437j2932j0746q328o958p218p384o064m355l694l610l218
$$ 534722 515484 500047 487115 476369 468041 461083 453865 446481 440417 436062 432368 428758 425540
56750D25540k971l194k846j498o58j482k837l229k921k764k578k217k416l247
$$ 425540 422569 419375 416529 415031 414373 412891 410054 406825 403904 401140 398562 396345 393929 390682
56736C90682l495k788k501l294l774k950j940j884k193k216k549l275l101j658
$$ 390682 387187 384399 381898 378604 374830 371880 369940 368056 365863 363647 361098 357823 354722 353064
56722C53064n23n72n91J13J92j015j742o93O99Q13L76N39O87J84P4R27J170l16
$$ 353064 352541 351969 351378 351491 351683 350668 348926 348233 348932 349745 350121 350660 351347 351531 351605 352532 353702 353386
56704C53386j974k057j309j063p55M18J375R42l7m02o65j308j227L6O47o23j950
$$ 353386 351412 349355 348046 346983 346228 346646 348021 348963 348926 348524 347859 346551 345324 345360 346007 345384 343434
56687C43434j265M49J130R28J024J064L57o7Q58K000J861J073Q23N12o59j537
$$ 343434 342169 342618 343748 344676 345700 346764 347121 347054 347912 349912 351773 352846 353669 354181 353522 351985
56671C51985r51p4m25j200j011n47q82r82M27K029J784K95l77Q5O98J463K644
$$ 351985 351034 350960 350535 349335 348324 347777 346895 345913 346340 348369 350153 350448 350071 350156 350854 352317 354961
56654C54961L112J917K49l97o44j531k189j618j104k168l724l964l461l693m081
$$ 354961 358073 359990 360239 359842 359198 357667 355478 353860 352756 350588 346864 342900 339439 335746 331665
56639C31665l358k382k605l107k169n55l61j630k753l210l378k894j664j131k136
$$ 331665 328307 325925 323320 320213 318044 317489 317128 315498 312745 309535 306157 303263 301599 300468 298332
56624B98332l031k399j726k745m029l418j843j557k167j929j372k059l095k479
$$ 298332 295301 292902 291176 288431 284402 280984 279141 277584 275417 273488 272116 270057 266962 264483
56610B64483q03j87o35p24o04j093j087N20J860P36j120m21K234L483K746K347
$$ 264483 263680 263493 262858 262134 261530 260437 259350 259870 261730 262466 261346 260925 263159 266642 269388 271735
56594B71735K774K256Q15M98J481J806J115R69J457J049r5k29N72N47k26K4J139
$$ 271735 274509 276765 277580 278078 279559 281365 282480 283449 284906 285955 285860 285631 286203 286750 286524 286548 287687
56577B87687J114j06l80Q62J917K094K451L079K857K135K469L603L735K860K701
$$ 287687 288801 288695 288315 289177 291094 293188 295639 298718 301575 303710 306179 309782 313517 316377 319078
56562C19078L409L519L166M018N919O863O435O098O005M833K899K088K503K440
$$ 319078 322487 326006 329172 333190 339109 345972 352407 358505 364510 369343 372242 374330 376833 379273
56548C79273J748J909K644J916l50j982k309k862m012m256l387l062l707l960
$$ 379273 381021 382930 385574 387490 387140 385158 382849 379987 375975 371719 368332 365270 361563 357603
56534C57603l625m011m952m694l232k575l200l349k363j551j328o05N15N38m96
$$ 357603 353978 349967 345015 340321 337089 334514 331314 327965 325602 324051 322723 322118 322633 323171 322675
56519C22675r29o55j268k771l406l018l308m303m003k070n75m44m07o1o34k031
$$ 322675 321746 321091 319823 317052 313646 310628 307320 303017 299014 296944 296369 295925 295518 295457 294823 292792
56503B92792k358j184k50k92j59M64M71r3K9N68Rj202j096J09K61o35l18J434
$$ 292792 290434 289250 289000 288708 288549 289013 289484 289391 289420 289988 289997 288795 287699 287808 288069 287434 287116 288550
56485B88550K295J735J846L146L537K358J639K276K704K379K853M344M855L809
$$ 288550 290845 292580 294426 297572 301109 303467 305106 307382 310086 312465 315318 319662 324517 328326
56471C28326L046L245K933J882J796K722K622J366J261K603K848J275L39J075
$$ 328326 331372 334617 337550 339432 341228 343950 346572 347938 349199 351802 354650 355925 356264 357339
56457C57339J399M73M43K086K864J361k97m18l59j136j196K26J167N06P9J087
$$ 357339 358738 359211 359654 361740 364604 365965 365668 365250 364891 363755 362559 362785 363952 364458 364537 365624
56441C65624J684L78j345j781j538j446r24q7m12j886k520k058k696m813n760
$$ 365624 367308 367686 366341 364560 363022 361576 360652 360565 360153 358267 355747 353689 350993 346180 340420
56426C40420m388l006l095l024j842j393k529l018j504N3K04N17K080L013K008
$$ 340420 336032 333026 329931 326907 325065 323672 321143 318125 316621 316674 316878 317395 319475 322488 324496
56411C24496Q79J119J220j41j480j448j324k275l075k691k231k403k023p91l32
$$ 324496 325375 326494 327714 327573 326093 324645 323321 321046 317971 315280 313049 310646 308623 307832 307500
56396C07500r44o96P15Q80r00k133j659j529k535k264K07K134J982K111L949N033
$$ 307500 306556 305860 306575 307455 306555 304422 302763 301234 298699 296435 296642 298776 300758 302869 306818 311851
56380C11851L735K579L662M926M174K903K898K855J519M47O00O5j868k402j50
$$ 311851 315586 318165 321827 326753 330927 333830 336728 339583 341102 341549 342149 342214 340346 337944 337794
56365C37794J811J123K02J530L149K658J725K451L061J398p00o11O28R52J152
$$ 337794 339605 340728 340930 342460 345609 348267 349992 352443 355504 356902 356202 355591 356219 357171 358323
56350C58323K378L065K028J348K561L365J850L83J480L321L408L122M471N834
$$ 358323 360701 363766 365794 367142 369703 373068 374918 375301 376781 380102 383510 386632 391103 396937
56336C96937N194M276N241O468N888N200O525Q061P460O375P189Q343P408N743
$$ 396937 402131 406407 411648 418116 424004 429204 435729 443790 451250 457625 464814 473157 480565 486308
56322D86308N644N819M263K651L295M518L615J693J199J374N34PJ354K556J348
$$ 486308 491952 497771 502034 504685 507980 512498 516113 517806 519005 520379 520913 520920 522274 524830 526178
56307E26178m80l88K93n41j309R7J835J458O46J912L745L839L908O262Q779Q468
$$ 526178 525698 525310 525603 525062 523753 523850 525685 527143 527789 529701 533446 537285 541193 547455 556234 564702
56291E64702P002P548R073R094R001J1191J3822J3979J3270J4866J7620J8720
$$ 564702 571704 579252 588325 597419 606420 617611 631433 645412 658682 673548 691168 709888
56279G09888J9348K2108K5527K6836K7564L0655L4701L6837L8630M3111M8690
$$ 709888 729236 751344 776871 803707 831271 861926 896627 933464 972094 1015205 1063895
56268A063895N2228N5570O2576P1969P9620Q5905R4335J04823J14756J24931J37889
$$ 1063895 1116123 1171693 1234269 1306238 1385858 1471763 1566098 1670921 1785677 1910608 2048497
56257B048497J51928J63073J71583J80348J88396J92159J91698J89491J84367
$$ 2048497 2200425 2363498 2535081 2715429 2903825 3095984 3287682 3477173 3661540
56248C661540J72831J55180J34560J11401Q4483N5964K9324M009k2113m6726o5561
$$ 3661540 3834371 3989551 4124111 4235512 4319995 4375959 4405283 4409292 4387179 4340453 4274892
56237D274892p9082r0626r9813j04071j04878j06005j07198j05937j03683j03943
$$ 4274892 4195810 4105184 4005371 3901300 3796422 3690417 3583219 3477282 3373599 3269656
56227C269656j05803j05968j05437j07564j11165j12350j11596j12197j13314
$$ 3269656 3163853 3057885 2952448 2844884 2733719 2621369 2509773 2397576 2284262
56218B284262j11463j07309j04167j01306r5725q8890q4571q1557p5709o7752
$$ 2284262 2172799 2065490 1961323 1860017 1764292 1675402 1590831 1509274 1433565 1365813
56208A365813o1778n7618n2036m5965m2822m1125l6590l0294k6949k6351k4389
$$ 1365813 1304035 1246417 1194381 1148416 1105594 1064469 1027879 997585 970636 944285 919896
56197I19896k1236k0372k0659j7733j2541j0120j0613r642o864n817o004l693
$$ 919896 898660 878288 857629 839896 827355 817235 806622 796980 790116 784299 778295 774602
56185G74602M1N91j287m82K971M138K656L113N980O895N182M496M904K934m79
$$ 774602 774643 775234 773947 773465 776436 780574 783230 786343 792323 799218 804400 808896 813800 816734 816255
56170H16255q17J249O66k403k773n5Q95n03J43K980L432J528K364O395Q531P741
$$ 816255 815438 816687 817353 814950 812177 812122 813017 812514 812657 815637 819069 820597 822961 829356 837887 845628
56154H45628Q359J1079J1953J1149J3235J7918J9973J9277K1270K6562K9881L0511
$$ 845628 853987 865066 877019 888168 901403 919321 939294 958571 979841 1006403 1036284 1066795
56142A066795L3849M1348M8721N5365O5614P9323R1394J01956J16646J35118J49518
$$ 1066795 1100644 1141992 1190713 1246078 1311692 1391015 1482409 1584365 1701011 1836129 1985647
56131A985647J56085J57956J55186J43119J23052J03888R0491Q0111P1801O8429
$$ 1985647 2141732 2299688 2454874 2597993 2721045 2824933 2915424 2995535 3067336 3135765
56121C135765O7297N9998M4398K6796J0463p057k3847l2973l4759l8333m8258
$$ 3135765 3203062 3263060 3307458 3334254 3344717 3337660 3313813 3280840 3246081 3207748 3159490
56110C159490o0663p4415r3582j15879j31333j36291j37081j36722j30377j17419
$$ 3159490 3098827 3024412 2930830 2814951 2683618 2547327 2410246 2273524 2143147 2025728
56100B025728j05276r7075q7571p5287o6311o2085n5916m5904l8726l6414l2128
$$ 2025728 1920452 1823377 1735806 1660519 1594208 1532123 1476207 1430303 1391577 1355163 1323035
56089A323035k3575j7696j7324j6068j1199q562r903q573k834O9j970j362M334
$$ 1323035 1299460 1281764 1264440 1248372 1237173 1228611 1218708 1210135 1207301 1207370 1205400 1204038 1208372
56076A208372P189M004K428O113Q114N311M900R859J2443R045P292J1383J4609
$$ 1208372 1215561 1219565 1221993 1228106 1236220 1241531 1246431 1256290 1268733 1277778 1285070 1296453 1311062
56063A311062J3340J3929J8797K0438J6359J5010J9746K2177J8622J7359K1998
$$ 1311062 1324402 1338331 1357128 1377566 1393925 1408935 1428681 1450858 1469480 1486839 1508837
56052A508837K4004J9703J8093K3390K6613K3236K2122K7848L1538K8631K8095
$$ 1508837 1532841 1552544 1570637 1594027 1620640 1643876 1665998 1693846 1725384 1754015 1782110
56041A782110L4221L7406L3207L2089L9439M4596M1066L8787M4472M8869M5781
$$ 1782110 1816331 1853737 1886944 1919033 1958472 2003068 2044134 2082921 2127393 2176262 2222043
56030B222043M4482N0611N4192M9653M7974N5552O1152N7570N5684O2724O7773
$$ 2222043 2266525 2317136 2371328 2420981 2468955 2524507 2585659 2643229 2698913 2761637 2829410
56019B829410O3739O2085P0097P5693P1007O8641P7431Q5041Q2359Q1850R3043
$$ 2829410 2893149 2955234 3025331 3101024 3172031 3240672 3318103 3403144 3485503 3567353 3660396
56008C660396J03366J02673J02909J13597J22344J20230J21369J35780J48647
$$ 3660396 3763762 3866435 3969344 4082941 4205285 4325515 4446884 4582664 4731311
55999D731311J48774J50992J67120J82143J83747J87274K05678K23533K27670
$$ 4731311 4880085 5031077 5198197 5380340 5564087 5751361 5957039 6180572 6408242
55990F408242K33974K55752K76268K81922K90985L18620L46331L58414L74462
$$ 6408242 6642216 6897968 7174236 7456158 7747143 8065763 8412094 8770508 9144970
55981I144970M11715M50908M75326N06156N61152O17726O57566P06210P85194
$$ 9144970 9556685 10007593 10482919 10989075 11550227 12167953 12825519 13531729 14316923
55972A4316923Q69097R36625J017498J138550J273056J397855J547782J754738
$$ 14316923 15186020 16122645 17140143 18278693 19551749 20949604 22497386 24252124
55964B4252124J990202K232945K532401K934773L414617L958241M639608N525336
$$ 24252124 26242326 28475271 31007672 33942445 37357062 41315303 45954911 51480247
55956E1480247O588924P819720R323676J1209528J3499812J6291659J9850257
$$ 51480247 58069171 65888891 75212567 86422095 99921907 116213566 136063823
55949A36063823K4359673K9757802L5979522M2857460M9006172N0954667M4642272
$$ 136063823 160423496 190181298 226160820 269018280 318024452 368979119 413621391
55942D13621391K8851657P124472j4242332l0234056l9323337m2598585m1859724
$$ 413621391 442473048 449597520 435355188 405121132 365797795 323199210 281339486
55935B81339486l8686308l4371920k9844988k5545160k1604669j8127617j5196517
$$ 281339486 242653178 208281258 178436270 152891110 131286441 113158824 97962307
55928I7962307j2757832j0695473q971923p586654o467489n517462m715552m075449
$$ 97962307 85204475 74509002 65537079 57950425 51482936 45965474 41249922 37174473
55920C7174473l555179l094258k693800k379338k124789j885455j667887j499125
$$ 37174473 33619294 30525036 27831236 25451898 23327109 21441654 19773767 18274642
55912A8274642j361457j220753j087016r87320r08335q21357p36450o78525o35461
$$ 18274642 16913185 15692432 14605416 13618096 12709761 11888404 11151954 10473429 9837968
55903I837968n80387n21754m83287m56328m17776l74842l48523l31575l04276
$$ 9837968 9257581 8735827 8252540 7796212 7378436 7003594 6655071 6323496 6019220
55894F019220k73864k58803k50941k31272k06988j96453j92903j78377j58877
$$ 6019220 5745356 5486553 5235612 5004340 4797352 4600899 4407996 4229619 4070742
55885D070742j51488j50540j39716j24525j20606j22293j13911j00452r6944r8776
$$ 4070742 3919254 3768714 3628998 3504473 3383867 3261574 3147663 3047211 2950267 2851491
55875B851491r1821q1024q0237q4074p7967o6298o3264o5101n8305m6669m3956
$$ 2851491 2759670 2678646 2598409 2514335 2436368 2370070 2306806 2241705 2183400 2136731 2092775
55864B092775m7611m5205l9286m1075m6718m3943l5723l3904l5876l0335j9943
$$ 2092775 2045164 1999959 1960673 1919598 1872880 1828937 1793214 1759310 1723434 1693099 1673156
55853A673156j5777j5256p649L928P364L039J9l586j5712l1093l7408l6273l8593
$$ 1673156 1657379 1642123 1634474 1638402 1645766 1648805 1648824 1645238 1629526 1598433 1561025 1524752 1486159
55840A486159m3660m2354l6570l5955l9034l6549l0123k9195l2591l1089k5335
$$ 1486159 1442499 1400145 1363575 1327620 1288586 1252037 1221914 1192719 1160128 1129039 1103704
55829A103704k3733k5444k2561j6338j4775j6749j4733j0299j1011j4961j4217
$$ 1103704 1079971 1054527 1031966 1015628 1000853 984104 969371 959072 948061 933100 918883
55818I18883j0547j1912j6330j5080r185p036q214n288O28J637j646j616J480
$$ 918883 908336 896424 880094 865014 855829 848793 840579 835291 835919 837556 835910 834294 835774
55805H35774Q17k824k757k94k495p877q651n488n920r765j0262q070j0024j5292
$$ 835774 836591 833767 831010 830716 828221 820344 811693 806205 800285 790520 780258 772188 762164 746872
55791G46872j6693j4486j5178j8004j6416j1717j1311j4451j3561q841p659j0093
$$ 746872 730179 715693 700515 682511 666095 654378 643067 628616 615055 606214 598555 588462
55779E88462r063m453l155n119l300K012K533l346q381r949j2789j7175j7236
$$ 588462 579399 574946 571791 566672 563372 565384 567917 564571 556190 546241 533452 516277 499041
55766D99041j2743j0286j1039r193m008j644l350l460q59j044m867o480m483m366
$$ 499041 486298 476012 464973 455780 451772 450128 446778 443318 442459 441415 436548 430068 425585 421219
55752D21219p695r419p917p566r390r146o392n668p170o119k679k480n845o718
$$ 421219 413524 404105 396188 388622 379232 370086 363694 358026 350856 344737 342058 339578 333733 327015
55738C27015l846k787n075n515k412m58j192k93L195M384J739l57l71j993n676
$$ 327015 323169 320382 315307 309792 307380 306922 305730 305437 308632 313016 314755 314398 314027 312034 306358
55723C06358o873m809m167n970n703k497j149k840k872Q2J326p47j705L24J638
$$ 306358 299485 294676 290509 284539 278836 276339 275190 272350 269478 269560 270886 270139 268434 268758 270396
55708B70396R82K003N338O716N399N997R377J0407P329M818M972L855P1j891k25
$$ 270396 271378 273381 278719 285435 290834 296831 306208 316615 323944 328762 333734 337589 337660 335769 335544
55693C35544N28k098m311l811l865o103o830m237k068k494k347J84J987J514J953
$$ 335544 336072 333974 329663 325852 321987 315884 309054 304817 302749 300255 297908 298092 300079 301593 303546
55678C03546M682O296N249M747O059N772K721P91J719J954k24j360J82Q99r14
$$ 303546 308228 314524 319773 324520 330579 336351 339072 339863 341582 343536 343312 341952 342134 343033 342119
55663C42119j746J44J153p61k228j108l76j777k149J46J533j63j721r47q87l702
$$ 342119 340373 340517 341670 340909 338681 337573 337197 335420 333271 333417 334950 334787 333066 332119 331232 327530
55647C27530o352o414o398q308r602q471p562q650r065p217o081p479q375o652
$$ 327530 321178 314764 308366 300058 290456 281985 274423 265773 256708 249491 243410 235931 227556 220904
55633B20904n084n736n999m047k759m108n088l347j649k536l642k581j559k783
$$ 220904 215820 210084 204085 200038 197279 193171 188083 184736 183087 180551 176909 174328 172769 169986
55619A69986l998k858j318j578j966q33j67j507k535j423l63j131j621l41J59
$$ 169986 165988 163130 161812 160234 158268 157435 157268 155761 153226 151803 151440 150309 148688 148347 148506
55604A48506j861l564k510r89j548k412j314J28j85r24n02l00j336j624j76M42
$$ 148506 146645 143081 140571 139582 138034 135622 134308 134436 134251 133327 132825 132525 131189 129565 129389 129831
55588A29831j166k224q31M13o08j484l9J352K05j466j102j67p49j409m27N34j53
$$ 129831 128665 126441 125610 126023 125415 123931 123892 125244 125449 123983 122881 122714 121965 120556 120129 120663 120510
55571A20510o38P16J891J099K89J213J910P94K32K174M191L814K836L370L570
$$ 120510 119872 120588 122479 123578 123867 125080 126990 127784 128016 130190 134381 138195 141031 144401 147971
55556A47971J535m95j78M42j102k897k276p64r15j476k60J348J153M52J222K069
$$ 147971 149506 149011 148833 149275 148173 145276 143000 142236 141321 139845 139585 140933 142086 142538 143760 145829
55540A45829J203M02J691L110K192P26J511L188K769Q80O8K37p9k04Q51J369l91
$$ 145829 147032 147434 149125 152235 154427 155153 156664 159852 162621 163501 163569 163806 163727 163523 164374 165743 165352
55523A65352k713l302l200m219n188m451l449m045n016m835m982o661p291m543
$$ 165352 162639 159337 156137 151918 146730 142279 138830 134785 129769 124934 119952 113291 106000 101457
55509A01457r27o0j068j052m26j175k334j796n90r40k074k042j619k420l276k556
$$ 101457 100530 100470 99402 98350 97924 96749 94415 92619 92029 91089 89015 86973 85354 82934 79658 77102
55493G7102j733k612l408j797N32O87m72n34k89j677l250k486o63o88j883j637
$$ 77102 75369 72757 69349 67552 68084 68771 68299 67765 67476 65799 62549 60063 59400 58712 56829 55192
55477E5192m60p19j837j457l5K80OJ126K811K711J346R40J172K31j077o46P64
$$ 55192 54732 54013 52176 50719 50684 50964 50970 52096 54907 57618 58964 59904 61076 61307 60230 59584 60348
55460F0348P62l46m87J33o9m03P86K348J924J80n21l62r94j646m78J393J424J11
$$ 60348 61110 60764 60277 60410 60341 59938 60724 63072 64996 65176 64655 64293 63299 61653 61175 62568 63992 64103
55442F4103j37N32K03p32m07O39N18j94K29Q61k58j942j659k36l41j417q16J058
$$ 64103 63966 64498 64701 63969 63562 64201 64719 64525 64754 65615 65357 63415 61756 61520 61179 59762 58946 60004
55424F0004J526P59J196K437J664r72k262j280l33l73P6J156J032m31j193o54
$$ 60004 61530 62289 63485 65922 67586 66614 64352 63072 62739 62366 62442 63598 64630 64199 63006 62352
55408F2352k49k25O09J908J979R89P10J188R44J17M7L09m49j342n58Q78M70j290
$$ 62352 62103 61878 62487 64395 66374 67363 68073 69261 70205 70322 70369 70678 70229 68887 68329 69207 69677 68387
55390F8387j794j029j265k514k577j363q58j027QJ727J609r5l67J313K043M64
$$ 68387 66593 65564 64299 61785 59208 57845 56987 55960 55968 57695 59304 59209 58842 60155 62198 62662
55374F2662j406k015k130k102j087K71k7j743k358j161l9K12Q19J860J744N39
$$ 62662 61256 59241 57111 55009 53922 54193 54166 52423 50065 48904 48865 49077 49896 51756 53500 54039
55358E4039K90J330J636N01m24l74m43q02j76J287J801J079O36O40k62j790k040
$$ 54039 54329 55659 57295 57796 57372 56998 56555 55753 55577 56864 58665 59744 60380 61020 60758 58968 56928
55341E6928j021p17j340j017L96Q07k43q13k67k22j070j120m3L43m12m68P79J582
$$ 56928 55907 55190 53850 52833 53229 54036 53793 52980 52713 52491 51421 50301 50258 50601 50189 49721 50500 52082
55323E2082J171R09J248P93o36j242m64P3k82k66L76K17p69p27N72J012j12r12
$$ 52082 53253 54162 55410 56203 55567 54325 53861 53934 53652 53386 53762 53979 53210 52483 53055 54067 53955 53043
55305E3043m03J6l06n5J030J190o3q04j21M13q3j99Q07J487J005O62J196J358
$$ 53043 52640 52656 52350 52295 53325 54515 54452 53648 53527 53940 53857 53658 54465 55952 56957 57619 58815 60173
55287F0173N03q8K56L74k55m02M27R48N95M06N95k7j368j658p08m76j464j691
$$ 60173 60676 60588 60844 61218 60963 60561 60988 61936 62531 62937 63532 63505 62137 60479 59771 59295 57831 56140
55269E6140m38K51p83j708r18M53Q93P09M60k27r69l73J219J396n63k289k015
$$ 56140 55702 55953 55170 53462 52544 52997 53890 54599 55059 54832 53863 53490 54709 56105 55542 53253 51238
55252E1238r04m07r7M29K45p19q23M03J114L34l53K36Q77N15J67O41Q75K11r4
$$ 51238 50334 49927 49830 50259 50504 49785 48962 49365 50479 50813 50460 50696 51573 52088 52255 52896 53771 53982 53888
55233E3888P28J377Q84K54K76M3q83j233m05K32k08o87m83m27p60l62P01O55o66
$$ 53888 54616 55993 56877 57131 57407 57450 56567 55334 54929 55161 54953 54266 53783 53356 52596 52234 52935 53590 52924
55214E2924r34P43K085J455M77Q13J346O51l36m13l86j104j501o95J20j38m84
$$ 52924 51990 52733 54818 56273 56750 57563 58909 59560 59224 58811 58425 57321 55820 55125 55245 55107 54623
55197E4623P1O85N65M82Q12M31q61j345m25O2q10j197M3J034J93j009r20n40j017
$$ 54623 54694 55379 55944 56426 57238 57669 56808 55463 55038 55100 54290 53093 53136 54170 54363 53354 52434 51894 50877
55178E0877j105K27J314O61k04M23J221M75n35K3R03m2j854k020o59J37q0j47
$$ 50877 49772 49999 51313 51974 51770 52193 53414 53889 53354 53377 54280 54238 52384 50364 49705 49842 49762 49615
55160D9615N0k09m83M3O66L09l84k58J87n0m06N8O76M80K00P94J387Q33j7J64
$$ 49615 49665 49456 48973 49016 49682 49991 49607 49349 49536 49486 49080 49138 49814 50294 50494 51288 52675 53508 53491 53655
55140E3655P13K97n70n59P4L23M41J069J503R43K85O81J456J442J051J141J158
$$ 53655 54368 54665 54095 53536 53610 53933 54374 55443 56946 57889 58174 58855 60311 61753 62804 63945 65103
55123F5103M04k76j3L30j20l77M33R52k65k029k283j209k06O42J782K268J184
$$ 65103 65507 65231 65218 65548 65428 65051 65484 66436 66171 64142 61859 60650 60444 61086 62868 65136 66320
55106F6320k85n62k23n31r05k08Q65J111J111J766K059Q81m14l9J113J161O33
$$ 66320 66035 65473 65250 64719 63814 63606 64471 65582 66693 68459 70518 71399 70985 70946 72059 73220 73853
55089G3853J118J908J229k54m61L62K63p09p22L16O29j22m40J30M24J04P8M68
$$ 73853 74971 76879 78108 77854 77393 77755 78018 77309 76587 76903 77532 77410 76970 77100 77524 77628 77706 78174
55071G8174M68K43P06J526J534R02Q09J173Q84k6n11m96p26j015p21l50o98j026
$$ 78174 78642 78885 79591 81117 82651 83553 84362 85535 86419 86393 85882 85386 84660 83645 82924 82574 81876 80850
55053H0850k59P42M35o49q63l89n95j120m84Q28Q56l77q25Q1O56J7p13o67l42
$$ 80850 80591 81333 81768 81119 80256 79867 79272 78152 77668 78496 79352 78975 78150 78231 78887 78904 78191 77524 77182
55034G7182LQ54J891J947R21j22p64j363j416KK101K827J725M25L1k0k82m13k99
$$ 77182 77185 78039 79930 81877 82798 82676 81912 80549 79133 79135 81236 84063 85788 86213 86244 86224 85942 85529 85230
55015H5230l49l86K00J056J220P17L60R2p39j721j734q66k25n4K30M00k66j240
$$ 85230 84881 84495 84695 85751 86971 87688 88048 88140 87401 85680 83946 83080 82855 82801 83031 83431 83165 81925
54997H1925j254l99L1k91n25m00l64k44L37N44o46k290k411j005M4q6l71o6M59
$$ 81925 80671 80272 80303 80012 79487 79087 78723 78479 78816 79360 78714 76424 74013 73008 73052 72966 72595 72529 72988
54978G2988J080K124L034K767J634R99J180J403J665K662L965M284L597L123L249
$$ 72988 74068 76192 79226 81993 83627 84626 85806 87209 88874 91536 95501 99785 103382 106505 109754
54963A09754L336L386L908M375L954L612N173Q261J0520J1030J1218J2200J3477
$$ 109754 113090 116476 120384 124759 128713 132325 137498 145759 156279 167309 178527 190727 204204
54950B04204J4650J6063J7239J6704J4003J0116N587J84n333r213j0990j2025
$$ 204204 218854 234917 252156 268860 282863 292979 298566 298750 293417 284204 273214 261189
54938B61189j3280j4329j4775j4847j4289j2549j0359r208q967p949n628l465
$$ 261189 247909 233580 218805 203958 189669 177120 166761 157553 148586 140637 135009 131544
54926A31544k540k264j889j552j380j125r54j134q81P85L141M550N012N975P684
$$ 131544 129004 126740 124851 123299 121919 120794 119840 118706 117825 118610 121751 126301 131313 137288 144972
54911A44972Q977R721J1120J3337J5083J5893J6527J6755J5104J1343O956K693
$$ 144972 153949 163670 174790 188127 203210 219103 235630 252385 267489 278832 285788 288481
54899B88481k157p433j1441j3429j4525j5470j5488j4181j2553j1264r870q377
$$ 288481 286324 278891 267450 254021 239496 224026 208538 194357 181804 170540 160670 152293
54887A52293p629p447o465m518l147k955k712j822j481k309k989k449j458r42
$$ 152293 144664 137217 130752 126234 123087 120132 117420 115598 114117 111808 108819 106370 104912 103970
54873A03970o05k50o10j670k023j080k45o77j618k066k406l114l444k749j773
$$ 103970 103365 103115 102505 100835 98812 97732 97487 96810 95192 93126 90720 87606 84162 81413 79640
54858G9640j393j253o88J31Q69J610K115J756P42Q1j43q40j898j964q71k37p99
$$ 79640 78247 76994 76306 76437 77306 78916 81031 82787 83529 83610 83467 82627 80729 78765 77894 77657 76858
54841G6858j179k91Q47R68L57k67j008j701j248N82K231K445J885J645J544J076
$$ 76858 75679 75388 76235 77203 77560 77293 76285 74584 73336 73918 76149 78594 80479 82124 83668 84744
54825H4744N79L64kn41m15M61Q70K94p9N87J356J314J128J568K044J905J823K551
$$ 84744 85323 85687 85685 85144 84729 85190 86060 86354 86275 86862 88218 89532 90660 92228 94272 96177 98000 100551
54807A00551L574M209M771N615O284O679P674R518J1086J1794J2768J4907J7240
$$ 100551 104125 108334 113105 118720 125004 131683 139357 148875 159961 171755 184523 199430 216670
54794B16670J8417J8422J7577J5322J1337O580J967k741p569j1323j3173j3843
$$ 216670 235087 253509 271086 286408 297745 304325 306292 303551 295982 284659 271486 257643
54782B57643j4129j3609j2054j0517r702q823p395o472o589o279m365k192j576
$$ 257643 243514 229905 217851 207334 197632 188809 181414 174942 168353 162074 157709 155517 153941
54769A53941j930j484k07O35Q84J410K266K792L100L848N034O340Q075J0382J2318
$$ 153941 152011 150527 150320 150955 151839 153249 155515 158307 161407 165255 170289 176629 184704 195086 207404
54754B07404J3113J3575J4861J6573J7388J6813J4978J1572O504R61l743p742
$$ 207404 220517 234092 248953 265526 282914 299727 314705 326277 332781 333742 329999 322257
54742C22257j1737j5276j7342j8076j8394j8284j6912j4188j1121q767p647p698
$$ 322257 310520 295244 277902 259826 241432 223148 206236 192048 180927 172160 164513 156815
54730A56815q072p584o114m809m269l624k257j213j610k728l047k415j833j762
$$ 156815 148743 141159 135045 130236 125967 122343 120086 118873 117263 114535 111488 109073 107240 105478
54716A05478j880j970j947j532p22o4K08M65O24n0j387j962j213m49p12j093m27
$$ 105478 103598 101628 99681 98149 97427 97363 97571 98036 98660 98610 97223 95261 94048 93599 92887 91794 91367
54699I1367P55J443J905K725L273K791J876J343P33m97j484j216k88K36N70J236
$$ 91367 92122 93565 95470 98195 101468 104259 106135 107478 108211 107714 106230 105014 104726 104962 105532 106768
54683A06768J513P00k10L1P59O30O6L98J430J921J875K256K949L055K726K803
$$ 106768 108281 108981 108771 108802 109561 110191 110257 110655 112085 114006 115881 118137 121086 124141 126867 129670
54667A29670L025K511J652J570K116K229J965K219K712K285J105O06J206J914
$$ 129670 132695 135206 136858 138428 140544 142773 144738 146957 149669 151954 153059 153665 154871 156785
54653A56785K233K720L433L592L068K770L201L940M599N169N398N037M593M640
$$ 156785 159018 161738 165171 168763 171831 174601 177802 181742 186341 191510 196908 201945 206538 211178
54639B11178M553L204P81j380k660l505m158m448m740n627o648o677n728n010
$$ 211178 215731 218935 219716 218336 215676 212171 208013 203565 198825 193198 186550 179873 174145 169135
54625A69135n062n062m306l235k667k796l230l403k937k026j320j069q07l06n3
$$ 169135 164073 159011 154705 151470 148803 146007 142777 139374 136437 134411 133091 132022 131215 130909 130856
54610A30856j88JQ07J318R20M01M31K35q26j648j141l69r57k302k635k100k331
$$ 130856 130668 130669 131476 132794 133714 134115 134546 134781 133955 132307 131166 130797 129840 127538 124903 122803 120472
54593A20472l409l736k881k194k312k278j584j173j693k489k817k787k593k117
$$ 120472 117063 113327 110446 108252 105940 103662 102078 100905 99212 96723 93906 91119 88526 86409
54579H6409j580j438j436r55k77k27n98l89M03O98J79l12l36m03o59n26N4L02
$$ 86409 84829 83391 81955 81000 80723 80496 79898 79509 79912 80610 80789 80477 80141 79738 79079 78553 78607 78909
54561G8909p9m41l73k10j62KK48K90M21J153K009J826M41j001j493r33M28K124
$$ 78909 78830 78389 78016 77806 77644 77646 77894 78184 78605 79758 81767 83593 84034 83033 81540 80607 81035 83159
54543H3159L177K909K061J906K385K381J731J424J833K223K242K398K834K940
$$ 83159 86336 89245 91306 93212 95597 97978 99709 101133 102966 105189 107431 109829 112663 115603
54529A15603K460J765Q65n74k087k686k438k456l080l452l120k655k368j819r84
$$ 115603 118063 119828 120693 120119 118032 115346 112908 110452 107372 103920 100800 98145 95777 93958 92974
54514I2974n95q44j012q49r77j535j696j120o33p54p78p0P84R25M95K08K70M49
$$ 92974 92379 91535 90523 89674 88697 87162 85466 84346 83713 82959 82181 82111 82895 83820 84315 84523 84793 85242
54496H5242O80J014J305J330R47Q7j040j796j701j095o48m45j70Q4Lk04j04J30
$$ 85242 85922 86936 88241 89571 90518 90605 89565 87769 86068 84973 84325 83880 83710 83794 83797 83593 83489 83619
54478H3619M1j86l8L40L88J18j18m17q92r25J4J165J439J118J236J614J169j3
$$ 83619 83660 83474 83436 83776 84164 84282 84164 83747 82855 81930 81944 83109 84548 85666 86902 88516 89685 89672
54460H9672n79k8O46N95K5o75j347j439l96J077J418K32j230j801j494p85K1M66
$$ 89672 89093 89065 89711 90306 90331 89656 88309 86870 86474 87551 88969 89201 87971 86170 84676 83891 83912 84378
54442H4378J71m81p83p81q81p45J49J106R10k32q87n44l0J61M27Q18P76K84q1
$$ 84378 84549 84068 83285 82504 81623 80878 81027 82133 83043 82811 81924 81380 81350 81511 81938 82756 83532 83816 83735
54423H3735j86j91L80J845K947K210M78Q3J419K526K259J548J178O04j64J54J852
$$ 83735 83549 83358 83738 85583 88530 90740 91218 91301 92720 95246 97505 99053 100231 100835 100671 100825 102677
54406A02677L228K954J847J278J340J620K261L174L553L139K792L019L194K846
$$ 102677 105905 108859 110706 111984 113324 114944 117205 120379 123932 127071 129863 132882 136076 138922
54392A38922K422K115J406M14J38N85L21j206k476k137r41l52n18p90j073j523
$$ 138922 141344 143459 144865 145279 145417 146002 146323 145117 142641 140504 139563 139211 138693 137903 136830 135307
54376A35307j832j866k096k634k781k160j340p31r6M74L22m34q47q73j530k662
$$ 135307 133475 131609 129513 126879 124098 121938 120598 119867 119771 120245 120567 120133 119286 118413 116883 114221
54360A14221k490l70J806K224J472J001Q25L64P1N71J278J386J295J609J753J118
$$ 114221 111731 111361 113167 115391 116863 117864 118689 119053 119124 119695 120973 122359 123654 125263 127016 128134
54344A28134N57J213K530L033K507J969J904J838J467J034P68O75O55L61n13j525
$$ 128134 128691 129904 132434 135467 137974 139943 141847 143685 145152 146186 146954 147629 148284 148645 148132 146607
54328A46607j812j495j673k531k872k226j964l135m516m269k534j025o65j107
$$ 146607 144795 143300 141627 139096 136224 133998 132034 128899 124383 120114 117580 116555 115890 114783
54314A14783j945l081m101m372l726k480j083j08l1o25j172j524k057k491k003
$$ 114783 112838 109757 105656 101284 97558 95078 93995 93887 93856 93231 92059 90535 88478 85987 83984
54299H3984q45m18j159j790j383o83n01l62J61L01m68j156q08j41k31o87n06J10
$$ 83984 83139 82721 81562 79772 78389 77706 77205 76843 77004 77305 76837 75681 74873 74732 74501 73814 73308 73418
54281G3418L15J41J58K92J71K4J51J64k36n08j77L35O13R85J478J218n3j029o40
$$ 73418 73733 73874 74032 74324 74495 74519 74670 74834 74598 74090 73913 74248 74861 75846 77324 78542 78489 77460 76820
54262G6820K81L91j42l16k9J83L17N23L99j67l61K59P65L66j86J14Q45J125J147
$$ 76820 77101 77492 77350 77034 77005 77188 77505 78028 78427 78260 77899 78158 78923 79289 79103 79217 80062 81187 82334
54243H2334J358J183Q2j025r56n4N18M14j68j313k604k690j124M72O42K13N44
$$ 82334 83692 84875 84957 83932 82976 82922 83440 83854 83686 82373 79769 77079 75955 76427 77069 77282 77826
54226G7826J086O85QL32R71L50j068j460p38m61r80j092n24l90r18r23R9J129
$$ 77826 78912 79597 79605 79937 80908 81258 80190 78730 77992 77531 76551 75459 74935 74545 73627 72704 72803 73932
54208G3932J300Q47K10m21o03j11K05n29j493j080O31J973K080J559R43K51K6
$$ 73932 75232 76079 76289 75868 75265 75154 75359 74830 73337 72257 72888 74861 76941 78500 79443 79694 79720
54191G9720R18K106J914K99q99n38M90Q24J93q90j690j365K16J747J808P89J26
$$ 79720 80638 82744 84658 84957 84058 83520 84010 84834 85027 84137 82447 81082 81298 83045 84853 85642 85768
54174H5768j18j048k452k595j001N31M55n64j102j009r41r54n72K69J111J493
$$ 85768 85650 84602 82150 79555 78554 79085 79540 78976 77874 76865 75924 74970 74398 74667 75778 77271
54158G7271J248O39K68L86N48L57K36O19R81O57J54M01J100J148M68O6L80R01
$$ 77271 78519 79158 79426 79812 80360 80717 80953 81572 82553 83210 83364 83765 84865 86013 86481 86547 86927 87828
54140H7828J315J701J699Q48l54r48r62j105j220o17K70J38j100k129k197j851
$$ 87828 89143 90844 92543 93391 93037 92089 91127 90022 88802 88185 88455 88593 87493 85364 83167 81316
54124H1316j538j011l61j53k35K30J155J414N78m41q21o87l17K59O26K29n21o38
$$ 81316 79778 78767 78406 78253 78018 78248 79403 80817 81395 80954 80133 79446 79129 79388 80014 80243 79722 79084
54106G9084j31N4k79l04K06N16L55K84L10l42j671k496k117j081qJ059J802J562
$$ 79084 78953 79007 78728 78424 78630 79146 79501 79785 80095 79753 78082 75586 73469 72388 72380 73439 75241 76803
54088G6803N42k01l35n21r02q04k33j03n31m91L17Q53N93L90P15P57J70J13J317
$$ 76803 77345 77144 76809 76288 75386 74582 74349 74246 73715 73224 73541 74394 74987 75377 76092 76849 77019 77132 78449
54069G8449K510K146P28K2O49J594J695P49n34j126o30K12M85M14Q72J656J664
$$ 78449 80959 83105 83833 83855 84504 86098 87793 88542 88008 86882 86252 86464 86949 87363 88235 89891 91555
54052I1555Q70N56J211J788J584J302J503J537R47N07Q23J235J161J253K081K837
$$ 91555 92425 92981 94192 95980 97564 98866 100369 101906 102853 103360 104183 105418 106579 107832 109913 112750
54036A12750K616K020K146K870L342L537M038M855N523O023O576O922O681O046
$$ 112750 115366 117386 119532 122402 125744 129281 133319 138174 143697 149720 156296 163218 169899 175945
54022A75945N422M842M362M406N026N406M869L839L148K900K705K435K063J412
$$ 175945 181367 186209 190571 194977 200003 205409 210278 214117 217265 220165 222870 225305 227368 228780
54008B28780O21K78M81M39l58j272j619j844k680l750m030l398k731k625k835
$$ 228780 229401 229679 230160 230599 230241 228969 227350 225506 222826 219076 215046 211648 208917 206292 203457
53993B03457k897k729k551k604k851k908k513k073k220k725k623j637o45l99n19
$$ 203457 200560 197831 195280 192676 189825 186917 184404 182331 180111 177386 174763 173126 172481 172082 171563
53978A71563l29O9R6l66r64j310j179o85m66j065j966k020j079k94m48q53m78
$$ 171563 171234 171303 171399 171033 170069 168759 167580 166895 166429 165364 163398 161378 160299 160005 159557 158704 158226
53961A58226O68J846K542K553J800O52r7j05J44K27L88R28J632K201K584K636
$$ 158226 158894 160740 163282 165835 167635 168287 168190 168085 168229 168456 168844 169772 171404 173605 176189 178825
53945A78825K093J330J316K429L990N191N885O187O203O352P035P751P499O314
$$ 178825 180918 182248 183564 185993 189983 195174 201059 207246 213449 219801 226836 234587 242086 248400
53931B48400N189M261K487l21k589l131k878l350m417m804m019k640j280k73J20
$$ 248400 253589 257850 260337 260016 257427 254296 251418 248068 243651 238847 234828 232188 230908 230635 230755
53916B30755J06N26J781L098L602L601M012M965N773N947N628N309N509O298O942
$$ 230755 230861 231387 233168 236266 239868 243469 247481 252446 258219 264166 269794 275103 280612 286910 293852
53901B93852O649N769N405N573M980L078J048l3o81j673k462k234j588j703k481
$$ 293852 300501 306270 311675 317248 322228 325306 326354 326321 325640 323967 321505 319271 317683 315980 313499
53886C13499k941k946l239l993m649n031n616o569p466p935p933p431o443n383
$$ 313499 310558 307612 304373 300380 295731 290700 285084 278515 271049 263114 255181 247750 241307 235924
53872B35924m798m802n030n068m740m204l889m008m089l573k774k534k891l078
$$ 235924 231126 226324 221294 216226 211486 207282 203393 199385 195296 191723 188949 186415 183524 180446
53858A80446k946l183l849l915k867j611j082j071j129j492k257k718k481k268
$$ 180446 177500 174317 170468 166553 163686 162075 160993 159922 158793 157301 155044 152326 149845 147577
53844A47577k654k943k345j344q57q59q90j128j828k368k018j112m65j73J12L15
$$ 147577 144923 141980 139635 138291 137434 136575 135685 134557 132729 130361 128343 127231 126766 126593 126705 127020
53828A27020K76L28O08N07k81r47p67l18l38k87O70J876J920Q11qK68R84J221
$$ 127020 127296 127624 128232 128739 128458 127511 126744 126426 126088 125801 126471 128347 130267 131078 131070 131338 132322 133543
53810A33543Q11J40l08k11K26M13K99O08J663K692K943K775K846L021K989L206
$$ 133543 134354 134494 134186 133975 134201 134614 134913 135521 137184 139876 142819 145594 148440 151461 154450 157656
53794A57656M183N466O257O493O461N995N036M207L888L441K392J548J790K573
$$ 157656 161839 167305 173562 180055 186516 192511 197547 201754 205642 209083 211475 213023 214813 217386
53780B17386K846K699K762K698J832O59K26L48n5j116j956k230k402k587k463
$$ 217386 220232 222931 225693 228391 230223 230882 231108 231456 231401 230285 228329 226099 223697 221110 218647
53765B18647k229k435k897k831k119j427j194j293j525j681j448r81j118k192
$$ 218647 216418 213983 211086 208255 206136 204709 203515 202222 200697 199016 197568 196587 195469 193277
53751A93277l223l162k341j691j297p80m14n88q43o67o03j251j916j642r85j113
$$ 193277 190054 186892 184551 182860 181563 180783 180369 179781 178938 178271 177668 176417 174501 172859 171874 170761
53735A70761j791j825j075m36k08l9r0o86j220r82n99j012j571r96K93Q05N22
$$ 170761 168970 167145 166070 165634 165426 165387 165297 164611 163391 162409 161810 160798 159227 158231 158524 159329 159851
53718A59851O76J209Q48k93n36N31J337R36K88K66M44N38J121K079K147R75NK81
$$ 159851 160527 161736 162584 162291 161755 162286 163623 164559 164847 165113 165557 166095 167216 169295 171442 172417 172422 172703
53700A72703R90J143J232K031L072L495L373L171K826K319K205K682K987K590
$$ 172703 173693 174836 176068 178099 181171 184666 188039 191210 194036 196355 198560 201242 204229 206819
53686B06819K139K345K772K594J871J254R67Q56J013J613K409K934K913K310J302
$$ 206819 208958 211303 214075 216669 218540 219794 220761 221617 222630 224243 226652 229586 232499 234809 236111
53671B36111L65j02k01j58K29J041J546J097L94N92J310J057l00j216r80p63j479
$$ 236111 236476 236374 236173 236015 236244 237285 238831 239928 240322 240914 242224 243281 242981 241765 240785 240022 238543
53654B38543k158j528j1R86R08K12n47r45o24J98O96M73R8J25K96J76o8n5K30
$$ 238543 236385 234857 234846 235832 236740 236952 236405 235460 234836 235034 235730 236203 236301 236426 236722 236898 236830 236775 237005
53635B37005O65J247J750J748J288R16Q00N52P4k28k50l97p17p12k56K63Q67J986
$$ 237005 237670 238917 240667 242415 243703 244619 245419 245971 246045 245817 245567 245170 244453 243741 243485 243748 244615 246601
53617B46601L211L304K047R44J337K709L641L658L378L425L869M345M252L342
$$ 246601 249812 253116 255163 256107 257444 260153 263794 267452 270830 274255 278124 282469 286721 290063
53603B90063K295K112K821L526L755L893M150M219M163M462M850M369L040K185
$$ 290063 292358 294470 297291 300817 304572 308465 312615 316834 320997 325459 330309 334678 337718 339903
53589C39903K510L097L079K960L428M049M189M188M465M343L053J286M95J033
$$ 339903 342413 345510 348589 351549 354977 359026 363215 367403 371868 376211 379264 380550 381045 382078
53575C82078J924K263K002J539J236J171J055O09J63K83O78M19n32j001m16K21
$$ 382078 384002 386265 388267 389806 391042 392213 393268 393877 394040 394323 395001 395420 394888 393887 393471 393692
53559C93692j53j070j416j069p24p53j075j568j840j214K06J073L67j123j732
$$ 393692 393539 392469 391053 389984 389260 388507 387432 385864 384024 382810 383016 384089 384456 383333 381601
53544C81601r45L47J228J519J430J222J213J473J677J575J315J097R36J058J860
$$ 381601 380656 381003 382231 383750 385180 386402 387615 389088 390765 392340 393655 394752 395688 396746 398606
53529C98606L081L727L425L073L564M516M952M665M153L775L718M322N606O880
$$ 398606 401687 405414 408839 411912 415476 419992 424944 429609 433762 437537 441255 445577 451183 458063
53515D58063P521P817Q314Q837Q927Q888R485J0745J1875J2389J2667J3293J4278
$$ 458063 465584 473401 481715 490552 499479 508367 517852 528597 540472 552861 565528 578821 593099
53502E93099J5151J5549J5658J6056J7066J8331J9285J9849K0298K0698K1027
$$ 593099 608250 623799 639457 655513 672579 690910 710195 730044 750342 771040 792067
53491G92067K1587K2527K3122K2614K1659K1805K3256K4454K4276K3423K3050
$$ 792067 813654 836181 859303 881917 903576 925381 948637 973091 997367 1020790 1043840
53480A043840K3135K3063K2813K2686K2589K2390K2412K2833K3228K3263K3197
$$ 1043840 1066975 1090038 1112851 1135537 1158126 1180516 1202928 1225761 1248989 1272252 1295449
53469A295449K3159K2637K1365J9961J9075J8559J8095J7809J7643J6900J5232
$$ 1295449 1318608 1341245 1362610 1382571 1401646 1420205 1438300 1456109 1473752 1490652 1505884
53458A505884J3423J2362J1836J1046R743Q199O541M837L282J766k62k951n679
$$ 1505884 1519307 1531669 1543505 1554551 1564294 1572493 1579034 1583871 1587153 1588919 1588657 1585706 1580027
53445A580027p928r795j1328j2199j2521j3021j3900j4586j5129j6527j8927k0847
$$ 1580027 1572099 1562304 1550976 1538777 1526256 1513235 1499335 1484749 1469620 1453093 1434166 1413319
53433A413319k1233k1059k1614k2419k2284k1461k1116k1337k1149k0126j8584
$$ 1413319 1392086 1371027 1349413 1326994 1304710 1283249 1262133 1240796 1219647 1199521 1180937
53422A180937j6592j4112j1778j0270r217p812o176n021m316l475k508j818j141
$$ 1180937 1164345 1150233 1138455 1128185 1118968 1111156 1104980 1099959 1095643 1092168 1089660 1087842 1086701
53409A086701J26J766L043L977N248O988Q741J0453J2431J4452J5928J6907J8007
$$ 1086701 1086827 1088593 1091636 1095613 1100861 1107849 1116590 1127043 1139474 1153926 1169854 1186761 1204768
53396A204768J9447K0965K2527K4277K5933K7081K7908K8951L0290L1786L3704
$$ 1204768 1224215 1245180 1267707 1291984 1317917 1344998 1372906 1401857 1432147 1463933 1497637
53385A497637L6261L8906M0922M2523M4412M6628M8647N0346N1930N3230N3987
$$ 1497637 1533898 1572804 1613726 1656249 1700661 1747289 1795936 1846282 1898212 1951442 2005429
53374B005429N4566N5426N6163N6076N5374N4885N4778N4483N3696N2439N0421
$$ 2005429 2059995 2115421 2171584 2227660 2283034 2337919 2392697 2447180 2500876 2553315 2603736
53363B603736M7343M3667M0160L6793L3054K9068K5420K2077J8439J4386J0325
$$ 2603736 2651079 2694746 2734906 2771699 2804753 2833821 2859241 2881318 2899757 2914143 2924468
53352B924468O254J737l271q343j3151j7436k0743k3031k5212k8216l1828l5377
$$ 2924468 2930722 2932459 2929188 2920845 2907694 2890258 2869515 2846484 2821272 2793056 2761228 2725851
53340B725851l9053m3399m7888n1263n3110n3978n4107n3307n1913n0684m9646
$$ 2725851 2686798 2643399 2595511 2544248 2491138 2437160 2383053 2329746 2277833 2227149 2177503
53329B177503m8198m6367m4892m4039m3347m2610m2022m1337l9907l7699l5316
$$ 2177503 2129305 2082938 2038046 1994007 1950660 1908050 1866028 1824691 1784784 1747085 1711769
53318A711769l3012l0575k8180k6361k5092k3711k1829j9613j7367j5640j5289
$$ 1711769 1678757 1648182 1620002 1593641 1568549 1544838 1523009 1503396 1486029 1470389 1455100
53307A455100j6441j7701j7584j6482j5896j6040j5668j4203j2516j1369j0488
$$ 1455100 1438659 1420958 1403374 1386892 1370996 1354956 1339288 1325085 1312569 1301200 1290712
53296A290712r490q460p222n283k857r30K3M27N95M95O24J800L755N158N597O337
$$ 1290712 1281222 1272762 1265540 1260257 1257400 1256470 1256493 1256920 1257515 1258010 1258634 1260434 1264189 1269347 1274944 1281281
53280A281281Q550J1848J5082J7718J9794K1337K2451K3387K4138K4477K4527
$$ 1281281 1289831 1301679 1316761 1334479 1354273 1375610 1398061 1421448 1445586 1470063 1494590
53269A494590K4584K4455K3773K2958K2706K2498K0847J7389J3564J0815R178
$$ 1494590 1519174 1543629 1567402 1590360 1613066 1635564 1656411 1673800 1687364 1698179 1707357
53258A707357Q032P069N952M113J589q20k750m791p311r742j1628j3398j5427
$$ 1707357 1715389 1722458 1728410 1732523 1734112 1733292 1730542 1725751 1718440 1708698 1697070 1683672 1668245
53245A668245j7251j8510j9804k1733k3840k5390k6631k8287l0194l1401l1385
$$ 1668245 1650994 1632484 1612680 1590947 1567107 1541717 1515086 1486799 1456605 1425204 1393819
53234A393819l0543k9558k8864k8640k8796k8932k8596k7653k6307k4889k3690
$$ 1393819 1363276 1333718 1304854 1276214 1247418 1218486 1189890 1162237 1135930 1111041 1087351
53223A087351k2788k1991k1107k0203j9399j8684j8227j8395j8998j8883j7110
$$ 1087351 1064563 1042572 1021465 1001262 981863 963179 944952 926557 907559 888676 871566
53212H71566j4254j1819j0537j0034r893j0072j0379j0544j0822j1672j2847j3667
$$ 871566 857312 845493 834956 824922 815029 804957 794578 784034 773212 761540 748693 735026
53200G35026j4068j4503j4936j4933j4605j4365j3962j2905j1720j1372j1498
$$ 735026 720958 706455 691519 676586 661981 647616 633654 620749 609029 597657 586159
53189E86159j0783r179q196q577r318r510r619j0124j0438j0125r997j0853j2103
$$ 586159 575376 566197 558001 549424 540106 530596 520977 510853 500415 490290 480293 469440 457337
53176D57337j2585j2003j0817r504q595q601r137r007p811o615o304o313n800
$$ 457337 444752 432749 421932 412428 403833 395232 386095 377088 369277 362662 356358 350045 344245
53163C44245n056m702m379l457k382k158k789l325l246k901k705k649k555k310
$$ 344245 339189 334487 330108 326651 324269 322111 319322 315997 312751 309850 307145 304496 301941 299631
53149B99631j896j492j255q98j3R94R82m50k181k731j756mJ582K384K309J954
$$ 299631 297735 296243 294988 294090 294077 295071 296053 295603 293422 290691 288935 288931 290513 292897 295206 297160
53133B97160K064K534K515J746R82Q44R89R07O63M25K4n33q74r83j348j971k180
$$ 297160 299224 301758 304273 306019 307001 307845 308834 309741 310404 310829 310853 310320 309446 308463 307115 305144 302964
53116C02964j863j867k592l238l178l072l732m754n222m971m336l454k702k935
$$ 302964 301101 299234 296642 293404 290226 287154 283422 278668 273446 268475 264139 260685 257983 255048
53102B55048m230n134m337k539j547j986k951l519l486k924k046j452j563j944
$$ 255048 250818 245684 241347 238808 237261 235275 232324 228805 225319 222395 220349 218897 217334 215390
53088B15390j823j200p40q16j252j790k232k357k160j958j879j610j074p17p47
$$ 215390 213567 212367 211627 210811 209559 207769 205537 203180 201020 199062 197183 195573 194499 193782 193035
53073A93035o93l31l24j214k394k871k525j925j358q86p91j149j374r63k98lK2
$$ 193035 192342 192011 191687 190473 188079 185208 182683 180758 179400 178514 177723 176574 175200 174237 173939 173936 173958
53056A73958K09M38L66J69J11j45r26j681j698j316j426j983k066j259j49N60
$$ 173958 174167 174605 174971 175140 175251 175106 174180 172499 170801 169485 168059 166076 164010 162751 162602 163162
53040A63162N71j67j333k045j621n32J05o8m59o03o83q81r41o10n7L30L06r1n66
$$ 163162 163733 163566 162233 160188 158567 158035 158140 158072 157613 157010 156327 155446 154505 153895 153838 154168 154474 154383 153817
53021A53817p86p52p16o63k62M62R47Q43M43Q2k99o17m23L35R25Q32M97M61M56
$$ 153817 153031 152279 151563 150900 150638 151100 152047 152890 153333 153415 153116 152499 152076 152411 153336 154168 154665 155126 155582
53002A55582J16o5O08J796K442K147J496J203J436J801J588M52q45r46M65K229
$$ 155582 155698 155633 156241 158037 160479 162626 164122 165325 166761 168562 170150 170602 169757 168811 169276 171505
52986A71505L284L783M014L410J691Q1qR94J442P92O8J57P67J111P93l3p77q51
$$ 171505 174789 178572 182586 185996 187687 187768 187760 188754 190196 190988 191056 191213 191980 193091 193884 193851 193074 192223
52968A92223m71n89j448j962j316m53p78j993k473j588l71N2l93j162j722j702
$$ 192223 191752 191163 189715 187753 186437 185984 185206 183213 180740 179152 178781 178833 178440 177278 175556 173854
52952A73854j172o63m29l4P00J003L35m29k24M25J95q35j310p59j02K6M9K97M61
$$ 173854 172682 172019 171590 171556 172256 173259 173594 173165 172941 173366 173561 172726 171416 170657 170555 170581 170630 170927 171388
52933A71388M33O10J006J144J024J149J379R06k11o72K96J700K024J016k92q98
$$ 171388 171821 172431 173437 174581 175605 176754 178133 179039 178828 178156 178452 180152 182176 183192 182900 182002
52917A82002o25M9N48P24R07J306J562J259O34K45J85K12L79Q49J275J126N50
$$ 182002 181377 181426 181974 182698 183605 184911 186473 187732 188366 188611 188796 189008 189387 190236 191511 192637 193187
52900A93187J81K70N84R83J357J313P02J93N14J376J964K140K274K278J939J782
$$ 193187 193368 193638 194222 195205 196562 197875 198577 198770 199284 200660 202624 204764 207038 209316 211255 213037
52884B13037K358K967K430J005J39K59L88K8o0O05J368J697K035K738L273L176
$$ 213037 215395 218362 220792 221797 221936 222195 222583 222611 222551 223156 224524 226221 228256 230994 234267 237443
52868B37443K815K584K230J665J513K092K624K257J313P80J055J739K337K607
$$ 237443 240258 242842 245072 246737 248250 250342 252966 255223 256536 257316 258371 260110 262447 265054
52854B65054K468K035J506R11J75m96p96r08j259j686j514o86m6k22q51j292j502
$$ 265054 267522 269557 271063 271974 272149 271653 270857 269949 268690 267004 265490 264804 264758 264536 263685 262393 260891
52837B60891j815k298k718k867k742k576k724l220l602l464l020k598k032j099
$$ 260891 259076 256778 254060 251193 248451 245875 243151 239931 236329 232865 229845 227247 225215 224116
52823B24116k89k94r49j513j741j882j808j214m94l54o79p85p37j142j703j417
$$ 224116 223827 223533 222584 221071 219330 217448 215640 214426 213932 213578 212899 212114 211377 210235 208532 207115
52807B07115l52J31o13j612j904j820k012k256k086j682j429j235r32p06o48n13
$$ 207115 206763 206894 206281 204669 202765 200945 198933 196677 194591 192909 191480 190245 189313 188607 187959 187446
52791A87446l16n06j147j601j386p19K9O32O32l62j748k314j867j429j434j091
$$ 187446 187130 186624 185477 183876 182490 181771 181800 182432 183064 182702 180954 178640 176773 175344 173910 172819
52775A72819j05L94l87j391j193j10M80K16j32k26n28j167j555j325q72p94j279
$$ 172819 172714 173108 172721 171330 170137 170027 170507 170723 170591 170365 169837 168670 167115 165790 164918 164124 162845
52758A62845k111k945l447l499l175k536j643q08m68o64j034j399j924k526k665
$$ 162845 160734 157789 154342 150843 147668 145132 143489 142681 142213 141549 140515 139116 137192 134666 132001
52743A32001j938o60L96N40l74j654k133j381l42j12m02j19Q39J475J307Q55M42
$$ 132001 130063 129403 129799 130339 129965 128311 126178 124797 124455 124343 123941 123822 124661 126136 127443 128298 128740
52726A28740k29r88r48J84J583K484K897K853K112J049O27J002J204P39K69K42
$$ 128740 128511 127523 126575 126759 128342 130826 133723 136576 138688 139737 140364 141366 142570 143309 143578 143820
52710A43820J54k20j95M37P03N4n96m23j00m66j040j080j071j712k388k115j320
$$ 143820 143974 143754 143559 143996 144699 144753 144157 143734 143634 143168 142128 141048 139977 138265 135877 133762 132442
52693A32442j150j568j596j070p03o47l66J48K18l30r02j040r00q09j044j749
$$ 132442 131292 129724 128128 127058 126355 125708 125342 125490 125708 125378 124476 123436 122536 121727 120683 118934
52677A18934k562k581j411J30R84J030O66r0j223j977j665p95m57p60r23n95j79
$$ 118934 116372 113791 112380 112510 113494 114524 115190 115100 113877 111900 110235 109440 108983 108223 107300 106705 106526
52660A06526nl2k42n08l35N15J367J355O16K7K7M10R08J250J013J76m84k98L74
$$ 106526 106521 106489 106247 105739 105404 105919 107286 108641 109257 109284 109311 109721 110629 111879 112892 113068 112584 112286 112660
52641A12660P49O98M96J26l77n44k91l62r35p20J182L336L559J974O08L12N1p07
$$ 112660 113409 114107 114603 114729 114352 113808 113517 113155 112220 111500 112682 116018 119577 121551 122159 122471 122522 121815
52623A21815j016l90J61j47o24n04k59m98p68m66l8j47l86J8P81R09K46l90n08
$$ 121815 120799 120409 120570 120423 119799 119295 119036 118538 117770 117304 117266 117119 116733 116751 117532 118441 118687 118297 117789
52604A17789m28l98m5Q98J863K011J315O42O97J224J483J281J076J188J359J273
$$ 117789 117361 116963 116918 117816 119679 121690 123005 123647 124344 125568 127051 128332 129408 130596 131955 133228
52588A33228J014Q07P26Q44J254J677J617J161J033J448J628J006K18J41N85Q17
$$ 133228 134242 135049 135775 136619 137873 139550 141167 142328 143361 144809 146437 147443 147661 147802 148387 149204
52572A49204Q55J204J693J724J468J675K304K409J589N80J75L45O88J057J352
$$ 149204 150059 151263 152956 154680 156148 157823 160127 162536 164125 164705 164880 165225 165913 166970 168322
52557A68322J320Q73L20L9J60N72R61R52N49K25K86M39L86L87O69Q42N93N02J205
$$ 168322 169642 170515 170835 170874 171034 171606 172567 173519 174068 174293 174579 175018 175404 175791 176460 177302 177895 178397 179602
52538A79602K103K052J103M50O43R80Q26M74M54Q40J507K263K513J712M31rP05
$$ 179602 181705 183757 184860 185310 185953 186933 187759 188233 188687 189527 191034 193297 195810 197522 197953 197944 198649
52521A98649J312P48m32r68o27k22l71r21j453j738j700j333o68J87J014J474
$$ 198649 199961 200709 200277 199309 198682 198460 198089 197168 195715 193977 192277 190944 190276 190463 191477 192951
52505A92951J437J243J362J718J761J197L25m11q43r70q02m44j38n5j53k16J5
$$ 192951 194388 195631 196993 198711 200472 201669 201994 201583 200740 199770 198968 198524 198386 198331 198178 197962 197977
52488A97977O09J211J345J055R35J286J703J764J588J299O33l38p23P9J274J629
$$ 197977 198586 199797 201142 202197 203132 204418 206121 207885 209473 210772 211405 211067 210344 210423 211697 213326
52472B13326J121O71N70L24p5M1Q13J493J541J209Q28L48j78m15l30k77l18j52
$$ 213326 214447 215118 215688 216012 215937 215978 216791 218284 219825 221034 221862 222210 222032 221617 221287 221010 220692 220540
52454B20540K29L91J47k49o54j082j227p11R5L40j39p19j060j424j802j738j322
$$ 220540 220769 221160 221307 221058 220404 219322 218095 217384 217479 217819 217680 216961 215901 214477 212675 210937 209615
52437B09615j287j742j753p63M02O37o0r35j581j977j961j415p60n82q81j085
$$ 209615 208328 206586 204833 204070 204472 205109 205049 204114 202533 200556 198595 197180 196420 195838 194957 193872
52421A93872p91j66K57J24l66n80j46N55R22Q21M10m49j817k905k642j111L78
$$ 193872 193081 192915 193172 193296 192930 192350 192204 192759 193681 194502 194912 194463 192646 189741 187099 185988 186366
52404A86366Q65O85O25R13J335J673J712J352R48R63J163Q60J44lQ45J827J960
$$ 186366 187231 187916 188541 189454 190789 192462 194174 195526 196474 197437 198600 199460 199604 199601 200446 202273 204233
52387B04233J342O92L57L26O26J110J275Q68K58j73n49r57r28o8J161J883J823
$$ 204233 205575 206267 206624 206950 207576 208686 209961 210829 211087 210914 210365 209408 208480 208412 209573 211456 213279
52370B13279J435J182J193J492K058K648K815K341J504R05Q68J043Q44L68M74
$$ 213279 214714 215896 217089 218581 220639 223287 226102 228443 229947 230852 231720 232763 233607 233975 234449
52355B34449J571K816L072K340J529J188J248J750K801L823L959L296K760K653
$$ 234449 236020 238836 241908 244248 245777 246965 248213 249963 252764 256587 260546 263842 266602 269255
52341B69255K344J564R98J157J636J902J984J949J606J141J185J741J984J603
$$ 269255 271599 273163 274161 275318 276954 278856 280840 282789 284395 285536 286721 288462 290446 292049
52327B92049J441K097K828K703K051J853K277K709K884L060L279L268L016K820
$$ 292049 293490 295587 298415 301118 303169 305022 307299 310008 312892 315952 319231 322499 325515 328335
52313C28335K864L069L315L535L760M215N044N899O208N993N894O258O810P360
$$ 328335 331199 334268 337583 341118 344878 349093 354137 360036 366244 372237 378131 384389 391199 398559
52299C98559Q158R266J0337J1203J2076J2863J3081J2762J2638J3128J3909J4818
$$ 398559 406717 415983 426320 437523 449599 462462 475543 488305 500943 514071 527980 542798
52287E42798J6168J7776J8682J8514J8156J8406J8897J9124J9535K0632K1820
$$ 542798 558966 576742 595424 613938 632094 650500 669397 688521 708056 728688 750508
52276G50508K2216K1927K1613K1312K0720J9986J9364J8528J7206J5911J5111
$$ 750508 772724 794651 816264 837576 858296 878282 897646 916174 933380 949291 964402
52265I64402J4164J2194R557P401O082N062M072L282K478J168n26j986l040l996
$$ 964402 978566 990760 1000317 1007718 1013800 1018862 1022934 1026216 1028694 1029862 1029336 1027350 1024310 1020314
52251A020314m871n383n611n888o119o018n735n579n280m356k996j793p73M67
$$ 1020314 1015443 1010060 1004449 998561 992442 986424 980689 975110 969830 965474 962478 960685 959912 960379
52237I60379J914L318M983P328R781J1246J1734J2468J4112J5889J6805J6846
$$ 960379 962293 965611 970594 977922 987703 998949 1010683 1023151 1037263 1053152 1069957 1086803
52225A086803J6517J6016J5319J4601J4068J3691J3329J2839J1876J0080P590
$$ 1086803 1103320 1119336 1134655 1149256 1163324 1177015 1190344 1203183 1215059 1225139 1232729
52214A232729N064K991J249n96k734m970o956q625j0412j2700j4986j6190j6207
$$ 1232729 1237793 1240784 1242033 1241437 1238703 1233733 1226777 1218152 1207740 1195040 1180054 1163864 1147657
52201A147657j6380j7750j9522k0240j9982k0061k0822k1117k0167j8699j7748
$$ 1147657 1131277 1113527 1094005 1073765 1053783 1033722 1012900 991783 971616 952917 935169
52190I35169j7287j6664j5575j4108j2370j0683r624r379r414r182q779q533q298
$$ 935169 917882 901218 885643 871535 859165 848482 838858 829479 820065 810883 802104 793571 785273
52177G85273p634o530n514n099n345n853o039n552m593l768l530l825m266m544
$$ 785273 777639 771109 765595 760496 755151 749298 743259 737707 733114 729346 725816 721991 717725 713181
52163G13181m592m464m100l338k227j347j389k407l712m688n254n399m810l455
$$ 713181 708589 704125 700025 696687 694460 693113 691724 689317 685605 680917 675663 670264 665454 661999
52149F61999k071j501j684j898j760j571j772k464l377l936l616k618j854j927
$$ 661999 659928 658427 656743 654845 653085 651514 649742 647278 643901 639965 636349 633731 631877 629950
52135F29950k447k806l104l682m184l947l094k333j860j267n20j53m22r69j534
$$ 629950 627503 624697 621593 617911 613727 609780 606686 604353 602493 601226 600706 600553 600131 599162 597628
52120E97628k201k844k909k141r84j02K25J28J8L68J228K036K310K457L241M609
$$ 597628 595427 592583 589674 587533 586549 586447 586672 586800 586818 587186 588414 590450 592760 595217 598458 603067
52104F03067N666N870N676N858O781Q333J0075J1389J2011J2476J3570J5375J7361
$$ 603067 608733 614603 620279 626137 632918 641251 651326 662715 674726 687202 700772 716147 733508
52091G33508J9284K1276K3153K4444K5255K6243K7610K8776K9289K9328K9126
$$ 733508 752792 774068 797221 821665 846920 873163 900773 929549 958838 988166 1017292
52080A017292K8606K7851K7236K6773K5938K4526K3006K1759K0471J8663J6251
$$ 1017292 1045898 1073749 1100985 1127758 1153696 1178222 1201228 1222987 1243458 1262121 1278372
52069A278372J3313R964O742M424K980J367j106l857o023p695r445j1166j2348
$$ 1278372 1291685 1301649 1308391 1312815 1315795 1317162 1316056 1312199 1306176 1298481 1289036 1277870 1265522
52056A265522j3124j4093j5257j5974j5996j5765j5503j4818j3553j2336j1757
$$ 1265522 1252398 1238305 1223048 1207074 1191078 1175313 1159810 1144992 1131439 1119103 1107346
52045A107346j1400j0322q374o446n303m583l389j539K19J325K177L506N320P006
$$ 1107346 1095946 1085624 1077250 1070804 1065501 1060918 1057529 1055990 1056209 1057534 1059711 1063217 1068537 1075543
52031A075543Q334R724J1377J2704J3045J2663J2508J2998J3464J2999J1614J0279
$$ 1075543 1083877 1093601 1104978 1117682 1130727 1143390 1155898 1168896 1182360 1195359 1206973 1217252
52019A217252R764R719R134P558N561L971K986K145Q55j202l919o743r042j0750
$$ 1217252 1227016 1236735 1245869 1253427 1258988 1262959 1265945 1268090 1268945 1267743 1263824 1257081 1248039 1237289
52005A237289j2420j4436j6462j8000j9217k0697k2629k4659k6506k8208k9732
$$ 1237289 1224869 1210433 1193971 1175971 1156754 1136057 1113428 1088769 1062263 1034055 1004323
51994A004323l0726l0894l0368k9667k9357k9670l0315l0761l0767l0494k9973
$$ 1004323 973597 942703 912335 882668 853311 823641 793326 762565 731798 701304 671331
51983F71331k8790k6619k3873k1459k0000j9459j9283j8858j7981j7058j6472
$$ 671331 642541 615922 592049 570590 550590 531131 511848 492990 475009 457951 441479
51972D41479j5795j4274j2213j0974j1088j1306j0390q936q302q337p680o043
$$ 441479 425684 411410 399197 388223 377135 365829 355439 346503 338201 329864 322184 316141
51960C16141m729m666n224n423n253n174n185n020m694m297l702k971k579k800
$$ 316141 311412 306746 301522 296099 290846 285672 280487 275467 270773 266476 262774 259803 257224 254424
51946B54424l137k896k116j591j927k820l327k834j741j056j290k021k654l114
$$ 254424 251287 248391 246275 244684 242757 239937 236610 233776 232035 230979 229689 227668 225014 221900
51932B21900l484l498k996k423k245k127j493o19l42p61j097q80m93l57l50k58
$$ 221900 218416 214918 211922 209499 207254 205127 203634 203015 202673 201912 200815 199935 199442 199085 198735 198477
51916A98477k47o28j431k372k912k597j700j165j457j857j577j025j100j661j863
$$ 198477 198230 197602 196171 193799 190887 188290 186590 185425 183968 182111 180534 179509 178409 176748 174885
51901A74885j691j851k240j980j088p15j322j972j959j816k022j874o71R02J581
$$ 174885 173194 171343 169103 167123 166035 165320 163998 162026 160067 158251 156229 154355 153684 154586 156167
51886A56167J144L99o5l17n95r62j300j362j108r86j405j917j685q35m08o91o59
$$ 156167 157311 157710 157645 157328 156733 155771 154471 153109 152001 151015 149610 147693 146008 145173 144765 144074 143415
51869A43415M56J933K622K449K104J912J741J553J329Q78K53j1L95J009J280J296
$$ 143415 143871 145804 148426 150875 152979 154891 156632 158185 159514 160392 160645 160634 161029 162038 163318 164614
51853A64614J395J535J537J527J706K027K383K658K413J268j76o39J33Q91O46
$$ 164614 166009 167544 169081 170608 172314 174341 176724 179382 181795 183063 182887 182248 182381 183272 183918
51838A83918MK6N83Q09N26K29R6p0k43k55k63m81p38p75o44m35o3K16j35r02r51
$$ 183918 183922 183948 184531 185340 185866 186095 186191 186121 185878 185623 185360 184879 184141 183366 182722 182287 182224 182440 182305 181403 180452
51817A80452J58J235J057J18l08j02n5k08Q4P09Q02J96k82k06q3l09n21k76L47
$$ 180452 180610 181845 182902 183020 182712 182610 182555 182347 182431 183140 183942 184138 183856 183650 183567 183258 182737 182461 182808
51798A82808J032J473J264K34j004j524j235q77q26o56m3N93P40M90K93L89P14
$$ 182808 183840 185313 186577 186811 185807 184283 183048 182171 181345 180689 180646 181239 181979 182469 182762 183151 183865
51781A83865J054J051N01k65n58p5P54J277J234R15Q21J228J857K034J354J18
$$ 183865 184919 185970 186471 186206 185648 185573 186327 187604 188838 189753 190574 191802 193659 195693 197047 197165
51765A97165r94j491j235l59P28J537J943K148K153J762J337J721K986L925L567
$$ 197165 196171 194680 193445 193086 193814 195351 197294 199442 201595 203357 204694 206415 209401 213326 216893
51750B16893K562K222K633K710J989J247J270J869K379K499K371K247K244K190
$$ 216893 219455 221677 224310 227020 229009 230256 231526 233395 235774 238273 240644 242891 245135 247325
51736B47325J716Q21J33K68J072J908K453K759K780K530K491L195M353M977M520
$$ 247325 249041 249862 249995 250263 251335 253243 255696 258455 261235 263765 266256 269451 273804 278781 283301
51721B83301L372K239J458R79O53M58O09J313K315K889K600J726P18l38j328j765
$$ 283301 286673 288912 290370 291349 292002 292460 293069 294382 296697 299586 302186 303912 304630 304292 302964 301199
51705C01199j425q68o74o38l55j55n88j369j813j969k341k677k208j030j30J20
$$ 301199 299774 298906 298232 297594 297239 297084 296496 295127 293314 291345 289004 286327 284119 283089 282959 283079
51689B83079L86J099J764J951K012K315K572K515K649L624N255O687P254O785
$$ 283079 283465 284564 286328 288279 290291 292606 295178 297693 300342 303966 309221 315908 323162 329947
51675C29947N334L120O92j209k096k051j632j380j279q83q6N67O26N15J007K153
$$ 329947 335281 338401 339093 337884 335788 333737 332105 330725 329446 328563 328477 329044 329670 330185 331192 333345
51659C33345L202L553L350L187L504M170M261K695m87l721n417n643n689o240
$$ 333345 336547 340100 343450 346637 350141 354311 358572 361267 360780 357059 351642 345999 340310 334070
51645C34070o769o630n917n126m608m468m509m251l462k559k067j865j576j371
$$ 334070 327301 320671 314754 309628 305020 300552 296043 291792 288330 285771 283704 281839 280263 278892
51631B78892j670k280k623k669k810k906k387j297l91p8r3k64p69j436j663j216
$$ 278892 277222 274942 272319 269650 266840 263934 261547 260250 259859 259781 259688 259424 258655 257219 255556 254340
51615B54340m88J71O47O66jq41r97m75o6o9O3N85J101J420J775J875R92o15j468
$$ 254340 253852 254023 254670 255336 255335 254494 253497 253022 252956 252887 252950 253535 254636 256056 257831 259706 260698 260083 258615
51596B58615p08P84J723J918J840J644J429J608K212K550K316K281L059L962L986
$$ 258615 257907 258691 260414 262332 264172 265816 267245 268853 271065 273615 275931 278212 281271 285233 289219
51581B89219L349K974K999K840K401K194K356K430K119J518P63Pl01J71J070J712
$$ 289219 292568 295542 298541 301381 303782 305976 308332 310762 312881 314399 315162 315169 314868 315039 316109 317821
51565C17821J892J821J514Q51J20k17k24l25n14l35L17R12R84O70M08M69R24J726
$$ 317821 319713 321534 323048 323899 324019 323802 323578 323253 322739 322404 322721 323633 324617 325287 325695 326164 327088 328814
51547C28814K635L214L103K335J339O09K92O8l41o93m73L77J323J852J822J206
$$ 328814 331449 334663 337766 340101 341440 342049 342341 342409 342068 341375 340902 341279 342602 344454 346276 347482
51531C47482J09q28p37L79J405J370N63j21l96n86p82p73o36p86j304j727j618
$$ 347482 347591 346763 346026 346405 347810 349180 349743 349622 349226 348640 347858 347085 346449 345663 344359 342632 341014
51514C41014j150r69j544k569l109k618j778j820k947m010m055l486l191l164
$$ 341014 339864 338895 337351 334782 331673 329055 327277 325457 322510 318500 314445 310959 307768 304604
51500C04604k751j913j325j286j297q81l22k25o74j110r73l41J57J37k6J87N94
$$ 304604 301853 299940 298615 297329 296032 295151 294829 294604 293930 292820 291847 291506 291663 291800 291774 291961 292555
51483B92555O07L18N26J470K341K499K373K553K702K265J661J849K943M180N047
$$ 292555 293162 293480 294006 295476 297817 300316 302689 305242 307944 310209 311870 313719 316662 320842 325889
51468C25889N557N546M729L538L047L613M402M512M052L688L657L687L558L334
$$ 325889 331446 336992 341721 345259 348306 351919 356321 360833 364885 368573 372230 375917 379475 382809
51454C82809L134K966K783K502K114J721J426J202R91Q56Q29P38M55J59R2Q5k92
$$ 382809 385943 388909 391692 394194 396308 398029 399455 400657 401648 402504 403333 404071 404526 404685 404777 404862 404570
51437D04570j162k218l107l633l622l048k237j641j318j111j217j992l076l468
$$ 404570 403408 401190 398083 394450 390828 387780 385543 383902 382584 381473 380256 378264 375188 371720
51423C71720k824k113k353l127l067j698m9O74L41m35j212j778j716o96P83J673
$$ 371720 368896 366783 364430 361303 358236 356538 356489 357163 357504 357069 355857 354079 352363 351667 352450 354123
51407C54123J546J055R82J276J353R42K22n95j279j509j318j414k363l641m164
$$ 354123 355669 356724 357706 358982 360335 361277 361499 360904 359625 358116 356798 355384 353021 349380 345216
51392C45216l838l745m549n544n772n329m938m734m336l797l664m022m283m044
$$ 345216 341378 337633 333084 327540 321768 316439 311501 306767 302431 298634 294970 290948 286665 282621
51378B82621l639l563l735l720l311k646j841q98k8L21q3q69j467j796k323l266
$$ 282621 278982 275419 271684 267964 264653 262007 260166 259268 259240 259561 259478 258609 257142 255346 253023 249757
51362B49757m146m355m024l852m151m398l926k707j417p98j011j475j407o53J84
$$ 249757 245611 241256 237232 233380 229229 224831 220905 218198 216781 215983 214972 213497 212090 211437 211621
51347B11621N28N12N15M27m9n89m80L58J218J549J394Q85O5n81k98Q59J806J807
$$ 211621 212149 212661 213176 213603 213554 212965 212485 212843 214061 215610 217004 217889 217954 217373 217075 217934 219740 221547
51329B21547J406J436J698J410N57n4N6N23Q32R44J041J059P64K26n0L36J013
$$ 221547 222953 224389 226087 227497 228054 228000 228056 228579 229411 230355 231396 232455 233219 233445 233395 233731 234744
51312B34744R99j69j776k750k960l053l271l201k690k141j788j449j194j345j610
$$ 234744 235743 235574 233798 231048 228088 225035 221764 218563 215873 213732 211944 210495 209301 207956 206346
51297B06346j220k47K13l39j077j392j954l241m207l667k253j464j353p66M68
$$ 206346 205126 204879 205092 204753 203676 202284 200330 197089 192882 189215 186962 185498 184145 183379 183847
51282A83847J153O62k44q08j221j757k029j728j241r93p83k97K10K45k16p32q79
$$ 183847 185000 185662 185418 184610 183389 181632 179603 177875 176634 175641 174858 174561 174771 175016 174800 174068 173189
51265A73189n98k57l59r30j369j210q35q76j217j253r24o49l66L49J170J099L
$$ 173189 172591 172334 171975 171045 169676 168466 167631 166755 165538 164285 163361 162712 162346 162695 163865 164964 164967
51248A64967r80j073r25j389k019j767n68O39J200J194Q01N1q02j307j382j330
$$ 164967 163987 162914 161989 160600 158581 156814 156246 156885 158085 159279 160080 160131 159329 158022 156640 155310
51232A55310j231q41j46M61P59R49J149J052M91q8j33K24M03K49J54K49J30l74
$$ 155310 154079 153238 153092 153553 154312 155261 156410 157462 157953 157865 157732 157956 158359 158608 158762 159011 159141 158767
51214A58767p27m11K43N33M44N66J076J476J424J249J340J616J795J826J760J572
$$ 158767 158040 157629 157872 158405 158849 159415 160491 161967 163391 164640 165980 167596 169391 171217 172977 174549
51198A74549J284R92N92j08q25q95k42K94K2o69q78l74L24P22P38N07K30Q1l6
$$ 174549 175833 176825 177417 177309 176484 175589 175347 175641 175663 174994 174116 173742 174066 174788 175526 176033 176263 176344 176308
51179A76308m12r75j151o46QJ23k77o91q45p08k19L97L96o92k226k997k566j521
$$ 176308 175896 174921 173770 173124 173132 173255 172978 172287 171442 170734 170515 170912 171308 170616 168390 165393 162827 161306
51161A61306o41k95m93r16j019o30l57q34j702j951j219k19K15o1o83j243j486
$$ 161306 160665 160370 159877 158961 157942 157312 156955 156121 154419 152468 151249 151030 151245 151184 150501 149258 147772
51144A47772j299p80j53L37M57J96ML72R90R34j6q26n51M30J143J412J667J883
$$ 147772 146473 145693 145540 145877 146334 146530 146534 146906 147896 148830 148814 147988 147437 147867 149010 150422 152089 153972
51126A53972J608Q76J44m99j280k044k338k094j604j008m05j71m81q21o84l35
$$ 153972 155580 156456 156600 156101 154821 152777 150439 148345 146741 145733 145328 145157 144676 143855 143171 142836
51110A42836k05qN86R96N67j07MO43P19K24J74P53J095J006J227J808J808J108
$$ 142836 142631 142623 143209 144205 144772 144665 144669 145312 146031 146255 146429 147182 148277 149283 150510 152318 154126 155234
51092A55234Q87J675K435K323J904J826J692J171R52J439J715J020J57J98O37
$$ 155234 156121 157796 160231 162554 164458 166284 167976 169147 170099 171538 173253 174273 174430 174628 175265
51077A75265K96o43r85n00j39l14l12M28J409J763J256L84j69j45R0O2j9M62J389
$$ 175265 175561 174918 173933 173433 173294 172980 172668 173096 174505 176268 177524 177908 177739 177594 177684 177746 177727 178189 179578
51058A79578J783J183L71J71L15K40K63R97K123K762K752K605K476K083J466R70
$$ 179578 181361 182544 182915 183086 183401 183641 183904 184901 187024 189786 192538 195143 197619 199702 201168 202138
51042B02138N75K5m51k67O56J740K468K711K416J609O43k7l13l66j67K53N26M10
$$ 202138 202713 202738 202287 202020 202676 204416 206884 209595 212011 213620 214263 214236 213923 213557 213390 213643 214169 214579
51024B14579L16P06J165Q14l84j423j489p60O0N21N72M29M92R78J554J698J440
$$ 214579 214895 215601 216766 217580 217196 215773 214284 213524 213584 214105 214677 215106 215598 216576 218130 219828 221268
51007B21268J450K171L200L657L094J989J386J926L194M232M680N045N710O290
$$ 221268 222718 224889 228089 231746 234840 236829 238215 240141 243335 247567 252247 257292 263002 269292
50993B69292O401O528P388Q692R337Q877Q175Q331R489J0935J2132J3266J4800
$$ 269292 275693 282221 289609 298301 307638 316515 324690 333021 342510 353445 365577 378843 393643
50980C93643J6658J8155J8903J9545K1086K3598K6248K8579L1097L4279L7837
$$ 393643 410301 428456 447359 466904 487990 511588 537836 566415 597512 631791 669628
50969F69628M1527M5909N1561N7991O4159O9670P4690P9028Q2308Q4846Q7366
$$ 669628 711155 757064 808625 866616 930775 1000445 1075135 1154163 1236471 1321317 1408683
50958A408683Q9694R0629Q9298Q5929Q1011P4337O5384N4332M2225L0197J8622
$$ 1408683 1498377 1589006 1678304 1764233 1845244 1919581 1984965 2039297 2081522 2111719 2130341
50947B130341P107m770j6652k7517l6558m3586m8601n1466n2384n2083n1013m8859
$$ 2130341 2137448 2132678 2116026 2088509 2051951 2008365 1959764 1908298 1855914 1803831 1752818 1703959
50935A703959m5458m1792l9180l7781l6697l5457l4506l4234l4434l4915l5953
$$ 1703959 1658501 1616709 1577529 1539748 1503051 1467594 1433088 1398854 1364420 1329505 1293552
50924A293552l7771m0079m2381m4324m5671m6347m6638m6824m6563m5091m2217
$$ 1293552 1255781 1215702 1173321 1128997 1083326 1036979 990341 943517 896954 851863 809646
50913H09646l8618l5058l1710k8456k5322k2352j9442j6626j4243j2530j1300
$$ 809646 771028 735970 704260 675804 650482 628130 608688 592062 577819 565289 553989
50902E53989j0130q728p013n130l457k281j380k02J357K716L304L238L028K874
$$ 553989 543859 535131 528118 522988 519531 517250 515870 515668 517025 519741 523045 526283 529311 532185
50888E32185K623K322K350K874L447L541L420M025N696P437Q029P710P965R512
$$ 532185 534808 537130 539480 542354 545801 549342 552762 556787 562483 569920 577949 585659 593624 603136
50874F03136J1345J2169J2106J2305J3368J4946J6463J7607J8314J9021K0687
$$ 603136 614481 626650 638756 651061 664429 679375 695838 713445 731759 750780 771467
50863G71467K3867K7874L1614L5005L8876M3617M8864N4472O0827O8033P5744
$$ 771467 795334 823208 854822 889827 928703 972320 1021184 1075656 1136483 1204516 1280260
50852A280260Q4134R4154J06249J19483J32488J44846J57001J69211J81027J91648
$$ 1280260 1364394 1458548 1564797 1684280 1816768 1961614 2118615 2287826 2468853 2660501
50842B660501K00334K06571K09985K09998K05567J95561J79403J57185J29392
$$ 2660501 2860835 3067406 3277391 3487389 3692956 3888517 4067920 4225105 4354497
50833D354497R7137O2566K8081n046l6730o6454r2503j13133j27819j36738j39800
$$ 4354497 4451634 4514200 4542281 4537235 4500505 4434051 4341548 4228415 4100596 3963858 3824058
50822C824058j37009j29421j18802j06598r3871q2028p2615o6303o2738o1570
$$ 3824058 3687049 3557628 3438826 3332228 3238357 3156329 3083714 3017411 2954673 2893103
50812B893103o2929o6723p2046p7826q3617q9466r5216j00329j04277j06738j07473
$$ 2893103 2830174 2763451 2691405 2613579 2529962 2440496 2345280 2244951 2140674 2033936 1926463
50801A926463j06316j03387r9024r3482q6840p9280p1267o3319n5718m8642m2426
$$ 1926463 1820147 1716760 1617736 1524254 1437414 1358134 1286867 1223548 1167830 1119188 1076762
50790A076762l7319l2961k8443k3219j7688j2697q580n011j628J469L924N468
$$ 1076762 1039443 1006482 978039 954820 937132 924435 915855 910844 909216 910685 914609 920077
50778I20077N996N498M221K755J771J446J198J22k100m710o485o888o479o232
$$ 920077 926073 931571 935792 938547 940318 941764 942962 943084 940984 936274 929789 922901 916422 910190
50764I10190o725q002r709j1123j1383j0215q262o391m881l578k492j656n48J594
$$ 910190 903465 895463 885754 874631 863248 853033 844771 838380 833499 829921 827429 825773 825225 826819
50750H26819M731P832R991J1378J2870J5059J7912K1134K4558K8196L2072L6149
$$ 826819 831550 839382 849373 860751 873621 888680 906592 927726 952284 980480 1012552 1048701
50738A048701M0398M5006N0345N6680O3895P1634P9602Q7659R5800J04143J12675
$$ 1048701 1089099 1134105 1184450 1241130 1305025 1376659 1456261 1543920 1639720 1743863 1856538
50727A856538J20827J27557J32090J34295J34117J31047J24574J14800J01916
$$ 1856538 1977365 2104922 2237012 2371307 2505424 2636471 2761045 2875845 2977761
50718B977761Q5418O4628M0035J3455j3243l8854o2187q1620r5879j04808j08888
$$ 2977761 3063179 3127807 3167842 3181297 3168054 3129200 3067013 2985393 2889514 2784706 2675818
50707B675818j08384j03539r5407q5806p6222o7048n8074m9543m2421l7592l5077
$$ 2675818 2567434 2463895 2368488 2282682 2206460 2139412 2081338 2031795 1989374 1951782 1916705
50696A916705l4364l5401l8636m3933m9974n5298n9538o3106o5873o6939o5728
$$ 1916705 1882341 1846940 1808304 1764371 1714397 1659099 1599561 1536455 1470582 1403643 1337915
50685A337915o2702n8804n4623n0267m5634m0590l5176k9705k4539j9775j5420
$$ 1337915 1275213 1216409 1161786 1111519 1065885 1025295 990119 960414 935875 916100 900680
50674I00680j1642q410n071r02L922Q555J2630J6515K0331K3465K5497K6886K8258
$$ 900680 889038 880628 875557 874655 878577 887132 899762 916277 936608 960073 985570 1012456 1040714
50661A040714K9398K9485K8136K5849K3535K1834K0717J9613J8044J6161J4428
$$ 1040714 1070112 1099597 1127733 1153582 1177117 1198951 1219668 1239281 1257325 1273486 1287914
50650A287914J2938J1588J0744J1005J2094J2809J2571J2240J2985J4898J7415
$$ 1287914 1300852 1312440 1323184 1334189 1346283 1359092 1371663 1383903 1396888 1411786 1429201
50639A429201K0383K3882K7400L0256L2813L6104M0042M2936M3389M1995M0440
$$ 1429201 1449584 1473466 1500866 1531122 1563935 1600039 1640081 1683017 1726406 1768401 1808841
50628A808841L9263L7329L3552K8360K3149J8710J4760J0788O779L110K09j411
$$ 1808841 1848104 1885433 1918985 1947345 1970494 1989204 2003964 2014752 2021531 2024641 2024850 2023439
50616B023439j324L33K877N866R517J3966J8460K1863K3732K4267K3440K0918
$$ 2023439 2022115 2022448 2025325 2031191 2040708 2054674 2073134 2094997 2118729 2142996 2166436 2187354
50604B187354J6873J2135P342K474k623p900j3472j9755k6853l4311m1753m9277
$$ 2187354 2204227 2216362 2223704 2226178 2223555 2215655 2202183 2182428 2155575 2121264 2079511 2030234
50592B030234n6836o3600o8513p1203p2058p1603p0102o7675o4522o1008n7575
$$ 2030234 1973398 1909798 1841285 1770082 1698024 1626421 1556319 1488644 1424122 1363114 1305539
50581A305539n4376n1041m7118m2738l8568l5041l2015k9177k6250k2855j8763
$$ 1305539 1251163 1200122 1153004 1110266 1071698 1036657 1004642 975465 949215 926360 907597
50570I07597j4498j1030q561o281l669j235N21K219M840Q235J1305J3461J5147
$$ 907597 893099 882069 873508 867227 863558 862323 862844 865063 869903 878138 889443 902904 918051
50557I18051J6950J8965K1148K3674K6650K9807L2693L5074L7036L8866M0837
$$ 918051 935001 953966 975114 998788 1025438 1055245 1087938 1123012 1160048 1198914 1239751
50546A239751M2948M4881M6216M6717M6400M5536M4518M3485M2145M0305L8541
$$ 1239751 1282699 1327580 1373796 1420513 1466913 1512449 1556967 1600452 1642597 1682902 1721443
50535A721443L7774L8119L8793L9371M0305M1857M3417M4670M6641N0495N5701
$$ 1721443 1759217 1797336 1836129 1875500 1915805 1957662 2001079 2045749 2092390 2142885 2198586
50524B198586O0539O4256O7646P1485P5515P9151Q2120Q3962Q3890Q1766P8455
$$ 2198586 2259125 2323381 2391027 2462512 2538027 2617178 2699298 2783260 2867150 2948916 3027371
50513C027371P4521O9205O1398N1135L9277K6210J1854l268j8024l1883m5263
$$ 3027371 3101892 3171097 3232495 3283630 3322907 3349117 3360971 3357703 3339679 3307796 3262533
50502C262533n8332p0181p9646q6319r0156r0650q7179q0022p0365n9284m7157
$$ 3262533 3204201 3134020 3054374 2968055 2877899 2787249 2700070 2620048 2549683 2490399 2443242
50491B443242l4139k0708p645M175J3943K1294K6566L0278L2215L1421K7069J8924
$$ 2443242 2409103 2388395 2380750 2384925 2398868 2420162 2446728 2477006 2509221 2540642 2567711 2586635
50479B586635O954q703k6943m5518o2194p5874q6350r3523r7438r8699r8166r6382
$$ 2586635 2593589 2584886 2557943 2512425 2450231 2374357 2288007 2194484 2097046 1998347 1900181 1803799
50467A803799r3563q9791q4916p8772p1958o5758o0707n5851n0192m4155l8693
$$ 1803799 1710236 1620445 1535529 1456757 1384799 1319041 1258334 1202483 1152291 1108136 1069443
50456A069443l3653k8312k3092j9131j6303j3205r359n835l347j096J722M650
$$ 1069443 1035790 1007478 984386 965255 948952 935747 926388 920553 917206 916110 917832 922482
50444I22482O966Q901J0949J2945J4725J6892J9861K2880K5015K6540K8315L0266
$$ 922482 929448 938349 949298 962243 976968 993860 1013721 1036601 1061616 1088156 1116471 1146737
50432A146737L1584L2225L3115L4812L6834L8380L9127L9208L8915L8545L8178
$$ 1146737 1178321 1210546 1243661 1278473 1315307 1353687 1392814 1432022 1470937 1509482 1547660
50421A547660L7615L6714L5601L4375L2843L0945K8990K7272K5736K4443K3967
$$ 1547660 1585275 1621989 1657590 1691965 1724808 1755753 1784743 1812015 1837751 1862194 1886161
50410A886161K4845K6834K9190L1355L3038L3943L3920L3163L1945L0345K8407
$$ 1886161 1911006 1937840 1967030 1998385 2031423 2065366 2099286 2132449 2164394 2194739 2223146
50399B223146K6239K3597J9967J5285J0096M640j592q978j7094k5525l4591m4515
$$ 2223146 2249385 2272982 2292949 2308234 2318330 2322970 2321378 2312400 2295306 2269781 2235190 2190675
50387B190675n4454o3176p0263p5770p9213p9881p8003p4616p0356o5107n8776
$$ 2190675 2136221 2073045 2002782 1927012 1847799 1767918 1689915 1615299 1544943 1479836 1421060
50376A421060n1578m3638l5029k6186j7678r693k263M195R232J3056J6117J8081
$$ 1421060 1369482 1325844 1290815 1264629 1246951 1237258 1234995 1239190 1248422 1261478 1277595 1295676
50364A295676J7923J4984R434J867o843j5465k2947k9050l3938l7455l9383m0161
$$ 1295676 1313599 1328583 1338017 1339884 1333041 1317576 1294629 1265579 1231641 1194186 1154803 1114642
50352A114642m0465m0206l8802l6336l3645l1284k9161k7158k5278k3209k0572
$$ 1114642 1074177 1033971 995169 958833 925188 893904 864743 837585 812307 789098 768526
50341G68526j7654j5201j3421j1915j0447r003p243m846k361p43N1J046K672M319
$$ 768526 750872 735671 722250 710335 699888 690885 683642 678796 676435 675692 675743 676789 679461 683780
50327F83780N551O736Q073R100R629J0230J1262J2310J3131J4267J6037J7691
$$ 683780 689331 696067 704140 713240 722869 733099 744361 756671 769802 784069 800106 817797
50315H17797J8327J8115J7920J8208J8900J9804K0616K0904K0617K0224J9882
$$ 817797 836124 854239 872159 890367 909267 929071 949687 970591 991208 1011432 1031314
50304A031314J9005J7113J4652J2397J0563R059Q070P542O576M256R67j927l725
$$ 1031314 1050319 1067432 1082084 1094481 1105044 1114103 1122173 1129715 1136291 1140547 1141514 1139587 1135862
50291A135862m998o499q124r257r687r891j0602j2232j4584j6981j8821j9983
$$ 1135862 1130864 1124365 1116241 1106984 1097297 1087406 1076804 1064572 1049988 1033007 1014186 994203
50279I94203k0697k1173k1455k1557k1486k1132k0316j8960j7328j6063j5838
$$ 994203 973506 952333 930878 909321 887835 866703 846387 827427 810099 794036 778198
50268G78198j6743j8040j8754j8520j7613j6314j4616j2651j0900r798r294q978
$$ 778198 761455 743415 724661 706141 688528 672214 657598 644947 634047 624249 614955 605977
50256F05977q481p611o335m781l209j900j113r45j128j097n97J4L15M75R18J602
$$ 605977 597496 589885 583550 578769 575560 573660 572547 571602 570474 569377 568780 568794 569109 569584 570502 572104
50240E72104K052K055J797J487J241J236J338Q57o08k248k787k148j512j613j957
$$ 572104 574156 576211 578008 579495 580736 581972 583310 584167 583559 581311 578524 576376 574864 573251 571294
50225E71294j960j918k356l168l915m350m226l227j612l00J75K68N57Q99J003
$$ 571294 569334 567416 565060 561892 557977 553627 549401 546174 544562 544262 544437 544705 545262 546161 547164
50210E47164J170J767K470K728K616K571K632K557K368K196J895J436J340K039
$$ 547164 548334 550101 552571 555299 557915 560486 563118 565675 568043 570239 572134 573570 574910 576949
50196E76949L005L232K464J344M09l42j008j529j984k575l190l440l300l280l817
$$ 576949 579954 583186 585650 586994 587403 587061 586053 584524 582540 579965 576775 573335 570035 566755 562938
50181E62938m754n560n907n926o036o512p076p019n944m254k832k206k204k087
$$ 562938 558184 552624 546717 540791 534755 528243 521167 514148 508204 503950 501118 498912 496708 494621
50167D94621j033J186L681M984M541L349K694K554J867J83j673k765l098l302
$$ 494621 493588 494774 498455 503439 507980 511329 514023 516577 518444 518627 516954 514189 511091 507789
50153E07789l679m038m187m192m148m014l688l148k449j683r64m23j65k40o11
$$ 507789 504110 500072 495885 491693 487545 483531 479843 476695 474246 472563 471599 471176 471011 470771 470160
50138D70160j125j470j277m83M15P25K96l06m66j86K23P27J456K157K259J521
$$ 470160 469035 467565 466288 465805 466220 466945 467241 466935 466469 466283 466506 467233 468689 470846 473105 474626
50122D74626L20p00r64j77J341K595K691J821J038J079J777K540K892K544J525
$$ 474626 474946 474246 473282 473105 474446 477041 479732 481553 482591 483670 485447 487987 490879 493423 494948
50107D94948M18q7P1L90O19R21J288J435J366J377J418J174R11J379K593L609
$$ 494948 495366 495279 495350 495740 496359 497280 498568 500003 501369 502746 504164 505338 506249 507628 510221 513830
50091E13830L854L859M207M625M708M727M998N217N163N403O428P666Q233Q179
$$ 513830 517684 521543 525750 530375 535083 539810 544808 550025 555188 560591 567019 574685 582918 591097
50077E91097Q133Q140P844P477P598Q001P930P342P041P325P394O477M954L944
$$ 591097 599230 607370 615214 622691 630289 638290 646220 653562 660603 667928 675322 681799 686753 690697
50063F90697L988M511M472L546K580K680L817M821M905M651M939N540N502M683
$$ 690697 694685 699196 703668 707214 709794 712474 716291 721112 726017 730668 735607 741147 746649 751332
50049G51332M029M365N506O603O993O658O218O375P160P888Q084Q055Q254Q634
$$ 751332 755361 759726 765232 771835 778828 785486 791704 798079 805239 813127 821211 829266 837520 846154
50035H46154R021R625J0581J1501J2122J2918J4350J6043J7578J9507K2476K5724
$$ 846154 855175 864800 875381 886882 899004 911922 926272 942315 959893 979400 1001876 1027600
50023A027600K7710K8106K7944K7734K6692K4129K0437J6326J2061Q015N016L530
$$ 1027600 1055310 1083416 1111360 1139094 1165786 1189915 1210352 1226678 1238739 1246754 1251770 1255300
50011A255300L101L083L401M041M437L884K173o10m496r387j4699j9749k4240
$$ 1255300 1258401 1261484 1264885 1268926 1273363 1277247 1279420 1278810 1274314 1264927 1250228 1230479 1206239
49998A206239k8159l1404l3799l5189l5446l4652l3357l2217l1189k9618k7347
$$ 1206239 1178080 1146676 1112877 1077688 1042242 1007590 974233 942016 910827 881209 853862
49987H53862k5185k3886k3147k2151k0697j9265j8101j6895j5410j3984j3119
$$ 853862 828677 804791 781644 759493 738796 719531 701430 684535 669125 655141 642022
49976F42022j2806j2444j1477r991q501p294o278n506n320n606n431m091k229
$$ 642022 629216 616772 605295 595304 586803 579509 573231 567725 562405 556799 551368 547277 545048
49963E45048j128j027r72m78k68r81j990k216j617j068j126j528j854j969j799
$$ 545048 543920 542893 541921 541443 541175 540194 538204 535988 534371 533303 532177 530649 528795 526826 525027
49948E25027j224l37M63Q61Q24M62q1m53j32J094K684L734L845L477L362L748
$$ 525027 523803 523466 523929 524790 525614 526076 525995 525542 525410 526504 529188 532922 536767 540244 543606 547354
49932E47354M427N255O216P139P782Q313R126J0104J0659J0819J1534J3338J5364
$$ 547354 551781 557036 563252 570391 578173 586486 595612 605716 616375 627194 638728 652066 667430
49919F67430J6469J6914J7955K0048K2525K5022K8120L2169L6406L9878M2624
$$ 667430 683899 700813 718768 738816 761341 786363 814483 846652 883058 922936 965560
49908I65560M5318M8113N0413N1604N1556N0411M8271M5235M1653L8197L5446
$$ 965560 1010878 1058991 1109404 1161008 1212564 1262975 1311246 1356481 1398134 1436331 1471777
49897A471777L3316L1169K8700K6469K5040K3922K1905J8445J3953Q738K458n074
$$ 1471777 1505093 1536262 1564962 1591431 1616471 1640393 1662298 1680743 1694696 1703434 1705892 1700818
49885A700818j3223k1153k8623l5683m1897m6423m8859m9689m9863n0075n0337
$$ 1700818 1687595 1666442 1637819 1602136 1560239 1513816 1464957 1415268 1365405 1315330 1264993
49874A264993n0223m9490m8365m7095m5433m3009m0045l7185l4616l1911k8796
$$ 1264993 1214770 1165280 1116915 1069820 1024387 981378 941333 904148 869532 837621 808825
49863H08825k5538k2521j9921j7964j6820j6052j4789j2833j1066j0256r986r339
$$ 808825 783287 760766 740845 722881 706061 690009 675220 662387 651321 641065 631079 621740
49851F21740q248p461p342p411p128o591o207o055n924n737n710n963o279o286
$$ 621740 613492 606031 598689 591278 584150 577559 571352 565297 559373 553636 547926 541963 535684 529398
49837E29398n847n059m072l123k680l050l763l816k854j616r20o80m19j53q3R7
$$ 529398 523551 518492 514420 511297 508617 505567 501804 497988 495134 493518 492598 491918 491499 491346 491263 491360
49821D91360P05J250J075O15R40K063K950L174L420L977M073L372K906L580M698
$$ 491360 492065 493315 494390 495005 495945 498008 500958 504132 507552 511529 515602 518974 521880 525460 530158
49806E30158N000M562M518N353O507P524Q532R558J0188J0195R943R973J0521
$$ 530158 535158 539720 544238 549591 556098 563622 572154 581712 591900 602095 612038 622011 632532
49793F32532J1607J3246J5433J8046K0833K3483K5850K8155L0682L3241L5188
$$ 632532 644139 657385 672818 690864 711697 735180 761030 789185 819867 853108 888296
49782H88296L6040L5773L4414L1845K8244K4221K0268J6464J3021J0509R137Q353
$$ 888296 924336 960109 994523 1026368 1054612 1078833 1099101 1115565 1128586 1139095 1148232 1156585
49770A156585P655P264P340O946M682J91n599j1697j7813k3911k9707l4753l8668
$$ 1156585 1164240 1171504 1178844 1185790 1190472 1190663 1185064 1173367 1155554 1131643 1101936 1067183 1028515
49757A028515m1150m2028m1502m0027l7974l5513l2775k9853k6770k3610k0662
$$ 1028515 987365 945337 903835 863808 825834 790321 757546 727693 700923 677313 656651
49746F56651j8164j6063j4194j2536j1085r656q147o841o111n825n401m497l462
$$ 656651 638487 622424 608230 595694 584609 574953 566806 559965 553854 548029 542628 538131 534669
49733E34669l035l549m443m647l651k103j079q35p53m66l35o30r25q09o39j015
$$ 534669 531634 528085 523642 518995 515344 513241 512162 511327 510574 510108 509773 509143 508218 507409 506770 505755
49717E05755j827k424k435k007j447j074j122j431j406p89j22l0l86o36o01l48
$$ 505755 503928 501504 499069 497062 495615 494541 493419 491988 490582 489793 489671 489641 489255 488619 488018 487670
49701D87670L50J620K785K837J700L93j95k9M75J062J577J824J746J487J183R05
$$ 487670 488020 489640 492425 495262 496962 497355 497160 497131 497606 498668 500245 502069 503815 505302 506485 507390
49685E07390P77Q50R31R09J097J833K814L339L201K821K494K061J545J438K028
$$ 507390 508167 509017 509948 510857 511954 513787 516601 519940 523141 525962 528456 530517 532062 533500 535528
49670E35528K813L032K580K056J930K026J949J814K218L429M803N421N194M899
$$ 535528 538341 541373 543953 546009 547939 549965 551914 553728 555946 559375 564178 569599 574793 579692
49656E79692N023N125M657L843L277L057K915K868L101L447L641L903M551N155
$$ 579692 584715 589840 594497 598340 601617 604674 607589 610457 613558 617005 620646 624549 629100 634255
$$ [...]
##END NTUPLES=NMR SPECTRUM
##END=
