
##TITLE=AC1302_PERAH12114_6535671_KetVU1Pe3j
##JCAMPDX= 6.0         $$ Bruker NMR JCAMP-DX V2.0
##DATA TYPE= NMR SPECTRUM
##DATA CLASS= NTUPLES
##ORIGIN= BRUKER
##OWNER= Administrator
$$ 1.72 TOPSPIN		Version 2.1
$$ 2012-07-16 14:54:01.765 -0500  Administrator@TOPSPIN
$$ Compression mode = diff/dup
##.OBSERVE FREQUENCY= 400.02188249412
##.OBSERVE NUCLEUS= ^1H
##.ACQUISITION MODE= SIMULTANEOUS (DQD)
##.ACQUISITION SCHEME= undefined
##.AVERAGES= 8
##.DIGITISER RES= 22
##SPECTROMETER/DATA SYSTEM= spect
##.PULSE SEQUENCE= zg30
##.SOLVENT NAME= COFFEE_meoh
##.SHIFT REFERENCE= INTERNAL, COFFEE_meoh, 1, 14.98509
##AUDIT TRAIL= $$ (NUMBER, WHEN, WHO, WHERE, PROCESS, VERSION, WHAT)
$$ ##TITLE= Audit trail, TOPSPIN		Version 2.1
$$ ##JCAMPDX= 5.01
$$ ##ORIGIN= Bruker BioSpin GmbH
$$ ##OWNER= Administrator
$$ $$ C:\Bruker\TOPSPIN/data/COFFEE/nmr/AC1302_PERAH12114_6535671_KetVU1Pe3j/10/pdata/1/auditp.txt
$$ ##AUDIT TRAIL=  $$ (NUMBER, WHEN, WHO, WHERE, PROCESS, VERSION, WHAT)
(   1,<2012-07-16 14:53:39.656 -0500>,<Administrator>,<TOPSPIN>,<go>,<TOPSPIN 2.1>,
      <created by zg
	started at 2012-07-16 14:52:05.468 -0500,
	POWCHK enabled, PULCHK disabled,
       configuration hash MD5:
       6B 1B 68 BB D9 2E 58 E2 7F 35 AD 54 07 DF 0E 41
       data hash MD5: 64K
       C3 70 29 8F 73 CA 2E F8 4F 59 42 BC F1 45 02 42>)
(   2,<2012-07-16 14:53:48.671 -0500>,<Administrator>,<TOPSPIN>,<proc1d>,<TOPSPIN 2.1>,
      <Start of raw data processing
       efp LB = 0 FT_mod = 6 PKNL = 1 PHC0 = 0 PHC1 = 0 SI = 32K 
       data hash MD5: 32K
       C9 7D 76 E5 42 F8 88 3D C7 01 E8 3F 3E 4B 55 89>)
(   3,<2012-07-16 14:53:49.484 -0500>,<Administrator>,<TOPSPIN>,<proc1d>,<TOPSPIN 2.1>,
      <pk PHC0 = 176.1218 PHC1 = 0 
       data hash MD5: 32K
       2F 49 08 21 8D 73 53 D2 DC BF 4E 83 6F 0D 0D E1>)
(   4,<2012-07-16 14:53:49.906 -0500>,<Administrator>,<TOPSPIN>,<proc1d>,<TOPSPIN 2.1>,
      <abs ABSG = 1 
       data hash MD5: 32K
       BF A3 85 EA F8 FF 76 4F C4 65 30 57 64 DC A2 AF>)
(   5,<2012-07-16 14:53:50.187 -0500>,<Administrator>,<TOPSPIN>,<proc1d>,<TOPSPIN 2.1>,
      <abs ABSG = 2 
       data hash MD5: 32K
       76 2A 13 9A 1A 11 C4 6B D5 D2 37 3D 77 A0 10 21>)
(   6,<2012-07-16 14:53:50.500 -0500>,<Administrator>,<TOPSPIN>,<proc1d>,<TOPSPIN 2.1>,
      <abs ABSG = 3 
       data hash MD5: 32K
       00 7B 77 A3 46 94 C7 31 A3 13 CE 8B F4 E0 C4 71>)
(   7,<2012-07-16 14:53:50.781 -0500>,<Administrator>,<TOPSPIN>,<proc1d>,<TOPSPIN 2.1>,
      <abs ABSG = 4 
       data hash MD5: 32K
       B7 83 AB E2 BE 5D 40 BD 63 FC 04 35 EC 3A C0 DC>)
(   8,<2012-07-16 14:53:51.000 -0500>,<Administrator>,<TOPSPIN>,<proc1d>,<TOPSPIN 2.1>,
      <abs ABSG = 5 
       data hash MD5: 32K
       DE 36 7E A5 F7 11 79 4B D3 C3 19 79 4F 60 1B A8>)
$$ ##END=
$$ 
$$ $$ hash MD5
$$ $$ BF DE 73 4D 9D 6A EF 7F A7 F0 C1 72 11 1F A5 A1
##$RELAX= 
##$RELAX= 
##$RELAX= 
##$RELAX= 
##$RELAX= 
##$RELAX= 
##$RELAX= 
$$ Bruker specific parameters
$$ --------------------------
$$ [...]
150 150 150 150 150 150 150 150
##$TP07= 0
##$TPNAME0= <>
##$TPNAME1= <>
##$TPNAME2= <>
##$TPNAME3= <>
##$TPNAME4= <>
##$TPNAME5= <>
##$TPNAME6= <>
##$TPNAME7= <>
##$TPOAL= (0..7)
0.5 0.5 0.5 0.5 0.5 0.5 0.5 0.5
##$TPOFFS= (0..7)
0 0 0 0 0 0 0 0
##$TUNHIN= 0
##$TUNHOUT= 0
##$TUNXOUT= 0
##$USERA1= <user>
##$USERA2= <user>
##$USERA3= <user>
##$USERA4= <user>
##$USERA5= <user>
##$V9= 5
##$VALIST= <valist>
##$VCLIST= <CCCCCCCCCCCCCCC>
##$VD= 0
##$VDLIST= <DDDDDDDDDDDDDDD>
##$VPLIST= <PPPPPPPPPPPPPPP>
##$VTLIST= <TTTTTTTTTTTTTTT>
##$WBST= 2048
##$WBSW= 25
##$XGAIN= (0..3)
0 0 0 0
##$XL= 0
##$YL= 0
##$YMAX_a= 495217
##$YMIN_a= -629256
##$ZGOPTNS= <>
##$ZL1= 120
##$ZL2= 120
##$ZL3= 120
##$ZL4= 120
##$ABSF1= 14.98509
##$ABSF2= -5.573092
##$ABSG= 5
##$ABSL= 3
##$ALPHA= 0
##$AQORDER= 0
##$ASSFAC= 0
##$ASSFACI= 0
##$ASSFACX= 0
##$ASSWID= 0
##$AUNMP= <proc_prof1d_extract_pilot.lims>
##$AXLEFT= 0
##$AXNAME= <>
##$AXNUC= <1H>
##$AXRIGHT= 0
##$AXTYPE= 0
##$AXUNIT= <>
##$AZFE= 0.1
##$AZFW= 0.1
##$BCFW= 0
##$BC_mod= 0
##$BYTORDP= 0
##$COROFFS= 0
##$CY= 15
##$DATMOD= 1
##$DC= 0
##$DFILT= <>
##$DTYPP= 0
##$F1P= 0
##$F2P= 0
##$FCOR= 0.5
##$FTSIZE= 32768
##$FT_mod= 6
##$GAMMA= 0
##$GB= 0
##$INTBC= 1
##$INTSCL= 1
##$ISEN= 128
##$LB= 0
##$LEV0= 0
##$LPBIN= 0
##$MAXI= 10000
##$MC2= 0
##$MEAN= 0
##$ME_mod= 0
##$MI= 0
##$NCOEF= 0
##$NC_proc= -8
##$NLEV= 6
##$NOISF1= 0
##$NOISF2= 0
##$NSP= 0
##$NTH_PI= 0
##$NZP= 0
##$OFFSET= 14.98509
##$PC= 1
##$PHC0= 176.1218
##$PHC1= 0
##$PH_mod= 1
##$PKNL= yes
##$PPARMOD= 0
##$PPDIAG= 0
##$PPIPTYP= 0
##$PPMPNUM= 2147483647
##$PPRESOL= 1
##$PSCAL= 4
##$PSIGN= 0
##$PYNMP= <proc.py>
##$REVERSE= no
##$SF= 400.02
##$SI= 32768
##$SIGF1= 0
##$SIGF2= 0
##$SINO= 400
##$SIOLD= 32768
##$SPECTYP= <>
##$SREGLST= <1H.CDCl3>
##$SSB= 0
##$STSI= 32768
##$STSR= 0
##$SW_p= 8223.68421052631
##$SYMM= 0
##$S_DEV= 0
##$TDeff= 65536
##$TDoff= 0
##$TI= <>
##$TILT= no
##$TM1= 0
##$TM2= 0
##$TOPLEV= 0
##$USERP1= <user>
##$USERP2= <user>
##$USERP3= <user>
##$USERP4= <user>
##$USERP5= <user>
##$WDW= 1
##$XDIM= 32768
##$YMAX_p= 467180680
##$YMIN_p= -722445
##$CURPLOT= <Network HP LaserJet P1505>
##$CURPRIN= <$Network HP LaserJet P1505>
##$DFORMAT= <normdp>
##$LAYOUT= <+/1D_H.xwp>
##$LFORMAT= <normlp>
##$PFORMAT= <normpl>
##$SURQMSG= 1
$$ End of Bruker specific parameters
$$ ---------------------------------
##NTUPLES= NMR SPECTRUM
##VAR_NAME=  FREQUENCY,     SPECTRUM/REAL,   SPECTRUM/IMAG
##SYMBOL=    X,             R,               I
##VAR_TYPE=  INDEPENDENT,   DEPENDENT,       DEPENDENT
##VAR_FORM=  AFFN,          ASDF,            ASDF
##VAR_DIM=   32768,         32768,           32768
##UNITS=     HZ,            ARBITRARY UNITS, ARBITRARY UNITS
##FACTOR=    0.250966925370066, 1,           1
##FIRST=     8223.43324360094, -165776,      -105145
##LAST=      0,             163323,          -14922
##MIN=       0,             -722445,         0
##MAX=       8223.43324360094, 467180680,    0
$$ Real data points
##PAGE= N=1
##DATA TABLE= (X++(R..R)), XYDATA
$$ [...]
30823 -88386 -131754 206002 -168116 38140 -139820 92338 80804 517641 -54774 -102319 222297
30811 180509 283350 -237199 2397 28671 -185523 320244 -272708 249113 87564 13233
30800 -176158 1212 251270 273823 50800 -1307 14826 57986 54496 -262440 99898 37354 200011
30788 200011 -250178 -92108 89051 -269756 -8973 -18367 1705 191480 -60562 -7045 -72783 -64826
30776 -64826 87478 230562 23953 432534 -115903 11694 88495 -77187 -16469 -11635 -155072
30765 -155072 145593 -168179 147505 -71773 -171548 32941 -89612 34482 87402 -232454 -176268
30754 -176268 -204694 -27329 -56793 -127489 43912 -93316 26368 403418 99241 136009 -22639
30742 257094 -12200 5288 536712 -105264 112597 193149 97668 186687 -12920 145418 -91177
30730 -193366 -95645 -215973 -51882 -64081 -35325 118390 291944 256212 198873 160103 87275
30719 87275 -69621 -76578 186652 52916 -313469 249268 -44769 41024 484485 -218848 146110
30707 -64818 9267 -43773 -270303 43274 7693 -58684 33134 43075 124401 274675 227622 97110
30694 -150123 189401 280867 229170 -23360 -87998 -242460 86257 -180035 -128557 295509 -185830
30682 -152503 46055 39 50442 133697 230209 -124096 -110996 126168 177312 112870 135945 -43069
30669 -94924 148774 -66900 124442 80043 -173910 -51916 -8051 -136395 108656 -62820 32786
30657 66420 -139063 -85717 76649 115552 295630 -124490 219948 -216665 206438 -65221
30646 -124890 131234 -270561 107992 -221209 -11080 -200221 200289 180677 42771 236499
30636 236499 233852 181534 -188982 50278 -44536 124943 288129 5681 -49906 80076 40379
30625 40379 94643 64923 459535 -27783 -141821 294333 -49251 -201457 35422 21429 -71539
30613 -164842 -168027 197423 7616 -112801 -187840 -95463 -93467 67639 -186774 -141740 -24812
30601 125592 -184130 -30791 32015 -29220 -36762 108970 -139843 -69203 -228616 -42403 96381
30589 -127859 128627 77115 56435 131165 -29516 -311110 98156 203440 153409 177520 114271
30578 114271 18797 -57978 -21368 -161211 -151616 64074 84195 67873 -311698 -109481 85502
30566 -80871 252638 -90814 -20542 153840 -53826 -210902 33920 255964 287605 95656 230122
30555 230122 8102 109835 -8267 -152588 -139199 155848 -124584 63449 2575 -68439 -190312
30544 -190312 124968 -224232 30371 -36234 66107 12712 -134637 -39030 -100214 -50166 231371
30532 -198200 -27928 146164 133179 44609 -315512 86354 59569 -121437 39511 -34859 -151155
30521 -151155 101571 71180 214447 -83883 335133 79019 -323673 -72622 45141 -381125
30510 -148509 -95804 -134200 -147643 127122 -110551 179633 -258656 187129 256388 -26041
30499 -77289 -32274 -47510 114557 97520 -547290 104443 58163 239032 104051 -340339
30488 63804 -33877 -22923 142597 115712 400508 -59890 -27056 18710 -77484 85012 259284
30477 259284 -159222 -40116 19003 31856 -131256 177902 -125109 81184 186387 160317
30467 160317 237497 -52171 106227 139087 -205452 293862 246581 361596 -225543 -166070
30457 -166070 82553 57390 -71818 -124664 184921 69108 -97092 -21388 200397 418794 9795
30445 -166754 -119681 185329 150913 84695 93499 -7824 60048 85843 -372876 -76321 -102337
30434 -102337 407329 -51049 -6698 30888 127163 -84983 40820 -41956 297529 100543 -323484
30422 6699 -29262 47981 -56828 60095 -150546 -97176 80092 98726 134803 -158898 -56937
30410 -119252 166298 -222427 -255230 62259 2864 277137 94928 -9993 38714 123589 319099
30399 319099 -34473 64950 81104 -41149 -88416 103026 -242175 -168730 -208930 466107 -147396
30387 -37499 111331 174246 2238 94736 171805 -152795 -133393 -183234 140894 78269 51221
30376 51221 -259741 -22976 -212941 109652 -78018 107673 -89374 72004 1826 149435 -117352
30364 147573 135023 243718 233874 196383 64955 -160393 -155198 90262 -50756 -310419 -156868
30353 -156868 -153770 -102204 -154668 2330 3922 69688 -432007 -322560 -23666 195434 -149519
30341 128650 56543 263896 272064 -42702 80746 237107 -90473 125214 51735 32187 23226
30330 23226 92432 239701 97057 -199396 27867 -95231 -269453 -11029 -25403 -116759 105234
30318 -102862 166599 -178338 -47331 -9916 662 -327532 -180954 -55814 44734 -148194 85420
30306 -193880 -254688 90474 81523 65913 -152117 111471 425292 1423 143622 -20296 137777
30294 61748 -31020 48435 -223896 258688 -77758 152364 273204 -303017 172964 108650
30284 108650 -19307 293395 -104166 354333 75305 -135911 237545 123343 168853 -14682
30273 -71129 33356 22391 -104355 161523 -461350 146016 138043 20092 47617 -87112 -49951
30262 -49951 -197462 155652 -186249 44803 -52382 -229084 146915 48988 15909 -16216 174057
30250 181186 -20883 -271284 124291 -196304 -76921 826 223157 -12812 52333 101072 103218
30239 103218 130589 206441 56278 5753 -52897 -50902 -50750 308610 -256674 -95509 -43304 161928
30226 -91357 27212 81907 -117210 -29618 -72226 -139808 -269321 -56538 62232 -6770 32401
30214 -108977 161007 460970 84844 -51824 129176 -151191 -37142 -41231 6172 181521 116500
30203 116500 46438 92180 108424 295461 128720 12271 -57159 -38550 69617 -121051 175829
30191 -429306 137304 -54197 -26405 117834 39578 -19271 -23383 32851 261181 129370 102962
30180 102962 24286 -34373 -149742 251407 104548 188002 171073 -176987 -26783 -86197 -198369
30169 -198369 -106023 -66423 -47805 -60561 -229379 101246 -175538 206652 -66083 -46111 148713
30157 -252061 144996 284258 86556 26981 -276107 39705 -126792 -37876 367943 80531
30146 109977 -110248 -62658 -266642 -198065 334646 206398 105090 46031 -38065 -11488
30135 -4540 -91119 300542 97900 -67677 -374473 23076 -79703 -189223 53110 -38277 101091
30123 143804 -352055 85607 103103 -100135 -261001 -325723 294210 156143 -130570 7324
30112 1019 145498 -49554 18041 9153 -44743 243170 -46762 -106816 -160366 5902 -289820 88973
30099 125318 155191 202747 20872 -147164 271661 -30383 -286459 -56227 -158125 78537 177589
30088 177589 116842 92085 114760 135799 125563 365508 75120 168310 125203 203412 -136176
30076 -145666 -70093 206423 -31711 -86878 -2842 18576 -42659 -169327 113843 197357 -35408
30064 -76682 152339 -59456 182125 -185418 39816 28693 -50454 378129 102867 122399 157570
30053 157570 119912 -127976 183980 -156712 -53110 -70751 -100130 126667 -260312 111709
30042 -228686 -37922 -84793 -85980 -90920 131097 123336 -183581 160054 26779 -156093 -5436
30030 90363 40710 161762 144960 150367 42131 -192050 -135236 236776 -17548 -59140 -23163
30018 131088 135214 -14984 62405 355962 -34524 79995 22765 -159258 99713 -150766 -69179
30006 -94520 357251 14930 417132 -162852 232668 138757 82939 83116 -23342 -336664 30472
29994 199791 -47780 94763 298108 -85801 -47396 -99839 -48855 -186194 34803 112705 -47896
29982 -139809 -21419 63597 92518 9018 59300 -541813 2086 -148734 34553 135994 267359
29971 267359 -47982 -8735 349133 279337 251778 75953 -5021 56305 264508 134325 48942
29959 106932 -183396 -95399 114077 117623 -88931 139962 162475 -8575 56558 -111815 -22599
29947 163286 -104758 266155 148689 113193 302006 -119736 -388044 -21612 61162 83565
29937 83565 -65053 26116 -332123 171187 -188940 356656 -8657 64269 -70434 91253 257466
29926 257466 101830 53256 -369481 19355 75690 20896 -27147 218174 -35741 -9629 -79396
29915 -79396 13674 -196941 -189045 54337 -164666 -33352 -71351 180169 103915 -118748 173274
29903 -240385 94339 -375613 -165309 -73091 -202565 -100997 -11116 8444 95403 64745 248594
29892 248594 -52254 108415 -136531 -112547 301046 173849 153172 -90278 -130647 -83229 -6154
29880 364080 -14812 260048 -113518 -129094 126051 -156710 -94815 80461 95031 166222 135167
29869 135167 274250 537923 118508 170390 241390 278322 5287 -50125 216430 186762 -181657
29857 -98127 -48376 -76427 -331392 203450 144396 331202 -244497 -61534 22983 107270 -130023
29845 51553 -169361 74359 -239746 98447 -80620 -88030 -258220 2507 -80658 151118 -256712
29833 157743 -37042 61973 19918 90641 274447 176816 102008 -43069 17617 262101 -14997
29821 -233790 148909 90176 -11107 -71058 -98302 144081 75081 -89294 -96140 184584 -49223
29809 23928 171264 -33909 -134769 -269432 -119569 -20507 -27761 110152 -47436 -178361 134465
29797 170978 -11778 152113 136613 108837 -57301 56488 96845 -63410 149339 -51978 -338587
29786 -338587 -243226 -91466 405207 67566 93460 244806 -71022 248712 21114 -263996 -117775
29774 -96568 24244 -100181 64658 -192789 -155813 343883 -61673 123528 -161668 -125426 -55947
29762 -376034 -119979 -89022 -172095 -27074 265407 327484 -138162 -38760 -125282 -319312 -247009
29751 -247009 85145 -354328 -145932 -84513 16813 46969 315644 102897 60914 142509 270107
29740 270107 -18398 200574 72080 -159463 -181932 246717 72454 321012 -61852 161496
29729 105603 -145255 79400 40819 25554 62133 253020 119682 -60525 156787 -94030 -194553
29718 -194553 112946 86062 -376554 179203 38320 38826 112564 260988 24588 141993 220427
29707 220427 -256608 61578 111346 209880 -287011 -102129 -33756 287024 187533 -148228
29696 -26009 29734 161879 42338 -128682 -18130 169139 37234 79340 180310 76680 -121069
29684 -166765 207985 223457 234862 -225299 120335 575216 -193902 -74720 -216720 266236
29673 468367 -160499 39796 167836 57538 -15550 11980 81348 -42733 262760 -42297 -118119
29662 -118119 77619 -78143 122330 71285 213622 -151435 -186846 53929 41882 125351 272875
29651 272875 221025 238038 296553 -209218 74409 -225008 30183 -71834 181298 -253725 429235
29639 -59750 196493 120966 97475 -59994 6952 -12917 -145026 38803 -21137 -167246 77076
29627 90112 130936 155380 -140128 -366933 313974 71899 189639 -213314 -20935 145833
29616 153595 145001 88654 5595 110168 -83707 -241310 282766 -354506 92057 190583 183184
29605 183184 -117376 -175975 30301 -412990 193454 -79643 545179 -122087 -309793 -34076
29594 26442 -311866 -64089 -31116 105988 104481 133344 167301 134501 -328955 -211196 247368
29582 -124388 -31276 -163136 -210043 -93630 56328 -373625 -332714 88218 -151343 338461 -302387
29570 388246 196401 -235941 -305393 -47115 22317 35609 -3583 76233 -294507 -88763 -42133
29558 304267 -17886 -15111 128697 -145102 -133000 25601 89350 195543 34020 29706 113430
29547 113430 -176791 129447 177269 426221 -20013 -83441 112744 -14887 -4555 -177685 -15889
29535 -32626 63519 211074 226133 -11645 -114518 29832 120323 26437 221684 183408 -215472
29523 318302 -71000 -169842 73610 43815 131097 -286297 36608 43827 333521 -130698 21564
29511 321343 447 -270268 144823 -198958 86554 293723 -260692 66404 63647 203782 -126865
29499 -26010 -37439 -236837 -133943 198281 187097 -15591 -259452 164566 70459 66997 8941
29487 -127102 12567 -12459 74673 -308690 214575 -172092 234419 248981 57223 37896 -343109
29475 -308851 80384 78252 462791 -423643 -93199 -432429 -275437 73747 111152 -193857 -2060
29463 -14220 -183362 -265436 -38204 -190753 -192149 -180942 -38742 -241176 -101712 -356891 -350467
29452 -350467 -185665 26159 2305 253233 248499 231919 170355 100409 -147450 -147977 75359 -45287
29439 -137634 -196377 -39725 59048 -210760 135079 352606 112018 -2414 217440 58489 291099
29428 291099 -238958 -181016 60400 -100193 280463 23662 -22427 -49827 -63899 102048 -257007
29416 4012 -232687 51948 303499 -65051 164620 87809 -73792 46544 -125736 -33418 -119257
29405 -119257 102399 -181485 -70445 -54256 101461 21362 -155685 275091 222181 10586
29394 -30569 154919 -195849 410659 115566 -55029 250190 243004 -67639 -156953 271496 235001
29383 235001 100248 -201659 -104057 -199561 292281 -63996 35124 100522 141667 258479 37635
29371 65346 210526 325553 -171955 -131278 -5269 -33739 -207874 185179 -46467 168471 89042
29360 89042 173068 -141472 -265676 -231706 411187 265956 -205094 -88378 216028 418888
29350 418888 145982 87540 -55820 286515 140704 31610 183882 -235269 165311 302087
29340 302087 189336 148372 -93904 -200880 117368 65455 -208488 -109451 205785 -47430
29329 79951 -78153 132755 275545 67616 -187168 11176 -109421 196500 284716 49311 25246
29318 25246 175235 225146 -100480 66618 79593 274523 40758 168634 20501 -176936 53150
29306 -131072 -192183 -306999 14771 -162531 169286 343997 371747 217938 -153363 167883
29295 -51747 79189 400152 18502 -14633 -202176 -12812 189814 66167 325758 -110239 -209997
29284 -209997 -328336 168290 161863 -157986 12442 -47996 -350141 2203 94110 -80677 77060
29272 208320 92328 201174 9976 27263 119017 371957 121065 -294874 125084 -139643
29261 177748 82051 255356 -48015 -280801 133738 -182380 -369941 292504 129568 180807
29251 180807 50869 61301 -127401 -188534 -117697 22272 -220311 79363 -71563 23622 -269389
29239 17381 151075 -330747 -102960 -216214 -180923 167614 -117820 -118354 -289074 173300
29228 -30066 240786 166681 320834 13916 -97979 145684 17094 -57822 273566 87166 -168346
29216 137484 353136 342210 -342559 137377 -117891 -84541 221526 396702 244208 61343
29205 93183 -398156 71767 309984 86726 6514 -42191 194008 140030 190168 -63870 44430
29193 43770 116610 238441 112557 -13769 -477249 -415324 151006 -51365 5018 -14116 -312841
29182 -312841 -192363 -7723 -135515 -82793 1850 -62020 2188 155268 452287 154984 5148
29170 -104033 194165 34643 -106976 -282985 54659 -99893 43134 311672 25408 20617 -252756
29158 125386 20657 -9840 149786 40023 -104753 295503 20806 -160045 120409 171848 -37585
29146 271911 -183944 216897 -143692 -67223 38401 66176 373115 45459 3333 198534 118464
29135 118464 3320 -193624 -68308 53268 -2170 -230015 -323178 -4332 75083 -8719 208388 11183
29122 191747 22995 68469 400501 214820 -219773 150306 279827 139612 -65862 270121
29111 48751 55283 -224638 65131 -53753 -162219 11275 -245036 34481 -109141 141072 -71235
29099 207542 65995 27060 100338 -183179 95084 -283435 -227933 -10131 -109989 160624 324011
29088 324011 64235 -109317 111755 328356 18972 -121333 33948 -49897 -32274 16700 116149
29077 116149 -8714 168287 149852 111179 177922 332550 63197 -171695 -95048 -112572 -37024
29065 168364 169139 42547 212054 3752 223072 103825 -56504 -23022 88502 -16848 61305
29053 216627 59667 -121326 61372 -257440 134579 -88371 -83455 -60978 -127031 -140072 194144
29041 39742 380555 -117346 149156 -404426 205833 35957 -117681 -2690 250544 482543
29031 482543 119088 -85767 53988 -151763 -154559 39975 96520 -153195 -27544 321030 61077
29019 -74599 22974 234129 431995 369658 291120 -68585 -49870 -93990 -224401 -327115 -205211
29008 -205211 175346 -316874 -20192 -195695 46100 98104 37470 179897 -104384 187062
28997 -70893 278958 139347 -58183 -82290 99397 -65959 101208 68314 -167532 -148685 116367
28985 -27866 -62199 32697 450199 57794 -131182 -73401 140555 37883 -5977 -102586 -154217
28974 -154217 -101627 -81170 2113 207421 -44059 -164565 -322557 183610 158304 -132603 146826
28962 49961 -108470 46549 28510 -20027 137058 -255966 264727 165394 39677 74306 123084
28951 123084 -38939 137337 208769 179379 -81913 21053 391850 -222547 -19417 326280 43062
28939 134522 33980 133583 4621 -3232 -47170 -25410 35071 206997 24285 -114263 158662
28927 215384 55608 128778 335601 -14517 178616 -114759 -157488 -68152 -74739 -199586 146197
28915 273271 238237 185737 -174327 -69377 -140514 90928 185437 -99978 -343014 -569 -5264 220491
28902 91700 -312724 -216511 -92359 204401 -99564 326793 460912 -284542 162546 203307
28892 203307 -157722 -54944 -7324 178787 -479097 -186997 67509 -285419 -27143 117019
28881 290341 -30631 173758 -284366 261373 212043 73967 -49133 184815 -209093 -97057
28870 -97493 144169 153349 -270723 23138 -262775 33966 -146327 -146731 93699 156021 316157
28859 316157 -89124 19471 471547 167331 151555 -33624 -296303 201261 304772 134980
28848 21127 106088 132648 11749 203068 -56192 261087 41920 170841 -110219 -19974 99993
28836 -32153 -274278 -84639 117043 103061 8344 340559 144841 26319 119634 -357782 278584
28824 71869 -13677 13803 -22067 -12148 -4436 257089 180151 -133745 100588 34950 -446682
28812 212460 23807 208347 270826 -24821 -58347 -49902 116832 -74748 -33543 167404 -60145
28800 211851 -91309 306614 128459 -208238 13164 25723 -56650 149855 -44841 -144954
28790 -144954 255148 202109 368969 9675 290145 78655 34692 332503 93717 178213 -46688
28778 13294 -186313 -283848 93295 -122752 -195639 12075 -517034 38391 166275 50832 -85433
28766 -115805 -431 52822 4882 -264512 -263277 -109249 -16140 -77779 -202364 -275514 -94895 29606
28753 15832 50517 192473 92902 145341 -35650 -42596 -36909 -394183 4209 55460 -253729 18606
28740 -203951 253916 -128721 95023 179296 -211068 219214 222140 112880 300655 -219262
28729 27200 40086 110849 -50941 -117701 -124823 -767 81205 -412529 373191 83633 -97892 50400
28716 197072 144647 -45243 85508 -28763 101772 62572 -203478 296263 -285453 -157695
28706 -157695 -273432 -211704 180 -229341 -52039 -2248 78012 107662 109163 -48256 30381 53246
28694 53246 283317 99568 222322 174247 233316 -241822 -42051 -52127 386652 264316 -126922
28682 -253599 -172227 73519 101700 -168645 150684 61168 74595 -264844 97302 23909 67116
28671 67116 34440 -156866 92383 107482 60797 -354078 230042 -19413 244231 48914 -89119
28659 43297 -98892 -175729 -151655 -32527 54706 -293163 335577 970 147115 39327 -154833
28647 21697 -93789 -8419 73364 -196342 229246 241823 255091 179664 -123240 -63075 -233694
28636 -233694 229222 -104593 -184435 92939 -22283 159622 -124409 -96041 38210 1716 310794
28625 310794 1247 -45537 202455 -17068 -68757 233087 76289 16537 236871 273017 -209203
28613 -193533 186822 -126210 -46175 -169423 234146 -166919 -222062 -133353 91365 123219
28603 123219 231644 301255 5952 116954 -185905 -114641 124677 -332086 165992 362104
28593 362104 204654 124025 58735 7360 317246 -326979 48850 -135280 130319 -55979 -23395
28581 172476 156349 160252 21374 156837 -42163 56410 -155002 124132 369213 -290468 74898
28569 236883 240186 -110607 62263 230850 322313 -66904 -159006 48401 101530 -249303 -251253
28558 -251253 53642 242349 77960 -27454 -22514 -45764 -158614 24257 -90173 -167115 -111718
28547 -111718 -289480 55413 41318 -212878 -171094 226682 93301 -143328 -25363 116549
28536 26659 196390 121501 8178 -75661 111808 173745 128344 -179591 66827 35603 -64442
28524 42668 29808 -50840 19134 23983 -64251 106878 -223941 18955 165421 120449 -24052
28512 99561 76348 -10832 54525 -74597 87928 -159593 -189802 -154145 128581 80609 -158167
28500 3564 177190 -50405 -71196 283388 -274315 -189968 -30832 10201 -176150 25802 215998
28489 215998 22425 95679 -107533 309984 -201690 282050 89023 152648 8588 168228 277752
28478 277752 247954 -74095 210688 -76498 -197446 311124 -109060 46603 75779 27193 -73659
28466 188738 -80627 126956 -37400 258494 -126905 123317 -10211 191411 30767 90603
28456 90603 264980 262304 -369954 84824 -78981 -192754 328595 -496 59795 37561 -146359
28444 -61403 280135 -68833 194587 -89340 32620 263028 -60278 -240118 29450 156355 -213296
28432 73948 158025 -67538 36624 274138 -273535 -98662 -102401 909 -233844 -39788 248374
28420 204921 346780 -9811 219 30652 152803 -128927 -251056 -93858 115540 131816 -202511
28408 -59594 -133472 102539 165261 321609 221560 156954 96916 11817 -114886 160730 -92166
28396 -10044 212671 73136 -170623 -20690 36531 -181825 206408 233614 -81624 222981 -173123
28384 -49007 -139914 -107856 260980 -47651 -91239 -59151 67420 30493 17111 395862 39396
28372 154163 8057 -208875 127536 151552 210113 173191 81791 116340 259132 -22912 -241502
28361 -241502 -22312 -220730 3586 183039 -46038 -74559 174900 182733 -277668 16256 302595
28350 302595 -115263 194918 202640 120963 -216343 -276763 162485 21657 22233 -244278 269111
28338 240847 -17008 123017 205118 134404 196102 55975 -62385 -449230 -19753 120754 55032
28326 -178115 222761 -27596 277338 -112554 -13171 -61778 -176139 -52775 392145 -100928
28315 -240776 -28937 167601 58265 135715 215239 199991 100792 -26356 -30193 56999 107384
28304 107384 174049 243082 221027 174157 -50893 208923 -312850 -50546 67285 99993 94651
28293 94651 58790 317945 -83833 54275 -68150 -27554 -124032 31838 -79255 -279442 -9186
28281 29519 153861 425535 -248371 78007 157457 50348 210291 42847 209391 -209469
28270 104638 202668 8493 32228 138132 -93794 -52831 -109849 43723 245424 -254386 493119
28258 -107111 165544 272868 175365 194194 236635 81150 -101687 -240781 -169869 -66655 -84671
28247 -84671 20579 -71987 237239 -163465 113870 -47094 213436 -57813 -15624 -6944 132284
28235 -104584 -40372 -103625 -120630 323046 332784 -356 165 4936 36039 -163304 295802 168559
28223 168559 -73771 -125112 182072 -189587 138361 -124089 160909 -50593 -202397 215696
28212 -105162 181839 -170794 12348 1514 -163050 36493 -66297 -43628 -29654 29792 -166787
28200 -126227 108472 52958 40700 356363 325725 -188298 -47624 -316412 22927 180925
28190 180925 21410 -56173 -44444 65041 172957 -55124 4090 97025 105408 278955 -229648
28178 -110200 51044 -86936 382633 206882 116672 85818 113545 -165762 191816 177369 -286823
28166 46003 -195362 15721 -48234 -138195 269580 57624 80784 330684 -160164 -33566 -109753
28155 -109753 -101122 21706 252766 -57144 -140608 248169 163449 197590 -182718 -234948 234137
28143 321124 63448 352678 109860 -100828 -85000 -105752 5649 63671 170981 247320 -24728
28131 -32890 282981 -56724 -33708 -129878 -138879 271930 224853 35577 195968 106973 -188822
28119 -283573 -265698 -50882 -78708 -76158 -13593 259320 -75393 -108083 393118 215749 165916
28108 165916 55952 19628 92032 -23414 147381 -104670 -135747 54187 138326 331667 122791
28096 322706 193917 124643 -100688 6801 23688 -19249 217727 -81325 -7332 275941 319924
28085 319924 99977 111810 154236 -9692 219148 200509 -173224 32572 102876 -302558 -35357
28073 -482283 -51429 -145554 -210881 -95007 24034 322061 162123 75408 373176 249140 -148420
28061 426437 -131204 212993 33438 118565 -111075 -83656 186029 -223085 57031 51253 44094
28050 44094 218986 58036 60777 274217 51855 5546 19760 -29123 -23582 -79621 115194 160630
28038 160630 -73116 38253 -86189 -2797 -260318 -138350 170383 378731 337569 -52093 -318067
28027 -318067 174835 -112644 15019 11695 39615 50627 140320 218775 137506 167530 -64533
28015 -96584 -49056 -8465 -289618 -121849 -161259 128544 142015 26794 226472 205621 338115
28004 338115 -413852 87173 316626 39874 -51673 62097 -173377 -62652 14379 -7682 72168
27992 52920 -32031 512830 -71747 -1038 294066 40743 283401 -13921 279844 59822 313023
27981 313023 16644 -122901 -224660 -173348 -171260 70629 -19733 127272 -158156 91728 -255899
27969 237826 90839 -107091 -121271 -124604 -14091 -99211 269041 189285 -63482 -78012 -229441
27958 -229441 -272189 147497 -106883 66534 89786 89239 -2150 -28536 119677 -35550 126871
27946 98574 71965 -167179 351639 233658 -41747 -249448 114147 23269 120913 -10348 82129
27934 83411 507827 -199187 -171552 2347 -117357 346453 299720 112618 230323 13248 -35250
27922 26875 6875 91784 -157711 98199 149108 -105583 263776 -158370 -30931 -47733 -269547
27911 -269547 -58412 -6920 -193746 350276 25929 384301 82649 -68241 -271142 -114327 -100836
27900 -100836 59292 280329 113154 -239538 73931 -82856 -398004 301317 10288 -131589
27889 64507 -265286 149090 -180816 -124243 -62660 -98376 -141987 -188829 282319 199469 252926
27878 252926 11744 207046 96725 15619 37080 56566 105403 -14573 132337 59801 -70334
27866 140646 24406 216686 -234254 -217326 51319 330099 15549 222385 352546 83475
27855 37936 81780 -10718 184022 -100151 -231496 221149 308998 -98277 -161467 206905 277102
27844 277102 29640 -166312 65125 -100973 7163 75213 -203900 226167 -150253 -54905 103086
27832 -98038 -205329 90905 215927 -77748 -135969 -111751 76099 12402 -91090 199169 -45550
27820 14647 113404 -137753 31251 -26394 -11116 -234313 192443 23013 286279 90801 54884
27809 54884 -94216 241030 77006 -8711 -92636 173614 489630 -102800 -237952 14244 -186267
27797 79820 -435368 -128221 -81136 275059 48772 161443 -48289 -26995 101748 48735 307648
27786 307648 162460 -137854 11669 -191892 55387 -142789 26834 -33319 38298 295795
27776 295795 42709 50447 -52567 -89799 -63321 371500 -70595 -12930 -133634 29130 41326
27765 41326 79237 305994 241243 116216 207344 25642 60668 -43844 23922 -7066 -103780
27754 -103780 87156 -264412 14404 -152841 36706 243720 308816 -4098 16736 -51652 158671
27742 19038 129122 274732 -162422 -181596 102597 233024 -166507 183402 24000 200252
27732 200252 -54613 -146148 -79059 85672 -114653 1612 106912 8600 196467 105982 -128371
27720 53113 20669 169610 -73566 -163279 152414 -32536 58812 -66679 32556 142538 -97856
27708 -241764 338017 160359 224705 -125433 245704 -32126 -103103 244275 39969 -34567
27697 107285 -284843 149110 -202767 -164336 -340302 -154756 -154812 -55969 72779 -54399 216959
27685 466622 55233 446037 223581 -81071 8356 443597 179590 7416 -38619 362196 236322
27674 236322 330146 55892 -89956 315718 -176931 176472 99335 -39049 -309135 -127294
27663 -136865 106115 223485 -44391 193747 435477 -110732 19971 -230011 -8202 -122978
27653 -122978 139606 -321824 30330 332216 21627 137690 -85061 37956 -3688 42355 23222
27642 23222 146657 40125 121445 133016 -259750 -201121 -119430 319134 116721 114027 -214110
27630 -7094 184343 19407 454239 -291821 180109 189382 139357 20089 41024 174731 269787
27619 269787 -533486 -123964 5073 -223058 323485 39318 87116 302317 111373 42441
27608 239340 24712 16289 -319452 -43498 -242272 99186 -211784 -413307 259071 55318 100829
27597 100829 60676 44013 45953 109864 -282321 -312568 -116975 -203319 372220 129377 322464
27586 322464 -3046 -153714 134752 126010 116762 174557 -87563 -34888 -90289 -170573 -108096 29819
27573 -238023 839 166474 53988 -455816 -65956 -362415 -302138 179466 -26873 209285 -28854
27561 150425 42738 362621 225740 -274553 177842 -185347 -159451 -44947 215608 153365
27551 153365 160131 -148829 -70550 -12800 143605 171917 212623 -27022 -193033 102798 -18173
27539 48727 204108 2445 -31502 -246970 78915 -114578 188453 88287 240301 -307810 -1823
27527 -88620 -48289 -137307 -33950 -93846 -112429 -58216 -72909 357750 120843 -137872 -40781
27515 32048 52779 246533 237506 70440 -147544 130968 456659 28806 266580 4881 -510313
27503 -230178 199867 -59513 258963 116439 -366289 163433 320246 -200865 -76611 29651
27492 -147090 -21049 -328376 121173 104569 156913 -156807 -186327 -194740 14419 -142027 -150591
27481 -150591 327246 75498 254606 -20764 96899 130085 8519 1068 103156 -191290 48384
27469 92044 60507 -109797 -15282 -5795 -117103 -108803 -113433 -83573 -195950 87161 132532 -82006
27456 -200215 -182658 -134607 -80755 9176 39461 -8141 -214198 -40801 -59625 -16454 135243
27444 173314 -178273 79808 -120405 -124808 -31877 -119682 177948 90242 83865 -100354 -254377
27433 -254377 25656 -266917 32785 32096 15031 67898 221435 -137386 41448 72995 -127598
27421 -46889 175047 170426 20203 -182705 -35328 150517 -153330 -59428 247085 156798 128925
27410 128925 334915 22497 -35171 -180107 126046 -254 176423 -31884 182042 140097 -60610
27398 84060 208738 53787 286601 -112631 132017 -14429 187149 -14157 67875 363723
27388 363723 -25370 219808 -178885 -285197 205900 -81590 115615 -144601 -106895 -180632
27378 -180632 82632 -21229 315629 182350 -56113 306559 135534 244908 -133447 -309442
27368 -309442 -34950 -155015 -75485 -117623 84765 -120878 208381 -41839 179920 200308 -692
27356 45309 -4662 311334 -84716 -136291 138198 -17284 -610095 35064 318859 -74576 -137114
27345 -137114 88305 -7647 303628 -60715 -106703 -248960 277696 -50093 192273 -68022 -45810
27334 -45810 180773 282085 -8083 -111462 -104061 160659 -114141 -236670 75902 109872 205629
27323 205629 -95540 -26670 -15768 -3303 113189 236897 178210 230175 86652 -154943 100151
27311 -83037 538161 -11948 -75941 490804 268669 -192561 -39010 -102015 -22719 180932 191731
27300 191731 62885 122888 39133 -63390 55764 -233243 -306416 -210686 -205885 94560 109325
27289 109325 311504 121188 -293809 -152697 103807 -74577 -28271 115104 170006 -122055
27278 284445 -178526 -13383 18969 160895 -206720 26674 -106359 -169047 -63445 -94866 77379
27266 201075 -433435 -68431 39739 -64733 7619 192274 -45934 489569 22007 -163179 -90325
27255 -90325 126234 399615 -106267 -112599 256586 -11525 92980 75107 107750 10849 -291007
27243 -27527 62419 128069 -193867 -407454 -164240 406294 -83377 343921 -546995 -128605
27232 -44600 149649 -276329 312520 86327 89514 13100 140254 22934 -154675 -54688 -118267
27221 -118267 -227020 -328047 230178 -17785 59111 97594 31726 176536 76845 -352058
27210 -173025 64120 130705 -95522 -108083 396727 -51052 -202069 138479 142609 85004 419634
27199 419634 -211980 77439 -214587 79665 456939 149968 29033 -132740 -248398 279090
27188 183967 397504 240796 234978 95996 -258380 -50970 154194 -764 -278223 -127613 201558
27176 61503 -71576 -64302 -24855 139416 101365 -100617 366724 -615294 -57631 -113194 141709
27164 5297 125005 280611 84522 -14897 -133400 -112865 182687 -168059 164105 47203 238586
27153 238586 -22329 77331 66911 308874 76676 -106281 66132 57701 48297 307964 -95445
27141 3437 245824 -51850 -162856 -92761 268772 26774 243659 169978 57061 -74827 142789
27129 103288 30309 41938 -37019 -109318 -291943 359852 -112771 -11188 58962 -175596 19764
27117 -15651 92554 211124 -67716 -138258 -112433 -116843 199501 98996 186093 166445 70878
27105 60961 -220931 -85557 381336 -236095 124705 -42038 -85320 -100940 54763 -78994 -281425
27094 -281425 87172 42063 -264671 136565 53297 -124034 -125442 9986 -108654 57847 67431
27083 67431 116259 -174340 -100729 -313046 -81448 54374 -225729 235283 184528 -44585 31398
27071 60458 -193893 93313 -253896 31423 -153849 -86557 210369 -227126 -168999 -205042 -497550
27060 -497550 27836 64223 -215397 16557 33366 -117466 357718 -84518 20323 173972 9548
27048 120719 67123 -56023 95430 35399 260798 174475 -61236 -45875 159796 97016 -45949
27036 -78147 -26736 39459 -285345 -122027 189088 -230299 -107189 -16600 48552 240239
27026 240239 -324967 183782 -165313 100437 359302 86349 201586 140851 181218 40750
27015 85100 -138076 -310473 -11271 -136134 -73951 38482 -118984 111321 24117 166507
27005 166507 -386953 -145475 275986 87820 142289 -206048 280165 146865 83865 190471
26995 190471 228376 130590 281739 112621 258664 87389 -262306 63262 122310 284011
26985 284011 -112200 154362 -143920 166483 67979 177791 -77171 -213419 40515 95664
26975 95664 -34221 -176962 176077 316883 61612 -90050 -61101 -83649 -1316 -57740 42989
26963 -105678 64945 185681 176790 66042 226051 27456 71845 76340 -115062 166921 199124
26952 199124 -126745 316849 147308 333354 27144 -533200 26495 -64347 344313 -83608
26941 368261 81655 202031 -142315 101691 366164 92697 -219416 -81162 282806 74903
26930 45949 182621 528569 -150142 -7440 -535202 -81684 87311 -151707 -4057 -184916 87801
26918 186329 -115963 -181406 -19387 -255598 121044 83723 -263353 40051 69464 209183
26908 209183 252146 146098 137717 -121042 -176019 257236 171817 -124084 308835 61634 -199988
26896 -54160 263623 106437 95841 -76060 -56856 229695 91500 12892 -148351 433706 15072
26884 9783 -144365 -5560 24043 249103 -44345 -127304 327376 -44227 141708 -296013 74335
26872 356882 -70203 41783 214557 -77643 65447 -83243 -125544 27618 256907 72372 30496
26860 -237056 227205 -231126 -179753 242124 -186687 58974 247171 -208249 258093 191570
26850 191570 193448 153899 -28839 -255260 290627 -8667 107132 22696 -62220 51947 176687
26839 176687 101680 -86952 104864 163076 88586 -15789 152310 -198465 5856 287426 3349
26827 -9535 399433 -221255 59155 256090 -32047 -461041 147141 100435 219463 -79528 -151033
26816 -151033 -85430 -134255 -27549 -47798 -158730 296462 216667 60564 -127201 -148338 248308
26804 -53805 260566 -93388 196724 198560 -212469 -37704 -170738 -95927 -140372 -62546 -143443
26793 -143443 148868 367161 -85610 -30286 270396 255071 -133882 -139821 -241094 -199679 95606
26781 158017 71253 -264874 34819 228556 75074 69622 -170839 8124 373612 -24960 74208
26769 146649 117004 25341 -291081 2133 264925 10842 -347998 137047 -14089 -286318 -70217
26757 -262942 -25324 133158 -37696 -24631 -115567 18731 336715 -271296 124156 110307 -260077
26745 69707 -66074 164573 114901 -55112 -331 146543 94476 167176 -236820 -155300 161531
26733 199245 -76548 1704 124278 33532 -36242 -292252 -134059 138947 41895 355084 -101745
26721 151697 -126787 -115745 -177231 214583 185106 -176188 250953 -333156 3820 175888
26711 175888 -256568 -99497 176696 26432 47328 -171230 -52931 185826 -54364 49389 135559
26700 135559 17709 242112 -32696 19801 -83141 226065 249691 67906 -128963 -86112 51244
26688 134533 -359051 -125641 -207952 152832 -39412 38150 73710 -280877 136079 40359
26677 291370 -11275 251272 -54046 153231 75550 160525 -46470 -53660 184048 -262475 -46581
26665 73620 201055 67301 44504 -115551 -7318 199339 -85021 73275 14917 -213549 -140361
26654 -140361 123757 162803 -14426 201892 83569 74231 110981 3916 152074 163350 214531
26643 214531 -339267 -102443 -41123 131400 68960 124106 298073 67553 116206 -50592 208316
26631 395593 -205556 443029 -40765 -26090 -25666 80184 -73065 171748 239434 104265 -71589
26619 213822 52680 223638 -169317 -1827 -174544 130145 224149 -7141 -271380 146776 -147637
26607 258478 231600 50149 84316 -235170 -18152 -137748 41442 123823 104927 90994 74371
26596 74371 -36434 -29618 49084 -110824 -7751 247130 74646 123083 -322418 -97259 -235711
26585 -235711 73107 -109012 221094 -35435 146942 -209640 -413091 480976 -218251 231232
26574 4715 107537 -369377 -253168 -183494 226148 -131679 253596 -18765 -194365 89830
26563 322730 -15132 47540 102576 97307 215433 79504 -31068 -206139 83929 76057 -85189
26551 -269006 235220 -162057 198608 253318 38798 74856 -270578 -37014 -112483 -201494 191139
26539 -244979 130958 -67600 96372 -89819 -127966 123331 -57209 -165412 -6393 -214848 -52655
26527 -16302 96333 -276432 111497 -36783 257245 -233864 59827 114636 -159817 315167
26516 177339 51873 132996 228908 -172961 358328 146722 476671 73510 315739 -27732
26505 258441 255365 129054 43487 -62588 175121 -9041 68689 50234 31710 333099 275251
26494 275251 120766 124737 -245487 87044 58256 256142 297359 220854 103655 97087 -216836
26482 107889 185729 -245132 101151 265615 -140434 31250 -505594 18677 -196925 215396
26471 74058 153641 135084 156732 243931 -149063 -184230 -45158 -49728 -9742 28305 156434 137067
26459 137067 57851 56304 -284323 124548 199081 -134785 104841 -200001 -15643 94220 258810
26448 258810 31557 38855 -140913 -161215 231552 127433 22373 -98582 -15006 103869 -157296
26436 167327 45442 4494 15679 44936 134227 -113392 78478 131403 -171203 66080 -35451
26424 -148228 -313110 -97810 -62779 146465 259356 303207 538096 133473 -299481 32370
26413 -27186 -129064 -24306 -20350 -163259 128463 266985 211497 14289 219221 -44645 57378
26401 104281 10748 40143 86090 -13762 -86875 -71018 139536 -330795 -126086 -22839 -310141
26390 -310141 -178555 -63415 -50908 -116080 24536 32970 124687 -342397 73296 -30742 50343
26378 -210527 142978 238683 17690 -165296 -23282 -63980 48473 -103735 6260 -49804 -33814
26367 -33814 -118902 -322715 90317 -88730 -368447 115329 33888 -179874 15616 -280395 101007
26355 111244 -136617 79299 -412112 6801 38530 245656 96325 -3358 166643 10552 -264441
26343 36612 -108789 112706 238512 -32283 157183 40609 15764 -272019 61000 -287628
26332 -211691 34744 157776 63400 -120125 23344 -12288 47049 184366 -168728 54939 -88964
26320 156050 65895 -124500 -84955 176141 -296412 -112076 -60102 -195106 14172 141214
26310 141214 362456 -85368 -109957 188149 72352 288393 -256782 8035 245894 -325325
26299 -54404 -115834 -141659 -58851 -61560 96492 -42356 93335 59542 -3900 316317 188394 -136129
26286 124615 -156847 -349773 242043 366559 181077 314623 19657 -82612 85284 -129804
26275 513266 1345 211267 179622 270611 -86957 -40902 38768 -238726 -83770 156057 -105012
26263 73945 67232 -28550 -275394 27522 199322 166859 132283 -43681 239213 -31690 -349769
26252 -349769 -64265 107182 14311 4123 -177101 137494 -43919 27058 -138658 39371 -220201
26240 -17764 -37729 173235 -234994 89299 -149295 -62616 -394501 -120728 -55182 37146 19478
26229 19478 49395 35339 -146196 -124521 156348 205104 -314451 7292 79283 -24272 -22927
26218 -22927 -144498 18224 269362 -298684 52805 133040 121992 185163 -128296 34292 -103541
26206 -16963 -16249 128099 393938 -30913 -121775 242760 369118 154118 44207 150035 -212141
26194 45258 268700 79919 13374 -145857 23330 -288031 -290780 -169733 -22339 98775 63684
26183 63684 120456 303327 -75568 103960 119761 -30161 39650 70429 215832 -126842 -44255
26171 172418 148099 -11818 -82266 273987 -3945 108945 192859 -272969 196153 -197708 -31256
26159 -67839 457391 -18645 266795 -118066 151567 218205 -103856 -49122 117287 -188895
26148 50237 -404365 115564 -220265 207069 109458 2194 -257137 30839 -362920 6898 139765
26137 139765 31981 -313233 -135564 -82413 -11353 37188 160407 12310 -64047 432595 -65989
26125 -50672 52657 181350 -109560 91818 -160143 147402 65479 -22905 -355969 83808 329879
26114 329879 113519 263073 74516 385659 110480 -17154 179708 -87751 11843 -180601
26103 32143 -275463 236516 -250288 -88483 327283 -279500 29230 181841 -210998 116216
26092 190703 -88237 242976 -82836 286630 -2530 -285152 -9537 197515 7841 180613 33081
26080 -692 290898 202901 -9144 -158953 212072 316147 -45279 -232591 45786 -66322 -242566
26069 -242566 35012 127846 183022 -13712 -273359 124107 14585 63149 -97868 -175246 -310354
26058 -310354 -192775 107123 -62467 29938 9761 -338638 -118491 -13734 96820 -271228 179646
26046 -131177 -147401 125019 88158 -244588 -186298 -252467 349507 -35355 204260 -87295 266957
26034 -204002 288000 -106645 137342 94866 202719 -219805 184430 -96392 220075 31112
26023 -48947 90067 -15592 -121794 -51228 338250 -32896 -232153 -226748 -60668 292569 211864
26012 211864 -42040 26661 118890 -162015 229922 -61844 -271460 -41170 -165545 -438432
26002 -438432 -256523 -187577 27247 107261 289730 -264160 60035 28061 -45822 210837 -231608
25990 -141779 102324 171328 -68305 -233337 85701 25163 353110 -282302 -126077 58780
25979 -148616 -128365 -46871 -278500 61473 -89366 -158005 71253 112175 155546 166688 -5606
25967 97466 -14668 -279222 -211397 67899 300488 -140168 -178301 -136135 -125416 -183395 -27172
25955 -55521 12546 170121 -391993 -442529 -82976 111529 59666 83463 175552 151114 -165068
25943 140565 76361 -32501 -224618 -31972 166301 208068 281761 -224042 -51526 50295 43061
25932 43061 72574 -98409 82515 44992 146826 11660 34728 -12748 -29727 -7935 489601
25920 10238 174949 154656 -328847 -57092 -34580 -91563 -271198 -264219 -130315 -176975 92450
25908 -121245 869 -104400 26609 55727 -81543 -191076 -242503 -13304 371315 136731 -243608
25896 111250 136229 -64011 116819 -205890 117410 101871 -125453 263149 -32353 -38377 104072
25884 -10005 -294331 23179 -124131 28315 -97559 9472 -196006 213406 63577 -98899 -195658
25873 -195658 -157001 -44112 170620 -697 112100 -96058 -53959 425659 -260339 -154435 -149789
25862 -149789 110063 35821 -241599 119156 14706 -139166 -119702 -53013 64189 -318 115127
25850 107485 176136 195546 -181504 207927 -191849 -304813 8146 -3964 166990 247522 510488
25839 510488 -69125 152300 242943 215642 41105 113464 -19464 -47501 -98915 230142 4802
25827 -315869 -93742 -126614 88917 -306908 187857 264201 238146 191022 -59539 -66358 113720
25815 316052 67343 154703 132945 -193742 184216 196416 32251 -263412 -372238 -51795 -41711
25804 -41711 -215495 -81139 -34126 -146423 -129810 -2729 41208 -122468 -134537 86547 -8996
25792 43376 306947 -139348 151512 -39938 -19260 143780 301615 -36693 71301 57431 -83092
25780 -101682 20287 381461 -241621 -10135 158211 -75076 107536 -122794 157045 28842
25769 206335 -440859 -66221 182011 45580 -340612 107580 -354104 6385 -305804 64382
25758 -37134 -180291 -95828 169378 221945 186134 -95270 284988 145769 218077 223358 -36649
25746 -129246 -322611 327000 -155643 -22576 -2233 80304 -88730 -51090 -47000 -241378 257421
25734 512592 61077 -460182 -50010 -49558 53814 -380903 -68073 -5297 -17726 -137878 222253
25722 -13748 -180370 43864 -47048 -101437 100749 156189 -80416 71697 21756 -51148 -143815
25711 -143815 110009 -15186 55691 200529 -83270 -460127 90218 -89045 174629 -133956
25700 105783 -289381 -31051 -129512 -83563 -273949 15357 -276880 -10983 3689 -62588 -13155
25688 -84022 -114089 -32800 -127112 160998 -161370 -323286 -195347 178308 -421732 14737
25677 -193929 26369 6858 46363 87866 -184185 415867 -213769 25591 -64871 -90222 145521
25665 100108 18208 263390 -155326 -91637 -246623 177880 -12835 169771 197217 -4152 -228649
25654 -228649 -163488 129941 -13033 226807 1058 -113364 -296046 -141156 -32911 -133948
25644 -133948 184623 -36182 146488 -1914 -199550 103433 -279615 68929 202369 -109261
25633 88786 62646 -74961 177371 109049 -18778 128544 301789 -184326 139685 60253 317536
25622 317536 58783 -33918 -3903 -168572 101381 -150978 237247 31443 -259019 48527 52194
25611 52194 -93366 -241044 151855 219181 102473 61424 -214192 -88157 319308 -12144 259660
25599 148188 -45684 -10139 -27926 232497 -120171 139831 3518 335612 118921 216663 46653
25587 -135799 -80896 -37001 -97572 150790 60696 180577 -263747 -207614 78677 -170058 67671
25575 214229 192919 20285 -190558 90333 76452 168438 -33878 24219 79026 -71526 306108
25563 -14389 -48565 257138 152975 65287 277264 243859 -228081 3549 -29665 -79735 -82827
25552 -82827 40073 179763 -124658 178436 -247674 -223945 88335 -77974 31409 174680 -105218
25540 74326 43396 237981 191916 -62285 -289965 301335 243889 -104971 -207783 1291 -24374
25528 -11595 -146758 -213356 110774 204778 57914 50729 76769 71176 273999 317033 47287
25516 125963 -60003 247855 -70841 -137305 -185787 7458 62134 -258052 94435 31690 -314195
25504 -28956 -51283 -25378 -170222 -4007 -545138 166461 146080 -212925 213047 -153917 141665
25492 183307 -93391 94189 -346639 -75617 -134911 40941 144571 85750 436141 119024 -212501
25480 52277 112561 -209362 -300777 28277 -157939 -319415 175996 -35241 -10945 465201 -385438
25468 -135554 -113882 -45799 14527 -56896 -89717 150877 111836 275412 -278022 -137890 32243
25456 -82662 -22737 -190859 224632 71699 -238423 50435 254342 -63086 75687 -271792 -33220
25444 276622 -190770 -104065 31952 -184365 193330 -4175 155203 10479 -221343 64816 339051
25433 339051 -45556 96416 -212245 -127799 -160058 291881 13713 133295 -77548 -2932 117329
25421 -113375 353138 -58805 83143 -291282 -326752 16261 164042 180569 73924 34116 87519
25410 87519 -25171 -46042 -92885 66455 10868 -137543 -200065 -155464 78917 -66836 49315
25398 164915 382488 152231 -36764 -47672 61734 415826 -2495 10929 -111452 16487 185117
25387 185117 183973 -202772 -236720 56113 -138313 -159647 56297 -110309 -104059 50521 -52318
25375 185389 -163329 -39119 92801 396962 35039 246479 300762 190694 -37289 -555561
25365 -555561 -18402 188546 232269 -96332 149083 64238 48993 -32712 368868 56234 -37839
25353 227953 142986 56551 -60659 -136367 11158 436629 -205606 -105055 -44457 -94372 59903
25341 62697 23202 -6673 239057 -1440 -73878 -7314 185957 -45178 -3727 35188 -45819 283354
25328 -32699 128098 -12578 298246 -203338 96259 -270202 79728 255956 -191128 152365
25317 284860 198780 -64746 140703 -252065 -75604 164496 96946 291675 71953 115926 108248
25306 108248 -3203 104457 3286 162544 -174495 -74417 114036 -122444 -98216 -59248 -6289
25294 27339 242839 106092 -11559 198762 105447 -102783 36851 -136584 40139 -76209 -201848
25283 -201848 99768 181389 139829 138944 168303 243034 -200203 28881 22232 -61983 256767 -88948
25270 -224839 158506 -216680 -238894 268144 24719 -146040 32180 147919 -95532 -102376 55471
25258 209823 129844 -50854 52532 389680 -122151 -229835 250802 -223656 -79881 -40097
25248 -40097 -52500 474286 -23814 165446 -162541 12909 5696 -47468 -91539 -130518 -50858
25236 -5042 247502 13759 -237400 -192197 -18273 -42430 -162974 224287 -24162 -104616 168552
25224 190440 293701 -134244 -222240 258599 108445 -97352 97180 -157762 26043 -252066
25213 -341541 127596 -96783 145639 -360201 17231 -3296 -228217 -119051 -265705 171275
25202 88662 62390 39981 -51834 -26230 -284099 -146672 243408 -30826 304886 207237 -204373
25190 -136665 -87441 132925 134334 25123 167182 65107 -263843 178339 -34624 -18888 -302173
25179 -302173 212890 -62001 43131 -44138 320162 107200 112271 140696 123263 15572 399921
25168 399921 108525 1746 -20184 -145214 -82231 -127289 -72651 -88636 150024 -133019 22015
25156 14734 -41090 34669 -45459 -22544 -254936 62900 96534 -34608 8092 -103452 17982
25144 21359 29147 35687 282300 -109074 35030 377996 -12421 325544 -129083 151496 19134
25132 117518 405919 -44546 -156664 63373 -71147 34835 123027 165929 65048 -238936 -20559
25120 -225988 367747 -226898 -198634 182469 57107 -113368 -23930 -83860 -39746 221951
25109 -12702 -23103 -41511 349480 -143218 85775 182513 -120185 155831 67089 -32268 -398873
25098 -398873 121809 19667 50687 188111 18108 -242279 -14889 223872 221825 46217 55339
25087 55339 125536 233898 155057 87169 -23173 -256679 -206544 30535 331299 -184895 -51382
25075 262736 56678 86780 221592 -25631 -334626 -216364 -190762 127573 -67403 -54960 -32250
25064 -32250 -184682 -117216 60028 -173657 89361 -268310 -312601 -100426 -215034 77997 316303
25053 316303 12930 119350 -116080 -85657 367970 -232423 186380 30836 77451 225297
25043 225297 282782 -89098 -191530 93424 84941 -4040 28011 -3839 -136162 -27972 167713
25031 -313240 114118 -9930 66813 -346199 108605 17059 -184885 -72320 128706 31906 -193344
25019 272054 -24549 -49108 -275123 -5528 -261491 -595391 112219 55109 -297568 217855
25008 382088 -209395 114599 -108757 163180 -80902 62505 -278172 -319520 -150399 -46792
24997 3540 -169434 79278 240134 -49011 19622 109462 -130500 493477 60236 112560 68265
24986 68265 -90997 -5986 -393388 514 -80881 143944 -137412 -332020 268180 175844 143510
24975 143510 -119474 41663 412592 -226101 -161123 187609 41362 -35275 146833 207435
24965 207435 -208037 103424 7982 -17448 191272 192330 408039 61591 213320 154965 -53505
24953 134323 315791 329299 296377 -183249 -36205 -11569 94185 12255 -34739 249709 149293
24942 149293 184322 78693 54837 191961 110769 181752 -17220 -7263 -101416 -8271 180139
24930 -67911 -47024 -249325 -38587 54693 222560 228523 -3561 26247 -18627 -26398 59242 -53963
24917 241606 154633 242153 -269726 -126086 -75832 206754 144774 -176936 84083 20205 -49629
24905 -194193 -185782 55491 -134512 157810 81714 -264141 -361164 -98679 -31016 -23951 -429112
24894 -429112 -62018 102147 49931 123657 364126 388265 62388 -278879 -115658 330209
24883 -44038 122542 -175605 -259145 -173073 -254604 11899 252528 173049 -17015 -18577 43109
24871 39232 136543 301532 -39246 65476 39486 -74416 -187473 124550 132779 147458 50825
24859 -97544 103438 96889 -81014 -72254 -30610 126426 19731 129020 -25058 15545 194403
24848 194403 21214 154446 42512 -45197 61699 544977 232743 -100735 10637 -138718
24837 -29684 160826 -99722 -8888 71261 230862 -135204 -88145 52591 236386 -35254 279709
24825 -160300 102649 -22861 -8677 -165769 -74856 1982 -169198 -52575 -193200 11239 -67936
24813 185922 43024 165783 -51540 48928 -126429 -55174 -44237 187609 48292 -27159 46060
24801 -2045 115221 -10241 57000 43351 -17085 111745 91189 -105686 170181 -284825 230382
24789 -264094 197732 143214 248503 -490613 132772 -184270 -197535 -246198 -75091 15629
24778 154985 -246687 71499 361185 40671 -68166 -107150 14771 -66590 -178847 165335 -89005
24766 -38815 -111973 28479 -42627 -249619 53026 -196681 -400229 -158621 73404 -139418 -107674
24755 -107674 -110802 109128 -158596 2639 61578 285660 42201 -142367 -144568 25912 40312
24744 40312 -165712 98965 127900 882 167970 -347409 -83277 -154158 89857 10731 136860
24733 136860 10488 19810 164858 68625 -195359 283469 -30662 179382 -244380 272635
24722 180058 -79374 -86666 63124 -69685 228010 81596 -353624 66290 -205599 295708 -55076
24710 -255961 -117357 154600 -127695 -279886 3754 -245040 -109925 172684 210231 -153170
24699 19195 211883 -32532 -107789 -11269 -2525 -161247 -134783 -64218 155232 178728 -104917
24687 158859 -52611 -17030 -64872 -91877 53183 162318 -68240 -119388 -122942 43621 -151488
24675 -6926 -51136 -88483 -351485 215786 -1216 -85538 -31515 -128817 -10888 -153422 -60525
24663 4993 -216149 -328950 269128 375893 9725 296496 122313 -26672 -204091 -74559 -206186
24652 -206186 6573 31313 402643 23094 215187 46113 114955 108510 -200444 49470 264218
24641 264218 -55376 -163545 326666 -154168 -204301 -315360 -136339 115621 -310798 -7229
24630 206166 -118267 -63492 16293 77662 -229304 30015 102304 44270 82103 -550221 -158527
24618 206216 118586 -29888 278717 114769 153442 -490615 -179919 -112628 179498 -198514
24607 -114029 -221993 217641 211664 207405 -64611 275015 16277 -190521 -223721 -120277 269249
24595 131144 -32735 -270433 -80322 262354 189660 232207 105503 118120 29489 115327 -399830
24583 518619 21863 -64156 11811 14344 -28460 -835 -92109 -56425 -275381 82395 -336899 301557
24570 49147 -182525 -223204 61033 -56539 -21345 97380 344806 44094 -359001 50448 163184
24559 163184 143075 -83466 -20042 94052 12017 103471 208650 -62505 -43504 -45705 373150
24547 395265 134991 236195 -208912 -164682 101861 -93727 111122 83317 120857 304282
24537 304282 -179666 -13246 82861 -263876 136128 -169001 -30275 -38465 223652 -106089
24526 -9788 170385 -5260 -303698 -31665 -222587 -76807 -129681 64638 107157 -285016 -220181
24515 -220181 -16500 -111670 -79890 -311856 -47971 -160209 -357598 -143169 -118785 -124671 49204
24503 -198639 69946 -181991 -109823 817 52170 8141 113537 -229353 -290027 464695 -183647
24491 34096 -160985 -12814 101817 121596 -138978 49152 229479 -271840 -41392 -13232 84312
24479 173520 20038 -52848 276410 233824 -20177 158011 6803 44761 -154032 56706 38682
24468 38682 127606 124339 -166683 37914 350188 150800 265747 -206232 -20928 57377 149846
24457 149846 -161907 98344 -109314 -234104 22724 51311 -355864 -15317 -392366 72242
24446 -44241 181255 -346863 120228 63860 79503 -113961 123709 35588 158607 406700
24436 406700 242616 -59361 251141 140 -121126 91963 -175584 -97178 -225642 132812 145804
24425 145804 -61444 -195372 -225755 -170332 250250 131772 -126349 -52235 74323 147057 54621
24413 -9824 148208 11844 138692 129867 85181 117251 90007 -83586 -65103 295088 157051
24402 157051 19873 59031 -149687 -71238 -255427 -181104 242351 -72852 -19236 133724 97113
24391 97113 208954 87590 -363760 -229312 -100191 108979 -64152 -74239 -27846 -48558 -4423
24379 -43701 72665 68179 125855 -159121 -266632 -40495 75242 267556 118784 221782 93740
24367 56176 114981 -34070 276487 -83040 117751 277635 -35690 -28848 186956 68286 -220374
24355 -107815 -174808 155520 -419184 -30171 295803 -3300 -72637 25701 287889 14969 128632
24344 128632 147730 329038 22111 -29060 -230700 -63973 -146536 332124 -55829 16603 66621
24333 66621 -76322 188524 250378 240743 -166635 143009 -364978 -90902 62002 -195648 -75414
24321 147656 92564 -258360 75719 37903 139506 255330 163988 71465 6180 167860 126568
24310 126568 -261057 -91262 -433528 147455 -8845 -90847 118645 11174 -175206 -214563 -132168
24299 -132168 -132161 19472 -79168 51940 -160736 -112245 140178 -207730 -71576 -352164 -509467
24288 -509467 -29742 111566 -96055 -321406 198095 -445504 156856 31963 -222302 131810
24277 -45961 115585 -158470 -57460 164472 -6691 -122892 96574 61538 -221684 -270362 308676
24265 -163085 208642 16295 -114531 4317 -251047 -87745 -43156 -126541 30666 6866 201315
24254 201315 42800 73659 164934 -355012 -245944 -189048 161757 197970 -13613 -119044 -247272
24243 -247272 -108023 -39106 -73238 -53599 -40073 -46313 -75411 -308098 29972 375895 603398
24232 603398 523443 27427 37363 -228922 -275779 -22115 -255384 217010 -13710 205261 178775
24221 178775 150680 230099 -21546 -179349 -273337 -151876 6040 -240362 186666 78464 -273871
24209 -235905 -147578 80097 135238 -79765 -55553 -27695 252239 -105346 -67156 45946 46941
24198 46941 -67510 46171 25889 -32046 -192093 -3007 -104596 -42840 -309210 234534 -51055
24186 84714 419917 -53104 223076 65227 -235550 178110 -64000 217379 -340567 151034
24175 -289469 -202539 -176379 -239004 134679 136342 -233528 -61431 110195 -62671 66909 -254517
24163 66344 -95442 -187621 -218605 -57568 77786 97059 93307 164872 66827 -7182 -122684 -353
24150 226209 267313 -280325 -114209 -111062 -41567 348821 292448 77287 -294818 49533 -194336
24138 150231 42111 -87657 -139209 -21138 284738 9122 -29974 -14569 -49274 24792 -140933
24126 245006 -73969 -29543 229347 -4037 268008 312859 -353521 -44038 27394 -18565 -195014
24115 -195014 3597 -240793 -292993 -345283 360579 -209677 297683 13511 -149745 -222 -38038
24104 -38038 74884 36685 -341693 262798 170424 -9798 136379 -70871 -92470 -245911 -22690
24092 -51328 -140099 -96956 2232 -118901 -122167 -36706 -296266 69842 284177 -39077 -81964
24081 -81964 353106 -121887 -19997 144973 -76526 -179447 57005 -151742 -87980 84934 -15031
24069 -11782 261672 30650 -51731 398490 -222826 -104543 -13198 -229643 8998 386968 -101661
24057 -251416 -73386 -6681 195994 217720 101721 92128 -280400 -164887 -7786 -89197 -144326
24046 -144326 -35399 -57552 -256892 -440930 -438113 -2639 195222 -91404 -132653 32218 -142422
24034 166955 89828 -129355 -112337 -31006 26110 360933 -224420 147279 218215 -72604 -298056
24023 -298056 247085 -18859 -181380 91583 32652 -216289 59124 163158 -336514 -272606
24013 -272606 36923 -33246 228888 -42773 110105 33676 291433 -95440 42888 -71841 507120
24001 -16493 389918 140944 61966 52197 186113 66878 13747 -220321 -18077 -164795 -6226
23989 -87920 -249244 -90561 24819 364976 109599 -275406 10342 -73859 35121 293864 -187652
23977 -22004 48801 31832 199865 -16699 248679 10760 225296 -71814 193066 66945 -71017
23965 391041 85070 -310337 -12981 157274 122417 -250753 38743 78936 -80144 -102662 217268
23953 -122656 57717 -294578 -286628 52926 185201 -118983 -209407 -21550 254348 -211689 123472
23941 -232483 24197 -40723 -73587 -272954 -76250 318737 -55217 149736 -189139 -118523 -128535
23930 -128535 -206803 43861 -46405 138460 -506458 19315 210385 310521 -239825 -47416
23919 -104458 219672 145418 200526 85375 151400 -177231 238627 -276010 -378486 -177140
23908 -214765 44261 191252 -59046 -182687 154031 -91701 12301 -16184 162455 115131 -361548
23896 -310995 10515 113728 135118 -93518 20886 -40504 59741 -171687 48483 174002 147008
23885 147008 13688 29649 -349651 -80067 50550 30752 -133128 214201 -116852 -106371 261833
23873 -209854 99627 -249172 163409 138831 -51522 -112540 -84188 37224 96446 161241 -171012
23861 32499 164742 175495 -156567 -39874 216138 127909 -169629 -51751 117486 47698 31924
23850 31924 40137 165547 -153413 82782 109436 -210022 213510 -28027 -229618 6582 -210606
23838 -224589 -160375 198945 324363 -213126 -148494 112570 144771 -92026 214613 -207494
23827 76873 88986 -232443 -85605 -11128 155131 -158511 -149688 -23038 9633 -148703 -102922
23816 -102922 11377 -394730 58785 121744 -74129 -127754 -528414 101209 -286296 -41088 257887
23804 -182257 -33601 299105 8742 6394 -244739 200107 -320635 -215810 -143834 290714 -26906
23792 -241108 -39399 -90377 -216863 387688 -16393 262618 68327 9706 35190 225465 -15371
23780 5079 142262 -93547 476710 -293473 -92613 -148743 225995 -163732 -104989 127078 181826
23769 181826 -148868 58537 -182440 215026 -267245 40532 -132464 141300 -39339 -46796
23759 -46796 -207661 -4538 -143575 261630 130212 -201946 70479 -202190 212911 -76159
23748 133353 -184005 -94249 180627 -24865 -1164 278155 -159226 -94438 -210993 174846
23737 -244763 -22519 -14235 -150154 -124126 -87053 -189285 -3185 -94067 98739 85304 73867
23726 73867 983 -254305 -224395 -14459 -104754 -242438 77037 51604 -266443 269370 -100580
23714 -254274 122473 122015 264717 222744 125484 -7992 165478 -121138 -198822 130855 43964
23702 -101460 -224370 -42092 -11814 -357279 426710 43377 258317 180822 -273325 -152537
23692 -152537 68703 -174092 389719 451301 -458603 -72813 -72073 -371901 59859 -380726 -33134
23680 -7709 -54988 167745 54107 11324 -372507 237619 -205624 247188 -302198 -8488 55553
23668 -96786 -152225 -524213 -2579 123658 37159 96774 8841 -59850 -55448 -4414 -221453 156661
23655 -69700 247081 30849 242377 156370 -233080 289795 -203882 -56551 176730 318876
23645 318876 -107674 73206 -356160 -161195 108612 -40756 -18496 149253 135853 121365
23635 121365 -83935 215472 176009 -159349 -206551 236089 372650 -81892 411366 -208001
23624 -215234 100028 183755 -58916 -98196 -57636 -136467 -43271 195665 -157805 242731 169328
23613 169328 101816 39935 -37342 211680 126717 -101335 17935 -81764 -268219 -200003 -18505
23601 19926 -26608 -208728 -27508 -190923 -171350 38744 86370 -112036 330696 120996 -113997
23589 -117337 40203 -62699 -262531 161678 -198937 -446120 -227006 175459 -15294 71656
23578 -143678 26830 -235196 99551 86887 -80891 147093 -108727 65695 -83412 245625 -195971
23566 -157145 -167915 -143024 -139444 -94514 -138579 170613 -223627 -73246 -216973 -151910 -9621
23554 191399 -427568 -55989 -17135 146778 -172328 -49078 -66328 -313177 -112311 40770
23543 136994 -250990 -102765 -90744 190793 -108148 56673 147829 35465 72108 -15269 -43107
23532 -43107 131523 13366 -87706 150868 54222 85962 125976 -411879 -218566 -346561 -55818
23520 120901 -99053 -514370 121165 -156361 -52287 215276 154007 69683 25546 9659 118178
23509 118178 -207025 -264436 21686 -45544 346228 285643 -291910 27322 261518 151587
23499 151587 -214170 201533 -82058 -7265 -104244 169213 -62112 -160723 150495 139736 -44432
23487 -316855 43892 124587 -23603 -194208 -53766 -279985 -22898 -405144 -72345 -23667 717
23475 -246665 173988 154464 -31964 201256 -10773 -140599 -48315 152991 -92603 -85465 86111
23463 333858 101787 -109844 -305179 18612 -3591 148430 -2913 -156530 173118 -74671 44808
23451 85428 59969 -207151 -179725 -118749 -130370 -18341 197652 -208347 -48260 153975 126492
23440 126492 65691 128752 66008 -65303 51958 -176214 3461 -59189 154426 119679 -170535
23428 -110546 -25080 244725 482222 -124372 -241914 -295338 -20818 249754 66240 175215
23418 175215 150883 82076 -106285 -143901 -13309 64842 45761 -180127 -50570 66740 -244932
23406 7383 151295 253871 -337980 190851 55736 -119071 12944 262429 -371535 30436
23395 46781 34714 -339 -38589 -15671 -47032 56793 -169840 41951 233530 -97034 -181754 -284193
23383 -284193 -298269 128046 -341149 195253 -129789 -163017 186897 -28516 63253 -22659
23372 -97550 -125092 -233215 305125 224289 293461 75206 -1215 72815 63983 -109604 115959
23360 -81576 80007 -323107 204740 -39072 -274812 -3789 151664 -367915 -93186 -132289 -215604
23349 -215604 -152159 238443 -317529 167923 64323 169643 -16824 -19514 -15975 -201032 -285057
23338 -285057 -225476 199274 -255874 60901 -31706 -182743 -29500 146154 -72115 85045 87871
23327 87871 -268003 -440409 209883 77947 42209 -182815 1697 -55178 -164934 -160214 -217863
23316 -217863 236600 -139889 -30091 -65329 88850 12214 41425 -287616 -211574 193590 106025
23305 106025 -14427 -173563 357452 -254844 -330682 -145021 38560 -318222 -190599 187912
23294 -281393 -53345 -391016 36434 -216776 95310 17141 -28847 101733 75040 84738 6129
23282 -158749 55995 116553 -125084 41386 -104599 -118813 -176596 -53131 -26335 -18051 207979
23270 -188788 -222671 -12691 44176 79182 59057 -152038 128297 22140 -23140 -263160 181055
23258 131744 49882 79237 -4565 -160171 -216125 -91342 69363 -46324 34159 43680 314304
23247 314304 -138784 -58948 30671 176810 -1603 90143 -136608 -113243 633988 -207233 -221405
23236 -221405 -74248 -31068 -109760 -188278 -81822 58600 -14598 103992 1106 -366044 -152671
23224 235668 53143 108611 -388561 -224450 18871 -98875 -231054 202469 -14309 -169027
23214 -169027 105758 -3917 109724 -133796 175282 4431 311812 21201 4798 44414 -341773
23202 -70132 218201 65231 -59717 78193 36402 234843 47379 -412786 343129 -411844 -240763
23191 -240763 -1439 -10482 -111138 116954 -193258 5131 -48899 -240476 25555 185899 -95803
23179 -164111 -23471 -273727 79804 168597 -137379 -99783 142688 142592 -43724 -46707 271421
23167 -176408 -166790 -87492 71892 -204813 -106475 42119 -135107 -87988 -170415 -134413 -323728
23156 -323728 -61586 160201 -42235 148436 22540 -269368 -510947 65077 -78322 135798
23145 -246209 -35063 200959 63340 176728 -60243 -5800 -454982 -136360 -195868 -110951 -13477
23133 -32513 180174 -40714 89317 -304046 -412801 -97083 -99405 -286221 180325 -11750 -45238
23122 -45238 312107 -209961 80059 -182738 -57291 12935 43491 -153466 -196079 -126491 -308809
23111 -308809 -38327 -16534 154057 -174241 83200 -270713 40005 222477 -84969 68842 261438
23100 261438 -113559 244892 206089 172288 -34825 187541 27707 156578 69406 92703 -66873
23088 92025 216734 -14107 142067 57700 -104578 -98997 -32589 -93515 -672859 -8160 -430033
23077 -430033 -26792 -8204 120301 80868 -157464 98379 -96588 41674 98339 -217669 93763
23065 224975 -110878 -145633 104633 -49641 -284766 35909 -144337 -129736 -366641 171907
23054 30291 -215721 89522 -161904 -219979 -52242 154776 -40536 75743 109544 -476864 -278598
23043 -278598 -222982 -54779 196289 -156426 230374 136051 -102297 -206578 145589 84525
23033 84525 174176 319481 -9521 -269861 20122 156657 -136513 276624 238302 302067 74492
23021 -36586 -15254 -42911 -24417 119361 -199991 71141 53656 204302 -180442 68508 -165231
23009 221962 -282579 -183687 190904 -296928 -70240 94216 148825 -80181 129656 -127979
22998 -219056 -205972 -102704 -51086 203725 -120834 -157065 -255581 37602 -226951 -249877 -3769
22986 -353916 13136 -87912 65864 169248 -1228 -80255 -143252 16308 84451 -17980 -47145
22975 -47145 -111792 -65249 177455 -79034 178108 31838 -648976 -80038 248195 -244480 185013
22963 -90227 42503 369567 165977 -109735 -21196 104352 -18139 -62727 -327797 99572 -38257
22951 -460919 -127588 141657 -46035 -41153 97678 -124384 78077 156477 69527 -124010 -131969
22940 -131969 -173612 -267500 -193212 -23068 -222037 -301085 -90946 132901 2183 295329 -33766
22928 -54344 -118583 164535 -1467 144050 -343007 -23092 112387 43927 -155466 -36766 -134811
22917 -134811 -70114 -28262 -232924 -151236 164426 -533581 218818 -13453 154071 -3261 127842
22905 63974 -105165 81610 43436 -120704 -299969 230824 1071 134867 -111212 121877
22894 -32761 -508042 -44580 10601 38921 40550 90622 157741 -462187 -281005 -126107 -173018
22883 -173018 13265 236005 38832 -89263 -14012 -91760 -163437 -197005 132917 50839 146371
22872 146371 239532 -41975 -99291 -67457 129211 -184560 -101975 162421 213171 -366168 -38689
22860 130856 -294545 -464392 439209 -181463 -22473 -339805 184169 155076 -44384 244978
22849 236310 79522 70908 78496 -146894 217342 -230047 -61818 -72426 -124493 -228028 -123584
22838 -123584 72313 276500 -209816 -62309 -331365 -37137 -9544 -25705 -17776 -180540 -41838
22826 230815 251656 92454 -27128 -56324 -102166 221295 4666 -127996 -45636 -231233 -82007
22814 -273387 35298 -45021 -140120 -77659 -31575 44396 -363343 34485 52148 511167 181903
22802 61391 -154317 -240717 -36683 -198163 -504964 30911 -110219 -141145 58503 197652 27334
22790 -267069 -58395 270286 -206926 -312576 -73397 150122 -19719 98822 181864 -154931
22779 63536 95649 -401301 -270888 40396 79342 -108606 51995 -49328 -179196 -442885 -172458
22767 -61729 48499 -187715 299575 -46018 245477 -357828 -36739 -195803 -6921 -225944 323558
22755 -61000 -76323 -28185 211176 202188 -140120 -255180 -332763 161460 141872 -24965 -56172
22744 -56172 273544 263490 -24461 159758 -256224 217555 111238 -287501 -7770 186283
22733 -145768 15735 -157383 -149445 -22266 20877 -199413 -193662 -135330 -449483 -166270 -29921
22721 -333527 -177551 -219174 -190 -763 104743 -21687 18575 39415 -184360 -307996 23571
22709 65530 -166578 11244 -198953 -354287 21006 -203973 -54945 148769 -293116 6197 62494
22698 62494 -57745 292346 -17066 -136965 -39481 114905 -167652 125084 -368562 172925
22687 104121 126125 75234 63266 185386 20393 -24321 -107255 -146624 94974 74583 99499
22676 99499 -40095 -171553 276806 -87067 -93269 -119675 -122422 7268 -230131 35429 -183881
22664 4747 -213119 145021 -145254 99971 186747 95784 -423117 -1550 64707 215536 36450
22652 241595 155801 -3955 27030 -341437 134207 -177689 79219 -78483 -139424 -37584 236654
22640 -178676 -66350 -308970 -435015 104428 -74675 225930 -39072 -36042 60389 -177741 88414
22628 -85572 85078 42901 150168 -173031 236616 207092 -227986 -190067 -399068 14442 96955
22617 96955 43100 -135165 42384 -242853 -66405 -123030 -362622 -41065 -4418 -109332 -300588
22606 -300588 -227988 123863 280561 212653 112010 51118 -129538 -304567 -120013 66565
22595 -142415 -2979 -293559 138237 108448 -116771 334537 -312072 87040 120540 -115626
22584 -2675 -143325 8313 258248 196399 87690 -9875 -357379 9981 96053 -261983 61798 -133721
22571 -148948 -313645 191355 -26582 174932 -14514 -155139 -191923 -103429 123768 -476522
22560 154600 -314698 132683 217620 20313 -205266 -281732 217590 -67800 117289 67483
22550 67483 277814 -116698 147668 75930 -332231 48598 -48370 -14923 -157480 -119986 -133122
22539 -133122 118843 -359110 -331984 35812 -115770 -54153 104884 -492758 -70494 299070
22528 68890 -56944 -19356 -51309 141332 409579 4894 27039 -36234 -512942 -111437 -174998
22517 -174998 -70555 54156 91743 -64225 65843 40615 -23363 192347 151506 -344429 90292
22505 -232683 66201 33062 136735 -66461 23791 125915 -10170 300231 28250 220260 -26120
22493 -85502 -385708 120198 -246172 265076 -36798 -20028 127586 -190239 -60575 238093
22482 -268003 145098 -234008 -357834 206940 -84336 18478 -315966 -91511 18276 -151281
22471 -278422 -155185 -381343 217435 85621 -104486 221 99039 -7415 334165 34892 -269841
22459 -339882 -30529 -331407 -38408 -27119 -197271 -78925 201271 46218 41361 -106894 -155832
22448 -155832 96318 211063 29382 -411259 53195 -24830 119009 -153146 41849 -120458
22437 -142224 -127738 -355276 -24578 23798 -29100 148159 215520 -113328 -79857 164160 -191020
22425 170133 -33844 -120807 -13605 3255 80196 -156836 89575 196059 -235272 70358 -44935
22413 -236674 -179576 -413786 3399 -128736 -98299 105469 -42725 -323179 145083 12787 -71921
22401 -211984 305149 -68026 -134347 23753 -40264 -126542 187293 -93394 -210842 -125838 -54511
22389 85002 -240114 -160502 187288 -151193 -109808 -20071 -113368 -176226 -278588 -115110 -94179
22378 -94179 -155870 32534 -235112 64120 -53799 -305293 225162 259267 131242 77348 -71661
22366 -71783 183584 -40621 -98601 63864 -44929 -105828 -177638 -73250 5003 44917 108897 79283
22354 79283 293507 -85887 146832 -308099 -150825 -25145 232492 -385440 -531508 -68278
22343 -15975 -216238 -7121 100473 -264858 112383 86337 -231816 234128 -308597 -93198
22332 -51729 92753 -127651 -299290 -147804 -21318 216783 -39846 98847 7538 89236 -145907
22320 284063 206375 217900 -170387 24343 -192635 174811 -336723 10314 183794 65454
22309 -74433 -372253 -395347 -262577 -20929 174839 -82051 240903 -327495 -149376 -49524
22298 28732 94152 33755 -131102 -221941 -100605 -312711 -305062 93507 139161 274397 -139725
22286 -180091 170332 -222854 -165802 162397 32642 262518 -307507 46291 -72702 -35425
22275 -106101 70675 -190891 -165221 -238040 -140325 -73458 -164584 -29261 241065 4043 162982
22264 162982 -81248 44290 -145534 -143907 148146 175538 17436 140351 -287462 227478 -195920
22252 166306 -225638 96786 -120063 126202 12415 58944 261513 218810 39602 -169946
22241 329810 -50567 -75022 -128739 -73626 -401527 -156406 -133460 81898 76794 98897 99237 250546
22229 250546 180464 -82299 -160286 -190575 -52045 273280 28760 92223 207824 87717 -19240
22217 -55962 -37177 345844 266244 127290 -196265 178861 79465 -24238 -50878 92740 -407425
22205 62490 -5118 75219 31190 -23906 87688 -49344 98382 26196 -72185 -4593 208754 39470
22192 -482 -52719 12160 -142539 79388 -190871 -57292 1456 -1444 -226624 -173727 -55302 39067
22179 -53947 124931 -327779 -170041 -179026 9984 66657 -313190 -77506 27886 -227543 -163217
22168 -163217 20996 -257368 -127312 -129501 250011 6247 -205368 88733 -27995 -122566 -238962
22157 -238962 -252828 37245 21278 -76755 -119092 -280200 28790 -58997 -198975 -166483 -25860
22145 -120712 11360 -72733 -47221 4144 -324411 -8447 78983 -289847 119036 -134201 -91878
22134 -91878 -2381 163560 -154919 47900 61352 -83768 -123689 -69092 47484 243562 139048
22123 139048 322655 -38685 -133530 -285243 -178169 -28772 -266575 -4870 -114855 -257251
22113 -257251 -160004 -86553 -160515 -73051 -66107 34779 55864 -149399 -341642 379887 -191332
22101 27929 2192 -196362 232724 281902 -32361 -304036 -275544 -202138 -181145 -41487 -38302
22090 -38302 -54455 -163507 148990 -55608 60733 157731 109140 -183344 -237779 -16868 190431
22078 192999 -311216 -196106 -13457 -71153 92313 -329730 76366 -253754 119495 -331909
22067 353630 -32174 -153335 55540 -187552 -84937 124210 262970 29891 -170915 49676
22056 479463 6605 -145149 -272359 -281869 103390 -297747 -185568 -107348 150131 -125513
22045 347925 -283677 86167 -7371 -297458 -307690 12129 -337959 -436963 -8358 48508 32019
22034 32019 -164454 38553 135057 363215 134151 -20325 8401 -173113 232805 174936 -301256
22022 -153182 -14502 -122125 -241698 53817 179456 -374166 21416 24201 -86540 -232697 -174494
22011 -174494 157756 89703 -415738 -196592 -249762 33733 131240 56651 -166685 254195
22000 -232077 -288030 -125360 -362586 209515 -194545 -136970 -66489 -225574 219839 -356876
21989 -26949 163040 92732 393557 23852 139307 116436 105148 -103248 -255200 -155789 -365580
21978 -365580 170224 137241 -31539 204743 273172 148931 -138241 53487 86924 -18782 -67445
21967 -67445 -289564 -105046 -271032 -106063 -133976 112899 85231 -149522 -130700 118951
21956 185342 -339549 -328885 -338202 50922 -40259 -23726 -216398 23271 35579 -58742 -179145
21945 -179145 44181 68269 159363 59549 -78213 62641 -71896 -243708 339148 -52051 -259960
21934 -259960 156872 140257 101692 -44073 -121690 -52165 -13188 -61007 153863 423707 -154960
21922 132087 -262553 -101185 -163502 105029 105653 100480 -82072 87425 149470 -5514 -165239
21911 -165239 -165171 -105612 40186 12148 44964 228694 146483 -210889 -190150 255488 189775
21900 189775 7311 -292670 -25406 70870 237210 -138246 -11216 172704 136320 -194825 -82481
21888 -141878 -172794 244292 322005 102507 -87173 -585001 124121 240153 -119639 -241439
21878 -241439 104587 8050 30613 -114205 124377 4596 -235299 -132513 -195024 118992 -210560
21866 -20296 133114 102350 2662 -223697 -253022 -38435 -159229 -57563 -137252 -71327 2388
21854 -181695 224095 -5688 -29530 128293 185223 -170158 -307341 10407 -157112 -65979 -154495
21843 -154495 128244 154239 116426 -258473 286117 134173 -20838 -203865 -238234 -227680
21833 -227680 53846 334792 58305 -23125 -120769 -165261 -162815 -34899 -508128 280480 -9760
21821 -190565 153785 -457774 -41186 48358 -185638 247297 114299 -3431 -205725 6202 -101885
21809 -83493 -372263 -10473 140053 326232 715 -107417 268243 -33814 -173278 148541 -72801
21797 95864 -86722 -124806 230553 -97015 55596 -18094 -41799 178538 144431 -127262 -404899
21786 -404899 21269 71571 207998 163194 96992 105822 -45821 -50694 -114364 -369859 10610
21774 211266 302955 -229 -211102 132277 -224201 33057 -92867 44747 185619 -42658 -101081
21763 -101081 225409 -33213 -132977 -175082 151238 91693 -392511 -112685 18471 188007
21753 188007 329550 -168110 73460 21094 -169186 163420 48702 703 143630 -62434 -227252
21742 -227252 -236874 -239606 -264948 172612 -27612 -73132 -182321 -181203 92068 111476 -99352 -42029
21729 214321 -125990 103739 99367 -130806 -220563 -79826 -183855 -366244 -121089 -314587
21719 -314587 -95845 -97333 -81640 -185785 -258578 -176911 -149260 -244521 -23578 -317231 175495
21707 89627 -109112 -144577 -189795 -83298 -162905 -63298 -135777 -25130 -269934 -162423 21371
21695 -50199 -248294 -91521 -255524 -375944 -72063 166490 -214518 284374 -92891 14002
21684 -332856 -163323 81416 -62349 -93258 188752 -56056 -6462 62772 179444 -155282 -45440
21672 -34304 157868 -184326 -64639 -167907 47404 -144860 -404199 43627 317591 -21016
21661 111449 114551 -184621 -258783 -433084 27442 -50670 91177 -138662 55915 47634 312870
21650 312870 93236 -60605 -58427 15681 71338 -414355 -158398 8776 110672 127982 -57523
21638 20675 36943 -370178 -108622 -19054 -30594 12353 175770 8106 -282224 -156077 -310090
21627 -310090 50945 163972 -304379 147518 -189053 145487 173965 -135962 171360 -43803
21616 254025 -262984 249543 -375781 176794 -197320 5977 -346831 106017 39362 -59375
21605 23635 -105518 -258873 -105559 -165183 -49602 36235 40807 -167041 140575 310233 133362
21593 -175030 -151713 -48519 -173542 186934 -90098 -55838 137830 103967 -100822 94295 -30890
21581 -209598 -217621 -34108 7818 -72615 -137496 -69925 270997 159467 -180402 -48431 -77764
21570 -77764 80613 -319230 -96206 250059 108020 322450 -388975 -259424 295610 -232125
21559 207005 -213315 -25976 -107585 -107818 174077 -165565 53644 125183 87381 22432 -97724
21547 -328174 143772 -9037 -399502 102308 -33991 -71930 408626 95212 206245 -15587 -33671
21536 -33671 84878 175024 -353139 -15837 -171131 -28365 235590 97132 -34276 228766 -109236
21524 -355055 15846 382965 159977 -94197 49153 -268035 -11889 -221827 -7919 -252569 -96236
21512 -109677 106752 20886 -137231 -78979 -360881 410008 -22969 -227336 116735 167072
21502 167072 -385268 -87014 -260095 32298 -140601 161425 90483 -322550 72549 72608 -11326
21490 -129528 240551 -201592 306134 228394 45656 -132958 142722 -45113 198836 104683
21480 104683 114725 -343988 -163125 -296727 76464 170056 362693 26860 -33803 47668 -162541
21468 -17504 190476 -25235 -29753 105709 123618 134126 272561 59390 -288184 53838 -66182
21456 -55582 -11651 95280 -134035 -207046 -194204 74361 -161849 -229423 -95658 -211052 -159666
21445 -159666 -228851 40559 -64616 93149 -186078 62982 289514 446424 208397 337881
21435 337881 329701 307011 -46833 -169435 44831 258173 -202851 -56474 -29322 -95661 -201160
21424 -201160 -201786 -78444 104502 -239686 12290 170231 -120382 -129848 -311978 203538 130219
21413 130219 -275472 144976 -168804 125044 -96688 -15480 227684 -82643 197483 135680
21403 135680 -27538 70578 -85069 -105338 -279782 -358161 -11601 -277416 -239725 -137796 -199908
21392 -199908 -185500 -301263 -242567 140218 -135826 -171683 93117 249686 -100847 -61576
21382 -61576 -66520 144302 -81644 -53927 371201 127480 122986 301912 -165396 -309325 -363608
21371 -363608 3465 212496 -65402 -201835 24256 -155881 -1179 -343181 -164023 -245645 -17317
21359 172937 20288 -170829 -161878 -10559 -14040 104540 123963 6301 -210850 75890 -64807
21347 -48395 28137 -232475 264613 158837 3124 -88474 -121779 -74169 -95067 51347 -179757
21335 -145155 -48837 -62864 64691 112766 -156736 118221 -124362 -72011 42395 -203613 -65203
21323 -133760 -113967 -175405 -169660 112628 183256 -49984 -67793 68019 -227702 -722445 -287395
21311 -221543 216325 -227090 -444880 -241399 -290599 -177436 136488 -511590 -4605 248764
21300 -94760 22154 95601 178140 -66612 -32057 -89806 -163400 -41522 -108628 -272671 -23703
21288 105113 -128303 -247244 13273 -152573 -85786 110666 141661 -169919 -11703 41688
21277 -54803 -166590 -33156 -171702 -21445 116689 -247543 -126121 -136227 213731 -245499
21266 180751 220456 -61211 173361 -238166 -217209 -41629 -91587 200345 -18285 -80766 -264658
21255 -264658 -392878 -64878 -95109 -218397 152895 -152918 -358756 -85086 8374 -203005
21244 -223644 -232427 -114988 229566 157474 60420 291092 87044 84193 -287408 262486 -17084
21232 -88452 -57209 -119885 -139508 -133332 150848 78235 103796 275000 -167761 70863 268292
21221 268292 9277 134420 -185487 -489973 -12606 51061 -219850 92890 74863 -179666 -107986
21210 -107986 -83601 60814 -68197 -185125 -32509 62415 -20345 14940 -153139 78594 184315
21199 184315 70657 112283 27773 368440 128761 -127442 -63789 -276731 -4125 -62372 101414
21187 -191197 -54600 -41314 -82268 -52037 -21471 -50753 8555 -141019 -229584 -129571 119750
21175 -12009 -165226 -994 -68839 -108634 -179744 -138678 57051 58597 -127148 -14826 137538 69837
21163 69837 84056 -124973 85136 -403425 128599 -131083 -221596 -168834 -44074 62041 -75802
21151 -2208 221843 31908 -418 -263880 -158066 28366 -254512 -6724 194091 -4599 -121839
21140 -121839 156345 38938 226316 -96169 -177962 72937 -100515 -49522 49770 -208578 -197630
21129 -197630 -121001 -216283 149599 75149 115732 7446 -15986 -79734 -135050 -20525 203348
21117 253417 7250 33965 -16250 9157 19390 20009 -31612 -175839 238078 -113838 -307461
21106 -307461 2769 -54556 -147975 112589 314999 90559 39120 -65117 137702 -89464 -135357
21095 -135357 -43595 -105885 -41655 248738 -443568 164397 -46041 -95214 118821 -259275
21084 -72696 61484 -489675 61782 -173104 -243248 -428581 58920 24967 -258606 -762 -29511
21073 -29511 -502424 65001 -132028 185348 -290910 -188211 30004 -217813 146750 -138832
21062 -100927 -66242 31876 -121720 18108 -305858 204326 -146765 -12452 -45160 84481 47938
21051 47938 225635 -150814 50796 -282598 -71519 -7461 -41896 -65632 -135379 -13080 -64180
21040 -64180 -207992 20328 -104349 -141837 -106511 -102366 -76181 -43614 -95692 -64846 -59382 -160699
21028 -160699 -116437 -22325 -291679 -179629 176620 -300248 -93427 187852 214881 198217
21018 198217 68478 -149250 -222854 -75342 -152146 -151240 -150240 -204705 -395489 -172040 171340
21006 -36025 -7016 -81504 -270107 -204964 -48623 200514 -110679 50149 -120433 242681 -171113
20994 -187109 187072 -292315 -269739 -211781 -170304 -54100 -283911 -11566 -164237 149755
20983 -127429 76875 -263187 180260 -448417 -37984 -173500 23955 -80547 -238242 -181055
20973 -181055 -382847 -221366 45594 5352 168994 56982 -219122 -120176 -100783 -283776 113507
20961 135525 -70434 -247641 -41703 247600 7943 -16930 -34388 -278872 28091 -292325 -74214
20949 -47092 -39235 103953 114258 -230517 -389946 -194779 204805 -315834 23446 127022
20939 127022 -96969 449219 -99551 -410478 113551 -37544 173146 45016 225934 -184140
20928 31312 109241 56991 -47149 82038 453998 -267553 -57773 127265 -195050 -49319 -70090
20917 -70090 -44593 101905 -308377 -100185 -4445 56939 -17952 -284747 -45890 -37059 175463
20905 -82726 -216141 -86192 -76956 -171026 -250259 -14788 -80750 377467 -232102 44419 71428
20894 71428 -96708 -137222 -252720 62876 -4276 56733 120010 10486 231146 -245121 -282388
20883 -282388 256851 -122667 -56406 99088 -191734 170914 -123382 -108691 31958 60041
20873 60041 -311815 57356 274088 15665 81907 209604 -1433 -64426 -114841 -147195 -134319
20862 -134319 -201976 -102435 6049 -176111 -462595 -164179 -184670 -222783 25221 -319938 -185080
20851 -185080 -91485 -217958 137189 109745 -220348 149502 -148937 -181181 35236 -220844
20840 105968 112013 171507 -220867 -192612 2505 63438 -220834 -239232 -215952 -454739 272116
20828 186791 -144223 40558 40915 -348581 -288504 121596 -187414 -137701 -141061 88628 64895
20817 64895 35502 220922 37514 -138002 -11983 155158 187797 -11058 -168833 15466 -173151
20805 103733 -179907 48668 -176309 -356488 -4361 -340343 -516795 174709 -200086 156688
20794 43116 160161 -64433 -157938 -31038 18825 -254315 90424 -13743 -19081 -95009 -156294
20783 -156294 93374 -150011 72756 -153787 -11318 -243502 -328114 34500 298433 13573 -119752
20771 -138658 112369 245723 11498 58849 -244319 -53331 45634 -259324 140556 152139
20761 152139 -34913 351167 -121214 31701 -1799 -284826 -174421 -354623 169932 -31576
20750 67351 -384089 -59180 -54044 -155983 10884 16279 83129 -36223 -43537 -288903 -51335 -32140
20738 -32140 -151233 -15698 180703 -119426 -137092 138743 114576 -171871 -22229 -89139 -281705
20727 -281705 -160871 64452 -79149 180949 -205136 -33113 220625 -83118 -120788 265923
20716 -217027 -85333 199602 -196856 21177 -68700 247403 -120744 -230594 203073 -182473
20705 62055 -171549 -215155 -156650 -12128 -233027 11586 28520 113787 229683 -159580 15017
20693 197961 45412 34406 -322341 -285192 -59772 -182451 -17902 100986 -164449 -230535 -121267
20682 -121267 -209357 144371 -84097 25259 113007 249543 141458 -3201 -115700 -316347 -87701
20670 21653 -159707 -141853 -93211 218004 -115814 -143664 -34448 -196491 -44297 -106055 -439192
20659 -439192 -221487 127162 -33332 49261 -231405 220299 -163471 -126555 -309911 -73435
20648 -222415 -271761 -56545 -30661 -362427 146718 117304 -4553 128674 120132 -184024 280840
20636 -7277 -69663 -107812 114923 4499 -17745 190990 -11739 -76465 -2279 179548 -231960
20624 4782 -235899 62725 78008 62255 -49040 299468 3375 82554 215064 -261669 -35501
20612 -37330 43921 -251319 -279359 331756 -317416 -88992 8758 4449 221846 -65779 -38416
20601 -38416 14201 -106398 -18538 61730 157424 -333876 185633 -312796 -289488 -211496 114135
20589 -2567 -24740 -11401 215229 188235 5071 -165564 141602 173753 -140422 275465 329954
20578 329954 355873 -204684 -74800 -272234 147850 -74111 174720 42270 -106110 -171541
20568 -171541 25998 -92028 11310 -124705 -263542 -302334 16820 138713 13879 -155953 32190
20556 211178 -75300 2341 -114715 -86632 49284 -55537 268066 -188115 133783 -82159 -135445
20545 -135445 10680 76615 -258287 -148850 85022 -244263 20367 -240228 -151915 -267536
20535 -267536 -186312 177127 -200457 -94092 -245899 -284573 -222770 -50986 -276524 -110293
20524 -262459 142197 149617 -166190 191150 -65341 192678 -12448 127234 -276083 -408479
20514 -408479 -134076 -94276 -73611 -191964 96571 -5288 79717 -123628 -68036 -266080 90347
20502 -342479 86596 -80071 -141251 162252 -154314 36916 -131775 279180 113440 -53557
20491 -232838 54658 -151052 -59259 -339978 55440 -95321 81013 -231758 181373 240225 -195414
20479 -118214 -117228 -15590 152798 -38263 -160649 -34191 -126960 37974 -10793 -134142 95908
20467 196066 268803 -79219 7656 182962 31580 42793 72306 -385521 37511 314969 5613
20455 39751 136070 86362 -240880 -263908 32210 -226746 -16173 -45911 -238086 37486 163094
20444 163094 49929 -482908 -140120 -307402 137214 71326 -295465 -44207 296136 109517
20433 -32179 -385581 162251 37364 -314466 116601 -4487 -150013 118813 -310663 -340614
20423 -340614 -343059 -80941 71235 -14927 -150276 -195706 28152 461604 -177578 -458560 -307223
20412 -307223 34565 -38471 -353660 -138951 -97744 -120138 -110008 11756 -241308 506 394532
20401 394532 -157716 79222 -234819 -91432 -63769 115263 -98230 97058 -132657 24283 -45947
20389 -46145 -72142 152710 145226 -75009 -14439 -226100 -92545 40407 -100729 24941 -89332
20377 -42578 -103896 246594 102739 -118268 99688 6979 -204468 105224 93166 -87030 -78714
20366 -78714 -356781 -114834 -150676 -42655 -14246 -118276 264850 -147846 -190607 101442
20355 -139769 -75466 43532 2642 120317 192788 -112489 156567 -192076 -151199 -19664 76416
20343 388366 -156781 8041 115140 197660 30145 30759 229695 -472407 178206 -67199 -487991
20332 -487991 265530 25275 -91844 36214 158088 -236907 -6397 65513 8809 -211030 -131340
20321 -131340 -258053 -345948 -233767 -52080 378435 -166433 158265 -71799 145346 151669
20311 151669 -11248 -389024 121619 -190556 -51725 -291649 -79493 -189553 -162986 -51820
20300 215476 49844 -15777 2841 -176654 -160779 65076 -51451 83982 108105 -366507 62030
20288 -295532 193437 -104737 -80177 144254 -127067 141762 17554 -62781 46616 53313 -103010
20276 -416406 -266980 318913 -77924 -75632 75423 53503 21836 -198488 -149119 15386 -328652
20264 208934 -420573 -404915 -266052 159850 109885 -38750 -339062 100318 -67578 -203649
20254 -203649 41869 64013 -42407 -302685 36631 37749 -118152 65113 -338899 -276037 -129196
20242 49139 -235036 -17607 -58408 62856 -48192 -400548 -87753 9098 -194581 171911 -141333
20230 -391583 -148787 30181 -51362 -304408 -104549 -140946 -238805 74927 -71543 -109237 -139084
20219 -139084 28905 40861 -178208 -194710 44266 156623 418109 71100 -71076 -232507 -347869
20208 -347869 -8235 -95510 -261078 96227 152307 -233571 80836 787 -99439 -105085 41497 -228305
20195 -266800 -190592 -16509 -170440 -110605 -406482 161688 -85418 51394 229005 133632 -51862
20183 -2903 -356098 211907 -88533 -2838 -214955 -101302 408414 -72546 -146031 20289 -229745
20171 -298802 -420866 114958 111250 41833 67793 13277 -20635 -165471 -91014 -97343 -428007
20160 -428007 -9021 216072 -122259 -79314 285408 52500 56126 -226536 7723 60656 -56522
20148 70082 -32311 79496 -158836 -239988 68351 101430 138027 -41401 -2730 -123728 -50226
20136 -157565 -148453 102749 -133200 309869 -128044 -2591 -315378 -325669 -306861 133693 -100553
20124 -57299 -75723 42205 -168168 77212 -94037 139821 -167996 -227744 232620 218450 -72020
20112 -82783 -161552 154537 -301653 -187884 -316274 -97999 101207 103890 58085 -251739 -33101
20100 121278 -162162 213774 -284192 -237826 -130115 169692 105780 -239125 -139458 53810
20089 -256696 121653 -266616 81357 -230019 -72497 99549 -150357 -43502 -212805 -189680
20079 -189680 185814 -185075 63512 -149069 -151173 7153 213930 55506 -37956 256806 -19144
20067 185932 334302 168828 397481 -132613 -78079 -875 -17981 -46595 -27216 -70170 -128200
20056 -128200 -72455 -3307 -82231 112451 189549 -366766 27814 144189 -95773 -10113 -55131
20045 -55131 332028 -127946 42109 -123399 -83574 159283 -148668 -269386 -51702 265949
20034 -127258 -222091 -289396 480840 337149 191913 220923 -7441 -58769 -296869 -142311 56993
20022 104079 -161404 125510 -37589 124337 286433 116914 60004 -46744 135068 -334466
20011 -214259 -97740 113472 -160549 -242909 91449 -18796 39549 -184141 53646 -240976 -12226
19999 -293530 -264686 -241269 -141302 -285890 -21268 -13932 79189 -172059 -284491 -51065 182098
19987 -331556 -63237 10367 1890 -128302 -239705 -135801 -119272 -272199 -60084 345267 37008
19975 4122 -303145 -36886 -179477 123488 -481102 50423 -103176 -7294 -31760 -138902 41403
19963 -255487 55665 23218 -219098 -94026 -24196 -19660 60231 -82617 -15284 -151683 209310
19951 120678 4621 -395895 -52142 -151641 -194794 -277408 392176 -335394 -124631 -180044 -397110
19940 -397110 151445 84457 -105945 -27579 50333 58774 93543 -275391 -238090 37538 -82554
19928 -78828 120710 226357 47609 -382004 62813 99193 -4081 3490 -175958 80584 -262682
19916 149676 -216172 68087 -215324 126245 137996 262391 -118683 46870 57941 -146972
19905 130698 39843 35856 -200970 -199493 -57012 -9593 186139 -179211 -238258 -460850 -2610
19893 119165 -88257 -149388 262820 -8030 -17163 -41307 -308746 305946 130099 -18678 -29378
19882 -29378 -53041 267052 -237778 -137743 135169 -535410 -10387 40306 83180 -46664 131073
19870 119246 -30368 -195099 117954 -272908 -207561 -268450 157313 -15094 263561 196208
19860 196208 -132681 -135497 105917 499917 -371084 107679 -72081 119865 44827 10207
19849 -188275 -389564 284 -186117 -112536 -76948 195121 -159465 -280700 -78842 -235526 -152167
19838 -152167 -402006 15108 -191441 63250 -44190 -205210 223519 -55030 -125713 102898
19827 -65554 -255397 -43711 -4550 115694 -155428 -115096 -153173 113056 -88410 -279775 -133214
19815 38626 119097 -182031 -109819 16042 -172175 136189 -206755 114943 -90193 -11197 12160
19803 1741 -108837 -34702 -76805 -10131 166331 -143387 -149239 -97904 50906 79119 -268786
19791 -220841 60090 216264 150384 -142595 -106636 -99528 -73332 -186863 -237479 187569 22552
19779 28152 265996 -164031 50132 154427 -93545 338540 -25230 233753 -161965 -176544
19769 -176544 -244837 28547 -361601 -370221 -17991 45009 -86244 -21187 -315233 23418 76018
19758 76018 208608 -180864 -87837 -100485 28257 30330 222104 -204828 -111013 -149362 113593
19746 63944 101273 60107 -48865 -237998 -290504 -80050 -417131 50057 198221 -196679 -42951
19734 18619 28398 81531 28428 -382171 -257328 -147622 -73135 -30620 36499 -86560 -14993
19722 -150432 -331526 274312 -312300 -1114 -200472 -16945 181575 86023 -188363 47716
19711 12955 -73027 91146 -153480 3942 6222 -100650 -337719 -121145 57836 -89439 -198317
19700 -198317 36195 31704 -98030 167851 -141675 -15613 -305663 86110 -201242 -7188 -214387
19689 -214387 -254419 133033 21862 -176066 376056 -40106 -14462 48410 -108995 -119268 -52760
19677 196057 -35357 -155445 -46212 -83014 27694 214470 -100564 -17060 -282478 -121700
19666 -73592 -135739 -140641 -209192 161817 -145345 36459 -218200 -43665 -106044 -66502 2270
19654 333916 141392 194472 -198294 396110 92311 -79308 -140886 -18390 -107569 -114195 134621
19642 -11966 -64925 -258030 20918 -60767 55145 23169 109879 102926 24414 -145689 3448 -219216
19629 193720 -88264 -232304 51489 -56374 87252 11161 -288096 404345 23813 182617 236364
19618 236364 -184284 -158712 -131877 -290568 -96395 -62538 139229 27430 -179047 -340544
19608 -340544 -271707 -70664 -2606 89648 244035 -266224 -230168 -195230 -65026 -101686 -253058
19597 -253058 -320050 26882 -11288 24704 -159356 -431021 -198697 -134890 -270633 -157546
19587 -157546 79746 -157879 339801 68605 280357 -147739 -21864 -8308 209356 -241777
19576 -60072 -171868 -82273 -46166 -79103 217684 13817 98984 -20823 -184376 52155 71630
19565 71630 412842 78252 244796 12722 -46724 209784 -221845 -113762 161430 -102507
19554 -178661 -92953 -126526 208023 -113459 52985 -81996 -101887 -21408 -5369 -418469 106100
19542 -113580 301830 -45405 226223 234334 -50701 5645 -237099 114113 8906 86160 -81526
19530 -128315 86256 -448630 -146174 -51181 -100731 47738 162363 80582 58119 26955 154419
19519 154419 -70660 9169 259646 -161019 -89092 15502 109522 -129761 -190714 -261373 -164163
19508 -164163 -37872 221598 291654 -375715 107995 -59452 286888 -550854 -290147 -225093
19498 -225093 75826 97500 -199735 -295219 166850 32682 -73087 235072 33530 -96255 -186954
19487 -186954 170360 -158853 39683 -144167 140848 -115925 -41775 17335 39001 -265034
19476 85719 -25858 360941 17189 -112697 160388 -52713 -327666 -671697 -156854 19533
19465 -110242 -40907 121231 114151 -108514 -5742 -47792 -388563 -100400 117006 -428610 22444
19453 43902 21695 -151430 -259967 -177104 -160676 -220954 -62123 -172807 42255 -64155 -94535
19442 -94535 -394995 -41691 146376 69422 17298 70069 -66402 219615 -97668 -161704 -98814
19431 -98814 -148972 22102 163459 -243231 67896 208252 146351 -80313 -314401 -114174 -69633
19420 -69633 92168 -306178 196541 39379 -12856 -24207 130771 147745 121504 -55365 -175320
19409 -175320 -121156 113509 -100450 -65041 -172104 79065 213829 15170 -193821 -14921
19398 -9929 -105427 -26797 -285264 -77530 -161143 -123770 -56918 181014 -296390 -5176 25151
19386 98877 -336118 -230465 52141 -47640 -210340 243410 258506 37959 -130517 -226422 104259
19374 -127082 -113572 227932 -109889 -46989 -31631 -11990 -178127 -384664 -369847 -367725 252772
19362 140108 146331 97304 -157939 -393172 -210185 -155839 -95072 142971 -231299 -25012 73787
19350 -74611 211878 -94151 4674 -117229 115777 -34800 145166 -8465 -99924 42469 -237484
19338 -178291 132398 -277940 272825 -114596 -49974 3972 194508 -111854 -316616 -162383
19328 -162383 2920 150109 -46759 -88664 -96334 -278529 -149442 87302 -412309 -70530 -163994
19317 -163994 50664 -74433 -69626 -223997 -197110 -195485 121442 -209919 -6979 189643 -91157
19305 173047 -44330 -143771 97604 155496 -422192 -182931 -227107 -108355 -63768 20365 52801
19294 52801 44307 -98489 291804 -323569 -112539 165389 -374916 -49207 93212 -226006 37570
19282 -267292 -32741 -237949 -108304 -204032 159842 103572 25160 54052 -37783 122053 -4507
19270 39815 81943 255649 -138103 140680 142258 -236946 -147281 -392947 43127 -69848 111736
19258 53731 157093 -77551 146046 189545 -254382 -80300 33296 -64613 46229 -376841 -172161
19246 106658 -233199 -89551 -239476 -12386 -374630 -166170 -332774 -172041 4005 266684
19236 266684 -47147 -269139 276325 108576 -211211 28262 -109218 -45717 5460 -31880 25952
19224 -163288 -21280 -123759 -10925 -76010 235757 161865 10734 -112500 -232735 -206571 -285683
19213 -285683 -227 -255710 -171236 -54328 46489 80332 -6381 -248795 -30232 -156949 15751
19201 -199876 -248600 -178132 64352 127200 -198811 53035 -303067 44000 -119469 -261008 -275445
19190 -275445 80897 -399422 40708 -458924 89990 -87050 -2804 -6356 -160655 -87608 69013
19178 200337 -362123 55974 164556 53490 -162370 -99240 226915 105770 -236378 -31428
19167 56008 82355 68954 -479478 179904 -127987 386396 -407490 -311312 29814 75649 -154976
19155 -83471 150308 -165015 -220866 54254 -139081 186504 -192440 -281027 106237 -102726
19144 49708 310948 -8752 -419364 -88048 53268 -387274 -38302 -179372 -53680 -98428 -140041
19133 -140041 -152266 168275 -20008 -296077 -76528 -199412 175634 95297 -37622 343163
19122 70656 129539 19670 -258358 -31123 -269078 -154425 210203 92648 -74268 -22693 91867
19110 274061 -290458 181232 -120483 30409 233809 -200410 -208420 -127132 308844 123659
19099 294957 -225635 -89563 -8573 27849 -40540 -91827 -12598 82658 209439 247887 -215326
19087 -216124 -356522 103472 -209512 126943 -235916 172830 -446862 -71354 -72692 -241350
19077 -241350 65882 -82115 219124 -81570 -57436 -222596 -31911 -158455 -167374 -72066 -57587
19066 -57587 -74354 -73022 81686 -32211 40359 134945 184506 77991 -436441 -100246 32426
19054 119309 -487929 -134159 213561 -3423 -124714 -81492 143673 3906 -43674 172398 48249
19042 -19160 137790 12182 -236479 -395103 -192606 267751 -83966 -15079 121554 250734
19032 250734 -9248 280985 -11364 -113591 -64692 -3700 -99541 -54811 35101 -53111 -53660 93527
19019 37694 103073 96705 -12819 232396 30103 -34706 949 -114290 93733 -9588 -64931 -22206
19006 -377732 286828 -298859 -89627 73203 -16209 -266353 -77961 -37846 211994 326808
18996 326808 -149513 -60007 -405748 -78916 95521 279723 -237349 215486 -265427 -15560
18985 -45838 58410 207660 -241144 -239500 -305217 -144483 45931 -220125 -34170 -213846 37344
18973 -76942 -30235 70320 -236331 -111154 50754 -191220 193916 -228172 -130024 -340230
18963 -340230 -246108 -119895 -153759 124380 75226 -23816 22234 -215139 51229 354302 170960
18951 -420601 -175514 219331 -286526 161753 273263 -61726 -13878 -175309 -82811 -74962
18941 -74962 -73796 -173500 -147759 -14994 -61594 -203876 166731 293749 203494 90205 -264714
18929 128861 -301555 -359205 -55220 43023 -42867 -98569 -183506 49872 182335 -196733 -186140
18918 -186140 121459 -112736 -46665 -178003 -22830 135867 49491 -128978 -78714 139852
18907 22974 -183993 -8980 -95652 168776 -196588 -221406 120766 162846 91925 -260761 -215490
18896 -215490 118799 -51885 107570 -123026 -167792 -46021 60759 44268 -163856 128364
18885 -185541 124391 -114067 123044 166576 -376884 291386 -37106 -224879 -41861 -36787
18875 -36787 -82709 -231326 -205064 20494 -114673 35336 -174901 -412 288668 -293025 265704
18863 -97239 -10169 -147889 148124 -232285 -261929 -221748 -63529 21211 386574 205597 -28337
18851 -127536 82448 -78687 -74362 216695 13144 101048 255183 -278518 195183 186116 245415
18840 245415 184635 -173599 201452 -141978 -224149 -140999 -538923 -18068 15881 128086
18830 128086 195701 -33764 -37370 131722 -173351 -43818 64047 113260 28055 148968 219651
18819 219651 52321 93495 -510083 -178950 36638 41368 -449736 -26319 131522 43572 -103889
18807 35013 -109184 42162 -1190 161943 -54078 93563 138595 87653 1691 -205855 -190502
18796 -190502 -61467 -373225 -279271 -91041 -124932 -43683 -40429 -49364 -50465 -49999 -15794 34009
18783 43397 -162879 -151964 -240385 103530 -78743 254501 -248100 -2996 -253414 116609 283436
18772 283436 -73894 -94238 -194091 -204171 -60270 -105502 -131804 99524 -120742 -2381 476256
18760 125279 26827 -35966 -127463 -79711 -47111 12170 -259988 73110 -43913 -139040 -229240
18749 -229240 -17580 -127400 -454031 81660 -156420 -90571 -50252 -68658 77349 143438 -185411
18737 -399214 -119801 -267918 -194764 -115756 306056 112469 39426 -126181 -54133 303627
18726 75929 123777 -54238 120251 -91168 111275 -135646 118051 -50461 -157852 -222413 -186060
18715 -186060 118320 -206435 79288 -214811 -56515 -2106 28258 -53820 303077 -224176 169661
18703 22538 97659 106397 -129190 324336 -36094 22062 -214613 -65225 -73503 46840 -151701
18691 -349307 -41142 -19253 206711 -74610 -87069 -176003 -292321 232297 29985 58836 126054
18680 126054 -362271 -73572 -1472 -105053 141148 -39234 18467 -183520 69026 -62493 -230858
18669 -230858 81024 30795 71471 5535 128548 91050 35084 1554 -159432 -144732 -57918
18657 51887 -202964 269620 -290071 14050 -14612 28702 -61817 -83912 126573 -78919 -327441
18646 -327441 -243264 85443 -299937 -20637 44045 21344 296070 -90634 -689445 -101146 178779
18634 -492454 -83592 23164 117859 -46906 -255714 1881 -28264 -112957 -111886 108440 -93717
18622 -130780 -174361 200934 123783 246500 -221255 -93793 -2630 16804 -129439 -168116 76746
18610 211797 -132361 -212509 -200081 230076 -125081 249892 126706 -517530 88804 -133530
18599 -155227 -164004 -216400 192322 -198753 -92427 22448 -187798 -37182 75646 -158317 147317
18587 -318877 -197999 -62168 -189888 20055 135237 63451 76004 280193 -131950 -156090
18577 -156090 71233 -67523 62940 257748 74845 -6936 43353 161061 -277587 -224172 -22300
18565 -43183 66709 -4964 79465 -203209 97871 -182176 -45676 187658 -232829 195387 65856
18553 358779 -322711 49674 94439 -305672 97801 140737 -197367 15798 42459 158247 -267910
18541 -90760 -165233 63027 -222149 -60958 -70113 90480 -39126 -269744 -138307 -126920 -128667
18530 -128667 -324760 -65128 8127 -97067 110735 -180083 -155168 -92144 -271307 -183530 -130589
18519 -130589 -174128 -299639 -99443 -125952 -116215 296068 -91703 -23343 -73280 51707 -122056
18507 -123384 -71681 101496 -210823 -3548 34945 300254 62904 -220672 37968 -32586 29732
18495 97465 -98221 228595 -163491 113003 -270191 -1173 51928 -45442 180899 -238785 -206326
18484 -206326 64671 -260029 -11964 30089 101199 -167632 -103411 -58112 -94416 -45042 275428
18472 -188655 182754 -2882 240201 -276043 155547 235635 -94341 169485 -119025 223754
18461 -28818 -175238 95846 248521 39395 248213 -97235 -5212 69622 60120 -127135 -136321
18450 -136321 -143989 -329620 -94643 28907 -285940 -189797 -36014 -73332 -13137 -148893 127405
18438 -178644 216634 -564843 -168350 -308193 63524 195246 -164639 -11131 -37657 -146788
18428 -146788 -71441 -59681 -30432 -58141 -455021 -54358 -160715 246117 -107585 -268718
18418 -268718 -214357 -129499 -357371 -262220 16931 -201444 402469 494970 204295 -258289
18407 -21750 -17998 -147743 -126065 -93643 15241 -71421 -230405 -420030 -112592 -127423 58409
18395 -74240 -157992 201729 -128267 239753 -168916 96377 -261020 -61809 222891 -54968
18384 -27952 -219270 -37277 -164523 159326 -145180 19416 256229 212650 -265645 173417
18373 -281960 105876 87815 57655 403731 152892 -146961 -152954 42574 29292 350713 -214054
18361 -131245 125546 -46219 -102153 19691 -244510 50908 -12891 -322762 -175185 -389914
18351 -389914 303199 -71501 216500 -81379 -88199 19050 4585 -86051 -173191 76092 -69053
18339 -203340 -142343 -375404 -306159 105757 -78647 -104298 239118 -114404 45487 356024
18329 356024 -123627 -196658 -355208 -53679 -81407 61803 -207858 3154 -145174 -250304 -195976
18318 -195976 -151655 -100607 162027 -171353 -173354 -341292 17266 -175533 31832 -259999 238255
18306 247320 -40658 48303 146635 -67134 281570 -43187 -309497 129806 -83003 2241 60423
18295 60423 -8069 110509 -206939 52815 53789 299419 -12798 30042 -310372 -173877 -151715
18284 -151715 -50104 17101 -161486 253016 -329623 -73921 61789 160980 -109610 77484 -316022
18272 -202300 -43118 59916 -160254 -34919 -246460 -44494 -1513 21498 79697 -241128 -231363
18261 -231363 -167452 -30379 -340024 -53622 239529 -121325 278530 -160958 32484 -146046
18250 298174 90487 217027 25509 30668 133074 -56789 -1330 193566 158519 -3658 -172804
18239 -172804 64836 -134281 137945 -108478 -76399 40069 -196436 -182961 172983 141479
18229 141479 -59648 238014 -378511 80278 -206835 339565 -265964 -393981 -32445 -46768
18219 -46768 -151892 101107 -389639 -186351 44483 -281835 36880 110386 123906 75151 -327976
18207 -260785 -137429 371049 -309225 -233441 -176445 182312 -201017 96763 104175 -211365
18196 96387 316472 -89371 56091 -245941 -136685 133861 146757 -284968 -148274 -79252
18186 -79252 109584 144643 -547211 13905 -3265 -221008 75339 -123744 -241113 -2442 -95062
18175 -95062 -117454 135673 -189194 -182930 -166461 -181791 -179378 -33660 -97101 86458 251968
18164 251968 138434 -252372 -257827 -33832 -48670 -198826 100524 -172556 -60308 176474
18153 -237045 162930 -269642 40681 -78380 93811 88881 -377471 26464 -215202 -395615 -48322
18141 296601 -260834 3524 -193057 -241408 -9569 -38429 -48658 -95034 336855 -108466 12779
18129 192747 -118926 403460 112907 88428 -43152 56352 141310 214838 -126778 24444 -108530
18117 1980 -50567 73928 69011 8811 -144588 -72084 -16413 78571 37199 120634 -339506 145270
18104 224499 -185921 238353 -152286 22743 41304 59105 47556 -7992 -185422 -140171 -240370
18093 -240370 -377274 -243950 -251213 14587 2927 -103202 24413 2317 -39944 -16095 13531
18081 -58628 -39404 -309366 180383 220732 -122429 128317 67229 276506 117244 -54546
18070 318156 -183526 -21227 197047 65142 -96406 222235 8685 94110 145445 -27031 -253407
18059 -253407 115788 -128974 -179491 -418690 -117983 -60620 -151102 108006 -243079 156398
18048 244391 -202218 93098 138715 -17235 -263969 -38382 -108824 -10720 160251 -74436 -130080
18037 -130080 51577 -69734 -39972 729 83394 -317046 -122691 -92569 267089 -239820 62994
18025 141636 -60972 -104076 -327615 -392850 73767 -56200 281774 -302578 304882 -24024 23767
18013 -285357 -36792 108574 214043 -32355 79 294710 -107185 14262 -198098 -399235 -86535
18001 179259 -312322 -153235 77465 -185829 -8555 -188989 181609 205036 268569 59634 218462
17990 218462 -337410 -360370 -102210 -90164 -75716 -89267 314707 -321356 226531 -251724
17979 130915 44920 162693 47911 -126184 -162704 32467 240997 -122640 146040 96511
17969 96511 94234 78347 104474 -107740 33048 206495 -450035 200362 -60668 -35153 23723
17957 148151 112874 224488 25490 -186246 81945 142905 -100533 -4254 74224 -225393 68448
17945 -7100 -213573 11643 -152627 -164647 -190484 49465 -57353 62023 91578 138753 -288425
17933 -143497 63058 -281603 -130214 -175403 51029 151234 129981 8663 51467 8549 -167928
17921 -367714 -164162 -235381 210600 87236 88614 302136 -201341 22992 -111602 -313819
17911 -313819 -229858 -248711 -5204 -72783 -33229 -67916 441705 106961 -331918 383482 103013
17899 -55713 26332 -118570 -219654 -15228 -84438 -76465 196762 -31141 138607 -86909 126922
17887 -153897 -178530 -29641 -144066 -63387 30649 -23760 -97180 17104 -15400 55334 -82335
17875 -93447 240475 -34460 114376 -62260 -161643 -233389 330046 304 -108160 159341 259192
17864 259192 35686 -27732 -180009 150154 -181763 235587 -120022 -208501 -314710 -185415
17854 -185415 -222140 251780 -137565 -37056 -105144 15773 71602 372 279823 -137723 191485
17842 -121670 -364571 -227435 -27262 359 305187 -20402 40351 288940 -92251 -289992 188496
17830 23372 -48691 75843 -24110 146197 88415 2487 161800 277250 123362 250963 -128645
17818 123650 -64404 209341 -136736 76203 -221148 72536 -171241 98573 -29502 239725
17807 33686 111723 -236878 -164241 156092 -322610 -400982 -103875 31530 144854 -167464
17796 -46433 -353247 -80187 113101 361022 -17014 57672 98850 -28279 -139095 -64122 -200488
17785 -200488 -77723 17249 -64843 34877 230216 -230748 -13134 137588 -33320 -387215 -134168
17773 -26639 -41605 -162549 296008 -177790 -98091 41184 -323901 11558 -144341 66612 32173
17761 338056 -312633 212413 15364 45165 35402 -64848 10381 -61203 27775 -80840 -6450
17749 -222801 -61108 -120065 14314 165489 122034 -238611 10929 81682 -213744 -111292 147465
17737 -157026 183741 238415 -238770 139788 -81182 -34434 150088 22027 64806 276479
17727 276479 -343261 -88343 -109643 -364317 -150761 -168749 -34383 -173705 -352828 -19211
17716 -65666 -6432 235372 145522 254772 -209263 55000 -128190 18519 -15569 164369 -179353
17704 -165524 -120653 -158287 -259605 -189282 -135400 231195 -33763 -111656 -199283 92590 -53798
17692 84916 31454 232895 205207 -156681 38044 -74957 279344 175296 197406 95143 -152064
17680 87335 -70752 17298 161543 -113393 122274 136164 165051 80417 58604 76656 13328
17668 127892 196404 -153554 -193760 241147 -254003 55066 361879 -213223 -2710 20091 238613
17657 238613 148209 -317786 19883 131105 -213589 -237338 89294 132412 -238610 189143
17646 234974 -85065 -374837 64089 -295900 -178229 127807 -27277 209525 358610 -157487
17635 -129117 145770 259484 -142216 148289 36000 30408 20138 215227 -156522 -3206 26839
17623 200645 97292 143438 -191201 48705 180484 18341 -63160 -236007 439323 -48616 -78037
17612 -78037 -350710 -213316 -6140 325147 18 115813 140208 214124 -117564 58887 69415
17601 69415 172795 -141715 -61435 262566 143475 16658 148552 -184564 163494 -163193
17590 162665 158262 444082 390709 -26337 132743 181836 -18530 -346369 -169834 81616 -11811
17578 101624 177556 115434 -208763 -42398 82485 -97799 70675 396262 334180 174818 103266
17567 103266 -101792 53764 99253 -210864 130614 -124378 -89662 205217 -66542 93478
17556 72556 107578 -13250 159076 -63728 83833 78392 4973 -337825 64773 383646 170058
17544 186886 -151124 1623 141024 -139499 -178923 -80299 116011 -234584 137545 41511
17533 111597 -35378 -26667 154522 86045 409388 -17556 -41159 -239764 73128 -305221 203280
17521 284766 -6684 -92910 -26818 66908 -142650 271348 65949 115854 -205749 58215 -162663
17509 294736 -58235 -52857 -61918 266234 86257 215366 188290 -189288 -60277 -70502 -134265
17498 -134265 95829 -31515 -33787 31769 129860 -47961 168353 -133891 97076 65370 509710
17487 509710 145813 16103 -39419 238391 294949 20875 6653 205440 340407 349787 349500
17476 349500 -31167 408631 248886 90124 443023 371874 -306236 -162462 16766 -44217
17465 162497 198096 309691 138110 -192482 3926 75896 104514 140328 226673 212855 -127182
17453 -33643 69217 228041 205457 -41913 667301 351653 336620 83669 367533 125980 364276
17442 364276 110982 601023 185613 147748 -141323 163744 228419 612814 251515 247233
17432 247233 466857 -77737 117610 -153103 439812 124442 111196 141602 325558 197418
17422 197418 36641 346408 -6773 236172 93211 83974 259756 350267 37463 224559 293955
17411 293955 172473 273294 237651 -46057 270975 285158 118610 145417 164135 71312 117058
17400 117058 220779 146888 -40057 182794 11306 41266 87593 69193 325072 233171 194774
17389 194774 49169 197310 180631 -13569 112527 300950 -51127 -86288 -138736 -90394 321069
17377 -106542 89764 47200 166329 12424 301883 292386 95899 340338 149460 31663 194216
17366 194216 -158916 77206 -18651 136255 84496 -325866 326077 -89566 348219 37569
17355 93552 232496 442176 94229 -144741 38854 -64717 -57462 423581 -45541 138054 527500
17344 527500 74350 291545 136059 213085 -133799 -391 49805 116991 171486 366222 235104
17333 235104 143984 711984 221259 131426 -26847 -9296 165388 230310 -80813 -26343 151781
17321 155187 -38435 237476 57488 64262 239641 308681 -70421 361795 99646 308323 217934
17310 217934 290161 63 101986 -219927 177933 193480 254756 43058 150017 29828 173145
17299 173145 375196 360380 347881 -14788 52002 239126 -276712 120888 103290 195140 267891
17288 267891 4993 104671 355165 12540 88814 161157 77387 -118906 130671 206061 145165
17277 145165 202911 409921 162151 223626 -33814 81230 193550 77668 104739 231400 252817
17266 252817 11052 161100 176519 583574 237370 347867 34319 109665 233677 222285
17256 222285 48895 86410 108241 85067 128462 341077 2149 8641 -244145 4638 496711
17245 496711 452617 47225 157057 158329 547057 304575 60657 -21022 531376 95855 299168
17234 299168 113193 482119 85034 209735 45878 -117237 181470 294354 210985 335490
17224 335490 243714 260781 363465 412058 283427 139280 217512 327667 134411 -136008
17213 311130 338942 360084 -37187 460836 -48336 220917 211964 401617 225112 43594 10016
17201 382380 348622 345672 218112 245023 28573 -84693 171265 98738 70739 51696 92570
17190 92570 358936 210886 292154 214489 -37070 128818 2331 422277 150414 320801 222756
17179 222756 574665 102831 305138 348183 153638 363820 206695 102181 576781 278057
17168 21455 292488 172611 336557 292476 -79667 141814 357162 298897 344855 253883 -73637
17156 408732 401787 41072 282582 259639 121352 428535 311533 128166 352261 31899
17145 423041 335263 295212 18605 562960 490559 82816 26273 250868 774996 154079 109078
17134 109078 175578 93399 -36922 320680 298603 212624 211648 125658 94075 277107 596837
17123 596837 89965 81801 311563 520815 136315 662473 544330 8610 555224 264934
17112 535847 260105 518363 202706 397981 549859 48607 173837 289020 167069 420748
17102 420748 310518 307246 528045 485528 597724 224352 386866 310432 313222 656469 58610
17090 145998 363025 313936 418095 74051 260154 556139 619389 412882 -17829 387103
17079 497997 277365 631976 684711 558683 586212 246 757106 391317 473015 259538 586370
17068 586370 339065 554392 285382 391064 283820 609720 433555 226940 315889 452569
17058 452569 672959 651769 701652 624892 117293 688567 580659 463283 612928 122835
17047 430145 238643 244091 321808 702459 372236 435401 681642 672626 464402 654182 497280
17036 497280 329337 217462 541750 766199 606863 778952 390632 624973 647374 333730
17026 333730 627162 146824 401328 307465 682508 372966 551629 709501 525838 876802
17016 876802 490628 547216 478827 615111 962417 250199 655911 1090814 384144 776760
17006 776760 1020703 1004456 819133 702536 752695 782156 721593 388814 891434 923965
16996 923965 712556 449157 849751 1065027 727493 656944 788272 829654 649773 548931
16986 548931 1012871 658971 434115 638961 812385 1140287 630285 799530 1408194 756082
16976 756082 1073522 592144 1012216 910779 960654 798047 888980 1065305 694385 809245
16966 809245 1094718 885828 970460 1019774 923675 980679 1088142 874747 1025989 748952
16956 748952 1025031 909100 946988 1153580 1069666 884796 1029303 1073593 856000 1221820
16946 1221820 1032058 872073 1133976 1144712 980009 1041523 944462 1305367 1130185 1378920
16936 1378920 871665 1171511 1287880 1079053 1492142 1174808 1048668 1187978 1037847
16927 1037847 1401275 1371818 1297549 1147136 1663814 1183504 1390215 1443171 1427595 1080265
16917 1080265 1507101 1510287 1252548 1538502 1133412 1553068 1196682 1443225 1069917 1742093
16907 1742093 1622345 1864010 1522348 1765204 1521068 1611400 1474775 1754528 1608410 1615009
16897 1615009 1978771 1858248 1687131 1790987 2146978 2349515 1766538 1917763 1975022 2282134
16887 2282134 1960803 1939689 1803507 2007989 2222857 1737758 2100414 2222554 2282997 2117467
16877 2117467 2160347 2370432 2174110 2371186 2258780 2270274 2702477 2552022 2426276 2404799
16867 2404799 2849957 2592880 2776010 2626852 2823609 2938658 3041798 2633936 2719546 3054509
16857 3054509 3279136 3107424 3049908 3144051 3053476 3499714 3267011 3195418 3365728 3435800
16847 3435800 3529343 3529217 3473781 3622065 3949361 3760567 3720247 4215139 3830800 3686160
16837 3686160 4090403 4389009 4324149 4257342 4185437 4152477 4163383 4432660 4649912 4772035
16827 4772035 4710149 5222800 5278521 5289904 5178287 5292080 5318314 5160691 5429215 5719750
16817 5719750 5518212 5622168 6122722 6143444 5890584 6415456 6574924 6636808 6594251 6947503
16807 6947503 7105778 7128583 7489330 7688094 7663943 7802537 8072899 8440618 8524013 8705681
16797 8705681 9113525 9186952 9359676 9582432 9941426 10289100 10131492 10451074 10822254 11249851
16787 11249851 11522498 11646393 12249053 12883681 13311121 13536166 14183509 14478158 14556339
16778 14556339 15233484 15520965 16128842 16734420 17746192 17986911 18596870 19112012 19969326
16769 19969326 20783559 21421068 22071098 23176453 24332426 24932850 26155674 26980817 28262465
16760 28262465 29725914 30780908 32367284 33445768 35094377 36841547 38282128 40576691
16752 40576691 42501352 44515947 46672907 49316557 51988626 54730990 57768619 60546893
16744 60546893 64353087 68060536 71960824 76225284 80835413 85691701 91100608 96805539
16736 96805539 102640240 109108361 115480660 122383853 130087453 137836682 145925720 154023300
16728 154023300 161764894 169877963 177613256 184829661 190959817 196106830 200499166 203196738
16720 203196738 204750517 204821436 202953580 199793512 195688642 190189308 183328538 176219344
16712 176219344 168483368 160203201 151744185 143461685 135589145 127311041 119682724 112615732
16704 112615732 105267407 99465158 92977349 87337503 82068296 76985009 72514488 68253885
16696 68253885 64297671 60715432 57109852 53791533 50966705 48068230 45839056 43401254
16688 43401254 41410568 39469510 37153206 35330540 33567400 32109206 30870183 29468481
16680 29468481 27975769 26809695 25881644 24546768 23551140 22586839 21846836 21041979 20053511
16671 20053511 19289479 18948441 17958586 17450190 16855110 16481450 15478763 15204986 14533721
16662 14533721 14558062 13727002 13182896 12725170 12570513 12197025 11634355 11251562 11134227
16653 11134227 10905458 10626097 9913234 9879346 9693589 9483036 9083239 8914756 8566451
16644 8566451 8309583 8105105 8224537 7569469 7783051 7047892 7059153 7122054 6807932 6331419
16634 6331419 6484229 6572849 6313950 6031012 5857679 5721779 5740130 5896232 5425993 5466513
16624 5466513 5433682 5414483 4930778 4939977 4864597 4767456 4395881 4363852 4190570 4323419 4275806
16613 4275806 4319519 4018274 3839576 3680318 3752550 3370038 3423303 3377198 3377053 3473579 3221001
16602 3221001 3121737 3344623 3173166 3109585 2723553 3244146 2991983 2906630 2904032 2994591
16592 2994591 2487568 2840847 2572828 2753625 2576175 2591968 2421464 2690153 2467566 2416333
16582 2416333 2528761 2080909 2339189 2030043 2130452 2265870 2383215 2207189 2311107
16573 2311107 2135838 2139481 1683023 1990075 1930725 2134379 1612521 2009661 1841464 1738453
16563 1738453 1716721 1742548 1758355 1838142 1811852 1685435 1879475 1604586 1681341 1377143
16553 1377143 1754873 1223859 1621204 1616873 1398661 1746699 1514058 1548213 1521516 1474937
16543 1474937 1335626 1584729 1343037 1343796 1443390 1440187 1091834 1085762 1419120 1224416 1150680
16532 1150680 1455446 1177608 1201817 1112269 1157305 1168453 933128 1123568 1395289 1331796
16522 1331796 1009401 996469 1241398 899411 1007791 1112584 690833 1114503 990718 892691
16512 892691 1208298 958642 851783 691545 922207 700727 960973 867046 789697 1170360
16502 1170360 1092797 868464 810927 810879 692176 635045 1064953 981038 848668 844968 550227
16491 550227 662814 673634 1100165 950985 547799 835833 686526 770786 569578 958737
16481 958737 699640 780838 1128691 745957 505937 651443 802163 678870 683325 617029
16471 617029 454870 264495 743045 567845 591720 561158 558648 831443 867010 423684
16460 426727 741763 506826 517223 605597 435947 453532 612358 654612 443489 1006064
16450 1006064 646399 611342 632967 333509 590158 618762 676074 670222 577548 502329 599246
16439 599246 500486 603840 500188 551104 251029 722266 679931 478328 509540 619311
16429 619311 75149 759896 346947 657746 894410 438166 684210 650700 208038 286444
16419 286444 595453 222204 168382 519741 421243 444159 391721 553808 679653 212375
16408 462296 486428 440950 -57540 546547 378785 357371 447414 470315 234961 263518 212553
16397 212553 440918 409760 346911 653168 266506 162454 406854 424605 343323 173093
16387 173093 159223 35469 262714 587637 258149 377114 447848 202133 394593 517796
16377 517796 150825 361963 667109 106976 -193711 521746 232674 143776 414187 228180
16367 228180 630912 186192 95069 167776 -151938 117116 427804 212064 120191 189606
16357 189606 69163 299126 303092 -49827 535118 339087 553415 40525 139040 257641 136121
16346 136121 142185 90295 135892 227997 422122 -85924 198355 148213 125948 273379 249374
16335 249374 167824 188888 178695 343362 213188 244952 50424 132989 120783 221614 222945
16324 222945 369931 214390 287479 99553 -80306 187964 237907 145989 190895 520642 65413
16312 286011 101743 335784 22152 69037 96160 -144480 -343976 263558 230512 356467
16302 356467 -157572 339911 177594 137921 136137 375691 -159979 -50920 30729 -43219 -30105
16291 -30105 375801 -17438 -25844 138413 -67458 88517 232864 236014 236110 11260 331695 182389
16279 182389 248414 -185942 404416 52589 -19804 54377 65387 -228748 -39067 300598 32251
16267 351498 484732 168885 223874 137275 132443 226213 101324 269464 180227 299669 125113
16255 -3256 -193811 382733 -100779 266662 27163 318804 174806 81909 -270111 3442 -112914
16243 54695 292217 368518 14552 -6992 -45898 129296 259310 206571 56020 -7738 -103333
16232 -103333 -78397 -15651 77947 281024 379932 -36942 50439 -13924 159020 14933 170468
16221 170468 -182785 83734 175986 67494 90072 114380 -187347 153804 -83422 188812 171423
16210 171423 -103902 124686 63576 144657 92702 -48575 385979 35186 445730 29222 54783
16199 54783 255116 211134 181761 -90104 56389 -80637 -98875 150877 327117 267797 68850
16187 410911 42134 -70250 -86605 -108472 210748 -13462 -96104 33874 374618 54950 -167563
16175 74766 14158 -212060 33835 -57127 -303318 196820 41410 129152 247392 -111301 321084
16163 77886 238761 71669 51229 105743 259455 -22998 264838 248565 -18275 -16257 -98712
16152 -98712 -117963 -128103 -83876 -94435 -24280 -86154 -189516 -21324 -350946 176924 145638
16141 145638 150675 -121797 52651 166041 58488 163745 -38780 73887 248496 11747 256313
16130 256313 258010 228542 52581 68840 100725 -168786 -38206 162670 41742 -418714 147056
16118 -99723 -94926 -221942 -79246 100424 -164332 64551 -121199 31074 -100083 -49473 -73763
16107 -73763 -73847 96919 85418 27534 80569 4438 41217 404520 197843 -147908 -29942 142765
16094 -101985 181972 133074 -179581 -161164 74179 -101932 -41317 -116120 86057 -89084 -211456
16083 -211456 81289 -37866 -57522 294236 285040 18120 5961 223302 -214928 -361897 154946
16071 154572 -172852 -76909 191872 218442 -182408 -133160 129630 39257 -83980 152113
16060 -299736 115255 -13694 -93872 -94449 57708 -219128 70865 77991 -118902 -9532 90495 -348179
16047 -151979 161293 247910 -192923 -13975 -231316 285527 -191327 67485 -2282 71011 32434
16035 -44756 72399 -91155 -28590 212439 -78943 -218265 220811 -212253 -152624 -169279 -190280
16024 -190280 -335280 23704 17490 87584 -111436 213947 229277 113704 -88760 -95882 -169160
16013 -169160 142180 -97157 45625 -148751 -25661 171824 -236179 -189240 -93981 -112197 -384630
16002 -384630 -61737 86730 142234 -291713 123414 128291 144426 122937 9962 -311253 -187832
15991 -187832 64799 -75578 -423007 147191 -423860 110320 -6393 48593 -75863 80867 170786
15980 170786 218626 408055 -310872 -42237 -86458 64750 -55842 -134033 278880 -143205 154231
15968 -268076 -348740 302451 -220705 85527 -60636 101494 41455 -261970 98835 93181 25421
15956 -191984 214995 -158715 273943 -290345 953 76387 -270678 -216636 -143742 -89631 83131
15944 140347 -57460 189521 -328392 -1482 89339 -280300 -223531 -223575 -199309 -226472 -152310 154941
15931 -133207 -213868 73398 250183 -33952 86587 181706 58939 249202 -66765 -279375 -139744
15920 -139744 -129904 -43830 157603 -128234 -139122 305261 -269921 176311 -244339 -187340
15910 -187340 -176367 -83991 -298682 348602 -46063 -274139 -260239 -62950 -69112 419191 -5241
15898 -27924 -110264 88983 6646 -39631 -297138 142971 111072 -133766 -289986 -94358 -33941
15886 8681 49107 215043 -67324 -42734 -321062 -96115 8841 -232532 -92578 -233471 95006
15874 -83049 -570028 62236 -274142 67968 38258 -170670 -85009 -120736 -47360 80096 -28707
15862 -122166 -64623 173794 -407452 48412 5886 109962 164144 146222 98506 -335475 -98266
15850 -89428 -77746 -22305 -127233 478370 342483 -69061 -124072 216019 -66447 -232502 -340264
15839 -340264 -181454 336389 64962 -157428 274862 -87563 41753 -84117 -25436 -132895
15829 -132895 -232240 -227228 -323939 -369751 6952 118969 -259946 -169678 78724 23426 -301234
15817 -23301 -273522 47263 -165378 -99671 -124589 -32663 -77672 61168 58525 -248289 292242
15805 318222 -88795 -119291 -64084 146178 245836 -192147 -200555 -39477 -6659 100195 151034
15794 151034 195975 190660 212801 -347683 -208640 -56347 -370602 -70468 418726 186196 30957
15782 6582 -428 125313 28978 -68319 -395252 -25865 -74177 123084 -239022 -75746 39645
15770 -152879 131733 299600 -126121 -287303 3229 88630 -164976 -112028 -217820 302345
15759 -157506 -86519 -11650 270847 -105255 -36105 -50366 22494 -31249 245367 362968 -235903
15747 -220826 -61075 59336 276609 171431 407298 -398869 -305450 -99467 -48429 188107
15736 99287 373896 -260512 -135351 -373297 -456565 -250195 -11257 -96138 -113063 53128 -218570
15724 -7382 -121858 211048 -230871 144507 -201123 -325744 -25203 -168412 -107136 52349
15713 -206367 197437 181283 203035 24091 88707 -330441 90168 -412024 42898 -41121 -88434
15702 -88434 -60336 93767 -7302 -87779 -4488 90395 366487 29460 244468 89481 129121 362734
15690 362734 -77206 272069 -196217 -46202 -184205 -221928 141355 -195774 23731 -30999
15679 -409161 -72248 -50097 -102801 80876 -66835 -133067 -156464 -55163 184029 411406 -262399
15667 257709 -414864 99435 13301 39101 185016 61578 146611 -27594 -5411 83673 -172299
15655 39527 21886 -306574 -141290 -77709 -57536 -1783 253939 336149 106005 -92427 82608
15643 -117342 128118 531734 -73044 -249562 -287960 -166326 143999 -4894 -3913 133578 -292264
15631 -89031 -7929 244831 50252 11415 76891 116485 -156119 -106213 101477 -175948 15024
15619 -99931 -89465 31612 153984 -268012 193755 -100993 -212539 -221481 10785 -36060 -91984
15608 -91984 -364390 -241848 47581 -126278 212713 404778 -330656 241515 103155 -133410
15597 -77657 -192131 26016 -35713 193665 112499 -59402 116013 1532 206802 111341 208306
15586 208306 -60896 168415 11117 90291 55853 -299410 28351 134599 190847 5415 -151257
15574 103263 107777 -136702 260114 102117 -201682 -7049 -125375 201147 -280477 -118680
15563 -156102 -227903 102022 40539 72683 -252260 67739 38417 -230735 -1049 -134326 -284942
15552 -284942 -161049 -133014 -305560 -9093 277508 94982 68152 136772 -149879 15949 -32287
15540 93867 94174 124427 -92605 311565 59804 292305 -87725 214069 -340296 316678 -197781
15528 -201726 55175 -46769 103631 -207372 -189871 -171808 -172875 217915 33146 -103437 -1164
15516 237710 -265532 175887 -337198 -327337 400675 329035 110706 101236 -117038 5603 227664
15505 227664 -120913 -94982 -51318 -91492 -9378 45075 -254618 -105122 432638 71799 38901
15494 38901 -133104 398625 152388 -135320 -54753 -63888 106110 -21821 -336147 142315
15483 136809 -433966 -21254 192811 205142 -118897 -29351 53544 2425 -7409 -203298 20948
15471 178643 142037 -463043 31180 39712 64325 308869 -101819 -69632 -44758 -60169 -81074
15460 -81074 -213004 -84766 -71983 -78160 -111275 -132286 -63419 6820 -41092 57172 -228753 337916
15447 -264786 -76282 444692 -110259 -98666 -84212 236413 -303221 74288 -314457 153751
15436 -265954 293887 -192426 150608 142041 292242 -200435 -15421 -9925 -13464 105863 -115323
15424 -401201 -327685 -216854 -35576 -55720 21163 -125854 -96169 95710 177913 -104253 257422
15412 71442 38019 76080 -161350 -185866 -168132 16781 202723 66196 -76917 87049 63873
15401 63873 -77449 -150087 196539 -110746 161165 -145061 -177058 -42340 -3020 -37102 31865
15389 -182363 49897 -10817 140143 127102 78075 -139574 204534 190830 170538 27596 -372639
15377 -61444 -137202 -12060 -224398 -116969 -135149 243949 276167 131834 102 112683 -11630
15365 10024 -234260 -109772 -218063 150706 -81300 223901 161379 249340 -54712 -115947 -9038
15353 44094 247697 -23090 -41974 -137575 346653 166698 66129 -15529 -7462 58281 48927
15342 48927 -1920 -25069 -88969 -123598 -103301 111748 -182588 210352 77323 219725 202309
15331 202309 2115 84038 119364 -222548 -158815 124085 82664 51679 84502 79381 -292474
15319 79019 -275554 5043 -78504 2994 56571 -53618 278154 -377549 -14530 -62743 -94499
15308 -94499 214436 -122881 22068 -97713 -213081 130449 147971 54326 -113641 -57625 -37404
15297 -37404 22047 192736 161763 164787 -80837 -88441 -11275 -276772 17278 14497 -250853 -73365
15284 81624 -127877 262648 -4507 428241 -178980 -97949 9014 -46324 -39443 -2437 118209
15272 -82517 -20491 190902 105160 -444691 -54356 106913 -11363 1554 192056 231942 -80714
15260 -121524 53546 -191856 29549 61518 192854 319486 341057 238801 47316 437397
15250 437397 379452 525464 1319311 919045 1438143 972995 404054 39846 -61330 -26410
15239 163918 -238984 364841 190528 255863 -350512 156572 -9076 3223 -18733 41797 -127801
15227 -159558 176296 -40747 160900 130877 -89056 181671 -192080 30665 -10659 -300907
15217 -300907 229121 -22235 119979 -95003 78275 74406 -59567 274738 115104 -44323 242780
15205 136351 278128 168812 -13317 91641 125634 264141 -94927 32646 72550 -165150 -118327
15194 -118327 160494 255707 -116259 -13208 77646 273110 152330 219250 -6150 225652 -128659
15182 -111982 96037 64299 2564 205139 -91741 350229 178096 515183 483849 -40558 -154236
15171 -154236 138413 -161427 46364 -269820 111693 168559 -104204 -44821 318010 -55613
15160 246157 224394 -142199 221431 105149 152739 14147 4807 344922 237 -45142 9868
15148 -23140 -120379 -94297 88920 -32344 276731 -42816 388324 113010 89478 -281777 -231149
15137 -231149 116823 36919 -110571 -268690 371620 261481 -5398 67984 143124 249702
15127 249702 -172728 86139 114716 -160913 -119982 83509 -133118 86526 145880 -63505 177117
15115 322161 -24590 122030 74701 353997 91080 70475 476076 100340 277416 -1690 336203
15103 79131 116559 213136 97532 22552 -72659 -172143 -12161 72885 393792 3290 248222
15092 248222 343134 321630 118819 14437 101880 17618 296746 15520 -169647 191945 181520
15081 181520 -125166 316287 304394 -119977 12215 524441 233416 -142093 378410 -953
15070 3559 6407 189022 52473 391786 185554 21702 -18158 22745 -115029 578085 233693
15058 175391 336275 -94467 -163087 -71856 624857 -34349 425619 -120979 338650 228351
15048 228351 105346 292579 348067 265791 77175 376949 238525 224244 298484 145464
15037 -49878 290227 426681 208397 128623 348114 -23839 -174623 390911 95837 71081
15027 71081 29543 51157 63656 210918 227372 152764 247242 177269 -20771 211919 -105386
15015 272974 169739 -44676 113456 243993 277930 289270 -56240 355902 412998 181756
15004 325884 278697 476722 333686 214079 143629 17856 78353 13738 166628 204294 436045
14993 436045 -16837 283785 318154 53041 122059 255212 163740 106322 192649 -19324 79537
14981 6673 101453 231757 -333062 124243 254560 162765 326930 240254 253771 246325 284577
14970 284577 561116 -229086 -161220 282470 345962 253918 429730 143270 565554 452314
14960 452314 136407 3676 228445 308909 138724 166387 -41484 298956 230493 151455 380052
14949 380052 123998 -60538 352938 15512 553211 303779 157535 203569 362317 521369
14939 521369 400787 410725 555925 110634 183153 328692 430807 218649 143493 524523
14929 524523 174626 178065 265330 263646 198582 405450 512957 55616 395624 409727 155534
14917 355402 388023 676961 342999 186090 511716 481246 426471 196305 414731 196462
14906 72431 409090 -14191 -64832 195393 364408 178779 182985 277319 273597 579568 232207
14894 527957 265354 9914 481418 402948 637428 255759 455811 404155 232616 421734
14884 421734 449189 150337 146275 412162 536318 554382 541227 193089 648369 552683 336341
14873 336341 408618 442214 141426 268392 312948 295615 374399 231137 365530 292303 274150
14862 274150 15460 307618 526206 333483 216808 225335 673684 364556 244152 153781
14852 153781 325860 359247 381853 672440 300004 490020 473131 484304 493130 305822 553876
14841 553876 778328 457370 783258 405537 328632 340093 498724 468953 434182 508038
14831 508038 538500 570003 404723 275538 452494 666509 350671 539328 200069 442860
14821 442860 483108 305934 394944 618999 175720 505037 439987 763133 365370 382642
14811 382642 693765 720596 503455 626036 567587 587351 499460 355555 435241 729351
14801 729351 718038 466625 335374 565519 741083 707143 574930 861842 482340 262222
14791 262222 464520 455901 475268 682639 502980 617361 325521 694836 440356 19983
14780 680499 336087 327219 559246 513216 860118 581259 394520 449250 847845 741685
14770 741685 362992 343967 598662 718010 737866 456810 675660 1040229 515868 789143
14760 789143 756422 626308 888890 641866 492325 665705 900147 610874 673794 551324
14750 551324 758567 913664 644412 1094410 895578 669289 611832 511966 882078 257176
14739 607866 587391 596040 795118 979927 559044 1069495 641032 480444 575018 380937
14729 380937 902809 878072 1083127 763686 992912 760796 894157 848577 727376 1040189
14719 1040189 784963 858085 1013222 814662 846099 964799 1021500 1175644 942621 752573
14709 752573 285951 813175 926235 837779 672757 732329 629201 836844 928581 886856
14699 886856 727315 879603 1058299 881966 931406 644183 1070576 805146 882878 1062422
14689 1062422 882111 1041298 1172482 1017131 840704 1222341 1059157 1260026 802837
14680 802837 1081835 1064546 1006557 1218920 1417636 1172148 1296487 908041 1102224 794512
14670 794512 1044855 745087 990943 991392 1293937 1017031 1010377 881331 945087 1094937 1085033
14659 1085033 1065887 975884 1200520 1159956 1142051 1231695 1294268 1059662 1221343 1226699 1374240
14648 1374240 1018572 1183134 1090218 1180415 1041846 1549002 1249525 982307 967179 1239247
14638 1239247 1322995 1416296 1747437 1513143 1506137 1520761 1167218 1267735 1697597 1504778
14628 1504778 1493504 1437864 1380288 1448525 1440812 942836 1596168 1605118 1627901 1499760 1481335
14617 1481335 1642375 1718471 1581318 1586244 1680020 1699061 1169511 1837263 1604575 1536567
14607 1536567 1669820 1903593 1746010 1699720 1519042 1865447 1922218 1526025 1502752 1732221
14597 1732221 1584954 1528093 1798368 1780808 1868911 1979967 1890435 2032180 1947928 2091456
14587 2091456 1574651 1667828 2011612 2131975 1990910 2107538 1837048 2086384 2319939 2007979
14577 2007979 2188783 2102327 2062460 2401083 2236999 2565272 2196649 2393901 2496257 2389562
14567 2389562 2066296 2616699 2614425 2288231 2473343 2965074 2898290 2832560 2898116 3209831
14557 3209831 3273169 3351099 3623508 3882866 3889485 4456582 5272344 6261013 7543037 11708922
14547 11708922 21254119 38803861 39386266 22866980 11324608 5726452 3606765 2790603
14539 2790603 2488722 2137773 2283261 2284977 2387939 2408702 2666515 2364613 2224487 2341795
14529 2341795 2525038 2477024 2333688 2202946 2481487 2437485 2562723 2550370 2710181 2723093
14519 2723093 2722299 2766031 2805244 2846213 3051482 2955718 2797375 2955980 2380436 2719623 2892505
14508 2892505 3351620 3049494 3054153 2980868 3169081 3225728 3468325 3167275 3213442 3351734
14498 3351734 3582902 3432480 3114622 3238772 3223274 3494903 3756119 3503939 3679289 3839623
14488 3839623 3704170 3933996 3793486 3863359 3679310 3691753 3936324 4068890 4284792 4272703
14478 4272703 4125699 4360994 4063761 4198761 4346558 4643072 4617903 4568075 4565414 5080748
14468 5080748 4698391 4180888 4773398 4774989 4576564 4990764 4903111 4957061 5193382 5238536
14458 5238536 5475787 5374948 5192150 5402240 5737710 5461466 5578699 5598125 5521275 6279408
14448 6279408 5950409 5836526 5910991 6108935 6264222 6124903 6098423 6325138 6182388 6450994
14438 6450994 6789046 6730819 7068604 6696191 6750831 7088090 7090041 6991959 7479957 7415516
14428 7415516 7601812 7782432 7725790 7986948 8167733 8128241 8112105 8306593 8412802 8433077
14418 8433077 8494802 8837078 9009608 8976879 9082989 9478281 9763036 9127393 9940891 9964978
14408 9964978 9844390 10466831 10442006 10569002 10750529 10803803 11243396 11147653 11234931 11391264
14398 11391264 11548464 11976985 12328475 12267679 12675012 12670268 13073182 13044031 13465473 13520285
14388 13520285 13853759 13898152 14169896 14334715 14865744 15070192 15399100 15700328 15816526
14379 15816526 16092413 16311431 16829601 17235242 17233165 17717513 17984385 18202641 18572722 18811091
14369 18811091 19696472 19694358 20514997 20489137 21105852 21363811 21855652 22628971 22795394 23602696
14359 23602696 23905319 24418392 25268045 25633290 26010283 26630671 27503284 28376961 28906543
14350 28906543 29527976 30468735 31002987 31903898 32611057 33591077 34422494 34920265 36048581
14341 36048581 37297650 38179107 39221392 40620999 41446305 42945049 43934505 45191295
14333 45191295 46505019 48045803 49596910 51157259 52500777 53920268 55740096 57781900
14325 57781900 59686725 61717327 64025237 66145257 68494571 71171888 73322232 76097223
14317 76097223 79067854 82054197 85203404 88343008 91929296 95403380 99293833 103552004
14309 103552004 107608292 112260223 117026690 122234080 127546352 133186486 139145262 145599771
14301 145599771 152057682 158933835 166535112 174411115 182441743 191160479 200655476 210453108
14293 210453108 220751966 231402451 242935403 255167621 267120125 280114304 293427666
14286 293427666 307110610 321317391 335655231 349846505 364564552 378747931 392969658
14279 392969658 406514932 418994437 430791934 441533743 450960073 458468418 464177855
14272 464177855 467180680 465649228 461051117 456305111 451546352 448135958 440826512 431319074
14264 431319074 419850718 406482339 392279466 377603098 362271564 346838052 331620569
14257 331620569 316135591 301338113 287585887 273651348 260623443 247652780 235356320
14250 235356320 224045340 212902175 202535784 192670533 183358838 174460764 166549901
14243 166549901 159093566 151686539 144543473 137974422 132194160 126898430 121347730 115999343
14235 115999343 111192570 106500753 102102417 98128809 94469856 91041052 87378732 83641145
14227 83641145 80905272 77832142 75260580 72247382 69840699 67217270 65166475 63070344
14219 63070344 61039839 58880797 56965814 55407093 53501617 52177198 50621050 49154571
14211 49154571 47149748 46251608 44594408 43690143 42779730 41667992 40412154 39082529
14203 39082529 37896285 37323695 36353916 35381401 34820307 33431453 32637677 31808924 31082069
14194 31082069 30618018 29494552 29038102 28308013 27366134 26830454 26389120 25737947 25178916
14185 25178916 24648621 24017374 23701519 23001867 22380339 21832210 21613862 21201447 20539093
14176 20539093 20017273 19860621 19282924 18819040 19175990 18287739 18100476 17328797 17356962
14167 17356962 17220836 16609718 15951024 15921661 15433627 15259249 15291397 14595192 14456911 13977320
14157 13977320 13963930 13812789 13381292 13211632 12737995 12831772 12628018 12488817 12430271 12166672
14147 12166672 11814016 11486604 11159202 11306942 11231911 10777363 10915287 10450195 10460869 10851439
14137 10851439 10004614 9910118 10036744 9705288 9449967 9603887 9357036 9334398 8879807 8559582
14127 8559582 8732466 8540581 8599868 8670435 8357614 8181756 8142541 8102264 7706233 7857919
14117 7857919 7432007 7727563 7392953 7751004 7328581 7615437 7090047 7005061 7175630 7029280
14107 7029280 6767484 6642122 6367937 6382605 6768330 6389808 6623937 6442256 6039026 6100097
14097 6100097 6362264 6034660 6152058 5690252 6106082 5837347 5724238 5579880 5588914 5445722
14087 5445722 5322424 5433407 5138126 5350638 5167239 5130238 5153792 5048250 4987903 4701295
14077 4701295 4788446 4586560 4580681 4539269 4357050 4632492 4666416 4441867 4396992 4673003
14067 4673003 4260855 4139433 4555666 4256341 4153415 4436585 4199425 4158481 4351132 4037601
14057 4037601 4212710 4108026 4117422 3831903 3946232 3540956 3889065 3692103 3821640 3864227
14047 3864227 3459776 3825299 3595406 3649150 3674042 3448567 3712349 3151178 3348767 3379366
14037 3379366 3368700 3081120 3237441 3471851 3030393 2851728 2950149 3448733 3284786 3243240
14027 3243240 3026360 3127230 2986138 3158560 2811959 2876567 2684775 2831792 3072912 2683449
14017 2683449 2752977 2556009 2405456 2873573 2675686 2549044 2372701 2669321 2482340 2083833
14007 2083833 2276351 2535627 2536109 2513092 2197074 2288803 2484450 2213686 2544548 2404935
13997 2404935 2534203 2324673 2340245 2168505 2703908 2644384 2840773 3030852 4152511 6323385
13987 6323385 14972056 32573137 39133210 25752525 14976154 9627526 6327975 5113952
13979 5113952 4278458 3947622 3517858 3098914 3171566 3283126 3042736 2857636 2495450 2860773
13969 2860773 2656826 2530362 2705515 2557751 2561413 2174735 2444801 2126623 2361424 2209856
13959 2209856 2590789 2032691 2225683 1904001 2099191 2419867 2256006 2196844 1934491 2053615
13949 2053615 1984802 2033752 2126306 1813896 2186345 2159648 1717784 1849349 1864181 1757433
13939 1757433 1715568 1881592 1898589 1877487 1693712 1573948 1797774 1762573 1544952 1476143
13929 1476143 1545022 1840811 1687969 1710889 1702090 1736898 1356413 1429139 1629130 1518327
13919 1518327 1628965 1737329 1443468 1459171 1645258 1318900 1547955 1568721 1154820 1618603
13909 1618603 1504348 1389388 1900528 1400634 1214225 1566281 1578864 1482401 1710990 1393459
13899 1393459 1534805 1101200 1210380 1466487 1373357 1324399 1398385 1377450 1713685 1479616
13889 1479616 1387742 1370513 1461143 1485652 1128098 1265730 1159099 1292386 1334700 1331795 1342721
13878 1342721 1580751 1148765 1196371 1260029 1170810 1231211 1223190 1041036 1414707 1079378
13868 1079378 1081713 1128570 1218838 1279329 1161815 1083060 1099753 941452 1095674 931354 990127
13857 990127 1008581 1021837 1001173 1255796 1484196 1357943 1111247 906026 697324 829625
13847 829625 1351662 853065 805899 1234243 974708 1053716 826376 860955 1239880 1126329
13837 1126329 887433 1195798 1043413 757594 857179 1046313 1168645 924891 820056 922201
13827 922201 1139855 1056915 922867 959205 863292 1415955 987021 866210 976967 899118
13817 899118 1197560 744236 796602 1024979 742913 898184 935018 1146564 907000 778946
13807 778946 908106 1153285 715051 813236 985471 659519 579164 1269898 891004 868980
13797 868980 607223 717704 390456 615204 626474 684358 643690 987316 869988 843643
13787 843643 746632 901402 795249 988499 1057379 662929 612979 448118 484141 763375
13777 763375 672025 803197 665512 1007589 1073114 724971 315171 695253 602440 783110
13767 783110 769299 560726 669248 759720 801729 553817 350828 561994 762111 632192
13757 632192 741797 662220 1187751 558341 937505 376112 687123 548450 729336 315839
13746 694469 822105 560227 751296 467933 627849 605681 794680 724482 789498 379955
13735 968329 699553 817635 740771 813404 472950 435032 647279 438462 678926 363129
13725 363129 567488 479260 464622 790839 522492 458137 777672 370078 570149 557303
13715 557303 389914 485668 726791 697333 620472 366214 595928 691961 823486 634283
13705 634283 474900 360968 295612 60921 550741 300115 832007 522310 426574 754665
13695 754665 667415 698033 322325 656097 367182 581415 785988 636969 551479 431582
13685 431582 584339 348377 339002 464281 453075 613129 353504 325266 326246 669568 501539
13674 501539 534997 393118 468504 600589 843906 436987 476616 369987 239168 307503
13664 307503 306360 346547 398432 514585 297667 92167 305863 551644 567173 637992 441576
13653 441576 374674 574486 684598 153482 660943 257907 672850 611677 363527 399109
13643 399109 596568 80478 48667 450881 562947 560491 549849 577656 353834 184723 367714
13632 367714 635096 467523 722920 458454 389846 312825 532538 771503 501605 546390
13622 546390 415961 419296 358015 400468 273684 711112 202455 681179 307146 289554
13612 289554 517416 329682 482988 551215 654656 568038 400849 341806 358539 362871 323970
13601 323970 496237 444368 159547 69759 460031 723784 509000 300109 245980 661190
13591 661190 45275 477779 546364 789804 212487 442151 309704 421792 433787 428412
13581 428412 593416 350047 428868 174928 384065 730532 175159 323151 172909 640640
13571 640640 258949 354432 381123 598422 137317 491118 448931 304708 512991 333169
13561 333169 199593 881803 221708 246850 352452 192771 8533 562847 70265 211601
13551 211601 176088 266739 400809 76695 613399 284077 88543 338796 -77256 389913
13540 191058 299962 339024 335240 46464 540475 325713 202778 237674 344223 165729
13529 319986 472620 499733 177477 348278 16674 3568 177864 299325 218030 482908
13519 482908 464489 338712 191997 377542 325179 262435 176881 433135 269683 215572
13509 215572 111104 361757 214162 29384 67586 -61826 459909 82682 260641 271246
13499 271246 194094 471701 306121 99033 -224839 182878 21306 636835 156775 167768
13489 167768 293437 307039 314998 52572 65079 287230 167870 50292 164891 117493 215057
13478 215057 239462 405927 -108113 326197 229594 30614 189898 277521 324957 372012 518294
13467 518294 248150 47269 -353444 254997 371914 286171 184325 189340 22310 251724
13457 251724 343124 67273 268895 86808 227581 197628 279339 312917 21636 -96749 -149955
13446 -149955 474448 130250 168597 47761 283743 365907 474529 170642 307639 240248
13436 240248 246737 325731 5162 38739 193479 190742 237538 502032 310613 212383 -100621
13424 219128 641 161463 -11142 196950 92121 73398 -25932 446461 291739 196568 399235
13413 399235 -105178 99677 262946 170735 -216748 220791 333372 240747 482565 -96753
13402 446051 550775 239527 273741 455341 118690 312136 391104 10373 72038 123231
13392 123231 -57888 -49852 217054 313780 365175 176377 381139 187727 434021 15990 234913
13381 234913 261491 374233 101938 188867 -126105 103399 146058 314122 172322 322481
13371 322481 410109 280718 198363 105848 192380 414904 150547 126966 312971 644920
13361 644920 49328 118001 319995 191249 156196 476204 389668 288841 291468 207234 497582
13350 497582 -51766 21288 361036 203294 399891 168525 388892 494042 244681 367936
13340 367936 134178 122905 252575 8558 363662 183648 121730 158971 -23571 154365 622603
13329 622603 541874 274624 229779 218514 323628 6736 134813 28790 246581 544807 137664
13317 301147 368867 228201 311378 155269 500344 -297951 313531 -6242 315966 118814
13306 69042 385950 279856 -160869 197609 491452 88983 192704 202469 25813 -107000
13295 16933 240600 4560 51767 284968 264254 93609 65342 306383 246346 416612 17450
13283 68012 13548 226572 383837 315037 -99997 157748 182079 110400 -157906 -2393 357653
13271 309317 313008 31761 327435 377771 -307357 -190069 140143 199573 5832 288882 86885
13259 104151 272393 52598 65982 -56376 405540 210513 -24113 -165410 371746 389653
13249 389653 -55520 198018 -196978 202131 39287 206732 -50612 303952 -103070 386643
13238 254821 -66849 43084 190328 101161 36139 229912 58884 -7158 385600 31345 482958
13227 482958 -120009 -64734 240663 -203331 369553 -48115 132642 -61229 83514 79168 102606
13216 102606 68877 -30769 192185 281721 260772 63291 106535 143687 -110902 102944 11448
13204 -151971 -25818 101813 41667 83836 -142683 288385 158387 -5435 91237 19121 277195
13193 277195 50055 34172 94972 138857 -411959 602374 77886 87694 89877 46656 264740
13182 264740 28090 109305 353815 -96803 277710 -88282 131779 169969 -6616 -112747 259471
13170 45046 502173 122457 -264524 121113 214398 5683 -198360 160607 62550 -154064
13159 185533 388874 198377 37589 107687 186624 242766 -227814 198936 123256 162981 189215
13148 189215 -80225 -187676 404641 209297 -67652 166309 132338 280978 323345 -219636
13137 185912 -207727 354281 -71300 -243082 46473 171946 229341 309722 105937 178190
13127 178190 2869 156115 -57890 -33225 56444 -24936 339284 -161335 -26137 265776 -84967
13115 50365 -25209 271929 131293 514967 -64916 165216 255944 56547 330993 401943 86899
13103 37515 277706 -111558 57078 294594 467 -44500 108971 84986 17182 117432 462579
13092 462579 -10761 168645 -9832 -53974 -56020 157960 206959 101007 -175374 356959 457463
13081 457463 -199885 144390 -17283 323453 110617 159391 42025 248673 170088 130387
13071 130387 -260563 -148178 112180 -58003 121776 5097 154391 -87107 323873 90544
13060 447302 316608 -289413 16370 173006 -156636 30965 329547 -154629 67500 77313
13050 77313 250415 -160098 -125065 285835 19191 267670 76556 201896 -190738 17007
13039 157968 362738 -123924 175968 222796 561580 188367 -46028 411427 -14184 153103
13028 201532 361450 117969 300924 -6672 146550 -112781 340570 66283 137332 229487
13018 229487 206206 -277620 155596 256371 426078 282915 253724 -74694 48970 118060
13008 118060 58657 -252235 -220793 410108 171409 -94909 223528 250315 21255 -182092
12997 215074 -143271 177149 -15954 -133613 21892 216523 -221994 152176 1451 -188205
12986 -9757 364601 -10227 166302 60812 -792 -168625 76058 99808 -196704 -82382 -202006
12975 -202006 -143160 139517 23556 177082 31546 173272 -5270 80810 -202043 216888 153769
12964 153769 -232961 132694 -11532 335466 -104680 -240539 84146 -74626 64484 189617
12954 189617 -312609 233462 98722 179411 125696 493897 317842 -90634 -273460 -184818
12944 -184818 -104595 231260 207814 24579 -213945 18063 -114436 84943 32175 -38098 -169118
12933 -169118 177893 183712 -24979 53962 -282792 211829 125425 143803 163386 442741 -520532
12921 -59641 58518 231028 -63775 -196780 -5769 146377 -121348 309636 288601 -74010 4253
12909 -355995 129265 -46733 130418 -7650 112655 2883 -38423 14327 65835 36914 -101264
12897 -65602 290122 -64557 206845 173805 99451 -140107 314959 -187681 -138789 107605
12886 199401 -81755 -117110 -296268 -44609 161408 27377 351199 37424 197830 49284 -246900
12874 229223 145803 60161 -53805 83384 -43001 -119847 -196852 90839 21919 73451 -42460
12862 164576 242603 -181960 23619 340684 250859 258977 -210987 -209474 100686 152583 -77712
12850 -182236 -325297 449053 -49890 524292 129316 73537 220046 -29187 182571 33141
12839 -101799 -150699 223860 394618 -71234 183332 -68754 -177291 -171940 -30096 -15997 70224
12827 -317408 34802 -185205 -56780 99125 120024 139078 48765 77562 -162040 70409 89111
12816 89111 154859 -43001 -178579 40468 185682 211019 -367422 489891 -16175 3462 135709
12805 135709 -35271 7474 101957 249692 200074 147314 12924 -90276 -244683 -61424 104136
12793 -270213 218373 -54182 164438 202875 -138090 -51283 198090 -498573 -312729 115824
12782 94401 159351 -199544 10975 -317023 -116981 315969 148621 -126239 -83686 250985
12771 -17327 -34124 201173 99783 27560 66639 120872 264723 162720 -372927 361627 123109
12759 71801 89439 19351 77506 57032 70661 -256115 -173437 -145228 163021 614132 -21774
12747 -58698 29799 117412 -319828 -153175 38700 11486 104910 134835 -297453 -26821 77224
12735 254191 217602 181224 367809 156680 -13472 -283251 43565 253815 -47649 192753
12724 -143212 239697 -222267 170958 153787 -299842 38700 -273981 159308 -38241 -54696
12714 -54696 -183081 -178949 -242524 -2371 135475 -72211 177182 175033 213544 310317 266572 192091
12702 192091 59330 471900 -18486 37201 -188169 155803 -7352 -62809 36512 150456 -147996
12690 -315644 41860 -281741 440034 -238363 173810 41821 66817 390488 17395 141206
12680 141206 106357 242547 250276 -41240 -233298 22538 192801 123947 10951 87073 -225308
12668 6636 -16872 128167 -248463 50340 30042 288624 157866 -280559 -164487 199980
12657 150858 327183 196006 -85663 388764 176155 184357 292 141002 -202193 2481 112181
12646 112181 201711 115462 148902 -139384 27453 7302 466637 325953 -266610 156229 162681
12635 162681 74268 -278292 -155183 -101794 -181036 411471 337029 254529 198837 393539 170419
12623 241149 93938 324665 -226475 219188 -67671 429701 122460 142942 502188 212057
12612 199549 -4853 -36219 51644 187544 134025 325850 132530 -296877 236509 -62378 160622
12600 282509 -114622 68361 -84889 -142657 -409572 -92654 -454 45889 -208878 243500 -216121
12588 134486 220646 58234 430006 259047 119338 42734 -37154 113702 230964 70694
12577 138446 -291186 113467 319239 126868 69829 246229 -74734 58045 151986 -83972
12566 75419 -258474 3335 36427 101754 42476 195038 64633 97353 -117810 -87560 153213
12554 46808 2278 -17495 209722 -121783 -61420 -262027 -61298 -204112 265456 89823 -42457
12542 331563 -285528 24016 42066 59114 -26124 21074 -23754 29180 -114707 -88014 -44582
12531 -44582 -468431 234927 -257700 -36480 -74014 33391 17822 211526 34131 348671 130356
12519 160619 -46947 31543 196660 -297853 16221 -26798 -48985 232048 -77595 -336791 158981
12507 58824 -237000 334533 6232 9714 24798 140639 48417 280516 226724 60611 25623
12495 117393 87009 285238 150214 -35084 -107778 -267497 -51138 -214734 -379229 -204991
12485 -204991 138844 -232889 -354259 114741 -218143 115714 -15321 72629 359867 -100488
12474 -142538 225202 185776 298639 -54845 230754 202185 -23630 -84411 150625 28660 -154364
12462 -102043 -204015 -110888 -129691 -95017 -176869 176382 -26220 178212 -208958 197721
12451 94400 64287 -117489 37942 -73019 -47952 -115748 -102625 -46020 420818 -253302 215242
12439 -13905 164201 -115886 477853 -196727 -44826 -82156 -20097 41532 104511 8205 92203
12428 92203 52550 -95764 -366297 -119563 133987 292762 -65884 -237694 -198942 105496
12417 111850 82758 -63871 181512 129048 17327 -38208 283814 -217882 139064 -90472 19087
12405 143952 -39566 -211395 -102342 -312199 -122314 267133 -105247 -405869 299658 -310321
12394 -214283 -228313 -336508 -83231 -235732 72452 92700 -60213 -16330 74571 -282276 -52774
12382 80225 -89895 -163170 205753 -306572 -63690 30645 -163796 61585 142510 -47958 -21274
12370 8301 324776 -227204 97014 -236827 -56797 93664 -252281 97914 97910 -407541 -24389 144831
12357 -148413 89407 336094 -173590 -85233 268254 -39710 76733 -63647 310610 435177
12347 435177 69485 -10220 187567 47832 158172 -5342 77797 112114 85500 85452 354720 -58869
12334 76026 -71878 -75888 244955 -25547 -100056 100480 96265 -104316 46895 19389 -41999
12322 -67213 133757 -177991 -77101 110364 -96542 -212281 133192 152488 -186425 -180342 -382098
12311 -382098 80968 -38766 -3127 54391 108070 181542 102456 168193 175840 -57139 123470 -361087
12298 83022 -62708 -182166 -86864 -167774 97910 31421 394616 23024 183748 -86756 111792
12286 567586 84206 81670 -32542 128560 -200105 43566 397118 97209 354338 210971 -33917
12274 203256 364348 348775 -28811 140472 -29899 239853 166477 -7588 -79897 259945 72700
12262 -17745 74461 -145138 -182595 193735 132907 79828 286722 140320 449127 124804
12251 195642 -77702 126862 -65495 -98790 -5279 363298 103050 162404 98165 115725 -68117
12239 281709 47586 243837 262500 140075 178396 94739 386540 -144681 121205 6190 53498
12228 53498 170617 -22348 85603 24782 81124 -167864 114761 -54342 49883 31117 159529
12217 159529 -164997 99686 -30814 321159 120804 289580 220632 -34095 -225778 14653
12206 164932 177974 -6834 132502 147314 -13302 124702 237743 225106 285657 -165003 -139627
12195 -139627 187361 198823 351230 478900 163561 20732 126768 282284 292049 -122263
12184 -140680 167476 115960 6541 39001 145717 272881 427324 191224 228116 -70959 97850
12172 58154 157210 237495 63295 439254 145002 -259994 212199 597875 -152636 150464
12161 349274 45153 55797 147119 -32486 -78877 295165 123123 -52658 197393 283321 -134916
12149 -73269 -178110 -8938 -125362 12896 -84570 -204172 173490 -33328 188239 -117782 -338169
12138 -338169 52652 -128529 126668 252383 -60854 -110832 -75413 3427 375156 -119230 50060
12126 224031 195025 337858 79350 137971 -75916 29766 -268660 72664 -186751 535571 121210
12114 -253919 -43929 120637 -54151 61018 -175552 -185227 -261885 60206 72974 -21132 143017
12102 -16767 -438054 89230 152739 265800 236487 195539 -67694 328808 -69790 -377109 -109583
12090 89769 -206575 -126021 -69595 -140541 -224500 -167351 87804 -143355 -2532 38450 243656
12079 243656 191236 -334630 7306 101089 -147495 187082 -101539 9171 276221 313468 1414222
12068 1414222 1955516 669061 20308 267083 22772 -185952 263021 -319729 -107528 90608
12057 122176 240445 155400 239978 32121 258095 -46048 190692 118850 208964 15016 -22619
12045 112893 -293649 201056 -167774 21913 -251152 -110046 -20521 -197149 -15716 -1698
12034 -34058 -132424 98221 -151710 -87750 -9965 182915 -38868 -33207 -161394 -17126 62846
12022 -124079 129202 129203 73357 -9115 207787 59137 -90410 121825 136943 124845 -70229 371149
12009 343624 -341529 13118 -83478 -362919 -41686 22880 225139 -17507 70381 156175 -166814
11997 313357 79007 -31003 -165201 -80253 -144243 -213185 41401 -149662 54785 -238070 -110956
11985 35754 -358502 -186054 154860 -16280 69217 608 31865 217239 232590 -48309 191983
11973 74745 -467777 -163516 97378 156674 -159265 12338 234817 116764 -370905 -27844
11962 59800 33470 -144970 -196069 -85684 56717 -60039 35125 -405443 -239119 208861 -311904
11950 20574 -83686 139437 -183868 151741 -183494 -93568 147950 1919 -267804 -61343 45471
11938 112048 197268 64823 -159213 34692 -174349 231497 19411 103726 -99139 201832 54121
11926 68283 -128914 -199394 403934 -120707 304022 -99370 170382 154219 -256857 184827
11915 18262 157880 -120531 -142550 152291 -147292 -268009 3272 -44192 -18339 293084 250879
11904 250879 179341 306029 2486 -307235 -128632 47848 -120947 296950 -364645 -13195
11893 107834 93220 40022 -63900 209796 -18519 101012 260026 113429 -60597 -36426 -179934
11882 -179934 -164935 -371608 -94579 88189 -223420 76256 59175 95343 157601 -26266 64455
11870 -65272 -37874 240993 39300 8420 -425098 37318 134070 -74687 -29655 -180016 -122020
11859 -122020 -172892 29889 -325793 -417947 19039 -273645 253922 -170388 -52100 68132 202728
11848 202728 167753 -117933 -316983 162759 127950 -80847 85946 -4021 307760 301028 -205028
11836 42694 -95661 195660 -246801 -58554 -310973 204466 -51917 57934 291554 -135617
11825 109973 -366705 109456 208628 -283702 -165619 -47176 -301631 74451 136831 -147857
11814 161625 152501 -142922 53349 -109434 311760 50693 -181187 -365581 26619 77055 -101024
11802 155319 -45585 196520 -6416 -101957 125540 -40143 114242 63557 95371 320158 190818
11791 190818 -359067 45021 36964 230756 -164803 -201093 326608 27285 230205 -276375
11780 -81650 29667 -332194 -157503 414785 137427 21941 -405280 -88837 219475 -71046
11769 -8044 -257919 -215273 61430 94990 -59395 -124477 -90586 447602 208108 269922 55230
11757 51846 -149826 -140033 90021 230445 236510 -124358 -338009 -114804 -261351 -188899 204003
11745 -17772 81473 237914 127294 -61049 52578 56232 65563 247959 102456 233314 -195902
11733 -346935 129112 15979 126410 -98453 -117940 62523 -178135 -138566 77086 -434690 21490
11721 386474 -130781 -11016 -4352 380534 -226752 -59536 105070 -10881 -309052 163726
11710 -48662 284568 -39971 15285 74443 -36747 -109574 -150892 -332667 -20116 114946 207378
11699 207378 297415 -267377 160064 -291526 61235 4464 -32897 50704 -152171 29315 10966
11687 120814 -191477 17448 28962 104485 109041 -229963 355626 -114018 -228756 156711
11676 -24180 -47843 85729 -210349 -89571 76696 319971 264746 28956 -104740 217949 157887
11665 157887 197868 133446 -11183 -80514 98620 -66279 -13513 -84985 48573 64123 -258150
11653 -70881 105021 -275530 -31400 86828 128740 -340560 -20571 169000 360497 -16980 167430
11641 -132400 359686 102886 -362362 24589 -184131 6648 60334 -32388 301134 -114489
11630 12961 192333 -207977 240656 93821 217204 130100 -90668 -12218 -66960 223483 14341
11618 133704 405139 28675 142709 -2604 264486 379423 343897 -202677 100458 -204971
11607 154267 -38712 -111356 107838 177047 -70442 158284 79035 32749 -320281 79602 -46524
11595 185524 36704 87457 301442 366180 115221 43212 130620 -16200 288649 -68259 188351
11583 283471 139994 92654 134427 -43001 227745 209237 395704 -27367 -205128 -109293 -23590
11571 98853 76283 -142100 -30090 -40371 -19605 93511 177784 131209 167544 171252 286980
11560 286980 214497 194662 147913 -72392 507901 215376 249369 218069 45773 -78707 -154368
11549 -154368 262004 210962 -199408 177382 -83978 208579 -109191 -275575 147661 -24832
11538 100598 232984 134751 151022 -124156 62551 225597 137695 24791 391303 228672
11528 228672 280125 -93687 195147 -66779 332736 -20842 93387 431647 196568 151024 193133
11517 193133 163514 150078 54809 217464 -1481 170475 224250 120088 101670 369487 59828
11505 51138 56832 328165 -160932 -35704 295436 179341 373846 6064 209126 171686 -154836
11493 196504 98521 -132750 -128845 109668 264743 -133390 136393 224316 181099 165487 -32126
11481 232380 69742 342242 306407 405423 218464 269356 -53051 675477 178230 -5771 28161
11469 -97762 427142 365710 83373 83831 10749 216653 638371 158531 39395 290553 -244452
11457 216779 119915 220252 203256 205723 -165844 241299 86915 63233 289867