
##TITLE=AC1302_PERAH12114_6535671_KetVU1Pe3j
##JCAMPDX= 6.0         $$ Bruker NMR JCAMP-DX V2.0
##DATA TYPE= NMR SPECTRUM
##DATA CLASS= NTUPLES
##ORIGIN= BRUKER
##OWNER= Administrator
$$ 1.72 TOPSPIN		Version 2.1
$$ 2012-07-17 15:14:13.765 -0500  Administrator@TOPSPIN
$$ Compression mode = diff/dup
##.OBSERVE FREQUENCY= 400.02188249412
##.OBSERVE NUCLEUS= ^1H
##.ACQUISITION MODE= SIMULTANEOUS (DQD)
##.ACQUISITION SCHEME= undefined
##.AVERAGES= 64
##.DIGITISER RES= 22
##SPECTROMETER/DATA SYSTEM= spect
##.PULSE SEQUENCE= noesygpps1d.comp
##.SOLVENT NAME= COFFEE_meoh
##.SHIFT REFERENCE= INTERNAL, COFFEE_meoh, 1, 14.96066
##AUDIT TRAIL= $$ (NUMBER, WHEN, WHO, WHERE, PROCESS, VERSION, WHAT)
$$ ##TITLE= Audit trail, TOPSPIN		Version 2.1
$$ ##JCAMPDX= 5.01
$$ ##ORIGIN= Bruker BioSpin GmbH
$$ ##OWNER= Administrator
$$ $$ C:\Bruker\TOPSPIN/data/COFFEE/nmr/AC1302_PERAH12114_6535671_KetVU1Pe3j/22/pdata/1/auditp.txt
$$ ##AUDIT TRAIL=  $$ (NUMBER, WHEN, WHO, WHERE, PROCESS, VERSION, WHAT)
(   1,<2012-07-17 15:14:08.906 -0500>,<Administrator>,<TOPSPIN>,<go>,<TOPSPIN 2.1>,
      <created by zg
	started at 2012-07-17 15:02:38.625 -0500,
	POWCHK enabled, PULCHK disabled,
       configuration hash MD5:
       6B 1B 68 BB D9 2E 58 E2 7F 35 AD 54 07 DF 0E 41
       data hash MD5: 64K
       32 F7 E8 B0 01 A3 D0 9B CB A2 96 95 0B ED 8E 98>)
(   2,<2012-07-17 15:14:11.718 -0500>,<Administrator>,<TOPSPIN>,<proc1d>,<TOPSPIN 2.1>,
      <Start of raw data processing
       efp LB = 0.3 FT_mod = 6 PKNL = 1 PHC0 = 0 PHC1 = 0 SI = 128K 
       data hash MD5: 128K
       91 B0 FE 4A 8B 63 DE DA 3C D5 8D 70 84 EC 81 3D>)
(   3,<2012-07-17 15:14:12.796 -0500>,<Administrator>,<TOPSPIN>,<proc1d>,<TOPSPIN 2.1>,
      <pk PHC0 = -2.576294 PHC1 = 0 
       data hash MD5: 128K
       55 4A E9 F2 48 02 B6 91 5F EA 47 45 01 CB 3F 6C>)
(   4,<2012-07-17 15:14:13.437 -0500>,<Administrator>,<TOPSPIN>,<proc1d>,<TOPSPIN 2.1>,
      <abs ABSG = 1 
       data hash MD5: 128K
       C8 98 9F 64 69 8C D1 FD 0B 5F 1C A3 DB 4D 0E E1>)
(   5,<2012-07-17 15:14:13.500 -0500>,<Administrator>,<TOPSPIN>,<proc1d>,<TOPSPIN 2.1>,
      <abs ABSG = 2 
       data hash MD5: 128K
       93 1B BB 6B F9 22 EC 83 69 7D E9 3B 16 A8 95 60>)
(   6,<2012-07-17 15:14:13.562 -0500>,<Administrator>,<TOPSPIN>,<proc1d>,<TOPSPIN 2.1>,
      <abs ABSG = 3 
       data hash MD5: 128K
       B0 19 04 74 BC 43 E4 2C DC 99 6F 92 38 90 A9 41>)
(   7,<2012-07-17 15:14:13.625 -0500>,<Administrator>,<TOPSPIN>,<proc1d>,<TOPSPIN 2.1>,
      <abs ABSG = 4 
       data hash MD5: 128K
       00 B1 54 40 46 DC 1B 12 AE BB 2B C1 52 99 A9 6C>)
(   8,<2012-07-17 15:14:13.671 -0500>,<Administrator>,<TOPSPIN>,<proc1d>,<TOPSPIN 2.1>,
      <abs ABSG = 5 
       data hash MD5: 128K
       07 4F BE 1B E6 F0 5A 27 D9 3B 00 83 1E 4D 38 56>)
$$ ##END=
$$ 
$$ $$ hash MD5
$$ $$ C8 57 68 B5 12 64 0A 9A 3E 60 B9 AE C5 A2 2C 5D
##$RELAX= 
##$RELAX= 
##$RELAX= 
##$RELAX= 
##$RELAX= 
##$RELAX= 
##$RELAX= 
##$RELAX= 
##$RELAX= 
$$ [...]
##$TP07= 0
##$TPNAME0= <>
##$TPNAME1= <>
##$TPNAME2= <>
##$TPNAME3= <>
##$TPNAME4= <>
##$TPNAME5= <>
##$TPNAME6= <>
##$TPNAME7= <>
##$TPOAL= (0..7)
0.5 0.5 0.5 0.5 0.5 0.5 0.5 0.5
##$TPOFFS= (0..7)
0 0 0 0 0 0 0 0
##$TUNHIN= 0
##$TUNHOUT= 0
##$TUNXOUT= 0
##$USERA1= <user>
##$USERA2= <user>
##$USERA3= <user>
##$USERA4= <user>
##$USERA5= <user>
##$V9= 5
##$VALIST= <valist>
##$VCLIST= <CCCCCCCCCCCCCCC>
##$VD= 0
##$VDLIST= <DDDDDDDDDDDDDDD>
##$VPLIST= <PPPPPPPPPPPPPPP>
##$VTLIST= <TTTTTTTTTTTTTTT>
##$WBST= 2048
##$WBSW= 25
##$XGAIN= (0..3)
0 0 0 0
##$XL= 0
##$YL= 0
##$YMAX_a= 11671391
##$YMIN_a= -9483155
##$ZGOPTNS= <>
##$ZL1= 120
##$ZL2= 120
##$ZL3= 120
##$ZL4= 120
##$ABSF1= 14.96066
##$ABSF2= -5.597522
##$ABSG= 5
##$ABSL= 3
##$ALPHA= 0
##$AQORDER= 0
##$ASSFAC= 0
##$ASSFACI= 0
##$ASSFACX= 0
##$ASSWID= 0
##$AUNMP= <proc_prof1d_extract.lims>
##$AXLEFT= 0
##$AXNAME= <>
##$AXNUC= <1H>
##$AXRIGHT= 0
##$AXTYPE= 0
##$AXUNIT= <>
##$AZFE= 0.1
##$AZFW= 0.1
##$BCFW= 0
##$BC_mod= 0
##$BYTORDP= 0
##$COROFFS= 0
##$CY= 15
##$DATMOD= 1
##$DC= 0
##$DFILT= <>
##$DTYPP= 0
##$F1P= 0
##$F2P= 0
##$FCOR= 0.5
##$FTSIZE= 131072
##$FT_mod= 6
##$GAMMA= 0
##$GB= 0
##$INTBC= 1
##$INTSCL= 1
##$ISEN= 128
##$LB= 0.3
##$LEV0= 0
##$LPBIN= 0
##$MAXI= 10000
##$MC2= 0
##$MEAN= 0
##$ME_mod= 0
##$MI= 0
##$NCOEF= 0
##$NC_proc= -2
##$NLEV= 6
##$NOISF1= 0
##$NOISF2= 0
##$NSP= 0
##$NTH_PI= 0
##$NZP= 0
##$OFFSET= 14.96066
##$PC= 1
##$PHC0= -2.576294
##$PHC1= 0
##$PH_mod= 1
##$PKNL= yes
##$PPARMOD= 0
##$PPDIAG= 0
##$PPIPTYP= 0
##$PPMPNUM= 2147483647
##$PPRESOL= 1
##$PSCAL= 4
##$PSIGN= 0
##$PYNMP= <proc.py>
##$REVERSE= no
##$SF= 400.020009771531
##$SI= 131072
##$SIGF1= 0
##$SIGF2= 0
##$SINO= 400
##$SIOLD= 131072
##$SPECTYP= <>
##$SREGLST= <1H.CDCl3>
##$SSB= 0
##$STSI= 131072
##$STSR= 0
##$SW_p= 8223.68421052631
##$SYMM= 0
##$S_DEV= 0
##$TDeff= 65536
##$TDoff= 0
##$TI= <>
##$TILT= no
##$TM1= 0
##$TM2= 0
##$TOPLEV= 0
##$USERP1= <user>
##$USERP2= <user>
##$USERP3= <user>
##$USERP4= <user>
##$USERP5= <user>
##$WDW= 1
##$XDIM= 131072
##$YMAX_p= 391958934
##$YMIN_p= -17829
##$CURPLOT= <Network HP LaserJet P1505>
##$CURPRIN= <$Network HP LaserJet P1505>
##$DFORMAT= <normdp>
##$LAYOUT= <+/1D_H.xwp>
##$LFORMAT= <normlp>
##$PFORMAT= <normpl>
##$SURQMSG= 1
$$ End of Bruker specific parameters
$$ ---------------------------------
##NTUPLES= NMR SPECTRUM
##VAR_NAME=  FREQUENCY,     SPECTRUM/REAL,   SPECTRUM/IMAG
##SYMBOL=    X,             R,               I
##VAR_TYPE=  INDEPENDENT,   DEPENDENT,       DEPENDENT
##VAR_FORM=  AFFN,          ASDF,            ASDF
##VAR_DIM=   131072,        131072,          131072
##UNITS=     HZ,            ARBITRARY UNITS, ARBITRARY UNITS
##FACTOR=    0.0627417313425164, 1,          1
##FIRST=     8223.62146879497, -1296,        -61743
##LAST=      0,             513,             -62720
##MIN=       0,             -17829,          0
##MAX=       8223.62146879497, 391958934,    0
$$ Real data points
##PAGE= N=1
##DATA TABLE= (X++(R..R)), XYDATA
$$ [...]
$$ plain form
63917 4132655 3948157 3750411 3544239 3333839 3122525 2913192 2708735 2511859 2324726
63908 2324726 2149006 1985964 1836235 1699804 1576444 1465913 1367525 1279984 1202118 1133510
63898 1133510 1073945 1022476 977600 938224 903860 873910 847396 823591 802382 783764 767379
63887 767379 752767 739626 727487 715536 703243 690976 679578 669465 660607 653204 647817 644702
63875 644702 643580 644411 647976 655237 666325 680534 697147 715772 735977 757284 779771 804133
63863 804133 830736 858950 887738 916518 944979 972431 998035 1021534 1043048 1062105 1077593
63852 1077593 1088799 1095850 1098939 1097877 1092767 1084423 1073439 1059345 1041371 1019660 995083 968142
63840 968142 938917 907947 876298 844589 812643 780288 747888 715787 683865 652091 621138
$$ packed form
63917D132655j84498j97746k06172k10400k11314k09333k04457j96876j87133
63908B324726j75720j63042j49729j36431j23360j10531r8388q7541p7866o8608
63898A133510n9565n1469m4876l9376l4364k9950k6514k3805k1209j8618j6385
63887G67379j4612j3141j2139j1951j2293j2267j1398j0113q858p403n387l115
63875F44702j122Q31L565P261J1088J4209J6613J8625K0205K1307K2487K4362
63863H04133K6603K8214K8788K8780K8461K7452K5604K3499K1514J9057J5488
63852A077593J1206P051L089j062n110q344j0984j4094j7974k1711k4577k6941
63840I68142k9225l0970l1649l1709l1946l2355l2400l2101l1922l1774l0953
$$ plain form
63829 621138 591976 565025 540040 516648 494670 474030 454672 436635 420084 405207 392032
63818 392032 380246 369275 358780 349078 340748 333703 327016 319894 312600 306117 301007 296893 293004
63805 293004 289014 285257 282228 279958 277987 275934 273876 271975 269930 267250 264041 261073 258886 257180
63791 257180 255270 252775 249728 246404 243341 241121 239710 238280 236092 233358 230880 229065 227737 226717
63777 226717 226057 225779 225836 226271 227014 227618 227733 227752 228378 229507 230169 229715 228479 227121 225984 225369 225672 226677
63759 226677 227310 226804 225709 225051 224875 224474 223811 223673 224267 224625 223843 222268 221010 220830 221909 224150 226982
63742 226982 229227 229990 229749 230018 231836 234914 238262 241167 243450 245275 247001 249064 251731 254992 258685
63727 258685 262543 266156 269252 272137 275560 279903 284760 289432 293598 297298 300625 303816 307323 311295
$$ packed form
63829F21138k9162k6951k4985k3392k1978k0640j9358j8037j6551j4877j3175
63818C92032j1786j0971j0495r702q330p045o687p122p294o483n110m114l889
63805B93004l990l757l029k270j971k053k058j901k045k680l209k968k187j706
63791B57180j910k495l047l324l063k220j411j430k188k734k478j815j328j020
63777B26717o60k78N7M35P43O04J15J9O26J129O62m54j236j358j137o15L03J005
63759B26677O33n06j095o58j76m01o63j38N94L58p82j575j258j80J079K241K832
63742B26982K245P63k41K69J818L078L348K905K283J825J726K063K667L261L693
63727B58685L858L613L096K885L423M343M857M672M166L700L327L191L507L972
$$ plain form
63713 311295 315083 317729 318939 319144 318670 317365 315137 312265 308975 305250 301422 298400 296710 295616 293867
63698 293867 291192 288539 286847 286174 286119 286527 287527 289268 291905 295488 299628 303589 307035 310391 314188
63683 314188 318287 322110 325341 327942 329677 330222 329776 329063 328576 328247 328021 328304 329508 331395 333232 334511
63667 334511 335326 336204 337678 339885 342323 344132 344828 344628 343881 342368 339482 335026 329587 324077 319097
63652 319097 314702 310561 306315 301897 297501 293254 289234 285979 284507 285231 287046 288200 288150 287906 288403
63637 288403 289294 289844 290329 291784 294626 298290 302208 306458 311317 316704 322345 328175 334330 340962 348193
63622 348193 356046 364277 372547 380942 390161 400983 413591 427553 442324 457675 473774 491093
63610 491093 510339 532305 557590 586206 617428 650154 683551 717222 750590 782321 810696
$$ packed form
63713C11295L788K646J210K05m74j305k228k872l290l725l828l022j690j094j749
63698B93867k675k653j692o73n5M08J000J741K637L583M140L961L446L356L797
63683C14188M099L823L231K601J735N45m46p13m87l29k26K83J204J887J837J279
63667C34511Q15Q78J474K207K438J809O96k00p47j513k886m456n439n510m980
63652C19097m395m141m246m418m396m247m020l255j472P24J815J154n0k44M97
63637B88403Q91N50M85J455K842L664L918M250M859N387N641N830O155O632P231
63622C48193P853Q231Q270Q395R219J0822J2608J3962J4771J5351J6099J7319
63610D91093J9246K1966K5285K8616L1222L2726L3397L3671L3368L1731K8375
$$ plain form
63599 810696 834465 853049 866099 873494 875977 875236 872888 869579 865352 860471 855338 849746 842765 833446
63585 833446 821176 805406 785706 762504 737337 711868 686801 662141 638340 616547 597556
63574 597556 580998 565961 552154 540102 530361 523014 517953 515134 514323 514920 516398 518743 522240 526994
63560 526994 532931 540051 548271 557096 565927 574813 584516 595754 608716 623466 640440 660317 683663
63547 683663 710889 742231 777521 816257 858087 902672 948419 991613 1027620 1053339 1068356
63536 1068356 1074010 1072105 1064750 1054633 1044419 1035608 1028146 1021211 1014156 1006665 998225 987759 973941
63523 973941 955867 933359 906681 876262 842863 807801 772565 738111 704731 672658 642517
63512 642517 614969 590082 567307 546098 526418 508628 492975 479211 466730 455070 444275
$$ packed form
63599H10696K3769J8584J3050P395K483p41k348l309m227m881n133n592o981r319
63585H33446j2270j5770j9700k3202k5167k5469k5067k4660k3801k1793j8991
63574E97556j6558j5037j3807j2052r741p347n061k819q11N97J478K345L497M754
63560E26994N937P120Q220Q825Q831Q886R703J1238J2962J4750J6974J9877K3346
63547F83663K7226L1342L5290L8736M1830M4585M5747M3194L6007K5719J5017
63536A068356N654j905p355j0117j0214q811p462o935p055p491q440j0466j3818
63523I73941j8074k2508k6678l0419l3399l5062l5236l4454l3380l2073l0141
63512F42517k7548k4887k2775k1209j9680j7790j5653j3764j2481j1660j0795
$$ plain form
63501 444275 434722 426581 419493 412844 406341 400326 395467 392108 389926 388187 386270 383875 380974 377867
63487 377867 375210 373545 372692 372020 371506 372007 374067 376910 379308 381186 383627 387315 391791 396365 400970
63472 400970 405626 409701 412341 413375 413241 412189 410028 406607 402115 396900 391282 385621 380327 375727
63458 375727 371963 368952 366449 364324 362852 362493 363323 364976 367229 370233 373938 377716 381027 384120 387613
63443 387613 391654 396066 401117 407544 415841 426146 438884 454925 474888 498747 526222 557087
63431 557087 590764 625894 660526 692501 719680 740427 754392 762729 767325 769946 772104 775295
63419 775295 780995 790540 805112 825465 851414 881861 915575 951662 988993 1025550 1058818 1086756
63407 1086756 1108180 1122611 1130442 1133131 1132549 1129788 1124915 1117946 1109627 1100906 1091866 1081426 1068025
$$ packed form
63501D44275r553q141p088o649o503o015m859l359k182j739j917k395k901l107
63487C77867k657j665q53o72n14N01K060K843K398J878K441L688M476M574M605
63472D00970M656M075K640J034j34j052k161l421m492n215n618n661n294m600
63458C75727l764l011k503k125j472l59Q30J653K253L004L705L778L311L093L493
63443C87613M041M412N051O427Q297J0305J2738J6041J9963K3859K7475L0865
63431E57087L3677L5130L4632L1975K7179K0747J3965Q337M596K621K158L191
63419G75295N700R545J4572K0353K5949L0447L3714L6087L7331L6557L3268K7938
63407A086756K1424J4431P831K689n82k761m873o969q319q721r040j0440j3401
$$ plain form
63394 1068025 1050446 1028182 1001373 970648 937012 901722 866039 830915 796902 764386 733804
63383 733804 705608 680083 657291 637093 619105 602830 588064 575183 564843 557390 552634 550083
63371 550083 549249 549878 552130 556525 563411 572476 583027 594755 607979 623097 640146 659126 680502
63358 680502 705000 732923 763873 797219 832662 870247 909849 950682 991247 1029593 1063661
63347 1063661 1091639 1112497 1126317 1133980 1136339 1133919 1127567 1119023 1110247 1102082 1093844 1084285 1072623
63334 1072623 1058583 1041848 1021851 998033 970205 938842 905154 870656 836527 803511 772516
63323 772516 744894 721800 703503 689707 680362 675580 674548 674919 673617 668257 657880 642764 623981
63310 623981 603052 581611 560923 541549 523449 506458 490692 476502 464102 453318 443736 435003
$$ packed form
63394A068025j7579k2264k6809l0725l3636l5290l5683l5124l4013l2516l0582
63383G33804k8196k5525k2792k0198j7988j6275j4766j2881j0340p453m756k551
63371E50083q34O29K252M395O886R065J0551J1728J3224J5118J7049J8980K1376
63358F80502K4498K7923L0950L3346L5443L7585L9602M0833M0565L8346L4068
63347A063661K7978K0858J3820P663K359k420o352q544q776q165q238r559j1662
63334A072623j4040j6735j9997k3818k7828l1363l3688l4498l4129l3016l0995
63323G72516k7622k3094j8297j3796r345m782j032L71j302n360j0377j5116j8783
63310F23981k0929k1441k0688j9374j8100j6991j5766j4190j2400j0784r582q733
$$ plain form
63298 435003 426932 419406 412343 405804 400080 395563 392426 390256 388028 384673 379895 374478 369652 366114
63284 366114 363634 361543 359427 357358 355563 354019 352428 350581 348675 347166 346297 345875 345545 345156 344743
63269 344743 344297 343739 343115 342605 342327 342256 342374 342790 343630 344857 346225 347439 348404 349436 351168 354126 358343
63252 358343 363427 368922 374441 379531 383753 387133 390453 394829 400907 408480 416877 425635 434826 444831
63238 444831 455966 468384 482243 497780 515089 533961 554054 575169 597226 620033 643296
63227 643296 666857 690699 714646 738298 761413 784211 807126 830395 854165 878891 905184
63216 905184 932975 961007 987450 1011091 1031833 1050021 1065447 1077100 1083773 1084754 1079965 1069651
63204 1069651 1054148 1033943 1009805 982719 953668 923478 892886 862741 834086 807950 784983
$$ packed form
63298D35003q071p526p063o539n724m517l137k170k228l355m778n417m826l538
63284C66114k480k091k116k069j795j544j591j847j906j509q69m22l30l89m13
63269C44743m46n58o24n10k78p1J18M16Q40J227J368J214R65J032J732K958M217
63252C58343N084N495N519N090M222L380L320M376O078P573Q397Q758R191J0005
63238D44831J1135J2418J3859J5537J7309J8872K0093K1115K2057K2807K3263
63227F43296K3561K3842K3947K3652K3115K2798K2915K3269K3770K4726K6293
63216I05184K7791K8032K6443K3641K0742J8188J5426J1653O673R81m789j0314
63204A069651j5503k0205k4138k7086k9051l0190l0592l0145k8655k6136k2967
$$ plain form
63193 784983 765284 748599 734683 723485 715091 709615 707210 708118 712606 720705 731949 745438 760356
63180 760356 776421 793727 812139 831165 850535 870619 891898 914139 936491 958358 979682
63169 979682 1000280 1019428 1036441 1051312 1064222 1074593 1081089 1082520 1078309 1068127 1051754 1029650
63157 1029650 1003254 974164 943166 910381 876228 841713 807737 774586 742371 711632 683164
63146 683164 657376 634129 613128 594182 577100 561610 547535 534836 523384 512928 503456 495439
63134 495439 489407 485224 481947 478507 474531 470558 467504 465899 465566 466006 467019 468844 471722 475453 479486
63119 479486 483275 486524 489343 492310 496128 500936 506104 511001 515674 520341 524443 526925 527609 527687 528543
63104 528543 530505 532974 535289 537051 538071 538570 539122 539884 540184 539488 538591 539049 541400 544617 547407 549355
$$ packed form
63193G84983j9699j6685j3916j1198q394n476k405R08M488Q099J1244J3489J4918
63180G60356J6065J7306J8412J9026J9370K0084K1279K2241K2352K1867K1324
63169I79682K0598J9148J7013J4871J2910J0371O496J431m211j0182j6373k2104
63157A029650k6396k9090l0998l2785l4153l4515l3976l3151l2215l0739k8468
63146F83164k5788k3247k1001j8946j7082j5490j4075j2699j1452j0456r472q017
63134D95439o032m183l277l440l976l973l054j605l33M40J013J825K878L731M033
63119D79486L789L249K819K967L818M808N168M897M673M667M102K482O84P8Q56
63104E28543J962K469K315J762J020M99N52P62L00o96q97M58K351L217K790J948
$$ plain form
63088 549355 550635 551384 551831 552454 553409 554185 554337 554296 554890 556328 558223 560465 563473 567576 572655 578404
63072 578404 584497 590574 596622 603442 612119 622803 634524 646447 658778 672132 686612 702067
63060 702067 718880 737797 759152 782824 808900 837816 869843 904906 942952 984013 1027885
63049 1027885 1074355 1123839 1177138 1234085 1292930 1351601 1409289 1466395 1523326 1580064 1636774
63038 1636774 1694031 1752244 1811352 1871266 1932090 1993534 2054442 2113231 2168560 2219302 2264062
63027 2264062 2301093 2328565 2344742 2348233 2338541 2316331 2282741 2238508 2184171 2121216 2052477 1981061
63015 1981061 1909052 1837510 1767502 1700763 1639286 1584494 1536861 1496317 1462874 1436817 1418279
63004 1418279 1406825 1401787 1402945 1410541 1424420 1443507 1466439 1492487 1521468 1552934 1586027 1620231
$$ packed form
63088E49355J280P49M47O23R55P76J52m1N94J438J895K242L008M103N079N749
63072E78404O093O077O048O820Q677J0684J1721J1923J2331J3354J4480J5455
63060G02067J6813J8917K1355K3672K6076K8916L2027L5063L8046M1061M3872
63049A027885M6470M9484N3299N6947N8845N8671N7688N7106N6931N6738N6710
63038A636774N7257N8213N9108N9914O0824O1444O0908N8789N5329N0742M4760
63027B264062L7031K7472J6177L491r692k2210l3590m4233n4337o2955o8739p1416
63015A981061p2009p1542p0008o6739o1477n4792m7633m0544l3443k6057j8538
63004A418279j1454n038J158P596J3879J9087K2932K6048K8981L1466L3093L4204
$$ plain form
62992 1620231 1655737 1692686 1730389 1767776 1804480 1840980 1877563 1913413 1946839 1976092 1999722
62981 1999722 2016395 2024810 2023977 2013477 1993385 1964030 1925865 1879531 1826002 1766725 1703509 1638097
62969 1638097 1571722 1505216 1439610 1376383 1316876 1261519 1209882 1161454 1116109 1073872 1034685
62958 1034685 998586 965755 936028 908619 882741 858366 835878 815028 794828 774679 755054
62947 755054 736643 719249 702110 685086 668836 653733 639255 624807 610660 597590 585762
62936 585762 574547 563438 552710 542986 534458 526837 519913 513808 508701 504572 501381 499256 498222
62923 498222 497735 496806 494774 491918 489105 486919 485293 483923 482715 481685 480655 479348 477697 475853 473948
62908 473948 472044 470294 468833 467516 466025 464349 462786 461307 459284 456270 452822 449989 448009 446042
$$ packed form
62992A620231L5506L6949L7703L7387L6704L6500L6583L5850L3426K9253K3630
62981A999722J6673Q415q33j0500k0092k9355l8165m6334n3529n9277o3216o5412
62969A638097o6375o6506o5606o3227n9507n5357n1637m8428m5345m2237l9187
62958A034685l6099l2831k9727k7409k5878k4375k2488k0850k0200k0149j9625
62947G55054j8411j7394j7139j7024j6250j5103j4478j4448j4147j3070j1828
62936E85762j1215j1109j0728r724q528p621o924o105n107m129l191k125j034
62923D98222m87r29k032k856k813k186j626j370j208j030j030j307j651j844j905
62908D73948j904j750j461j317j491j676j563j479k023l014l448k833j980j967
$$ plain form
62894 446042 443373 440425 438226 437223 436990 436890 436565 435894 435005 434384 434551 435434 436429 437246 438346 440212 442482
62877 442482 444237 444988 445044 444996 445242 445949 446959 447629 447195 445644 443943 443074 443017 442946 442244 441016 439702 438578
62859 438578 437698 437062 436686 436661 437161 438283 439806 441214 442002 441926 441082 439916 439060 438914 439348 439981 440665 441415
62841 441415 441930 441670 440562 439257 438393 437954 437636 437438 437409 437129 436127 434752 433938 433940 433958 433385 432849 433413 435082
62822 435082 436741 437552 437887 438765 440818 443942 447552 450946 453740 456310 459630 464359 470149 476111 481835
62807 481835 487622 493742 499915 505747 511381 517391 524192 531839 540362 549957 560784 572794 585801
62794 585801 599567 613793 628293 643337 659631 677832 698238 721119 747083 776799 810457
62783 810457 847965 889733 936959 990928 1052191 1120504 1195292 1275921 1361707 1451981 1546133
$$ packed form
62894D46042k669k948k199j003k33j00l25o71q89o21J67Q83R95Q17J100J866K270
62877D42482J755P51N6m8K46P07J010O70m34j551j701q69n7p1p02j228j314j124
62859D38578q80o36l76k5N00J122J523J408P88p6q44j166q56j46M34O33O84P50
62841D41415N15k60j108j305q64m39l18j98k9k80j002j375q14KJ8n73n36N64J669
62822D35082J659Q11L35Q78K053L124L610L394K794K570L320M729N790N962N724
62807D81835N787O120O173N832N634O010O801P647Q523R595J0827J2010J3007
62794E85801J3766J4226J4500J5044J6294J8201K0406K2881K5964K9716L3658
62783H10457L7508M1768M7226N3969O1263O8313P4788Q0629Q5786R0274R4152
$$ plain form
62772 1546133 1643276 1741707 1838783 1931460 2016941 2092850 2157014 2207392 2242368 2261051 2263243
62761 2263243 2249263 2220004 2177113 2122712 2058694 1986453 1907503 1824129 1739006 1654155 1570542
62750 1570542 1488599 1408686 1331048 1256019 1184639 1118506 1058469 1003742 952895 905541 862440
62739 862440 824072 789794 758557 729829 703586 679944 659150 641449 626505 613240 600695
62728 600695 588870 578388 569559 562207 556194 551590 548400 546563 546258 547703 550584 554089 557737 561862
62714 561862 567128 573825 581848 591144 601987 614912 630547 649343 671392 696567 724911 756774
62702 756774 792570 832643 877408 927279 982272 1041897 1105695 1173655 1245852 1321825 1400573
62691 1400573 1481019 1562163 1642698 1720623 1793238 1857472 1910494 1950382 1976293 1987970 1985260
$$ packed form
62772A546133R7143R8431R7076R2677Q5481P5909O4164N0378L4976J8683K192
62761B263243j3980k9259m2891n4401o4018p2241p8950q3374q5123q4851q3613
62750A570542q1943p9913p7638p5029p1380o6133o0037n4727n0847m7354m3101
62739H62440l8368l4278l1237k8728k6243k3642k0794j7701j4944j3265j2545
62728F00695j1825j0482q829p352o013m604l190j837l05J445K881L505L648M125
62714E61862N266O697Q023R296J0843J2925J5635J8796K2049K5175K8344L1863
62702G56774L5796M0073M4765M9871N4993N9625O3798O7960P2197P5973P8748
62691A400573Q0446Q1144Q0535P7925P2615O4234N3022L9888K5911J1677k710
$$ plain form
62680 1985260 1968321 1938099 1896181 1844160 1783393 1715349 1641848 1564888 1486465 1408591 1333094
62669 1333094 1261108 1192794 1127724 1065590 1006665 951729 901567 856353 815512 778267 744205
62658 744205 713224 685145 659753 637058 617066 599280 582843 567243 552503 538639 525453
62647 525453 512939 501346 490599 480285 470498 462123 455772 451028 447269 444696 443661 443436 442672 441043
62633 441043 439486 438750 438602 438628 438833 438929 437969 435478 432428 430239 429113 428090 426542 424867 423704 423221
62617 423221 423444 424693 427256 430847 434718 438266 441424 444569 448205 452680 458119 464521 471869 480078
62603 480078 489005 498750 509954 523516 539855 558552 578966 601222 626450 655926 690072 728400
62591 728400 770314 815503 863353 912339 960547 1006694 1050163 1090013 1124557 1152187 1172097
$$ packed form
62680A985260j6939l0222m1918n2021o0767o8044p3501p6960p8423p7874p5497
62669A333094p1986o8314o5070o2134n8925n4936n0162m5214m0841l7245l4062
62658G44205l0981k8079k5392k2695j9992j7786j6437j5600j4740j3864j3186
62647E25453j2514j1593j0747j0314r787q375o351m744l759k573j035k25p64j629
62633D41043j557p36j48K6K05R6r60k491l050k189j126j023j548j675j163m83
62617D23221K23J249K563L591L871L548L158L145L636M475N439O402P348Q209
62603D80078Q927R745J1204J3562J6339J8697K0414K2256K5228K9476L4146L8328
62591G28400M1914M5189M7850M8986M8208M6147M3469L9850L4544K7630J9910
$$ plain form
62580 1172097 1183874 1186900 1180851 1166547 1145651 1119527 1088899 1054598 1017915 979920 940944 901178
62568 901178 861471 823114 786927 752900 720701 690307 662020 636123 612647 591461 572461
62557 572461 555569 540559 527083 514948 504233 494980 486895 479550 472726 466326 460180 454366 449558
62544 449558 446480 444869 443633 442271 441571 442408 444341 446081 447099 447975 449117 449946 449707 448640 447843 448257
62528 448257 450166 453506 458144 463835 470332 477781 486823 498037 511426 526632 543603 562797 584737
62515 584737 609668 637820 669712 705770 745670 788432 833243 879839 927821 975884 1022148
62504 1022148 1065200 1104461 1139457 1169110 1191998 1207182 1214525 1214307 1206915 1193058 1174059 1151600
62492 1151600 1127086 1101465 1075736 1051407 1030138 1012927 999834 990551 985123 984087 988086 997423
$$ packed form
62580A172097J1777L026o049j4304k0896k6124l0628l4301l6683l7995l8976l9766
62568I01178l9707l8357l6187l4027l2199l0394k8287k5897k3476k1186j9000
62557E72461j6892j5010j3476j2135j0715r253q085p345o824o400o146n814m808
62544D49558l078j611j236j362p00Q37J933J740J018Q76J142Q29k39j067p97M14
62528D48257J909L340M638N691O497P449R042J1214J3389J5206J6971J9194K1940
62515E84737K4931K8152L1892L6058L9900M2762M4811M6596M7982M8063M6264
62504A022148M3052L9261L4996K9653K2888J5184P343k18p392j3857j8999k2459
62492A151600k4514k5621k5729k4329k1269j7211j3093r283n428j036L999R337
$$ plain form
62480 997423 1011927 1031132 1054664 1082433 1114314 1149535 1186351 1222360 1255161 1282963 1304918
62469 1304918 1320986 1331213 1334940 1330817 1317684 1295388 1264817 1227469 1185085 1139241 1090912 1040589
62457 1040589 989037 937708 888095 840906 796285 754603 716515 682299 651765 624949 602328
62446 602328 584066 569446 557422 547439 539412 533122 528125 524228 521745 521098 522230 524423 526666 528287
62432 528287 529299 530035 530472 530060 528251 524990 520579 515289 509325 502969 496478 489858 482904 475495 467755
62417 467755 459972 452486 445618 439624 434705 430971 428211 425704 422560 418517 414243 410657 408042 405967
62403 405967 403913 401701 399460 397534 396430 396549 397796 399625 401546 403463 405455 407408 409005 410075
62389 410075 410839 411741 413023 414472 415706 416729 418132 420662 424635 429738 435290 440692 445825 451105 457006
$$ packed form
62480I97423J4504J9205K3532K7769L1881L5221L6816L6009L2801K7802K1955
62469A304918J6068J0227L727m123j3133k2296l0571l7348m2384m5844m8329n0323
62457A040589n1552n1329m9613m7189m4621m1682l8088l4216l0534k6816k2621
62446F02328j8262j4620j2024r983q027o290m997l897k483o47J132K193K243J621
62432E28287J012P36M37m12j809l261m411n290n964o356o491o620o954p409p740
62417D67755p783p486o868n994m919l734k760k507l144m043m274l586k615k075
62403D05967k054k212k241j926j104J19J247J829J921J917J992J953J597J070
62389D10075P64R02J282J449J234J023J403K530L973N103N552N402N133N280N901
$$ plain form
62374 457006 463513 470306 477495 485755 495473 506162 517148 528604 541418 556165 572672 590558
62362 590558 609802 630829 654419 681519 712743 748102 787613 831991 882083 937498 996441
62351 996441 1057057 1118296 1179161 1237776 1291689 1338714 1377147 1405772 1424409 1434172 1436520 1432088
62339 1432088 1420771 1402641 1378181 1347834 1312025 1271691 1228279 1183191 1137674 1093159 1051079
62328 1051079 1012149 976227 942983 912332 884246 858698 835867 815769 797431 779058 759473
62317 759473 739023 718692 698769 678861 658815 638991 619775 601363 584002 567964 553285
62306 553285 539923 528125 518197 509898 502519 495637 489368 483787 478655 473950 470155 467566 465615 463424
62292 463424 460927 458965 458297 458889 460251 462049 464185 466601 469309 472508 476422 481035 486106 491354 496537
$$ packed form
62374D57006O507O793P189Q260R718J0689J0986J1456J2814J4747J6507J7886
62362E90558J9244K1027K3590K7100L1224L5359L9511M4378N0092N5415N8943
62351I96441O0616O1239O0865N8615N3913M7025L8433K8625J8637R763K348m432
62339A432088j1317j8130k4460l0347l5809m0334m3412m5088m5517m4515m2080
62328A051079l8930l5922l3244l0651k8086k5548k2831k0098j8338j8373j9585
62317G59473k0450k0331j9923j9908k0046j9824j9216j8412j7361j6038j4679
62306E53285j3362j1798r928q299p379o882o269n581n132m705l795k589j951k191
62292D63424k497j962o68N92J362J798K136K416K708L199L914M613N071N248N183
$$ plain form
62277 496537 501398 505703 509362 512518 515656 519590 525081 532229 540424 549174 558805 570039 583003 597174
62263 597174 612355 629214 648665 671173 696970 726519 760244 798105 840025 886658 939053
62252 939053 997304 1059940 1124756 1189817 1253348 1313089 1366436 1411342 1446875 1472919 1489649
62241 1489649 1497432 1496910 1488748 1473095 1449426 1417207 1376792 1329573 1277232 1221139 1162584 1103271
62229 1103271 1045068 989330 936785 888073 843915 804570 769479 737736 708758 682365 658546
62218 658546 637367 618907 602946 588863 576057 564348 553798 544351 535982 528968 523587 519546
62206 519546 516130 512954 510315 508767 508690 510306 513753 518935 525540 533399 542569 552894 563697 574227
62192 574227 584299 594267 604487 615077 626132 637785 649896 661867 672966 682817 691580 699749
$$ packed form
62277D96537M861M305L659L156L138L934N491P148Q195Q750R631J1234J2964J4171
62263E97174J5181J6859J9451K2508K5797K9549L3725L7861M1920M6633N2395
62252I39053N8251O2636O4816O5061O3531N9741N3347M4906L5533K6044J6730
62241A489649P783n22q162j5653k3669l2219m0415m7219n2341n6093n8555n9313
62229A103271n8203n5738n2545m8712m4158l9345l5091l1743k8978k6393k3819
62218F58546k1179j8460j5961j4083j2806j1709j0550r447q369p014n381m041
62206E19546l416l176k639j548p7J616L447N182O605P859R170J0325J0803J0530
62192E74227J0072R968J0220J0590J1055J1653J2111J1971J1099R851Q763Q169
$$ plain form
62180 699749 707770 715652 722757 728086 731039 731961 731893 731801 732218 733604 736722 742339 750722 761775 775801
62165 775801 793855 817182 846395 881244 920913 964225 1009588 1055033 1098471 1137991 1172081
62154 1172081 1199877 1221287 1236726 1246559 1250760 1249096 1241542 1228458 1210328 1187339 1159325 1126346
62142 1126346 1089476 1050867 1012780 976481 942159 909805 879919 853311 830509 811490 795814
62131 795814 782768 771607 761953 753995 748089 744122 741497 739823 739407 740839 744172 748757 753972 759985
62117 759985 767603 777272 788196 798504 806392 811171 813248 813281 811666 808950 806278 804766 804264 803175
62103 803175 799813 793767 785751 776594 766932 757654 749898 744366 741067 739870 740778 743432 746955 750825
62089 750825 755498 761608 768782 775949 782708 789753 797866 807057 816876 827098 837874 849603 862838
$$ packed form
62180F99749Q021P882P105N329K953R22o8r2M17J386L118N617Q383J1053J4026
62165G75801J8054K3327K9213L4849L9669M3312M5363M5445M3438L9520L4090
62154A172081K7796K1410J5439R833M201j664p554j3084j8130k2989k8014l2979
62142A126346l6870l8609l8087l6299l4322l2354k9886k6608k2802j9019j5676
62131G95814j3046j1161r654p958n906l967k625j674m16J432L333M585N215O013
62117G59985P618R669J0924J0308P888M779K077L3j615k716k672j512n02j089
62103H03175l362o046q016r157r662r278p756n532l299j197R08K654L523L870
62089G50825M673O110P174P167O759P045Q113R191R819J0222J0776J1729J3235
$$ plain form
62076 862838 877949 894660 912313 930748 950482 971757 993950 1016335 1038938 1062084 1085554
62065 1085554 1109014 1133091 1159119 1187659 1217934 1248960 1280594 1313067 1345888 1377554 1406053
62054 1406053 1429499 1446788 1458147 1464806 1467752 1466891 1461560 1451341 1435932 1414708 1387262 1354318
62042 1354318 1317395 1277522 1234947 1190211 1144724 1099826 1055818 1012452 970013 929343 891087
62031 891087 855454 822618 792782 765809 741249 718828 698574 680448 664194 649623 636577
62020 636577 624500 612471 599975 587396 575497 564636 554715 545607 537213 529281 521571 514226 507641
62007 507641 501968 497099 493188 490763 490055 490498 491246 492069 493393 495473 497933 500277 502564 505252 508493
61992 508493 511890 514896 517125 518179 517633 515432 512105 508202 503639 497878 490713 482594 474175 465897
$$ packed form
62076H62838J5111J6711J7653J8435J9734K1275K2193K2385K2603K3146K3470
62065A085554K3460K4077K6028K8540L0275L1026L1634L2473L2821L1666K8499
62054A406053K3446J7289J1359O659K946q61n331j0219j5409k1224k7446l2944
62042A354318l6923l9873m2575m4736m5487m4898m4008m3366m2439m0670l8256
62031H91087l5633l2836k9836k6973k4560k2421k0254j8126j6254j4571j3046
62020F36577j2077j2029j2496j2579j1899j0861r921r108q394p932p710p345o585
62007E07641n673m869l911k425p08M43P48Q23J324K080K460K344K287K688L241
61992E08493L397L006K229J054n46k201l327l903m563n761p165q119q419q278
$$ plain form
61978 465897 458070 451076 445216 440467 436501 432948 429648 426765 424545 422852 421117 419046 417195 416348
61964 416348 416373 416272 415493 414581 414280 414541 414897 415286 415906 416589 417022 417446 418487 420288 422360 424379 426633
61947 426633 429565 433257 437566 442449 448078 454889 463563 474654 488086 503190 519253 535850 552705
61934 552705 569589 586424 603220 619845 636070 651823 667162 681948 695762 708081 718358
61923 718358 726131 731408 734786 736795 737229 735593 732021 727213 721593 715250 708740 703130 699068 696546
61909 696546 695892 698175 704123 713180 724130 736186 749028 762296 775515 788079 798848 806300 809626
61896 809626 809321 806214 800494 792221 782151 771123 759111 745794 731728 717935 704530 690849
61884 690849 676904 663650 651627 640323 629169 618222 607493 596463 584857 573239 562291
$$ packed form
61978D65897p827o994n860m749l966l553l300k883k220j693j735k071j851q47
61964D16348K5j01p79r12l01K61L56L89O20O83M33M24J041J801K072K019K254
61947D26633K932L692M309M883N629O811Q674J1091J3432J5104J6063J6597J6855
61934E52705J6884J6835J6796J6625J6225J5753J5339J4786J3814J2319J0277
61923G18358P773N277L378K009M34j636l572m808n620o343o510n610m062k522
61909F96546o54K283N948R057J0950J2056J2842J3268J3219J2564J0769P452L326
61896H09626l05l107n720q273j0070j1028j2012j3317j4066j3793j3405j3681
61884F90849j3945j3254j2023j1304j1154j0947j0729j1030j1606j1618j0948
$$ plain form
61873 562291 551942 541690 531330 521002 511014 502074 495207 490891 488529 487222 486751 487447 489456 492642
61859 492642 496918 502210 508297 515173 523378 533511 545626 559543 575600 594545 616677 641554
61847 641554 668553 697311 727479 758361 788929 818106 845052 869267 890336 907544 920057
61836 920057 927675 931098 931154 928100 922119 914156 905664 897651 890560 885034 882122 882629 886758 894458 905514
61821 905514 919054 933529 947561 960487 971796 980389 984810 984073 978011 966989 951483 931842
61809 931842 908354 881690 853254 824677 796806 769531 742699 716734 692150 669038 647511
61798 647511 628180 611501 596925 583411 570656 559118 548828 538951 528811 518802 509928 502745
61786 502745 496990 491920 486813 481468 476421 472387 469347 466556 463659 461240 459802 458632 456346 452479
$$ packed form
61873E62291j0349j0252j0360j0328r988q940o867m316k362j307m71O96K009L186
61859D92642M276N292O087O876Q205J0133J2115J3917J6057J8945K2132K4877
61847F41554K6999K8758L0168L0882L0568K9177K6946K4215K1069J7208J2513
61836I20057P618L423N6l054n981p963q492q013p091n526k912N07M129P700J1056
61821I05514J3540J4475J4032J2926J1309Q593M421p37o062j1022j5506j9641
61809I31842k3488k6664k8436k8577k7871k7275k6832k5965k4584k3112k1527
61798F47511j9331j6679j4576j3514j2755j1538j0290r877j0140j0009q874p183
61786E02745n755n070n107n345n047m034l040k791k897k419j438j170k286l867
$$ plain form
61772 452479 447951 443984 441099 439271 438480 438713 439693 440951 442152 443220 444264 445472 447014 448939 451170
61757 451170 453605 456148 458687 461197 463880 467025 470642 474332 477549 479979 481675 482881 483710 483893 482894
61742 482894 480389 476683 472584 468923 466168 464319 462959 461599 460205 459281 459241 459829 460466 461035 461929 463379
61726 463379 465173 467045 468933 470786 472551 474445 476793 479441 481763 483491 485096 487061 489247 491297
61712 491297 493286 495507 497869 499946 501391 501978 501472 499918 497850 495803 493706 491151 488073 484804 481599
61697 481599 478550 475812 473436 471077 468351 465508 463298 462067 461278 459925 457251 453256 448900 445648
61683 445648 444273 444152 444089 443609 442874 441589 439013 435224 431554 429238 428209 427674 427302 427285 427566 427661 427253
61666 427253 426570 426125 426214 426626 426781 426317 425556 425133 425148 425088 424664 424258 424322 424775 425305 425851 426392 426620 426290 425716
$$ packed form
61772D52479m528l967k885j828p91K33R80J258J201J068J044J208J542J925K231
61757D51170K435K543K539K510K683L145L617L690L217K430J696J206Q29J83r99
61742D82894k505l706m099l661k755j849j360j360j394r24m0N88O37N69Q94J450
61726D63379J794J872J888J853J765J894K348K648K322J728J605J965K186K050
61712D91297J989K221K362K077J445N87n06j554k068k047k097k555l078l269l205
61697D81599l049k738k376k359k726k843k210j231p89j353k674l995m356l252
61683D45648j375j21o3m80p35j285k576l789l670k316j029n35l72j7K81R5m08
61666D27253o83m45Q9M12J55m64p61m23J5o0m24m06O4M53N30N46N41K28l30n74
$$ plain form
61646 425716 425529 426080 427368 429329 431829 434518 437042 439393 441804 444405 447093 449561 451277 451759 451082
61631 451082 449843 448372 446329 443452 440302 437723 435790 433827 431333 428358 425097 421736 418752 416795
61617 416795 416033 415919 415738 415159 414292 413467 412947 412528 411458 409030 405279 400844 396293 391972 388301 385592
61601 385592 383425 380755 376898 372138 367244 362744 358720 354904 350755 345903 340765 336438 333700 332345
61587 332345 331631 331019 330187 328763 326536 323828 321179 318653 315804 312397 308921 306194 304509 303318 301848
61572 301848 300036 298638 298200 298100 297029 294556 291828 290471 291018 292654 294214 295089 295250 294869 294119 293215
61556 293215 292443 292093 292264 292733 293147 293388 293673 294270 295287 296745 298609 300545 301905 302255 301867 301467 301573
61539 301573 302260 303431 304966 306602 307940 308778 309317 309942 310877 312050 313187 313996 314374 314442 314311 313898 313131
$$ packed form
61646D25716j87N51J288J961K500K689K524K351K411K601K688K468J716M82o77
61631D51082j239j471k043k877l150k579j933j963k494k975l261l361k984j957
61617D16795p62j14j81n79q67q25n20m19j070k428l751m435m551m321l671k709
61601C85592k167k670l857m760m894m500m024l816m149m852n138m327k738j355
61587C32345p14o12q32j424k227k708k649k526k849l407l476k727j685j191j470
61572C01848j812j398m38j00j071k473k728j357N47J636J560Q75J61l81p50r04
61556B93215p72l50J71M69M14K41K85N97J017J458J864J936J360L50l88m00J06
61539C01573O87J171J535J636J338Q38N39O25R35J173J137Q09L78O8j31m13p67
$$ plain form
61522 313131 312287 311789 311599 311100 309791 307859 305885 304207 302912 302190 302163 302402 302192 301497 301139 301678 302553
61505 302553 302841 302511 302282 302376 302225 301500 300680 300214 299728 298655 297251 296308 296000 295613 294506 292895 291550
61488 291550 291052 291455 292406 293408 294170 294854 295888 297471 299309 300879 301905 302596 303485 304960 306908 308940
61472 308940 310950 313169 315536 317408 318269 318483 318864 319616 320211 320232 319839 319339 318808 318295 317919 317547 316779 315524
61454 315524 314230 313335 312862 312804 313485 315066 317018 318578 319632 320718 322195 323855 325369 326743 328132
61439 328132 329470 330492 331093 331586 332534 334237 336363 338232 339529 340583 341859 343404 344974 346408 347577
61424 347577 348197 348120 347719 347599 347953 348675 350098 353014 357567 362570 366423 368612 369935 371300 372742 373706
61408 373706 373912 373669 373460 373452 373381 372840 371649 369983 368078 365897 363326 360751 359071 358777 359242 359334 358695 357920
$$ packed form
61522C13131q44m98j90m99j309j932j974j678j295p22k7K39k10o95l58N39Q75
61505C02553K88l30k29R4j51p25q20m66m86j073j404r43l08l87j107j611j345
61488B91550m98M03R51J002P62O84J034J583J838J570J026O91Q89J475J948K032
61472C08940K010K219K367J872Q61K14L81P52N95K1l93n00n31n13l76l72p68j255
61454C15524j294q95m73n8O81J581J952J560J054J086J477J660J514J374J389
61439C28132J338J022O01M93R48J703K126J869J297J054J276J545J570J434J169
61424C47577O20p7m01j20L54P22J423K916M553N003L853K189J323J365J442R64
61408C73706K06k43k09qp1n41j191j666j905k181k571k575j680k94M65R2o39p75
$$ plain form
61390 357920 357482 357127 356654 356662 357820 359704 361098 361456 361424 361787 362528 363198 363634 363892 363894 363725 364008 365358 367477
61371 367477 369346 370440 371281 372560 374135 375263 375573 375378 375130 375070 375463 376707 378829 381154 382851 383759
61355 383759 384432 385528 387510 390798 395636 401639 407928 414039 420351 427360 434863 442219 449098 455547
61341 455547 461556 467032 472027 476553 480303 483097 485538 488673 492919 497737 502330 506175 508855 510048
61327 510048 509958 509296 508486 507240 505127 502231 499041 496081 493888 492969 493386 494604 496018 497455 499012 500745
61311 500745 502776 505434 508993 513516 519133 526186 534781 544479 554680 565119 575780 586646 597760
61298 597760 609113 620056 629241 635595 639182 640671 640289 637888 633800 628886 623618 617644 610410 601858
61284 601858 592450 582873 573854 565943 559223 553304 547666 542037 536583 531849 528334 525898 523847 521887
$$ packed form
61390C57920m38l55m73QJ158J884J394L58l2L63P41O70M36K58Kj69K83J350K119
61371C67477J869J094Q41J279J575J128L10j95k48o0L93J244K122K325J697R08
61355C83759O73J096J982L288M838O003O289O111O312P009P503P356O879O449
61341D55547O009N476M995M526L750K794K441L135M246M818M593L845K680J193
61327E10048r0o62q10j246k113k896l190k960k193r19M17J218J414J437J557J733
61311E00745K031K658L559M523N617P053Q595R698J0201J0439J0661J0866J1114
61298E97760J1353J0943R185O354L587J489l82k401m088m914n268n974p234q552
61284F01858r408r577r019p911o720n919n638n629n454m734l515k436k051j960
$$ plain form
61270 521887 520796 521676 524599 528394 531813 534487 536681 538487 539623 539980 540205 541581 545146 550903 558044
61255 558044 565913 574375 583134 591299 598123 603856 609302 614719 619629 623551 626348 627951 628380 628075 627597
61240 627597 626853 625099 621914 617776 613553 609863 607099 605550 605049 604774 603872 602359 601202 601425 603178
61225 603178 605713 608288 611021 614667 619559 625106 630508 635597 640736 646194 652040 658304 664777 670869
61211 670869 676144 680756 684882 688067 689831 690659 691537 692650 693421 693803 694523 695871 697316 698746 701173
61196 701173 705633 712118 720179 729878 741386 754196 767480 780911 794426 807440 818913 828108
61184 828108 834873 839400 842184 843991 845403 846514 847342 848190 849132 849509 848471 845840 842033 837364 831976
61169 831976 826263 820683 815207 809409 803055 796167 788568 779878 769997 759202 747801 735989 723960
$$ packed form
61270E21887j091Q80K923L795L419K674K194J806J136L57K25J376L565N757P141
61255E58044P869Q462Q759Q165O824N733N446N417M910L922K797J603M29l05m78
61240F27597p44j754l185m138m223l690k764j549n01k75r02j513j157K23J753
61225F03178K535K575K733L646M892N547N402N089N139N458N846O264O473O092
61211F70869N275M612M126L185J764Q28Q78J113P71L82P20J348J445J430K427
61196G01173M460O485Q061R699J1508J2810J3284J3431J3515J3014J1473R195
61184H28108O765M527K784J807J412J111Q28Q48R42L77j038k631l807m669n388
61169H31976n713n580n476n798o354o888p599q690r881j0795j1401j1812j2029
$$ plain form
61156 723960 711823 699483 686969 674744 663363 653054 644034 636928 632253 629608 628015 626905 626084
61143 626084 624903 622364 618208 613075 607324 600561 592771 585100 578809 573968 569918 566559 564396 563503
61129 563503 563299 563454 564384 566659 570358 575169 580790 587102 594291 602959 613795 626953 641967 658425
61115 658425 676460 696343 717876 740547 764123 788673 813966 839274 863961 887990 911619
61104 911619 934763 956908 977508 996206 1012772 1027095 1039184 1048894 1055618 1058570 1057472 1052729
61092 1052729 1044898 1034306 1021316 1006574 990607 973350 954427 933931 912644 891431 870566
61081 870566 849735 828611 807405 786836 767616 749999 733842 718892 704813 691157 677769
61070 677769 665252 654606 646269 639867 634972 631585 629567 628165 626658 625209 624542 624936 626051 627669
$$ packed form
61156G23960j2137j2340j2514j2225j1381j0309r020p106m675k645j593j110q21
61143F26084j181k539m156n133n751o763p790p671o291m841m050l359k163q93
61129E63503k04J55R30K275L699M811N621O312P189Q668J0836J3158J5014J6458
61115F58425J8035J9883K1533K2671K3576K4550K5293K5308K4687K4029K3629
61104I11619K3144K2145K0600J8698J6566J4323J2089R710O724K952j098m743
61092A052729p831j0592j2990j4742j5967j7257j8923k0496k1287k1213k0865
61081H70566k0831k1124k1206k0569j9220j7617j6157j4950j4079j3656j3388
61070F77769j2517j0646q337o402m895l387k018j402j507j449o67L94J115J618
$$ plain form
61056 627669 630078 633647 638445 644355 651237 658912 667269 676459 686780 698367 711167 725159 740380
61043 740380 756785 774356 793327 814123 837099 862367 889692 918399 947807 978091 1010418
61032 1010418 1045764 1083888 1123915 1165565 1209049 1254021 1299578 1345433 1392261 1440611 1490222
61021 1490222 1540810 1593020 1648306 1708314 1774614 1848386 1929878 2018543 2114172 2217889 2332224
61010 2332224 2460972 2609403 2784388 2994342 3249735 3564224 3955937 4449760 5080465
61001 5080465 5891666 6924896 8203480 9724575 11462538 13366825 15341463 17227270
60993 17227270 18828578 19992420 20687372 21015630 21150208 21254528 21439457 21754721 22178224
60984 22178224 22598039 22825234 22662681 21995706 20839651 19315690 17585841 15797266 14058207
$$ packed form
61056F27669K409L569M798N910O882P675Q357R190J0321J1587J2800J3992J5221
61043G40380J6405J7571J8971K0796K2976K5268K7325K8707K9408L0284L2327
61032A010418L5346L8124M0027M1650M3484M4972M5557M5855M6828M8350M9611
61021A490222N0588N2210N5286O0008O6300P3772Q1492Q8665R5629J03717J14335
61010B332224J28748J48431J74985K09954K55393L14489L91713M93823O30705
61001E080465Q11201J033230J278584J521095J737963J904287J974638J885807
60993A7227270J601308J163842O94952L28258J34578J04320J84929L15264M23503
60984B2178224M19815K27195j62553o66975j156055j523961j729849j788575j739059
$$ plain form
60975 14058207 12436572 10966570 9657988 8506479 7501525 6630254 5878974 5234301
60967 5234301 4683444 4213582 3811888 3466723 3168364 2908542 2680115 2477685 2297841
60958 2297841 2138114 1995882 1868561 1754426 1652783 1563472 1486233 1419984 1362392 1310501
60948 1310501 1262211 1216939 1174761 1135431 1098553 1064222 1032831 1004406 978505 954640 932481
60937 932481 911840 892714 875101 858512 842044 825341 809148 794460 781361 769208 757682
60926 757682 747018 737333 728336 719733 711363 702973 694423 686192 679063 673220 668105 663272 658792 654707
60912 654707 650791 647212 644810 644200 645031 646619 648944 652488 657394 663315 669934 677121 684753 692919 702244
60897 702244 713463 726660 741275 756777 772850 789008 804658 819728 834734 850024 865385
$$ packed form
60975A4058207j621635j470002j308582j151509j004954q71271p51280o44673
60967E234301n50857m69862m01694l45165k98359k59822k28427k02430j79844
60958B297841j59727j42232j27321j14135j01643q9311p7239o6249n7592n1891
60948A310501m8290m5272m2178l9330l6878l4331l1391k8425k5901k3865k2159
60937I32481k0641j9126j7613j6589j6468j6703j6193j4688j3099j2153j1526
60926G57682j0664r685q997q603q370q390q550q231p129n843n115m833m480m085
60912F54707l916l579k402o10Q31J588K325L544M906N921O619P187P632Q166R325
60897G02244J1219J3197J4615J5502J6073J6158J5650J5070J5006J5290J5361
$$ plain form
60886 865385 880618 896029 911977 928206 943936 958405 971089 981696 990362 997637 1003879 1008760
60874 1008760 1011707 1012723 1012305 1010584 1007024 1001169 993322 984219 974235 963219 950998 937745 923887
60861 923887 909871 896078 882679 869422 855680 840944 825243 808954 792326 775531 759202
60850 759202 744447 731896 720926 710238 699119 687758 676367 664613 652177 639441 627170
60839 627170 615727 604881 594203 583296 571811 559657 547196 534931 523084 511783 501465
60828 501465 492602 485062 478237 471953 466686 462587 458828 454433 449559 445408 442906 441843 441303 440533 439303
60813 439303 437776 436283 435102 434293 433821 433845 434627 436088 437674 438904 439896 441083 442552 443913 444822 445332
60797 445332 445644 445822 445847 445796 445792 445905 446176 446528 446551 445707 444001 442206 441066 440435 439532 437829 435243 431653
$$ packed form
60886H65385J5233J5411J5948J6229J5730J4469J2684J0607Q666P275O242M881
60874A008760K947J016m18j721l560n855p847r103r984j1016j2221j3253j3858
60861I23887j4016j3793j3399j3257j3742j4736j5701j6289j6628j6795j6329
60850G59202j4755j2551j0970j0688j1119j1361j1391j1754j2436j2736j2271
60839F27170j1443j0846j0678j0907j1485j2154j2461j2265j1847j1301j0318
60828E01465q863p540o825o284n267m099l759m395m874m151k502j063n40p70j230
60813D39303j527j493j181q09m72K4P82J461J586J230R92J187J469J361R09N10
60797D45332L12J78K5n1mJ13K71L52K3q44j706j795j140o31r03j703k586l590
$$ plain form
60779 431653 427004 422030 418114 415871 414310 411906 408258 404268 400914 398420 396517 394948 393524 392086
60765 392086 390591 389105 387639 386149 384658 383228 381830 380458 379233 378216 377211 376047 374947 374213
60751 374213 373669 372954 372427 373246 376186 380677 385311 389088 391921 394191 396215 398155 400096 402045 403839
60736 403839 405072 405172 403796 401240 398326 395691 393244 390470 387184 383905 381392 379861 378639 376626
60722 376626 373229 368856 364515 360982 358400 356424 354517 352193 349302 346137 343069 340174 337442 335125
60708 335125 333461 332095 330430 328608 327497 327401 327418 326594 325198 324202 323840 323480 322805 322293 322381 322808 323107 323249
60690 323249 323455 323724 323954 324301 325044 326201 327598 329242 331340 333925 336705 339353 341848 344457 347473
60675 347473 350946 354567 357848 360566 363134 366397 370969 376711 382853 388477 392924 395948 397752 398776
$$ packed form
60779D31653m649m974l916k243j561k404l648l990l354k494j903j569j424j438
60765C92086j495j486j466j490j491j430j398j372j225j017j005j164j100p34
60751C74213n44p15n27Q19K940M491M634L777K833K270K024J940J941J949J794
60736D03839J233J00j376k556k914k635k447k774l286l279k513j531j222k013
60722C76626l397m373m341l533k582j976j907k324k891l165l068k895k732k317
60708C35125j664j366j665j822j111r6J7q24j396r96l62l60o75n12Q8M27K99J42
60690C23249K06K69K30L47P43J157J397J644K098K585K780K648K495K609L016
60675C47473L473L621L281K718K568L263M572N742O142N624M447L024J804J024
$$ plain form
60661 398776 399312 399344 398953 398688 399148 400165 400879 400796 400351 400153 400106 399821 399547 400002 401335 402939 404331 405569
60643 405569 406580 406746 405613 403564 401358 399265 397017 394316 390959 386738 381716 376528 371981 368395
60629 368395 365604 363444 361809 360359 358699 356974 355840 355666 356012 356084 355538 354719 354262 354526 355265 355812 355730
60612 355730 355281 355083 355301 355409 354912 354108 353912 354898 356642 358129 358808 359083 359672 360668 361542 362006 362410 363147
60594 363147 364174 365434 367300 370041 373074 375368 376572 377238 377940 378620 378886 378482 377388 375906 374815
60579 374815 374991 376598 378908 381085 382865 384402 385925 387820 390648 394645 399452 404737 410883 418629
60565 418629 428089 438491 448920 458993 468734 478024 486265 492503 495860 496011 493354 488740 483086 477231
60551 477231 471933 467782 465073 463777 463650 464373 465813 468215 472059 477644 484969 494029 504884 517269
$$ packed form
60661C98776N36L2l91k65M60J017P14q3m45j98m7k85k74M55J333J604J392J238
60643D05569J011J66j133k049k206k093k248k701l357m221n022n188m547l586
60629C68395k791k160j635j450j660j725j134j74L46P2n46q19m57K64P39N47q2
60612C55730m49j98K18J08m97q04j96R86J744J487O79K75N89R96Q74M64M04P37
60594C63147J027J260J866K741L033K294J204O66P02O80K66m04j094j482j091
60579C74815J76J607K310K177J780J537J523J895K828L997M807N285O146P746
60565D18629R460J0402J0429J0073R741R290Q241O238L357J51k657m614n654n855
60551D77231n298m151k709j296j27P23J440K402L844N585P325R060J0855J2385
$$ plain form
60537 517269 530446 543748 557011 570098 582144 591853 598603 602862 605378 606329 605448 602649 598243
60524 598243 592816 587210 582383 578803 575944 572719 568549 563830 559364 555616 552738 551010 550801 551970
60510 551970 553586 554520 554447 554211 555154 558076 562896 569323 577660 588764 603259 621110 642146 666708
60496 666708 695507 728894 766555 807851 852027 897878 943510 986708 1025492 1058198 1083192
60485 1083192 1098821 1103786 1097567 1080690 1054703 1021764 983947 942843 899809 856366 814021 773712
60473 773712 735694 700067 667230 637736 611872 589491 570205 553610 539344 526997 516022
60462 516022 505861 496233 487222 479005 471549 464765 458772 453714 449270 444706 439647 434591 430342 426991
60448 426991 423758 419905 415643 411942 409517 408172 407158 405980 404697 403521 402361 400932 399229 397671
$$ packed form
60537E17269J3177J3302J3263J3087J2046R709O750M259K516R51q81k799m406
60524E98243n427n606m827l580k859l225m170m719m466l748k878j728k09J169
60510E51970J616R34p3k36R43K922M820O427Q337J1104J4495J7851K1036K4562
60496F66708K8799L3387L7661M1296M4176M5851M5632M3198L8784L2706K4994
60485A083192J5629M965o219j6877k5987l2939l7817m1104m3034m3443m2345m0309
60473G73712l8018l5627l2837k9494k5864k2381j9286j6595j4266j2347j0975
60462E16022j0161r628r011q217p456o784n993n058m444m564n059n056m249l351
60448D26991l233l853m262l701k425j345j014j178j283j176j160j429j703j558
$$ plain form
60434 397671 396692 396199 395595 394447 393071 392208 392104 392197 391942 391597 391754 392332 392721 392867 393448 394659 395618 395535
60416 395535 394880 394666 395041 395451 395879 396908 398502 399754 400217 400691 402179 404571 406868 408300 408815 408811 408900
60399 408900 409682 411284 413233 415093 417063 419580 422471 424948 426469 427314 428202 429592 431446 433554 435858
60384 435858 438386 440910 442999 444585 446249 448552 451197 453360 454824 456244 458191 460597 463395 466927
60370 466927 471136 474950 477368 478914 481180 484870 488955 491872 493013 492911 492497 492504 493244 494667 496673 499382
60354 499382 502890 506850 510699 514417 518703 524211 530882 538213 545899 553898 561955 569331 575114 578769
60340 578769 580386 580350 578767 575366 570133 563914 557994 553028 548615 544031 539123 534335 530017 526013 521915
60325 521915 517556 513158 509035 505219 501483 497693 494003 490687 487927 485873 484651 484185 484163 484462 485470
$$ packed form
60434C97671r79m93o04j148j376q63j04R3k55l45J57N78L89J46N81J211R59q3
60416C95535o55k14L75M10M28J029J594J252M63M74J488K392K297J432N15mQ9
60399D08900P82J602J949J860J970K517K891K477J521Q45Q88J390J854K108K304
60384D35858K528K524K089J586J664K303K645K163J464J420J947K406K798L532
60370D66927M209L814K418J546K266L690M085K917J141j02m14PP40J423K006K709
60354D99382L508L960L849L718M286N508O671P331P686P999Q057P376N783L655
60340E78769J617l6j583l401n233o219n920m966m413m584m908m788m318m004m098
60325E21915m359m398m123l816l736l790l690l316k760k054j222m66k2K99J008
$$ plain form
60310 485470 487737 491405 496279 502367 510090 520023 532708 548571 567565 588765 610617 631673 650867
60297 650867 667183 679456 686624 687893 682749 671332 655008 636118 616783 598101 580538 564662
60285 564662 551143 540319 531998 525570 520151 514952 509810 505198 501457 498279 495083 491614 487903 484048
60271 484048 480384 477480 475390 473197 469967 466064 462808 460726 458828 455892 451939 447986 444759 442170
60257 442170 439960 438295 437522 437539 437617 436902 435143 432966 431417 431189 432185 433712 434980 435523 435402 435106 435206
60240 435206 435977 437290 438735 439803 440117 439725 439195 439292 440423 442402 444651 446651 448318 450011 452034 454055
60224 454055 455310 455625 455909 457244 459673 462364 464860 467507 470644 474062 477580 481545 486269 491360 496192
60209 496192 500780 505671 511135 516992 523193 529992 537432 545072 552370 559042 565005 570323 575391 580761
$$ packed form
60310D85470K267L668M874O088P723R933J2685J5863J8994K1200K1852K1056J9194
60297F50867J6316J2273P168J269n144j1417j6324j8890j9335j8682j7563j5876
60285E64662j3519j0824q321o428n419n199n142m612l741l178l196l469l711l855
60271D84048l664k904k090k193l230l903l256k082j898k936l953l953l227k589
60257D42170k210j665p73J7P8p15j759k177j549k28R96J527J268N43j21k96J00
60240D35206P71J313J445J068L14l92n30R7J131J979K249K000J667J693K023K021
60224D54055J255L15K84J335K429K691K496K647L137L418L518L965M724N091M832
60209D96192M588M891N464N857O201O799P440P640P298O672N963N318N068N370
$$ plain form
60195 580761 586491 591853 596002 598825 600934 602890 604680 605922 606387 606221 605752 605176 604442 603416 601994
60180 601994 599998 597091 593035 588034 582618 577160 571665 566091 560666 555780 551681 548337 545449 542594
60166 542594 539565 536617 534149 532085 529875 527225 524424 521707 518810 515673 513242 512734 514113 515972
60152 515972 517179 518002 519337 521377 523573 525467 526924 527802 528091 528367 529461 531504 533813 535956 538445
60137 538445 542024 546661 551720 556872 562262 567858 573201 577921 582097 585869 589038 591301 592660 593333
60123 593333 593416 592983 592436 592460 593475 595283 597333 599348 601606 604588 608298 612082 615297 618061 620972 624032
60107 624032 626330 627086 626580 625684 624782 623702 622431 621177 619796 617796 615099 612235 609656 607378 605416
60092 605416 603976 602991 602124 601559 602174 604447 607739 611182 614733 618683 622523 625128 625935 625334 624074 622886
$$ packed form
60195E80761N730N362M149K823K109J956J790J242M65j66m69n76p34j026j422
60180F01994j996k907m056n001n416n458n495n574n425m886m099l344k888k855
60166E42594l029k948k468k064k210k650k801k717k897l137k431n08J379J859
60152E15972J207Q23J335K040K196J894J457Q78K89K76J094K043K309K143K489
60137E38445L579M637N059N152N390N596N343M720M176L772L169K263J359O73
60123E93333Q3m33n47K4J015J808K050K015K258K982L710L784L215K764K911L060
60107F24032K298P56n06q96r02j080j271j254j381k000k697k864k579k278j962
60092F05416j440r85q67n65O15K273L292L443L551L950L840K605Q07o01j260j188
$$ plain form
60076 622886 622429 622828 623263 622694 620933 618404 614957 609792 602639 594246 585528 576975 569031 562118 555854
60061 555854 549052 541139 533013 525922 519992 514446 508787 503118 497634 492522 488197 485008 482764 481027
60047 481027 479821 479604 480595 482547 485139 488267 491930 496098 500676 505495 510487 515959 522299 529190 535555
60032 535555 540668 544882 548721 551697 552819 552017 550236 548102 545313 541508 536994 532225 527129 521348
60018 521348 514835 507880 500801 493891 487480 481751 476598 471827 467431 463605 460571 458340 456574 454792
60004 454792 452961 451675 451375 451438 450565 448194 445134 442663 441318 440810 440738 441005 441614 442398 443066 443512 444015
59987 444015 445069 446843 448951 450938 452944 455665 459629 464648 469854 474070 476347 476559 475465 473952
59973 473952 472293 470420 468628 467401 466560 465217 462745 459383 455804 452604 450284 449168 449092 449635 450840
$$ packed form
60076F22886m57L99M35n69j761k529l447n165p153q393q718q553p944o913o264
60061E55854o802p913q126p091n930n546n659n669n484n112m325l189k244j737
60047D81027j206k17R91J952K592L128L663M168M578M819M992N472O340O891O365
60032E35555N113M214L839K976J122q02j781k134k789l805m514m769n096n781
60018E21348o513o955p079o910o411n729n153m771m396l826l034k231j766j782
60004D54792j831j286l00O3q73k371l060k471j345n08p2K67O09P84O68M46N03
59987D44015J054J774K108J987K006K721L964N019N206M216K277K12j094j513
59973D73952j659j873j792j227q41j343k472l362l579l200k320j116p6N43J205
$$ plain form
59958 450840 453126 456259 459062 460645 461416 462354 463679 464824 465388 465485 465283 464845 464453 464684 466000 468401
59942 468401 471359 473951 475403 475813 476081 476759 477320 476987 475958 475165 474984 474958 474725 474518 474484 474200 473294 472167
59924 472167 471627 472020 472982 473967 474767 475586 476767 478509 480836 483814 487643 492336 497448 502377 506944 511421
59908 511421 516003 520490 524514 527787 530053 531034 530561 528717 525911 522951 520855 520193 520587 521151 521509 521989
59892 521989 522815 523621 524041 524403 525400 527315 529945 533201 537306 542356 547988 553689 559288 565025 571182
59877 571182 577705 584119 589831 594527 598279 601226 603224 603931 603192 601208 598251 594344 589374 583540 577514
59862 577514 572016 567244 562896 558735 554935 551751 549137 546950 545405 545000 545981 548210 551620 556499 563124
59847 563124 571278 580262 589219 597289 603711 608105 610666 611962 612535 612804 613190 614053 615446 617089 618547
$$ packed form
59958D50840K286L133K803J583P71R38J325J145N64R7k02m38l92K31J316K401
59942D68401K958K592J452M10K68O78N61l33j029p93j81k6k33k07l4k84r06j127
59924D72167n40L93R62R85Q00Q19J181J742K327K978L829M693N112M929M567M477
59908E11421M582M487M024L273K266R81m73j844k806k960k096o62L94N64L58M80
59892E21989Q26Q06M20L62R97J915K630L256M105N050N632N701N599N737O157
59877E71182O523O414N712M696L752K947J998P07p39j984k957l907m970n834o026
59862E77514n498m772m348m161l800l184k614k187j545m05R81K229L410M879O625
59847E63124Q154Q984Q957Q070O422M394K561J296N73K69L86Q63J393J643J458
$$ plain form
59832 618547 619288 618672 616219 612075 607019 601832 596783 591762 586689 581537 576130 570306 564306 558711 553828
59817 553828 549394 545059 540932 537388 534429 531567 528385 525012 522025 519995 519071 518736 518020 516273 513885
59802 513885 511951 511038 510527 509355 507151 504349 501421 498496 495646 493110 491098 489692 488979 488990 489376 489533
59786 489533 489251 488944 489006 489245 489262 489143 489269 489582 489503 488687 487428 486184 485049 483946 483028 482563 482540 482665 482705
59767 482705 482616 482424 482174 481989 482042 482480 483442 485002 486871 488377 489125 489621 490851 493175 496074 499036 502195
59750 502195 505844 509850 513986 518453 523513 528848 533871 538524 543145 547649 551529 554797 558134 561870
59736 561870 565445 568342 570918 573720 576407 578058 578345 577793 577036 576483 576580 577617 579099 579993 579919 579605 579881
59719 579881 580681 581433 581998 582677 583498 584032 583939 583287 582302 581084 579652 578084 576618 575721 575920 577321 579377
$$ packed form
59832F18547P41o16k453m144n056n187n049n021n073n152n407n824o000n595m883
59817E53828m434m335m127l544k959k862l182l373k987k030r24l35p16j747k388
59802E13885j934r13n11j172k204k802k928k925k850k536k012j406p13J1L86J57
59786D89533k82l07O2K39J7j19J26L13p9q16j259j244j135j103r18m65k3J25M0
59767D82705q9j92k50j85N3M38R62J560J869J506P48M96J230K324K899K962L159
59750E02195L649M006M136M467N060N335N023M653M621M504L880L268L337L736
59736E61870L575K897K576K802K687J651K87n52p57n53R7J037J482Q94p4l14K76
59719E79881Q00P52N65O79Q21N34r3o52r85j218j432j568j466q97J99J401K056
$$ plain form
59702 579377 581417 583288 585187 586993 588262 588963 589703 590984 592590 593957 594789 595081 594935 594731 595023 595708
59686 595708 595630 593799 590943 589106 589509 591448 593473 594934 595956 596562 596549 595879 594507 592002 587986 582907
59670 582907 577790 573139 568612 563873 559220 555121 551529 548013 544393 540986 538316 536714 536126 536197 536588
59655 536588 537226 538161 539353 540799 542745 545398 548414 551031 552853 554141 555248 556104 556480 556431 556159 555609
59639 555609 554469 552472 549528 545713 541282 536633 532114 527993 524653 522535 521715 521684 521714 521322 520269 518375
59623 518375 515631 512382 509167 506350 503986 501908 499847 497597 495145 492503 489426 485634 481468 477969
59609 477969 475912 475009 474405 473815 473777 474754 476420 477986 479021 479790 480814 482218 483529 484091 483582 482129
59593 482129 480084 477985 476536 476133 476302 476076 475184 474483 474845 475975 476761 476611 475896 475136 474246 472808 470761
$$ packed form
59702E79377K040J871J899J806J269P01P40J281J606J367Q32K92j46k04K92O85
59686E95708p8j831k856j837M03J939K025J461J022O06j3o70j372k505m016n079
59670E82907n117m651m527m739m653m099l592l516l620l407k670j602n88P1L91
59655E36588O38R35J192J446J946K653L016K617J822J288J107Q56L76m9k72n50
59639E55609j140j997k944l815m431m649m519m121l340k118q20l1L0l92j053j894
59623E18375k744l249l215k817k364k078k061k250k452k642l077l792m166l499
59609D77969k057r03o04n90l8R77J666J566J035P69J024J404J311N62n09j453
59593D82129k045k099j449m03J69k26q92p01L62J130P86j50p15p60q90j438k047
$$ plain form
59576 470761 468554 466663 465143 463756 462377 461037 459499 457233 454202 451386 449896 449597 449331 448536 447871
59561 447871 447946 448249 447923 446918 445701 444420 443197 442875 444464 447810 451515 454210 455519 455936 456377 457752
59545 457752 460381 463797 467511 471840 477536 484973 494296 505986 520349 536626 553500 570330 586778
59532 586778 601176 610582 613166 609834 603073 594943 586687 579382 573941 570630 569171 569240 570620 573072
59518 573072 576320 579908 583005 584821 585369 585312 584849 583321 580213 575889 570919 565280 558790 551741 544465
59503 544465 536738 528332 519883 512440 506283 500794 495425 490188 485213 480465 476099 472690 470857 470735
59489 470735 471825 473203 474018 473994 473486 473041 473055 473819 475438 477510 479329 480674 482048 483800 485489 486584
59473 486584 487399 488714 490721 492936 495053 497288 499858 502582 505042 506913 508194 509388 511206 513770
$$ packed form
59576D70761k207j891j520j387j379j340j538k266l031k816j490k99k66p95o65
59561D47871P5L03l26j005j217j281j223l22J589L346L705K695J309M17M41J375
59545D57752K629L416L714M329N696P437R323J1690J4363J6277J6874J6830J6448
59532E86778J4398R406K584l332o761q130q256p305n441l311j459O9J380K452
59518E73072L248L588L097J816N48n7m63j528l108m324m970n639o490p049p276
59503E44465p727q406q449p443o157n489n369n237m975m748m366l409j833j22
59489D70735J090J378Q15k4n08m45J4P64J619K072J819J345J374J752J689J095
59473D86584Q15J315K007K215K117K235K570K724K460J871J281J194J818K564
$$ plain form
59459 513770 516342 518302 520128 522903 527042 532077 537557 543460 549717 556086 562614 569666 577248 584831
59445 584831 592011 598786 604876 609304 611115 610237 607248 602586 596479 589488 582546 576260 570451 564565
59431 564565 558431 552414 546918 542025 537745 534420 532568 532375 533614 536057 539650 544334 550139 557550
59417 557550 567283 579470 593632 609801 629013 652069 678175 705338 731549 754766 772285 781538
59405 781538 781906 775159 764059 751177 738893 729304 723490 721352 722395 725916 730138 732061 728936 719682
59391 719682 704746 685381 663529 641554 621117 602520 585592 570695 558246 547896 539101 532152
59379 532152 527670 525290 523787 522473 521575 521235 521129 521276 522264 524255 526573 528788 531451 535142 539386
59364 539386 543254 546636 550180 554246 558642 563300 568447 574065 579803 585601 591893 599013 606820 615154
$$ packed form
59459E13770K572J960J826K775M139N035N480N903O257O369O528P052P582P583
59445E84831P180O775O090M428J811q78k989m662o107o991o942o286n809n886
59431E64565o134o017n496m893m280l325j852j93J239K443L593M684N805P411
59417E57550R733J2187J4162J6169J9212K3056K6106K7163K6211K3217J7519R253
59405G81538L68o747j1100j2882j2284r589n814k138J043L521M222J923l125r254
59391G19682j4936j9365k1852k1975k0437j8597j6928j4897j2449j0350q795o949
59379E32152m482k380j503j314q98l40j06J47R88J991K318K215K663L691M244
59364E39386L868L382L544M066M396M658N147N618N738N798O292P120P807Q334
$$ plain form
59350 615154 624332 634930 647314 661523 677343 694308 711811 729447 747128 764800 782264 799290
59338 799290 815603 830632 843644 854316 862794 868933 871965 871411 867937 862647 855800 846913 836047
59325 836047 824025 811196 796878 780678 763790 748271 735219 724231 714413 705234 696371 687476
59313 687476 678566 670327 663605 658574 654604 650966 647550 644896 643672 644252 646763 651399 658558 668647
59299 668647 681715 697079 713165 727846 739187 745964 747566 743846 735536 724561 713176 702476
59287 702476 692118 681691 671836 663669 657512 652704 648487 644599 641083 637978 635271 632901 630874 629554
59273 629554 629708 631922 636037 641488 648066 655962 665044 674641 684192 693688 703177 712050 719168 723641
59259 723641 725313 724589 722031 718123 713158 707125 699754 690852 680719 670179 660098 650911 642676 635419
$$ packed form
59350F15154R178J0598J2384J4209J5820J6965J7503J7636J7681J7672J7464J7026
59338G99290J6313J5029J3012J0672Q478O139L032n54l474n290o847q887j0866
59325H36047j2022j2829j4318j6200j6888j5519j3052j0988r818r179q863q895
59313F87476q910q239o722n031l970l638l416k654j224N80K511M636P159J0089
59299F68647J3068J5364J6086J4681J1341O777J602l720q310j0975j1385j0700
59287G02476j0358j0427r855q167o157m808m217l888l516l105k707k370k027j320
59273F29554J54K214M115N451O578P896R082R597R551R496R489Q873P118M473
59259G23641J672p24k558l908m965o033p371q902j0133j0540j0081r187q235p257
$$ plain form
59245 635419 629232 624077 619758 616146 613244 611053 609643 609324 610424 612752 615618 618529 621560 624894
59231 624894 628326 631489 634262 636664 638570 639819 640424 640403 639559 637640 634468 629815 623542 616185 609009
59216 609009 603063 598398 594503 591126 588254 585711 583378 581551 580482 579787 578870 577739 576793 576017 575130
59201 575130 574413 574575 575760 577423 579222 581277 583415 585038 586091 587438 589774 592763 595733 598721 602229
59186 602229 606234 610042 613075 615444 617706 620246 622824 624740 625571 625669 625718 625940 626185 626686 628011 630151
59170 630151 632338 634104 635933 638519 641912 645888 650641 656535 663488 671091 679077 687176 694845 701644
59156 701644 707663 712947 716701 717749 715861 712085 707667 703079 698207 693041 687837 682855 678191 673833
59142 673833 669756 665922 662168 658096 653258 647603 641656 636068 631065 626503 622313 618589 615264 611984
$$ packed form
59245F35419o187n155m319l612k902k191j410l19J100K328K866K911L031L334
59231F24894L432L163K773K402J906J249O05k1q44j919l172m653o273p357p176
59216F09009n946m665l895l377k872k543k333j827j069o95r17j131r46p76q87
59201E75130p17J62J185J663J799K055K138J623J053J347K336K989K970K988L508
59186F02229M005L808L033K369K262K540K578J916Q31R8M9K22K45N01J325K140
59170F30151K187J766J829K586L393L976M753N894O953P603P986Q099P669O799
59156G01644O019N284L754J048j888l776m418m588m872n166n204m982m664m358
59142F73833m077l834l754m072m838n655n947n588n003m562m190l724l325l280
$$ plain form
59128 611984 608477 604889 601686 599256 597673 596754 596234 595929 595892 596500 598291 601515 605821 610611 615790 621894
59112 621894 629291 637507 645613 653117 660122 666784 673063 679020 684901 690847 696800 702713 708521 713944
59098 713944 718695 722838 726546 729558 731410 732246 732816 733481 733763 733089 731490 729334 726897 724467 722347
59083 722347 720393 717942 714554 710389 705584 699844 693074 685930 679156 672732 666165 659271 652177 644892
59069 644892 637463 630234 623400 616584 609480 602688 597191 593153 589821 586561 583305 580023 576521 572968
59055 572968 570023 568087 566737 565141 562847 560057 557317 555018 553071 551095 548959 546968 545355 543936
59041 543936 542543 541482 541100 541188 541308 541454 541837 542185 541992 541403 541213 541863 543099 544732 547087 550472 554771
59024 554771 559887 566077 573528 581992 591233 601481 613027 625596 638455 650986 662809 673482
$$ packed form
59128F11984l507l588l203k430j583r19n20l05l7O08J791L224M306M790N179O104
59112F21894P397Q216Q106P504P005O662O279N957N881N946N953N913N808N423
59098G13944M751M143L708L012J852Q36N70O65K82o74j599k156k437k430k120
59083G22347j954k451l388m165m805n740o770p144o774o424o567o894p094p285
59069F44892p429p229o834o816p104o792n497m038l332l260l256l282l502l553
59055E72968k945j936j350j596k294k790k740k299j947j976k136j991j613j419
59041E43936j393j061l82Q8J20J46L83L48j93n89j90O50J236J633K355L385M299
59024E54771N116O190P451Q464R241J0248J1546J2569J2859J2531J1823J0673
$$ plain form
59012 673482 682424 689235 693931 696802 698102 697889 696234 693590 690776 688430 686613 685222 684664 685728 688750
58997 688750 693233 698375 703662 708826 713579 717635 720881 723368 725213 726500 727218 727269 726670 725605 724070
58982 724070 721655 718049 713684 709442 705667 702010 698448 695952 695727 698010 702014 706905 712488 718996
58968 718996 726544 734988 744199 754240 765124 776463 787611 798313 808966 819979 830991 841037
58956 841037 849410 855922 860399 862387 861572 858135 852442 844653 834840 823274 810379 796559 782311
58943 782311 768356 755437 743902 733532 723727 713930 704127 695057 687746 682638 679211 676441 673570
58930 673570 670486 667578 665302 663699 662203 660106 657311 654531 652639 651837 651482 650643 648859 646453 644109
58915 644109 642159 640418 638724 637291 636311 635546 634779 634456 635302 637409 640282 643755 648225 653842 660219
$$ packed form
59012F73482Q942O811M696K871J300k13j655k644k814k346j817j391n58J064L022
58997F88750M483N142N287N164M753M056L246K487J845J287P18N1n99j065j535
58982G24070k415l606m365m242l775l657l562k496k25K283M004M891N583O508
58968G18996P548Q444R211J0041J0884J1339J1148J0702J0653J1013J1012J0046
58956H41037Q373O512M477J988q15l437n693p789r813j1566j2895j3820j4248
58943G82311j3955j2919j1535j0370r805r797r803r070p311n108l427k770k871
58930F73570l084k908k276j603j496k097k795k780j892q02l55q39j784k406k344
58915F44109j950j741j694j433r80p65p67l23Q46K107K873L473M470N617O377
$$ plain form
58900 660219 667230 675465 685427 696718 708474 720212 731784 742886 753275 763278 773648 785035
58888 785035 797979 813125 830766 850235 870343 890455 910640 930698 949669 966543 981032
58877 981032 993268 1003086 1009885 1013097 1012598 1008776 1002360 993969 983724 971493 957650 943333 929695
58864 929695 917077 905170 893829 883334 873835 864854 855569 845503 834877 824311 814193 804299
58852 804299 794037 783104 771789 760589 749685 739005 728682 719133 710647 703169 696495 690375
58840 690375 684360 677922 671005 664239 658303 653211 648438 643524 638327 632880 627373 622141 617260 612274
58826 612274 606749 601107 596440 593453 591941 591357 591456 592302 594061 596978 601146 606112 611093 615757 620398
58811 620398 625204 629823 633931 637676 641202 644194 646411 648252 650170 651791 652251 651318 649602 647683 645482
$$ packed form
58900F60219P011Q235R962J1291J1756J1738J1572J1102J0389J0003J0370J1387
58888G85035J2944J5146J7641J9469K0108K0112K0185K0058J8971J6874J4489
58877I81032J2236R818O799L212m99l822o416q391j0245j2231j3843j4317j3638
58864I29695j2618j1907j1341j0495r499q981r285j0066j0626j0566j0118r894
58852H04299j0262j0933j1315j1200j0904j0680j0323r549q486p478o674o120
58840F90375o015o438o917o766n936n092m773m914n197n447n507n232m881m986
58826F12274n525n642m667k987j512n84R9Q46J759K917M168M966M981M664M641
58811F20398M806M619M108L745L526K992K217J841J918J621M60r33j716j919k201
$$ plain form
58796 645482 642540 638533 633509 627914 622357 617087 611854 606542 601654 597748 594681 591914 589401 587607
58782 587607 586838 587171 588902 592268 596692 601101 605213 609801 615361 621139 625870 628909 630151 629306 625992
58767 625992 620409 613480 606292 599618 593776 588578 583493 578132 572596 567215 562149 557508 553778 551676
58753 551676 551435 552413 553660 554839 556387 558706 561431 563793 565664 567815 570969 574906 578818 582288 585525
58738 585525 588810 592160 595602 599392 603802 608874 614419 620069 625384 630136 634527 639014 643951 649459
58724 649459 655515 661906 668269 674333 680011 685165 689599 693523 697657 702532 708003 713836 720325 727795
58710 727795 735844 743729 751206 758280 764387 768645 770788 771050 769227 764756 757752 749021 738896 726955
58696 726955 713160 698365 683320 668031 652524 637498 623627 610894 599140 588655 579654 571676
$$ packed form
58796F45482k942m007n024n595n557n270n233n312m888l906l067k767k513j794
58782E87607p69L33J731L366M424M409M112M588N560N778M731L039J242q45l314
58767F25992n583o929p188o674n842n198n085n361n536n381n066m641l730k102
58753E51676k41R78J247J179J548K319K725K362J871K151L154L937L912L470L237
58738E85525L285L350L442L790M410N072N545N650N315M752M391M487M937N508
58724F49459O056O391O363O064N678N154M434L924M134M875N471N833O489P470
58710G27795Q049P885P477P074O107M258K143K62j823m471p004q731j0125j1941
58696G26955j3795j4795j5045j5289j5507j5026j3871j2733j1754j0485r001p978
$$ plain form
58684 571676 564099 556877 550298 544443 539307 534986 531222 527236 522618 518072 514646 512485 510841 509120
58670 509120 507491 506653 507412 510221 514735 520035 525612 531856 539235 547458 555824 563934 571429 577381 580766
58655 580766 581521 580537 578623 575996 572706 569026 565260 561582 558162 555138 552381 549524 546288 542600 538455
58640 538455 533958 529530 525876 523535 522477 522138 521973 522050 523025 525324 528440 531328 533409 534817 535752 536197
58624 536197 536343 536795 538067 540290 543498 547751 552836 558465 565030 573593 584707 597681 611249 624422
58610 624422 636385 646342 654063 660126 665019 668375 669601 668818 666641 663478 659690 656001 652946 650075
58596 650075 646377 641438 635709 629799 624010 618432 613093 608164 604342 602667 603479 605891 608775 611941
58582 611941 615859 620701 626417 633401 642121 652113 662101 671187 679295 686518 692834 698649 704960 712622
$$ packed form
58684E71676p577p222o579n855n136m321l764l986m618m546l426k161j644j721
58670E09120j629q38P59K809M514N300N577O244P379Q223Q366Q110P495N952L385
58655E80766P55r84j914k627l290l680l766l678l420l024k757k857l236l688m145
58640E38455m497m428l654k341j058l39j65P7R75K299L116K888K081J408R35M45
58624E36197J46M52J272K223L208M253N085N629O565Q563J1114J2974J3568J3173
58610F24422J1963R957P721O063M893L356J226p83k177l163l788l689l055k871
58596F50075l698m939n729n910n789n578n339m929l822j675Q12K412K884L166
58582F11941L918M842N716O984Q720R992R988R086Q108P223O316N815O311P662
$$ plain form
58568 712622 721790 732219 743725 756262 769923 785110 802414 822124 843911 867087 891117 915853
58556 915853 941184 966338 989734 1009867 1026251 1038976 1047558 1051206 1050488 1047681 1044726 1041551 1037133
58543 1037133 1031442 1025368 1019266 1012678 1005176 996392 985406 971227 954086 935393 916282 896887
58531 896887 877086 857210 837853 819618 803208 789205 777619 768044 760268 754282 749818 746388
58519 746388 743717 741663 739920 738298 737104 736590 736323 735759 735140 734923 734605 733235 731007 729167 728086 726565
58503 726565 723524 719463 715648 712653 710327 708572 707382 706430 705262 703833 702520 701721 701591 702006 702648
58488 702648 703354 704434 706405 709420 713209 717539 722383 727725 733714 741004 750408 762067 775370 789797
58474 789797 805355 821974 838848 854580 867808 877716 884217 887721 888515 886470 881590 874612 866645
$$ packed form
58568G12622R168J0429J1506J2537J3661J5187J7304J9710K1787K3176K4030K4736
58556I15853K5331K5154K3396K0133J6384J2725Q582L648p18k807k955l175m418
58543A037133n691o074o102o588p502q784j0986j4179j7141j8693j9111j9395
58531H96887j9801j9876j9357j8235j6410j4003j1586r575p776n986m464l430
58519G46388k671k054j743j622j194n14k67n64o19k17l18j370k228j840j081j521
58503G26565l041m061l815k995k326j755j190r52j168j429j313p99j30M15O42
58488G02648P06J080J971L015L789M330M844N342N989P290R404J1659J3303J4427
58474G89797J5558J6619J6874J5732J3228R908O501L504P94k045m880o978p967
$$ plain form
58461 866645 858383 850145 842573 836787 833821 834230 837993 844346 851974 860005 868716 878696 889458 899537
58447 899537 907831 914149 918530 920731 920480 917554 911676 903012 892818 882815 873789 865437 857727 851595
58433 851595 847917 846409 845956 845746 845788 846650 848876 852551 857373 863261 870629 879786 890362 901621 912922
58418 912922 923439 932001 937942 941757 944102 944562 942307 937651 931948 926093 920146 914252 908804 903646
58404 903646 898149 892266 886644 881641 877169 873548 871498 871115 871782 873196 875566 878670 881792 884785 888210
58389 888210 892135 895758 898498 900562 902185 903272 904089 905310 906999 908419 909195 909908 911256 913506 916924
58374 916924 921779 927603 933454 939243 945860 953685 962048 970507 979520 989328 999318 1009166 1019633 1031478
58360 1031478 1044410 1057880 1072148 1087823 1104872 1122675 1140514 1157472 1172423 1184648 1194118
$$ packed form
58461H66645q262q238p572n786k966M09L763O353P628Q031Q711R980J0762J0079
58447H99537Q294O318M381K201k51k926n878q664j0194j0003r026q352p710o132
58433H51595l678j508m53k10M2Q62K226L675M822N888P368R157J0576J1259J1301
58418I12922J0517Q562N941L815K345M60k255m656n703n855n947n894n448n158
58404I03646n497n883n622n003m472l621k050l83O67J414K370L104L122K993L425
58389H88210L925L623K740K064J623J087Q17J221J689J420P76P13J348K250L418
58374I16924M855N824N851N789O617P825Q363Q459R013R808R990R848J0467J1845
58360A031478J2932J3470J4268J5675J7049J7803J7839J6958J4951J2225R470
$$ plain form
58349 1194118 1200977 1205404 1208147 1210465 1213207 1216538 1220661 1225937 1232123 1238469 1244896 1252254 1261162 1271483
58335 1271483 1283151 1296444 1311131 1326414 1342177 1359262 1378081 1397873 1417705 1437189 1455878
58324 1455878 1473013 1488398 1502534 1515549 1526983 1536980 1546480 1555800 1564211 1571393 1578138 1585088 1592069
58311 1592069 1599258 1607725 1618039 1629439 1641130 1653345 1666516 1680537 1695499 1712078 1730436 1749771
58299 1749771 1769507 1789886 1810884 1831741 1852140 1872622 1893317 1913573 1933453 1954254 1976863
58288 1976863 2000868 2025829 2051993 2079201 2106648 2134496 2164129 2196091 2229296 2263072 2298271
58277 2298271 2335496 2373903 2412811 2452843 2494526 2537392 2581463 2627865 2676837 2726870 2776970
58266 2776970 2828106 2881355 2936452 2993447 3053929 3119176 3188685 3261679 3338307 3418207 3499879
$$ packed form
58349A194118O859M427K743K318K742L331M123N276O186O346O427P358Q908J0321
58335A271483J1668J3293J4687J5283J5763J7085J8819J9792J9832J9484J8689
58324A455878J7135J5385J4136J3015J1434R997R500R320Q411P182O745O950O981
58311A592069P189Q467J0314J1400J1691J2215J3171J4021J4962J6579J8358J9335
58299A749771J9736K0379K0998K0857K0399K0482K0695K0256J9880K0801K2609
58288A976863K4005K4961K6164K7208K7447K7848K9633L1962L3205L3776L5199
58277B298271L7225L8407L8908M0032M1683M2866M4071M6402M8972N0033N0100
58266B776970N1136N3249N5097N6995O0482O5247O9509P2994P6628P9900Q1672
$$ plain form
58255 3499879 3582773 3667992 3755643 3843693 3930984 4019137 4109904 4202930 4297949 4396919 4501907
58244 4501907 4612896 4729600 4853361 4985253 5124382 5269966 5423114 5584761 5754158
58235 5754158 5931196 6117835 6315362 6522909 6740628 6971464 7217543 7477883 7752106
58226 7752106 8043381 8355131 8688044 9043097 9424267 9835302 10277223 10752131 11265981
58217 11265981 11824345 12429146 13083170 13794201 14571236 15420775 16350861 17374857 18507581
58208 18507581 19762444 21156889 22716303 24468859 26442560 28672966 31209937 34115023
58200 34115023 37462874 41355332 45933193 51377716 57921565 65880773 75687473 87904330
58192 87904330 103213502 122341292 145871328 174004752 206417166 242231035 279909291
$$ packed form
58255C499879Q2894Q5219Q7651Q8050Q7291Q8153R0767R3026R5019R8970J04988
58244D501907J10989J16704J23761J31892J39129J45584J53148J61647J69397
58235E754158J77038J86639J97527K07547K17719K30836K46079K60340K74223
58226G752106K91275L11750L32913L55053L81170M11035M41921M74908N13850
58217A1265981N58364O04801O54024P11031P77035Q49539R30086J023996J132724
58208A8507581J254863J394445J559414J752556J973701K230406K536971K905086
58200C4115023L347851L892458M577861N444523O543849P959208R806700J2216857
58192H7904330J5309172J9127790K3530036K8133424L2412414L5813869L7678256
$$ plain form
58185 279909291 316991166 350027186 375199324 389539647 391958934 383358556 365904703
58178 365904703 342155186 314546489 285204339 255839245 227670288 201449554 177574015
58171 177574015 156193731 137282709 120701409 106255660 93729169 82894971 73530586
58164 73530586 65434871 58429381 52351517 47057612 42429999 38372148 34798598 31635273
58156 31635273 28824693 26322016 24086850 22083400 20284247 18666884 17208372 15888210
58148 15888210 14693120 13613359 12636693 11750703 10947889 10223059 9567991 8973503 8434211
58139 8434211 7946050 7501109 7089889 6707215 6351653 6020879 5711984 5424623 5159281
58130 5159281 4913484 4683639 4469360 4272031 4090237 3920475 3761389 3613583 3476022
$$ packed form
58185B79909291L7081875L3036020K5172138J4340323K419287q600378j7453853
58178C65904703k3749517k7608697k9342150k9365094k8168957k6220734k3875539
58171A77574015k1380284j8911022j6581300j4445749j2526491j0834198r364385
58164G3530586q095715p005490o077864n293905m627613m057851l573550l163325
58156C1635273k810580k502677k235166k003450j799153j617363j458512j320162
58148A5888210j195090j079761r76666q85990q02814p24830o55068n94488n39292
58139H434211m88161m44941m11220l82674l55562l30774l08895k87361k65342
58130E159281k45797k29845k14279j97329j81794j69762j59086j47806j37561
$$ plain form
58121 3476022 3346204 3223287 3107851 2999135 2895599 2797504 2705935 2619875 2537095 2457390
58111 2457390 2382210 2311716 2244812 2181455 2122268 2066445 2012558 1960780 1911872 1864629 1816929
58100 1816929 1768795 1721972 1676960 1632905 1589916 1548992 1509948 1471777 1434881 1400755 1369672
58089 1369672 1340752 1313963 1289955 1268180 1247254 1227026 1208310 1190752 1172872 1154102 1135043
58078 1135043 1115902 1096386 1076830 1057728 1038425 1017975 996905 976455 956587 936574 917082
58067 917082 899643 884303 869717 855335 841575 828123 814150 800242 788127 778255 769405 760733
58055 760733 752399 744057 734679 724289 714179 704889 695464 685239 675029 666018 658576 652544 647575
58042 647575 642868 637558 631666 625901 620477 615028 609657 605023 601286 597844 594174 590168 585694 580585
$$ packed form
58121C476022j29818j22917j15436j08716j03536r8095r1569q6060q2780p9705
58111B457390p5180p0494o6904o3357n9187n5823n3887n1778m8908m7243m7700
58100A816929m8134m6823m5012m4055m2989m0924l9044l8171l6896l4126l1083
58089A369672k8920k6789k4008k1775k0926k0228j8716j7558j7880j8770j9059
58078A135043j9141j9516j9556j9102j9303k0450k1070k0450j9868k0013j9492
58067I17082j7439j5340j4586j4382j3760j3452j3973j3908j2115r872q850q672
58055G60733q334q342r378j0390j0110r290r425j0225j0210r011p442o032m969
58042F47575m707n310n892n765n424n449n371m634l737l442l670m006m474n109
$$ plain form
58028 580585 574852 568290 560342 551214 542447 535249 528818 521648 513952 507263 501926 496660 490634 484510
58014 484510 479206 474847 471176 467998 465162 462895 461962 462551 463395 463106 462019 461493 461804 462148 462337 462912
57998 462912 463716 463946 463642 463652 464099 464378 464649 465694 467099 467224 465401 462729 460310 458071 455717 453465
57982 453465 451294 448659 445467 442267 439101 435362 431147 427521 424910 422383 419076 415327 411981 409578
57968 409578 408578 409239 410750 411589 411332 411126 411900 413167 414226 415426 417401 419860 421925 423108 423378 422871
57952 422871 422017 421366 420867 419936 418487 417125 416015 414459 412116 409804 408600 408889 410741 414368 419582
57937 419582 425515 431579 438196 446080 455344 465724 477035 488781 499899 509490 517513 524364 530189
57924 530189 534878 538193 539547 538203 534175 528510 522335 516062 509742 503545 497404 490721 483019 474665
$$ packed form
58028E80585n733o562p948r128q767p198o431p170p696o689n337n266o026o124
58014D84510n304m359l671l178k836k267r33N89Q44k89j087n26L11L44J89N75
57998D62912Q04K30l04J0M47K79K71J045J405J25j823k672k419k239k354k252
57982D53465k171k635l192l200l166l739m215l626k611k527l307l749l346k403
57968D09578j000O61J511Q39k57k06P74J267J059J200J975K459K065J183K70n07
57952D22871q54o51m99r31j449j362j110j556k343k312j204K89J852L627N214
57937D19582N933O064O617P884R264J0380J1311J1746J1118R591Q023O851N825
57924E30189M689L315J354j344m028n665o175o273o320o197o141o683p702q354
$$ plain form
57910 474665 466589 459472 453358 447774 442113 436249 430844 426689 423765 421376 419093 416955 414834 412340
57896 412340 409446 406520 403678 400825 398403 397313 397925 399872 402839 406699 410812 414178 416573 418694
57882 418694 420941 422995 424882 427406 430991 434929 438215 440410 441349 440926 439636 438427 437524 436261 434510
57867 434510 433231 432941 432651 431180 428745 426419 424734 423659 423317 423801 424793 426159 428426 431928 435988
57852 435988 439743 443219 446772 449975 452072 453217 454251 455364 455828 455079 453349 451189 448930 446653 444290
57837 444290 441710 438905 435954 432711 429007 425371 422941 422159 422082 421557 420667 420409 421322 423113 425296 427573
57821 427573 429771 431961 434506 437583 440840 443926 447032 450541 454417 458306 461818 464307 464845 463054
57807 463054 459655 455779 452029 448585 445662 443237 440826 438204 436006 434927 434744 434777 434999 435896 437474
$$ packed form
57910D74665q076p117o114n584n661n864n405m155k924k389k283k138k121k494
57896D12340k894k926k842k853k422j090O12J947K967L860M113L366K395K121
57882D18694K247K054J887K524L585L938L286K195R39m23j290j209r03j263j751
57867D34510j279k90k90j471k435k326j685j075l42M84R92J366K267L502M060
57852D35988L755L476L553L203K097J145J034J113M64p49j730k160k259k277k363
57837D44290k580k805k951l243l704l636k430p82p7n25q90k58R13J791K183K277
57821D27573K198K190K545L077L257L086L106L509L876L889L512K489N38j791
57807D63054l399l876l750l444k923k425k411k622k198j079j83L3K22Q97J578
$$ plain form
57792 437474 439154 440503 441426 441778 441457 440758 440099 439509 438886 438473 438558 439098 440233 442705 446851 451559 455242
57775 455242 457751 460364 463941 468141 472520 477226 482192 486571 489578 491237 491834 491216 489168 486041 482444
57760 482444 478515 473962 468634 462789 456940 451792 448200 446862 447907 450839 454894 459460 464257 469177
57746 469177 474016 478450 482268 485452 488051 490237 492459 495023 497328 498095 496846 494721 493340 493126 493381
57731 493381 493637 494135 495038 495951 496413 496319 495793 495114 494908 495856 497976 500515 502677 504172 505105 505812 506879
57714 506879 508766 511160 513099 513919 513737 512875 511346 509258 507247 505920 505037 503763 501717 499393 497527
57699 497527 496514 496589 498054 500829 503926 505981 506531 506408 506681 507516 508381 508985 509466 509861 510079 510467 511761
57682 511761 514240 517424 520788 524370 528506 533502 539829 548122 558675 571530 587470 608302 635492
$$ packed form
57792D37474J680J349R23L52l21o99o59n90o23m13Q5N40J135K472M146M708L683
57775D55242K509K613L577M200M379M706M966M379L007J659N97o18k048l127l597
57760D82444l929m553n328n845n849n148l592j338J045K932M055M566M797M920
57746D69177M839M434L818L184K599K186K222K564K305P67j249k125j381k14K55
57731D93381K56M98R03R13M62r4n26o79k06R48K120K539K162J495R33P07J067
57714E06879J887K394J939Q20j82q62j529k088k011j327q83j274k046k324j866
57699D97527j013P5J465K775L097K055N50j23K73Q35Q65O04M81L95K18L88J294
57682E11761K479L184L364L582M136M996O327Q293J0553J2855J5940K0832K7190
$$ plain form
57669 635492 668893 707414 750503 797980 848230 897038 938441 966773 978688 974267 956552 929715
57657 929715 897407 862515 827663 795057 765892 740334 718129 699000 682736 669318 658766
57646 658766 650602 643793 637680 632562 628922 626494 624744 623824 624218 625705 627511 629374 631558 633943 636054
57631 636054 638089 640934 644850 648948 652347 655145 657870 660622 663239 665773 668251 670301 671493 671911
57617 671911 672117 672748 674253 676703 679656 682476 684965 687440 690089 692604 694602 696086 697326 698562 699944
57602 699944 701430 702659 703310 703771 705022 707578 710854 713806 715905 717265 718145 718671 718933 719023 719030 719089 719310
57585 719310 719648 720027 720713 722308 725176 728975 732891 736270 739029 741563 744331 747406 750425 752977 754945
57570 754945 756381 757300 757823 758401 759561 761524 764274 767784 771938 776418 781056 786015 791231 796021 799803
$$ packed form
57669F35492L3401L8521M3089M7477N0250M8808M1403K8332J1915m421j7715k6837
57657I29715l2308l4892l4852l2606k9165k5558k2205j9129j6264j3418j0552
57646F58766q164o809o113n118l640k428j750r20L94J487J806J863K184K385K111
57631F36054K035K845L916M098L399K798K725K752K617K534K478K050J192M18
57617F71911K06O31J505K450K953K820K489K475K649K515J998J484J240J236J382
57602F99944J486J229O51M61J251K556L276K952K099J360Q80N26K62R0PN9K21
57585G19310L38L79O86J595K868L799L916L379K759K534K768L075L019K552J968
57570G54945J436R19N23N78J160J963K750L510M154M480M638M959N216M790L782
$$ plain form
57555 799803 803002 806537 810614 814786 819112 824311 830597 837186 843258 848704 853608 857764 861171 864366
57541 864366 867690 870703 872836 874292 875851 878132 881405 885729 890801 896007 901060 906288 911887 917262
57527 917262 921599 924865 927742 930764 933997 937400 941029 944977 949542 955424 963267 972941 983527 994079
57513 994079 1004256 1014355 1024928 1036335 1048416 1060574 1072277 1083435 1094291 1105115 1116085
57502 1116085 1127258 1138458 1149355 1159742 1169644 1179163 1188447 1197696 1206734 1214613 1220305 1224074 1227577
57489 1227577 1232242 1238020 1244078 1250111 1256349 1262787 1269185 1275607 1282205 1288692 1294745 1300862 1308007 1316301
57475 1316301 1324735 1332348 1339123 1345520 1351750 1357827 1363855 1369877 1375760 1381569 1387791 1394890 1402872 1411545
57461 1411545 1420947 1431050 1441155 1450061 1457064 1462699 1468420 1475522 1484262 1493821 1503098 1511647 1519894
$$ packed form
57555G99803L199L535M077M172M326N199O286O589O072N446M904M156L407L195
57541H64366L324L013K133J456J559K281L273M324N072N206N053N228N599N375
57527I17262M337L266K877L022L233L403L629L948M565N882P843R674J0586J0552
57513I94079J0177J0099J0573J1407J2081J2158J1703J1158J0856J0824J0970
57502A116085J1173J1200J0897J0387R902R519R284R249R038P879N692L769L503
57489A227577M665N778O058O033O238O438O398O422O598O487O053O117P145Q294
57475A316301Q434P613O775O397O230O077O028O022N883N809O222P099P982Q673
57461A411545R402J0103J0105Q906P003N635N721P102Q740R559R277Q549Q247
$$ plain form
57448 1519894 1528492 1537528 1546486 1554894 1562867 1570955 1579668 1589273 1599884 1611445 1623546 1635531 1647013
57435 1647013 1658136 1669169 1680001 1690373 1700466 1710806 1721505 1732047 1742113 1752300 1763627
57424 1763627 1776393 1789823 1802794 1814713 1825752 1836521 1847568 1859047 1870727 1882347 1893891
57413 1893891 1905456 1916961 1928153 1938948 1949654 1960802 1972763 1985506 1998727 2012205 2025940
57402 2025940 2039870 2053565 2066533 2078918 2091523 2104893 2118599 2131783 2144296 2156889 2170248
57391 2170248 2184261 2198455 2212779 2227545 2242759 2258019 2273221 2288944 2305797 2323590 2341518
57380 2341518 2359090 2376441 2393737 2410748 2427258 2443492 2459732 2475756 2491096 2505787 2520450
57369 2520450 2535600 2551186 2566842 2582370 2597902 2613755 2630123 2646825 2663442 2679911 2696797
$$ packed form
57448A519894Q598R036Q958Q408P973Q088Q713R605J0611J1561J2101J1985J1482
57435A647013J1123J1033J0832J0372J0093J0340J0699J0542J0066J0187J1327
57424A763627J2766J3430J2971J1919J1039J0769J1047J1479J1680J1620J1544
57413A893891J1565J1505J1192J0795J0706J1148J1961J2743J3221J3478J3735
57402B025940J3930J3695J2968J2385J2605J3370J3706J3184J2513J2593J3359
57391B170248J4013J4194J4324J4766J5214J5260J5202J5723J6853J7793J7928
57380B341518J7572J7351J7296J7011J6510J6234J6240J6024J5340J4691J4663
57369B520450J5150J5586J5656J5528J5532J5853J6368J6702J6617J6469J6886
$$ plain form
57358 2696797 2714688 2733507 2752732 2772148 2791900 2811871 2831555 2850663 2869484 2888523 2908126
57347 2908126 2928468 2949510 2970834 2991869 3012305 3032026 3050760 3068390 3085552 3103204 3121452
57336 3121452 3139516 3157065 3174798 3193317 3212248 3231074 3250090 3269739 3289601 3308991 3328191
57325 3328191 3348057 3368542 3388652 3407876 3426774 3445921 3465148 3484204 3503448 3523310 3543497
57314 3543497 3563286 3582334 3600775 3618778 3636476 3654247 3672619 3691777 3711376 3730944 3750292
57303 3750292 3769451 3788381 3806944 3825234 3843729 3862874 3882500 3901859 3920388 3938292 3956191
57292 3956191 3974342 3992427 4010079 4027383 4044796 4062730 4081262 4100167 4119194 4138282 4157476
57281 4157476 4176626 4195272 4212966 4229724 4246145 4263095 4281152 4300150 4319279 4337814 4355742
$$ packed form
57358B696797J7891J8819J9225J9416J9752J9971J9684J9108J8821J9039J9603
57347B908126K0342K1042K1324K1035K0436J9721J8734J7630J7162J7652J8248
57336C121452J8064J7549J7733J8519J8931J8826J9016J9649J9862J9390J9200
57325C328191J9866K0485K0110J9224J8898J9147J9227J9056J9244J9862K0187
57314C543497J9789J9048J8441J8003J7698J7771J8372J9158J9599J9568J9348
57303C750292J9159J8930J8563J8290J8495J9145J9626J9359J8529J7904J7899
57292C956191J8151J8085J7652J7304J7413J7934J8532J8905J9027J9088J9194
57281D157476J9150J8646J7694J6758J6421J6950J8057J8998J9129J8535J7928
$$ plain form
57270 4355742 4373485 4391133 4408382 4425313 4442733 4461363 4481004 4500796 4520057 4538581 4556496
57259 4556496 4574229 4592384 4611138 4629914 4648100 4665931 4684112 4702647 4720714 4737843 4754640
57248 4754640 4771973 4789878 4807681 4825017 4842229 4859728 4877311 4894352 4910620 4926667 4943270
57237 4943270 4960597 4978167 4995615 5013104 5030865 5048723 5066456 5084311 5102673 5121348 5139676
57226 5139676 5157342 5174649 5191936 5209149 5226017 5242179 5256997 5269739 5280295 5289488 5298312 5307079
57214 5307079 5315489 5323355 5330919 5338468 5345889 5352690 5358464 5363382 5368169 5373373 5378628 5382893 5385537 5386873
57200 5386873 5387470 5387301 5385995 5383767 5381565 5380184 5379596 5379343 5379309 5379756 5380680 5381430 5381131 5379447 5376849 5374085
57184 5374085 5371449 5368620 5365163 5360973 5356024 5349870 5341839 5331905 5321081 5310575 5300654 5290640 5279982
$$ packed form
57270D355742J7743J7648J7249J6931J7420J8630J9641J9792J9261J8524J7915
57259D556496J7733J8155J8754J8776J8186J7831J8181J8535J8067J7129J6797
57248D754640J7333J7905J7803J7336J7212J7499J7583J7041J6268J6047J6603
57237D943270J7327J7570J7448J7489J7761J7858J7733J7855J8362J8675J8328
57226E139676J7666J7307J7287J7213J6868J6162J4818J2742J0556R193Q824Q767
57214E307079Q410P866P564P549P421O801N774M918M787N204N255M265K644J336
57200E386873N97j69j306k228k202j381n88k53l4M47R24P50k99j684k598k764
57184E374085k636k829l457m190m949o154q031r934j0824j0506r921j0014j0658
$$ plain form
57171 5279982 5269004 5258477 5248754 5239509 5230134 5220223 5209756 5198990 5188073 5176718 5164413 5151000
57159 5151000 5136807 5122131 5106948 5091334 5075788 5060721 5045891 5030855 5015783 5001277 4987424
57148 4987424 4973667 4959703 4945914 4932635 4919387 4905217 4889498 4872181 4853522 4833940 4813958
57137 4813958 4793907 4773483 4751736 4727613 4700750 4671802 4641813 4611115 4579103 4545309 4510390
57126 4510390 4475595 4441575 4408439 4376875 4348409 4324346 4305134 4290988 4282363 4279277 4280784 4285768
57114 4285768 4293903 4305267 4319410 4335608 4354122 4376720 4405954 4444454 4495150 4561801 4648820
57103 4648820 4760549 4901085 5075204 5289675 5553759 5878942 6278970 6770405 7372472
57094 7372472 8105596 8989902 10044415 11285377 12722152 14352298 16158577 18108629
$$ packed form
57171E279982j0978j0527r723r245r375r911j0467j0766j0917j1355j2305j3413
57159E151000j4193j4676j5183j5614j5546j5067j4830j5036j5072j4506j3853
57148D987424j3757j3964j3789j3279j3248j4170j5719j7317j8659j9582j9982
57137D813958k0051k0424k1747k4123k6863k8948k9989l0698l2012l3794l4919
57126D510390l4795l4020l3136l1564k8466k4063j9212j4146q625l086J507M984
57114D285768Q135J1364J4143J6198J8514K2598K9234L8500N0696O6651Q7019
57103D648820J11729J40536J74119K14471K64084L25183M00028M91435O02067
57094G372472P33124Q84306J054513J240962J436775J630146J806279J950052
$$ plain form
57086 18108629 20157205 22251589 24338510 26366598 28281500 30020785 31517708 32710800
57078 32710800 33547997 33984646 33988623 33558148 32736462 31604178 30252543 28759121 27179895
57069 27179895 25553267 23906164 22259335 20632213 19045368 17519241 16071682 14716784
57061 14716784 13464283 12318649 11279108 10341268 9498609 8742867 8064525 7453979 6902120
57052 6902120 6400151 5940166 5516511 5125807 4765291 4431843 4122667 3835786 3569326
57043 3569326 3321211 3089925 2874723 2674718 2488688 2316171 2157706 2013429 1882353
57034 1882353 1763636 1657607 1564949 1485757 1420133 1368843 1332568 1311111 1303647 1308298 1320030
57023 1320030 1329795 1327614 1307235 1267899 1212682 1146337 1074108 1000674 929207 861419 798348 740626
$$ packed form
57086A8108629K048576K094384K086921K028088J914902J739285J496923J193092
57078C2710800Q37197M36649L977m30475q21686j132284j351635j493422j579226
57069B7179895j626628j647103j646829j627122j586845j526127j447559j354898
57061A4716784j252501j145634j039541r37840q42659p55742o78342o10546n51859
57052F902120n01969m59985m23655l90704l60516l33448l09176k86881k66460
57043C569326k48115k31286k15202k00005j86030j72517j58465j44277j31076
57034A882353j18717j06029r2658p9192o5624n1290l6275k1457p464M651J1732
57023A320030R765k181k0379l9336n5217o6345p2229p3434p1467o7788o3071n7722
$$ plain form
57011 740626 688295 641060 598697 560866 526839 495980 468278 443853 422171 402347 383998
57000 383998 367171 351613 336799 322680 309822 298701 289267 281144 273888 267130 260913 255864 252658
56987 252658 251355 251614 253426 257236 263256 270922 278981 285941 290554 292132 290455 285411 277083 266274
56973 266274 254438 242770 231690 221428 212561 205485 199793 194802 190541 187736 187051 188824 193338
56960 193338 200809 211145 224045 239125 255494 271393 284738 293955 298091 296560 289457 278068
56948 278068 264428 250159 235960 222093 208919 196923 186569 178216 172060 168153 166620 167769
56936 167769 171911 179312 190433 205838 225597 248891 274251 299686 322395 339034 347073 345953
56924 345953 336887 321985 303743 284562 265803 247446 229136 211323 194979 180612 168201 157736
$$ packed form
57011G40626n2331m7235m2363l7831l4027l0859k7702k4425k1682j9824j8349
57000C83998j6827j5558j4814j4119j2858j1121r434q123p256o758o217n049l206
56987B52658j303K59J812L810O020P666Q059O960M613J578j677n044q328j0809
56973B66274j1836j1668j1080j0262q867p076n692m991m261k805o85J773M514
56960A93338P471J0336J2900J5080J6369J5899J3345R217M136j531p103j1389
56948B78068j3640j4269j4199j3867j3174j1996j0354q353o156l907j533J149
56936A67769M142P401J1121J5405J9759K3294K5360K5435K2709J6639Q039j120
56924C45953r066j4902j8242j9181j8759j8357j8310j7813j6344j4367j2411j0465
$$ plain form
56912 157736 149158 141930 135417 129615 124998 121767 119716 118693 118602 119116 119947 121311 123575 126613 130006
56897 130006 133767 138316 143841 150227 157527 165962 175588 186457 199024 213795 230674 249133 268695
56884 268695 288551 306799 320958 329450 332204 329890 323284 313383 301431 288520 275494 263302
56872 263302 252993 245292 240505 238793 240234 244872 253177 266266 285097 309729 339918 376054 418552
56859 418552 466335 516514 565193 607769 639009 654694 654073 640105 617046 588397 556996 525598
56847 525598 496513 471243 450822 435874 426156 421095 421317 428904 445691 472184 508624 555994
56835 555994 614917 684116 760636 840683 918953 987747 1038541 1065371 1066749 1044925 1004381 950914
56823 950914 890709 829002 769273 713543 663102 618909 581753 552309 530997 517846 512757 516043
$$ packed form
56912A57736q578p228o513n802m617l231k051j023r1N14Q31J364K264L038L393
56897A30006L761M549N525O386P300Q435R626J0869J2567J4771J6879J8459J9562
56884B68695J9856J8248J4159Q492K754k314o606r901j1952j2911j3026j2192
56872B63302j0309p701m787j712J441M638Q305J3089J8831K4632L0189L6136M2498
56859D18552M7783N0179M8679M2576L1240J5685o21j3968k3059k8649l1401l1398
56847E25598k9085k5270k0421j4948r718n061K22P587J6787K6493L6440M7370
56835E55994N8923O9199P6520Q0047P8270O8794N0794K6830J378k1824m0544n3467
56823I50914o0205o1707n9729n5730n0441m4193l7156k9444k1312j3151n089L286
$$ plain form
56811 516043 528517 550919 583195 624237 672124 724261 776924 824617 860574 878974 877435 857576
56799 857576 823431 779528 729989 678314 627201 578554 533791 493921 459365 430156 406520
56788 406520 388925 377491 371885 372008 378295 390927 409153 431635 456938 483088 506961 524835
56776 524835 533805 532701 521992 503190 478169 448678 416411 383407 351838 323025 296942 273001
56764 273001 251075 231423 213984 198321 184227 171943 161686 153236 146023 139431 133058 126882
56752 126882 121227 116517 113018 110737 109378 108358 107073 105227 102805 99837 96516 93433 91214 89895
56738 89895 89116 88968 89986 92004 93708 93897 92792 91547 90829 90481 90269 90267 90469 90641 90705 90900 91492 92600
56720 92600 94349 96866 99979 103100 105607 107343 108715 110261 112050 113605 114581 115421 116920 119161 121322
$$ packed form
56811E16043J2474K2402L2276M1042M7887N2137N2663M7693L5957J8400j539j9859
56799H57576l4145m3903m9539n1675n1113m8647m4763l9870l4556k9209k3636
56788D06520j7595j1434n606J23O287J2632J8226K2482K5303K6150K3873J7874
56776E24835Q970j104j0709j8802k5021k9491l2267l3004l1569k8813k6083k3941
56764B73001k1926j9652j7439j5663j4094j2284j0257q450p213o592o373o176
56752A26882n655m710l499k281j359j020j285j846k422k968l321l083k219j319
56738H9895p79j48J018K018J704J89j105j245p18l48k12kK02J72O4J95N92J108
56720I2600J749K517L113L121K507J736J372J546J789J555R76Q40J499K241K161
$$ plain form
56705 121322 122735 123632 124515 125279 125475 125201 125125 125674 126610 127449 127962 128200 128329 128553 129047 129866 130944 132156
56687 132156 133391 134679 136157 137740 138931 139316 139242 139499 140261 140926 141237 141907 143587 145738 147269 148030
56671 148030 148931 150663 152942 155154 157141 159113 161239 163632 166491 169971 173991 178356 182938 187602
56657 187602 191951 195375 197517 198677 199531 200287 200325 198880 195911 191913 187033 180998 174043 167255 161616
56642 161616 157096 152986 148719 143960 138338 131812 125200 119743 115990 113422 111196 108953 106867 105275
56628 105275 104461 104576 105459 106487 106855 106293 105508 105591 106812 108282 109076 109294 109577 109892 109554 108397 107137
56611 107137 106431 106245 106291 106420 106384 105877 105123 104776 104955 105018 104602 104137 104002 103972 103944 104304 104979 105024 104023 103026
56591 103026 103145 103937 104327 104494 105503 107467 109483 111227 113193 115262 116469 116582 116721 117837 119553 121088
$$ packed form
56705A21322J413Q97Q83P64J96k74p6N49R36Q39N13K38J29K24M94Q19J078J212
56687A32156J235J288J478J583J191L85p4K57P62O65L11O70J680K151J531P61
56671A48030R01J732K279K212J987J972K126K393K859L480M020M365M582M664
56657A87602M349L424K142J160Q54P56L8j445k969l998m880o035o955o788n639
56642A61616m520m110m267m759n622o526o612n457l753k568k226k243k086j592
56628A05275q14J15Q83J028L68n62p85Q3J221J470P94K18K83L15l38j157j260
56611A07137p06j86M6J29l6n07p54l47J79O3m16m65j35l0k8L60O75M5j001r97
56591A03026J19P92L90J67J009J964K016J744J966K069J207J13J39J116J716J535
$$ plain form
56575 121088 122479 124217 126329 128521 130780 133212 135614 137770 139965 142788 146557 151241 156782 163275
56561 163275 171002 180470 192161 205913 220634 234835 247418 257951 266427 272937 277581 280611 282636
56548 282636 284522 286860 289538 291982 293748 294756 295070 294702 293571 291528 288543 284976 281452 278278 275203
56533 275203 271880 268200 263966 258787 252771 246860 241877 237559 233178 228761 224895 221518 217837 213470
56519 213470 208881 204510 200218 195840 191655 187985 184841 182179 180125 178687 177557 176310 174586 172171
56505 172171 169338 166965 165726 165178 164205 162404 160435 159005 158139 157514 156785 155444 153166 150605 149136
56490 149136 149332 150227 150439 149541 148038 146571 145602 145390 145727 146007 145987 146172 147081 148463 149650 150319 150522 150336
56472 150336 150080 150575 152521 155558 158441 160272 161246 162170 163599 165650 168305 171459 174577 176654 176943
$$ packed form
56575A21088J391J738K112K192K259K432K402K156K195K823L769M684N541O493
56561A63275P727R468J1691J3752J4721J4201J2583J0533Q476O510M644L030K025
56548B82636J886K338K678K444J766J008L14l68j131k043k985l567l524l174l075
56533B75203l323l680m234n179o016n911m983m318m381m417l866l377l681m367
56519B13470m589m371m292m378m185l670l144k662k054j438j130j247j724k415
56505A72171k833k373j239n48r73j801j969j430q66o25p29j341k278k561j469
56490A49136J96Q95K12q98j503j467r69k12L37K80k0J85R09J382J187O69K03j86
56472A50336k56M95J946L037K883J831R74R24J429K051K655L154L118K077K89
$$ plain form
56457 176943 175781 174392 173690 173503 173148 172407 171588 170924 170432 170227 170469 171019 171590 172229 173209 174479 175671
56440 175671 176680 177754 178973 180055 180770 181192 181481 181746 182133 182690 183119 182982 182098 180553 178552 176663
56424 176663 175815 176464 177987 179463 180736 182016 182890 182735 181902 181377 181383 181489 182030 183944 186934 189268 190085
56407 190085 190528 191747 193030 193037 191932 190993 190702 190487 189994 189520 189325 189463 190234 191982 194445 196973 199295
56390 199295 201515 203508 205000 206215 207768 209852 212010 213812 215403 217368 220265 224210 228685 232902
56376 232902 236652 240626 245630 251570 257391 261849 264252 264762 264191 263226 261720 259063 255321 251458 248242
56361 248242 245515 242825 240199 237859 235765 233928 232633 231833 230887 229457 228180 227753 227836 227565 226802 226045
56345 226045 225380 224366 222980 221995 222202 223627 225524 227035 228069 229692 233168 238317 243319 246672 248872
$$ packed form
56457A76943j162j389p02j87l55p41q19o64m92k05K42N50N71O39R80J270J192
56440A75671J009J074J219J082P15M22K89K65L87N57M29j37q84j545k001j889
56424A76663q48O49J523J476J273J280Q74j55q33n25OJ06N41J914K990K334Q17
56407A90085M43J219J283Pj105r39k91k15m93m74j95J38P71J748K463K528K322
56390A99295K220J993J492J215J553K084K158J802J591J965K897L945M475M217
56376B32902L750L974N004N940N821M458K403N10n71r65j506k657l742l863l216
56361B48242k727k690k626k340k094j837j295q00r46j430j277m27Q3k71p63p57
56345B26045o65j014j386r85K07J425J897J511J034J623L476N149N002L353K200
$$ plain form
56330 248872 251599 255772 260990 266349 270947 274009 275536 276684 278696 281473 283945 285693 287332 289384
56316 289384 291660 293867 295976 297757 298674 298604 298151 297978 298200 298636 299293 300393 302164 304698 307816 311110
56300 311110 314327 317552 320752 323436 325237 326632 328523 331195 334246 337439 340973 344884 348787 352421
56286 352421 355989 359793 363882 368246 373003 378271 384027 390151 396411 402581 408845 415965 424593 434449
56272 434449 444590 454488 464497 475214 486776 498907 511452 524720 539399 556044 574569 594409
56260 594409 615302 637737 662513 690140 720892 755146 793398 836169 884178 938368 999607
56249 999607 1068651 1146377 1233387 1329095 1431998 1541344 1657789 1781643 1911102 2043033
56239 2043033 2174901 2304752 2429679 2545669 2649211 2738122 2810593 2864427 2897775 2910142
$$ packed form
56330B48872K727M173N218N359M598L062J527J148K012K777K472J748J639K052
56316B89384K276K207K109J781R17p0m53j73K22M36O57J100J771K534L118L294
56300C11110L217L225L200K684J801J395J891K672L051L193L534L911L903L634
56286C52421L568L804M089M364M757N268N756O124O260O170O264P120Q628R856
56272D34449J0141R898J0009J0717J1562J2131J2545J3268J4679J6645J8525J9840
56260E94409K0893K2435K4776K7627L0752L4254L8252M2771M8009N4190O1239
56249I99607O9044P7726Q7010R5708J02903J09346J16445J23854J29459J31931
56239B043033J31868J29851J24927J15990J03542Q8911P2471N3834L3348J2367
$$ plain form
56229 2910142 2902237 2875156 2830052 2768484 2692858 2606341 2512025 2412003 2307495 2199962 2091559
56218 2091559 1984293 1879374 1777892 1681426 1591197 1506998 1427747 1352774 1282031 1215520 1153382
56207 1153382 1096187 1044218 996691 952477 911368 873837 839891 809139 781694 757876 737088
56196 737088 717982 699855 682947 667432 653062 639870 628217 617986 608619 600109 593067 587564
56184 587564 582744 577857 572935 568260 563909 560113 557341 555693 554717 554044 553735 553909 554512 555549 557100
56169 557100 559110 561557 564605 568126 571434 574222 577367 581927 587623 593308 598773 604911 612176 620064
56155 620064 628226 636976 646434 656267 666567 678078 691251 705929 722250 741027 763110 789201
56143 789201 820460 858319 903438 955650 1015098 1082483 1157937 1240451 1328351 1419236 1509336
$$ packed form
56229B910142p905k7081m5104o1568p5626q6517r4316j00022j04508j07533j08403
56218B091559j07266j04919j01482r6466r0229q4199p9251p4973p0743o6511o2138
56207A153382n7195n1969m7527m4214m1109l7531l3946l0752k7445k3818k0788
56196G37088j9106j8127j6908j5515j4370j3192j1653j0231r367q510p042n503
56184E87564m820m887m922m675m351l796k772j648r76o73l09J74O03J037J551
56169E57100K010K447L048L521L308K788L145M560N696N685N465O138P265P888
56155F20064Q162Q750R458R833J0300J1511J3173J4678J6321J8777K2083K6091
56143G89201L1259L7859M5119N2212N9448O7385P5454Q2514Q7900R0885R0100
$$ plain form
56132 1509336 1594302 1671328 1739952 1800850 1855050 1904438 1951358 1996655 2038830 2075621 2105621
56121 2105621 2128047 2142197 2148086 2146960 2140396 2129106 2112656 2089479 2056941 2012443 1955268 1887134
56109 1887134 1811054 1730425 1649043 1570519 1497012 1429264 1367992 1314136 1267547 1226827 1191105
56098 1191105 1160933 1136807 1117816 1102318 1089142 1077724 1068044 1060856 1056985 1055985 1056355 1057277 1059053
56085 1059053 1061740 1064855 1068720 1074473 1082057 1089720 1096315 1102684 1110012 1118282 1127295 1137655 1149541
56072 1149541 1161769 1173269 1184416 1195915 1207591 1219414 1232458 1247517 1263794 1280231 1297142
56061 1297142 1315305 1334393 1353612 1373071 1393211 1413641 1433708 1453559 1473530 1493275 1512540
56050 1512540 1532024 1552299 1572698 1592401 1611950 1632484 1654172 1676563 1699906 1724965 1751945
$$ packed form
56132A509336Q4966P7026O8624O0898N4200M9388M6920M5297M2175L6791L0000
56121B105621K2426J4150N889j126o564j1290j6450k3177l2538m4498n7175o8134
56109A887134p6080q0629q1382p8524p3507o7748o1272n3856m6589m0720l5722
56098A191105l0172k4126j8991j5498j3176j1418r680p188l871j000L70R22J776
56085A059053K687L115L865N753P584P663O595O369P328Q270R013J0360J1886
56072A149541J2228J1500J1147J1499J1676J1823J3044J5059J6277J6437J6911
56061A297142J8163J9088J9219J9459K0140K0430K0067J9851J9971J9745J9265
56050A512540J9484K0275K0399J9703J9549K0534K1688K2391K3343K5059K6980
$$ plain form
56039 1751945 1780536 1810606 1842082 1874637 1908132 1942864 1978958 2016278 2055234 2096530 2139682
56028 2139682 2183044 2225928 2269456 2314737 2361648 2410025 2460461 2513126 2567461 2623900 2684032
56017 2684032 2748080 2814162 2881294 2951107 3025147 3102516 3181938 3264249 3350832 3441221 3534269
56006 3534269 3630400 3730826 3835868 3945769 4061808 4184921 4314567 4450487 4594044 4746228
55996 4746228 4906053 5072577 5246788 5429924 5621810 5822626 6034309 6258580 6495729
55987 6495729 6746993 7015546 7303274 7609396 7934500 8282979 8659133 9064097 9499417
55978 9499417 9970274 10481985 11036585 11636464 12288266 12999827 13776830 14626451 15560953
55969 15560953 16593869 17736756 19004406 20419785 22009943 23802420 25831931 28147532
$$ packed form
56039A751945K8591L0070L1476L2555L3495L4732L6094L7320L8956M1296M3152
56028B139682M3362M2884M3528M5281M6911M8377N0436N2665N4335N6439O0132
56017B684032O4048O6082O7132O9813P4040P7369P9422Q2311Q6583R0389R3048
56006C534269R6131J00426J05042J09901J16039J23113J29646J35920J43557J52184
55996D746228J59825J66524J74211J83136J91886K00816K11683K24271K37149
55987F495729K51264K68553K87728L06122L25104L48479L76154M04964M35320
55978I499417M70857N11711N54600N99879O51802P11561P77003Q49621R34502
55969A5560953J032916J142887J267650J415379J590158J792477K029511K315601
$$ plain form
55961 28147532 30810011 33890533 37481982 41711928 46746351 52798422 60156298 69216333
55953 69216333 80503357 94669131 112432935 134411788 160876548 191577547 225700773
55946 225700773 261800973 297582520 329773829 354576175 368776766 370912411 361684976
55939 361684976 343424317 319105176 291542859 262996767 235069162 208754989 184577633
55932 184577633 162751331 143303976 126146135 111117466 98024972 86663677 76824280
55925 76824280 68304533 60922274 54516619 48941909 44069143 39791971 36024085 32690978
55917 32690978 29728792 27088309 24732479 22628794 20747041 19062083 17553112 16199897
55909 16199897 14983132 13887304 12899456 12005948 11193760 10453957 9780530 9166581 8604584
$$ packed form
55961B8147532K662479L080522L591449M229946N034423O052071P357876R060035
55953F9216333J1287024J4165774J7763804K1978853K6464760L0700999L4123226
55946B25700773L6100200L5781547L2191309K4802346J4200591K135645r227435
55939C61684976j8260659k4319141k7562317k8546092k7927605k6314173k4177356
55932A84577633k1826302j9447355j7157841j5028669j3092494j1361295r839397
55925G6824280q519747p382259o405655n574710m872766m277172l767886l333107
55917C2690978k962186k640483k355830k103685j881753j684958j508971j353215
55909A6199897j216765j095828r87848q93508q12188p39803o73427o13949n61997
$$ plain form
55900 8604584 8089275 7617163 7183961 6785222 6418555 6082421 5773477 5487653 5223033
55891 5223033 4979265 4754980 4548143 4358017 4184329 4025186 3878084 3742216 3617537
55882 3617537 3502207 3393103 3288238 3186682 3086896 2987423 2888870 2793256 2701686 2614048
55872 2614048 2530249 2449980 2372040 2295630 2221743 2151622 2084650 2019483 1956473 1897045 1841294
55861 1841294 1788169 1737614 1690526 1646736 1604823 1564035 1525008 1488512 1454585 1422759 1392210
55850 1392210 1361922 1331583 1301909 1273413 1245576 1217923 1190949 1165023 1139422 1113576 1088285
55839 1088285 1064538 1042135 1020620 1000439 981876 964008 946122 929042 913551 898754 883674
55828 883674 869188 856445 844490 831635 818228 805768 793964 781091 766843 752494 738449
$$ packed form
55900H604584n15309m72112m33202l98739l66667l36134l08944k85824k64620
55891E223033k43768k24285k06837j90126j73688j59143j47102j35868j24679
55882C617537j15330j09104j04865j01556r9786r9473r8553r5614r1570q7638
55872B614048q3799q0269p7940p6410p3887p0121o6972o5167o3010n9428n5751
55861A841294n3125n0555m7088m3790m1913m0788l9027l6496l3927l1826l0549
55850A392210l0288l0339k9674k8496k7837k7653k6974k5926k5601k5846k5291
55839A088285k3747k2403k1515k0181j8563j7868j7886j7080j5491j4797j5080
55828H83674j4486j2743j1955j2855j3407j2460j1804j2873j4248j4349j4045
$$ plain form
55817 738449 723964 709313 695952 684247 673057 661887 651556 642385 633540 624758 617113 611443
55805 611443 607312 603952 601068 598422 595894 594290 594931 598058 602583 607479 612344 616647 619636 621234
55791 621234 621951 621868 620760 619106 617751 616619 615006 612999 611141 608671 603629 594963 583198 568968
55777 568968 552513 534882 517953 502614 488364 475242 464676 457568 452843 448815 444949 441464
55765 441464 438202 434837 431473 428316 425352 422896 421683 421805 422282 422234 421729 420930 419232 415987 411503 406604
55749 406604 401612 396326 390604 384493 378146 371953 366304 360914 354885 347764 340125 332861 326440 321055
55735 321055 316849 313595 310734 308106 306165 305123 304380 303138 301168 298678 295806 292557 288951 285071
55721 285071 281194 277767 274850 271746 267849 263688 260423 258387 256969 255838 255203 254833 254062 253179 253640
$$ packed form
55817G38449j4485j4651j3361j1705j1190j1170j0331r171q845q782p645n670
55805F11443m131l360k884k646k528j604O41L127M525M896M865M303K989J598
55791F21234P17q3j108j654j355j132j613k007j858k470n042q666j1765j4230
55777E68968j6455j7631j6929j5339j4250j3122j0566p108m725m028l866l485
55765D41464l262l365l364l157k964k456j213J22M77m8n05p99j698l245m484m899
55749D06604m992n286n722o111o347o193n649n390o029p121p639p264o421n385
55735C21055m206l254k861k628j941j042p43j242j970k490k872l249l606l880
55721B85071l877l427k917l104l897m161l265k036j418j131o35l70p71q83M61
$$ plain form
55706 253640 256239 259962 263313 265897 267934 269064 268624 266703 264062 261144 257763 253563 248392 242459
55692 242459 236487 231414 227561 224415 221475 218960 217400 216939 217374 218529 220314 222722 225911 229948 234357
55677 234357 238405 241883 245036 247656 249071 249241 249004 248822 248101 246308 244033 242242 241081 240061 238986
55662 238986 238001 237131 236334 235730 235274 234618 233774 233519 234552 236600 238853 240929 242881 244610 245905 246823
55646 246823 247590 248324 249151 250173 250957 250550 248552 245697 242807 239652 235513 230437 225095 219723 214101
55631 214101 208438 203435 199376 195854 192487 189325 186481 183927 181773 180211 179066 177803 176137 174280
55617 174280 172491 170755 168994 167297 165797 164539 163527 162706 161855 160656 158866 156316 152920 148931 145089
55602 145089 142226 140647 140065 140008 140117 140103 139671 138586 136798 134587 132585 131400 131122 131367 131847 132586 133501
$$ packed form
55706B53640K599L723L351K584K037J130m40j921k641k918l381m200n171n933
55692B42459n972n073l853l146k940k515j560m61M35J155J785K408L189M037M409
55677B34357M048L478L153K620J415J70k37j82p21j793k275j791j161j020j075
55662B38986r85q70p97o04m56o56q44k55J033K048K253K076J952J729J295R18
55646B46823P67P34Q27J022P84m07j998k855k890l155m139n076n342n372n622
55631B14101n663n003m059l522l367l162k844k554k154j562j145j263j666j857
55617A74280j789j736j761j697j500j258j012q21q51j199j790k550l396l989l842
55602A45089k863j579n82n7J09j4m32j085j788k211k002j185k78K45M80P39R15
$$ plain form
55585 133501 134211 134493 134564 134629 134517 134089 133607 133273 132799 131982 131484 132370 134859 138055 140951 143273 145275 147152
55567 147152 148895 150495 152000 153396 154470 154847 154248 152727 150610 148232 145985 144451 144035 144320 144255 143208
55551 143208 141465 139476 137169 134485 132049 130622 130059 129465 128345 127072 126234 125977 126108 126400 126702 126953
55535 126953 127211 127556 127958 128340 128623 128589 127882 126314 124019 121186 117884 114291 110733 107255 103500 99251
55519 99251 94721 90034 85021 79972 76097 74556 75428 78174 82564 88291 94116 98583 101575 104168 106882
55504 106882 109075 110204 110663 110945 110898 110395 109978 110239 111107 112296 113883 115754 117013 116701 114906 112540
55488 112540 110276 108309 106888 106287 106248 106114 105685 105425 105731 106500 107576 109081 110986 112765 113854 114235
55472 114235 114240 113987 113383 112560 111902 111613 111507 111323 110999 110554 109921 109076 108202 107491 106878 106107 105091 104026 103135
$$ packed form
55585A33501P10K82P1O5j12m28m82l34m74q17m98Q86K489L196K896K322K002J877
55567A47152J743J600J505J396J074L77n99j521k117k378k247j534m16K85o5j047
55551A43208j743j989k307k684k436j427n63n94j120j273q38k57J31K92L02K51
55535A26953K58L45M02L82K83l4p07j568k295k833l302l593l558l478l755m249
55519I9251m530m687n013n049l875j541Q72K746M390N727N825M467K992K593K714
55504A06882K193J129M59K82m7n03m17K61Q68J189J587J871J259l12j795k366
55488A12540k264j967j421o01l9j34m29k60L06P69J076J505J905J779J089L81
55472A14235Nk53o04q23o58k89j06j84l24m45o33q45q74p11o13p71j016j065q91
$$ plain form
55453 103135 102430 101816 101347 101294 101904 103077 104272 104845 104556 103716 102807 102031 101352 100830 100629 100660 100487 99793 98810
55434 98810 98099 97923 98032 98093 98182 98657 99569 100415 100683 100497 100443 100773 101105 101015 100526 99857 99094 98459 98503 99461 100683
55413 100683 101243 101003 100532 100145 99739 99505 99929 100871 101417 101032 100209 99601 99124 98481 98016 98346 99418 100546
55395 100546 101220 101460 101566 101935 102915 104396 105728 106399 106581 106678 106687 106472 106294 106432 106513 105930 104849 104085 103936
55376 103936 103778 102994 101754 100706 100331 100757 101777 102840 103429 103663 104202 105346 106492 106703 105617 103707
55360 103707 101875 100838 100629 100534 99771 98365 97165 96851 97186 97411 97169 96769 96635 96761 96810 96619 96441 96591
55342 96591 96950 97037 96594 95879 95272 94837 94506 94409 94695 95109 95128 94538 93649 92946 92724 92978 93436 93723 93710 93648 93782
55321 93782 93965 93884 93589 93455 93679 94141 94734 95519 96414 97019 96920 96149 95232 94742 94749 94735 94192 93272 92579 92329 92088
$$ packed form
55453A03135p05o14m69n3O10J173J195N73k89q40r09p76o79n22k01L1j73o94r83
55434I8810p11j76J09O1Q9M75R12Q46K68j86n4L30L32r0m89o69p63o35M4R58J222
55413A00683N60k40m71l87m06k34M24R42N46l85q23o08m77o43m65L30J072J128
55395A00546O74K40J06L69R80J481J332O71J82R7Rk15j78J38Q1n83j081p64j49
55376A03936j58p84j240j048l75M26J020J063N89K34N39J144J146K11j086j910
55360A03707j832j037k09r5p63j406j200l14L35K25k42m00j34J26M9j91j78J50
55342I6591L59Q7m43p15o07m35l31r7K86M14J9n90q89p03k22K54M58K87j3o2J34
55321I3782J83q1k95j34K24M62N93P85Q95O05r9p71r17m90Pj4n43r20o93k50k41
$$ plain form
55300 92088 91469 90636 89884 89204 88647 88621 89273 89987 90146 90136 90920 92730 94863 96719 98349 99894 101085 101509
55282 101509 101018 99827 98551 97992 98407 99092 99248 99087 99420 100248 100652 100227 99734 100001 100825 101411 101320 100618
55264 100618 99557 98469 97580 96692 95534 94593 94916 96694 98639 99352 98762 97709 96582 95141 93414 91990
55248 91990 91346 91406 91833 92445 93261 94334 95583 96690 97300 97401 97310 97286 97427 97940 98976 100060 100245 99250
55230 99250 97937 97220 96958 96464 95715 95307 95411 95506 95169 94573 94109 94011 94416 95379 96621 97583 97938 97872 97827 98050
55210 98050 98420 98607 98417 98087 98048 98300 98222 97252 95590 93975 92931 92501 92507 92740 93012 93406 94368 96148 98199
55191 98199 99576 99962 99911 100014 100228 100193 99829 99285 98506 97250 95565 93992 93077 92760 92421 91644 90719 90205
55173 90205 90137 90086 89951 90142 90729 90916 89934 88189 86980 87094 88164 89383 90399 91363 92537 94117 96208
$$ packed form
55300I2088o19q33p52o80n57k6O52P14J59j0P84J810K133J856J630J545J191M24
55282A01509m91j191j276n59M15O85J56j61L33Q28M04m25m93K67Q24N86r1p02
55264A00618j061j088q89q88j158r41L23J778J945P13n90j053j127j441j727j424
55248I1990o44O0M27O12Q16J073J249J107O10J01r1k4J41N13J036J084J85r95
55230I9250j313p17k62m94p49m08J04R5l37n96m64r8M05R63J242R62L55o6m5K23
55210I8050L70J87j90l30l9K52p8r70j662j615j044m30OK33K72L94R62J780K051
55191I8199J377L86n1J03K14l5l64n44p79j256j685j573r15l17l39p77r25n14
55173I0205o8n1j35J91N87J87r82j745j209J14J070J219J016R64J174J580K091
$$ plain form
55156 96208 98664 100964 102449 102780 102217 101442 101016 100983 101080 101275 101785 102495 102762 102142 101054 100304 100133 100200 100304
55137 100304 100555 100799 100575 99938 99798 100906 102765 104017 103868 102790 101797 101425 101517 101716 101844 101824 101511 100776
55119 100776 99755 98888 98638 99125 100048 100933 101478 101714 101867 102003 101880 101295 100600 100640 101956 104129 106134 107355
55101 107355 108052 108789 109661 110326 110622 110812 111145 111515 111808 112290 113212 114170 114410 113894 113443 113566 113750 113463 113228
55082 113228 113867 115021 115526 115283 115583 117158 118919 119395 118676 118059 118174 118457 118338 118056 118121 118563 118983 118972
55064 118972 118367 117423 116765 116835 117404 117874 118058 118217 118356 117939 116581 114695 113236 112876 113489 114252 114234 113165
55046 113165 111782 111208 111834 112973 113671 113711 113662 114042 114633 114666 113660 112030 110756 110436 110804 111279 111712 112295
55028 112295 112922 113142 112793 112302 112054 111796 110973 109610 108515 108508 109610 111104 112307 113108 113748 114334 114776 115152
$$ packed form
55156I6208K456K300J485L31n63p75m26l3R7J95N10P10K67o20j088p50j71O7J04
55137A00304K51K44k24o37j40J108J859J252j49j078r93l72R2J99J28k0l13p35
55119A00776j021q67k50M87R23Q85N45K36J53J36j23n85o95M0J316K173K005J221
55101A07355O97P37Q72O65K96J90L33L70K93M82R22R58K40n16m51J23J84k87k35
55082A13228O39J154N05k43L00J575J761M76p19o17J15K83j19k82O5M42M20j1
55064A18972o05r44o58P0N69M70J84J59J39m17j358j886j459l60O13P63j8j069
55046A13165j383n74O26J139O98M0m9L80N91L3j006j630j274l20L68M75M33N83
55028A12295O27K20l49m91k48k58q23j363j095pJ102J494J203Q01O40N86M42L76
$$ plain form
55010 115152 115811 116981 118413 119551 120007 119797 119211 118539 117901 117292 116794 116627 116835 117020 116659 115738 114785 114249
54992 114249 114077 113981 113814 113580 113405 113613 114517 115996 117530 118775 119744 120390 120514 120296 120308 120598 120356 119003
54974 119003 117172 116026 116059 117151 119216 121878 123922 124236 123290 122675 123053 123559 123439 123164 123369 123600 123001
54957 123001 121683 120609 120391 120813 121377 121715 121600 121106 120757 121043 121760 122201 121999 121443 120946 120590 120344 120373
54939 120373 120829 121457 121716 121340 120628 120105 120011 120262 120770 121532 122331 122691 122421 122052 122429 123845 125751 127349
54921 127349 128338 129143 130536 132956 136084 139297 142625 146922 152711 159180 164889 169263 172718 175335 176276
54906 176276 174888 171771 168163 164586 160684 156200 151548 147282 143439 139671 135913 132660 130486 129347
54892 129347 128606 127800 127220 127487 128650 130009 130818 130945 130803 130887 131393 132117 132686 133036 133630 135021 137297 140137
$$ packed form
55010A15152O59J170J432J138M56k10n86o72o38o09m98j67K08J85l61r21r53n36
54992A14249j72r6j67k34j75K08R04J479J534J245R69O46J24k18J2K90k42j353
54974A19003j831j146L3J092K065K662K044L14r46o15L78N06j20k75K05K31n99
54957A23001j318j074k18M22N64L38j15m94l49K86P17M41k02n56m97l56k46K9
54939A20373M56O28K59l76p12n23r4K51N08P62P99L60k70l69L77J416J906J598
54921A27349R89Q05J393K420L128L213L328M297N789O469N709M374L455K617R41
54906A76276j388l117l608l577l902m484m652m266l843l768l758l253k174j139
54892A29347p41q06n80K67J163J359Q09J27j42Q4N06P24N69L50N94J391K276K840
$$ plain form
54874 140137 143265 146588 150075 153893 158520 164170 170083 174894 177773 178763 178075 175754 172201 168313 164624
54859 164624 160796 156394 151730 147477 143832 140582 137791 135817 134684 133853 132669 130853 128608 126430
54845 126430 124694 123299 121857 120321 119139 118609 118386 117868 116783 115156 113074 110909 109501 109504 110653 112053
54829 112053 113117 113833 114220 114126 113696 113564 114261 115617 116966 117826 118217 118383 118383 118074 117432 116776 116504 116708 117215
54810 117215 117968 119061 120323 121199 121261 120600 119561 118365 117212 116481 116452 116986 117751 118649 119705 120662 121092
54793 121092 120903 120477 120247 120299 120380 120124 119347 118327 117746 118120 119288 120605 121655 122577 123690 124948 125889
54776 125889 126073 125565 125013 125181 126336 128163 130247 132489 134952 137500 139819 141812 143952 147096 151777
54761 151777 157547 163208 167939 171995 176013 179850 182700 184198 184656 184117 181948 177795 172349 166727 161544
$$ packed form
54874A40137L128L323L487L818M627N650N913M811K879R90o88k321l553l888l689
54859A64624l828m402m664m253l645l250k791j974j133q31j184j816k245k178
54845A26430j736j395j442j536j182n30k23n18j085j627k082k165j408LJ149J400
54829A12053J064P16L87r4m30j32O97J356J349Q60L91J66%l09o42o56k72K04N07
54810A17215P53J093J262Q76O2o61j039j196j153p31k9N34P65Q98J056R57M30
54793A21092j89m26k30N2Q1k56p77j020n81L74J168J317J050R22J113J258R41
54776A25889J84n08n52J68J155J827K084K242K463K548K319J993K140L144M681
54761A51777N770N661M731M056M018L837K850J498M58n39k169m153n446n622n183
$$ plain form
54746 161544 156953 153059 149782 146755 143850 141409 139547 137766 135867 134609 134662 135369 135520 135021 134767 135009
54730 135009 135011 134472 134220 135095 136944 139147 141429 143736 145893 147849 149843 152038 154417 157240 161030 165764
54714 165764 170580 174649 177857 180324 181801 182026 181228 179766 177573 174425 170449 165978 161215 156455 152235
54699 152235 148773 145570 142175 139062 137086 136215 135436 133907 131673 129253 127141 125759 125360 125709 126286
54684 126286 126893 127711 128674 129291 129290 128989 128745 128406 127638 126444 125036 123487 121962 121080 121490 122986 124406
54667 124406 124581 123307 121436 120165 120138 120962 121555 121163 120025 118893 118113 117586 117507 118486 120592 122800 123921
54650 123921 123854 123465 123363 123351 123105 122814 122906 123479 124290 125052 125520 125472 124922 124264 123967 124137 124530 124956 125407 125793
54630 125793 125733 124821 123073 121027 119337 118325 118035 118606 120251 122673 124791 125517 124763 123387 122216 121560
$$ packed form
54746A61544m591l894l277l027k905k441j862j781j899j258N3P07J51m99k54K42
54730A35009Kn39k52Q75J849K203K282K307K157J956J994K195K379K823L790M734
54714A65764M816M069L208K467J477K25p98j462k193l148l976m471m763m760m220
54699A52235l462l203l395l113j976q71p79j529k234k420k112j382l99L49N77
54684A26286O07Q18R63O17jl01k44l39p68j194j408j549j525q82M10J496J420
54667A24406J75j274j871j271k7Q24N93l92j138j132p80n27p9R79K106K208J121
54650A23921o7l89j02j2k46k91R2N73Q11P62M68m8n50o58k97J70L93M26M51L86
54630A25793o0r12j748k046j690j012k90N71J645K422K118P26p54j376j171o56
$$ plain form
54614 121560 121608 122627 124409 125994 126453 125721 124391 122981 121873 121634 122719 124766 126639 127418 127142 126575
54598 126575 126452 126951 127659 127998 127836 127686 128164 129320 130710 131995 133147 134091 134467 133978 132785 131451 130471
54581 130471 129891 129393 128840 128673 129484 131101 132444 132644 132003 131516 131591 131715 131279 130264 129080 128098 127466 127129
54563 127129 126963 127063 127791 129278 131028 132430 133538 134844 136276 137056 136782 136152 136245 137371 138954 140270
54547 140270 141021 141363 141708 142454 143669 145039 146209 147126 147965 148797 149476 149864 150197 151079 152908 155199 156767
54530 156767 156852 155883 154811 153961 153018 151937 151168 150895 150659 150022 149143 148386 147745 146988 146050 144996 143836 142698
54512 142698 141889 141510 141201 140607 139914 139636 140002 140812 141733 142417 142450 141626 140381 139650 140055 141262 142287 142454
54494 142454 141994 141615 141550 141271 140292 139009 138419 139085 140679 142455 143858 144658 144933 145014 145186 145273 144825 143773
$$ packed form
54614A21560M8J019J782J585M59p32j330j410j108k39J085K047J873P79k76n67
54598A26575j23M99P08L39j62j50M78J156J390J285J152R44L76m89j193j334r80
54581A30471n80m98n53j67Q11J617J343K00o41m87P5J24m36j015j184r82o32l37
54563A27129j66J00P28J487J750J402J108J306J432P80k74o30R3J126J583J316
54547A40270P51L42L45P46J215J370J170R17Q39Q32O79L88L33Q82J829K291J568
54530A56767Q5r69j072q50r43j081p69k73k36o37q79p57o41p57r38j054j160j138
54512A42698q09l79l09n94o93k78L66Q10R21O84L3q24j245p31M05J207J025J67
54494A42454m60l79o5k79r79j283n90O66J594J776J403Q00K75Q1J72Q7m48j052
$$ plain form
54476 143773 142651 142111 142492 143809 145708 147364 147941 147466 146839 146742 146932 146931 146966 147674 149102 150506 151211 151344
54458 151344 151648 152742 154534 156274 157197 157175 156646 156034 155482 155104 155088 155430 155913 156492 157328 158317 158971 158931 158242
54439 158242 157003 155237 153321 151974 151422 151137 150784 150846 151698 152629 152616 151796 151274 151573 152067 152038 151537 151004
54421 151004 150657 150575 150926 151741 152731 153608 154431 155474 156794 157984 158296 157169 154917 152787 152030 152838 154379
54404 154379 155749 156631 157098 157259 157234 157217 157391 157841 158590 159630 160913 162415 164162 166094 167991 169577 170586
54387 170586 170686 169724 168145 166750 165725 164301 161841 158922 156773 155951 156154 157107 158768 160685 161927
54372 161927 162023 161450 160986 160996 161442 162113 162628 162721 162782 163665 165599 167729 169045 169455 169580 169861 170343 171083 172169
54353 172169 173319 173939 173792 173392 173562 174689 176532 178646 180829 183078 185235 186977 188165 188972 189483 189403
$$ packed form
54476A43773j122n40L81J317J899J656N77m75o27r7J90jL5P08J428J404P05J33
54458A51344L04J094J792J740R23k2n29o12n52l78j6L42M83N79Q36R89O54m0o89
54439A58242j239j766j916j347n52k85l53O2Q52R31j3q20n22K99M94k9n01n33
54421A51004l47q2L51Q15R90Q77Q23J043J320J190L12j127k252k130p57Q08J541
54404A54379J370Q82M67J61k5j7J74M50P49J040J283J502J747J932J897J586J009
54387A70586J00r62j579j395j025j424k460k919k149q22K03R53J661J917J242
54372A61927R6n73m64J0M46O71N15R3O1Q83J934K130J316M10J25K81M82P40J086
54353A72169J150O20j47m00J70J127J843K114K183K249K157J742J188Q07N11q0
$$ plain form
54337 189403 188467 187026 185812 185057 184143 182262 179267 175824 172857 170843 169473 167989 165969 163728 161852
54322 161852 160577 159902 160010 161045 162490 163346 163101 162138 161067 160077 159196 158671 158697 158971 158960 158560 158172 158166 158522
54303 158522 159020 159538 159993 160114 159525 158203 156716 155749 155390 155164 154824 154709 155074 155455 155165 154149 152876
54286 152876 151569 150109 148624 147563 147133 147173 147623 148585 149863 151024 152102 153609 155623 157412 158344 158662
54270 158662 158967 159390 159739 160041 160316 160130 159060 157565 156820 157485 159027 160358 160874 160737 160382 160006 159579
54253 159579 159212 159316 160248 161828 163427 164511 164939 164807 164302 163767 163524 163440 162932 161631 159891 158463 157790
54236 157790 157724 157775 157536 157031 156682 156756 156924 156660 156013 155507 155254 154800 154059 153774 154571 156003 157098 157590 158058
54217 158058 159038 160467 161929 163036 163566 163541 163151 162425 161158 159379 157640 156456 155696 154941 154285 154240 154864
$$ packed form
54337A89403r36j441j214p55r14j881k995l443k967k014j370j484k020k241j876
54322A61852j275o75J08J035J445Q56k45r63j071r90q81n25K6K74j1m00l88oL56
54303A58522M98N18M55J21n89j322j487r67l59k26l40j15L65L81k90j016j273
54286A52876j307j460j485j061m30M0M50R62J278J161J078J507K014J789R32L18
54270A58662L05M23L49L02K75j86j070j495p45O65J542J331N16j37l55l76m27
54253A59579l67J04R32J580J599J084M28j32n05n35k43q4n08j301j740j428o73
54236A57790o6N1k39n05l49P4J68k64o47n06k53m54p41k85P97J432J095M92M68
54217A58058R80J429J462J107N30k5l90p26j267j779j739j184p60p55o56m5O24
$$ plain form
54200 154864 155512 155544 154946 154075 153200 152472 152139 152440 153312 154306 154826 154518 153486 152233 151382 151390 152322 153740 154908
54181 154908 155341 155142 154618 153744 152426 151224 151173 152662 154957 157043 158461 159059 158542 156909 154954 153682
54165 153682 153306 153234 152908 152256 151539 151178 151557 152588 153629 154218 154711 155713 157085 157995 157874 156861 155421
54148 155421 153974 152869 152284 152139 152284 152595 152691 152046 150841 150209 150900 152106 152498 152155 152419 153897 155724
54131 155724 156962 157659 158154 158331 158151 158161 158810 159758 160391 160560 160410 160024 159685 159943 160831 161529 161423 161079 161468
54112 161468 162578 163532 163927 164278 165101 166217 167187 167972 168869 169946 170775 170811 170046 169195 168952 169141 168990 168255
54094 168255 167524 167262 167198 167051 167217 168154 169550 170750 171583 172069 171727 170136 168055 167006 167600 169051 170406
54077 170406 171429 172056 171937 171081 170312 170423 171265 172206 173119 174377 176129 178208 180604 183389 186195 188355
$$ packed form
54200A54864O48L2n98q71q75p28l33L01Q72R94N20l08j032j253q51QR32J418J168
54181A54908M33j99n24q74j318j202n1J489K295K086J418N98n17j633j955j272
54165A53682l76p2l26o52p17l61L79J031J041N89M93J002J372R10j21j013j440
54148A55421j447j105n85j45J45L11R6o45j205o32O91J206L92l43K64J478J827
54131A55724J238O97M95J77j80J0O49R48O33J69j50l86l39K58Q88O98j06l44L89
54112A61468J110R54L95L51Q23J116R70P85Q97J077Q29L6p65q51k43J89j51p35
54094A68255p31k62o4j47J66R37J396J200Q33M86l42j591k081j049N94J451J355
54077A70406J023O27j19q56p69J11Q42R41R13J258J752K079K396K785K806K160
$$ plain form
54061 188355 189794 191309 193737 197122 201027 205342 210410 216392 222910 229410 235577 241137 245454 247684
54047 247684 247469 245325 242293 239279 236735 234738 233200 232051 231364 231325 232025 233372 235225 237587 240575
54032 240575 244308 248841 254038 259416 264262 268090 270952 273256 275401 277678 280255 282975 285275 286558
54018 286558 286653 285767 284117 281824 279087 276200 273418 271004 269252 268128 266916 264622 260891 256309 251734
54003 251734 247539 243573 239594 235508 231343 227195 223256 219818 217201 215506 214388 213307 212224 211743
53989 211743 212158 212578 211624 209057 206094 203904 202376 200781 199122 198134 198178 198744 199148 199233 199200 199072 198625 197815
53971 197815 197082 197078 198003 199332 200393 201190 202291 203856 205220 205686 205434 205322 206076 207980 211058 215062 219406
53954 219406 223577 227585 231707 235895 239780 243114 245821 247823 249288 250825 252807 254612 255329 255227 255705
$$ packed form
54061A88355J439J515K428L385L905M315N068N982O518O500O167N560M317K230
54047B47684k15k144l032l014k544j997j538j149o87l9P00J347J853K362K988
54032B40575L733M533N197N378M846L828K862K304K145K277K577K720K300J283
54018B86558R5q86j650k293k737k887k782k414j752j124j212k294l731m582m575
54003B51734m195l966l979m086m165m148l939l438k617j695j118j081j083m81
53989B11743M15M20r54k567k963k190j528j595j659r88M4N66M04Q5l3j28m47q10
53971A97815p33mR25J329J061P97J101J565J364M66k52j12P54J904L078M004M344
53954B19406M171M008M122M188L885L334K707K002J465J537J982J805P17j02M78
$$ plain form
53939 255705 257584 260270 262982 265894 269469 273323 276637 279277 281700 284025 285961 287557 289234 291133
53925 291133 293099 295357 298472 302458 306545 310092 313325 316940 321402 326886 333522 341344 350198 359894
53911 359894 370264 381045 391978 403217 415292 428454 442268 456013 469207 481496 492220
53900 492220 500273 504303 503164 496617 485883 473118 459967 446717 432984 418861 405032 392010
53888 392010 379731 367909 356479 345699 336025 327808 320889 314519 307918 300922 294024 287896 282961
53875 282961 279212 276138 272939 269095 264786 260563 256722 253200 249993 247334 245263 243298 240781 237613
53861 237613 234474 232199 230929 230059 229034 227939 227093 226405 225583 224820 224620 224931 225076 224720 224232 223857 223309
53844 223309 222628 222621 223636 224565 224086 222546 221457 221255 220713 218760 215815 212898 210356 208116 206509 206034
$$ packed form
53939B55705J879K686K712K912L575L854L314K640K423K325J936J596J677J899
53925B91133J966K258L115L986M087L547L233L615M462N484O636P822Q854R696
53911C59894J0370J0781J0933J1239J2075J3162J3814J3745J3194J2289J0724
53900D92220Q053M030j139o547j0734j2765j3151j3250j3733j4123j3829j3022
53888C92010j2279j1822j1430j0780r674q217o919o370o601o996o898o128m935
53875B82961l749l074l199l844m309m223l841l522l207k659k071j965k517l168
53861B37613l139k275j270q70j025j095q46o88q22p63k00L11J45l56m88l75n48
53844B23309o81pJ015R29m79j540j089k02n42j953k945k917k542k240j607m75
$$ plain form
53828 206034 206586 207441 207953 207924 207577 207411 207834 208656 209195 209159 209115 209754 210907 211719 211685 211209 211201 212295 214394 216792
53808 216792 218851 220650 222865 225952 229646 233387 237000 240776 245057 249876 254846 259411 263392 267253
53794 267253 271527 276048 280207 283882 287438 290765 293164 294610 296280 299069 302147 303825 303523 302025
53780 302025 300059 297534 294269 290658 287285 284330 281502 278244 274039 268918 263688 259233 255606 252238
53766 252238 248910 245921 243334 240770 238128 235865 234224 232775 231120 229571 228642 228192 227552 226374 224905
53751 224905 223537 222357 221174 219759 218056 216273 214692 213367 212147 211025 210244 209939 209852 209583 208956 208106
53735 208106 207396 207330 208227 209823 211412 212609 213753 215355 217322 218992 219872 220143 220490 221499 223106 224546
53719 224546 225037 224621 224130 224255 224939 225856 227107 229006 231391 233612 235223 236384 237598 239287 241644 244607
$$ packed form
53828B06034N52Q55N12k9l47j66M23Q22N39l6m4O39J153Q12l4m76qJ094K099K398
53808B16792K059J799K215L087L694L741L613L776M281M819M970M565L981L861
53794B67253M274M521M159L675L556L327K399J446J670K789L078J678l02j498
53780C02025j966k525l265l611l373k955k828l258m205n121n230m455l627l368
53766B52238l328k989k587k564k642k263j641j449j655j549r29m50o40j178j469
53751B24905j368j180j183j415j703j783j581j325j220j122p81l05q7k69o27q50
53735B08106p10o6Q97J596J589J197J144J602J967J670Q80K71L47J009J607J440
53719B24546M91m16m91J25O84R17J251J899K385K221J611J161J214J689K357K963
$$ plain form
53703 244607 247915 251332 254810 258320 261691 264903 268375 272538 277097 281133 284107 286471 289064 292206
53689 292206 295605 298900 301866 304134 305157 304687 303086 300986 298761 296517 294438 292831 291743 290817 289748
53674 289748 288694 288052 287933 288115 288366 288460 287996 286682 284959 283841 283802 284160 283921 282923 281706 280593 279539
53657 279539 278775 278816 279603 280280 280196 279726 279669 280186 280800 281214 281538 281754 281505 280635 279583 279027 279292 280233 281515
53638 281515 282843 284087 285380 287012 289028 290971 292164 292309 291832 291656 292609 294849 297735 300329 302183
53623 302183 303629 305267 307374 309934 313051 316927 321423 325942 329957 333504 337056 341042 345573 350426
53609 350426 355131 359271 362886 366500 370546 374883 379089 383073 387104 391275 395283 398850 402125 405509
53595 405509 409185 412931 416319 419064 421261 423247 425057 426067 425394 422784 418921 414815 411112 408062
$$ packed form
53703B44607L308L417L478L510L371L212L472M163M559M036K974K364K593L142
53689B92206L399L295K966K268J023m70j601k100k225k244k079j607j088r26j069
53674B89748j054o42j19J82K51R4m64j314j723j118l9L58k39r98j217j113j054
53657B79539p64M1P87O77q4m70n7N17O14M14L24K16k49q70j052n56K65R41J282
53638B81515J328J244J293J632K016J943J193J45m77j76R53K240K886K594J854
53623C02183J446J638K107K560L117L876M496M519M015L547L552L986M531M853
53609C50426M705M140L615L614M046M337M206L984M031M171M008L567L275L384
53595D05509L676L746L388K745K197J986J810J010o73k610l863m106l703l050
$$ plain form
53581 408062 405757 403953 401814 398419 393770 389024 385447 383203 381368 379046 376172 373261 370767 368958
53567 368958 368113 368284 368869 368896 368017 366843 366041 365535 365011 364829 365727 367694 369852 371573 373087 374757 376364
53550 376364 377584 378697 380284 382463 384852 387121 389206 391145 393161 395743 399184 403074 406699 409987
53536 409987 413761 418999 426080 434664 443959 453175 462053 471056 480779 491240 501987 512837 524128
53523 524128 536276 549455 563709 578939 594716 610476 626083 641966 658669 676588 696064
53512 696064 717240 739738 762947 786774 811627 837518 863761 889836 915991 942558 969180
53501 969180 995221 1020523 1045184 1068939 1091328 1112345 1132416 1151918 1171217 1190863 1211148
53490 1211148 1231615 1251652 1271415 1291481 1311668 1331045 1349223 1366875 1384725 1402745 1420660
$$ packed form
53581D08062k305j804k139l395m649m746l577k244j835k322k874k911k494j809
53567C68958q45J71N85K7q79j174q02n06n24j82Q98J967K158J721J514J670J607
53550C76364J220J113J587K179K389K269K085J939K016K582L441L890L625L288
53536D09987L774N238P081Q584R295R216Q878R003R723J0461J0747J0850J1291
53523E24128J2148J3179J4254J5230J5777J5760J5607J5883J6703J7919J9476
53512F96064K1176K2498K3209K3827K4853K5891K6243K6075K6155K6567K6622
53501I69180K6041K5302K4661K3755K2389K1017K0071J9502J9299J9646K0285
53490A211148K0467K0037J9763K0066K0187J9377J8178J7652J7850J8020J7915
$$ plain form
53479 1420660 1438449 1455802 1471713 1485384 1497166 1507860 1517268 1524179 1527779 1528413 1526764 1522862 1516255
53466 1516255 1506921 1495606 1483296 1470472 1456913 1442142 1426044 1408980 1391329 1373104 1354158
53455 1354158 1334612 1314809 1294808 1274174 1252493 1230053 1207846 1186749 1166766 1147252 1127935
53444 1127935 1109459 1092684 1077672 1063828 1050951 1039582 1030127 1022193 1015209 1009377 1005492 1003932
53432 1003932 1004225 1005567 1007433 1009759 1012844 1017129 1022898 1030188 1039091 1049865 1062456 1076203 1090469
53419 1090469 1105445 1121780 1139526 1158069 1177241 1197877 1220949 1246581 1274300 1303847 1335236
53408 1335236 1368236 1402362 1437533 1474417 1513864 1556031 1600114 1645083 1690720 1737876 1787563
53397 1787563 1839892 1894148 1949743 2006651 2064828 2123677 2182422 2240727 2298682 2356396 2413836
$$ packed form
53479A420660J7789J7353J5911J3671J1782J0694R408O911L600O34j649l902o607
53466A516255r334j1315j2310j2824j3559j4771j6098j7064j7651j8225j8946
53455A354158j9546j9803k0001k0634k1681k2440k2207k1097j9983j9514j9317
53444A127935j8476j6775j5012j3844j2877j1369r455p934o984n832l885j560
53432A003932K93J342J866K326L085M285N769P290Q903J0774J2591J3747J4266
53419A090469J4976J6335J7746J8543J9172K0636K3072K5632K7719K9547L1389
53408A335236L3000L4126L5171L6884L9447M2167M4083M4969M5637M7156M9687
53397A787563N2329N4256N5595N6908N8177N8849N8745N8305N7955N7714N7440
$$ plain form
53386 2413836 2470805 2526745 2580699 2631774 2679563 2723972 2764912 2802405 2836666 2867630 2894540
53375 2894540 2916534 2933564 2946279 2954923 2958781 2956803 2948383 2933334 2911503 2882791 2847479 2806341
53363 2806341 2760490 2711194 2659686 2606906 2553313 2498882 2443297 2386462 2329093 2272762 2219027
53352 2219027 2168479 2120752 2075222 2031187 1987491 1942761 1896520 1849722 1803806 1759502 1716881
53341 1716881 1676179 1637869 1601957 1567827 1535052 1504075 1475866 1451094 1429713 1411005 1393847
53330 1393847 1377169 1360515 1344153 1328438 1313119 1297484 1281219 1264856 1249223 1234660 1221002
53319 1221002 1208248 1196830 1187052 1178561 1170763 1163657 1157890 1153925 1151555 1150419 1150637 1152509 1155839 1160032
53305 1160032 1164893 1170921 1178685 1188290 1199667 1212985 1228386 1245526 1263880 1283499 1305026 1328870
$$ packed form
53386B413836N6969N5940N3954N1075M7789M4409M0940L7493L4261L0964K6910
53375B894540K1994J7030J2715Q644L858j978q420j5049k1831k8712l5312m1138
53363B806341m5851m9296n1508n2780n3593n4431n5585n6835n7369n6331n3735
53352B219027n0548m7727m5530m4035m3696m4730m6241m6798m5916m4304m2621
53341A716881m0702l8310l5912l4130l2775l0977k8209k4772k1381j8708j7158
53330A393847j6678j6654j6362j5715j5319j5635j6265j6363j5633j4563j3658
53319A221002j2754j1418r778q491p798p106n767l965k370j136K18J872L330M193
53305A160032M861O028P764R605J1377J3318J5401J7140J8354J9619K1527K3844
$$ plain form
53293 1328870 1354767 1382338 1411559 1442221 1473220 1503031 1530945 1557319 1582457 1605804 1626617
53282 1626617 1645001 1661715 1677042 1690322 1700618 1707460 1710903 1711201 1708544 1702894 1694027 1681965 1667320
53269 1667320 1650895 1632903 1612972 1590986 1567483 1543009 1517518 1490733 1462719 1433753 1403948
53258 1403948 1373524 1343172 1313622 1284867 1256308 1227642 1199165 1171191 1143669 1116472 1089681
53247 1089681 1063382 1037446 1011577 985383 958505 931137 904393 879627 857196 836364 816530
53236 816530 797953 780974 765257 750332 736421 724017 712920 702375 691983 681827 671796
53225 671796 661468 650703 639694 628328 616050 602564 588190 573389 558392 543522 529396
53214 529396 516456 504568 493329 482514 472078 462070 452733 444349 436780 429420 421771 413730 405270
$$ packed form
53293A328870K5897K7571K9221L0662L0999K9811K7914K6374K5138K3347K0813
53282A626617J8384J6714J5327J3280J0296O842L443K98k657n650q867j2062j4645
53269A667320j6425j7992j9931k1986k3503k4474k5491k6785k8014k8966k9805
53258A403948l0424l0352k9550k8755k8559k8666k8477k7974k7522k7197k6791
53247A089681k6299k5936k5869k6194k6878k7368k6744k4766k2431k0832j9834
53236H16530j8577j6979j5717j4925j3911j2404j1097j0545j0392j0156j0031
53225F71796j0328j0765j1009j1366j2278j3486j4374j4801j4997j4870j4126
53214E29396j2940j1888j1239j0815j0436j0008r337q384p569p360p649q041q460
$$ plain form
53201 405270 396416 387714 380065 373574 367145 359741 351626 343795 336736 330484 325354 321590 318485 314906
53187 314906 310728 306818 303545 300292 296670 293150 290075 286987 283615 280750 279315 279067 278939 278325 277277
53172 277277 275784 273704 271377 269595 268829 268847 269126 269268 269085 268650 268232 267908 267322 266091 264282 262196 259952
53155 259952 257692 255940 255200 255307 255658 255946 256170 256101 255392 254218 253133 252223 251041 249528 248365 248103 248471
53138 248471 248825 248839 248502 247906 247415 247597 248613 249962 251114 252003 252604 252548 251696 250708 250425 250920 251722 252768
53120 252768 254440 256639 258576 259703 260360 261170 262218 263172 263920 264648 265371 265808 265738 265197 264245 262783 260850
53103 260850 258904 257430 256323 255001 253271 251717 250947 250778 250602 250322 250341 250691 250817 250357 249589 248873 248182
53086 248182 247481 247006 246764 246242 245182 244225 244140 244712 245087 245024 245065 245515 246071 246563 247323 248470 249465 249786 249610
$$ packed form
53201D05270q854q702p649o491o429p404q115p831p059o252n130l764l105l579
53187C14906m178l910l273l253l622l520l075l088l372k865j435k48j28o14j048
53172B77277j493k080k327j782p66J8K79J42j83m35m18l24n86j231j809k086k244
53155B59952k260j752p40J07L51K88K24o9p09j174j085r10j182j513j163k62L68
53138B48471L54J4l37n96m91J82J016J349J152Q89O01n6q52r88k83M95Q02J046
53120B52768J672K199J937J127O57Q10J048R54P48P28P23M37p0n41r52j462j933
53103B60850j946j474j107j322j730j554p70j69j76k80J9L50J26m60p68p16o91
53086B48182p01m75k42n22j060r57q5N72L75o3M1M50N56M92P60J147R95L21j76
$$ plain form
53067 249610 249402 249167 248529 247336 245862 244596 244010 244269 244825 244611 243073 240825 238982 238029 237752 237983 238790
53050 238790 239939 240840 241250 241552 242103 242710 243041 243178 243340 243296 242538 241013 239340 238218 237822 237778 237481 236488
53032 236488 234859 233272 232631 233425 235441 237959 240132 241378 241793 242135 243043 244239 244857 244625 244292 244667
53016 244667 245690 246726 247365 247462 246824 245462 244016 243281 243319 243598 243968 244862 246397 247927 248813 249107 249131 248825
52998 248825 248011 246956 246206 245976 246072 246275 246482 246614 246735 247202 248381 250218 252271 254076 255355 256095 256657
52981 256657 257549 258742 259479 259181 258387 258283 259393 261227 263201 265321 267802 270572 273424 276263 278852
52966 278852 280626 281161 280703 279955 279416 279129 278976 278955 279150 279580 280105 280450 280363 279829 279040 278062 276647 274493
52948 274493 271697 268790 266336 264586 263494 262905 262504 261737 260087 257678 255384 254072 253749 253728 253559 253439
$$ packed form
53067B49610k08k35o38j193j474j266n86K59N56k14j538k248j843r53k77K31Q07
53050B38790J149R01M10L02N51O07L31J37J62m4p58j525j673j122l96m4k97r93
53032B36488j629j587o41P94K016K518K173J246M15L42R08J196O18k32l33L75
53016B44667J023J036O39R7o38j362j446p35L8K79L70Q94J535J530Q86K94K4l06
52998B48825q14j055p50k30R6K03K07J32J21M67J179J837K053J805J279P40N62
52981B56657Q92J193P37k98p94j04J110J834J974K120K481K770K852K839K589
52966B78852J774N35m58p48n39k87j53k1J95M30N25L45q7n34p89r78j415k154
52948B74493k796k907k454j750j092n89m01p67j650k409k294j312l23k1j69j20
$$ plain form
52932 253439 253645 254004 254141 253877 253095 251563 249354 247153 245684 244931 244339 243674 243212 243171 243498 244255 245668
52915 245668 247589 249315 250177 250070 249335 248439 247824 247654 247581 247106 246297 245775 245822 245968 245697 245145 244748 244576 244422
52896 244422 244269 244235 244205 243953 243551 243287 243245 243242 243220 243413 244075 245182 246366 247106 247125 246728 246557 246835 247064 246684
52876 246684 245837 245207 245226 245738 246337 246772 247088 247630 248852 250848 253125 255035 256402 257477 258441 259263 259980
52859 259980 260712 261331 261501 261222 261064 261595 262699 263651 263784 262974 261477 259514 257120 254312 251199 247825
52843 247825 244095 240125 236509 233858 232010 230152 227867 225635 224085 223234 222873 223188 224338 225736 226499
52828 226499 226586 226758 227388 227986 228062 227775 227405 226811 225839 224844 224357 224509 225113 225995 226840 227054 226306 225086 224347
52809 224347 224650 225917 227788 229838 231649 233128 234662 236517 238134 238529 237427 235606 234045 233106 232565
$$ packed form
52932B53439K06L59J37k64p82j532k209k201j469p53n92o65m62m1L27P57J413
52915B45668J921J726Q62j07p35q96o15j70p3m75q09n22M7J46k71n52l97j72j54
52896B44422j53l4l0k52m02k64m2lk2J93O62J107J184P40J9l97j71K78K29l80
52876B46684q47o30J9N12N99M35L16N42J222J996K277J910J367J075R64Q22P17
52859B59980P32O19J70k79j58N31J104R52J33q10j497j963k394k808l113l374
52843B47825l730l970l616k651j848j858k285k232j550q51l61L15J150J398P63
52828B26499Q7J72O30N98P6k87l70n94r72r95m87J52O04Q82Q45K14p48j220p39
52809B24347L03J267J871K050J811J479J534J855J617L95j102j821j561r39n41
$$ plain form
52794 232565 231970 230804 228765 226220 224078 222875 222232 221474 220507 219777 219531 219534 219474 219327 219282 219591 220489 222029
52776 222029 223910 225634 226915 227890 228923 230225 231554 232242 231738 230298 228877 228034 227197 225512 223263
52761 223263 221734 221578 222080 222439 222996 224433 226201 226832 225839 224408 223873 224184 224432 224289 224267 224774 225632 226503
52743 226503 227254 227802 228148 228783 230578 233860 237866 241451 244139 246100 247353 247637 247151 246846 247602 249423
52727 249423 251686 253901 255840 257182 257601 257203 256463 255657 254721 253684 252817 252145 251249 249852 248249 246853
52711 246853 245568 244065 242480 241350 240864 240600 240156 239696 239668 240117 240487 240097 238787 237175 236283 236798 238559
52694 238559 240659 242013 242070 241253 240685 241119 242097 242559 242366 242646 244229 246358 247613 247708 247583 247881 248238 248158
52676 248158 247704 247037 245985 244548 243270 242686 242741 243122 243756 244602 245300 245518 245432 245472 245762 246145 246520 246829 246906
$$ packed form
52794B32565n95j166k039k545k142j203o43p58r67p30k46Lo0j47m5L09Q98J540
52776B22029J881J724J281R75J033J302J329O88n04j440j421q43q37j685k249
52761B23263j529j56N02L59N57J437J768O31r93j431n35L11K48j43k2N07Q58Q71
52743B26503P51N48L46O35J795L282M006L585K688J961J253K84m86l05P56J821
52727B49423K263K215J939J342M19l98p40q06r36j037q67o72q96j397j603j396
52711B46853j285j503j585j130m86k64m44m60k8M49L70l90j310j612q92N15J761
52694B38559K100J354N7q17n68M34R78M62j93K80J583K129J255R5j25K98L57q0
52676B48158m54o67j052j437j278n84N5L81O34Q46O98K18q6M0K90L83L75L09P7
$$ plain form
52657 246906 246742 246751 247364 248449 249463 250175 250998 252557 255088 258144 260816 262390 262940 263128 263350 263378 262912
52640 262912 262099 261235 260296 259142 257867 256625 255378 254178 253399 253267 253431 253496 253797 255097 257609 260788
52624 260788 264038 267140 269976 272236 273502 273438 272025 269805 267624 265821 263971 261823 260071 259502 259686
52609 259686 259331 257960 256437 255737 255878 256249 256372 256093 255580 255341 255825 256822 257665 258054 258175 258060 257574 257143
52591 257143 257627 259060 260290 260327 259438 258387 257320 256131 255377 255868 257532 259429 260912 262166 263597 265196
52575 265196 266632 267592 267989 268013 267952 267793 267173 265951 264609 263778 263573 263689 263884 263993 263704 262797 261538 260405
52557 260405 259534 258815 258396 258626 259512 260604 261399 261508 260599 258666 256402 254808 254293 254473 254861 255340 255851
52540 255851 256114 255920 255453 255116 255186 255694 256397 256802 256595 256102 256074 256858 258081 259289 260434 261497 262020 261540
$$ packed form
52657B46906j64RO13J085J014P12Q23J559K531L056K672J574N50J88K22K8m66
52640B62912q13q64r39j154j275j242j247j200p79j32J64O5L01J300K512L179
52624B60788L250L102K836K260J266o4j413k220k181j803j850k148j752n69J84
52609B59686l55j371j523p00J41L71J23k79n13k39M84R97Q43L89J21j15m86m31
52591B57143M84J433J230L7q89j051j067j189p54M91J664J897J483J254J431J599
52575B65196J436R60L97K4o1j59o20j222j342q31k05J16J95J09k89r07j259j133
52557B60405q71p19m19K30Q86J092P95J09r09j933k264j594n15J80L88M79N11
52540B55851K63j94m67l37P0N08P03M05k07m93k8P84J223J208J145J063N23m80
$$ plain form
52522 261540 260338 259324 259117 259561 260150 260631 261035 261354 261455 261294 261131 261490 262921 265722 269780 274570 279276
52505 279276 283096 285688 287465 289177 290996 292045 291154 288150 284212 280836 278604 277074 275612 273991
52491 273991 272306 270715 269394 268467 267863 267389 267042 266962 267039 266944 266708 266855 267572 268162 267862 266962 266532 267193 268788
52472 268788 271094 274030 277073 279331 280603 281662 283097 284573 285740 287201 289761 293120 296119 298085
52458 298085 299199 299671 299373 298442 297526 297136 297090 296730 295371 292604 288647 284499 281278 279184 277452 275411
52442 275411 273179 271204 269634 268394 267483 266846 266178 265240 264229 263571 263429 263545 263462 262794 261548 260344 260081
52425 260081 261082 262680 263905 264464 264758 265076 265217 265070 265157 266191 268204 270480 272448 274326 276701 279757
52409 279757 283370 287793 293698 301352 310258 319870 330278 341652 353204 363160 369776 372126 370152
$$ packed form
52522B61540j202j014k07M44N89M81M04L19J01j61j63L59J431K801M058M790M706
52505B79276L820K592J777J712J819J049q91l004l938l376k232j530j462j621
52491B73991j685j591j321r27o04m74l47q0P7r5k36J47P17N90l00r00m30O61J595
52472B68788K306K936L043K258J272J059J435J476J167J461K560L359K999J966
52458B98085J114M72k98r31r16l90m6l60j359k767l957m148l221k094j732k041
52442B75411k232j975j570j240r11o37o68r38j011o58j42J16q3o68j246j204k63
52425B60081J001J598J225N59K94L18J41j47Q7J034K013K276J968J878K375L056
52409B79757L613M423N905P654Q906R612J0408J1374J1552R956O616K350j974
$$ plain form
52396 370152 364574 356803 348423 340403 332991 326369 321020 317286 314868 313035 311224 309322 307554 306258
52382 306258 305637 305566 305721 305849 305898 305982 306494 308105 311228 315367 319458 323027 326666 331113 336218 341210 345782
52365 345782 350371 355307 360051 363501 364952 364654 363543 362547 362104 362112 362150 361797 361001 360270 360257 361007 361821 362125
52347 362125 362223 362833 364101 365608 367298 369807 373643 378512 383752 389067 394553 400311 406412 413132 420880
52332 420880 429856 439893 450578 461548 472832 484997 498724 514182 530997 548900 568052 588640
52320 588640 610438 632991 655932 678881 701268 722620 742923 762480 781525 800140 818435
52309 818435 836530 854421 871992 889116 905661 921531 936762 951461 965542 978679 990612
52298 990612 1001304 1010774 1018973 1025828 1031122 1034336 1034975 1033201 1029712 1024932 1018723 1011083 1002502 993347
$$ packed form
52396C70152n578p771q380q020p412o622n349l734k418j833j811j902j768j296
52382C06258o21p1J55J28M9Q4N12J611L123M139M091L569L639M447N105M992M572
52365C45782M589M936M744L450J451k98j111r96m43QL8l53p96p31j3P50Q14L04
52347C62125R8O10J268J507J690K509L836M869N240N315N486N758O101O720P748
52332D20880Q976J0037J0685J0970J1284J2165J3727J5458J6815J7903J9152K0588
52320E88640K1798K2553K2941K2949K2387K1352K0303J9557J9045J8615J8295
52309H18435J8095J7891J7571J7124J6545J5870J5231J4699J4081J3137J1933
52298I90612J0692R470Q199O855N294L214O39j774l489m780o209p640q581r155
$$ plain form
52284 993347 983474 972960 962769 954130 947586 943154 940884 940519 941008 941419 942364 945633 952115 960805 970176
52269 970176 980004 991367 1005119 1020755 1036710 1051670 1065621 1079605 1094367 1109467 1123892 1137169
52257 1137169 1149429 1160702 1170911 1180503 1190339 1200725 1211074 1220654 1229153 1236355 1241846 1245261 1246404
52244 1246404 1244915 1240337 1232782 1223069 1211993 1199913 1187183 1174358 1161618 1148635 1135505 1123192
52232 1123192 1112465 1102837 1093269 1083568 1074352 1065949 1058153 1050966 1044742 1039463 1034571 1029751 1025416 1022200
52218 1022200 1020421 1020170 1021458 1023975 1027021 1030003 1032870 1035980 1039771 1044592 1050495 1056982 1063241 1068854
52204 1068854 1074113 1079433 1084659 1089181 1092647 1095386 1098178 1101696 1106056 1110740 1114961 1118218 1120606 1122705
52190 1122705 1125201 1128423 1132086 1135577 1138692 1141914 1145657 1149388 1151955 1152734 1151934 1149787 1146072 1140698
$$ packed form
52284I93347r873j0514j0191q639o544m432k270l65M89M11R45L269O482Q690R371
52269I70176R828J1363J3752J5636J5955J4960J3951J3984J4762J5100J4425J3277
52257A137169J2260J1273J0209R592R836J0386J0349R580Q499P202N491L415J143
52244A246404j489m578p555r713j1076j2080j2730j2825j2740j2983j3130j2313
52232A123192j0727r628r568r701r216q403p796p187o224n279m892m820m335l216
52218A022200j779k51J288K517L046K982K867L110L791M821N903O487O259N613
52204A068854N259N320N226M522L466K739K792L518M360M684M221L257K388K099
52190A122705K496L222L663L491L115L222L743L731K567P79q00k147l715n374
$$ plain form
52176 1140698 1134182 1127067 1119392 1111201 1103203 1096182 1090016 1083949 1077775 1072076 1067267 1063174 1059827 1057972
52162 1057972 1058296 1060519 1063702 1067200 1070900 1074738 1078450 1081751 1084450 1086379 1087439 1087702 1087378 1086723 1086046
52147 1086046 1085564 1085077 1084120 1082750 1081946 1082734 1084921 1087123 1088108 1087867 1087354 1087539 1088776 1090774 1093022 1095409
$$ packed form
52176A140698o516p115p675q191p998p021o166o067o174n699m809m093l347j855
52162A057972L24K223L183L498L700L838L712L301K699J929J060K63l24o55o77
52147A086046m82m87r57j370q04P88K187K202R85k41n13J85J237J998K248K387
$$ [...]
##END NTUPLES=NMR SPECTRUM
##END=
