
##TITLE=AC1302_PERAH12114_6535671_KetVU1Pe3j
##JCAMPDX= 6.0         $$ Bruker NMR JCAMP-DX V2.0
##DATA TYPE= NMR SPECTRUM
##DATA CLASS= NTUPLES
##ORIGIN= BRUKER
##OWNER= Administrator
$$ 1.72 TOPSPIN		Version 2.1
$$ 2012-11-30 19:19:18.106 -0500  Administrator@X
$$ Compression mode = diff/dup
##.OBSERVE FREQUENCY= 400.02188249412
##.OBSERVE NUCLEUS= ^1H
##.ACQUISITION MODE= SIMULTANEOUS (DQD)
##.ACQUISITION SCHEME= undefined
##.AVERAGES= 8
##.DIGITISER RES= 22
##SPECTROMETER/DATA SYSTEM= spect
##.PULSE SEQUENCE= zg30
##.SOLVENT NAME= COFFEE_meoh
##.SHIFT REFERENCE= INTERNAL, COFFEE_meoh, 1, 14.98509
##AUDIT TRAIL= $$ (NUMBER, WHEN, WHO, WHERE, PROCESS, VERSION, WHAT)
$$ ##TITLE= Audit trail, TOPSPIN		Version 2.1
$$ ##JCAMPDX= 5.01
$$ ##ORIGIN= Bruker BioSpin GmbH
$$ ##OWNER= Administrator
$$ $$ E:\/data/COFFEE/nmr/AC1302_PERAH12114_6535671_KetVU1Pe3j/40/pdata/1/auditp.txt
$$ ##AUDIT TRAIL=  $$ (NUMBER, WHEN, WHO, WHERE, PROCESS, VERSION, WHAT)
(   1,<2012-11-30 19:19:11.396 -0500>,<Administrator>,<X>,<go>,<TOPSPIN 2.1>,
      <created by zg
	started at 2012-11-30 19:18:00.732 -0500,
	POWCHK enabled, PULCHK disabled,
       configuration hash MD5:
       86 BA 57 50 F2 9D 5C 9B 26 00 A9 28 5F 66 2E 89
       data hash MD5: 64K
       B5 93 CD 3D FF D8 16 03 BF 3F 36 98 EB 98 99 84>)
(   2,<2012-11-30 19:19:13.885 -0500>,<Administrator>,<X>,<proc1d>,<TOPSPIN 2.1>,
      <Start of raw data processing
       efp LB = 0 FT_mod = 6 PKNL = 1 PHC0 = 0 PHC1 = 0 SI = 32K 
       data hash MD5: 32K
       18 99 DD 8E 75 47 B1 39 8D 4E 6A F7 96 25 96 67>)
(   3,<2012-11-30 19:19:14.257 -0500>,<Administrator>,<X>,<proc1d>,<TOPSPIN 2.1>,
      <pk PHC0 = 97.48718 PHC1 = 0 
       data hash MD5: 32K
       10 30 B3 18 52 5A 54 3F D2 91 F0 E0 5F E9 1C 51>)
(   4,<2012-11-30 19:19:14.448 -0500>,<Administrator>,<X>,<proc1d>,<TOPSPIN 2.1>,
      <abs ABSG = 1 
       data hash MD5: 32K
       AE 44 F2 4A 2B 15 44 BE E7 CA C0 FC 03 92 62 B6>)
(   5,<2012-11-30 19:19:14.580 -0500>,<Administrator>,<X>,<proc1d>,<TOPSPIN 2.1>,
      <abs ABSG = 2 
       data hash MD5: 32K
       1A 5F 97 B2 47 72 CC CB 1E 1A D4 74 7C 3B E0 1A>)
(   6,<2012-11-30 19:19:14.723 -0500>,<Administrator>,<X>,<proc1d>,<TOPSPIN 2.1>,
      <abs ABSG = 3 
       data hash MD5: 32K
       05 73 CB 7F 8C 8B 5A 84 D9 D1 0B FA 40 F2 5C 6B>)
(   7,<2012-11-30 19:19:14.855 -0500>,<Administrator>,<X>,<proc1d>,<TOPSPIN 2.1>,
      <abs ABSG = 4 
       data hash MD5: 32K
       91 09 59 41 C7 2B A8 C7 B5 7A DD F9 1F 73 C1 25>)
(   8,<2012-11-30 19:19:14.975 -0500>,<Administrator>,<X>,<proc1d>,<TOPSPIN 2.1>,
      <abs ABSG = 5 
       data hash MD5: 32K
       F8 5E 76 41 2C 2E BF 8C 64 76 6D AE 66 10 A2 77>)
$$ ##END=
$$ 
$$ $$ hash MD5
$$ $$ 03 78 D2 63 29 6C 27 41 9A 7E C0 86 02 A8 8C 73
##$RELAX= 
##$RELAX= 
##$RELAX= 
##$RELAX= 
##$RELAX= 
##$RELAX= 
##$RELAX= 
$$ Bruker specific parameters
$$ --------------------------
##$DU= <E:\>
##$EXPNO= 40
##$NAME= <AC1302_PERAH12114_6535671_KetVU1Pe3j>
$$ [...]
150 150 150 150 150 150 150 150
##$TP07= 0
##$TPNAME0= <>
##$TPNAME1= <>
##$TPNAME2= <>
##$TPNAME3= <>
##$TPNAME4= <>
##$TPNAME5= <>
##$TPNAME6= <>
##$TPNAME7= <>
##$TPOAL= (0..7)
0.5 0.5 0.5 0.5 0.5 0.5 0.5 0.5
##$TPOFFS= (0..7)
0 0 0 0 0 0 0 0
##$TUNHIN= 0
##$TUNHOUT= 0
##$TUNXOUT= 0
##$USERA1= <user>
##$USERA2= <user>
##$USERA3= <user>
##$USERA4= <user>
##$USERA5= <user>
##$V9= 5
##$VALIST= <valist>
##$VCLIST= <CCCCCCCCCCCCCCC>
##$VD= 0
##$VDLIST= <DDDDDDDDDDDDDDD>
##$VPLIST= <PPPPPPPPPPPPPPP>
##$VTLIST= <TTTTTTTTTTTTTTT>
##$WBST= 1024
##$WBSW= 4
##$XGAIN= (0..3)
0 0 0 0
##$XL= 0
##$YL= 0
##$YMAX_a= 675920
##$YMIN_a= -575269
##$ZGOPTNS= <>
##$ZL1= 120
##$ZL2= 120
##$ZL3= 120
##$ZL4= 120
##$ABSF1= 14.98509
##$ABSF2= -5.573092
##$ABSG= 5
##$ABSL= 3
##$ALPHA= 0
##$AQORDER= 0
##$ASSFAC= 0
##$ASSFACI= 0
##$ASSFACX= 0
##$ASSWID= 0
##$AUNMP= <proc_prof1d_extract_pilot.lims>
##$AXLEFT= 0
##$AXNAME= <>
##$AXNUC= <1H>
##$AXRIGHT= 0
##$AXTYPE= 0
##$AXUNIT= <>
##$AZFE= 0.1
##$AZFW= 0.1
##$BCFW= 0
##$BC_mod= 0
##$BYTORDP= 0
##$COROFFS= 0
##$CY= 15
##$DATMOD= 1
##$DC= 0
##$DFILT= <>
##$DTYPP= 0
##$F1P= 0
##$F2P= 0
##$FCOR= 0.5
##$FTSIZE= 32768
##$FT_mod= 6
##$GAMMA= 0
##$GB= 0
##$INTBC= 1
##$INTSCL= 1
##$ISEN= 128
##$LB= 0
##$LEV0= 0
##$LPBIN= 0
##$MAXI= 10000
##$MC2= 0
##$MEAN= 0
##$ME_mod= 0
##$MI= 0
##$NCOEF= 0
##$NC_proc= -8
##$NLEV= 6
##$NOISF1= 0
##$NOISF2= 0
##$NSP= 0
##$NTH_PI= 0
##$NZP= 0
##$OFFSET= 14.98509
##$PC= 1
##$PHC0= 97.48718
##$PHC1= 0
##$PH_mod= 1
##$PKNL= yes
##$PPARMOD= 0
##$PPDIAG= 0
##$PPIPTYP= 0
##$PPMPNUM= 2147483647
##$PPRESOL= 1
##$PSCAL= 4
##$PSIGN= 0
##$PYNMP= <proc.py>
##$REVERSE= no
##$SF= 400.02
##$SI= 32768
##$SIGF1= 0
##$SIGF2= 0
##$SINO= 400
##$SIOLD= 32768
##$SPECTYP= <>
##$SREGLST= <1H.CDCl3>
##$SSB= 0
##$STSI= 32768
##$STSR= 0
##$SW_p= 8223.68421052631
##$SYMM= 0
##$S_DEV= 0
##$TDeff= 65536
##$TDoff= 0
##$TI= <>
##$TILT= no
##$TM1= 0
##$TM2= 0
##$TOPLEV= 0
##$USERP1= <user>
##$USERP2= <user>
##$USERP3= <user>
##$USERP4= <user>
##$USERP5= <user>
##$WDW= 1
##$XDIM= 32768
##$YMAX_p= 475372579
##$YMIN_p= -756180
##$CURPLOT= <Network HP LaserJet P1505>
##$CURPRIN= <$Network HP LaserJet P1505>
##$DFORMAT= <normdp>
##$LAYOUT= <+/1D_H.xwp>
##$LFORMAT= <normlp>
##$PFORMAT= <normpl>
##$SURQMSG= 1
$$ End of Bruker specific parameters
$$ ---------------------------------
##NTUPLES= NMR SPECTRUM
##VAR_NAME=  FREQUENCY,     SPECTRUM/REAL,   SPECTRUM/IMAG
##SYMBOL=    X,             R,               I
##VAR_TYPE=  INDEPENDENT,   DEPENDENT,       DEPENDENT
##VAR_FORM=  AFFN,          ASDF,            ASDF
##VAR_DIM=   32768,         32768,           32768
##UNITS=     HZ,            ARBITRARY UNITS, ARBITRARY UNITS
##FACTOR=    0.250966925370066, 1,           1
##FIRST=     8223.43324360094, -76122,       -336326
##LAST=      0,             -42172,          -75280
##MIN=       0,             -756180,         0
##MAX=       8223.43324360094, 475372579,    0
$$ Real data points
##PAGE= N=1
##DATA TABLE= (X++(R..R)), XYDATA
$$ [...]
19533f0182r0613M3908k4195A84728H6375c85289J61540J01911L0124a3371k76186
$$ -60182 -150795 -106887 -131082 184728 86375 -385289 -223749 -121838 -91714 -13371 -289557
19522b89557b5789a2479k63238j6886i0900f075k56659B05333a87510I9836R0427
$$ -289557 -25789 -12479 -275717 -292603 -90900 -6075 -262734 205333 -187510 99836 190263
19511A90263a3716p7140j1795P034j1178e2634A41470b4938k9308j23592B79674
$$ 190263 -13716 -90856 -102651 -95617 -106795 -52634 141470 -24938 -54246 -177838 279674
19499C3124b660A24482L40337e8464A81763a75829N5323e3609k0230k75464A90614
$$ 33124 -2660 124482 464819 -58464 181763 -175829 -120506 -53609 -73839 -349303 190614
19487a49832o7881l96206A71495p8280K0281K585a00027A5254J03630b9996j16255
$$ -149832 -217713 -613919 171495 93215 113496 116081 -100027 15254 118884 -29996 -146251
19476a46251A03466o982a03848m9334k23465A26470i5797p5893e2685G6241b4599
$$ -146251 103466 96484 -103848 -153182 -376647 126470 -95797 -171690 -52685 76241 -24599
19464B66139a74953m5625A12963a1123j17830H9399h4248q7680j1673A62881b69579
$$ 266139 -174953 -220578 112963 -11123 -128953 89399 -84248 -171928 -183601 162881 -269579
19452a21221D87416I4793b8008j13488k00079A8866R1454C7352i8509L2949n539
$$ -121221 487416 94793 -28008 -141496 -341575 18866 110320 37352 -98509 -65560 -71099
19441g1099A03794k0394J9939A2766h190I163c77150A60092b02711A29032a20164
$$ -71099 103794 83400 103339 12766 -8190 9163 -377150 160092 -202711 129032 -120164
19429a92742k37326d7530j9977J5849j51584P8805A29507a12885N5093A35136
$$ -192742 -430068 -47530 -67507 -51658 -203242 -124437 129507 -112885 -57792 135136
19418C23449a73163D950J7009l200J98568a35879m39245a7488g910A47795e0611
$$ 323449 -173163 4950 21959 18759 217327 -135879 -575124 -17488 -7910 147795 -50611
19406D30913a8790C3528b11625j32350B8167J13861D8648a60697M6910j0488p5758
$$ 430913 -18790 33528 -211625 -343975 28167 142028 48648 -160697 -113787 -124275 -200033
19395b00033L1506A90188b49529a08333c7208j85271B7034e2982p4814A58388
$$ -200033 -168527 190188 -249529 -108333 -37208 -222479 27034 -52982 -127796 158388
19384a02100M6487j16657f5795A78680a45676m0919N0682L5781j04785F5610P5087
$$ -102100 -55613 -172270 -65795 178680 -145676 -186595 -135913 -100132 -204917 65610 140697
19373A40697B600i3330E1032b7914F431K1625H949b11736A5217d616p3968B4612
$$ 140697 2600 -93330 51032 -27914 6431 28056 8949 -211736 15217 -4616 -78584 24612
19360F1201a75200a5711H2822c6281A20297K58028d1553A7979f2599m8470F509
$$ 61201 -175200 -15711 82822 -36281 120297 378325 -41553 17979 -62599 -111069 6509
19348A39629b6895j69414h7377j4998m4722d3994A85844i0952j03009A34666a19849
$$ 139629 -26895 -196309 -87377 -102375 -147097 -43994 185844 -90952 -193961 134666 -119849
19336h1661l73557C200d48075e717B68365a4767B9834b56307G1832n902g2381
$$ -81661 -455218 3200 -448075 -5717 268365 -14767 29834 -256307 71832 65930 -72381
19324c95906J92317j36694a33679j49718d0447J816k3973j73690a03152I7012
$$ -395906 -203589 -340283 -133679 -283397 -40447 -38631 -62604 -236294 -103152 97012
19313c6683o412E3216a81357p44J1903B48394b41090A99901r2230a56766A07847
$$ -36683 -43095 53216 -181357 -182101 -170198 248394 -241090 199901 107671 -156766 107847
19301B21256d6071A57574G5964J41665a48314H1063a01087j59695O556e5491j0952
$$ 221256 -46071 157574 75964 217629 -148314 81063 -101087 -260782 -254226 -55491 -66443
19290f6443B1581h4629j50690A97670m7252N8508a14801B65248b81696d038B75894
$$ -66443 21581 -84629 -235319 197670 150418 208926 -114801 265248 -281696 -4038 275894
19278a39519e7801A424a60681D1845M43977b27839H194L27081j23883p3236k0381
$$ -139519 -57801 1424 -160681 41845 485822 -227839 8194 335275 211392 138156 117775
19267A17775a20606a2552k05518o7008B0636e8595A97444d1730k33430j6476N4185
$$ 117775 -120606 -12552 -218070 -285078 20636 -58595 197444 -41730 -275160 -291636 -237451
19256b37451P2931g6994q2435J0051j3983k69846J65775J07106P5414p3497O2520
$$ -237451 -164520 -76994 -159429 -149378 -163361 -433207 -267432 -160326 -84912 -158409 -95889
19245i5889j06608A94358h6834j38144K391f9792A03164h940j50497N2306b7817
$$ -95889 -202497 194358 -86834 -224978 -222587 -69792 103164 -8940 -159437 -107131 -27817
19233i5378a4504j53730L504E542a33587E3050b97984A91489d617j76210h6731
$$ -95378 -14504 -168234 -164730 5542 -133587 53050 -297984 191489 -4617 -180827 -86731
19221a26464A49482e82262A70643f2732j02737M2582L8346h047j34951k16084
$$ -126464 149482 -582262 170643 -62732 -165469 -122887 -84541 -8047 -142998 -359082
19211c59082H1970b89958f5005r8645H0936e33705a19031C07792c6902j28581
$$ -359082 81970 -289958 -65005 -163650 80936 -533705 -119031 307792 -36902 -165483
19201a65483o8145M6500A30734a62894l59K8080o8127B76833G5843e04722a76061
$$ -165483 -233628 -187128 130734 -162894 -163253 -135173 -203300 276833 75843 -504722 -176061
19189C5521J84652a43513A65961j922l5313f0387C59585j20930i3542p2142F1054
$$ 35521 220173 -143513 165961 164039 128726 -60387 359585 238655 -93542 -165684 61054
19177B83325F156J19519F0405b06738K304a8240A37290a77591A17374a83531D2213
$$ 283325 6156 125675 60405 -206738 -204434 -18240 137290 -177591 117374 -183531 42213
19165a17897j9574E7226J8987a81417B85054b1791A99011a35508k05901E60b60206
$$ -117897 -137471 57226 76213 -181417 285054 -21791 199011 -135508 -341409 560 -260206
19153i8674A8723M0000c45608a8019j69613P4483k48020M9462R7944N5349F5896
$$ -98674 18723 58723 -345608 -18019 -187632 -113149 -361169 -311707 -213763 -158414 65896
19141E8937d53005B8355c62257J20723A48781b13164k15804J36205A31723O4983
$$ 58937 -453005 28355 -362257 -241534 148781 -213164 -428968 -292763 131723 196706
19131A96706a15623D7537j2518J06595R7472b09387L6410I7312a29599p5546B60521
$$ 196706 -115623 47537 35019 141614 239086 -209387 -172977 97312 -129599 -205145 260521
19119A82345n3365c6845A98257c06800f1561b1039A31867e3184m58752G0588b90223
$$ 182345 128980 -36845 198257 -306800 -61561 -21039 131867 -53184 -511936 70588 -290223
19107b95273J3052E4085a02242j4498M8282c2545j3361j6423C0543J13077a02769
$$ -295273 -282221 54085 -102242 -116740 -68458 -32545 -45906 -62329 30543 143620 -102769
19095a52510B05971a60725C8099d28719A77245i3209B9616N1506b92950a13006
$$ -152510 205971 -160725 38099 -428719 177245 -93209 29616 81122 -292950 -113006
19084G6981d1991E0289b2103k27731J18835d4948m2830D227b63580b3380o7687
$$ 76981 -41991 50289 -22103 -249834 -130999 -44948 -87778 4227 -263580 -23380 -91067
19073i1067F8887d7766B10807E6558i8666r7205h4027A59687m8338j5922L86151
$$ -91067 68887 -47766 210807 56558 -98666 -195871 -84027 159687 111349 95427 481578
19062D81578j98348g497k05048M3125C54832a81975O2792B41256F0838a66063
$$ 481578 283230 -7497 -212545 -169420 354832 -181975 -119183 241256 60838 -166063
19051e6216l68222E1496a81765A44969b51247J14736d249j02063j77565Q7906
$$ -56216 -424438 51496 -181765 144969 -251247 -136511 -4249 -106312 -283877 -195971
19041a95971C82460E547R6857f4676k6903c833B21130f292B28474a25812C30947
$$ -195971 382460 5547 102404 -64676 -91579 -3833 221130 -6292 228474 -125812 330947
19029D0629b1093D10358A48260c6300j3175B08856H7210J87568d8878A00070p007
$$ 40629 -21093 410358 148260 -36300 -49475 208856 87210 274778 -48878 100070 93063
19018I3063J719J13588a32649A13644h3384I5034L3583c31608R9229C18509q0632
$$ 93063 94782 208370 -132649 113644 -83384 95034 128617 -331608 -232379 318509 237877
19007B37877B6625b50527A33425E5410j4408i368k85253g3550j6117A26871E7987
$$ 237877 26625 -250527 133425 55410 41002 -9368 -294621 -73550 -89667 126871 57987
18995f2471D2325a62508J6428O2138H5508b16709E6782b63493l5830M1226A24509
$$ -62471 42325 -162508 -146080 -83942 85508 -216709 56782 -263493 -299323 -258097 124509
18983B2729K01868G6694d3098I9278a15834k7839H2510f4929g953k01624A11103
$$ 22729 224597 76694 -43098 99278 -115834 -143673 82510 -64929 -7953 -209577 111103
18971e2518a2540j87430n4282H9330a39177A22014g6958j45682F5217r68a51560
$$ -52518 -12540 -199970 -254252 89330 -139177 122014 -76958 -222640 65217 64249 -151560
18959A38463a38223q324b5223n6563C7113a893j38521j8568g9243c1539n1696
$$ 138463 -138223 -146547 -25223 -81786 37113 -1893 -140414 -158982 -79243 -31539 -83235
18948h3235j13083d4209j95650M2267Q4226A64402A8161J86447r9006a10637k13649
$$ -83235 -196318 -44209 -239859 -197592 -113366 164402 18161 204608 105602 -110637 -324286
18937c24286M4128a02492M0035A23838a39963K2374c4963A32938a97848n7916
$$ -324286 -280158 -102492 -62457 123838 -139963 -117589 -34963 132938 -197848 -255764
18927b55764a25053O0847k51505h2498B17093k551d54892a42063k45518B9607
$$ -255764 -125053 -64206 -315711 -82498 217093 214542 -454892 -142063 -387581 29607
18916B8717K529b81191C4936J00447e1802p4888l1594n9565l4844b5362A67854
$$ 28717 31246 -281191 34936 135383 -51802 -126690 -158284 -217849 -252693 -25362 167854
18904A49876a10053B20366d0455A34740m9098g6199k0351C7163b49143c2833B20253
$$ 149876 -110053 220366 -40455 134740 85642 -76199 -96550 37163 -249143 -32833 220253
18892D7699G412a14301j20273O9357H8183k9491d2719k14987E8435b21829F9399
$$ 47699 7412 -114301 -234574 -165217 88183 58692 -42719 -257706 58435 -221829 69399
18880b91649j81575a87161J6394g4573k90334F9682b38291R5923B26262h3187
$$ -291649 -473224 -187161 -170767 -74573 -364907 69682 -238291 -142368 226262 -83187
18869f319A73990a76463A46450D8885H411a09358C16457a63600r089I6137a27543
$$ -6319 173990 -176463 146450 48885 8411 -109358 316457 -163600 -172689 96137 -127543
18857B23072b53987J00062B69397b62131A87312I0448J48169m0806a18453d917
$$ 223072 -253987 -153925 269397 -262131 187312 90448 238617 197811 -118453 -4917
18846E7605i7580l9668B0418a37332b2368g252B58108a38262b749A40464E8800
$$ 57605 -97580 -137248 20418 -137332 -22368 -7252 258108 -138262 -2749 140464 58800
18834b72666J18221A20009c26993C42897f3209j3746L0510j60889A01517g0698
$$ -272666 -154445 120009 -326993 342897 -63209 -76955 -46445 -207334 101517 -70698
18823C09352A18383E790M4249J0574i2506o2246D6492b57472D9956d1104E4972
$$ 309352 118383 5790 50039 60613 -92506 -154752 46492 -257472 49956 -41104 54972
18811a56287o9849C29266p9708q5447E0582b41326D451J2855K02290f50837A93139
$$ -156287 -226136 329266 249558 164111 50582 -241326 4451 17306 219596 -650837 193139
18799A25537b19665B3686e75j90803n6586K1351A12886a77571A7028l27c02524
$$ 125537 -219665 23686 -575 -191378 -247964 -226613 112886 -177571 17028 16701 -302524
18787C34301A49740D7549M7553L8094c83383B4224d34015b02824k7229k8493j84597
$$ 334301 149740 47549 95102 133196 -383383 24224 -434015 -202824 -230053 -258546 -443143
18776d43143A71428a89074p0545B6784a2737I735J85355b58723F783b36052i6762
$$ -443143 171428 -189074 -259619 26784 -12737 9735 195090 -258723 6783 -236052 -96762
18764C7229a92735o8272M2589A06448c28606J35920M0110A13223b66365A01527
$$ 37229 -192735 -261007 -218418 106448 -328606 -192686 -152576 113223 -266365 101527
18753a42496j26492c2714o4985a0917A22688C861J61580a43701n04C9655J84906
$$ -142496 -268988 -32714 -97699 -10917 122688 3861 165441 -143701 -144205 39655 224561
18742B24561a95688f6619j34807e9536j04318D70309B28318h6368C3682b71156
$$ 224561 -195688 -66619 -201426 -59536 -163854 470309 228318 -86368 33682 -271156
18731c33946R4728M4886B49762G4410b4141j17583L7381q9560K6341e8196q6422
$$ -333946 -239218 -194332 249762 74410 -24141 -141724 -104343 -193903 -167562 -58196 -144618
18720a44618n6857A96621a11122l562B44116A2296a46147F3080i293A63648C5148
$$ -144618 -201475 196621 -111122 -114684 244116 12296 -146147 63080 -9293 163648 35148
18708A06116A6748a16180a4276A13109b78534e3953J7292p45H9502b70865N0185
$$ 106116 16748 -116180 -14276 113109 -278534 -53953 -36661 -37406 89502 -270865 -220680
18697b20680A3864g4490B6232a43402j45799r1056b4570j50107k83873b0138E8019
$$ -220680 13864 -74490 26232 -143402 -289201 -380257 -24570 -174677 -458550 -20138 58019
18685f4674C36654D3211a24426M2579l8261q9133j956R8019g325j49363C11136
$$ -64674 336654 43211 -124426 -81847 -120108 -209241 -211197 -113178 -7325 -156688 311136
18673A31142D3066b48544A75024D3121J90916h2123I7916i6747j36860m0872p7883
$$ 131142 43066 -248544 175024 43121 234037 -82123 97916 -96747 -233607 -274479 -352362
18662c52362a03582o156n828e6992o8318N4395B52085E2175J5406b17145Q4215
$$ -352362 -103582 -109738 -115566 -56992 -125310 -70915 252085 52175 67581 -217145 -132930
18651a32930C4455L7583K37503i1476A13171a86296C4561r108a68740b0081r4644
$$ -132930 34455 72038 309541 -91476 113171 -186296 34561 25453 -168740 -20081 -114725
18640a14725o6987k23711G3163K27272i6956l4091a0520q7841d4263k96206g6114
$$ -114725 -181712 -405423 73163 300435 -96956 -131047 -10520 -98361 -44263 -340469 -76114
18628A09325M854c64361L9814P9620i5322A75780c55281C0179b76741c6758m7974
$$ 109325 114179 -364361 -324547 -244927 -95322 175780 -355281 30179 -276741 -36758 -84732
18617h4732J1745k02319e2751p6623j30318C4189C042h2753k18926A09843J71818
$$ -84732 -72987 -275306 -52751 -129374 -259692 34189 3042 -82753 -301679 109843 281661
18606B81661b15910e3678A21242K44960I2103L13h6320j09631b8498F8034J28803
$$ 281661 -215910 -53678 121242 366202 92103 92416 -86320 -195951 -28498 68034 196837
18595A96837C3533b5577E5163a44132B62030a39357A18797e2017j13059o1881
$$ 196837 33533 -25577 55163 -144132 262030 -139357 118797 -52017 -165076 -226957
18585b26957C05993b02223j5504H4474K2038b82539A48844c43828a62714a5919
$$ -226957 305993 -202223 -217727 84474 106512 -282539 148844 -343828 -162714 -15919
18574c79993D6068L90008C647i6163K0921G9029l5779a34228A7252Q5506b0505
$$ -379993 46068 436076 3647 -96163 -75242 79029 43250 -134228 17252 102758 -20505
18562a17339l16353a10429A35847a1868n19p925A06493c31627B49220j01078b85548
$$ -117339 -433692 -110429 135847 -11868 -12387 -20312 106493 -331627 249220 148142 -285548
18550a45199o9986A27500h6037J1207C9740a07238A01093c3636l00891P8439B5513
$$ -145199 -215185 127500 -86037 -74830 39740 -107238 101093 -33636 -334527 -256088 25513
18538B72262r5086b37720i4172m7151j55679M1099D0371f3107M904j13803a3646
$$ 272262 177176 -237720 -94172 -141323 -297002 -255903 40371 -63107 -58203 -172006 -13646
18526a41002q4547d0201m01284A12622K2002M1139a0688A03033B5045c53574B8925
$$ -141002 -225549 -40201 -441485 112622 134624 175763 -10688 103033 25045 -353574 28925
18514B14566m8047b5475k67113J35996P2960j21922F639b82509B02335a91057
$$ 214566 166519 -25475 -292588 -156592 -83632 -205554 6639 -282509 202335 -191057
18503G6267b0188A1739g2845j11754q69J2734B07434a61935N4399j4266B32398
$$ 76267 -20188 11739 -72845 -184599 -185468 -172734 207434 -161935 -107536 -121802 232398
18491A22472e8640k96584B51939d19213A51308l8836L6437q308N0620c7716A93255
$$ 122472 -58640 -355224 251939 -419213 151308 112472 148909 140601 191221 -37716 193255
18479B31992F062J99595K0065j03243e9642p7724A04536D6912b4345A55861c84209
$$ 231992 6062 205657 225722 122479 -59642 -137366 104536 46912 -24345 155861 -384209
18467b64739A28976a87491p5110e8530j1933L721D3462I250b77834c9852E6733
$$ -264739 128976 -187491 -262601 -58530 -70463 -66742 43462 9250 -277834 -39852 56733
18455e604l78581e3787l30583I5221a71468l1380A7986b2295B19040a76169e9637
$$ -5604 -384185 -53787 -384370 95221 -171468 -202848 17986 -22295 219040 -176169 -59637
18443a26158M4251l30752A65724a98093K0784d8332A60412c9804I086K28376b33217
$$ -126158 -81907 -412659 165724 -198093 -177309 -48332 160412 -39804 9086 237462 -233217
18431g131m55779a58990A93735c35152a29355i729j33691A18848b58359B26980
$$ -7131 -462910 -158990 193735 -335152 -129355 -9729 -143420 118848 -258359 226980
18420B25427i9814j8673k17862H8484d9915k84192c4156D8407f6509p3394l207
$$ 225427 -99814 -118487 -336349 88484 -49915 -334107 -34156 48407 -66509 -139903 -143110
18409a43110A1264g4701B23543b11174E1612O2096a60809e0750A93697F954K25689
$$ -143110 11264 -74701 223543 -211174 51612 113708 -160809 -50750 193697 6954 232643
18398B32643D059a49263a3669l79354o9611a04095D1718K0239d719k53321F2399
$$ 232643 4059 -149263 -13669 -393023 -462634 -104095 41718 61957 -4719 -258040 62399
18386a62339r0720J25873D5188a902C9425R4621a81018g0801r9985B3872K0986
$$ -162339 -253059 -127186 45188 -1902 39425 134046 -181018 -70801 -170786 23872 44858
18375D4858b759k54k8471n3665J2317F5470j4032a4589I3203l2098b03562D0367
$$ 44858 -2759 -3013 -31484 -85149 -72832 65470 51438 -14589 93203 61105 -203562 40367
18362c92611J62036O139B29332C5050M9053a37212o434G3472b81497C30952b12418
$$ -392611 -230575 -224436 229332 35050 84103 -137212 -143646 73472 -281497 330952 -212418
18350a00042A29127P9873L0642j16325f0965B67624B8212d65515h7336D613N6246
$$ -100042 129127 209000 239642 123317 -60965 267624 28212 -465515 -87336 4613 60859
18339F0859b38224B13671b57250b5048K415l79975E0195a20329A49888a1557A58209
$$ 60859 -238224 213671 -257250 -25048 -22633 -402608 50195 -120329 149888 -11557 158209
18327d62731A40017b76020a14955k81949F6459J27214a96722L6279c9835k03797
$$ -462731 140017 -276020 -114955 -396904 66459 193673 -196722 -160443 -39835 -243632
18317b43632j10127B40023f1170C2926f3567j20877B12822J02736a22511l51552
$$ -243632 -353759 240023 -61170 32926 -63567 -184444 212822 315558 -122511 -474063
18307d74063J36847A46895m5067K09070e799p2410j96835A96856B3534e0745A69457
$$ -474063 -337216 146895 101828 310898 -5799 -78209 -275044 196856 23534 -50745 169457
18295A77620q7117B3621C803d5811j9295A97925q9442F416J25115a14309H2135
$$ 177620 90503 23621 3803 -45811 -65106 197925 108483 6416 131531 -114309 82135
18283b76570N081A5937n058a51879k2245E4493b04604h4817A49102g7643B5004
$$ -276570 -271489 15937 10879 -151879 -174124 54493 -204604 -84817 149102 -77643 25004
18271A2756K98996E4958b8943G1617L26025j06892b07262B62506F526h7721j02278
$$ 12756 311752 54958 -28943 71617 397642 290750 -207262 262506 6526 -87721 -189999
18260a89999f5173j21783r8697J32333C7186J523M2346c18471b5389B26749g9790
$$ -189999 -65173 -186956 -285653 -153320 37186 38709 81055 -318471 -25389 226749 -79790
18248C2215a17188o6218E2174c45970c4501c832j0154l8696B4332b44289B84836
$$ 32215 -117188 -183406 52174 -345970 -34501 -3832 -13986 -52682 24332 -244289 284836
18236h5237I7726J25812f1359j60934a6492k02333B21898H9550i3168j4409c5831
$$ -85237 97726 223538 -61359 -222293 -16492 -218825 221898 89550 -93168 -107577 -35831
18224F5225J49958D5782i5715A34093D4829f5777A78778K9366c00232c4800j40823
$$ 65225 215183 45782 -95715 134093 44829 -65777 178778 208144 -300232 -34800 -175623
18213a75623H7849b30906A17035K2872b03543h0582j50828n7712e850D513c38711
$$ -175623 87849 -230906 117035 139907 -203543 -80582 -231410 -289122 -5850 4513 -338711
18201i1611C7744b48261B03704G3352L62533c10018B16696g3017k07476a05856
$$ -91611 37744 -248261 203704 73352 435885 -310018 216696 -73017 -280493 -105856
18190a1096j6579l13787h5262b1417l798B82953c25278N1033i4681A72739e1711
$$ -11096 -27675 -341462 -85262 -21417 -25215 282953 -325278 -274245 -94681 172739 -51711
18178a35157G6941b94022i12A6193K05911c0697k1007j6091l66380b06881k04082
$$ -135157 76941 -294022 -912 16193 222104 -30697 -51704 -67795 -434175 -206881 -410963
18167d10963A1169a41693A05642E0166J24139o5865K7056h9903I1414J72449f2112
$$ -410963 11169 -141693 105642 50166 174305 108440 135496 -89903 91414 263863 -62112
18155E7908a8699F251J68752a26033B11985c8882A13906M8261l3098a26756e4410
$$ 57908 -18699 6251 175003 -126033 211985 -38882 113906 162167 129069 -126756 -54410
18143A48917o7133b50048c2669k62918r9946J97161f6375j05133c7495C2774h8862
$$ 148917 81784 -250048 -32669 -295587 -395533 -198372 -66375 -171508 -37495 32774 -88862
18131a60162J6849n9482h6648A498c2244C58074j17045K3792a53469A48282e9819
$$ -160162 -143313 -202795 -86648 1498 -32244 358074 241029 264821 -153469 148282 -59819
18119I8350a33734k49170F0788b25996B04426o6959a64955A45924c0578l56178
$$ 98350 -133734 -382904 60788 -225996 204426 137467 -164955 145924 -30578 -386756
18109c86756a83975C3427g9276j8111r9829A77667E6266J02562E6891c68979G8347
$$ -386756 -183975 33427 -79276 -97387 -197216 177667 56266 158828 56891 -368979 78347
18097A09327i659C13786f4541e187B13415a92868n2959e6665F9929a07647C48039
$$ 109327 -9659 313786 -64541 -5187 213415 -192868 -245827 -56665 69929 -107647 348039
18085b5279B17469C7657a00850r9697g0291j32011B3255r326O2633e0741B48673
$$ -25279 217469 37657 -100850 -200547 -70291 -202302 23255 13929 76562 -50741 248673
18073e5282F6133b69763f6292j37605P4341j26419R5155f9500k20514P6991A81368
$$ -55282 66133 -269763 -66292 -203897 -129556 -255975 -160820 -69500 -290014 -213023 181368
18061g9900k49427R0735J15629D4652h9642l2870B39082a07193k73019a57342
$$ -79900 -329327 -238592 -122963 44652 -89642 -122512 239082 -107193 -380212 -157342
18050A27130n0029a67197p0407A23847a46291A08365C9348b91060h3986A71139
$$ 127130 77101 -167197 -237604 123847 -146291 108365 39348 -291060 -83986 171139
18039d73753E3775R9488o9651J30436d40578a71040p3713F3404J05144D818h3048
$$ -473753 53775 153263 83612 214048 -440578 -171040 -244753 63404 168548 4818 -83048
18027B81797a40425e9735A74281f3502A81527d4367A83152a73206f1948m0316
$$ 281797 -140425 -59735 174281 -63502 181527 -44367 183152 -173206 -61948 -102264
18017a02264k5067k13696G6609b04728B42887b08095A97431c05559J0812f9573
$$ -102264 -127331 -341027 76609 -204728 242887 -208095 197431 -305559 -294747 -69573
18006g109C5496b10103k6897A20704E2633d2940A01804b42025P2088h426l55279
$$ -7109 35496 -210103 -237000 120704 52633 -42940 101804 -242025 -169937 -8426 -363705
17995c63705J3524h2809A46972f6949e745A43873J49915a71097A03047b21113
$$ -363705 -350181 -82809 146972 -66949 -5745 143873 293788 -171097 103047 -221113
17984D0239a23238B9275M33125A69927D276b15237g497H8945c21997C4499a11194
$$ 40239 -123238 29275 462400 169927 4276 -215237 -7497 88945 -321997 34499 -111194
17972g325I2951a65443k4077C37232c6667j99150o8166B21167q2793d2468J8127
$$ -7325 92951 -165443 -189520 337232 -36667 -235817 -303983 221167 138374 -42468 -24341
17961b4341C39959a64768F2914a88239b7356A19241O3232A2492J88906a79523
$$ -24341 339959 -164768 62914 -188239 -27356 119241 182473 12492 201398 -179523
17950b37772d0064q001B24864c02795a02497I5855M2150b04736J7574C694J14491
$$ -237772 -40064 -48065 224864 -302795 -102497 95855 138005 -204736 -187162 3694 118185
17939A18185i0503j16865m6420B70097a76778j43345C90839e89795G6985d09559
$$ 118185 -90503 -207368 -253788 270097 -176778 -320123 390839 -589795 76985 -409559
17928b21263M558H8804m3158L7823b23946B51785c41256a54422a59l2148A06025
$$ -221263 -216705 88804 45646 83469 -223946 251785 -341256 -154422 -159 -32307 106025
17916A40521a62759A34818c221m4894r8018K9618L8293L2735p8603M3918A22458
$$ 140521 -162759 134818 -3221 -48115 -146133 -116515 -78222 -45487 -124090 -80172 122458
17904b20252j9271C23182e1345j06972g2613a5432B04903M4209o1920h7606j67628
$$ -220252 -239523 323182 -51345 -158317 -72613 -15432 204903 249112 187192 -87606 -255234
17893b55234J24900B56475g8011j13053m6505q792G2803a53128N0486L9232m5180
$$ -255234 -130334 256475 -78011 -191064 -237569 -246361 72803 -153128 -102642 -63410 -108590
17882a08590E7833a47775r2828A10686K9379E1813a45993C12881c62998B67256
$$ -108590 57833 -147775 -240603 110686 140065 51813 -145993 312881 -362998 267256
17871D8106d5869m2922k92872a0058j7124o88434e2906B34591b588k31986A42290
$$ 48106 -45869 -88791 -381663 -10058 -27182 -715616 -52906 234591 -2588 -234574 142290
17859A81842g3623j89248J15763A79643F4596J4008K56179a99670k36991b04950
$$ 181842 -73623 -262871 -147108 179643 64596 78604 334783 -199670 -436661 -204950
17848F9558N7956D4277g555l5185A65606H0329b97838J40197C91022r5424F2848
$$ 69558 127514 44277 -7555 -42740 165606 80329 -297838 -157641 391022 295598 62848
17836a12351B42314G4975H367i3053A02588b72091J31449A32855E7911M0217b5312
$$ -112351 242314 74975 8367 -93053 102588 -272091 -140642 132855 57911 98128 -25312
17824A17429a30629J8910L2598l7118B45278j19336h1837p1989p7435e4313k5574
$$ 117429 -130629 -111719 -79121 -116239 245278 125942 -81837 -153826 -231261 -54313 -79887
17813g9887j04692B13171E6513J01717j935a8016A9180N7849L20156i0608j64840
$$ -79887 -184579 213171 56513 158230 156295 -18016 19180 77029 397185 -90608 -255448
17802b55448Q0748E8217b14867j30512g4973r2275H6408A6055i8685B63175a68496
$$ -255448 -174700 58217 -214867 -345379 -74973 -167248 86408 16055 -98685 263175 -168496
17790a46669k86907K12208C66179b37832l4358B06964f5016A21407b47491F0998
$$ -146669 -433576 -221368 366179 -237832 -272190 206964 -65016 121407 -247491 60998
17779a80630A71002a54416A02659D4999a238E4648f6544c1767j42742k37753D95
$$ -180630 171002 -154416 102659 44999 -1238 54648 -66544 -31767 -174509 -412262 495
17767h8724K0883B1291f2645A0367J1620J87822a65628B01718g3914A5768J07879
$$ -88724 -67841 21291 -62645 10367 21987 209809 -165628 201718 -73914 15768 123647
17756A23647e2132A1026a3551j85015o4916j73319D9874r071J23367a69703j69853
$$ 123647 -52132 11026 -13551 -198566 -263482 -436801 49874 40803 164170 -169703 -339556
17745c39556J7803b3721j47597A2070a33023C5366L97027i9260J2926j10626f1099
$$ -339556 -321753 -23721 -171318 12070 -133023 35366 432393 -99260 -86334 -196960 -61099
17733A70337l0299a76187A1924c3299j42795J6324F4253J14119P0313a19364H0988
$$ 170337 140038 -176187 11924 -33299 -176094 -159770 64253 178372 248685 -119364 80988
17721a98659e3102A06846f0218l54735I4636i9398B01751o1540a48339f1383A4759
$$ -198659 -53102 106846 -60218 -414953 94636 -99398 201751 140211 -148339 -61383 14759
17709B26325g4220G9413a11248e0778k38056B91023a724j16816A92605j1807a88046
$$ 226325 -74220 79413 -111248 -50778 -288834 291023 -1724 -118540 192605 180798 -188046
17697H9545b4927k12989A38843J29508C1746J00168F5879a37164G9553G464b15634
$$ 89545 -24927 -237916 138843 268351 31746 131914 65879 -137164 79553 7464 -215634
17685a05200a0357j54846f5643r480p7159A09617c2179O553B2451b52905a2754
$$ -105200 -10357 -165203 -65643 -75123 -152282 109617 -32179 -25626 22451 -252905 -12754
17673A41475a69085H5053O8530b25217F8674A654a516l21562L8168B22168E1631
$$ 141475 -169085 85053 153583 -225217 68674 1654 -1516 -323078 -284910 222168 51631
17661B44881a25785A13845k0698a15172d6178p0844A25686L5150m597j594g8227
$$ 244881 -125785 113845 93147 -115172 -46178 -117022 125686 160836 156239 154645 -78227
17649f8556k43206Q210B05883b94564J33035J2892A02076P2279g6422A6270P7754
$$ -68556 -311762 -303552 205883 -294564 -161529 -148637 102076 174355 -76422 16270 94024
17638I4024m3580l934g1466A86770m9796F4600N6697D7890K06567o168a13586
$$ 94024 50444 46510 -71466 186770 136974 64600 121297 47890 254457 248289 -113586
17626B04591J1931q4473c1496j11681B69186a98875j9925N9583B44165B3624M9069
$$ 204591 216522 132049 -31496 -143177 269186 -198875 -218800 -159217 244165 23624 72693
17615G2693b86769b1851B7198K13735b4328P864B31801b2719E713K4359O3715
$$ 72693 -286769 -21851 27198 240933 -24328 -16464 231801 -22719 5713 30072 93787
17604I3787J54293O7192j38685a70439C78087F7729A5891J53543I118d1071E6456
$$ 93787 248080 315272 176587 -170439 378087 67729 15891 169434 9118 -41071 56456
17592a03068d2898D310J885a64397I0912i8191D5637O0783J5825a41366B64853
$$ -103068 -42898 4310 6195 -164397 90912 -98191 45637 106420 122245 -141366 264853
17580i9437C353K00749E2505A5304c6359B56185r5572N284b22990D0103b37167
$$ -99437 3353 204102 52505 15304 -36359 256185 160613 165897 -222990 40103 -237167
17568a44061H5387f5262C35726B9098J36058a66116B21825d203H6059J0628m4558
$$ -144061 85387 -65262 335726 29098 165156 -166116 221825 -4203 86059 96687 52129
17557E2129K4457c40841d4098L898l1015A58521c17045b5150j15346F5267J20791
$$ 52129 76586 -340841 -44098 -40200 -71215 158521 -317045 -25150 -140496 65267 186058
17546A86058f0802g16C33975E8487J96191f17A82926C6496J1184e5070J0089A42218
$$ 186058 -60802 -716 333975 58487 254678 -617 182926 36496 47680 -55070 -44981 142218
17533G32R5336D6377J10168a97912R208Q1525B52063l0437a17085B08667j0722
$$ 732 96068 46377 156545 -197912 -188704 -107179 252063 221626 -117085 208667 197945
17522A97945p1865j4300a0216j24761c975k99351f0494k28833a27582C9883J81550
$$ 197945 126080 111780 -10216 -134977 -3975 -303326 -60494 -289327 -127582 39883 221433
17511B21433b41151B03224d5889C57716a94863c6170A3233b79253A35347K19557
$$ 221433 -241151 203224 -45889 357716 -194863 -36170 13233 -279253 135347 354904
17501C54904A58401C4279b2487C28246i3690B87442i945A24294P680o2693L82312
$$ 354904 158401 34279 -22487 328246 -93690 287442 -9945 124294 131974 69281 451593
17490D51593E783N518R999a22122C49993B2460b33535i9613C163e1699C34911
$$ 451593 5783 11301 21300 -122122 349993 22460 -233535 -99613 3163 -51699 334911
17478D18255F449L05186G2877B4386L74093q3052c7818B79117Q1561A4388P0310
$$ 418255 6449 311635 72877 24386 398479 315427 -37818 279117 360678 14388 84698
17467H4698M2758C8371J15889b75594B25222q7609B9799J6979Q0805c0707C31980
$$ 84698 127456 38371 154260 -275594 225222 137613 29799 46778 127583 -30707 331980
17455B35941K14966A49650D2794b61210B15316I5720K53644j52705H0328j1413
$$ 235941 450907 149650 42794 -261210 215316 95720 349364 196659 80328 68915
17445F8915J77892J07803J73899k49094G3108K89813r4661b0604A91892H2063
$$ 68915 246807 354610 528509 279415 73108 362921 268260 -20604 191892 82063
17434C59059j16903M6821a60503c1528A04941L16315A74491J1954r0188g3690
$$ 359059 242156 288977 -160503 -31528 104941 421256 174491 186445 96257 -73690
17423f0314B45666m9376K61720A21222L34059C8910R3698j076M0883M4021L030
$$ -60314 245666 196290 458010 121222 455281 38910 132608 131532 172415 216436 219466
17412B19466L6655p2836J46565H6102e2925A96913P7659J1308o3208D4051a3144
$$ 219466 256121 183285 329850 86102 -52925 196913 274572 285880 222672 44051 -13144
17400E8705O2250k0687b78k34390h6528B61993A1955a84246C38008j14350J01839
$$ 58705 120955 100268 -278 -234668 -86528 261993 11955 -184246 338008 223658 325497
17389C25497L7634a4113A29197L17797G4960K47626J93218B00660J8173r0515
$$ 325497 363131 -14113 129197 446994 74960 322586 515804 200660 218833 128318
17379A28318O1526C0801J16394L6060L12374A12869A650J73529l5285J03306R5646
$$ 128318 189844 30801 147195 183255 495629 112869 1650 175179 139894 243200 338846
17368C38846A465K05774q4884J89158L4779D717K40179I0002l6607K14867A11869
$$ 338846 1465 207239 122355 311513 346292 4717 244896 90002 53395 268262 111869
17356A51888e1376D5415Q2200n7979K03617A19138J50619Q0305E5058d2261B0370
$$ 151888 -51376 45415 127615 69636 273253 119138 269757 350062 55058 -42261 20370
17344C17330J02598b74694C56847j21742a00911n3575A49680b19073B87460b3983
$$ 317330 419928 -274694 356847 235105 -100911 -154486 149680 -219073 287460 -23983
17333f7248K1171A27826K31973M508A29809K42877E4897b06039B22502K78953
$$ -67248 -46077 127826 359799 364307 129809 372686 54897 -206039 222502 501455
17323E01455A00049I808J83505c7058A16052Q0627g3829B55270n1444M21854B40225
$$ 501455 100049 9808 193313 -37058 116052 196679 -73829 255270 203826 625680 240225
17311d3795B06053J1293J13017A11310N1199K07206c12120D80534A86102c09388
$$ -43795 206053 217346 330363 111310 162509 369715 -312120 480534 186102 -309388
17300B91714d987B14002K05279j96997I3510L1024Q6270n3354a5038A84495m2304
$$ 291714 -4987 214002 419281 222284 93510 124534 210804 157450 -15038 184495 142191
17289A42191F6195J43145c1047B62787I8400d9305C6611K24098q7816J2195J06431
$$ 142191 66195 209340 -31047 262787 98400 -49305 36611 260709 172893 185088 291519
17278B91519H3803C9143K28456D292L08226j35883E1544b3905B18068F0614J94402
$$ 291519 83803 39143 267599 4292 312518 176635 51544 -23905 218068 60614 255016
17267B55016n3562k2929A8315J86971J92572j93492F3729N26557A35250K33144
$$ 255016 201454 178525 18315 205286 397858 204366 63729 590286 135250 368394
17257C68394A75294E1717L17531A59690K4487L358b04508B54776A3442A460K46703
$$ 368394 175294 51717 369248 159690 184177 187535 -204508 254776 13442 1460 248163
17246B48163E3091M10724A14844M13774k29493p3205J58388A92033G6080j3325
$$ 248163 53091 463815 114844 528618 299125 225920 384308 192033 76080 62755
17236F2755R9445J74987q211j53904K0239h7685A30457K66507H7944L40418G8368
$$ 62755 162200 337187 328976 175072 195311 -87685 130457 396964 87944 428362 78368
17224B89745D2110j4429K84373A22998L0174E9652d4943F63486A67462p2681i8185
$$ 289745 42110 27681 312054 122998 153172 59652 -44943 663486 167462 94781 -98185
17212D81238a06326b4267E35142F3919J3607K64785j49764P6448K87134k06794
$$ 481238 -106326 -24267 535142 63919 77526 342311 192547 268995 556129 349335
17202C49335F0821D196M0727Q9428K92143j31421d2279D05061A46836J62363j7424
$$ 349335 60821 4196 44923 134351 426494 295073 -42279 405061 146836 309199 291775
17191B91775M8622A2011O8035J57613l680r1052a74786C00830L8681R709j16777
$$ 291775 340397 12011 80046 237659 233979 142927 -174786 300830 339511 349220 232443
17180B32443m869Q4595a20894D3763b35878D09071J8900n5206j80195L8036J27324
$$ 232443 227574 312169 -120894 43763 -235878 409071 427971 372765 192570 230606 357930
17169C57930J1154A72755J26235j32248J42712K640A02047M07255l0889j11045
$$ 357930 369084 172755 298990 166742 309454 312094 102047 509302 478413 367368
17159C67368j30592I8347K28174J18524j23247M198J24935p3953a5200C70378
$$ 367368 236776 98347 326521 445045 321798 325996 450931 376978 -15200 370378
17148A08958j9296J56124m8660L75244j04718K996j14289N0107A83524K49595
$$ 108958 89662 245786 197126 572370 467652 470648 356359 406466 183524 433119
17138D33119I9768M52095p0977A06517N8551J68548J18209K8946j35677N8034
$$ 433119 99768 551863 480886 106517 165068 333616 451825 480771 345094 403128
17128D03128m8644K9895j61837N7331n3138R536R7197J8687j01024K80329j91319
$$ 403128 354484 384379 222542 279873 226735 236271 333468 352155 251131 531460 340141
17117C40141r386j4413j53638L39602J36985A35141J59469K82028J82104l09113
$$ 340141 330755 316342 162704 502306 639291 135141 294610 576638 758742 449629
17107D49629K96990e3976C95523m3260A37256Q8990l9402K11152K33743i9502
$$ 449629 746619 -53976 395523 352263 137256 226246 186844 397996 631739 -99502
17096D14485J10272j28210n8452P8402r4420M82502l06386j3836L9479J05119
$$ 414485 524757 396547 338095 416497 322077 804579 498193 484357 523836 628955
17086F28955m3850r4608k40192J41740A87289J88105A10801L53213J69927n3958
$$ 628955 585105 490497 250305 392045 187289 375394 110801 464014 633941 579983
17076E79983k27098M5972j36420r2405J62071O5761q1031K24787r4136j23663
$$ 579983 352885 398857 262437 170032 332103 397864 316833 541620 447484 323821
17066C23821M0822L35626B13825M34636k57183j88622Q8263M30526J336k84897
$$ 323821 364643 700269 213825 648461 391278 202656 290919 721445 722781 437884
17056D37884L99570D02518K85122j72726O1262A36563Q0089K54833J76822j33104
$$ 437884 837454 402518 687640 514914 576176 136563 216652 471485 648307 515203
17046E15203M2903B37727R2193J45025j8505J31480l4715M1374o6160j18716J78782
$$ 515203 558106 237727 329920 474945 456440 587920 553205 594579 528419 409703 588485
17035E88485l9464J60429q6501l05463K77101O8484J05153A84570K33007J75364
$$ 588485 549021 709450 622949 317486 594587 663071 768224 184570 417577 592941
17025E92941j34047L23924l06707M48916C95389K41362j52767n5678K78428l8975
$$ 592941 458894 782818 476111 925027 395389 636751 483984 428306 706734 667759
17015F67759O789J07523P1461k31901P348K01682k34890j16194O76736m09467
$$ 667759 674548 782071 853532 621631 628979 830661 595771 479577 1156313 746846
17005G46846K57432l23019j4063J85743m1202k35576N7701J86604K11345l93285
$$ 746846 1004278 681259 667196 852939 811737 576161 633862 820466 1031811 638526
16995F38526L223o9867K09822r4641l05623K69716M10701l77992K24148J06603
$$ 638526 641749 571882 781704 687063 381440 651156 1061857 683865 908013 1014616
16985A014616k99007L3352O3937O962J8106K20522l14240J29807M2193j02903
$$ 1014616 715609 748961 812898 819860 837966 1058488 744248 874055 916248 813345
16975H13345K29847j30962Q5436J19506k80549K84555j68659J58213j15368o9912
$$ 813345 1043192 912230 997666 1117172 836623 1121178 952519 1110732 995364 925452
16965I25452J73958j19298j49259K98789j52360J16296j95790N8651r2402J72502
$$ 925452 1099410 980112 830853 1129642 977282 1093578 897788 956439 864037 1036539
16955A036539R0535o5719Q5605q2105J86733j08346p5399j3215n0035N1481N4901
$$ 1036539 1127074 1061355 1146960 1064855 1251588 1143242 1067843 1054628 1004593 1056074 1110975
16944A110975J71353m6960k40005L28736m7878K45888k97352k22879M09059l41628
$$ 1110975 1282328 1235368 995363 1324099 1276221 1522109 1224757 1001878 1410937 1069309
16934A069309L24015j64729J72388J88745j37389p1541j84856K21012J11843r3280
$$ 1069309 1393324 1228595 1400983 1589728 1452339 1380798 1195942 1416954 1528797 1435517
16924A435517k69488M71639j01727k98769L21033Q6101j46531j98934J65640L67920
$$ 1435517 1166029 1637668 1535941 1237172 1558205 1644306 1497775 1298841 1464481 1832401
16914A832401j1125l36392j4991J42167j20810K19145p3664j53511K03184j37657
$$ 1832401 1821276 1484884 1469893 1612060 1491250 1710395 1636731 1483220 1686404 1548747
16904A548747J09918R3652J4906m1687m9196K11892k27496N86740m87777K11777
$$ 1548747 1658665 1752317 1767223 1725536 1676340 1888232 1660736 2247476 1759699 1971476
16894A971476N4864k41362J77123J48164j30328j71451K47061k28027L09497k12979
$$ 1971476 2026340 1784978 1962101 2110265 1979937 1808486 2055547 1827520 2137017 1924038
16884A924038M90101j38816J02089J13393k38756q148j45975J20809K944M65039
$$ 1924038 2414139 2275323 2377412 2490805 2252049 2243901 2097926 2218735 2221679 2686718
16874B686718k21265k40768L08439K39173j90872L65440l22938J05168j00718
$$ 2686718 2465453 2224685 2533124 2772297 2581425 2946865 2623927 2729095 2628377
16865B628377K19705p1163R4847O590m2228J57965m345K85471j65195K01265J9848
$$ 2628377 2848082 2776919 2871766 2878356 2836128 2994093 2989748 3275219 3110024 3311289 3331137
16854C331137l63261O72672q1398j02784L73750k56298l07903K23143M92425k98997
$$ 3331137 2967876 3640548 3559150 3456366 3830116 3573818 3265915 3489058 3981483 3682486
16844C682486L63606m61190O00281m23581L0628p0026O98611J26558k94648M15153
$$ 3682486 4046092 3584902 4185183 3761602 3792230 3722204 4420815 4547373 4252725 4667878
16834D667878j07880l35646N37930k47084N72168n8942l53995O02562o8593K42736
$$ 4667878 4559998 4224352 4762282 4515198 5087366 5028424 4674429 5276991 5208398 5451134
16824E451134j56080K74138P5055n2066J79154L60858P3284l44633J84864J38931
$$ 5451134 5295054 5569192 5644247 5592181 5771335 6132193 6205477 5860844 6045708 6184639
16814F184639K25930M73012j38732L39959K961K80349j54744K81595p6247L66835
$$ 6184639 6410569 6883581 6744849 7084808 7087769 7368118 7213374 7494969 7418722 7785557
16804G785557L17782M1798M49169j27070J17572M30993J01257J52985J84613N40624
$$ 7785557 8103339 8145137 8594306 8467236 8584808 9015801 9117058 9270043 9454656 9995280
16794I995280l2881Q6119M38511L24332N50264J18695K74558M28984L04208J64377
$$ 9995280 9962399 10048518 10487029 10811361 11361625 11480320 11754878 12183862 12488070 12652447
16784A2652447O43717N32495J39569N31099L12493M54391K24802Q75799M93121
$$ 12652447 13296164 13828659 13968228 14499327 14811820 15266211 15491013 16366812 16859933
16775A6859933M05113M23046N81945R97187L69867Q00545P10573O53155N67962
$$ 16859933 17265046 17688092 18270037 19267224 19637091 20437636 21148209 21801364 22369326
16766B2369326J220600N25216J080977J070673Q69675P70765J565900P52803J220339
$$ 22369326 23589926 24115142 25196119 26266792 27136467 27907232 29473132 30225935 31446274
16757C1446274J407334J273420J495234K013995J523154J425383J916371J965886
$$ 31446274 32853608 34127028 35622262 37636257 39159411 40584794 42501165 44467051
16749D4467051K139210K309233K202217K709954K888605K729233L072574K990837
$$ 44467051 46606261 48915494 51117711 53827665 56716270 59445503 62518077 65508914
16741F5508914L656611L542500M074471M137619M782534M282929M737319N229982
$$ 65508914 69165525 72708025 76782496 80920115 85702649 89985578 94722897 99952879
16733I9952879N363813N565025N851804O130719O222346O076169O312951O419439
$$ 99952879 105316692 110881717 116733521 122864240 129086586 135162755 141475706 147895145
16725A47895145N980439O031848N548525M835048M532804L516036K522941J782722
$$ 147895145 153875584 159907432 165455957 170291005 174823809 178339845 180862786 182645508
16717A82645508J005226j95649j123187j865691l384552l662612m500946m963561
$$ 182645508 183650734 183455085 182331898 180466207 177081655 173419043 168918097 163954536
16709A63954536n936719n656409o312977o521539o101365o424833o449745n941898
$$ 163954536 158017817 152361408 146048431 139526892 133425527 127000694 120550949 114609051
16701A14609051n686327n918899n254676n120827n065508m706482m338036l995027
$$ 114609051 108922724 103003825 97749149 92628322 87562814 82856332 78518296 74523269
16693G4523269l819937l736755l276923l769505k480365l067655k767548k038307
$$ 74523269 70703332 66966577 63689654 59920149 57439784 54372129 51604581 49566274
16685D9566274k516564k033793k142867j590545k032044j396267j837785j530518
$$ 49566274 47049710 45015917 42873050 41282505 39250461 37854194 36016409 34485891
16677C4485891j956867p76072j078637j731142j008221q88209j384188q40308
$$ 34485891 32529024 31752952 30674315 28943173 27934952 27046743 25662555 24822247
16669B4822247p00200j015999q50494n37177j253145l41281m69076r29842n38538
$$ 24822247 24122047 23106048 22255554 21718377 20465232 20123951 19654875 18725033 18186495
16660A8186495n30446o47618l54483q04273j62763n87175m79634k30776q37680
$$ 18186495 17656049 17008431 16653948 15849675 15686912 15099737 14620103 14389327 13551647
16651A3551647r9366n83753j83118l45088k75709o31345J93956l84135n59472
$$ 13551647 13452281 12868528 12685410 12340322 12064613 11433268 11627224 11243089 10683617
16642A0683617n89884M74291q28556j09262q2012m13239j78832Q446l04438j31580
$$ 10683617 10093733 10568024 9739468 9630206 9548194 9134955 8956123 8964569 8660131 8528551
16632H528551k55294k73334j14836j59323k06096k18147o0885o0702q2285m28427
$$ 8528551 8273257 7999923 7885087 7725764 7519668 7301521 7240636 7179934 7097649 6669222
16622F669222O2528j676j56795m91940J03218j78158q4574P564n39237J67265
$$ 6669222 6731750 6730074 6573279 6081339 6184557 6006399 5921825 5929389 5390152 5557417
16612E557417m11571J71260j955l01012j64887J29599m50662P0070P8733p7653
$$ 5557417 5145846 5317106 5315151 5014139 4849252 4978851 4528189 4598259 4676992 4599339
16602D599339K16009m34816j4826N1412j10666j28157j42066k87392K05263j98776
$$ 4599339 4815348 4380532 4365706 4417118 4306452 4178295 4036229 3748837 3954100 3755324
16592C755324L3757j19034j56758l8188k2550j12040r7870J98925N227J14079
$$ 3755324 3789081 3670047 3513289 3475101 3452551 3340511 3242641 3441566 3446793 3560872
16582C560872n78321M45745m47136m0444L30513k02809J85217k16783j86497n95
$$ 3560872 2982551 3428296 2981160 2940716 3271229 3068420 3253637 3036854 2850357 2849762
16572B849762R8486l31804O6085K00605j76072m2640K68873k66781j542L5393
$$ 2849762 2948248 2616444 2682529 2883134 2707062 2664422 2933295 2666514 2664972 2700365
16562B700365J354j76734j72263K52260n40601L52928k80091k4429K45654J70108
$$ 2700365 2701719 2524985 2352722 2604982 2064381 2417309 2137218 2112789 2358443 2528551
16552B528551m01540Q2148j04886j57026J45151M3478k30638Q6440l07996J76577
$$ 2528551 2127011 2209159 2104273 1947247 2092398 2135876 1905238 1991678 1683682 1860259
16542A860259R8090J12319o1616m1795l08624P2612j1020r962K8870J47057j00605
$$ 1860259 1958349 2070668 2009052 1967257 1658633 1731245 1720225 1710263 1739133 1886190 1785585
16531A785585K4516o4146l77579M06829j81616L27046l60097J29177Q4784k16400
$$ 1785585 1810101 1745955 1368376 1775205 1593589 1920635 1560538 1689715 1774499 1558099
16521A558099J46977l25012M5384L88842n83451K97969J6996l71143O1945K14924
$$ 1558099 1705076 1380064 1425448 1814290 1230839 1528808 1545804 1174661 1236606 1451530
16511A451530l25374K97451J8203k08979m9008J85264j5468k4935K00173n44891
$$ 1451530 1126156 1423607 1441810 1232831 1183823 1369087 1353619 1328684 1528857 983966
16501I83966J55389J50277j29126J60835j75237N9569l34138M28964m01146K12221
$$ 983966 1139355 1289632 1160506 1321341 1146104 1205673 871535 1300499 899353 1111574
16491A111574K0973L42132n55361J53352r5015P8797l81960L53731J62952j87648
$$ 1111574 1132547 1474679 919318 1072670 977655 1056452 674492 1028223 1191175 1003527
16481A003527J34118J74318k69329K32453j96721L54k66576j88532N04731E63982
$$ 1003527 1137645 1311963 1042634 1275087 1078366 1078720 812144 623612 1128343 563982
16470H28193R0942j32518Q0811K68567j51776j52375M23973D67427K97734l7254
$$ 828193 919135 786617 867428 1135995 984219 831844 1255817 467427 765161 727907
16460G27907K38000k34563L65025n15230L01894l4005J39957k02288j46902l1590
$$ 727907 965907 731344 1096369 581139 883033 849028 988985 786697 639795 608205
16450F08205L29946j97863J79229j83812r0053R4063j55664K33362l5058p0799
$$ 608205 938151 740288 919517 735705 645652 739715 584051 817413 782355 711556
16440G11556r1967N0694O8751M3381j19357J94078q0057O0843j115j18722n8938
$$ 711556 619589 670283 739034 782415 663058 857136 777079 837922 836807 718085 659147
16429F59147k5200M5488k58410L60896P5017j26248j04920J96679k87160J80332
$$ 659147 633947 679435 421025 781921 856938 730690 625770 822449 535289 715621
16419G15621K2267j0530j94058J11014J52099k63375m7380J47005j17533q0446
$$ 715621 737888 727358 533300 644314 796413 533038 485658 632663 515130 434684
16409D34684o0180n0378J96990K23211j5465l41516L3530p9408L22846k68494
$$ 434684 374504 324126 521116 744327 728862 387346 420876 341468 664314 395820
16399C95820J63749k251M6860O7127l05083A1325N08852p9223l3721J03861N8
$$ 395820 559569 557318 604178 671305 366222 11325 520177 440954 407233 511094 511152
16388E11152Q6183j12020J24563B57786j26933N91515L163j73693j07826j3992
$$ 511152 597335 485315 609878 257786 130853 722368 725531 551838 444012 430020
16378D30020r4675M1554j41540O80067A41928J39059q9568G4793M29247o7967
$$ 430020 335345 376899 235359 915426 141928 280987 191419 74793 504040 436073
16368D36073J4579B08086K13451j07726A12262K18472j07245L437k7251K95365
$$ 436073 450652 208086 421537 313811 112262 330734 223489 226926 199675 495040
16358D95040j33842j17642K24427B30966p4500K35131l0458L4810j19554K20898
$$ 495040 361198 243556 467983 230966 156466 391597 361139 395949 276395 497293
16348D97293j31124J15437k21948m764L03472Q1721r5498p4244p0517J97035j77038
$$ 497293 366169 481606 259658 254894 558366 640087 544589 470345 399828 596863 419825
16337D19825J60057A70878L32848A42467K44407l442q8739K30083A94451J7770
$$ 419825 579882 170878 503726 142467 386874 383432 294693 524776 194451 212221
16327B12221J61053A15518l2155A1311J60780K71840Q1439A8495J94183L38914
$$ 212221 373274 115518 83363 11311 172091 443931 525370 18495 212678 551592
16317E51592B66811K30688j79311j6343L2966J24509J15481j18680J6296B14538
$$ 551592 266811 497499 318188 301845 334811 459320 574801 456121 472417 214538
16306A03756K66045A28605L44746B34487H3420J81676J75785J59726a37815E51516
$$ 103756 369801 128605 473351 234487 83420 265096 440881 600607 -137815 551516
16295E07874A79761J71114J9739A17209O04846k34965K4850B18552b41117D55708
$$ 507874 179761 350875 370614 117209 722055 487090 511940 218552 -241117 455708
16284D99413A68231L82402k61876j25659L28354A15692N1606P8744K68192m1439
$$ 499413 168231 550633 288757 163098 491452 115692 167298 246042 514234 472795
16274D72795A41577J59762L34958p5375A45429J98268B4796K04480j05018g2661
$$ 472795 141577 301339 636297 560922 145429 343697 24796 229276 124258 -72661
16263B98711A7139J08400M67548k17190I0443J71416A4452K50223l2473L43492
$$ 298711 17139 125539 593087 375897 90443 261859 14452 264675 232202 575694
16253E75694a5095C42323p0527d8693A23113K28473J73351j86186J8053L9178
$$ 575694 -15095 342323 271796 -48693 123113 351586 524937 338751 356804 395982
16243C95982A07477k0715a98931A54927L8561J04948a12902l3118c8681D38136
$$ 395982 107477 86762 -198931 154927 193488 298436 -112902 -146020 -38681 438136
16232B8893K88320d1384D39947j48788J42571j70024l1384a5462A44910d7852
$$ 28893 317213 -41384 439947 291159 433730 263706 232322 -15462 144910 -47852
16221D43043E6426K40533J83428K12939B82126A34898E8095M7285J18581K81153
$$ 443043 56426 296959 480387 693326 282126 134898 58095 105380 223961 505114
16211E05114E7790c1633F9990K3104K17916G8163K01313a11082L4361A47544Q9950
$$ 505114 57790 -31633 69990 93094 311010 78163 279476 -111082 -76721 147544 237494
16200B37494J7559I1546a02241p1896O9814B58275b02463A05327b8709E3391K9632
$$ 237494 255053 91546 -102241 -174137 -104323 258275 -202463 105327 -28709 53391 83023
16189H3023K00739A35809i0067B47746j08832a0720C61480B1433J62509O3571
$$ 83023 283762 135809 -90067 247746 138914 -10720 361480 21433 183942 247513
16179B47513g020A67893C3977J77130e6793I5780f8932B80477n1219H9984N67133
$$ 247513 -7020 167893 33977 211107 -56793 95780 -68932 280477 229258 89984 657117
16168F57117A82610J26904a30223C53610a30454A13186O5666j0830H2807e5421
$$ 657117 182610 309514 -130223 353610 -130454 113186 178852 168022 82807 -55421
16157D57751j47073j01721H622K35311k264g7079b3017A23439B2199M7663R2489
$$ 457751 310678 208957 8622 243933 241669 -77079 -23017 123439 22199 69862 162351
16146A62351K564k430o3629h7582F8129d3299l92081A82278M3424J32217A15861
$$ 162351 164915 162485 98856 -87582 68129 -43299 -435380 182278 225702 357919 115861
16134A94615B8259h5969D28222A07348L2094m4393C6818d3062j7424F3984J68099
$$ 194615 28259 -85969 428222 107348 139442 95049 36818 -43062 -60486 63984 232083
16123B32083b9949A8872N9448K51367j32083P9700C4526L15247H0677i603n6611
$$ 232083 -29949 18872 78320 329687 197604 277304 34526 349773 80677 -9603 -66214
16112f6214o6227F9706a38557q7771B09020h6473g561n18099A45920C6836L35187
$$ -66214 -132441 69706 -138557 -226328 209020 -86473 -7561 -525660 145920 36836 372023
16101C72023A27277J73170j13439c42271H5796a44021C1170N1971c04814a0366
$$ 372023 127277 300447 187008 -342271 85796 -144021 31170 83141 -304814 -10366
16090b3586A29887b91562A82986c60170A4247L7137d5258j3196A9519a01823k8751
$$ -23586 129887 -291562 182986 -360170 14247 51384 -45258 -58454 19519 -101823 -130574
16079a30574j48852f8047B8879N5507K80202D3642b47232B5079n130Q0164l8270
$$ -130574 -279426 -68047 28879 84386 364588 43642 -247232 25079 19949 100113 61843
16068F1843c9640j01504I1898M06391a99559L4373H9559O6060o2504a22147j859
$$ 61843 -39640 -141144 91898 498289 -199559 -165186 89559 155619 93115 -122147 -124006
16057a24006L8821I2057m1039a17529c8367k37955F3625J89491a34943D8033K807
$$ -124006 -85185 92057 51018 -117529 -38367 -276322 63625 253116 -134943 48033 50840
16046E0840d2660D8773A1685b00459j55019b5746A92940b18137A02253L5879D2368
$$ 50840 -42660 48773 11685 -200459 -355478 -25746 192940 -218137 102253 138132 42368
16034i7933B60701I189b30073d1951A1732J216b20916F1765J46596C3904c27907
$$ -97933 260701 9189 -230073 -41951 11732 12948 -220916 61765 208361 33904 -327907
16022f1978C93457j33166B9900J03505a17437A01367a14141j2350B4402f7517
$$ -61978 393457 260291 29900 133405 -117437 101367 -114141 -126491 24402 -67517
16011a4212B40725n8450B7457c13238n370B0105J67593j4318P4200b21027k7313
$$ -14212 240725 182275 27457 -313238 -318608 20105 187698 173380 247580 -221027 -248340
16000b48340a2550A10118O295i5437F583d4689I3288J3366g8742j4325F3618K58583
$$ -248340 -12550 110118 116413 -95437 6583 -44689 93288 106654 -78742 -93067 63618 322201
15988C22201d0805j59981e553j5222j95093G943J36205B9722a79324C39423A21774
$$ 322201 -40805 -200786 -5553 -20775 -215868 7943 144148 29722 -179324 339423 121774
15976C8844a7139B57211J29606A55667g3579c1957k45082a4614I4087g040j14078
$$ 38844 -17139 257211 386817 155667 -73579 -31957 -277039 -14614 94087 -7040 -121118
15965a21118b7484f153A31206n2531a3755j53186N0662I4765i3422A69723d1289
$$ -121118 -27484 -6153 131206 78675 -13755 -166941 -116279 94765 -93422 169723 -41289
15953b38994k8720A62113E3575c99090A08967d0309E5909L00901a56592C11270
$$ -238994 -267714 162113 53575 -399090 108967 -40309 55909 356810 -156592 311270
15942a23965k6708I3204a3989A61698a09794L6586q0637o6139m5370a27439l6267
$$ -123965 -150673 93204 -13989 161698 -109794 -73208 -153845 -219984 -265354 -127439 -163706
15931a63706j59302G5513c14906a17783B16950i6908j4100C1164a04939Q214C07373
$$ -163706 -323008 75513 -314906 -117783 216950 -96908 -111008 31164 -104939 -96725 307373
15919C50471J275a31384l5529F1517L7316c00394A3831R1536D2914a06950k35476
$$ 350471 351746 -131384 -166913 61517 98833 -300394 13831 105367 42914 -106950 -342426
15908c42426J01369A18322m8272e3995j69516B40816a60370M8824k6445j2588
$$ -342426 -241057 118322 70050 -53995 -223511 240816 -160370 -111546 -137991 -150579
15898a50579j92184k652J07296A6654J24630h2630j28577I8914g3002j38589L10
$$ -150579 -342763 -345415 -238119 16654 141284 -82630 -211207 98914 -73002 -211591 -211281
15887b11281Q9516C2348h7589A14150f4292j85615J22667D261M3984a46624A54614
$$ -211281 -121765 32348 -87589 114150 -64292 -249907 -127240 4261 48245 -146624 154614
15875c3929C1541e9513p5147j39729A62501d6916k61219h312A06287R3703o0847
$$ -33929 31541 -59513 -134660 -274389 162501 -46916 -308135 -8312 106287 199990 139143
15864A39143a44597A54416o5661A5114M8974a2264A14788g416A06553P6752b8308
$$ 139143 -144597 154416 88755 15114 64088 -12264 114788 -7416 106553 183305 -28308
15852b56272b3m56463D53931a58208a7671l0044o7278d675A39126P27k3839a36783
$$ -256272 -23 -456486 453931 -158208 -17671 -47715 -114993 -4675 139126 139853 116014 -136783
15839b49819D17443G1310J20005J34034e9001I90P4215b80611i0534a5749j57238
$$ -249819 417443 71310 191315 325349 -59001 990 75205 -280611 -90534 -15749 -172987
15828a72987k55897D1141J54690q9268c50946a22161A5511J71202d3839G8908
$$ -172987 -428884 41141 195831 106563 -350946 -122161 15511 186713 -43839 78908
15817a95507l45191c3486l15711j6633f5721C19873A08810m2790h1310H4095d3276
$$ -195507 -540698 -33486 -349197 -365830 -65721 319873 108810 66020 -81310 84095 -43276
15805B99769a23600B5253K49027B2790h5080q9940d2631q7350o4136j00087J07694
$$ 299769 -123600 25253 274280 22790 -85080 -175020 -42631 -129981 -194117 -294204 -186510
15794a86510f9841B5470J13470n7189b00218i8820D1490f6223C06544i3898j31110
$$ -186510 -69841 25470 138940 81751 -200218 -98820 41490 -66223 306544 -93898 -225008
15783b25008I2513f850k1577j64739d7394l06985b6485k83743i9834p3711G2364
$$ -225008 92513 -6850 -28427 -193166 -47394 -354379 -26485 -310228 -99834 -173545 72364
15771c15702B66885b77223C8032h2890A41352a05471p5316L2477K3243B62801
$$ -315702 266885 -277223 38032 -82890 141352 -105471 -180787 -148310 -125067 262801
15760B29310a02545A72303E7710a63045I2818J91307c70825A41525C0190J49439
$$ 229310 -102545 172303 57710 -163045 92818 284125 -370825 141525 30190 179629
15750A79629g8092E2705b9037C8844L3337j8504J53786a35167A29268c77944A22823
$$ 179629 -78092 52705 -29037 38844 72181 53677 207463 -135167 129268 -377944 122823
15738A3789J4627C183b55145H9915a78343B42641a85451j54779A66797a72120
$$ 13789 28416 3183 -255145 89915 -178343 242641 -185451 -340230 166797 -172120
15727A43314a53815C4487a58349K313K5449j03529B38940b71118P6327l11876
$$ 143314 -153815 34487 -158349 -156036 -130587 -234116 238940 -271118 -194791 -506667
15717e06667a02702n4973n3483I9861a12761A4653h8828A08a12385A96978D8733
$$ -506667 -102702 -157675 -211158 99861 -112761 14653 -88828 108 -112385 196978 48733
15705b61942c2224j09704L9726D9386J50491H5571K2738E930J25535E5105K26251
$$ -261942 -32224 -141928 -102202 49386 199877 85571 108309 5930 131465 55105 281356
15694B81356b7597j31952M4002C21442I5110d2091p7929B78179b88510a05301
$$ 281356 -27597 -159549 -115547 321442 95110 -42091 -120020 278179 -288510 -105301
15683c5044l58163a02103l1200d1164A01078a74854A19875a67391k63681K05952
$$ -35044 -393207 -102103 -133303 -41164 101078 -174854 119875 -167391 -431072 -225120
15673b25120o590B91743A16890E2734A3537K17707B4578P4122n312c22396J33777
$$ -225120 -231710 291743 116890 52734 13537 231244 24578 98700 93388 -322396 -188619
15662a88619B90209G0211K48835H3131J23604b42159C7986R4502h4024A24708
$$ -188619 290209 70211 319046 83131 206735 -242159 37986 132488 -84024 124708
15651c598D5518H681M7958P0895b12235g0478G6689a844k78916b246A37317a32888
$$ -3598 45518 8681 56639 127534 -212235 -70478 76689 -1844 -280760 -2246 137317 -132888
15638A12670l4999b0831l0921A30636d8466q3384f1531l3303k05557I7564g0859
$$ 112670 77671 -20831 -51752 130636 -48466 -131850 -61531 -94834 -300391 97564 -70859
15626d42364a10932J2121A74673A9329N2273d15621C1948a96357O6047d7479J9828
$$ -442364 -110932 -98811 174673 19329 71602 -415621 31948 -196357 -130310 -47479 -27651
15615b7651j09171j11650R1517j10928H7612J47997a05544L4104K6156B68458
$$ -27651 -136822 -248472 -156955 -267883 87612 235609 -105544 -71440 -45284 268458
15604a8097j9324G3090R109A3157a2127j79971A6084c38566P8978A0143L2029
$$ -18097 -37421 73090 82199 13157 -12127 -192098 16084 -338566 -259588 10143 42172
15593D2172a17742K5089j58231C70827j17774o3084E2814J3041b27072j01496
$$ 42172 -117742 -92653 -250884 370827 253053 189969 52814 65855 -227072 -328568
15583c28568B10533N0325a25776M0510C1394R6524b8860j57498Q6575d3621m9375
$$ -328568 210533 260858 -125776 -85266 31394 127918 -28860 -186358 -99783 -43621 -92996
15572i2996m3330j18881F5641a9891q588A85003i1180A3946N1008b3743A70621
$$ -92996 -136326 -255207 65641 -19891 -28479 185003 -91180 13946 64954 -23743 170621
15560c84481B73506b77358F9390b45887a20160L0760A76567B6418a9450A13062
$$ -384481 273506 -277358 69390 -245887 -120160 -89400 176567 26418 -19450 113062
15549a79754A1309J32402E6872P6139m3391K06947j217a41249D0643N6757J44209
$$ -179754 11309 143711 56872 133011 89620 296567 295350 -141249 40643 97400 241609
15538B41609a12037E0036g8790a0371A49427J21428F9116M823i8350k35413a26470
$$ 241609 -112037 50036 -78790 -10371 149427 270855 69116 73939 -98350 -333763 -126470
15526b15072i4939J6120B3890J22953a02292C27252j17324n7731e5055B93970
$$ -215072 -94939 -78819 23890 146843 -102292 327252 209928 152197 -55055 293970
15515b4599A12034h3248j67793D6607d24150D0629a34315o5332D8453b10769L5744
$$ -24599 112034 -83248 -251041 46607 -424150 40629 -134315 -199647 48453 -210769 -175025
15504a75025j15155d9094A44272a83524M8807B37094A0101a22589b2809j39391
$$ -175025 -290180 -49094 144272 -183524 -134717 237094 10101 -122589 -22809 -162200
15494a62200A11192J11157a88545g8423k7966l3709c9766I7940a98726l0324h3302
$$ -162200 111192 222349 -188545 -78423 -106389 -140098 -39766 97940 -198726 -229050 -83302
15482C05250C6867a83156A04945b24182D3922J84015E3951M2083b24408i0606
$$ 305250 36867 -183156 104945 -224182 43922 227937 53951 96034 -224408 -90606
15471A17989c6177q701C2740a41705E991a55603A4566a25736j19620B10028a57925
$$ 117989 -36177 -44878 32740 -141705 5991 -155603 14566 -125736 -245356 210028 -157925
15459H257N05929D781L58546b26839C61968b9972k22813c6138A83656b35605B9195
$$ 8257 514186 4781 363327 -226839 361968 -29972 -252785 -36138 183656 -235605 29195
15447A30961J88591I7286n681J87575b45064b5901A03843N5713C7720c88288A25781
$$ 130961 319552 97286 91605 279180 -245064 -25901 103843 159556 37720 -388288 125781
15435D7958K27868g5126A2793b65785G6374b43910J5654B54330i7254j9893m8208
$$ 47958 275826 -75126 12793 -265785 76374 -243910 -228256 254330 -97254 -117147 -165355
15424a65355p1491C5321K89383a05668A88141a3811C08205A06625J72037A37465
$$ -165355 -236846 35321 324704 -105668 188141 -13811 308205 106625 278662 137465
15413d40687a04105k85019e7500j79818H0726K3927C4262b33557c3489j22327
$$ -440687 -104105 -389124 -57500 -237318 80726 104653 34262 -233557 -33489 -155816
15403a55816j83103c3266o077B00351a42258k85175A7237K4381h1454l2192o3504
$$ -155816 -338919 -33266 -39343 200351 -142258 -427433 17237 41618 -81454 -113646 -177150
15392a77150c4177D08894d215C74327A43447L4212b01483C5901a08080H0704J51212
$$ -177150 -34177 408894 -4215 374327 143447 177659 -201483 35901 -108080 80704 231916
15381B31916R0149H9849d63142A26809C6968L9263h0868P893B6290a44474j14474
$$ 231916 322065 89849 -463142 126809 36968 76231 -80868 -72975 26290 -144474 -258948
15370b58948j32882B45332p3232L0721a20493E8674a48277j82895J54063J4546
$$ -258948 -391830 245332 172100 202821 -120493 58674 -148277 -331172 -177109 -162563
15360a62563n1451A42124g4351L6403C3918L51278c7618r1536B71667a89870i0571
$$ -162563 -214014 142124 -74351 -37948 33918 385196 -37618 -129154 271667 -189870 -90571
15348b18915D7223c3777j62C5592b58467A00189q111B2647h7568C068d3778E949
$$ -218915 47223 -33777 -33939 35592 -258467 100189 92078 22647 -87568 3068 -43778 5949
15335f2639F3303J42309A2992J69589G7212b24508a4653o152D35963e9235C0147
$$ -62639 63303 205612 12992 182581 77212 -224508 -14653 -20805 435963 -59235 30147
15323g5803B62116J38865a49916C26164F7542M7326a72133n0485A95846G1263
$$ -75803 262116 400981 -149916 326164 67542 114868 -172133 -222618 195846 71263
15312A0831N0912B9784a30440A26819L16904a56874e1667A3236K81675k3261a70054
$$ 10831 61743 29784 -130440 126819 443723 -156874 -51667 13236 294911 271650 -170054
15300c2170A02090J8904J15012c3813j00231H1901e4497D3881M33281b07517i7106
$$ -32170 102090 120994 236006 -33813 -134044 81901 -54497 43881 477162 -207517 -97106
15288F272L7324o910j2826i8840E04480c99467a4778A58773n7466b3162B60986
$$ 6272 43596 36686 23860 -98840 504480 -399467 -14778 158773 101307 -23162 260986
15276E14968b35254A9016b16081C28359j22816F455g1790l4959D15442e4905E9362
$$ 514968 -235254 19016 -216081 328359 205543 6455 -71790 -106749 415442 -54905 59362
15264B30323j0977C0852N8407b27586A74856m5074J59518b70516I1420b02385
$$ 230323 219346 30852 89259 -227586 174856 129782 289300 -270516 91420 -202385
15253i5613A0710e1179D08989P16502K3421k77819O33416G14690B86855j13307
$$ -95613 10710 -51179 408989 1125491 1148912 871093 1504509 714690 286855 173548
15243A73548e7906E3362a33951I0654k6928a6611k2822A55499i3586k15245h8790
$$ 173548 -57906 53362 -133951 90654 63726 -16611 -39433 155499 -93586 -308831 -88790
15231e9855H0488M9940a56110K8991C4198O4668c7501g331j72016A50813D2246
$$ -59855 80488 130428 -156110 -127119 34198 98866 -37501 -7331 -179347 150813 42246
15219C233K84549A04316m9491h5418r2899B63033a94682B76301j04898c0497A49359
$$ 3233 287782 104316 54825 -85418 -178317 263033 -194682 276301 171403 -30497 149359
15207b34217J04649C18966a40980C19960m6776H8995c9993k97928g6537q5753
$$ -234217 -129568 318966 -140980 319960 273184 88995 -39993 -337921 -76537 -162290
15197a62290J4584A88175I3126J53206h7936A22057K10541r3825a11875c960G9668
$$ -162290 -147706 188175 93126 246332 -87936 122057 332598 238773 -111875 -3960 79668
15185B77373B1052N5426K52513a15197f412D30257a6903H7150K1370A7514K10916
$$ 277373 21052 76478 328991 -115197 -6412 430257 -16903 87150 108520 17514 228430
15174B28430a6063N792A76803J36644A2538b20378C23968A5229a55668A26202
$$ 228430 -16063 -10271 176803 313447 12538 -220378 323968 15229 -155668 126202
15163b90116D4199J9902P8643R3516a36430H1589d82329B93841A21618b6870F2141
$$ -290116 44199 64101 142744 236260 -136430 81589 -482329 293841 121618 -26870 62141
15151a35932A57999A6561K79479D8912L85388a16962I0217b71701d7051F5143
$$ -135932 157999 16561 296040 48912 434300 -116962 90217 -271701 -47051 65143
15140b61420J11075B16053a21522c1728H4513J94926A9717K4658d7266B48368
$$ -261420 -150345 216053 -121522 -31728 84513 279439 19717 44375 -47266 248368
15129A83969m6197j6326J73821A44415J37407j21454G6432O3048M80090A49281
$$ 183969 137772 121446 295267 144415 281822 160368 76432 139480 619570 149281
15118f735B06988J46140h0600B65499P9051p1587J39001f1151I8265a5460B47024
$$ -6735 206988 353128 -80600 265499 344550 272963 411964 -61151 98265 -15460 247024
15106A7757L5378c3603q9382F9999O7931k9051A107K1744a48971G5274b25897
$$ 17757 53135 -33603 -122985 69999 137930 108879 1107 22851 -148971 75274 -225897
15094a36206C83649j37538A8780a4585B35969n0481r0822K11051A52007a3213
$$ -136206 383649 246111 18780 -14585 235969 185488 94666 305717 152007 -13213
15083A14591a56897C83729C9879j23c2656B54180Q4132H6472J11116f7157A55844
$$ 114591 -156897 383729 39879 39756 -32656 254180 338312 86472 197588 -67157 155844
15071d8508C36895j30074j00177A9655J49636o0322m0919J26284l4173J74057
$$ -48508 336895 206821 106644 19655 169291 108969 68050 194334 160161 334218
15061C34218r1831C2143J4408J31367q48G5444E962J34129f7064B13088C9498
$$ 334218 242387 32143 46551 177918 177070 75444 5962 140091 -67064 213088 39498
15049A30844M13243I5918J81662J97515A50643G2259Q0895K72028k9031E0436
$$ 130844 544087 95918 277580 475095 150643 72259 153154 425182 396151 50436
15038A80243K73292A05348j7581J94446K78561j37377A94714K62849A90152K56345
$$ 180243 453535 105348 87767 282213 560774 423397 194714 457563 190152 446497
15028D46497b02672A63942M6501e4757I4302M15201B6390K02494r664g6511c7477
$$ 446497 -202672 163942 210443 -54757 94302 509503 26390 228884 219220 -76511 -37477
15016D16376A23267N3888J09708p0580K84072j65818p9658F9603K38879A00363
$$ 416376 123267 177155 286863 216283 500355 334537 254879 69603 308482 100363
15005B18171k064J48806j39936J85767j69449i0544D117K78886a05597B52195
$$ 218171 216107 364913 224977 410744 241295 -90544 4117 283003 -105597 252195
14994A83804M70956l02866K93090k61592O3680B21746n6089P970O2878L9989j33284
$$ 183804 654760 351894 644984 383392 447072 221746 165657 173627 236505 276494 143210
14983A43210J24156J66692G7849L74950e5922A04435e6303A09425J44105K13824
$$ 143210 267366 434058 77849 452799 -55922 104435 -56303 109425 253530 467354
14973D67354K0503k26537j11563E70K73616L4499J1073A25602b2439B88601A25612
$$ 467354 487857 261320 149757 570 274186 308685 319758 125602 -22439 288601 125612
14961b29005B45652M8380j06872p3521e9803b4820D72803A1726Q3028J01186e950
$$ -229005 245652 294032 187160 113639 -59803 -24820 472803 11726 94754 195940 -5950
14949C73639K2738Q9463D1543K29674H1809d2938C28832m5879K9441r3143K10033
$$ 373639 396377 485840 41543 271217 81809 -42938 328832 282953 312394 219251 429284
14938D29284j95607M7880j19140M0379Q727r9388J71968J7491r5201J38484A25308
$$ 429284 233677 281557 162417 202796 211523 112135 284103 301594 206393 344877 125308
14926B05514J81331A35005O0839L13158k2473k06729J19897m2564a67398D86984
$$ 205514 386845 135005 195844 509002 486529 279800 399697 357133 -167398 486984
14915E17648B51285H4019J19588K47334A4961K89656b4839B10207J35740I0750
$$ 517648 251285 84019 203607 450941 14961 304617 -24839 210207 345947 90750
14904A16853N25338k76893k0046J3282G6642K06572l8713A14375J40033L87974
$$ 116853 642191 365298 345252 358534 76642 283214 244501 114375 254408 642382
14894F42382A92037N1302J57439j80876q0818K28420j8623j59538Q5357D6187
$$ 642382 192037 243339 400778 219902 139084 367504 348881 189343 274700 46187
14883F51864j91517J2802j28064J11003K65579k07188K45852j02519l13971M12298
$$ 651864 460347 473149 345085 456088 721667 514479 760331 657812 343841 756139
14873G56139l20392j3099r2768J82169q721j37226K34566k39704J42175q7445
$$ 756139 435747 422648 329880 512049 503328 366102 600668 360964 503139 415694
14863D15694J9633o5318A82703K03260j19585J19079L895F807J00351J99576J3822
$$ 415694 435327 370009 182703 385963 266378 385457 389352 6807 107158 306734 320556
14852C20556o9492L51193M1586O5667k49752A29690L48188N2030A21778B6571
$$ 320556 251064 602257 643843 709510 459758 129690 477878 529908 121778 26571
14841B53849K5765K62320I4573M24946B41132m0094L35091j3625k2178l6662J48449
$$ 253849 279614 541934 94573 519519 241132 201038 536129 522504 500326 463664 612113
14830F12113j17504J26771A31296K94275J72635B94137J78998B24503L43616j43035
$$ 612113 494609 621380 131296 425571 598206 294137 473135 224503 568119 425084
14820D25084P9699M29767D11520J07908J17217q7122r8324K67999j07656B67531
$$ 425084 504783 934550 411520 519428 636645 549523 451199 719198 611542 267531
14809B66171I3630L09377K93074M70l16587L63382l64148K7215p6161J40022K1796
$$ 266171 93630 403007 696081 696551 379964 743346 379198 406413 330252 470274 492070
14798D92070j1918A56740l0349K85768K99607k22137B22380K90407r4653R2834
$$ 492070 480152 156740 126391 412159 711766 489629 222380 512787 418134 510968
14788E10968p2534L7310Q3529o9112j72321P8059O5883K8975M0518L98986j61144
$$ 510968 438434 475744 559273 490161 317840 395899 461782 490757 531275 930261 769117
14777G69117j46726J94985q6722k96244M17687l57621j04260L61704j98545q9625
$$ 769117 622391 817376 730654 434410 852097 494476 390216 751920 553375 463750
14767D63750L18318k26945J46561q2855O3562L77226E22262J27672k01263J05877
$$ 463750 782068 555123 701684 618829 682391 1059617 522262 649934 448671 554548
14757E54548j54532M20040k37836j80433K39988k6609M3842K25344C15697N15201
$$ 554548 400016 820056 582220 401787 641775 615166 659008 884352 315697 830898
14747H30898j10984C42010N70859k38677k98152K78403p1117J83244K13336l01375
$$ 830898 719914 342010 912869 674192 376040 654443 583326 766570 979906 678531
14737F78531k3299Q715J88820l25405M68214k98148L19399m76428L70784l06609
$$ 678531 655232 663947 852767 527362 995576 697428 1016827 540399 911183 604574
14727F04574J35007j78644M1088K56868j24161K14385m29688K20339J64405j13703
$$ 604574 739581 560937 602025 858893 734732 949117 519429 739768 904173 790470
14717G90470K49487j75631R5266k20049n4197J83696j57828K68985m43522L55937
$$ 790470 1039957 864326 959592 739543 685346 869042 711214 980199 536677 892614
14707H92614N0047l9702K66149m10639l7642L1488k67457L91183q3390j30069
$$ 892614 942661 902959 1169108 758469 720827 752315 484858 876041 792651 662582
14697F62582L81778q2704Q493O7872n2390J59155l48315L24223Q6881m08716J39043
$$ 662582 1044360 961656 970149 1038021 985631 1144786 796471 1120694 1207575 798859 937902
14686I37902P6748k32944r0855p6769L06254L56221k42212j73757O330K42875
$$ 937902 1014650 781706 690851 614082 920336 1276557 1034345 860588 866918 1109793
14676A109793j7572k62893J98624o993l02217J00700j8726K28009k00653K06604
$$ 1109793 1092221 829328 1027952 1020959 718742 819442 800716 1028725 828072 1034676
14666A034676q6635K10181j48896L45468n3641k77329K44678j04453Q7965l85731
$$ 1034676 948041 1158222 1009326 1354794 1301153 1023824 1268502 1164049 1252014 866283
14656H66283J35779r2804J92469L02806l11958K25990n8954l43225K06607r7753
$$ 866283 1002062 909258 1101727 1404533 1092575 1318565 1259611 916386 1122993 1025240
14646A025240K8923K9557L29730j59270q2078K87318l73810J19111L84413j18973
$$ 1025240 1054163 1083720 1413450 1254180 1172102 1459420 1085610 1204721 1589134 1470161
14636A470161o34929N68642J76033m24096K89339J09337k25466Q5444o3156j13769
$$ 1470161 835232 1403874 1579907 1155811 1445150 1554487 1329021 1414465 1351309 1237540
14626A237540K21624K1242l15450O3551L70879k72511L48383m14696L3937K12756
$$ 1237540 1459164 1480406 1164956 1228507 1599386 1326875 1675258 1260562 1294499 1507255
14616A507255J73449k81145K99745K48666m11887j57270J33493J03795k83957
$$ 1507255 1680704 1399559 1699304 1947970 1536083 1378813 1512306 1616101 1332144
14607A332144L00562k93403K34963R0843m520n2839J49441j32823j67129K57363
$$ 1332144 1632706 1339303 1574266 1665109 1660589 1607750 1757191 1624368 1457239 1714602
14597A714602j21214o5281N46561k70699J94212k2876l61004J72981L55665n10702
$$ 1714602 1593388 1528107 2074668 1803969 1998181 1975305 1614301 1787282 2142947 1632245
14587A632245J69547L52132n74773L69004k59351M77469m40718K24807M18305
$$ 1632245 1801792 2153924 1579151 1948155 1688804 2166273 1725555 1950362 2368667
14578B368667l48626L43315n95947M25718J77146j34644J0235K89154M4424l27421
$$ 2368667 2020041 2363356 1767409 2193127 2370273 2235629 2245864 2535018 2579442 2252021
14568B252021L22476m44719L58613k23971L80982P6562Q3129l11627N98416J09594
$$ 2252021 2574497 2129778 2488391 2264420 2645402 2721964 2805093 2493466 3091882 3201476
14558C201476m5046q4714J57203J10830L77183O2618P10825M18483J168320K324131
$$ 3201476 3156430 3071716 3228919 3339749 3716932 3779550 4490375 4908858 6077178 8401309
14548H401309M422396R843180J8279402J015920k0760477A0175847m201822k115064
$$ 8401309 12823705 22666885 40946287 41962207 21201730 10175847 5974025 3858961
14540C858961q30916l77419m98424R3188n23308J86002L50590O1536J32800k75379
$$ 3858961 3028045 2650626 2152202 2245390 1722082 1908084 2258674 2320210 2453010 2177631
14530B177631l26101M44763o8200J55232n2731Q3557n3237N35J88999j36507J17811
$$ 2177631 1851530 2296293 2228093 2383325 2330594 2414151 2360914 2361449 2550448 2413941 2531752
14519B531752R1272L70399m04314O11117m17470p2063M33688j452j86776R1630
$$ 2531752 2623024 2993423 2589109 3200226 2782756 2710693 3144381 3142929 2956153 3047783
14509C047783j52263J03809K86443n6292L5099k27357K85089j65186L9376J93994
$$ 3047783 2895520 2999329 3285772 3229480 3264579 3037222 3322311 3157125 3196501 3390495
14499C390495j36258N9418K37262k57157n2627M21545j03464L26273p1588l60970
$$ 3390495 3254237 3313655 3550917 3293760 3241133 3662678 3559214 3885487 3813899 3452929
14489C452929M2801L49247j35776L15112l66376l331K24648N9508k1124p951O07549
$$ 3452929 3495730 3844977 3709201 4024313 3657937 3654606 3879254 3938762 3917638 3909687 4517236
14478D517236m54834j06472K87980M7006O496L1748P7528M339k37965J46093Q3681
$$ 4517236 4062402 3955930 4243910 4290916 4297412 4329160 4406688 4411027 4173062 4319155 4402836
14467D402836j05933J56121L83639m77723M45868K3748r9130N893N83724j49760
$$ 4402836 4296903 4453024 4836663 4358940 4804808 4828556 4729426 4735319 5319043 5169283
14457E169283j12599J18929K81331k65482L82886r6204K44987k04476k49132J56844
$$ 5169283 5056684 5175613 5456944 5191462 5574348 5478144 5723131 5518655 5269523 5426367
14447E426367M38180K25498M033Q2781k8943Q7271J28556M4419N1499J20675k58323
$$ 5426367 5864547 6090045 6094078 6176859 6147916 6235187 6363743 6408162 6459661 6580336 6322013
14436F322013L47519J52158K26143j86654J42596j7422L91069j26741O315O1655
$$ 6322013 6669532 6821690 7047833 6861179 7003775 6986353 7377422 7250681 7256996 7318651
14426G318651K93642P7655l3748M91017N5811j2821L5077L4615J05715K65235
$$ 7318651 7612293 7689948 7656200 8147217 8203028 8190207 8225284 8259899 8365614 8630849
14416H630849N16869l48852N6876O70991m16111L49184J14802J49123j04454J97676
$$ 8630849 9147718 8798866 8855742 9526733 9110622 9459806 9574608 9723731 9619277 9816953
14406I816953K94188p1318O40932j30530O24529k17697l0551K26709N42077J58902
$$ 9816953 10111141 10039823 10680755 10550225 11174754 10957057 10926506 11153215 11695292 11854194
14396A1854194j43529O03119q2294K32308K85726J46669K42539N1044J59880N39978
$$ 11854194 11710665 12313784 12231490 12463798 12749524 12896193 13138732 13189776 13349656 13889634
14386A3889634L03964J58764O4176M99368J25433M07359K46243M97289J45305
$$ 13889634 14193598 14352362 14416538 14915906 15041339 15448698 15694941 16192230 16337535
14377A6337535M00068J63705M96215R9280J04059N47505K61269O41456J95172
$$ 16337535 16737603 16901308 17397523 17496803 17600862 18148367 18409636 19051092 19246264
14368A9246264N72991J87833J27745O27646L16776P66006J88921O18038L89752
$$ 19246264 19819255 20007088 20134833 20762479 21079255 21845261 22034182 22652220 23041972
14359B3041972Q79174L85235M05383P72587K62920R49046M83173O57155M62367
$$ 23041972 23921146 24306381 24711764 25484351 25747271 26696317 27179490 27836645 28299012
14350B8299012J029525P79360N48215O99854P59784J055992O71452R27727P10594
$$ 28299012 29328537 30107897 30656112 31355966 32115750 33171742 33843194 34770921 35481515
14341C5481515J376877R67741J202796Q58720J220982J035340J476497J149766
$$ 35481515 36858392 37826133 39028929 39887649 41108631 42143971 43620468 44770234
14333D4770234J033775J743742J531326J337114J700493J252980K253505J650035
$$ 44770234 45804009 47547751 49079077 50416191 52116684 53369664 55623169 57273204
14325E7273204J894463J784298K361775J636226K542821K600155K415019K771880
$$ 57273204 59167667 60951965 63313740 64949966 67492787 70092942 72507961 75279841
14317G5279841K818409K762811L308127L249971K897167M154948L947038M031499
$$ 75279841 78098250 80861061 84169188 87419159 90316326 94471274 98418312 102449811
14309A02449811L881786M710768M776185N060641N044472N821579N914518O693788
$$ 102449811 106331597 111042365 115818550 120879191 125923663 131745242 137659760 144353548
14301A44353548O489189P374566P401758P669850Q642823Q980106R554129R823591
$$ 144353548 150842737 158217303 165619061 173288911 181931734 190911840 200465969 210289560
14293B10289560J0560982J1028975J1712836J2254771J2914859J2989629J3779713
$$ 210289560 220850542 231879517 243592353 255847124 268761983 281751612 295531325
14286B95531325J4579037J4388340J4794415J5121273J5341388J5233207J4476138
$$ 295531325 310110362 324498702 339293117 354414390 369755778 384988985 399465123
14279C99465123J4208540J3540664J2553398J1060638R861533P578353N087974
$$ 399465123 413673663 427214327 439767725 450828363 460689896 468268249 473356223
14272D73356223K016356p45704j559468k455763n493406n437068o995430q291433
$$ 473356223 475372579 474626875 473067407 470611644 465118238 459681170 452685740 444394307
14264D44394307r778441j1668895j3599957j4452762j5160106j5573294j5758606
$$ 444394307 434615866 422946971 409347014 394894252 379734146 364160852 348402246
14257C48402246j5529617j5187490j4980355j4370881j4248830j3203878j2843346
$$ 348402246 332872629 317685139 302704784 288333903 274085073 260881195 248037849
14250B48037849j1803140j2076120j0789041j0046374j0026628r049311q356624
$$ 248037849 236234709 224158589 213369548 203323174 193296546 184247235 175890611
14243A75890611q490034p889363p410195o901586o179145o088510n345305n882360
$$ 175890611 167400577 159511214 152101019 145199433 139020288 132931778 127586473 121704113
14235A21704113m702505n163048m792861l868284l796063m156372l696182l372982
$$ 121704113 117001608 111838560 107045699 103177415 99381352 95224980 91528798 88155816
14227H8155816l732774k782197l507463k457057k902803k660593j883234k346097
$$ 88155816 84423042 81640845 78133382 75676325 72773522 70112929 68229695 65883598
14219F5883598k206477k064013k063960k113958j598357j595913j499179j943527
$$ 65883598 63677121 61613108 59549148 57435190 55836833 54240920 52741741 50798214
14211E0798214r96381k031468j303203j348410m89409j210183j604119j244623
$$ 50798214 49801833 47770365 46467162 45118752 44629343 43419160 41815041 40570418
14203D0570418j528746n99980r04906o26020j161323r59374r54632j192279l19362
$$ 40570418 39041672 38441692 37536786 36910766 35749443 34790069 33835437 32643158 32323796
14194C2323796j153559o27464p24343m65279j105325n98849n86803n01572p35860
$$ 32323796 31170237 30542773 29818430 29353151 28247826 27648977 27062174 26560602 25824742
14185B5824742o25427n49410l22314m22806q05836m74886n52831j7379p82604
$$ 25824742 25199315 24649905 24327591 23904785 23098949 22624063 22071232 22053853 21271249
14176B1271249l98560n09471j39407p08893k93814m62835k54632k46291p85947
$$ 21271249 20872689 20363218 20223811 19514918 19221104 18758269 18503637 18257346 17471399
14167A7471399m6291m04523l60830p6781j49778l04372l85172m08344k74504k17937
$$ 17471399 17425108 17020585 16659755 16582974 16433196 16128824 15743652 15335308 15060804 14842867
14157A4842867j96161j35454j23210p74701J3450k44075k62775j76975n09792
$$ 14842867 14646706 14511252 14388042 13613341 13626791 13382716 13119941 12942966 12433174
14148A2433174M05417o06874j66230j86445j76327O2487l28848k03148k04328
$$ 12433174 12838591 12231717 12065487 11879042 11702715 11765202 11436354 11233206 11028878
14139A1028878l02255j87182k39646M88324n53455L8651p9278j40775j59416k89689
$$ 11028878 10726623 10539441 10299795 10788119 10234664 10273315 10194037 10053262 9893846 9604157
14129I604157l24230J03155j00033K05102l12179l76417j49004J18667n31336
$$ 9604157 9279927 9383082 9283049 9488151 9175972 8799555 8650551 8769218 8237882
14120H237882M8972m1120j37720m0114j42065j68761k07535k51736R3100Q3689
$$ 8237882 8286854 8245734 8108014 8067900 7925835 7757074 7549539 7297803 7390903 7474592
14110G474592j06384r9314n5986j6285k24494K54410l67232J18023k2384K4523
$$ 7474592 7368208 7268894 7212908 7196623 6972129 7226539 6859307 6977330 6954946 6979469
14100F979469m46039K4531k17705J00007J97513l06845j59929j08021J45847k4172
$$ 6979469 6533430 6557961 6340256 6440263 6637776 6330931 6171002 6062981 6208828 6184656
14090F184656k04979r7595k20772k81552K07220J7280l61147L65632N7518l63099
$$ 6184656 5979677 5882082 5661310 5379758 5586978 5604258 5243111 5608743 5666261 5303162
14080E303162q2377k51796O30174p93655N03546P3592l48093M3816q6315l19754
$$ 5303162 5220785 4968989 5599163 4805508 5309054 5382646 5034553 5078369 4992054 4672300
14070D672300K53604k65230K44117l95483K06627m42897L95641l12686J33457
$$ 4672300 4925904 4660674 4904791 4509308 4715935 4273038 4668679 4355993 4489450
14061D489450k46368P7056K23872K2404J28538l92390j58113P694J8100r0845
$$ 4489450 4243082 4320138 4544010 4566414 4694952 4302562 4144449 4152143 4170243 4079398
14051D079398j18355l15083m4802L05385j92037j65911L67484n08069J94236j95263
$$ 4079398 3961043 3645960 3601158 3906543 3714506 3548595 3916079 3408010 3602246 3406983
14041C406983j21794K97695k6118j5361l28776M43779j18313k55285N0167j73559
$$ 3406983 3285189 3582884 3556766 3541405 3212629 3656408 3538095 3282810 3332977 3159418
14031C159418N888n7842J98377q1055J10742j81246r9959k8121n147p0986k66642
$$ 3159418 3165306 3107464 3305841 3224786 3335528 3154282 3054323 3026202 3021055 2950069 2683427
14020B683427K79028J2243M8928j77081k00888J31799j53669o325J59682l885
$$ 2683427 2962455 2974698 3023626 2846545 2645657 2777456 2623787 2617462 2777144 2773259
14010B773259m81627M09778k95535M20303l47560M7512J97638l12176Q2459R7354
$$ 2773259 2291632 2701410 2405875 2826178 2478618 2526130 2723768 2411592 2494051 2591405
14000B591405j89607k41988N59775l61000J97790m04138M31493K21491l23353
$$ 2591405 2401798 2159810 2719585 2358585 2556375 2152237 2583730 2805221 2481868
13991B481868J73696M72941J309055K884494P309167J7830941J1072692j6413557
$$ 2481868 2655564 3128505 4437560 7322054 14631221 32462162 43534854 27121297
13983B7121297j1865385n652670k384175j566339p88661p83804m48153n7653n00074
$$ 27121297 15255912 9603242 7219067 5652728 4864067 4080263 3632110 3574457 3074383
13974C074383j11084L21938m66641k29190J86795k49310o1208J14871l80155M04863
$$ 3074383 2963299 3285237 2818596 2589406 2776201 2526891 2465683 2580554 2200399 2605262
13964B605262J20695k73174o4184m819J8972k25222J87726j01978j28337j76441
$$ 2605262 2725957 2452783 2388599 2383780 2402752 2177530 2365256 2263278 2134941 1958500
13954A958500K93107Q2273l57127M04157m05129K62174k41225J22577m10933P23963
$$ 1958500 2251607 2333880 1976753 2380910 1975781 2237955 1996730 2119307 1708374 2432337
13944B432337k95818k50866J56183L1475j33653O0911k05437J87231k4789j1152
$$ 2432337 2136519 1885653 2041836 2073311 1939658 2000569 1795132 1982363 1957574 1946422
13934A946422j27706J64142N4756j01198k53786K97350l2158j16801N1203m46256
$$ 1946422 1818716 1982858 2037614 1936416 1682630 1979980 1947822 1831021 1882224 1435968
13924A435968L26278J42251k23874j59209M4612j31478K96337l06652L65787k15544
$$ 1435968 1762246 1904497 1680623 1521414 1566026 1434548 1730885 1424233 1790020 1574476
13914A574476j99314K05221l4603N6135k8809K85609m93405K20452J12688j75106
$$ 1574476 1375162 1580383 1545780 1601915 1573106 1858715 1365310 1585762 1698450 1523344
13904A523344k0291k69895J23986K45794q998r0401J46510J43389l23958Q1810
$$ 1523344 1503053 1233158 1357144 1602938 1593940 1503539 1650049 1793438 1469480 1551290
13894A551290k59415M6888r2528o6396L7739J36668o4179J04803j29124K15130
$$ 1551290 1291875 1338763 1246235 1179839 1217578 1354246 1290067 1394870 1265746 1480876
13884A480876j72194k1097Q65P2969k21897J26557n6259N1589P5592j90549O0343
$$ 1480876 1308682 1287585 1288450 1361419 1139522 1266079 1209820 1261409 1337001 1146452 1206795
13873A206795M5401J19858l0858L2377J10272j55996k47883J2621K76752J30721
$$ 1206795 1252196 1372054 1341196 1373573 1483845 1327849 1079966 1092587 1369339 1500060
13863A500060l85155K03225K94289m89034O7666K49158l95255K00919m11874K10098
$$ 1500060 1114905 1318130 1612419 1123385 1191051 1440209 1044954 1245873 833999 1044097
13853A044097L69054j39117J6677k54407l27937Q22986n10116J47667L24551j08854
$$ 1044097 1413151 1274034 1290711 1036304 708367 1531353 1021237 1168904 1493455 1384601
13843A384601F79642K53188l2704L14084R4958K56353m42890J08991k41428l52308
$$ 1384601 679642 932830 900126 1214210 1309168 1565521 1122631 1231622 990194 637886
13833F37886Q4311K66715j92635J58437K71604j64045m19931L42494j03430J54014
$$ 637886 722197 988912 796277 954714 1226318 1062273 642342 984836 881406 1035420
13823A035420m3973O5127J49596k25090m0033k0404J93753m3836J9739k41925
$$ 1035420 991447 1056574 1206170 981080 941047 920643 1114396 1070560 1090299 848374
13813H48374k27944J69096J30594K02517K1490k05643L9928k1211K9195n2568
$$ 848374 620430 789526 920120 1122637 1144127 938484 978412 957201 986396 933828
13803I33828j82278q2503K40606j43576o9749L3370P3234J70681k02606P1855
$$ 933828 751550 669047 909653 766077 696328 729698 802932 973613 771007 842862
13793H42862R7377j65740K67337j05464r8582q0092R0724l2430J1298l08089L43989
$$ 842862 940239 774499 1041836 936372 837790 757698 848422 815992 827290 519201 863190
13782H63190k9740p8138k7045J16079o110L0115l09750J11906j471K60164k79839
$$ 863190 833450 755312 728267 844346 838236 868351 558601 670507 669036 929200 649361
13771F49361P5088Q261l53965N32036j72652l3186Q9667N176q7988M2353j40574
$$ 649361 724449 732710 378745 910781 738129 704943 794610 799786 711798 754151 613577
13760F13577J14760l29291J24729K13400k85070L03769l70308P88295B65320L78876
$$ 613577 728337 399046 523775 737175 452105 755874 385566 1173861 265320 644196
13750F44196n8692K68091k67216K57821J95632l51146O7251N1837j59240K82915
$$ 644196 585504 853595 586379 844200 1039832 688686 755937 807774 648534 931449
13740I31449J53108m89247J08726j87004L0884L74804k60826k59666K04059J15304
$$ 931449 1084557 595310 704036 517032 547916 922720 661894 402228 606287 721591
13730G21591J22316j64610j60008J75217o0836M4086r0620k0477J69437C16859
$$ 721591 843907 679297 519289 694506 633670 677756 587136 566659 736096 316859
13719B75303N97581j51386o4512J0432r9156K74698k56791N9944p5512j03223
$$ 275303 872884 721498 656986 667418 568262 842960 586169 646113 570601 467378
13709D67378P2217J27370p4620K04755J14931p6785k97180J66554l22058J21932
$$ 467378 539595 666965 592345 797100 912031 835246 538066 704620 382562 504494
13699E04494J76308J89653B71603O45892B65128M94467j42803M9825k36266J02487
$$ 504494 680802 870455 271603 917495 265128 759595 616792 666617 430351 532838
13689E32838K98647j72347j62736M6487J86604k90404J48434R1657B89361L43615
$$ 532838 831485 659138 496402 542889 729493 439089 587523 679180 289361 632976
13679F32976m3543j70642L95682k04571A95433L54818J96709P0131l97297j16336
$$ 632976 589433 418791 814473 609902 195433 550251 746960 817091 419794 303458
13669C03458m2228L7186n5110e3814E85383p2012P5864J7633K19218m04626N38329
$$ 303458 261230 298416 243306 -53814 585383 513371 589235 606868 826086 421460 959789
13658I59789C24969K96388B81362M51400k18601A19714M66879k14613J94281j46969
$$ 959789 324969 621357 281362 732762 514161 119714 586593 371980 566261 419292
13648D19292K06217k60070P99641E05602P4544J23263l50409J95285B69253L08263
$$ 419292 625509 365439 1165080 505602 580146 703409 353000 548285 269253 577516
13638E77516J90869B58268J03926M25031j33436k28190p0141J47743J69044k49504
$$ 577516 768385 258268 362194 787225 653789 425599 355458 503201 672245 422741
13628D22741B69O46919k89550L19552j11588j75576l3528r8837N480J21199K40053
$$ 422741 269 647188 357638 677190 565602 390026 356498 257661 263141 384340 624393
13617F24393B33629K52427j29087N12629l03280j51444J53482B32446K3215A09289
$$ 624393 233629 486056 356969 869598 566318 414874 568356 232446 255661 109289
13606C24921o3060J99536J58986C01917K26098n9566A82087M12398j87771j93051
$$ 324921 261861 461397 620383 301917 528015 468449 182087 594485 406714 213663
13596B13663K23926l3341j88941J80916n0649J81507j4232K6507J27811C20372
$$ 213663 437589 404248 215307 396223 345574 527081 512849 539356 667167 320372
13585C15226j16589L45687N1512j92665J43648Q8547k24761o3131j37558q4627
$$ 315226 198637 544324 595836 403171 546819 635366 410605 347474 209916 125289
13575A25289L57982j73301J18938A32529J73580O765q5131J11073A40006L49206
$$ 125289 483271 309970 428908 132529 306109 312874 227743 338816 140006 489212
13565D89212p2F4134N6548M8195J40189p7926J5348L18491k80006K00594B22383
$$ 489212 489140 64134 120682 168877 309066 231140 246488 564979 284973 485567 222383
13553B69903q8036J90757j02939K03034K5929r2366k3817m1577K65613A69096
$$ 269903 181867 372624 269685 472719 498648 406282 382465 340888 606501 169096
13542A391M41780l5467j19540l8402K23278k36496K2017K27184l1612l4248j2304
$$ 1391 443171 407704 288164 249762 473040 236544 258561 485745 454133 419885 407581
13531D07581N4457J5062B5757M14806A26006M97465k36418a29941D02359p1607
$$ 407581 462038 477100 25757 440563 126006 623471 387053 -129941 402359 330752
13521C30752L2930G1546M65278B1012N50118q2482F7850L29267A02815K48404
$$ 330752 363682 71546 536824 21012 571130 488648 67850 397117 102815 351219
13511C51219j06809d3060D57407k21418K92504j49133L778J60820B25239R8682
$$ 351219 244410 -43060 457407 235989 528493 379360 383138 543958 225239 323921
13501C23921p2253O9238O0122G0018K32555O6339A42451J06277K66370j02896
$$ 323921 251668 320906 381028 70018 302573 368912 142451 248728 515098 412202
13491D12202J58993E9384K07042o512K17874H7444L29447A8609R3941B3817M89425
$$ 412202 571195 59384 266426 259914 477788 87444 416891 18609 112550 23817 513242
13480E13242A61792K48206A28173J4802M32753j44077C8765L58253j38899f961
$$ 513242 161792 409998 128173 142975 575728 431651 38765 397018 258119 -6961
13469B04891J73011A78667L4934I0832J54192A0335J23630J86220K64930k17966
$$ 204891 377902 178667 213601 90832 245024 10335 133965 320185 585115 367149
13459C67149m7032J65678j68492J54778a2447A87550p1579K14677J97824A84128
$$ 367149 320117 485795 317303 472081 -12447 187550 115971 330648 528472 184128
13448d3059B10560J5591J69730j62504k3760K59691E1761L37724J26110A58965
$$ -43059 210560 226151 395881 233377 209617 469308 51761 389485 515595 158965
13437D41045A69046K51301A99991J70543j39198O9980G1236K71017j02205I3040
$$ 441045 169046 420347 199991 370534 231336 301316 71236 342253 240048 93040
13426C07802J14825I7133O12441A19329Q1898K94772j52433a66441C8669M95441
$$ 307802 422627 97133 709574 119329 201227 495999 343566 -166441 38669 534110
13416E34110B07058K11484j41602a27904B9570g0018K0841B34547N8919P7457
$$ 534110 207058 418542 276940 -127904 29570 -70018 -49177 234547 293466 370923
13406C70923K38092B07201K26656k6317F8135l3369i1898B89681A02625L21281
$$ 370923 609015 207201 433857 407540 68135 34766 -91898 289681 102625 423906
13396D23906A48028o2693L3691A4886L10885M5073j13233m6003M24271D2459L14263
$$ 423906 148028 85335 119026 14886 325771 370844 257611 211608 635879 42459 356722
13385C56722r8855q4026p1898a1235G8259K89892b6694E11184i6865g731D67586
$$ 356722 257867 173841 101943 -11235 78259 368151 -26694 511184 -96865 -7731 467586
13373B05748M04784j88947r0112N4793B0538P60131C41084N6771b15140B70493
$$ 205748 610532 421585 331473 386266 20538 780669 341084 397855 -215140 270493
13362C73427f1247A65588R7747p85M354j08067L34507A30364K54517j34013J84086
$$ 373427 -61247 165588 263335 262550 266904 158837 493344 130364 384881 250868 434954
13351D34954Q4015B56655J72577j83154E197M24835n4347j23153A21701M7048
$$ 434954 518969 256655 429232 246078 5197 430032 375685 252532 121701 168749
13341A68749K77165j97935H8716J25693j832H0506L06116A15811L10744j6891
$$ 168749 445914 247979 88716 214409 212577 80506 386622 115811 426555 409664
13331D09664j48782J2856J86616J02852B54851A1397L56653q2863A41270L46362
$$ 409664 260882 273738 460354 563206 254851 11397 368050 285187 141270 487632
13321D87632G5212L56802A48478J27591J5369M7200m9783q1817M4302j04696K29186
$$ 487632 75212 432014 148478 276069 291438 338638 288855 207038 251340 146644 375830
13310C75830j40532O9574A43699M5768e8411I8724B1891a6570C41513b39785C07360
$$ 375830 235298 304872 143699 189467 -58411 98724 21891 -16570 341513 -239785 307360
13298C4591K62124a8623A16515O9163K91121k30290G837J85302o5934K12985j50139
$$ 34591 296715 -18623 116515 185678 476799 246509 7837 193139 127205 340190 190051
13287A90051l4270J36810e8029H0018L04042j45789a3356j50271C67448J2928
$$ 190051 155781 292591 -58029 80018 384060 238271 -13356 -163627 367448 380376
13277C80376r5939n2785p0843b2732A83213a68480D02005g1790A92533A8687b5476
$$ 380376 284437 231652 160809 -22732 183213 -168480 402005 -71790 192533 18687 -25476
13265D51393A70148a49157B31859J99757j81092r9934J47462r1714C5236A0001
$$ 451393 170148 -149157 231859 431616 250524 150590 298052 206338 35236 10001
13254A00073R7427O4257k1157a993C24189q8823H5133M42042d2607j64308K9332
$$ 100073 197500 261757 240600 -1993 324189 235366 85133 527175 -42607 -206915 -177583
13243a77583A92326B7559L1612J91508J28108H4559K69608j40572a85213B43867
$$ -177583 192326 27559 59171 250679 378787 84559 354167 213595 -185213 243867
13232h0350b8491j19411B69289p2366a83146I5033L29740A87777p3430D1068M7611
$$ -80350 -28491 -147902 269289 196923 -183146 95033 424773 187777 114347 41068 88679
13221H8679J227a74801A40055O0796J50866J2382A20205b3348C16969G0784h0260
$$ 88679 89906 -174801 140055 200851 351717 364099 120205 -23348 316969 70784 -80260
13209A37546R5917J31366h362j32804C78143A87091Q1474a43710l8887c0599j65751
$$ 137546 233463 364829 -8362 -141166 378143 187091 268565 -143710 -182597 -30599 -196350
13198a96350D22805a16792C63258o9442j18368a08435A95994j6738g0262A55683
$$ -196350 422805 -116792 363258 293816 175448 -108435 195994 179256 -70262 155683
13187b0061l6841j17030A00962b34119C30625I9442K10246I2110a97850Q9310
$$ -20061 -56902 -173932 100962 -234119 330625 99442 309688 92110 -197850 -108540
13177a08540H2135R2704Q8879a2488p8907D1257K73632I5761k7354i2220A10335
$$ -108540 82135 174839 263718 -12488 -91395 41257 314889 95761 68407 -92220 110335
13165a45726A27072g1734L0827o2577B54489J13518n3291A34695f6585D69555
$$ -145726 127072 -71734 -40907 -103484 254489 368007 314716 134695 -66585 469555
13154D04222C7856d5948H6678k7633K73964F234a50077A9969L72584A73764Q3827
$$ 404222 37856 -45948 86678 59045 333009 6234 -150077 19969 392553 173764 257591
13143B57591n3352a57805D3105a45042B53185M6908j4203N7424b74779a20201
$$ 257591 204239 -157805 43105 -145042 253185 300093 285890 343314 -274779 -120201
13132E6459a24906B07196L16554A99813p9788C0138J20288K19874a06781A10153
$$ 56459 -124906 207196 523750 199813 120025 30138 150426 370300 -106781 110153
13121C05100j43604F9270K80548a39243D9704i4712a9960A80914b3075E8994M01794
$$ 305100 161496 69270 349818 -139243 49704 -94712 -19960 180914 -23075 58994 460788
13110D60788A48628g0709F4378J91430B5948L71707c8312F36146H2884g9508K121
$$ 460788 148628 -70709 64378 255808 25948 397655 -38312 636146 82884 -79508 -77387
13099g7387B05275a18423q811j6078b8106A64132b9892F29462d6380A55343i2426
$$ -77387 205275 -118423 -127234 -143312 -28106 164132 -29892 629462 -46380 155343 -92426
13087A32170D7444j199J78042J04914Q0479g9337B67776J2693k0982b84501J18995
$$ 132170 47444 46245 224287 329201 409680 -79337 267776 280469 259487 -284501 -165506
13076a65506K0892A95257j1270K59471B12435b0904r6190B59393i787j73934A39409
$$ -165506 -144614 195257 183987 443458 212435 -20904 -117094 259393 -9787 -183721 139409
13064A96048Q711J86404A35076M6608l0323L99109D0306K64731A33509n0423N65725
$$ 196048 204759 391163 135076 181684 151361 550470 40306 305037 133509 83086 648811
13053F48811k48598c5037p30C83008b01543A01369b22993B41324C9501J95678
$$ 648811 400213 -35037 -35767 383008 -201543 101369 -222993 241324 39501 235179
13043B35179B3626J23206n8771O9520f0372h677A70592a18794a2468B50518c9269
$$ 235179 23626 146832 88061 157581 -60372 -8677 170592 -118794 -12468 250518 -39269
13031A36393K30574j45196r1003f5403B74014a8955l9443B66499N3842A48344
$$ 136393 366967 221771 130768 -65403 274014 -18955 -58398 266499 320341 148344
13020E5814b1564A9256a88616A93636C4729J26744K45827D5620K22154B7660h7895
$$ 55814 -21564 19256 -188616 193636 34729 161473 407300 45620 267774 27660 -87895
13008b41983B79728A26991l8862N402J15461R1283A2062L9564N8750B390a31260
$$ -241983 279728 126991 88129 93531 208992 300275 12062 51626 110376 2390 -131260
12996B19091c20205C6087J7845h0941A88782a63303G9575K27175A15152P1591
$$ 219091 -320205 36087 53932 -80941 188782 -163303 79575 306750 115152 186743
12986A86743K58036A06156R4973k892K5286b1009m0250B5251f1354b2135D6177
$$ 186743 444779 106156 201129 198237 223523 -21009 -61259 25251 -61354 -22135 46177
12974b4282B84199a01246A33372E398J49686p6559k8560M7326m1251J09516d76512
$$ -24282 284199 -101246 133372 5398 155084 78525 49965 97291 56040 165556 -476512
12962B44310a46697D0033J10731O7511j06815A4218N4989b39895F1864l635K28129
$$ 244310 -146697 40033 150764 218275 111460 14218 69207 -239895 61864 58229 286358
12951B86358b53260R6286B8042a7089E82106d4535D00113o2467i9832B27162Q7472
$$ 286358 -253260 -156974 28042 -17089 582106 -44535 400113 337646 -99832 227162 314634
12940C14634j35055a48677A63673E5834a80558A0791c2726A41444i0965A77415
$$ 314634 179579 -148677 163673 55834 -180558 10791 -32726 141444 -90965 177415
12929h6932C71611A21316a4649I6275d240C17491a94930e6439A3963M23282A90868
$$ -86932 371611 121316 -14649 96275 -4240 317491 -194930 -56439 13963 437245 190868
12917A32955E8510J09600J49643h5910D61168j31107q5468A00660K6421P6337
$$ 132955 58510 168110 317753 -85910 461168 330061 244593 100660 127081 203418
12907B03418f5495A30957g7214A72821q5867a66029N4218Q062k8083A60619j6059
$$ 203418 -65495 130957 -77214 172821 86954 -166029 -111811 -103749 -131832 160619 144560
12896A44560n904D3808d542B46947L8312a06536a6959k0624A23565O2808E2497
$$ 144560 138656 43808 -4542 246947 285259 -106536 -16959 -37583 123565 186373 52497
12884G9523C3126J8059J3735a5992A74842p71n9428K6961L7200q5680a67135C31867
$$ 79523 33126 51185 64920 -15992 174842 174071 114643 141604 178804 93124 -167135 331867
12871D6972f0038G9903P7381h2542A86155i0066A01244J7331J28821k1690N0859
$$ 46972 -60038 79903 157284 -82542 186155 -90066 101244 118575 247396 225706 276565
12860B76565c2990D4941J47642l9325A9131J18194N2485D3118a87735Q3446A48578
$$ 276565 -32990 44941 192583 153258 19131 137325 189810 43118 -187735 -104289 148578
12848g0450A04268b6027j49656n6473H9127J28540a58917A27206O2458b26078
$$ -70450 104268 -26027 -175683 -232156 89127 217667 -158917 127206 189664 -226078
12837A89880b19432C3863M7496J7665J36014a78381a6606B4338a44560l612b9120
$$ 189880 -219432 33863 81359 99024 235038 -178381 -16606 24338 -144560 -148172 -29120
12825b70515A94290q8819L60150B6302d3584C7932O616J85795J7844a49677J4806
$$ -270515 194290 105471 465621 26302 -43584 37932 44548 230343 248187 -149677 -134871
12814a34871B03405c1363B61531I8494c9733F5499l0787h6806C7925K19571J08285
$$ -134871 203405 -31363 261531 98494 -39733 65499 34712 -86806 37925 257496 365781
12803C65781a77794A07420E1522J35451a55845a3542A72183e3228C83754a72972
$$ 365781 -177794 107420 51522 186973 -155845 -13542 172183 -53228 383754 -172972
12792A96713o0376d9583E7396J08022M3363r2627a59061G8066f2528j49469A55634
$$ 196713 136337 -49583 57396 165418 208781 116154 -159061 78066 -62528 -211997 155634
12780G1609J22687b9977m6007B02642m5430F9337b78027A78262a2225r2055j20544
$$ 71609 194296 -29977 -75984 202642 157212 69337 -278027 178262 -12225 -104280 -224824
12769b24824B99027A40420a45604B47402q8430k9200a80243j77208J28990I7985
$$ -224824 299027 140420 -145604 247402 158972 129772 -180243 -357451 -228461 97985
12758a73814L0741a8740q4988B30349a01100M9961a2988E3105a35782A48582g5807
$$ -173814 -143073 -18740 -103728 230349 -101100 -51139 -12988 53105 -135782 148582 -75807
12746A63319e3613J242F039J66710k8873a33766D08222E6467h354H62J43233N9767
$$ 163319 -53613 -52371 6039 172749 143876 -133766 408222 56467 -8354 862 144095 203862
12734B03862F8384l0724b63454B12211J81096D5671O2680K7305k3635g6820B69910
$$ 203862 68384 37660 -263454 212211 393307 45671 108351 135656 112021 -76820 269910
12722b19530a7535B45735F1425c29836A28774K4074K5922c5429C89817A41598
$$ -219530 -17535 245735 61425 -329836 128774 152848 178770 -35429 389817 141598
12711A46608J45009c3783B28044k4387K13185j20036M9056j05985J92372D5928
$$ 146608 291617 -33783 228044 203657 416842 296806 345862 239877 432249 45928
12700A23389Q0813l74Q6635r1695k7942e6461G2490P750f5660k26877A16960e6094
$$ 123389 204202 203828 290463 198768 170826 -56461 72490 80240 -65660 -292537 116960 -56094
12687D9996a53104A65380N8140b55915E1549J63007F1636L32922e507B4727K8387
$$ 49996 -153104 165380 223520 -255915 51549 214556 61636 394558 -5507 24727 53114
12676E3114c69020e4716A77788M0404l5877b05830A5894J38773P3333I6701P6943
$$ 53114 -369020 -54716 177788 218192 182315 -205830 15894 154667 228000 96701 173644
12665A73644b64349B43524n5840K22060c26053J33010k1914l4738A08768L23009
$$ 173644 -264349 243524 187684 409744 -326053 -193043 -214957 -249695 108768 431777
12655D31777a1289B35948j13884a12266A00160O716k9315J26615i916A47191o3042
$$ 431777 -11289 235948 122064 -112266 100160 106876 77561 204176 -9916 147191 84149
12644H4149Q8247m5238h1626r2618E3287a7926k05728A11532J07591J18903H2068
$$ 84149 172396 127158 -81626 -174244 53287 -17926 -223654 111532 219123 338026 82068
12632C22015A55480D6475c9541A78173p8519k7788C2839M89959k19278o5338C4341
$$ 322015 155480 46475 -39541 178173 99654 71866 32839 522798 303520 238182 34341
12620A93343A356K44268m8780d3505p1449A28275J26790E2340i9602j82356A99933
$$ 193343 1356 245624 196844 -43505 -114954 128275 255065 52340 -99602 -281958 199933
12608G9313N3408K15887I3970J70409I6237G582K352Q6909m0471K45438A21756
$$ 79313 132721 348608 93970 264379 96237 7582 9934 96843 56372 301810 121756
12596b35555C92216j1987g3431a3760A67732D7548a3366C15318g4594C65K23480
$$ -235555 392216 380229 -73431 -13760 167732 47548 -13366 315318 -74594 365 223845
12585B23845b6951I1014M65P2027O5874b54347C05032h6807d2284j09290C88561
$$ 223845 -26951 91014 91479 163506 229380 -254347 305032 -86807 -42284 -151574 388561
12573H2218a095o876C62859A61021b5842C7658K20970j01080b97792c8080A4705
$$ 82218 -1095 -7971 362859 161021 -25842 37658 258628 157548 -297792 -38080 14705
12561E2800N093a03699l1547A19099a43907e7335B98500a75302h7340c4278j25287
$$ 52800 57893 -103699 -135246 119099 -143907 -57335 298500 -175302 -87340 -34278 -159565
12550a59565c1504A21440K33190F6232b64142A05584c14513i2001B2755b96901
$$ -159565 -31504 121440 354630 66232 -264142 105584 -314513 -92001 22755 -296901
12539f9026B02839A4074K17223a92899d566D21668j30163B0949a3964D08459j70670
$$ -69026 202839 14074 231297 -192899 -4566 421668 291505 20949 -13964 408459 237789
12528B37789A06399N9403k0001M4088a50142A2029b33672A25235J56165B9818
$$ 237789 106399 165802 145801 189889 -150142 12029 -233672 125235 281400 29818
12517A24642a19898B80396a07027c547m6055B69645a868A99440n9499f4849A56557
$$ 124642 -119898 280396 -107027 -3547 -49602 269645 -1868 199440 139941 -64849 156557
12505C48467A05939J15694b170D0708J29608a82737A11560i6256k06960A33401
$$ 348467 105939 221633 -2170 40708 170316 -182737 111560 -96256 -303216 133401
12494A11455b87485J06620j38128k7998e1843E93506G9935a11736A59669B107
$$ 111455 -287485 -180865 -318993 -346991 -51843 593506 79935 -111736 159669 2107
12483c30A62256a95987f6251j63268j36166J07169D6798N2662J02471r7486l9698
$$ -330 162256 -195987 -66251 -229519 -365685 -258516 46798 99460 201931 104445 64747
12472F4747a09509D7153b5780E224a28798A22235A0567J52648b76751R4286K9200
$$ 64747 -109509 47153 -25780 5224 -128798 122235 10567 163215 -276751 -182465 -153265
12461a53265N6222A76939L20977C2654J41734L5503a53809D57880a99112b3761
$$ -153265 -97043 176939 497916 32654 174388 209891 -153809 457880 -199112 -23761
12450c54202d5880p209F2043g0383G2970k917J20240b4044j08251A37718i716
$$ -354202 -45880 -53089 62043 -70383 72970 70053 190293 -24044 -132295 137718 -9716
12438A65048b96714a35396A78608p0045f9544j27757E1604d8789j1263D6793i2354
$$ 165048 -296714 -135396 178608 108563 -69544 -197301 51604 -48789 -60052 46793 -92354
12426b7292B02194H2333R0740D4605J78362p9190b69423C6384c28536K9182C254
$$ -27292 202194 82333 173073 44605 222967 143777 -269423 36384 -328536 -299354 3254
12414e714l43323a53322A61753a14923D255a11963B29434F3444a50242K9956A39658
$$ -5714 -349037 -153322 161753 -114923 4255 -111963 229434 63444 -150242 -120286 139658
12402b18760A81289F7487c46128A88458H2834c15548B76005e448j466E8125K54379
$$ -218760 181289 67487 -346128 188458 82834 -315548 276005 -5448 -6914 58125 312504
12391C12504B8023j571b00151A47955E2590a99723C00523H6120a03667q8602l4488
$$ 312504 28023 26452 -200151 147955 52590 -199723 300523 86120 -103667 -192269 -226757
12380b26757J13129C05991i242l2634A84292a5462k40331F0489a88778B3040J41499
$$ -226757 -113628 305991 -9242 -41876 184292 -15462 -255793 60489 -188778 23040 164539
12369A64539a19691L7561b4765g679r9767B62989a54070n9811o1868J27674O2173
$$ 164539 -119691 -82130 -24765 -7679 -107446 262989 -154070 -213881 -275749 -148075 -85902
12358h5902A02053b88272A74922b57355J12008j95532a0818j38262A18876P9768
$$ -85902 102053 -288272 174922 -257355 -145347 -340879 -10818 -149080 118876 198644
12348A98644a48742B6036b47262a14448A44207j6729f506l9566a7155j4323H3540
$$ 198644 -148742 26036 -247262 -114448 144207 127478 -6506 -46072 -17155 -31478 83540
12336a42080A63812J31573b26030r4753A98377a46470e6671K0621B10758O15f9400
$$ -142080 163812 295385 -226030 -320783 198377 -146470 -56671 -36050 210758 211373 -69400
12324D4924K1234g0289A66810N5915a41823A70594k9229c3639B79335i8192r4834
$$ 44924 66158 -70289 166810 222725 -141823 170594 141365 -33639 279335 -98192 -193026
12313a93026H8445J90061b42513B42778a16073d0550A1167K30921i8971A65853
$$ -193026 88445 278506 -242513 242778 -116073 -40550 11167 242088 -98971 165853
12302a4552j788C14118d31191C14391N2932l7615i5955A12319L247a08705A14796
$$ -14552 -16340 314118 -431191 314391 367323 329708 -95955 112319 115566 -108705 114796
12290c5852B87535a08128B34340b22623a08899b9983j82185d1309B27170C994
$$ -35852 287535 -108128 234340 -222623 -108899 -29983 -212168 -41309 227170 3994
12279B86077N995C662K28731A8284K7325K82969j48997q5066J08907r0211B7258
$$ 286077 292072 3662 232393 18284 45609 328578 179581 94515 203422 113211 27258
12267a53186J3770A00269J887C7377Q8693a26922b3635j7464E4909K7954a64381
$$ -153186 -139416 100269 102156 37377 126070 -126922 -23635 -41099 54909 82863 -164381
12255A62748R340Q9415A03307M030K94827a10906B48843k4829a45631F3907J59534
$$ 162748 172088 261503 103307 107337 402164 -110906 248843 224014 -145631 63907 223441
12244B23441h0729a0767A71014g4273j5150H0588O4344m5319l4247R9013J56237
$$ 223441 -80729 -10767 171014 -74273 -89423 80588 144932 99613 65366 164379 320616
12233C20616m1232F7326i2777B58627J06626E1500Q5185K04439f2358A90212a0322
$$ 320616 279384 67326 -92777 258627 365253 51500 136685 341124 -62358 190212 -10322
12221B25735n1838e7939C01391J91471A71098K35682a74821A17160K18583A10485
$$ 225735 173897 -57939 301391 492862 171098 406780 -174821 117160 335743 110485
12210A96789G6896J36186g9296p7419D52836k19917o8881o9878j5553J08690R998
$$ 196789 76896 213082 -79296 -156715 452836 232919 164038 94160 78607 187297 197295
12199A97295H5230J10954n1125a04665B03448K30095j63747E7110M8949Q1799
$$ 197295 85230 196184 145059 -104665 203448 433543 269796 57110 106059 187858
12189A87858J22149E5003J67134A09059b75808I262R5820B069K2450b29126D44949
$$ 187858 310007 55003 222137 109059 -275808 9262 105082 2069 24519 -229126 444949
12177D33252A49480L298l6368a77913M9950E18521A29875a30620C80843a23834
$$ 433252 149480 152778 116410 -177913 -127963 518521 129875 -130620 380843 -123834
12166b20421B07430B7732K66960B4458Q8993g1283C3947L611b62932o4223A10118
$$ -220421 207430 27732 294692 24458 113451 -71283 33947 37558 -262932 -327155 110118
12154A62205J0969n1849E1162b1862B87112J15903p1433B1838K11052a22391l8243
$$ 162205 173174 121325 51162 -21862 287112 403015 331582 21838 232890 -122391 -160634
12143a60634c0732B13529R8354a86285G2550N1787N08013a34113N6128A13296
$$ -160634 -30732 213529 311883 -186285 72550 124337 632350 -134113 -77985 113296
12132i128D58051F6757b46309G5994h1581A9387K23821M8099M995d9918B31631
$$ -9128 458051 66757 -246309 75994 -81581 19387 243208 291307 296302 -49918 231631
12120f6279p5731C61383j21421e022A11691b8937C6639N3330c44842B34784a61881
$$ -66279 -142010 361383 239962 -5022 111691 -28937 36639 89969 -344842 234784 -161881
12108c71549a59878j60249e2901q8676d5241L553K250D2652P7691a21090j66096
$$ -371549 -159878 -320127 -52901 -141577 -45241 -41688 -39438 42652 120343 -121090 -287186
12097b87186J01817M4651L027E6275a05838j29447Q7932f2198j54394F2632K2823
$$ -287186 -185369 -140718 -137691 56275 -105838 -235285 -147353 -62198 -216592 62632 85455
12086H5455a68208b9977A77414C7870a33357N2573r7937L9602j7016D51836Q1767
$$ 85455 -168208 -29977 177414 37870 -133357 -80784 -178721 -139119 -156135 451836 533603
12075E33603R83895m95799C92489A69027b9398a0058A62657Q7207q6805m5721
$$ 533603 1517498 1021699 392489 169027 -29398 -10058 162657 249864 163059 117338
12065A17338d29094C41295a20180b3137A51118a29904m00398a32743a0243B0614
$$ 117338 -429094 341295 -120180 -23137 151118 -129904 -530302 -132743 -10243 20614
12054C48673h9687M1791I0323M0271h020C3206A2664J24164c76447I1675K6085
$$ 348673 -89687 -47896 90323 130594 -8020 33206 12664 136828 -376447 91675 117760
12043A17760c08416A34712j2925C1580R3586c14177F2996j3650a9962j30642E5184
$$ 117760 -308416 134712 121787 31580 125166 -314177 62996 49346 -19962 -150604 55184
12031C0751a67589c0132k28989O2135D60038H026K14741h0951k9354j34470A01611
$$ 30751 -167589 -30132 -259121 -196986 460038 8026 222767 -80951 -110305 -244775 101611
12019B98887h873G34L1143N7331B9922J62596D2031b10526A1277J2129c59690
$$ 298887 -8873 734 31877 89208 29922 192518 42031 -210526 11277 23406 -359690
12007A47666l3064B3009c7608p0142E39450A89561h4922a2651j01015A96445F8331
$$ 147666 114602 23009 -37608 -107750 539450 189561 -84922 -12651 -113666 196445 68331
11995a50646A17752j7610k2005K795A3362Q58d9252n4630N1163e331G3853a8379
$$ -150646 117752 100142 78137 80932 13362 14220 -49252 -103882 -52719 -5331 73853 -18379
11982d77264K18315a2457D1122R4408b1330B31017f0556j74494R5273k0344P9888
$$ -477264 -258949 -12457 41122 135530 -21330 231017 -60556 -235050 -139777 -160121 -80233
11971h0233c2599j55872D3901a39381H3268a38497B2129a80026M7040B71484a39904
$$ -80233 -32599 -188471 43901 -139381 83268 -138497 22129 -180026 -132986 271484 -139904
11959H6851b12736I2714K7998a20095E9003a68690d7264A59956b5872B49301F1543
$$ 86851 -212736 92714 120712 -120095 59003 -168690 -47264 159956 -25872 249301 61543
11947B8707J32810J29812A2539b0670C2240a19672j7189e4961g297H8319n64J78550
$$ 28707 161517 291329 12539 -20670 32240 -119672 -136861 -54961 -7297 88319 87755 266305
11935B66305b13058J01514B60719E0666J12836B8556i3456E5154h4592o0292b6923
$$ 266305 -213058 -111544 260719 50666 163502 28556 -93456 55154 -84592 -144884 -26923
11923F0759f7854L833A15435b04726H2186C6732J01631C7992q210d3526k12363
$$ 60759 -67854 -64021 115435 -204726 82186 36732 138363 37992 29782 -43526 -255889
11912b55889J21909F5396j8097a69037D28734c531A26971a05756Q583c2713j25043
$$ -255889 -133980 65396 47299 -169037 428734 -3531 126971 -105756 -97173 -32713 -157756
11901a57756M1704A15492J01927c2839j68979H3421b4516B69977D5490b0773n1847
$$ -157756 -116052 115492 217419 -32839 -201818 83421 -24516 269977 45490 -20773 -72620
11890g2620k37641a52626E0331a67705d834j30980D4654h6960A00189g1330A47685
$$ -72620 -310261 -152626 50331 -167705 -4834 -135814 44654 -86960 100189 -71330 147685
11878C01027f5330j94240C16200a6262B00758a20793A85589G1162c3471r0028
$$ 301027 -65330 -259570 316200 -16262 200758 -120793 185589 71162 -33471 -123499
11868a23499M284N5148N396q0908n7930c4504j09088D4341g8004j65353A4947
$$ -123499 -119215 -64067 -58671 -139579 -197509 -34504 -143592 44341 -78004 -243357 14947
11856d43121H0713e0499r2489E0452L06333e5129A12362O1835d777j31390j85034
$$ -443121 80713 -50499 -142988 50452 356785 -55129 112362 174197 -4777 -136167 -321201
11845c21201E7862b08041A63086c665p1468A04972J69885e8666A20308d23111
$$ -321201 57862 -208041 163086 -3665 -75133 104972 274857 -58666 120308 -423111
11834c7807k4285A1960b69266f3470m156A25559C4431b23290c8326B29273h9395
$$ -37807 -62092 11960 -269266 -63470 -67626 125559 34431 -223290 -38326 229273 -89395
11822b23960h5772A721c2149p1266A70026B711J1172a19871q6470I6865B5665
$$ -223960 -85772 1721 -32149 -103415 170026 2711 13883 -119871 -206341 96865 25665
11810A02623a66848G2566K30980b19055O4517b6221p0341R263A16053b41953B79644
$$ 102623 -166848 72566 303546 -219055 -154538 -26221 -96562 -87299 116053 -241953 279644
11798A76596a16703A22256a6535l8490L948k4246j13758h870o7430j39546b6818
$$ 176596 -116703 122256 -16535 -55025 -51077 -75323 -189081 -8870 -76300 -215846 -26818
11786A99463B2318K19390I2503a30188L9033B8132f198j33659k92963B36716q6677
$$ 199463 22318 241708 92503 -130188 -91155 28132 -6198 -139857 -432820 236716 150039
11775A50039a6850M400j63101E4873a06A95349g1652j02128B3440a29530j97669
$$ 150039 -16850 -12450 -175551 54873 -106 195349 -71652 -173780 23440 -129530 -327199
11764c27199A80969a15353A93879A885d083q5118p2317A21200B3184M8594i0179
$$ -327199 180969 -115353 193879 1885 -4083 -89201 -161518 121200 23184 71778 -90179
11752h0776C8122r235a73012o9308H0496r231a1435q7580A6846c6166a3731k28294
$$ -80776 38122 28887 -173012 -242320 80496 71265 -11435 -99015 16846 -36166 -13731 -242025
11740b42025B89637a00327l1256C59627b65343B08560C8826J93013J961J43624
$$ -242025 289637 -100327 -131583 359627 -265343 208560 38826 231839 233800 377424
11730C77424f4691A84483g4080A70237a42055E0906P7879J06347h5898n5986e482
$$ 377424 -64691 184483 -74080 170237 -142055 50906 128785 235132 -85898 -141884 -5482
11718a40495C06703q9742b55636A36658M6115B2640a21986c6455B63313D1470
$$ -140495 306703 216961 -255636 136658 182773 22640 -121986 -36455 263313 41470
11707A2898N1870f7907B56690R7795G8511a77151f9494h010D83740A9611N20922
$$ 12898 64768 -67907 256690 354485 78511 -177151 -69494 -8010 483740 19611 540533
11696E40533a9519B42767c41887a36962A01630a55893j85552I5625a11851j5156
$$ 540533 -19519 242767 -341887 -136962 101630 -155893 -341445 95625 -111851 -127007
11686a27007I3478K2457c2696r3491C62961k9510a8977d630j78761l7624f1300
$$ -127007 93478 115935 -32696 -126187 362961 333451 -18977 -4630 -183391 -221015 -61300
11674A94411E6992b4122a445H6403l2911k1663L79086C5283g600j2019p134A86123
$$ 194411 56992 -24122 -1445 86403 53492 31829 410915 35283 -7600 -19619 -26753 186123
11661d0802H2411a86801B18643M1026e9160B86652A29802a65699k6897h5572m9315
$$ -40802 82411 -186801 218643 259669 -59160 286652 129802 -165699 -192596 -85572 -134887
11650a34887l4509B4396f0688A26588K03242p8367H470c9177h575H0350d1687
$$ -134887 -169396 24396 -60688 126588 329830 251463 8470 -39177 -8575 80350 -41687
11638A18056C1456J10526a9123l8668k17260E5390b40148A17290a9699o1329G5511
$$ 118056 31456 141982 -19123 -57791 -275051 55390 -240148 117290 -19699 -81028 75511
11626f2429b1201G9244R5880A7232K97980A46443K776D2383L482A3355h0970B36752
$$ -62429 -21201 79244 175124 17232 315212 146443 149219 42383 45865 13355 -80970 236752
11613f0633b7693J1279A54492g7228G9794J73988D6158K09267A04092m2151a83730
$$ -60633 -27693 -16414 154492 -77228 79794 253782 46158 255425 104092 61941 -183730
11601A76867g4237B9943b6968A84663K83027j70990j23269J9326D0352M5928J44559
$$ 176867 -74237 29943 -26968 184663 467690 296700 173431 192757 40352 86280 230839
11590B30839j03126b355A91327J52509A31860c0415B09065E4774J85903b6777
$$ 230839 127713 -2355 191327 343836 131860 -30415 209065 54774 240677 -26777
11579D3291f6500p6823A54112F8259k5451J30770G6384J16519c6133C68933D5643
$$ 43291 -66500 -143323 154112 68259 42808 173578 76384 192903 -36133 368933 45643
11567G1139f1406j29760B4662e0134k35318g9711B44270H207a13283J1019N0701
$$ 71139 -61406 -191166 24662 -50134 -285452 -79711 244270 8207 -113283 -102264 -51563
11556e1563A32976b9015G2001K10422C2755e1329a0522C12939a07400l3133C3404
$$ -51563 132976 -29015 72001 282423 32755 -51329 -10522 312939 -107400 -140533 33404
11544a53935j01989A38482g3772A23285J03303C267N3290d9969A34534L4969f6995
$$ -153935 -255924 138482 -73772 123285 226588 3267 56557 -49969 134534 169503 -66995
11532B00668m3029a04433G076J11964J15192A2093d2173p0247C32730H7118K02292
$$ 200668 157639 -104433 7076 119040 234232 12093 -42173 -112420 332730 87118 289410
11521B89410a54171A87905E6672a85741A51430J3802L03431c029D15181e2019
$$ 289410 -154171 187905 56672 -185741 151430 165232 468663 -3029 415181 -52019
11510C43436K4401G5845M17033B31559J88542F9884J60898d1736k11680A43766
$$ 343436 367837 75845 492878 231559 420101 69884 230782 -41736 -253416 143766
11499A00019a0293A15484J48754j08245g723E9727c8560A80528J13290e200m941
$$ 100019 -10293 115484 264238 155993 -7723 59727 -38560 180528 293818 -5200 -10141
11488a0141q0710D37375D1092K83076J58770E5370h4685J8706q138D2455P9422
$$ -10141 -90851 437375 41092 324168 482938 55370 -84685 -65979 -74117 42455 121877
11477A21877C1188J61062J96847c4932E34106b35190C5069Q3524K06917k9863
$$ 121877 31188 192250 389097 -34932 534106 -235190 35069 118593 325510 295647
11467B95647r7855J25189o2203l5794a40474B52161a64773C60698A22828j6345
$$ 295647 197792 322981 260778 224984 -140474 252161 -164773 360698 122828 106483
11457A06483J79130a17794D4441J71984e562B50781h7329G1243l2186J86676d9361
$$ 106483 285613 -117794 44441 216425 -5562 250781 -87329 71243 39057 225733 -49361
11445A59739a03863D7488h6984D77722b2158B7054J8490N9183J48737c78118B09503
$$ 159739 -103863 47488 -86984 477722 -22158 27054 45544 104727 253464 -378118 209503
11433B36523M11148D8524M8111K0410i9737M3358A61429e2307a8717A79963H3210
$$ 236523 647671 48524 96635 117045 -99737 -56379 161429 -52307 -18717 179963 83210
11421I8497c17505j5667k71B90175b06501R4609A00046b93833B68066B4633J06148
$$ 98497 -317505 -333172 -333443 290175 -206501 -111892 100046 -293833 268066 24633 130781
11410A30781n1947J1789b87970a00145G7208K12597m5192a10550D019L40354I7896
$$ 130781 78834 90623 -287970 -100145 77208 289805 244613 -110550 4019 344373 97896
11398c4538H7091D2091b52289C50154m9543j05258a59210A29642a22112b9715
$$ -34538 87091 42091 -252289 350154 300611 195353 -159210 129642 -122112 -29715
11387B77270I0685k3527d4356G3376K10275a53662O1838p2147A96770c78125a17570
$$ 277270 90685 67158 -44356 73376 283651 -153662 -91824 -163971 196770 -378125 -117570
11375H9445K08147A22642L345E8109b04935R8689C6527M84099A20791c49687G4153
$$ 89445 297592 122642 125987 58109 -204935 -106246 36527 520626 120791 -349687 74153
11363A8192a56573L8222d0153B37140A04561C4141k277a95626c6132l202E11567
$$ 18192 -156573 -118351 -40153 237140 104561 34141 31864 -195626 -36132 -39334 511567
11351A00927O2841b64049h8061A86137I1100J58136A8342J12791J74317a53639
$$ 100927 163768 -264049 -88061 186137 91100 249236 18342 131133 305450 -153639
11340G0436l0950O2876b81632A54323J86629c6699l19224P2076B84214b29074
$$ 70436 39486 102362 -281632 154323 340952 -36699 -355923 -283847 284214 -229074
11329d3579j3229D9473P5050m4521f05228B47747n4121b94502K6008d8109A3470
$$ -43579 -56808 49473 124523 80002 -605228 247747 193626 -294502 -268494 -48109 13470
11317a4136m1174B64935g1864A44048a23303B12125H2987F099d02940i0293A97501
$$ -14136 -55310 264935 -71864 144048 -123303 212125 82987 6099 -402940 -90293 197501
11305b5812E2039L93733f0247e969l2827A48698d04776a11077o3717A5984d8148
$$ -25812 52039 445772 -60247 -5969 -38796 148698 -404776 -111077 -174794 15984 -48148
11293h4849B3541b33836h909k93669A67565a49456e2006j9015j21504B73475d50106
$$ -84849 23541 -233836 -8909 -302578 167565 -149456 -52006 -71021 -192525 273475 -450106
11281b69076a19358B88103a6932j84763E4475c6205A76942a02303j21516D29280
$$ -269076 -119358 288103 -16932 -201695 54475 -36205 176942 -102303 -223819 429280
11270B26644b22472N0551A00562L2452a99804I3340A8482a42811E2834i9296c6481
$$ 226644 -222472 -171921 100562 133014 -199804 93340 18482 -142811 52834 -99296 -36481
11258i7043A21077A401a33010A39111D7061J68324F0406a53727a3485A1656e3950
$$ -97043 121077 1401 -133010 139111 47061 215385 60406 -153727 -13485 11656 -53950
11246B18031b14729N1765A09513h4587o0023B171b30404k6019d5176i17j85425
$$ 218031 -214729 -162964 109513 -84587 -144610 2171 -230404 -256423 -45176 -917 -186342
11235a86342A37489j2549a58647b0771r5064C0305J94437H192J47893f4719Q479
$$ -186342 137489 124940 -158647 -20771 -115835 30305 224742 8192 156085 -64719 -56240
11224e6240A75066c55730P950J8211d7914j73124F5098a98748A52775m6944b45306
$$ -56240 175066 -355730 -347780 -329569 -47914 -221038 65098 -198748 152775 105831 -245306
11212b4815j96789b4893k00698B01337B2491c12625g4670A67357a039k24652A47779
$$ -24815 -221604 -24893 -225591 201337 22491 -312625 -74670 167357 -1039 -225691 147779
11200B48393H2487a74847A62120q0636k0726b54569a16216I0356h4680q1123b0428
$$ 248393 82487 -174847 162120 81484 60758 -254569 -116216 90356 -84680 -165803 -20428
11188d43351K18975B84601F3688f3509k3274F7327M8884a8593k29623A6740d10554
$$ -443351 -224376 284601 63688 -63509 -86783 67327 116211 -18593 -248216 16740 -410554
11176b09191j7340i7305j36855g2980A72412n8478j2843c24004A08596l2337R3129
$$ -209191 -226531 -97305 -234160 -72980 172412 113934 101091 -324004 108596 76259 169388
11165A69388L42m6814a98125f1928A11892b3244j95200R6024M3362j46373e8435
$$ 169388 169730 122916 -198125 -61928 111892 -23244 -218444 -122420 -79058 -225431 -58435
11153A0717N215a52108H5641J74938b10134A50873J98130I2225f9555A53425b30794
$$ 10717 15932 -152108 85641 260579 -210134 150873 349003 92225 -69555 153425 -230794
11141H3976A4550a7741A03038J0517l1324B2428d4266j17839E46630A81129O3551
$$ 83976 14550 -17741 103038 113555 82231 22428 -44266 -162105 546630 181129 244680
11130B44680a38633d9753B3929d9909I0904a60316H0079a97289P5180A15518a16694
$$ 244680 -138633 -49753 23929 -49909 90904 -160316 80079 -197289 -122109 115518 -116694
11118a4902A2800K43780r8919d2965B03174a17808C8143b9075A77280K41834A79773
$$ -14902 12800 256580 157661 -42965 203174 -117808 38143 -29075 177280 419114 179773
11106a44967A53646A8479K13618K09516A85281l93J54806f96C41177A14986b50528
$$ -144967 153646 18479 232097 441613 185281 184888 339694 -696 341177 114986 -250528
11094f7185A61608e1094A03996K76955a88789F86213l28262k2058P124A40598
$$ -67185 161608 -51094 103996 380951 -188789 686213 357951 335893 343017 140598
11083C43976A61055j101K8370L0739M7052o3918I2148L28032d567A70701J05351
$$ 343976 161055 159954 188324 219063 266115 202197 92148 420180 -4567 170701 276052
11072B76052I4895J64603N3299m1736J17644K7976j30924K70249F0077K55151
$$ 276052 94895 259498 312797 271061 388705 416681 285757 556006 60077 315228
11062C15228K14404j53268K64383j62565J23128j13166K41796o1290q5928N0831
$$ 315228 529632 376364 640747 478182 601310 488144 729940 668650 582722 633553
11052F33553K02634k36181K12549k70335J07563L00583m47897K66641q8884Q5475
$$ 633553 836187 600006 812555 542220 649783 950366 502469 769110 680226 765701
11042G65701L005J59681k42271m3064K4739R2888k92269K26344j46526Q8251L7555
$$ 765701 768706 928387 686116 643052 667791 760679 468410 694754 548228 636479 674034
11031F74034k26351K70916j41067A70827L23780K11524o6731K29069l38389J98811
$$ 674034 447683 718599 577532 170827 494607 706131 639400 868469 530080 728891
11021G28891k7228k56905L68978j78295L0895j76418K3341K79644C13868R8105
$$ 728891 701663 444758 813736 635441 666336 489918 513259 792903 313868 411973
11011D11973Q0405J10129p69k29428K1656P2474P7305R5328L9794k23151J01977
$$ 411973 492378 602507 601738 372310 393966 466440 543745 639073 678867 455716 557693
11000E57693J87754J2334j32479n6277O7416j48733L05563r244l06495K91188
$$ 557693 745447 757781 625302 569025 636441 487708 793271 784027 477532 768720
10990G68720K50531l56226K87208k74350M0001M65489N0382k08880q972L67333
$$ 768720 1019251 663025 950233 675883 715884 1181373 1231755 1022875 1013903 1381236
10980A381236k76838L18592k8323K00540o0825O15871J06438M61847k14401L96834
$$ 1381236 1104398 1422990 1394667 1595207 1534382 2150253 2256691 2718538 2504137 2900971
10970B900971j00732l46339J08196k98596k48580l01914O420j31836j29019N04752
$$ 2900971 2800239 2453900 2562096 2263500 2014920 1713006 1719426 1587590 1458571 1963323
10960A963323n71711J93476K77086j02735r3383k09528P717J05877m04040l50139
$$ 1963323 1391612 1585088 1862174 1759439 1666056 1456528 1464245 1570122 1166082 815943
10950H15943j74013j304j53507j3612M9322J31451l01149A70781N7208C320K82339
$$ 815943 641930 640626 487119 473507 522829 654280 353131 170781 227989 3320 285659
10939B85659o4723q7207J38794B3049N3762c9330E8608N4002J45728b1888j70871
$$ 285659 220936 133729 272523 23049 76811 -39330 58608 112610 258338 -21888 -192759
10928a92759B62000F5365I667K98490Q694I4293B4543i6675j8650B30452n7069
$$ -192759 262000 65365 9667 308157 316851 94293 24543 -96675 -115325 230452 173383
10917A73383E7140b58879A19001a30273G9274f7623p1412D2220a26872L6704A8028
$$ 173383 57140 -258879 119001 -130273 79274 -67623 -139035 42220 -126872 -90168 18028
10905C16319j29091A9013f442j54279A34891a13090A68710n457c01H0883K1509
$$ 316319 187228 19013 -6442 -160721 134891 -113090 168710 163253 -301 80883 102392
10894A02392P4412a29874A53680g4108H3466B4669J25469D9494d9420C7368a6106
$$ 102392 176804 -129874 153680 -74108 83466 24669 150138 49494 -49420 37368 -16106
10882a85825Q4629K3404k6365B4880J48664i6914a3182m18382a14890m1661e7890
$$ -185825 -101196 -77792 -104157 24880 173544 -96914 -13182 -431564 -114890 -156551 -57890
10870a19296A3007Q3682a30580B2508a05099A81933H6553a3272j91235G9355O0833
$$ -119296 13007 96689 -130580 22508 -105099 181933 86553 -13272 -204507 79355 140188
10859A40188b43055J15519C0407C06a79857f9713C87585a55067f1213A12792m2043
$$ 140188 -243055 -127536 30407 306 -179857 -69713 387585 -155067 -61213 112792 70749
10848G0749Q4571d8074D7714J9172C2382f0785j56754A7435J12963b48024J15051
$$ 70749 155320 -48074 47714 66886 32382 -60785 -217539 17435 130398 -248024 -132973
10837a32973e068A60467a52760A85980A920L61697G2124b09924J0870D9068k805
$$ -132973 -5068 160467 -152760 185980 1920 363617 72124 -209924 -199054 49068 46263
10826D6263j1831b22381B22719c09594N954a40500j60334i9447A75151G9505f1961
$$ 46263 34432 -222381 222719 -309594 -303640 -140500 -300834 -99447 175151 79505 -61961
10814b66026k92713g1088j13110a3709p9892c2848D8773i2837l39538c3537E8464
$$ -266026 -558739 -71088 -184198 -13709 -93601 -32848 48773 -92837 -432375 -33537 58464
10802a8043I634J83714c3413A2290R8443j485c4551A41670o2669b06346I402a79220
$$ -18043 9634 193348 -33413 12290 110733 109248 -34551 141670 79001 -206346 9402 -179220
10789A19919J16670P7144h9457A44188a76530o9515A35387g1184I3644a9602A35189
$$ 119919 236589 313733 -89457 144188 -176530 -246045 135387 -71184 93644 -19602 135189
10777F5608J2882d8851k11290m5408J21518M5421j20260B31984d6886A45438D4740
$$ 65608 78490 -48851 -260141 -305549 -184031 -138610 -258870 231984 -46886 145438 44740
10765a25888B84081f9045j20886E8928L3207m2903i5304F8209a02391r931l27837
$$ -125888 284081 -69045 -189931 58928 92135 49232 -95304 68209 -102391 -112322 -440159
10754d40159a14956k14402G3081f4653k96589A01247b23635m3900A0665R7370
$$ -440159 -114956 -329358 73081 -64653 -361242 101247 -223635 -267535 10665 108035
10744A08035b35290A32723J04512j15820a48189A88995d26935f1045D07984g3181
$$ 108035 -235290 132723 237235 121415 -148189 188995 -426935 -61045 407984 -73181
10733C607K02694a72658r2824e2172r2260K3852F582J31232i5868M7737j1739
$$ 3607 206301 -172658 -265482 -52172 -144432 -120580 6582 137814 -95868 -48131 -59870
10722e9870n6282j18353f6504j12710A25067n2993L5086D3087J08343k9882n0692
$$ -59870 -116152 -234505 -66504 -179214 125067 72074 107160 43087 151430 121548 70856
10711G0856e7773G8074b50082D8723a67283e819m09720A31174m8190C8719M72873
$$ 70856 -57773 78074 -250082 48723 -167283 -5819 -415539 131174 82984 38719 511592
10700E11592a25693d8735B4363c7253n004k04634b8313j18602k1282j66j00091
$$ 511592 -125693 -48735 24363 -37253 -42257 -246891 -28313 -146915 -168197 -168363 -268454
10689b68454l1505J00270m5912I1607a88890l7244d0982I1776a20328B79794E1402
$$ -268454 -299959 -199689 -245601 91607 -188890 -226134 -40982 91776 -120328 279794 51402
10677C9589J29817J90688b16549D30025b12337A72801a15387A73074c88777e5764
$$ 39589 169406 360094 -216549 430025 -212337 172801 -115387 173074 -388777 -55764
10666B41124b47644A7248K11687a8454A28896k2750b15388g0263B42692A6104
$$ 241124 -247644 17248 228935 -18454 128896 106146 -215388 -70263 242692 16104
10655D2255k31O7999G914L22086A40978J35307A3251O5527b3013A20803m5900
$$ 42255 42024 110023 7914 330000 140978 276285 13251 78778 -23013 120803 74903
10644G4903J54065B0231J9487a31300b2195p5707r2086e3101j01099b6478B04458
$$ 74903 228968 20231 39718 -131300 -22195 -97902 -189988 -53101 -154200 -26478 204458
10632a4328k0712r9448j82193e3162K5877k71763E39083f0545k58640B19571c27450
$$ -14328 -35040 -134488 -316681 -53162 -27285 -299048 539083 -60545 -319185 219571 -327450
10620a0086l9462j76794i5857H099a42922A38852a85503j01539m2660j4079A26207
$$ -10086 -49548 -226342 -95857 8099 -142922 138852 -185503 -287042 -329702 -343781 126207
10608a57538B61443e32004a88274A00959e3265k74939B1105a00227k24078J36390
$$ -157538 261443 -532004 -188274 100959 -53265 -328204 21105 -100227 -324305 -187915
10598a87915D2586b11346O0959E0895a79246K0406a4699j13962G9432a40781A7795
$$ -187915 42586 -211346 -150387 50895 -179246 -158840 -14699 -128661 79432 -140781 17795
10586b0776G9365f9891l02159a76528B43476b07216A70775a27635q3249B510a89513
$$ -20776 79365 -69891 -372050 -176528 243476 -207216 170775 -127635 -210884 2510 -189513
10574b16604C2874R7419l5958L0188h1239a3084A70905K6059r4440c2896l44062
$$ -216604 32874 130293 94335 124523 -81239 -13084 170905 196964 102524 -32896 -376958
10563c76958c5257m0570G5788Q8131a96129M0628A63304d9413k6605A12590d55448
$$ -376958 -35257 -75827 75788 163919 -196129 -155501 163304 -49413 -76018 112590 -455448
10551A29621o1725K6171J6897a11478k890d3559A7619J72883b5350l62852J63945
$$ 129621 67896 94067 110964 -111478 -114368 -43559 17619 190502 -25350 -388202 -224257
10540b24257G9775a5546k89468R7778A96629d27961B48817j01746J12872a05179
$$ -224257 79775 -15546 -305014 -207236 196629 -427961 248817 147071 259943 -105179
10529H583h1900j76969a00390L1437j7670B3850a1601I0215f3589q6350A42660
$$ 8583 -81900 -258869 -100390 -68953 -86623 23850 -11601 90215 -63589 -149939 142660
10517e3481j06931j79503B2731h1467n7989q6686L1827N3719B26850a83397m425
$$ -53481 -160412 -339915 22731 -81467 -139456 -226142 -194315 -140596 226850 -183397 -187822
10506a87822G0670K4983b78771A1908c11132j3433J48594d3668D4324L831J83500
$$ -187822 70670 95653 -278771 11908 -311132 -324565 -175971 -43668 44324 48155 231655
10495B31655a68059H02a48265j25823O8480K2849c5612l05501A62265o140e4701
$$ 231655 -168059 802 -148265 -274088 -205608 -182759 -35612 -341113 162265 156125 -54701
10483A43251L5539R5062J92090B14827H2931h9073E9466L14861k9434i2999f678
$$ 143251 178790 273852 465942 214827 82931 -89073 59466 374327 344893 -92999 -6678
10471A79448a36735f5927k57627J57706c7199J691r1691B38134P3375j00130c0069
$$ 179448 -136735 -65927 -323554 -165848 -37199 -35508 -127199 238134 311509 211379 -30069
10459b62983A0585b7014k91369o529d617r5530B51107r3174A3145a38967A39162
$$ -262983 10585 -27014 -318383 -324912 -4617 -100147 251107 157933 13145 -138967 139162
10447B4733K50508a76332k7572A25406a98343H7232a04683B17169F0481j0925
$$ 24733 275241 -176332 -203904 125406 -198343 87232 -104683 217169 60481 49556
10437D9556a29622C48921A9417J03364R5167H5779h5911e128B11927b71507G7824
$$ 49556 -129622 348921 19417 122781 217948 85779 -85911 -5128 211927 -271507 77824
10425c18366a24225j6525A02933K20357I138J87569e2658E6053f3171j28712O3179
$$ -318366 -124225 -140750 102933 323290 9138 196707 -52658 56053 -63171 -191883 -128704
10414a28704G3739e1689j34703A74293a00560k26278e751A87397a23316A40412
$$ -128704 73739 -51689 -186392 174293 -100560 -326838 -5751 187397 -123316 140412
10403A76616B4934h9F7424M1892J5615K12985F5748J93036A3640J58421j9274
$$ 176616 24934 -89 67424 109316 124931 337916 65748 258784 13640 172061 152787
10392A52787K4154m6212J98630o9309J81070B7846f9422A74822J2029G3417f4803
$$ 152787 176941 130729 329359 260050 441120 27846 -69422 174822 186851 73417 -64803
10380C02839A06277m1372b4559j88089B20298K43008A29105J06998a69073C50581
$$ 302839 106277 64905 -24559 -212648 220298 463306 129105 236103 -169073 350581
10369F92505b9377A61965L92684j88549j3086A39231J62015M7582q6378G4661
$$ 692505 -29377 161965 554649 366100 353014 139231 301246 348828 262450 74661
10358a50369e4731A83537K2130g5492i783C47265O2853O5274J83279r0195j35666
$$ -150369 -54731 183537 205667 -75492 -9783 347265 410118 475392 658671 568476 432810
10347D32810J10240c02A63324M41651n2639B05593J64523m070A31893K7387O2618
$$ 432810 543050 -302 163324 604975 552336 205593 370116 366046 131893 159280 221898
10336B21898p8456M430K2690n7291C1133J75474L1769A15061m9384N877j5884
$$ 221898 143442 147872 170562 113271 31133 206607 238376 115061 65677 71554 55670
10325E5670J45610L00607a18703H5948J00693K73751k25527D555J77793M2209
$$ 55670 201280 501887 -118703 85948 186641 460392 234865 4555 182348 224557
10315B24557I2130R0760q664b05251f5925r6868K2629C76459F2512a80810d4421
$$ 224557 92130 182890 174226 -205251 -65925 -162793 -140164 376459 62512 -180810 -44421
10303F8111c91181I1171A9774n38b29763C12374j56163O3919D1579a99132Q2922
$$ 68111 -391181 91171 19774 19236 -229763 312374 156211 220130 41579 -199132 -116210
10292a16210N2809J1673A56767f80B46247d15599B2230d4611q9075B22449E688
$$ -116210 -63401 -51728 156767 -680 246247 -415599 22230 -44611 -133686 222449 5688
10280a80993c915o9171A53175e450q9805A22024J73891j0612a25387c798j06814
$$ -180993 -3915 -73086 153175 -5450 -95255 122024 295915 285303 -125387 -3798 -110612
10269a10612H7385J21519b6236j3547p5480M9385l9509A68646J22463K35074A06697
$$ -110612 87385 208904 -26236 -39783 -115263 -65878 -105387 168646 291109 526183 106697
10257E2551a23716A47191K29118k6742I297K03214C5317b54546A03863d32143
$$ 52551 -123716 147191 376309 349567 9297 212511 35317 -254546 103863 -432143
10246C585b80472d7118n3306j05487I674O5228b0972E9256a6622r5815H5814f737
$$ 3585 -280472 -47118 -100424 -205911 9674 74902 -20972 59256 -16622 -112437 85814 -6737
10233a71075A16025N6023a60442F8740a85711n3828F3631d3496F6598b8900k7610
$$ -171075 116025 172048 -160442 68740 -185711 -239539 63631 -43496 66598 -28900 -56510
10222e6510j58881A17900b80418g8617B33616g3490f926B65806a42516O2180K6561
$$ -56510 -215391 117900 -280418 -78617 233616 -73490 -6926 265806 -142516 -80336 -53775
10211e3775A0758M6053a02439A80765C6863N7383D4991e5583k26620k828C6974
$$ -53775 10758 56811 -102439 180765 36863 94246 44991 -55583 -282203 -285031 36974
10199a743F8483a84492e7991k84490b1925j80045D440a71486d9705E17395h7019
$$ -1743 68483 -184492 -57991 -342481 -21925 -201970 4440 -171486 -49705 517395 -87019
10187f908D1501c8477H8773L25594b93734a27827J8847C34639H2110d33009J69926
$$ -6908 41501 -38477 88773 414367 -293734 -127827 -108980 334639 82110 -433009 -263083
10176b63083K8468A3686a89121H8150a55959A1253a70525O2701M2530B6652f4882
$$ -263083 -234615 13686 -189121 88150 -155959 11253 -170525 -107824 -65294 26652 -64882
10164H2052e3536G5173j543c09543F0842O2960b15133C5939b29926A17785a23823
$$ 82052 -53536 75173 73630 -309543 60842 123802 -215133 35939 -229926 117785 -123823
10152f080A76747a03886C08033c79441c065I8695e81687A3811a54386M5330J3216
$$ -6080 176747 -103886 308033 -379441 -3065 98695 -581687 13811 -154386 -109056 -95840
10141i5840j01538j72765r7715b9795B07069c15720O6881e8634J9878e413G5840
$$ -95840 -197378 -370143 -467858 -29795 207069 -315720 -248839 -58634 -38756 -5413 75840
10129a94052r4105i462k06401a03256l19503B5326b78647q3131a5002p3781E7559
$$ -194052 -288157 -9462 -215863 -103256 -422759 25326 -278647 -361778 -15002 -88783 57559
10117c07003D9248b794q1780B68128E7576a34265A87206b67927D4156a66186K6989
$$ -307003 49248 -2794 -84574 268128 57576 -134265 187206 -267927 44156 -166186 -139197
10106a39197k89233g5510C35340g1586q8432k1804E9385d9153J7072A09148J87281
$$ -139197 -428430 -75510 335340 -71586 -160018 -181822 59385 -49153 -32081 109148 296429
10095B96429D854i8052j44369A53710J43837c2011j12633H3965N9426b16601j03332
$$ 296429 4854 -98052 -242421 153710 297547 -32011 -144644 83965 143391 -216601 -319933
10084c19933B52132C5110a99556B37755j787e8055A920a19463B4133e2209m2553
$$ -319933 252132 35110 -199556 237755 235968 -58055 1920 -119463 24133 -52209 -94762
10073i4762l3308H067a07609j17344O5000c3308B18374f7796k25592J40617O8344
$$ -94762 -128070 8067 -107609 -224953 -159953 -33308 218374 -67796 -293388 -152771 -84427
10062h4427k1551k225E7911b52511E2709a5084j91696P3799a0425n8554k6439
$$ -84427 -105978 -108203 57911 -252511 52709 -15084 -206780 -132981 -10425 -68979 -95418
10051i5418q2261l5567g5310m77732H8856c20359A26747b3341D9208a69512K4914
$$ -95418 -177679 -213246 -75310 -553042 88856 -320359 126747 -23341 49208 -169512 -144598
10040a44598l8873A0521h0570C35520b52395R2422e8713B0626J96935b4892A77432
$$ -144598 -183471 10521 -80570 335520 -252395 -159973 -58713 20626 217561 -24892 177432
10028c60721f9848F023b42113q1378A87948o3578F0597k3596b12041c7537j9817
$$ -360721 -69848 6023 -242113 -323491 187948 124370 60597 37001 -212041 -37537 -57354
10017e7354k29462J41441j57598l2113B39069f7978A56130e6965l6551l62223
$$ -57354 -286816 -145375 -302973 -335086 239069 -67978 156130 -56965 -93516 -455739
10007d55739A34062a04670k22151a34269A5006L83715I5296J01264a03057d5311
$$ -455739 134062 -104670 -326821 -134269 15006 398721 95296 196560 -103057 -45311
9996f4421b0482k58946e2353j826D180P2387c08393A85049G7310g0189A12582
$$ -64421 -20482 -279428 -52353 -54179 4180 76567 -308393 185049 77310 -70189 112582
9984a30107K0413A72151B8284a18843B81363c26365i7539K0655B06371c3907A53187
$$ -130107 -109694 172151 28284 -118843 281363 -326365 -97539 -76884 206371 -33907 153187
9972b60024f0677k13360J27266d851k61285b1298r2833a577A8481M5485a54941
$$ -260024 -60677 -274037 -146771 -4851 -266136 -21298 -114131 -1577 18481 63966 -154941
9960a39876N630e06A28178h5251B06089i3373j33394a03634c878k17698A01083
$$ -139876 -134246 -506 128178 -85251 206089 -93373 -226767 -103634 -3878 -221576 101083
9948a85050A84311F7578h9270K7007m4884B19153g960A10309M22965A003K24845
$$ -185050 184311 67578 -89270 -62263 -107147 219153 -7960 110309 533274 1003 225848
9937B25848c50696B80410c41161i5950F2763K05377a10564F1472c48262i7608
$$ 225848 -350696 280410 -341161 -95950 62763 268140 -110564 61472 -348262 -97608
9926h7612a4094j17406j17138D7635P8470a63329A12058b31212N2041K063Q8246
$$ -87612 -14094 -131500 -248638 47635 126105 -163329 112058 -231212 -179171 -177108 -88862
9915h8862G6507a80069B4899b99610i1037A32873E8945b2099G7456h2242i226
$$ -88862 76507 -180069 24899 -299610 -91037 132873 58945 -22099 77456 -82242 -9226
9903B97801c9136A4804i5488l32952C01491B8553J12627a21043q7022E929R286
$$ 297801 -39136 14804 -95488 -428440 301491 28553 141180 -121043 -208065 5929 15215
9892A5215h8568k27775a5947l9873j46542F5315i5290A64054a16479A49169f2558
$$ 15215 -88568 -316343 -15947 -55820 -202362 65315 -95290 164054 -116479 149169 -62558
9880h1238j43269n0263j0070a19372A17529a86789b6428j50626O1805A29471I838
$$ -81238 -224507 -274770 -284840 -119372 117529 -186789 -26428 -177054 -115249 129471 9838
9868g6000A10220i5582J3317B23975b39264A26666a44491B07870b03986m3307
$$ -76000 110220 -95582 -82265 223975 -239264 126666 -144491 207870 -203986 -247293
9858b47293B38521c2445A59484E6394d4708j6042j09013b3709j98274i5766A16752
$$ -247293 238521 -32445 159484 56394 -44708 -60750 -169763 -23709 -221983 -95766 116752
9846h1910k98907a40145a2114B3171L0678a82641j9865h3569r2671b6595E0569
$$ -81910 -380817 -140145 -12114 23171 53849 -182641 -202506 -83569 -176240 -26595 50569
9834a00832c3839r1987r3237I7770L52363c29637A1568h2319l63042K00199J04567
$$ -100832 -33839 -125826 -219063 97770 450133 -329637 11568 -82319 -445361 -245162 -140595
9823a40595d0152j69213E6033A3098J16199b44124e8492k71828a13107K0759J5762
$$ -140595 -40152 -209365 56033 13098 129297 -244124 -58492 -330320 -113107 -92348 -76586
9812g6586D322J62181a53784A71981F819J7944L6118b07145h8857p4145c8873
$$ -76586 4322 166503 -153784 171981 6819 24763 60881 -207145 -88857 -163002 -38873
9800b68838g8074n127l5122b0196k79834e8638A1008g265H5375b03632J01788
$$ -268838 -78074 -83201 -118323 -20196 -300030 -58638 11008 -7265 85375 -203632 -101844
9789a01844j36333A84343a55786O9755b1122C1042L4333b44707e5724A09168c57697
$$ -101844 -238177 184343 -155786 -86031 -21122 31042 65375 -244707 -55724 109168 -357697
9777g7802g212l4283A58195G7260b0121H2763a778B06638b51015A02825a34153
$$ -77802 -7212 -41495 158195 77260 -20121 82763 -1778 206638 -251015 102825 -134153
9765B3433L20993c732A90571h2612j67739p757K8146i9356c230C2143c40594a48616
$$ 23433 344426 -3732 190571 -82612 -250351 -258108 -229962 -99356 -3230 32143 -340594 -148616
9752b82658e1029A9486a2732j07247N8607k4549r2793b362C50545b2976D8531
$$ -282658 -51029 19486 -12732 -119979 -61372 -85921 -178714 -2362 350545 -22976 48531
9740b12185I1966d6547A19405m265d8399j03764l3002f9581E809h3208A18203
$$ -212185 91966 -46547 119405 115140 -48399 -152163 -185165 -69581 5809 -83208 118203
9728a7443k74192B10889d2824p3829G6522c75727J28801K5857b3910G8882a27938
$$ -17443 -291635 210889 -42824 -116653 76522 -375727 -246926 -221069 -23910 78882 -127938
9716a72144I7353a19220j24590H6595N3044A1194J8579A3563b99611d6493R501
$$ -172144 97353 -119220 -243810 86595 139639 11194 29773 13563 -299611 -46493 -36992
9705c6992B47164A00055K6408d07577a4808n2109r8167K6597j89474G9287g5643
$$ -36992 247164 100055 126463 -407577 -14808 -66917 -165084 -138487 -327961 79287 -75643
9693a12269k5131j4823q1688A54833b87534J35909B9815g6472j17568h7195B78113
$$ -112269 -137400 -152223 -233911 154833 -287534 -151625 29815 -76472 -194040 -87195 278113
9681d07223J81151A4849L2107f2797j557k55233I0850b17979j28621b9449F9596
$$ -407223 -226072 14849 46956 -62797 -64354 -319587 90850 -217979 -346600 -29449 69596
9669f2783k03615H734a89591P1212a5496d229n9238k4611p3459d0105j5940j1343
$$ -62783 -266398 8734 -189591 -118379 -15496 -4229 -63467 -88078 -161537 -40105 -56045 -67388
9657f7388n572k6302j75891a29864A45839c38952c2200D33806e00486a20027j26698
$$ -67388 -72960 -99262 -275153 -129864 145839 -338952 -32200 433806 -500486 -120027 -246725
9646b46725A10720C2766b6071B805c4590J5827k9983j64582a4572A05815e1784
$$ -246725 110720 32766 -26071 2805 -34590 -18763 -48746 -213328 -14572 105815 -51784
9634i1280m400j17662G9513k1874a06080k4603l4296r718e0446k1437A68915e8874
$$ -91280 -95680 -213342 79513 57639 -106080 -130683 -164979 -174697 -50446 -71883 168915 -58874
9621G6191I621c00105B57679a03639a2162j99573G9534i7740B1907b02766M4481
$$ 76191 9621 -300105 257679 -103639 -12162 -211735 79534 -97740 21907 -202766 -158285
9610a58285H2480f5246C02034H7014D1571a73500L3230n929G3638c1233A8234
$$ -158285 82480 -65246 302034 87014 41571 -173500 -140270 -146199 73638 -31233 18234
9598A60623a372k0553o3425b0007A33839a2241j41231B14362c8872H4817Q9265
$$ 160623 -1372 -21925 -85350 -20007 133839 -12241 -153472 214362 -38872 84817 174082
9587A74082H3834a08495j9527C8714b35755B4442N0889h5068B84070a23882d9096
$$ 174082 83834 -108495 -128022 38714 -235755 24442 75331 -85068 284070 -123882 -49096
9575B11709F6623J30122f820j07021A0828h8307I5610O9256d6105m70737A40972
$$ 211709 66623 196745 -6820 -113841 10828 -88307 95610 164866 -46105 -516842 140972
9563i4099a2044k97000j7958K3370i6157C0587a73627Q6h5344j50176J02978B4201
$$ -94099 -12044 -309044 -327002 -303632 -96157 30587 -173627 -173541 -85344 -235520 -132542 24201
9550i612k47491d6543o45k68851K3493g035E03083r0500b20704B95383e4912j15879
$$ -9612 -257103 -46543 -47188 -316039 -292546 -7035 503083 412583 -220704 295383 -54912 -170791
9538a70791A06762a52506B66779b00834C0698c03045l5847f5670K6510j90091
$$ -170791 106762 -152506 266779 -200834 30698 -303045 -338892 -65670 -39160 -229251
9528b29251A8508K14987f8444A24526m2138a19899l19213C6646P4296h3342G9698
$$ -229251 18508 233495 -68444 124526 82388 -119899 -439112 36646 110942 -83342 79698
9516F279b34096A91049g7490A53843c9216j24022j69063P5293b8175A40125P8626
$$ 6279 -234096 191049 -77490 153843 -39216 -163238 -332301 -257008 -28175 140125 218751
9505B18751I055a86957B75961c58641A00161m6618J2820O1128E9653J9473N2642
$$ 218751 9055 -186957 275961 -358641 100161 53543 66363 127491 59653 79126 131768
9494A31768d6767j57963a6888F9897a12378c3262j55703p0343A00378B5422K91778
$$ 131768 -46767 -204730 -16888 69897 -112378 -33262 -188965 -259308 100378 25422 317200
9483C17200g5276A53793l5823b962r4439L5903E8608a4722j69869a756q7874D27825
$$ 317200 -75276 153793 117970 -2962 -97401 -61498 58608 -14722 -184591 -1756 -89630 427825
9470A97385d51879B2760b58354H27d238q6235o9405J4737n3719M6018L0059H2996
$$ 197385 -451879 22760 -258354 827 -4238 -90473 -159878 -145141 -198860 -152842 -122783 82996
9457A3225J4652J49854k0268m802D6834G4b7396G4316R5040b82327C5410L46209
$$ 13225 27877 177731 157463 152661 46834 74 -27396 74316 169356 -282327 35410 381619
9445C81619E9058d3409j42905m5192a10830k87885A71462l9713m3300a24183c2193
$$ 381619 59058 -43409 -186314 -231506 -110830 -398715 171462 131749 88449 -124183 -32193
9433a65240J8493q7364B9564h3192B2710b6962j36542C0681a74646k1157A04089
$$ -165240 -146747 -234111 29564 -83192 22710 -26962 -163504 30681 -174646 -195803 104089
9421E3951b06617A75841b14126j49825A87020a0197l33934A63192c62006J07908
$$ 53951 -206617 175841 -214126 -363951 187020 -10197 -344131 163192 -362006 -254098
9411b54098b5989j11899B79956j38095c67503B5902b9280j54315f1058k12718
$$ -254098 -25989 -137888 279956 141861 -367503 25902 -29280 -183595 -61058 -273776
9401b73776e8131B96093g7168j36038m2013B96482a18529k3959B2604M7775b23437
$$ -273776 -58131 296093 -77168 -213206 -255219 296482 -118529 -142488 22604 70379 -223437
9389A02982M1190l4201a59008A0632J30701c03788R7669B54719b727k4572l7527
$$ 102982 144172 109971 -159008 10632 141333 -303788 -206119 254719 -2727 -27299 -64826
9378f4826a3904A55604i4899A05815M9784a12614l2839A11858a12735p770c6691
$$ -64826 -13904 155604 -94899 105815 155599 -112614 -145453 111858 -112735 -120505 -36691
9366b93432A04939a46220f56j02367j2398k5502F4851b43831E9498a78063k0190
$$ -293432 104939 -146220 -656 -103023 -115421 -140923 64851 -243831 59498 -178063 -198253
9355a98253m5482N1638h7522B178J50768d6113p2001B38098l5364D3516B936a31343
$$ -198253 -243735 -192097 -87522 2178 152946 -46113 -118114 238098 202734 43516 2936 -131343
9342b07305B00464c94252a34180j51768i7324d1067l30417J82733M5821J2308
$$ -207305 200464 -394252 -134180 -285948 -97324 -41067 -371484 -188751 -142930 -130622
9332a30622N5761n0884L9504B26437a92234j5805b9040B46743a9196q1605C3818
$$ -130622 -74861 -125745 -86241 226437 -192234 -208039 -29040 246743 -19196 -100801 33818
9320a2676l38369B9088g5308j36565O7627a4091G3177a23872N5832A33234b02527
$$ -12676 -351045 29088 -75308 -211873 -144246 -14091 73177 -123872 -68040 133234 -202527
9308c01525q1620A40317g2078G4819K14773B2814R8865O0385b77827C3960a8376
$$ -301525 -383145 140317 -72078 74819 289592 22814 121679 182064 -277827 33960 -18376
9296A0916b91641a05395B70970j3288e4919k78311A25498a20867j18288h0317
$$ 10916 -291641 -105395 270970 257682 -54919 -333230 125498 -120867 -239155 -80317
9285A7825b19329m7075J29559j36718B5138J47807a3705a562A72606J00004C7845
$$ 17825 -219329 -266404 -136845 -273563 25138 172945 -13705 -1562 172606 272610 37845
9273g4503r0414H3784L1738b88843b5027B10191G6709K7495b8281B7685a3340
$$ -74503 -164917 83784 115522 -288843 -25027 210191 76709 104204 -28281 27685 -13340
9261b46645H1684c25886J30448l9252B21737a42822d5185I154Q219J95021G1699
$$ -246645 81684 -325886 -195438 -234690 221737 -142822 -45185 9154 17373 212394 71699
9249b32056P7214g0304B29733N7909h5723h7A37826n5103b51816I9928m0728b40459
$$ -232056 -154842 -70304 229733 287642 -85723 -87 137826 82723 -251816 99928 59200 -240459
9236f8196k9177k17412P3716O3531f9910C05552d67252a92271j28062a05932c748
$$ -68196 -97373 -314785 -241069 -177538 -69910 305552 -467252 -192271 -320333 -105932 -3748
9224D911a72385e6689F611e8549k5862A83589C6957M4365B4035J06699M4828E0302
$$ 4911 -172385 -56689 6611 -58549 -84411 183589 36957 81322 24035 130734 175562 50302
9211a33385M0135k3222j9920j49732a3287k63290a8467l13132B35566b28461B27898
$$ -133385 -93250 -116472 -136392 -286124 -13287 -276577 -18467 -331599 235566 -228461 227898
9199B31668c7585k66294K0915D3138K45987c49883a61328K421F4548f2800g284
$$ 231668 -37585 -303879 -282964 43138 289125 -349883 -161328 -158907 64548 -62800 -7284
9187b85990H9798a9692F0944i8592E4454a7602H8134e0189I6848d2175l0218n0442
$$ -285990 89798 -19692 60944 -98592 54454 -17602 88134 -50189 96848 -42175 -72393 -122835
9175a22835C50418A4804a56747A36690a90391b4823k0614p6831B46567b93509
$$ -122835 350418 14804 -156747 136690 -190391 -24823 -45437 -122268 246567 -293509
9164B05692p1240b75529f6259A91963H064a32496r7483j4454a170I940Q1335J09044
$$ 205692 134452 -275529 -66259 191963 8064 -132496 -229979 -244433 -1170 9940 91275 200319
9152B00319b02482R6358I0624d84291a79378A86041N1507b36216l1748J05318
$$ 200319 -202482 -106124 90624 -484291 -179378 186041 237548 -236216 -267964 -162646
9142a62646A69746c3367j93813M7073A38748i6068o9518O5691B45601E7286a71106
$$ -162646 169746 -33367 -227180 -180107 138748 -96068 -165586 -99895 245601 57286 -171106
9130A22029a17607D1457b364G5419a66961j47210c7399j52342a7990j96731a02334
$$ 122029 -117607 41457 -2364 75419 -166961 -314171 -37399 -189741 -17990 -214721 -102334
9118d0739R309B44018m9302a19108K9061b4264k26986h0794l531j0368f860A46338
$$ -40739 -31430 244018 194716 -119108 -90047 -24264 -251250 -80794 -84325 -94693 -6860 146338
9105i5283H7257L046K21910D1942a7965j31545A28622e454C36241c0730F1834
$$ -95283 87257 90303 312213 41942 -17965 -149510 128622 -5454 336241 -30730 61834
9093A46267J77952b98933R1807O5713N6978j00882d2167j13842a9740D6811d5894
$$ 146267 324219 -298933 -207126 -141413 -84435 -185317 -42167 -156009 -19740 46811 -45894
9081f6782k36459a45294p9828m3983K1930a06936A06476a8609C42373a07880l323
$$ -66782 -303241 -145294 -225122 -269105 -247175 -106936 106476 -18609 342373 -107880 -111203
9070a11203A03890K29350A50657j0625c0731k89558e2716k08469a22373e1613
$$ -111203 103890 333240 150657 140032 -30731 -320289 -52716 -261185 -122373 -51613
9059b22067c2660A52880C029f9858A62042K26225c13746c7088l03845a41002f7875
$$ -222067 -32660 152880 3029 -69858 162042 388267 -313746 -37088 -340933 -141002 -67875
9047b89245JB45226b08057N3622E2480a36775C48238b04755l2985H8777b00633
$$ -289245 -289244 245226 -208057 -154435 52480 -136775 348238 -204755 -237740 88777 -200633
9035H9668M1890a41735A33280n8442C6532b90149D517J47871a86465M0249C04630
$$ 89668 131558 -141735 133280 74838 36532 -290149 4517 152388 -186465 -146216 304630
9023A0262J32820e0684k28334I1491b981p2935n0359E5583a89977e6790j65654
$$ 10262 143082 -50684 -279018 91491 -2981 -75916 -126275 55583 -189977 -56790 -222444
9012b22444A53134H473c25864O9170q6908A64601D3404a12132j31446a7575l74702
$$ -222444 153134 8473 -325864 -256694 -343602 164601 43404 -112132 -243578 -17575 -392277
9001c92277d9747P591m1186c3403r6249B9427q303a69379j53202J06361G2335
$$ -392277 -49747 -42156 -83342 -33403 -129652 29427 21124 -169379 -322581 -216220 72335
8989b59006I6380c54190A83376g4216d582n5853a6358r7391B03317c76661C28507
$$ -259006 96380 -354190 183376 -74216 -4582 -60435 -16358 -113749 203317 -376661 328507
8977G629N8676b15706d5117A71391a69258k40583a21639P059A21031c68959D8597
$$ 7629 66305 -215706 -45117 171391 -169258 -409841 -121639 -114580 121031 -368959 48597
8965B22448F3057a55974I1300a26184d9654j38833O3825j07650A72053a18952
$$ 222448 63057 -155974 91300 -126184 -49654 -188487 -124662 -232312 172053 -118952
8954A74077J80811h8743j30310h5895j01551D6616J41557o8677l1936a17999q1955
$$ 174077 354888 -88743 -219053 -85895 -187446 46616 188173 119496 87560 -117999 -199954
8943a99954B04725a61592N818A42905b24011j8770a14938D21355A79318p8030
$$ -199954 204725 -161592 -155774 142905 -224011 -242781 -114938 421355 179318 101288
8933A01288J84643a96697O8321m0703B1630i9052n7932B02236K58067M25854K709620
$$ 101288 285931 -196697 -128376 -169079 21630 -99052 -156984 202236 460303 886157 3595777
8922C595777R673168m400856B704144A029319C09132K15370k57831d0680B14485
$$ 3595777 13268945 8868089 2704144 1029319 309132 524502 266671 -40680 214485
8912i8449c301A66119N4431e1702A29368Q0871i9747o2513o473B2719a69958I5411
$$ -98449 -3301 166119 220550 -51702 129368 210239 -99747 -162260 -168733 22719 -169958 95411
8899A46560a92596C9942i6509G6832R0180f4A59975K7446g1357q5379k88572P076
$$ 146560 -192596 39942 -96509 76832 167012 -64 159975 187421 -71357 -156736 -445308 -438232
8887d38232a99770j45289a50466A9643c0689N225e818m1130l5075j9696j17882
$$ -438232 -199770 -345059 -150466 19643 -30689 -25464 -5818 -46948 -82023 -101719 -219601
8876b19601a1573G4027a99329f2962B8263i7513m5246m5197H8815J25098q760
$$ -219601 -11573 74027 -199329 -62962 28263 -97513 -142759 -187956 88815 213913 205153
$$ [...]
##END NTUPLES=NMR SPECTRUM
##END=
