
##TITLE=AC1302_PERAH12114_6535671_KetVU1Pe3j
##JCAMPDX= 6.0         $$ Bruker NMR JCAMP-DX V2.0
##DATA TYPE= NMR SPECTRUM
##DATA CLASS= NTUPLES
##ORIGIN= BRUKER
##OWNER= Administrator
$$ 1.72 TOPSPIN		Version 2.1
$$ 2012-11-30 19:32:19.316 -0500  Administrator@X
$$ Compression mode = diff/dup
##.OBSERVE FREQUENCY= 400.02188249412
##.OBSERVE NUCLEUS= ^1H
##.ACQUISITION MODE= SIMULTANEOUS (DQD)
##.ACQUISITION SCHEME= undefined
##.AVERAGES= 64
##.DIGITISER RES= 22
##SPECTROMETER/DATA SYSTEM= spect
##.PULSE SEQUENCE= noesygpps1d.comp
##.SOLVENT NAME= COFFEE_meoh
##.SHIFT REFERENCE= INTERNAL, COFFEE_meoh, 1, 14.96077
##AUDIT TRAIL= $$ (NUMBER, WHEN, WHO, WHERE, PROCESS, VERSION, WHAT)
$$ ##TITLE= Audit trail, TOPSPIN		Version 2.1
$$ ##JCAMPDX= 5.01
$$ ##ORIGIN= Bruker BioSpin GmbH
$$ ##OWNER= Administrator
$$ $$ E:\/data/COFFEE/nmr/AC1302_PERAH12114_6535671_KetVU1Pe3j/42/pdata/1/auditp.txt
$$ ##AUDIT TRAIL=  $$ (NUMBER, WHEN, WHO, WHERE, PROCESS, VERSION, WHAT)
(   1,<2012-11-30 19:32:13.835 -0500>,<Administrator>,<X>,<go>,<TOPSPIN 2.1>,
      <created by zg
	started at 2012-11-30 19:20:45.687 -0500,
	POWCHK enabled, PULCHK disabled,
       configuration hash MD5:
       86 BA 57 50 F2 9D 5C 9B 26 00 A9 28 5F 66 2E 89
       data hash MD5: 64K
       DE 8A 8C 5F BA 16 00 7B 07 DD 5D 55 A1 02 25 70>)
(   2,<2012-11-30 19:32:16.563 -0500>,<Administrator>,<X>,<proc1d>,<TOPSPIN 2.1>,
      <Start of raw data processing
       efp LB = 0.3 FT_mod = 6 PKNL = 1 PHC0 = 0 PHC1 = 0 SI = 128K 
       data hash MD5: 128K
       B3 FC 70 ED E4 A7 20 F7 C8 6F 14 AF 69 07 E1 3C>)
(   3,<2012-11-30 19:32:17.653 -0500>,<Administrator>,<X>,<proc1d>,<TOPSPIN 2.1>,
      <pk PHC0 = -80.4364 PHC1 = 0 
       data hash MD5: 128K
       D0 C6 77 62 2F E7 CD EA 7E 88 3B 40 94 43 AD 8B>)
(   4,<2012-11-30 19:32:18.315 -0500>,<Administrator>,<X>,<proc1d>,<TOPSPIN 2.1>,
      <abs ABSG = 1 
       data hash MD5: 128K
       E0 AB 22 C3 F3 93 E8 B9 89 EB FF 12 95 4A 64 3E>)
(   5,<2012-11-30 19:32:18.507 -0500>,<Administrator>,<X>,<proc1d>,<TOPSPIN 2.1>,
      <abs ABSG = 2 
       data hash MD5: 128K
       26 AA 95 F4 D2 15 06 7D A8 4F 62 3C 89 E0 BA 80>)
(   6,<2012-11-30 19:32:18.654 -0500>,<Administrator>,<X>,<proc1d>,<TOPSPIN 2.1>,
      <abs ABSG = 3 
       data hash MD5: 128K
       D3 BB BC F6 EC E3 85 AE E7 AE E6 D6 D7 2E 1A BD>)
(   7,<2012-11-30 19:32:18.815 -0500>,<Administrator>,<X>,<proc1d>,<TOPSPIN 2.1>,
      <abs ABSG = 4 
       data hash MD5: 128K
       45 5D 19 12 EB D8 8A 79 94 C6 51 3C E5 D4 31 B3>)
(   8,<2012-11-30 19:32:18.977 -0500>,<Administrator>,<X>,<proc1d>,<TOPSPIN 2.1>,
      <abs ABSG = 5 
       data hash MD5: 128K
       7A 08 DB BC 3D 37 5B 87 CC 99 9E 44 6A 9A 0B 8C>)
$$ ##END=
$$ 
$$ $$ hash MD5
$$ $$ 9E 04 9D D2 DA AA 20 78 53 FD 4B 31 AB 3A 85 19
##$RELAX= 
##$RELAX= 
##$RELAX= 
##$RELAX= 
##$RELAX= 
##$RELAX= 
##$RELAX= 
##$RELAX= 
$$ Bruker specific parameters
$$ --------------------------
##$DU= <E:\>
##$EXPNO= 42
$$ [...]
150 150 150 150 150 150 150 150
##$TP07= 0
##$TPNAME0= <>
##$TPNAME1= <>
##$TPNAME2= <>
##$TPNAME3= <>
##$TPNAME4= <>
##$TPNAME5= <>
##$TPNAME6= <>
##$TPNAME7= <>
##$TPOAL= (0..7)
0.5 0.5 0.5 0.5 0.5 0.5 0.5 0.5
##$TPOFFS= (0..7)
0 0 0 0 0 0 0 0
##$TUNHIN= 0
##$TUNHOUT= 0
##$TUNXOUT= 0
##$USERA1= <user>
##$USERA2= <user>
##$USERA3= <user>
##$USERA4= <user>
##$USERA5= <user>
##$V9= 5
##$VALIST= <valist>
##$VCLIST= <CCCCCCCCCCCCCCC>
##$VD= 0
##$VDLIST= <DDDDDDDDDDDDDDD>
##$VPLIST= <PPPPPPPPPPPPPPP>
##$VTLIST= <TTTTTTTTTTTTTTT>
##$WBST= 1024
##$WBSW= 4
##$XGAIN= (0..3)
0 0 0 0
##$XL= 0
##$YL= 0
##$YMAX_a= 6427562
##$YMIN_a= -11936711
##$ZGOPTNS= <>
##$ZL1= 120
##$ZL2= 120
##$ZL3= 120
##$ZL4= 120
##$ABSF1= 14.96077
##$ABSF2= -5.597412
##$ABSG= 5
##$ABSL= 3
##$ALPHA= 0
##$AQORDER= 0
##$ASSFAC= 0
##$ASSFACI= 0
##$ASSFACX= 0
##$ASSWID= 0
##$AUNMP= <proc_prof1d_extract.lims>
##$AXLEFT= 0
##$AXNAME= <>
##$AXNUC= <1H>
##$AXRIGHT= 0
##$AXTYPE= 0
##$AXUNIT= <>
##$AZFE= 0.1
##$AZFW= 0.1
##$BCFW= 0
##$BC_mod= 0
##$BYTORDP= 0
##$COROFFS= 0
##$CY= 15
##$DATMOD= 1
##$DC= 0
##$DFILT= <>
##$DTYPP= 0
##$F1P= 0
##$F2P= 0
##$FCOR= 0.5
##$FTSIZE= 131072
##$FT_mod= 6
##$GAMMA= 0
##$GB= 0
##$INTBC= 1
##$INTSCL= 1
##$ISEN= 128
##$LB= 0.3
##$LEV0= 0
##$LPBIN= 0
##$MAXI= 10000
##$MC2= 0
##$MEAN= 0
##$ME_mod= 0
##$MI= 0
##$NCOEF= 0
##$NC_proc= -2
##$NLEV= 6
##$NOISF1= 0
##$NOISF2= 0
##$NSP= 0
##$NTH_PI= 0
##$NZP= 0
##$OFFSET= 14.96077
##$PC= 1
##$PHC0= -80.4364
##$PHC1= 0
##$PH_mod= 1
##$PKNL= yes
##$PPARMOD= 0
##$PPDIAG= 0
##$PPIPTYP= 0
##$PPMPNUM= 2147483647
##$PPRESOL= 1
##$PSCAL= 4
##$PSIGN= 0
##$PYNMP= <proc.py>
##$REVERSE= no
##$SF= 400.020009729376
##$SI= 131072
##$SIGF1= 0
##$SIGF2= 0
##$SINO= 400
##$SIOLD= 131072
##$SPECTYP= <>
##$SREGLST= <1H.CDCl3>
##$SSB= 0
##$STSI= 131072
##$STSR= 0
##$SW_p= 8223.68421052631
##$SYMM= 0
##$S_DEV= 0
##$TDeff= 65536
##$TDoff= 0
##$TI= <>
##$TILT= no
##$TM1= 0
##$TM2= 0
##$TOPLEV= 0
##$USERP1= <user>
##$USERP2= <user>
##$USERP3= <user>
##$USERP4= <user>
##$USERP5= <user>
##$WDW= 1
##$XDIM= 131072
##$YMAX_p= 436823881
##$YMIN_p= -13270
##$CURPLOT= <Network HP LaserJet P1505>
##$CURPRIN= <$Network HP LaserJet P1505>
##$DFORMAT= <normdp>
##$LAYOUT= <+/1D_H.xwp>
##$LFORMAT= <normlp>
##$PFORMAT= <normpl>
##$SURQMSG= 1
$$ End of Bruker specific parameters
$$ ---------------------------------
##NTUPLES= NMR SPECTRUM
##VAR_NAME=  FREQUENCY,     SPECTRUM/REAL,   SPECTRUM/IMAG
##SYMBOL=    X,             R,               I
##VAR_TYPE=  INDEPENDENT,   DEPENDENT,       DEPENDENT
##VAR_FORM=  AFFN,          ASDF,            ASDF
##VAR_DIM=   131072,        131072,          131072
##UNITS=     HZ,            ARBITRARY UNITS, ARBITRARY UNITS
##FACTOR=    0.0627417313425164, 1,          1
##FIRST=     8223.62146879497, 456,          -60776
##LAST=      0,             2023,            -60908
##MIN=       0,             -13270,          0
##MAX=       8223.62146879497, 436823881,    0
$$ Real data points
##PAGE= N=1
##DATA TABLE= (X++(R..R)), XYDATA
$$ [...]
64008B70709l366k645k327k161j726j199j228j851k132j274L65J716K110J680
$$ 270709 267343 264698 262371 260210 258484 257285 256057 254206 252074 250800 251165 252881 254991 256671
63994B56671R95O50R45J613K028J974J954K512L512M395M876M911M372L420K982
$$ 256671 257666 258316 259261 260874 262902 264876 266830 269342 272854 277249 282125 287036 291408 294828 297810
63979B97810L950N845P085O927O421O918Q283R297R370R109R294J0132J1444J2928
$$ 297810 301760 307605 314690 321617 328038 334956 343239 352536 361906 371015 380309 390441 401885 414813
63965D14813J4064J4430J4331J4683J5975J7859J9929K2381K5493K9014L2682
$$ 414813 428877 443307 457638 472321 488296 506155 526084 548465 573958 602972 635654
63954F35654L6969M2706N0049N8395O7267P6763Q7203R8782J11594J25412J39311
$$ 635654 672623 715329 765378 823773 891040 967803 1055006 1153788 1265382 1390794 1530105
63943A530105J51979J62677J71618J79146J84868J87790J87090J82511J74177
$$ 1530105 1682084 1844761 2016379 2195525 2380393 2568183 2755273 2937784 3111961
63934C111961J62192J46368J26420J02702P6714N0361K4493j518k8504n6165q3173
$$ 3111961 3274153 3420521 3546941 3649643 3726357 3776718 3801211 3799693 3771189 3715024 3631851
63923C631851j08094j29831j47534j60854j70173j76100j78707j77721j73364
$$ 3631851 3523757 3393926 3246392 3085538 2915365 2739265 2560558 2382837 2209473
63914B209473j66507j57875j47540j35454j22176j08846r6540q5738p6242o7552
$$ 2209473 2042966 1885091 1737551 1602097 1479921 1371075 1274535 1188797 1112555 1045003
63904A045003n9438n2173m6029m0716l5627l0748k6760k4102k2287k0481j8513
$$ 1045003 985565 933392 887363 846647 811020 780272 753512 729410 707123 686642 668129
63893F68129j6872j5818j4992j3969j2792j1776j0981j0158r090p712n934l695
$$ 668129 651257 635439 620447 606478 593686 581910 570929 560771 551681 543969 538035 534340
63881E34340j240Q89K432L768N477P643R854J1839J3656J5347J6805J8132J9612
$$ 534340 533100 533989 536421 540189 545666 553309 563163 575002 588658 604005 620810 638942 658554
63868F58554K1158K2174K2317K1963K1546K0849J9501J7790J6280J4773J2485
$$ 658554 679712 701886 724203 746166 767712 788561 808062 825852 842132 856905 869390
63857H69390R313O117L508J019k070n654r008j1761j4100j6181j7912j9315k0733
$$ 869390 878703 884820 888328 889347 887277 881623 872615 860854 846754 830573 812661 793346 772613
63844G72613k2446k4232k5505k5958k5994k6317k6920k6876k5449k3202k1446
$$ 772613 750167 725935 700430 674472 648478 622161 595241 568365 542916 519714 498268
63833D98268k0649k0069j8996j7664j6556j5536j4225j2793j1775j1342j1237
$$ 498268 477619 457550 438554 420890 404334 388798 374573 361780 350005 338663 327426
63822C27426j1229j1164j0746r767q406o971n501m100l301l510m146m054k863
$$ 327426 316197 305033 294287 284520 276114 269143 263642 259542 256241 252731 248585 244531 241668
63809B41668j421p84j206k208l139l547l426l238l393l633l336k532k024k292
$$ 241668 240247 239463 238257 236049 232910 229363 225937 222699 219306 215673 212337 209805 207781 205489
63795B05489k778k627j733o84nJ48j98q49j416j601j513j408j271r45m56L1N04
$$ 205489 202711 200084 198351 197667 197662 197810 197612 196763 195347 193746 192233 190825 189554 188609 188153 188184 188688
63778A88688R81J234J016M63m8m17p62r27n51K57Q10O64J80m1J2j14n63r46q88
$$ 188688 189669 190903 191919 192382 192334 191917 191155 190228 189677 189934 190744 191408 191588 191547 191559 191445 190882 189936 189048
63759A89048m58NK68L10K50K34L26M47N01M65L69K04k3k22k72k0P35K001L212
$$ 189048 188590 188595 188863 189173 189423 189657 189983 190430 190931 191396 191765 191969 191946 191724 191452 191432 192167 194168 197380
63740A97380L471K609J627J586K226K375J638Q54P34R24Q81R14J608K712L426
$$ 197380 200851 203460 205087 206673 208899 211274 212912 213766 214500 215424 216305 217219 218827 221539 224965
63725B24965L524L457L521L618L730L975M199M140L944L869L561K359L63j535
$$ 224965 228489 231946 235467 239085 242815 246790 250989 255129 259073 262942 266503 268862 269225 267690
63711B67690k804l694m353m416l840l273l098k775j771n23J47R6k37n18n34j6
$$ 267690 264886 261192 256839 252423 248583 245310 242212 239437 237666 237143 237290 237386 237149 236631 236097 236081
63695B36081R43J681J869K068K785L441L272K734K906L701L911L122K348K399
$$ 236081 237024 238705 240574 242642 245427 248868 252140 254874 257780 261481 265392 268514 270862 273261
63681B73261K686K254J159J95k34k70q7K02L54K32Q5K21N59P93Q66R62J135J247
$$ 273261 275947 278201 279360 279555 279321 279051 278964 279166 279520 279752 279837 280058 280617 281410 282276 283238 284373 285620
63663B85620J153P65K7r37j789k279k537k928l574m213m533m575m678m951m953
$$ 285620 286773 287538 287565 286628 284839 282560 280023 277095 273521 269308 264775 260200 255522 250571 245618
63648B45618m145k693j491j168j337j153l13Q61J995K862L180K858K405K424K773
$$ 245618 241473 238780 237289 236121 234784 233631 233318 234179 236174 239036 242216 245074 247479 249903 252676
63633B52676K774K368K400L459M973N879N867N624O023P270Q774R832J0448J1247
$$ 252676 255450 257818 260218 263677 268650 274529 280396 286020 292043 299313 308087 317919 328367 339614
63619C39614J2419J3272J3423J3883J5955J9203K1735K2723K3430K5213K7577
$$ 339614 352033 365305 378728 392611 408566 427769 449504 472227 495657 520870 548447
63608E48447K9104K9383K8980K8001K5749K1799J6561J0797N156J69l783o509
$$ 548447 577551 606934 635914 663915 689664 711463 728024 738821 743977 744146 740363 733854
63596G33854p793p438n889m424m191n283p190r788j3192j6892j9850k1550k2368
$$ 733854 726061 718623 712734 708310 704119 698836 691646 681858 668666 651774 631924 610374 588006
63583E88006k2805k2850k2165k0542j8078j5285j2894j1256r939q365o608n152
$$ 588006 565201 542351 520186 499644 481566 466281 453387 442131 432192 423827 417219 412067
63571D12067l961k474n37J320K740M107N917Q001R730J0765J1221J1323J1211
$$ 412067 408106 405632 405095 406415 409155 413262 419179 427180 436910 447675 458896 470219 481430
63558D81430J1142J1529J2672J4410J6222J7763J9334K1675K5207K9608L4063
$$ 481430 492572 504101 516773 531183 547405 565168 584502 606177 631384 660992 695055
63547F95055L7683L9491L8394L3635K5458J5238M978l462r061j1958j3000j2862
$$ 695055 732738 772229 810623 844258 869716 884954 889932 886470 877409 865451 852451 839589
63535H39589j1668r452o703m299l094l604n717q717j1919j5420j9640k4139k7536
$$ 839589 827921 818469 811766 807467 804373 800769 795052 786335 774416 758996 739356 715217 687681
63522F87681k9042k9337k9444k9344k8351k6358k3978k1812k0193j9220j8404
$$ 687681 658639 629302 599858 570514 542163 515805 491827 470015 449822 430602 412198
63511D12198j6751j4008j1389j0174r973r363p984o777o217n615m437l191k514
$$ 412198 395447 381439 370050 359876 349903 340540 332556 325779 319562 313947 309510 306319 303805
63498C03805k243j882j316o26J34O22L32o00j249j013l63p7k36l11J32J143K454
$$ 303805 301562 299680 298364 297738 297872 298494 298826 298226 296977 295964 295601 295524 295288 294977 295109 296252 298706
63481B98706L485L748L413L202L472L855L898L556K914J970R21J02o31j822l456
$$ 298706 302191 305939 309352 312554 316026 319881 323779 327335 330249 332219 333140 333242 332611 330789 327333
63466C27333m689m925m601m416m409m229l828l370k848k277j822j344l18J231
$$ 327333 322644 317719 313118 308702 304293 300064 296236 292866 290018 287741 285919 284575 284257 285488
63452B85488K319K213J662K060L613N160N842O117O977Q743J0977J3228J5494
$$ 285488 287807 290020 291682 293742 297355 302515 308357 314474 321451 330194 341171 354399 369893
63439C69893J8038K0986K4210K7465L0314L1784L0527K5962J9204J2326O662K408
$$ 369893 387931 408917 433127 460592 490906 522690 553217 579179 598383 610709 617371 619779
63427F19779k97q64P75L711P134J1160J5962K0776K4675K7787L0834L3698L5272
$$ 619779 619482 618618 619393 623104 630238 641398 657360 678136 702811 730598 761432 795130 830402
63414H30402L4659L1734K6691J9811J1862M124k231o589q866r409q853p802o766
$$ 830402 865061 896795 923486 943297 955159 959283 957052 950463 941597 932188 923335 915533 908767
63401I08767o431p570j0287j3825j7577k1791k6656l1106l3453l3147l1220k9080
$$ 908767 902336 894766 884479 870654 853077 831286 804630 773524 740071 706924 675704 646624
63389F46624k7400k6108k4741k2816k0316j7871j6076j4706j3050j0796q138n299
$$ 646624 619224 593116 568375 545559 525243 507372 491296 476590 463540 452744 444606 439307
63377D39307k560m82O34J395K681M504O137P342Q610J0265J2037J3763J5734J8139
$$ 439307 436747 436265 436899 438294 440975 445479 451616 458958 467568 477833 489870 503633 519367 537506
63363E37506K0675K2908K4681K6123K7654K9819L2544L4732L5288L4286L2374
$$ 537506 558181 581089 605770 631893 659547 689366 721910 756642 791930 826216 858590
63352H58590K9338K4368J7688J0725M451j248o229r449j0315r690q788p995p500
$$ 858590 887928 912296 929984 940709 945160 943912 937683 928234 917919 908229 899441 891446 883946
63339H83946q188j0810j4739j8614k1842k4719k7359k9405l0585l0757k9529k6636
$$ 883946 875758 864948 850209 831595 809753 785034 757675 728270 697685 666928 637399 610763
63327F10763k2686j8894j5891j3186r873n675j488Q57k42m692j0524j5434j8359
$$ 610763 588077 569183 553292 540106 530233 524558 523070 523927 523685 518993 508469 493035 474676
63314D74676j9346j8605j6529j4160j2617j1933j1179r832q368p349o647n799
$$ 474676 455330 436725 420196 406036 393419 381486 370307 360475 352107 344758 338111 332312
63302C32312m699l603k870k858l665m712m980m035k549j549j354j562j809k112
$$ 332312 327613 324010 321140 318282 314617 309905 304925 300890 298341 296792 295438 293876 292067 289955
63288B89955k413k332j588n59m6m34j257j746j716j603j701j666j024M0P28M41
$$ 289955 287542 285210 283622 283063 283017 282583 281326 279580 277864 276261 274560 272894 271870 271910 272638 273079
63272B73079o07j605j820j072K86J667K548K641K024J226R79J588K507K848K353
$$ 273079 272472 270867 269047 267975 268261 269928 272476 275117 277141 278367 279346 280934 283441 286289 288642
63257B88642J683J657K413L399L951L830L329L064L467M453N605O628P454Q065
$$ 288642 290325 291982 294395 297794 301745 305575 308904 311968 315435 319888 325493 332121 339575 347640
63243C47640Q572R386J0824J2484J3598J4097J4766J6090J7526J8373J8801J9521
$$ 347640 356212 365598 376422 388906 402504 416601 431367 447457 464983 483356 502157 521678
63231E21678K0734K2010K2942K3443K3520K3266K2956K2721K2349K1717K1216
$$ 521678 542412 564422 587364 610807 634327 657593 680549 703270 725619 747336 768552
63220G68552K1317K1913K2517K2892K2984K2496K1148J9133J6653J3177P984J432
$$ 768552 789869 811782 834299 857191 880175 902671 923819 942952 959605 972782 980766 982198
63208I82198n114j0740j5653k0238k4283k7496l0040l1947l2612l1492k8940k5830
$$ 982198 977084 966344 950691 930453 906170 878674 848634 816687 784075 752583 723643 697813
63196F97813k2582j9136j5584j2223r123o116l217n63J950M609P428J0141J2597
$$ 697813 675231 656095 640511 628288 619165 613049 609832 609269 611219 615828 623256 633397 645994
63183F45994J4746J6322J7059J7313J7914J9148K0249K0327J9525J8874J9134
$$ 645994 660740 677062 694121 711434 729348 748496 768745 789072 808597 827471 846605
63172H46605K0043K0713K0391J8866J6396J3392J0144O719L121o88m905r860j5559
$$ 846605 866648 887361 907752 926618 943014 956406 966550 973269 976390 975702 970797 960937 945378
63159I45378k1355k6363l0132l2741l4294l4756l4270l3203l1698k9632k7169
$$ 945378 924023 897660 867528 834787 800493 765737 731467 698264 666566 636934 609765
63148F09765k4915k3160k1371j8984j6321j4226j2937j1919j0717r333p833o183
$$ 609765 584850 561690 540319 521335 505014 490788 477851 465932 455215 445882 438049 431866
63136D31866m630l678l449l513l446l135k501j536p03o27j145j235l07J064K064
$$ 431866 427236 423558 420109 416596 413150 410015 407514 405978 405275 404648 403503 402268 401961 403025 405089
63121D05089K663L214L593L443K897K403K157K208K743L637M088L506K447J965
$$ 405089 407752 410966 414559 418002 420899 423302 425459 427667 430410 434047 438135 441641 444088 446053
63107D46053K163K243J825J316R72M89k18o68n47j60J54N24J096J578J615J282
$$ 446053 448216 450459 452284 453600 454572 455061 454843 454175 453628 453468 453622 454146 455242 456820 458435 459717
63091D59717R14P59R12J327J691J665J332J112J196J460J946K882M121N081N443
$$ 459717 460631 461390 462302 463629 465320 466985 468317 469429 470625 472085 474031 476913 481034 486115 491558
63076D91558N453N406N384N637O530P879Q936R452J0077J1260J2440J2943J3113
$$ 491558 497011 502417 507801 513438 519968 527847 536783 546235 556312 567572 580012 592955 606068
63063F06068J3843J5344J7122J8898K0819K2914K5103K7641L0975L4979L8911
$$ 606068 619911 635255 652377 671275 692094 715008 740111 767752 798727 833706 872617
63052H72617M2164M4726M6889M8862N0724N2424N3786N4620N4764N4006N2355
$$ 872617 914781 959507 1006396 1055258 1105982 1158406 1212192 1266812 1321576 1375582 1427937
63041A427937N0624N0159N1389N3076N3663N3119N2656N2822N2778N1392M8178
$$ 1427937 1478561 1528720 1580109 1633185 1686848 1739967 1792623 1845445 1898223 1949615 1997793
63030A997793M3020L5870K7068J7204O388n674j8549l0838m1526n0851n9159o5684
$$ 1997793 2040813 2076683 2103751 2120955 2127343 2121669 2103120 2072282 2030756 1979905 1920746 1855062
63018A855062o9320p0175o9342o7363o3820n8528n2169m5566l8910l2070k5091
$$ 1855062 1785742 1715567 1646225 1578862 1515042 1456514 1404345 1358779 1319869 1287799 1262708
63007A262708j8089j1040l997K758Q984J4626J9576K3629K6873K9743L2447L4663
$$ 1262708 1244619 1233579 1229582 1232340 1241324 1255950 1275526 1299155 1326028 1355771 1388218 1422881
62995A422881L6094L6909L7348L7267L6585L5845L5641L5623L4644L2025K8089
$$ 1422881 1458975 1495884 1533232 1570499 1607084 1642929 1678570 1714193 1748837 1780862 1808951
62984A808951K3443J8222J2175M991l636j3704k4419l4478m3142n0663n7304o2562
$$ 1808951 1832394 1850616 1862791 1867782 1864146 1850442 1826023 1791545 1748403 1697740 1640436 1577874
62972A577874o5806o7224o7472o6701o4636o1366n7400n3048m8486m4262m0891
$$ 1577874 1512068 1444844 1377372 1310671 1246035 1184669 1127269 1074221 1025735 981473 940582
62961I40582l7945l4462l0465k7162k5283k4044k2388k0476j9172j8586j7998
$$ 940582 902637 868175 837710 810548 785265 761221 738833 718357 699185 680599 662601
62950F62601j6980j5796j4808j4093j3649j3388j2959j2086j1031j0334j0088
$$ 662601 645621 629825 615017 600924 587275 573887 560928 548842 537811 527477 517389
62939E17389r954r709r342q704p671o602n989n660m993m024l503l707l910l479
$$ 517389 507435 497726 488384 479680 472009 465407 459418 453758 448765 444741 441238 437531 433621 430142
62925D30142k765k365k093j431n48r4j42j61O9J24l83j304k253k862k712j607
$$ 430142 427377 425012 422919 421488 420940 420846 420704 420543 420612 420736 420353 419049 416796 413934 411222 409615
62909D09615j32N86O0j026j758k038k276k481k314j900j862k384k876k787k284
$$ 409615 409483 410069 410129 409103 407345 405307 403031 400550 398236 396336 394474 392090 389214 386427 384143
62894C84143j790j286n74R4K56L4N3M93P49L33l63n83j88K91M52L65K04J5o1K61
$$ 384143 382353 381067 380493 380587 380843 380877 380930 381423 382172 382505 382142 381559 381371 381662 382114 382479 382683 382698 382637 382898
62874C82898R71J506J341O43J15J28L12Q3o11j302j615j614j476j134m72L58J028
$$ 382898 383869 385375 386716 387359 387474 387602 387914 387997 387386 386084 384469 382855 381379 380245 379773 380131 381159
62857C81159J399J461J123M31k4M61J675K428J950R09M93Q12R42L94k59l79j45
$$ 381159 382558 384019 385142 385573 385549 386010 387685 390113 392063 392972 393465 394277 395219 395613 395354 394975 394830
62840C94830p7k25l17l50n32p44n92J0O54Q95P21M39K41M6k63n27l78L07J190
$$ 394830 394753 394528 394211 393861 393329 392585 391993 392003 392657 393552 394273 394712 394953 394999 394736 394209 393831 394138 395328
62821C95328J827K186K527K884L007K866K801K970L070K916K989L931N586O960
$$ 395328 397155 399341 401868 404752 407759 410625 413426 416396 419466 422382 425371 429302 434888 441848
62807D41848P217O467N564N311N931P081Q234R104R758J0391J1143J2125J3407
$$ 441848 449065 455532 461096 466407 472338 479419 487653 496757 506515 516906 528049 540174 553581
62794E53581J4835J6071J7087J8423K0703K3974K7784L1774L5887M0044M4137
$$ 553581 568416 584487 601574 619997 640700 664674 692458 724232 760119 800163 844300
62783H44300M8393N3369N9270O5533P1369P6626Q1759Q6842R0871R2355R0687
$$ 844300 892693 946062 1005332 1070865 1142234 1218860 1300619 1387461 1478332 1570687 1661374
62772A661374Q6716Q1586P5163O6123N3766L9164K3996Q720p243k3671l8898n1355
$$ 1661374 1748090 1829676 1904839 1970962 2024728 2063892 2087888 2096608 2089365 2065694 2026796 1975441
62760A975441o1037o8861p5165p9552q1869q2565q2083q0489p7783p4168o9890
$$ 1975441 1914404 1845543 1770378 1690826 1608957 1526392 1444309 1363820 1286037 1211869 1141979
62749A141979o5263o0827n6975n3293m8801m3256l7781l3706l0996k8431k5257
$$ 1141979 1076716 1015889 958914 905621 856820 813564 775783 742077 711081 682650 657393
62738F57393k2094j9911j8620j7194j5000j2518j0558r252q111o837n559m323
$$ 657393 635299 615388 596768 579574 564574 552056 541498 532246 524135 517298 511739 507416
62726E07416k877j205J37O28N62P82J682K871L827M551N451O891R006J1623J4237
$$ 507416 504539 503334 503471 504099 504661 505443 507125 509996 513823 518374 523825 530716 539722 551345 565582
62711E65582J6326J7986J9946K2725K5945K8902L1554L4530L8248M2520M7057
$$ 565582 581908 599894 619840 642565 668510 697412 728966 763496 801744 844264 891321
62700H91321N1844N6888O1992O6968P1685P5687P8172P8737P7718P5422P1299
$$ 891321 943165 1000053 1062045 1129013 1200698 1276385 1354557 1433294 1511012 1586434 1657733
62689A657733O4506N5091M3990L1847J8547M090j0770k5102l8500n0698o0920
$$ 1657733 1722239 1777330 1821320 1853167 1871714 1875804 1865034 1839932 1801432 1750734 1689814
62678A689814o8340p3052p5963p7619p7681p5721p2145o8002o4044o0245n6140
$$ 1689814 1621474 1548422 1472459 1394840 1317159 1241438 1169293 1101291 1037247 977002 920862
62667I20862n1467m6558m2151l8719l5935l2967k9394k5688k2678k0594j8887
$$ 920862 869395 822837 780686 741967 706032 673065 643671 617983 595305 574711 555824
62656E55824j6925j4702j2798j1665j1099j0515r689q989q767q756q378p481o433
$$ 555824 538899 524197 511399 499734 488635 478120 468431 459442 450675 441919 433541 426060 419627
62643D19627n496m599l749l180k879k387j458n59l51q02j311j475j360j085o37
$$ 419627 414131 409532 405783 402603 399724 397337 395879 395320 394969 394167 392856 391381 390021 388936 388299
62628C88299p9M19P95J013Q36J63m82l10P21J756K145K235K686L440L871L844
$$ 388299 388220 388639 389434 390447 391283 391446 390964 390654 391375 393131 395276 397511 400197 403637 407508 411352
62612D11352M014M998O560P797Q039P491P073P629R218J1219J3109J4973J7260
$$ 411352 415366 420364 426924 434721 442760 450251 457324 464953 474171 485390 498499 513472 530732
62599E30732K0176K3508K6939L0345L3768L7127M0000M1829M2459M2372M2113
$$ 530732 550908 574416 601355 631700 665468 702595 742595 784424 826883 869255 911368
62588I11368M1493L9654L5925L0278K3025J4559N540l149j0978j8000k4297k9592
$$ 911368 952861 992515 1028440 1058718 1081743 1096302 1101842 1098693 1087715 1069715 1045418 1015826
62576A015826l3719l6983l9596m1161m1256m0150l8432l6264l3618l0990k9025
$$ 1015826 982107 945124 905528 864367 823111 782961 744529 708265 674647 643657 614632
62565F14632k7494k5462k2555j9452j6952j5180j3870j2732j1419r709q093p468
$$ 614632 587138 561676 539121 519669 502717 487537 473667 460935 449516 439807 431714 424246
62553D24246p902q200p230n289l674l172l398l441k740j438j55N89Q16Q65Q16
$$ 424246 416344 408144 400914 395625 391951 388779 385381 381940 379200 377762 377607 378196 379012 379877 380693
62538C80693N39K74N51J346J928J861J619J807K387L139M287O030P854R071R779
$$ 380693 381232 381506 382057 383403 385331 387192 388811 390618 393005 396144 400431 406461 414315 423386 433165
62523D33165J0659J2080J4065J6765K0216K3760K6609K8940L1634L4891L7873
$$ 433165 443824 455904 469969 486734 506950 530710 557319 586259 617893 652784 690657
62512F90657L9879M1097M1995M2604M2584M1442L8570L3680K7368K0648J3780
$$ 690657 730536 771633 813628 856232 898816 940258 978828 1012508 1039876 1060524 1074304
62501A074304O256j885r543j5786k0881k5539k9761l2942l4642l4760l3411l1186
$$ 1074304 1080560 1078675 1069132 1053346 1032465 1006926 977165 944223 909581 874821 841410 810224
62489H10224k8935k6792k3885j9669j5049j1380q761o198l143K9K899N377P150
$$ 810224 781289 754497 730612 710943 695894 684514 675753 669555 666412 666441 669340 674717 681867
62476F81867P710P188O312N334L713J198j574l962o187q753j1506j3896j5775
$$ 681867 689577 696765 703077 708411 712124 713322 711748 707786 701599 692846 681340 667444 651669
62463F51669j7397j8821j9840k0350k0371j9833j8679j7091j5267j3149j0690
$$ 651669 634272 615451 595611 575261 554890 535057 516378 499287 484020 470871 460181
62452D60181q300o593n745n377n020m468l718k905k202j526m53J221K906L740
$$ 460181 451881 445288 439543 434166 429146 424678 420960 418055 415853 414327 413874 415095 418001 421741
62438D21741L685L626M213N025N142M289L038K060J402N11j165l528n792p221
$$ 421741 425426 429052 433265 438290 443432 447721 450759 452819 454221 454732 453567 450039 444247 437026
62424D37026p875q356q875q977q370p501o946o585n914m935m245m213m537m688
$$ 437026 429151 420795 411920 402943 394573 387072 380126 373541 367627 362692 358447 354234 349697 345009
62410C45009m370l570k505j598j200j162j018o42l65l98n17m55k19K15J013K056
$$ 345009 340639 337069 334564 332966 331766 330604 329586 328944 328579 328181 327664 327209 326990 327205 328218 330274
62394C30274K792K929K849K934K862K189J299J025J458J891J995K308L257M406
$$ 330274 333066 335995 338844 341778 344640 346829 348128 349153 350611 352502 354497 356805 360062 364468
62380C64468N050N071M826M596M617N248O613Q222R427J0117J0637J1241J2059
$$ 364468 369518 374589 379415 384011 388628 393876 400489 408711 418138 428255 438892 450133 462192
62367D62192J3352J5277J7448J9268K0761K2571K5114K8182L1583L5530M0099
$$ 462192 475544 490821 508269 527537 548298 570869 595983 624165 655748 691278 731377
62356G31377M4722M8679N1777N4081N5141N4016N0144M3836L5931K7298J8717
$$ 731377 776099 824778 876555 930636 985777 1039793 1089937 1133773 1169704 1197002 1215719
62345A215719J0797L725k752q898j4647j9803k4434k8837l3112l6881l9505m0521
$$ 1215719 1226516 1230241 1227489 1218591 1203944 1184141 1159707 1130870 1097758 1060877 1021372 980851
62333I80851l9953l8264l5959l3296l0346k7287k4402k1792j9300j6895j4904
$$ 980851 940898 902634 866675 833379 803033 775746 751344 729552 710252 693357 678453
62322F78453j3696j3288j3453j4085j5063j5982j6376j6304j6209j6112j5393
$$ 678453 664757 651469 638016 623931 608868 592886 576510 560206 543997 527885 512492
62311E12492j3707j1760j0645j0557j0666j0216r250q123o833n217l638k889l267
$$ 512492 498785 487025 476380 465823 455157 444941 435691 427568 420735 415518 411880 408991 405724
62298D05724m028m054k987j523n13j39o0j19m21q36r20n01P3N18J100K160L396
$$ 405724 401696 397642 394655 393132 392619 392480 392420 392301 391880 391044 390124 389623 389696 390214 391314 393474 396870
62281C96870M205M510M792N273N623N617N569N877O492P112P634Q168Q837R815
$$ 396870 401075 405585 410377 415650 421273 426890 432459 438336 444828 451940 459574 467742 476579 486394
62267D86394J1365J3554J6019J8369K0658K3287K6440K9952L3686L7810M2550
$$ 486394 497759 511313 527332 545701 566359 589646 616086 646038 679724 717534 760084
62256G60084M7795N3068N7775O1425O3601O3829O1624N6773M9581M0725L0965
$$ 760084 807879 860947 918722 980147 1043748 1107577 1169201 1225974 1275555 1316280 1347245
62245A347245K1080J1905M038k723r320j6655k4821l3252m1276m8354n3937n7519
$$ 1347245 1368325 1380230 1384268 1381545 1372225 1355570 1330749 1297497 1256221 1207867 1153930 1096411
62233A096411n8944n8497n6647n3822n0400m6725m2942l8859l4178k9040k4373
$$ 1096411 1037467 978970 922323 868501 818101 771376 728434 689575 655397 626357 601984
62222F01984k1371k0306j9974j8720j6070j3038j0793r460q444p397o427n644
$$ 601984 580613 560307 540333 521613 505543 492505 481712 472252 463808 456411 449984 444340
62210D44340n046m709m694m752m506l930l326k831k299j646j011m55K21J216K477
$$ 444340 439294 434585 429891 425139 420633 416703 413377 410546 408247 406601 405590 405135 405356 406572 409049
62195D09049L758M856N733O547P508Q572R412R811R959J0123J0220J0062R822
$$ 409049 412807 417663 423396 429943 437451 446023 455435 465246 475205 485328 495548 505610 515432
62182E15432R836R993R824R167Q326P544O788O149N982O481P546R186J1586J4603
$$ 515432 525268 535261 545085 554252 562578 570122 576910 583059 589041 595522 603068 612254 623840 638443
62168F38443J7764K1009K4891K9600L4308L7935M0163M1213M0991L9137L5620
$$ 638443 656207 677216 702107 731707 766015 803950 844113 885326 926317 965454 1001074
62157A001074L0637K4240J6772R481L737m42m390r030j3864j8012k1495k5015
$$ 1001074 1031711 1055951 1072723 1082204 1085941 1085499 1081109 1072079 1058215 1040203 1018708 993693
62145I93693k8752l1946l3510l2865l0387k7318k4887k3189k1188j7983j3851
$$ 993693 964941 932995 899485 866620 836233 808915 784028 760839 739651 721668 707817
62134G07817r793o554m318k948j972o71J203L046M200M944O002P323Q010P512
$$ 707817 698024 691470 687152 684204 682232 681561 682764 685810 690010 694954 700956 708279 716289 723801
62120G23801O057L977J441q64j750q06Q49J714J358L21j053k932n422q251j0940
$$ 723801 729858 733835 735276 734412 732662 731856 732705 734419 735777 736098 735045 732113 726691 718440 707500
62105G07500j2846j3364j2544j1301j0436r669q178n835l258q68J255K719L058
$$ 707500 694654 681290 668746 657445 647009 637340 629162 623327 620069 619201 620456 623175 626233
62092F26233K784L241M946O865P787P748P520P507P745Q383R336R921R729R568
$$ 626233 629017 632258 637204 644069 651856 659604 667124 674631 682376 690759 700095 710016 719745 729313
62078G29313J0644J3016J5615J7733J9552K1206K2293K2555K2371K2120K1728
$$ 729313 739957 752973 768588 786321 805873 827079 849372 871927 894298 916418 938146
62067I38146K1186K1033K1799K3343K5063K6499K7405K7515K6553K4348K0737
$$ 938146 959332 980365 1002164 1025507 1050570 1077069 1104474 1131989 1158542 1182890 1203627
62056A203627J5745J0048M866R22k233n537r289j3091j6724k0491k4646k8906
$$ 1203627 1219372 1229420 1234286 1235208 1232975 1227438 1218149 1205058 1188334 1167843 1143197 1114291
62044A114291l2629l5282l6726l7218l7192l6832l5901l4183l2010l0095k8773
$$ 1114291 1081662 1046380 1009654 972436 935244 898412 862511 828328 796318 766223 737450
62033G37450k7713k6396k4655k2645k0522j8378j6277j4212j2076r925q188p385
$$ 737450 709737 683341 658686 636041 615519 597141 580864 566652 554576 544651 536463 529078
62021E29078p539q091q495q769r246r871j0078r431q224p197o756o596o043m660
$$ 529078 521539 513448 504953 496184 486938 477067 466989 457558 449334 442137 435381 428785 422742 418082
62007D18082k625o01Q09J638K435L478M333M501M225M238M725N072M709L704K377
$$ 418082 415457 414856 415665 417303 419738 423216 427549 432050 436275 440513 445238 450310 455019 458723 461100
61992D61100Q22q51k213k940l309l898m873n923o735p224p413p374p253p116o795
$$ 461100 461922 461071 458858 455918 452609 448711 443838 437915 431180 423956 416543 409169 401916 394800 388005
61977C88005o144n325m609m005l433l094l259l690l774l281k651k337k232j971
$$ 388005 381861 376536 371927 367922 364489 361395 358136 354446 350672 347391 344740 342403 340171 338200
61963C38200j502j047p41n40m16l54k05L00J266K447L388L858M107M629N509O271
$$ 338200 336698 335651 334910 334370 333954 333600 333395 333695 334961 337408 340796 344654 348761 353390 358899 365170
61947C65170O542O778P863R984J2285J3803J4476J5012J6013J7484J8974J9921
$$ 365170 371712 378490 386353 396337 408622 422425 436901 451913 467926 485410 504384 524305
61935E24305K0070J9773J9743K0257K0733K0381J9073J7274J5277J2967J0274
$$ 524305 544375 564148 583891 604148 624881 645262 664335 681609 696886 709853 720127
61924G20127P416M577J794p58k852m689o786r008j0227r466p109m419k019M39
$$ 720127 727543 732120 733914 733156 730304 725615 718829 709821 699594 690128 683019 678600 676581 677020
61910F77020L226N892Q029R980J2233J4449J5736J5746J4961J3690J1400P451
$$ 677020 680246 686138 694167 704147 716380 730829 746565 762311 777272 790962 802362 809813
61898H09813K273k686o379r111j1833j4771j7229j8744j9729k0616k0913j9864
$$ 809813 812086 809400 803021 793910 782077 767306 750077 731333 711604 690988 670075 650211
61886F50211j7827j6131j5453j5065j4080j2699j1716j1331j1096j0813j0714
$$ 650211 632384 616253 600800 585735 571655 558956 547240 535909 524813 514000 503286
61875E03286j0860j0946j0697r994q684o730m571k844j700q55j58M02J212K776
$$ 503286 492426 481480 470783 460789 452105 445375 440804 437960 436260 435405 435247 435649 436861 439637
61861D39637M838O485P433Q577J0812J3870J6842J9358K1637K3705K5272K6380
$$ 439637 444475 450960 458393 466970 477782 491652 508494 527852 549489 573194 598466 624846
61849F24846K7640K9622L2168L4316L4920L3569L0936K8000K4858K0855J5856
$$ 624846 652486 682108 714276 748592 783512 817081 848017 876017 900875 921730 937586
61838I37586J0626N611J87o038j1785j5032j5202j3543j1392r003o096k674J113
$$ 937586 948212 953823 954010 947972 936187 921155 905953 892410 881018 872015 865919 863245 864358
61825H64358N203R297J2771J5171J6403J6239J4194J0176M826j102p285j3552
$$ 864358 869561 878858 891629 906800 923203 939442 953636 963812 968638 967536 960251 946699
61813I46699j9456k4572k8798l2036l3964l4496l4104l3286l1969k9974k7707
$$ 946699 927243 902671 873873 841837 807873 773377 739273 705987 674018 644044 616337
61802F16337k5786k4140k2106j9458j6731j4440j2551j0883r570q735q081p251
$$ 616337 590551 566411 544305 524847 508116 493676 481125 470242 460672 451937 443856 436605
61790D36605o393n936n831n412m236k746j845j881k319k486k318k252k475k651
$$ 436605 430212 424276 418445 413033 408797 406051 404206 402325 400006 397520 395202 392950 390475 387824
61776C87824k360j633q42k74N1J70R8k7J04N91J002P23k30r52n36Q50K064K207
$$ 387824 385464 383831 382989 382715 382766 382936 383034 383007 383111 383702 384704 385427 385197 384245 383709 384559 386623 388830
61758C88830J504Q46Q37J370J919J988J484Q28N50O45N71P6m31n68n72p90j017
$$ 388830 390334 391180 392017 393387 395306 397294 398778 399606 400156 400801 401372 401448 401017 400449 399877 399087 398070
61741C98070r75j054j780k720k818j824n44M12J248K056K307J757J094J056J413
$$ 398070 397095 396041 394261 391541 388723 386899 386355 386767 388015 390071 392378 394135 395229 396285 397698
61726C97698J541J484J758K396K858K792K303J650J126J046J458J957K170K158
$$ 397698 399239 400723 402481 404877 407735 410527 412830 414480 415606 416652 418110 420067 422237 424395
61712D24395K058J731J221J012J243J036m61k730m391m931m926m688l823k406
$$ 424395 426453 428184 429405 430417 431660 432696 432235 429505 425114 420183 415257 410569 406746 404340
61698D04340j461j657k364k626k442k408k609k654k480k444k644k750k511k010
$$ 404340 402879 401222 398858 396232 393790 391382 388773 386119 383639 381195 378551 375801 373290 371280
61684C71280j440r64p24p62r10j073j388j895k207j911j249r24j174j392r00J66
$$ 371280 369840 368876 368152 367390 366480 365407 364019 362124 359917 358006 356757 355833 354659 353267 352367 352533
61668C52533R56Q05j39j156j704j849j999k289k377j873q63J52P45R09Q83Q23
$$ 352533 353489 354294 354155 352999 351295 349446 347447 345158 342781 340908 340045 340197 340942 341851 342734 343557
61652C43557P42P22J028J775K637L085L062L065L377L555L167K733L254M699N673
$$ 343557 344299 345021 346049 347824 350461 353546 356608 359673 363050 366605 369772 372505 375759 380458 386131
61637C86131N001L110J369L75m19j588k878l704l941l981m177m559m915m949m419
$$ 386131 391132 394242 395611 395986 395567 393979 391101 387397 383456 379475 375298 370739 365824 360875 356456
61622C56456l313j966q61k16J66N60Q14M81n11j522j825j476j196j469k097k723
$$ 356456 353143 351177 350316 350100 350266 350826 351640 352121 351610 350088 348263 346787 345591 344122 342025 339302
61606C39302l324l991m593m975n202n294m992m182l321l011l237l451l349l173
$$ 339302 335978 331987 327394 322419 317217 311923 306931 302749 299428 296417 293180 289729 286380 283207
61592B83207l163l149k810k143j506j379j971k862l111k168o73P4m08j259j474
$$ 283207 280044 276895 274085 271942 270436 269057 267086 264224 261113 258945 258272 258346 257938 256679 255205
61577B55205j157j160j726k111j585l87N19M73l16j071j159n64K55Q39J049R76
$$ 255205 254048 252888 251162 249051 247466 247079 247598 248071 247755 246684 245525 244961 245216 246055 247104 248080
61561B48080O79K04j98q9P34J846K436K066J112L66K56N65Q38Q85Q32Q97J221
$$ 248080 248759 248963 248765 248676 249410 251256 253692 255758 256870 257236 257492 258057 258895 259780 260612 261509 262730
61544B62730J731K085J933J334P62N31M24O6n28j007j079n87N62K074L062K699
$$ 262730 264461 266546 268479 269813 270575 271106 271530 271596 271068 270061 268982 268395 268957 271031 274093 276792
61528B76792J219j60n25j34R5l41j160j717j670j346j451k186k823k485j335l81
$$ 276792 278011 277851 277326 277192 277287 276946 275786 274069 272399 271053 269602 267416 264593 262108 260773 260392
61512B60392n2K42R33J423J053K73j3J64K2n84r31p28o55j181j617r64O91K178
$$ 260392 260340 260582 261515 262938 263991 264264 264251 264415 264437 263853 262922 262194 261539 260358 258741 257777 258468 260646
61494B60646K524J749N77k88n86m85k55K6M20P57O65J08l67k19M23R72J144J173
$$ 260646 263170 264919 265496 265208 264622 264137 263882 263908 264328 265085 265750 265858 265491 265272 265695 266667 267811 268984
61476B68984J270J273J000O08L69K27o0l73k01O65J647J924J371O49L53M23M85
$$ 268984 270254 271527 272527 273135 273504 273731 273671 273298 273097 273762 275409 277333 278704 279353 279706 280129 280614
61459B80614L95K17n5l11j86N26J367J648J308R47R56J103J055Q48O03K64l8J90
$$ 280614 281009 281226 281171 280860 280674 281200 282567 284215 285523 286470 287426 288529 289584 290432 291035 291299 291261 291451
61441B91451J174K297K666K187J639J692K185K494K290J790J416J361J483J530
$$ 291451 292625 294922 297588 299775 301414 303106 305291 307785 310075 311865 313281 314642 316125 317655
61427C17655J439J331J217Q89K45l92n35o9O56J313J921K548K869K377J121l6
$$ 317655 319094 320425 321642 322531 322776 322384 321849 321780 322436 323749 325670 328218 331087 333464 334585 334549
61411C34549k27L91P83L01n80j078j213j587k332k955l140l043k647j650k71N10
$$ 334549 334322 334713 335496 335797 335217 334139 332926 331339 329007 326052 322912 319869 317222 315572 315301 315811
61395C15811P4r79j652j756j712j562r19K12J233J683J603J252Q43N73N26N05
$$ 315811 315885 314906 313254 311498 309786 308224 307305 307517 308750 310433 312036 313288 314131 314704 315230 315735
61379C15735L22J52K79O19R25J260J776K163J964J386J126J397J699J650J394
$$ 315735 316057 316209 316488 317107 318032 319292 321068 323231 325195 326581 327707 329104 330803 332453 333847
61364C33847J091P74Q34J848L534M591M134K838K123K608L794M887N444N479N423
$$ 333847 334938 335712 336546 338394 341928 346519 350653 353491 355614 358222 362016 366903 372347 377826 383249
61349C83249N757O413O775O500N919N331M505L350K500K525L008L127K819K524
$$ 383249 389006 395419 402194 408694 414613 419944 424449 427799 430299 432824 435832 438959 441778 444302
61335D44302K106J044l26q59k14M00l23k221m003m706m321l366k412j884j800
$$ 444302 446408 447452 447126 446267 446053 446453 446130 443909 439906 435200 430879 427513 425101 423217 421417
61320D21417j646q87L43J288J397R10M81M15N49Q49J671L228N013O315P188Q329
$$ 421417 419771 418884 419227 420515 421912 422822 423303 423718 424267 425116 426787 430015 435028 441343 448531 456860
61304D56860R830J0698J0029Q221O434N264M538M032L691L191K126O70o02j623
$$ 456860 466690 477388 487417 495638 502072 507336 511874 515906 519597 522788 524914 525584 524982 523359
61290E23359k824m124m793m650m632n467o426o241m897l706l545l887l725k900
$$ 523359 520535 516411 511618 506968 502336 496869 490443 484202 479305 475599 472054 468167 464442 461542
61276D61542k002j388p99O4J032J677J860J821J855K058K375K723K926K809K527
$$ 461542 459540 458152 457353 457417 458449 460126 461986 463807 465662 467720 470095 472818 475744 478553 481080
61261D81080K597L387M646N818O656P240P480P058N955M699L882L617L551L267
$$ 481080 483677 487064 491710 497528 504184 511424 518904 525962 531917 536616 540498 544115 547666 550933
61247E50933K596J701Q69J43p89k127l508m366m632m725m890m984m972n058n222
$$ 550933 553529 555230 556099 556242 555453 553326 549818 545452 540820 536095 531205 526221 521249 516191 510969
61232E10969n099m569l994l584k970j813m47N40J098J635K317K874L051K932K806
$$ 510969 505870 501301 497307 493723 490753 488940 488493 489033 490131 491766 494083 496957 500008 502940 505746
61217E05746K905L247L637L929M307M998N695N723N001M305M153L964K971J569
$$ 505746 508651 511898 515535 519464 523771 528769 534464 540187 545188 549493 553646 557610 560581 562150
61203E62150R53J567K688L568M281N277O672Q325J0097J1681J2591J2601J1986
$$ 562150 563103 564670 567358 570926 575207 580484 587156 595481 605578 617259 629850 642451 654437
61190F54437J1100R891Q190O240M670L876L541K904J498l19j717k330k629l232
$$ 654437 665537 675428 683618 689858 694528 698404 701945 704849 706347 706028 704311 701981 699352 696120
61176F96120m130m909n471n997o349o169n639n476n962o553o801p103p997r154
$$ 696120 691990 687081 681610 675613 669264 663095 657456 651980 646018 639465 632664 625561 617564 608410
61162F08410r734r525r138r030q992q724q302p820o949n448l865l093l133k885
$$ 608410 598676 589151 580013 570983 561991 553267 544965 537145 530196 524748 520883 517790 514657 511772
61148E11772j612k04k96k177m358n447n753o417p555q162p647o461n134l653k135
$$ 511772 510160 509956 509660 507483 503125 497678 491925 485508 477953 469791 462144 455683 450549 446896 444761
61133D44761j221j128r86R4J726K809L136L587M729O164P397Q589J0030J1459
$$ 444761 443540 442412 441426 441520 443246 446055 449191 452778 457507 463671 471068 479657 489687 501146
61119E01146J2430J3025J3687J4530J5274J5847J6593J7769J9094J9929J9839
$$ 501146 513576 526601 540288 554818 570092 585939 602532 620301 639395 659324 679163
61108F79163J8850J7317J5689J4393J3689J3344J2519J0334O864L321R54k24j327
$$ 679163 698013 715330 731019 745412 759101 772445 784964 795298 802162 805483 806437 806213 804886
61095H04886l290n966q553j0492j1798j2798j3754j4593j4986j4803j4489j4600
$$ 804886 801596 795630 787077 776585 764787 751989 738235 723642 708656 693853 679364 664764
61083F64764j4887j4365j2592j0431r107q880r090r170q989q375p068n249l505
$$ 664764 649877 635512 622920 612489 603382 594502 585412 576242 567253 558878 551810 546561 543056
61070E43056k126r46J29R69J672K542L468L951M062M585N823O951P222P136P687
$$ 543056 540930 539984 540113 541082 542754 545296 548764 552715 556777 561362 567185 574136 581358 588494 596181
61055E96181Q898J0085J1138J2551J4209J5226J5192J4854J5286J6946J9634K2703
$$ 596181 605079 615164 626302 638853 653062 668288 683480 698334 713620 730566 750200 772903
61043G72903K5270K6836K7946K9607L1965L4248L6081L8020M0494M3169M5636
$$ 772903 798173 825009 852955 882562 914527 948775 984856 1022876 1063370 1106539 1152175
61032A152175M7926M9795N0561N0311N0469N2333N5885O0732O7310P6006Q5843
$$ 1152175 1200101 1249896 1300457 1350768 1401237 1453570 1509455 1570187 1637497 1713503 1799346
61021A799346R5412J04612J14433J25697J39398J57726J83125K16810K59915L15466
$$ 1799346 1894758 1999370 2113803 2239500 2378898 2536624 2719749 2936559 3196474 3511940
61011C511940L86788M74067N75168O90310Q23869R82359J174053J406405J667772
$$ 3511940 3898728 4372795 4947963 5638273 6462142 7444501 8618554 10024959 11692731
61002A1692731J898554J989449J836885J425100Q58815L08076q5961k62589k28727
$$ 11692731 13591285 15580734 17417619 18842719 19701534 20009610 19923649 19661060 19432333
60993A9432333l2036K37509M42229M37898J55170l48494r20275j401520j701336
$$ 19432333 19400297 19637806 20080035 20517933 20673103 20324609 19404334 18002814 16301478
60984A6301478j809862j767486j629711j446892j255377j075019r13050p71339
$$ 16301478 14491616 12724130 11094419 9647527 8392150 7317131 6404081 5632742
60976E632742o50462n49146m63908l91482l30724k81401k42153k10641j84956
$$ 5632742 4982280 4433134 3969226 3577744 3247020 2965619 2723466 2512825 2327869
60967B327869j63900j46308j30978j17238j04981r4082q4150p4813o6022n8039
$$ 2327869 2163969 2017661 1886683 1769445 1664464 1570382 1486232 1411419 1345397 1287358
60957A287358n1244m5913m2123l9877l9074l9164l9009l7620l5000l1947k9039
$$ 1287358 1236114 1190201 1148078 1108201 1069127 1029963 990954 953334 918334 886387 857348
60946H57348k6265k3579k1156j9012j6981j5260j4380j4329j4292j3625j2675
$$ 857348 831083 807504 786348 767336 750355 735095 720715 706386 692094 678469 665794
60935F65794j2206j2471j3198j4018j4487j4138j3043j1951j1363j0849r806q517
$$ 665794 653588 641117 627919 613901 599414 585276 572233 560282 548919 538070 528264 519747
60923E19747p745p541p262o597n826n129m370l618l136k766k057j115n98o09l84
$$ 519747 512002 504461 497199 490602 484776 479647 475277 471659 468523 465757 463700 462585 461987 461378 460994
60908D60994N40J516J694J191P43N84L81M0k1N22J458K200K203J354K43k00L13
$$ 460994 461534 463050 464744 465935 466678 467262 467643 467683 467662 468184 469642 471842 474045 475399 475642 475442 475755
60891D75755R33N87p73k198k911l001l009l366m281n697p145p975p984p558p037
$$ 475755 476688 477275 476502 474304 471393 468392 465383 462017 457736 452039 444894 436919 428935 421377 414340
60876D14340o284n127m034l744m277m668l992k477j257r93j148q46p7M04K65n4
$$ 414340 408056 402929 398895 395151 390874 386206 382214 379737 378480 377487 376339 375493 375416 375820 376085 376031
60860C76031j92m48j066j552j279m16M05J044J719K114J494r1j475j585m62J155
$$ 376031 375839 375391 374325 372773 371494 371078 371483 372527 374246 376360 377854 377763 376288 374703 374241 375396
60844C75396K639L580L638K938K187J900J732J056r8j181k011k808l435l319k377
$$ 375396 378035 381615 385253 388191 390378 392278 394010 395066 394968 393787 391776 388968 385533 382214 379837
60829C79837j493j552k300k553j577M6J066R06Q9n64q47j074j406j697j900k150
$$ 379837 378344 376792 374492 371939 370362 370408 371474 372380 372469 371905 371058 369984 368578 366881 364981 362831
60813C62831k419k503k491k771l366l744l544l083k793k621k417k448k956l530
$$ 362831 360412 357909 355418 352647 349281 345537 341993 338910 336117 333496 331079 328631 325675 322145
60799C22145l562l130k775k591k221j714j619k113k689k878k721k369j784j042
$$ 322145 318583 315453 312678 310087 307866 306152 304533 302420 299731 296853 294132 291763 289979 288937
60785B88937m27L3O09J258J498J191Q97J035J258J086P49Q20J338J894K347K857
$$ 288937 288510 288543 289152 290410 291908 293099 293996 295031 296289 297375 298124 298944 300282 302176 304523 307380
60769C07380L314L319K848K424K535L079L530L436K746J815J128Q57P45M44j52
$$ 307380 310694 314013 316861 319285 321820 324899 328429 331865 334611 336426 337554 338411 339156 339600 339448
60754C39448r68j834k357k058j007l4J93K8K82Q85R00k4r77j016n65r25k564m501
$$ 339448 338480 336646 334289 332231 331224 331190 331383 331411 331693 332578 333478 333454 332477 331461 330896 329971 327407 322906
60736C22906n456n118m154l394l278l802m542m787m090k839j952j816j878j462
$$ 322906 317450 312332 308178 304784 301506 297704 293162 288375 284285 281446 279494 277678 275800 274338
60722B74338p24l48n77j031j385j624j607r69K38J325J682J376Q41L40O2K87R96
$$ 274338 273614 273266 272689 271658 270273 268649 267042 266073 266311 267636 269318 270694 271535 271875 271937 272224 273220
60705B73220J628J686J458J638K347K953K840J978Q26m2k20K62R98J697K465L375
$$ 273220 274848 276534 277992 279630 281977 284930 287770 289748 290574 290532 290312 290574 291572 293269 295734 299109
60689B99109M049M064L557K998K543K036J560J383J454J424J207R94P69L01k87
$$ 299109 303158 307222 310779 313777 316320 318356 319916 321299 322753 324177 325384 326378 327147 327448 327161
60674C27161n57l92j65j35k74o93j638k833l524l446l176l166l053k400j503r22
$$ 327161 326604 326212 326047 325912 325638 324945 323307 320474 316950 313504 310328 307162 304109 301709 300206 299284
60658B99284o39l12O4L58P72J452J886J512P24N16J142J879K154K100J830J055
$$ 299284 298645 298333 298397 298755 299527 300979 302865 304377 305101 305617 306759 308638 310792 312892 314722 315777
60642C15777k35j378j880k144k764l530l825l677l660l777l255j671K55J443J636
$$ 315777 315542 314164 312284 310140 307376 303846 300021 296344 292684 288907 285652 283981 284236 285679 287315
60627B87315J390J158Q97N18K53L49P26J068J129Q03J21n83p69k97K08K8o15o99
$$ 287315 288705 289863 290760 291278 291531 291880 292606 293674 294803 295606 295727 295144 294375 294078 294286 294314 293699 293000
60609B93000K80J533J906J261M55J79L29N44P32Q13M61m20j219j111o1J087J544
$$ 293000 293280 294813 296719 297980 298435 298614 298943 299487 300219 301032 301493 301073 299854 298743 298682 299769 301313
60592C01313J297P66J58n24j067j048l21P21J443J465Q87K41J18P20J655K336
$$ 301313 302610 303376 303534 303010 301943 300895 300574 301295 302738 304203 305090 305331 305449 306169 307824 310160
60576C10160K520K439K403K531K860L450M241N040N786O653P761Q857R427R119
$$ 310160 312680 315119 317522 320053 322913 326363 330604 335644 341430 348083 355844 364701 374128 383247
60562C83247P941O148L966J486j089l111l744k890j606j084j334j402q01P0J023
$$ 383247 391188 397336 401302 402788 401699 398588 394844 391954 390348 389264 387930 386528 385727 385797 386820
60547C86820K526M636O395P109P468Q526J0113J1326J2089J3004J3827J3455J1539
$$ 386820 389346 393982 400377 407486 414954 423480 433593 444919 457008 470012 483839 497294 508833
60534E08833Q942O375L666P87j588l093m306n647o504o242n337m680m321l795
$$ 508833 517775 524150 527816 528603 527015 523922 519616 513969 507465 501223 495886 491206 486885 483090
60520D83090l185k950k970k685j955j081j35R09J574J369Q91J507L683O351Q270
$$ 483090 479905 476955 473985 471300 469345 468264 468129 469038 470612 471981 472872 474379 478062 484413 492683
60505D92683R491J1028J3584J6978K0570K3862K6712K9274L1836L4594L7371L9390
$$ 492683 502174 513202 526786 543764 564334 588196 614908 644182 676018 710612 747983 787373
60493G87373L9492L7013L2503K7003K0486J1686R2j2535k3439l1351l6839m0581
$$ 787373 826865 863878 896381 923384 943870 955556 955648 943113 919674 888323 851484 810903
60481H10903m2401m2149m0481l8205l5546l2454k9108k5738k2396j9260j6775
$$ 810903 768502 726353 685872 647667 612121 579667 550559 524821 502425 483165 466390
60470D66390j5076j3700j2149j0510r179q293p735p383p017o291n141m009l358
$$ 466390 451314 437614 425465 414955 405776 397483 389748 382365 375348 369057 363916 359907 356549
60457C56549l082k706k011j238q13j038j860k734k950k348j527j142j198j292
$$ 356549 353467 350761 348750 347512 346699 345661 343801 341067 338117 335769 334242 333100 331902 330610
60443C30610j235j075p06J4P74Q90J27q98j351j109p84q63j071q65l29j52n70
$$ 330610 329375 328300 327594 327608 328382 329272 329399 328501 327150 326041 325257 324394 323323 322458 322129 321977 321407
60426C21407q83m44K87L33k89n60l2M86L17J32R25K337K945K122P10k47o43q57
$$ 321407 320524 320080 320367 320700 320411 319851 319819 320305 320622 320754 321679 324016 326961 329083 329793 329546 328903 328046
60408C28046r23o23m2M69P68R58J088J140J285J738K305K398J731Q40O01J293
$$ 328046 327123 326500 326458 326927 327695 328653 329741 330881 332166 333904 336209 338607 340338 341178 341779 343072
60392C43072K324K924K865K432J979J715J797K225K712K869K611K157J704J300
$$ 343072 345396 348320 351185 353617 355596 357311 359108 361333 364045 366914 369525 371682 373386 374686
60378C74686J032J019J216J501J998K896L897M268L758K983K583K324J582N04
$$ 374686 375718 376737 377953 379454 381452 384348 388245 392513 396271 399254 401837 404161 405743 406247
60364D06247J7O69J896K691K637K188K116K872M295N786O738O961O694O326O076
$$ 406247 406264 406933 408829 411520 414157 416345 418461 421333 425628 431414 438152 445113 451807 458133 464209
60349D64209N838N225L887J970Q6j305k368l498m599n127m824m084l491l275l370
$$ 464209 470047 475272 479159 481129 481215 479910 477542 474044 469445 464318 459494 455410 451919 448644 445274
60334D45274l642l919l995l833l640l548l439l265l296l671l849l059j383QP8
$$ 445274 441632 437713 433718 429885 426245 422697 419258 415993 412697 409026 405177 402118 400735 400743 400821
60319D00821q86j616j258n3J339K688M205N991P847R496J0730J1376J1374J0959
$$ 400821 399935 398319 397061 397008 398347 401035 405240 411231 419078 428574 439304 450680 462054 473013
60305D73013J0549J0356J0135R373P742N428K986P45j639m795q677j2242j4386
$$ 473013 483562 493918 504053 513426 521168 526596 529582 530327 528688 523893 515216 502974 488588
60292D88588j4955j4555j3560j1808r320o821n247m920n297n464m850l696k756
$$ 488588 473633 459078 445518 433710 424390 417569 412322 407402 402105 396641 391791 388095 385339
60279C85339k401k180j499n93k44o15r76p72l70m70j173j978k355k030j104j83
$$ 385339 382938 380758 379259 378666 378422 377807 376831 376059 375689 375219 374046 372068 369713 367683 366579 366396
60263C66396o3q66j764j885j301p34n66n65l89j3L03K64j53n16l32K30M19m0m32
$$ 366396 366333 365467 363703 361818 360517 359783 359217 358652 358263 358250 358553 358817 358664 358148 357816 358046 358465 358425 357993
60244C57993j2J007J891K329K343J755N69m26m19J95K41n48j208j021l90R5N35
$$ 357993 357981 358988 360879 363208 365551 367306 367875 367449 367030 367225 367466 366918 365710 364689 364299 364394 364929
60227C64929J157J582J372Q48O83R56J188J150J112J384J983K756L480L843L659
$$ 364929 366086 367668 369040 369888 370571 371527 372715 373865 374977 376361 378344 381100 384580 388423 392082
60212C92082L128K703K690L009L402L749M165M789N401N456M753L937L897M638
$$ 392082 395210 397913 400603 403612 407014 410763 414928 419717 425118 430574 435327 439264 443161 447799
60198D47799N175M746L693K840K372J815R08L8k62J06P90J369J625J533J051O6
$$ 447799 452974 457720 461413 464253 466625 468440 469348 469386 469124 469230 470020 471389 473014 474547 475598 475664
60182D75664j346k681l291l010k316j767j512j453j597j979k406k533k242j731
$$ 475664 474318 471637 468346 465336 463020 461253 459741 458288 456691 454712 452306 449773 447531 445800
60168D45800j335j241j367j406j172r56j280k152k791k437j301l41j06j62J61
$$ 445800 444465 443224 441857 440451 439279 438323 437043 434891 432100 429663 428362 428021 427915 427753 427914
60153D27914P78R86N06q4j58J34K00k8r6N0j41q22j156l00J421K939L675L809
$$ 427914 428692 429678 430184 430100 429942 430076 430276 430248 430152 430202 430061 429239 428083 427783 429204 432143 435818 439627
60135D39627L573L098K770K935L195K817J886J289J362J410Q60R0l04l49k75K9
$$ 439627 443200 446298 449068 452003 455198 458015 459901 461190 462552 463962 464822 464912 464608 464259 463984 464013
60119D64013N82R61R74J106J634J890J191J1o40n84m00l16j07J04k8k64o1L06
$$ 464013 464595 465556 466530 467636 469270 471160 472351 472362 471722 471138 470738 470422 470315 470419 470391 470127 470066 470372
60101D70372j5r81j442q40j10k70r20r00M5J090J537J473J342J397J675K033K130
$$ 470372 470357 469376 467934 467094 466984 466714 465794 464894 464939 466029 467566 469039 470381 471778 473453 475486 477616
60084D77616J666P94Q0p1J31Q6n24j404k043k367k787l536m283m638m754m982
$$ 477616 479282 480076 480156 480085 480216 480302 479778 478374 476331 473964 471177 467641 463358 458720 453966 448984
60068D48984n183m897m178l646l653l880l985m126m524m937m911m330l426k496
$$ 448984 443801 438904 434726 431080 427427 423547 419562 415436 410912 405975 401064 396734 393308 390812
60054C90812j786j454j320r72l21J86K32J92O06J345J760J599J309J388J852K398
$$ 390812 389026 387572 386252 385280 384959 385145 385377 385569 386175 387520 389280 390879 392188 393576 395428 397826
60038C97826K783K875K630K218J930J847J676J167M92J15J91K85k40j583l197
$$ 397826 400609 403484 406114 408332 410262 412109 413785 414952 415444 415559 415750 416035 415795 414212 411015
60023D11015m158l871k615j407j219k157l411m086m060l895m015m266m332m242
$$ 411015 406857 402986 400371 398964 397745 395588 392177 388091 384031 380136 376121 371855 367523 363281
60009C63281m195m108l732l093k489k120j957j996k244k467k251j459l89N71J210
$$ 363281 359086 354978 351246 348153 345664 343544 341587 339591 337347 334880 332629 331170 330781 331352 332562
59994C32562J411J188Q27P37J001J341J552J612J360O32j50r7J017K196K350J610
$$ 332562 333973 335161 335988 336725 337726 339067 340619 342231 343591 344223 344073 343976 344993 347189 349539 351149
59978C51149R99J025J220J012M07k67q00j055r24n73m83r43j630j883j385m80
$$ 351149 352148 353173 354393 355405 355812 355545 354745 353690 352766 352193 351710 350767 349137 347254 345869 345389
59962C45389J90L56M05Q37J457J436M20p53r44j72M05rr55j534j535j298q72J3
$$ 345389 345579 345935 346340 347177 348634 350070 350490 349737 348793 348621 349026 349017 348062 346528 344993 343695 342823 342836
59944C42836J180J867J568O61l8j73J5J94K54J34k57p49q79m61N1J17r3J27R79
$$ 342836 344016 345883 347451 348112 348074 347901 347916 348110 348364 348498 348241 347492 346613 346152 346203 346320 346227 346354 347333
59925C47333J888K351K632L192L879M180L939L363K499J353M39M51J295J972J723
$$ 347333 349221 351572 354204 357396 361275 365455 369394 372757 375256 376609 377048 377499 378794 380766 382489
59910C82489Q58J90Q9L88P73R70P78K89j05j85p9J77Q56J865K350J632L01l39
$$ 382489 383347 383537 383626 384014 384787 385757 386535 386824 386719 386534 386455 386632 387488 389353 391703 393335 393636 393297
59892C93297J73J084J764K570L987N548O240N791M948M530M629M878N068N275
$$ 393297 393470 394554 396318 398888 402875 408423 414663 420454 425402 429932 434561 439439 444507 449782
59878D49782N476N403M872M047L270K631J947J080J34p22j374j677j570j436j850
$$ 449782 455258 460661 465533 469580 472850 475481 477428 478508 478642 477920 476546 474869 473299 471863 470013
59863D70013k703k964j902j43J092J615K263L389M402N055O113P945R276Q360
$$ 470013 467310 464346 462444 462301 463393 465008 467271 470660 475062 480117 486230 494175 503451 511811
59849E11811N147J415j152k264k459k075j146J39J221J351N8k327m699o052o287
$$ 511811 516958 518373 517221 514957 512498 510423 509277 509416 510637 511988 512046 509719 505020 498968 492681
59834D92681n910n223m302l494l212l151k420p82Q34J340O72l79j093j324j355
$$ 492681 486771 481548 477246 473752 470540 467389 464969 464187 465021 466361 467033 466654 465561 464237 462882
59819D62882j577k125k680k832k724k934l613m200m217l888l656l489l080k465
$$ 462882 461305 459180 456500 453668 450944 448010 444397 440197 435980 432092 428436 424947 421867 419402
59805D19402k061k204k883l679l878k967j342o8K92J85R0k76j207k060j943j012
$$ 419402 417341 415137 412254 408575 404697 401730 400388 400320 400612 400797 400887 400611 399404 397344 395401 394389
59789C94389k22M4K17N29O67N66O42R69J046P49P66J509K223J860N59m52k99P18
$$ 394389 394167 394211 394428 394957 395624 396190 396832 397801 398847 399596 400362 401871 404094 405954 406513 406061 405762 406480
59771D06480J711K114J953J604J490J774K209K316J843J021L50J39K90N01O31
$$ 406480 408191 410305 412258 413862 415352 417126 419335 421651 423494 424515 424865 425004 425294 425795 426426
59756D26426P69J054J568K324L160L642L433K832K537K774L046K969K876L194
$$ 426426 427195 428249 429817 432141 435301 438943 442376 445208 447745 450519 453565 456534 459410 462604
59742D62604L680L817L647L532L451L183L013L391L985L867K756J401N54L02M88
$$ 462604 466284 470101 473748 477280 480731 483914 486927 490318 494303 498170 500926 502327 502881 503183 503671
59727E03671J034J601J650J248J081J365J378N63n46j118j154j219j441j449j099
$$ 503671 504705 506306 507956 509204 510285 511650 513028 513591 513045 511927 510773 509554 508113 506664 505565
59712E05565p08o53j079j815k304j961r03M0L40L30M15L13k59p48l66P00J487
$$ 505565 504857 504204 503125 501310 499006 497045 496142 496182 496522 496852 497267 497580 497321 496573 496207 496907 498394
59695D98394J500J069O13K56R6J22p8r13j983k424k098j727j743j743j357r63
$$ 498394 499894 500963 501576 501832 501928 502050 501972 501059 499076 496652 494554 492827 491084 489341 487984 487021
59679D87021j054j439j622j611j839k481l254l854m197m300m186l927l576l075
$$ 487021 485967 484528 482906 481295 479456 476975 473721 469867 465670 461370 457184 453257 449681 446606
59665D46606k409j894j966k531k745j788Q1J590J804J156Q08J163J618J658J533
$$ 446606 444197 442303 440337 437806 435061 433273 433354 434944 436748 437904 438712 439875 441493 443151 444684
59650D44684J591J618J302Q65O83N98J69o15j379j981k549l025l141k846k353
$$ 444684 446275 447893 449195 450060 450743 451341 451510 450895 449516 447535 444986 441961 438820 435974 433621
59635D33621j846j466j381j502j362p80m26j105k547l592l530k733j915j413j261
$$ 433621 431775 430309 428928 427426 426064 425284 424858 423753 421206 417614 414084 411351 409436 408023 406762
59620D06762j435j765k086k463k937l102k563j772j656k328k804k329j250l27
$$ 406762 405327 403562 401476 399013 396076 392974 390411 388639 386983 384655 381851 379522 378272 377945
59606C77945K38O76J035J167R67L91m35r11k93J295K714K992K315J484R29O78
$$ 377945 378183 378859 379894 381061 382028 382419 381984 381073 380780 382075 384789 387781 390096 391580 392509 393187
59590C93187Q07J314J834K036K035J998J647P16l32p39n20m69j049j824k157k057
$$ 393187 393994 395308 397142 399178 401213 403211 404858 405574 405242 404503 403983 403514 402465 400641 398484 396427
59574C96427k035k374k801k884k555k191k079k007j483m35N66Q55K60p79j515
$$ 396427 394392 392018 389217 386333 383778 381587 379508 377501 376018 375583 376149 377004 377264 376485 374970
59559C74970j410o23P5K59M62J316K219J921M47o01j54R92J696K331L954O274
$$ 374970 373560 372937 373012 373271 373733 375049 377268 379189 379636 379035 378881 379873 381569 383900 387854 394128
59543C94128P828P985P727Q435J0875J5147K0306K3899K3114J7279Q584L8o613
$$ 394128 401956 409941 417668 426103 436978 452125 472431 496330 519444 536723 545307 545345 538732
59530E38732j0783j2180j1020q518o063m066k158k73J205K123K637K646J810K57
$$ 538732 527949 515769 504749 496231 490168 486102 483944 483671 484876 486999 489636 492282 494092 494349
59516D94349j336k441l082l428l515l586m160n342o426o633o097n643n675n796
$$ 494349 493013 490572 487490 484062 480547 476961 472801 467459 461033 454400 448303 442660 436985 431189
59502D31189n581n177m888m558l860k954k411k442k658k633k362j975j405o13
$$ 431189 425608 420431 415543 410985 407125 404171 401760 399318 396660 394027 391665 389690 388285 387672
59488C87672J34N60P27Q29P93M71P9O7N30J089J439J671J925K033J735J158P89
$$ 387672 387806 388366 389093 389922 390715 391186 391265 391332 391862 392951 394390 396061 397986 400019 401754 402912 403701
59471D03701R83J541J849J486O67N2oK06K44K12O78J867L197L788L404K751K790
$$ 403701 404684 406225 408074 409560 410227 410279 410273 410479 410723 410935 411613 413480 416677 420465 423869 426620 429410
59454D29410L684M579M593L965L806M667N786O092N424M325L039J481o3j106j850
$$ 429410 433094 437673 442266 446231 450037 454704 460490 466582 472006 476331 479370 480851 480788 479682 477832
59439D77832l027m565n291m508l112k486k805l201l144k803k218j078N44K020
$$ 477832 474805 470240 464949 460441 457329 454843 452038 448837 445693 442890 440672 439594 440138 442158
59425D42158L003L902N165O646P940R013J0150J1597J3448J5669J8064K0636K3910
$$ 442158 445161 449063 454228 460874 468814 477827 487977 499574 513022 528691 546755 567391 591301
59412E91301K8058L1319L0229K2616J0245k304j1298j5808j6626j4661j0739n678
$$ 591301 619359 650678 680907 703523 713768 711464 700166 684358 667732 653071 642332 636654
59400F36654J22O394J1622J2866Q138j248j1521j9474k4030k5449k4274k1386
$$ 636654 636776 643170 654792 667658 675796 674548 663027 643553 619523 594074 569800 548414
59388E48414j7989j4934j2315r963p889o068m289k528j081j25M80Q35R05R23J356
$$ 548414 530425 515491 503176 493213 485324 479256 474967 472439 471358 471233 471713 472548 473453 474376 475732
59373D75732K197K820K879K892L442M255M588M272L790L508L353L194L082L051
$$ 475732 477929 480749 483628 486520 489962 494217 498805 503077 506867 510375 513728 516922 520004 523055
59359E23055L049L086L275L649M117M588N045N602O464P615Q573Q800Q475Q401
$$ 523055 526104 529190 532465 536114 540231 544819 549864 555466 561930 569545 578118 586918 595393 603794
59345F03794Q926R454R354Q841Q445Q089P337O210N079L928K417O23r72k194l293
$$ 603794 612720 622174 631528 640369 648814 656903 664240 670450 675529 679457 681874 682497 681525 679331 676038
59330F76038m349n198n949o962q140q925r091q987q773q120o960n925n537n361
$$ 676038 671689 666491 660542 653580 645440 636515 627424 618437 609664 601544 594584 588659 583122 577761
59316E77761m531k851r47N06J360J860K293K848L700N149P424R972J1059Q832
$$ 577761 573230 570379 569432 569938 571298 573158 575451 578299 581999 587148 594572 604544 615603 624435
59302F24435L199l684r242j2591j4537j5930j6667j6267j4760j2732j0807r331
$$ 624435 627634 623950 614708 602117 587580 571650 554983 538716 523956 511224 500417 491086
59290D91086q335p526o430m837l131k011j790j975j742p55N35J425J683J719K139
$$ 491086 482751 475225 468795 463958 460827 458816 457026 455051 453309 452554 453089 454514 456197 457916 460055
59275D60055L169M456N349N515N249N149N485O104O864P723Q383Q290P280N837
$$ 460055 463224 467680 473029 478544 483793 488942 494427 500531 507395 515118 523501 531791 539071 544908
59261E44908M442L041J498P7j013k110l472m508m495l811l570m050m443m249l923
$$ 544908 549350 552391 553889 553966 552953 550843 547371 542863 538368 534557 530987 526937 522494 518245 514322
59246E14322l837l531k508j083J51J084J793K105K136K645M095N664O087N178
$$ 514322 510485 506954 504446 503363 503514 504598 506391 508496 510632 513277 517372 523036 529123 534301
59232E34301L859K804J884R39K71J10J84P2m41j424k797m069m553m098l317k857
$$ 534301 538160 540964 542848 543787 544058 544168 544352 544424 543983 542559 539762 535693 531140 527042 523725 520868
59216E20868k683k395j925j613j692k009k263k267k057j840j873k227k578k470
$$ 520868 518185 515790 513865 512252 510560 508551 506288 504021 501964 500124 498251 496024 493446 490976
59202D90976j868j321j410k038k482k188j321m52J30N30Q38R41P88N43L84K70
$$ 490976 489108 487787 486377 484339 481857 479669 478348 477896 478026 478556 479394 480335 481123 481666 482050 482320
59186D82320J00k3K03R72K110L110L512L304K924K801L036L514M100M571M642
$$ 482320 482420 482397 482600 483572 485682 488792 492304 495608 498532 501333 504369 507883 511983 516554 521196
59171E21196M361M199M424M660M513M391N051O324P000O144M079J945O89N30Q71
$$ 521196 525557 529756 534180 538840 543353 547744 552795 559119 566119 572263 576342 578287 578976 579506 580377
59156E80377O59o81k469l490l525l585m428n615o368o606o616o393n921n602n716
$$ 580377 581036 580355 577886 574396 570871 567286 562858 557243 550875 544269 537653 531260 525339 519737 514021
59141E14021n909n787n613n776o019n851n353m877m319l485k836k929l336l023
$$ 514021 508112 502325 496712 490936 484917 479066 473713 468836 464517 461032 458196 455267 451931 448908
59127D48908j801m91L50R88J694K286K695L204L847M238M357M806N923P246Q224
$$ 448908 447107 446616 446966 447954 449648 451934 454629 457833 461680 465918 470275 475081 481004 488250 496474
59112D96474Q866R258R049Q028O801O258O540P045P232O995O373N331L978K702
$$ 496474 505340 514598 523647 531675 538476 544734 551274 558319 565551 572546 578919 584250 588228 590930
59098E90930J955J876K110J985J104k01j132j231p37j99j2k69p76j104j016q90
$$ 590930 592885 594761 596871 598856 599960 599759 598627 597396 596659 596460 596448 596179 595403 594299 593283 592393
59082E92393j385k616m031n114n813o173o145n935n999o344o312n477m317l568
$$ 592393 591008 588392 584361 579247 573434 567261 561116 555181 549182 542838 536526 531049 526732 523164
59068E23164l285l055k760k631k699k781k900l222l654l922l938l787l469l016
$$ 523164 519879 516824 514064 511433 508734 505953 503053 499831 496177 492255 488317 484530 481061 478045
59054D78045k728k791k787k145j099n80j098k099k653k393j604p63k18k8R9N25
$$ 478045 475317 472526 469739 467594 466495 465915 464817 462718 460065 457672 456068 455305 455087 455059 455158 455683
59038D55683J249J799J789J340Q93P42R07J305J884K588L283L833M268M848N757
$$ 455683 456932 458731 460520 461860 462753 463495 464402 465707 467591 470179 473462 477295 481563 486411 492168
59023D92168O754P390P690Q187R088R736R479Q644Q047P670O714M983L305K271
$$ 492168 498922 506312 514002 522189 531277 541013 550492 559136 567183 574853 581567 586550 589855 592126
59009E92126J394O8j338k101k305k560k751k076l24J651K961L553L778L600K796
$$ 592126 593520 593588 592250 590149 587844 585284 582533 580457 580133 581784 584745 588298 592076 595676 598472
58994E98472J546M36j94n13q74j339j683j771j826k154k656k861k518j943j555
$$ 598472 600018 600454 600260 599747 598873 597534 595851 594080 592254 590100 587444 584583 582065 580122 578567
58979E78567j352j100p93m45L52K065M412O492P793Q593R194R422R130Q686Q486
$$ 578567 577215 576115 575322 574877 575229 577294 581706 588198 595991 604584 613778 623200 632330 641016 649502
58964F49502Q413Q213Q007P971P758O856N374L924K819J863R08M6q90k460m973
$$ 649502 657915 666128 674135 682106 689864 696720 702094 706018 708837 710700 711608 711654 710764 708304 703331
58949G03331p899j0229j1311j1241j0568r811r179q653q148p595o923o158n531
$$ 703331 695432 685203 673892 662651 652083 642272 633093 624440 616292 608697 601774 595616 590085
58936E90085n252n159m850m278l837l725l595l114k451j895j361p40l86o50j250
$$ 590085 584833 579674 574824 570546 566709 562984 559389 556275 553824 551929 550568 549828 549442 548792 547542
58921E47542j644j867k274k604k147q60L96R46R52Q22O66O18J025J857K489K594
$$ 547542 545898 544031 541757 539153 537006 536146 536542 537488 538440 539262 539928 540546 541571 543428 545917 548511
58905E48511K825M047O151Q083Q970Q849Q386Q149Q157P956P221O262N797O253
$$ 548511 551336 555383 561534 569617 578587 587436 595822 603971 612128 620084 627305 633567 639364 645617
58891F45617P522R315J1239J2628J2934J2515J2444J3147J3724J3021J0986Q538
$$ 645617 653139 662454 673693 686321 699255 711770 724214 737361 751085 764106 775092 783630
58879G83630O446M780L208J402p11k830m551n854p058q198q946r263r460r383
$$ 783630 790076 794856 798064 799466 798755 795925 791374 785520 778462 770264 761318 752055 742595 733212
58865G33212q294o160m281l831m367m664m568m824n454n600n145n216o561q334
$$ 733212 724918 718758 714477 710646 706279 701615 697047 692223 686769 681169 676024 670808 664247 655913
58851F55913r204r015q656q626q528p923p041o433o228o088n781n510n520n620
$$ 655913 646709 637694 629038 620412 611884 603961 596920 590487 584259 578171 572390 566880 561360 555740
58837E55740n441n076m986n198n087m317l485l283l394k888j568k51L68M95P71
$$ 555740 550299 545223 540237 535039 529952 525635 522150 518867 515473 512585 511017 510766 511134 511629 512400
58822E12400J432K235K843L094L044K889K843K983L287L673L934L841L439L046
$$ 512400 513832 516067 518910 522004 525048 527937 530780 533763 537050 540723 544657 548498 551937 554983
58808E54983K739K212J392Q15Q49R06M5j727l347l940l629l073k760k915l647
$$ 554983 557722 559934 561326 562141 562990 563896 563941 562214 558867 554927 551298 548225 545465 542550 538903
58793E38903m812n962o569o322n253l824k786k558k777k646j746l05J200K384
$$ 538903 534091 528129 521560 515238 509985 506161 503375 500817 498040 495394 493648 493343 494543 496927
58779D96927K978K934K577K377K499K691K544J815O11n88j350j877k779m105n052
$$ 496927 499905 502839 505416 507793 510292 512983 515527 517342 517953 517365 516015 514138 511359 507254 502202
58764E02202n079m746m867n275n175m404l506k762j959j127o41n14k85K20O95
$$ 502202 497123 492377 487510 482235 477060 472656 469150 466388 464429 463302 462661 462147 461862 462082 462777
58749D62777R95J303J545J320O91M04R82K085L053L621L880L907L781L685L730
$$ 462777 463772 465075 466620 467940 468631 469035 470017 472102 475155 478776 482656 486563 490344 494029 497759
58734D97759L860M004M147M269M422M784N301N531N196M643M257L751K710J558
$$ 497759 501619 505623 509770 514039 518461 523245 528546 534077 539273 543916 548173 551924 554634 556192
58720E56192J101J311J440J401J982L506N235O391O943P052O597N714M996M617
$$ 556192 557293 558604 560044 561445 563427 566933 572168 578559 585502 592554 599151 604865 609861 614478
58706F14478L885K193j17k362m395o385q200r537j0368j0808j0896j0829j0988
$$ 614478 618363 620556 620439 618077 613682 607297 599097 589560 579192 568384 557488 546659 535671
58693E35671j1334j1244j0327r037q092p593p150o500n656m744l993l621l468
$$ 535671 524337 513093 502766 493729 485637 478044 470894 464394 458738 453994 450001 446380 442912
58680D42912l098k443j991k058k296k198j680q95N9R72J518J855K747M659O990
$$ 442912 439814 437371 435380 433322 431026 428828 427148 426253 426312 427284 428802 430657 433404 438063 445053
58665D45053Q657R229R160R049R001Q616P428N440L183J173n27j962k783k737
$$ 445053 453710 462939 472099 481148 490149 498765 506193 511633 514816 515989 515462 513500 510717 507980
58651E07980k404k714l664m303m061l407l032l092l414l737l661k965k171j996
$$ 507980 505576 502862 499198 494895 490834 487427 484395 481303 477889 474152 470491 467526 465355 463359
58637D63359k239k039j308q81r99q92j93M11N03P75J774K844L169L022L080L266
$$ 463359 461120 459081 457773 456892 455893 455001 454808 455219 455722 456497 458271 461115 464284 467306 470386 473652
58621D73652L164K908K877K954K892K814K801K587K278K544L431L799K828J350
$$ 473652 476816 479724 482601 485555 488447 491261 494062 496649 498927 501471 504902 508701 511529 512879
58607E12879P59J258K040K495K311J159o99k007j830p60J0K16J75l07j454k518
$$ 512879 513638 514896 516936 519431 521742 522901 522202 520195 518365 517605 517615 517831 518006 517699 516245 513727
58591E13727k553j754r45j71R74K128K683L118M372O043O731O146N495N594N962
$$ 513727 511174 509420 508475 508304 509278 511406 514089 517207 521579 527622 534353 540499 545994 551588 557550
58576E57550O004N876N803N588N195M940M895M894N249O537Q484J0041J0841J1670
$$ 557550 563554 569430 575233 580821 586016 590956 595851 600745 605994 612531 621015 631056 641897 653567
58562F53567J3163J4860J6009J6591J7096J7710J8077J7581J5747J2773R543O776
$$ 653567 666730 681590 697599 714190 731286 748996 767073 784654 800401 813174 822717 829493
58550H29493M321J864j26r57r85j371k508l619m096m346n130o720q872j1065j2628
$$ 829493 833814 835678 835552 834595 833610 832239 829731 826112 822016 817670 812540 805820 796948 785883 773255
58535G73255j3274j3554j4177j4901j4727j3260j1079q798o519m383k810j924
$$ 773255 759981 746427 732250 717349 702622 689362 678283 669485 662966 658583 655773 653849
58523F53849j320p25l51m75j054j854k521k572j840r65q58j635k526k825k476
$$ 653849 652529 651804 651453 650978 649924 648070 645549 642977 641137 640172 639314 637679 635153 632328 629852
58508F29852j831j294j207j548j805j529r36n47n33q13j370j912j705m94Q03J144
$$ 629852 628021 626727 625520 623972 622167 620638 619702 619155 618622 617809 616439 614527 612822 612328 613131 614275
58492F14275P05L42J44l95j028q26M13J895L046M071N231O424P561Q609R218R180
$$ 614275 614980 615322 615466 615071 614043 613217 613630 615525 618571 622642 627873 634297 641858 650467 659685 668865
58476F68865R114R827J1009J1432J0434Q352N636K563j61j665k029k285l087m102
$$ 668865 677979 687806 698815 710247 720681 729033 734669 737232 737071 735406 733377 731092 728005 723903
58462G23903m817n050m576l146j142N07J368J923K820M198N720O844P083O488
$$ 723903 719086 714036 709460 706314 705172 705679 707047 708970 711790 715988 721708 728552 735635 742123
58448G42123N671M973M022K542R60l34j608k887l342k604j743j717j740o84Q06
$$ 742123 747794 752767 756789 759331 760291 759957 758349 755462 752120 749516 747773 746056 744316 743632 744438
58433G44438J333J101J376K144K439K601L866N804O482N514M674M999N382M782
$$ 744438 745771 746872 748248 750392 752831 755432 759298 765102 771584 777098 781772 786771 792153 796935
58419G96935L801L232K690J686N68l93j542k859l715m074m584n073m576l304k870
$$ 796935 800736 803968 806658 808344 808912 808519 806977 804118 800403 796329 791745 786672 782096 778792 775922
58404G75922l795m462l430j284O46K013K959L352L439M063N297O027N725N382
$$ 775922 772127 767665 764235 762951 763597 765610 768569 771921 775360 779423 784720 790747 796472 801854
58390H01854N866O590O686O415O442O706O824O786O644O296O015O137O080M891
$$ 801854 807720 814310 820996 827411 833853 840559 847383 854169 860813 867109 873124 879261 885341 890232
58376H90232K953J774J788J950J814K212L399M349M654N330O866Q171Q404Q227
$$ 890232 893185 894959 896747 898697 900511 902723 906122 910471 915125 920455 927321 935492 943896 952123
58362I52123Q352Q478Q480R048J0178J0711J0212R653R357Q183N848M051M004
$$ 952123 960475 968953 977433 986481 996659 1007370 1017582 1027235 1036592 1044775 1050623 1054674 1058678
58349A058678M623M577M349M811N464N682O180P595R020R458R459R943J0647J1137
$$ 1058678 1063301 1067878 1072227 1077038 1082502 1088184 1094364 1101959 1110979 1120437 1129896 1139839 1150486 1161623
58335A161623J1926J3227J3980J3555J3051J3504J4124J3764J2787J2130J1801
$$ 1161623 1173549 1186776 1200756 1214311 1227362 1240866 1254990 1268754 1281541 1293671 1305472
58324A305472J1616J2019J2783J2458J0480Q461P957Q424Q757R245J0395J1437
$$ 1305472 1317088 1329107 1341890 1354348 1364828 1373289 1381246 1389670 1398427 1407672 1418067 1429504
58312A429504J1608J1649J2448J3581J4517J5715J7231J7910J7417J7295J8477
$$ 1429504 1441112 1452761 1465209 1478790 1493307 1509022 1526253 1544163 1561580 1578875 1597352
58301A597352J9680J9844K0122K1510K2584K1790K0298K0246K1579K2741K3190
$$ 1597352 1617032 1636876 1656998 1678508 1701092 1722882 1743180 1763426 1785005 1807746 1830936
58290A830936K3312K3134K2911K3593K5178K6215K6301K7125K9505L1703L2452
$$ 1830936 1854248 1877382 1900293 1923886 1949064 1975279 2001580 2028705 2058210 2089913 2122365
58279B122365L3221L5383L7601L8423L9096M1225M3912M5743M7463N0062N2434
$$ 2122365 2155586 2190969 2228570 2266993 2306089 2347314 2391226 2436969 2484432 2534494 2586928
58268B586928N3550N4805N7484O0186O1470O2757O5733O9238P1628P3807P6989
$$ 2586928 2640478 2695283 2752767 2812953 2874423 2937180 3002913 3072151 3143779 3217586 3294575
58257C294575P9974Q1718Q3925Q7791R0992R1459R1407R3918R8184J01963J05978
$$ 3294575 3374549 3456267 3540192 3627983 3718975 3810434 3901841 3995759 4093943 4195906 4301884
58246D301884J11796J18063J23064J28506J36490J45358J52712J59912J69176
$$ 4301884 4413680 4531743 4654807 4783313 4919803 5065161 5217873 5377785 5546961
58237E546961J79138J87746J96692K08329K21276K33756K47980K66245K86210
$$ 5546961 5726099 5913845 6110537 6318866 6540142 6773898 7021878 7288123 7574333
58228G574333L05233L25555L49808L75631M00666M28445M62808N01140N40138
$$ 7574333 7879566 8205121 8554929 8930560 9331226 9759671 10222479 10723619 11263757
58219A1263757N83387O35428O93534P53980Q21323R02272R95366J096439J208934
$$ 11263757 11847144 12482572 13176106 13930086 14751409 15653681 16649047 17745486 18954420
58210A8954420J338341J482659J640629J823974K048745K320420K641281L025764
$$ 18954420 20292761 21775420 23416049 25240023 27288768 29609188 32250469 35276233
58202C5276233L492913M051613M713041N512787O501832P723264R219400J1049384
$$ 35276233 38769146 42820759 47533800 53046587 59548419 67271683 76491083 87540467
58194H7540467J3265495J5876698J8874192K2293653K6199953L0561142L5088093
$$ 87540467 100805962 116682660 135556852 157850505 184050458 214611600 249699693
58187B49699693L9084952M1337028M0227290L4336054K3375594Q763270o782024
$$ 249699693 288784645 330121673 370348963 404685017 428060611 436823881 430041857
58180D30041857k0423719l0307994l5920827l7766923l6838629l4195944l0716028
$$ 430041857 409618138 379310144 343389317 305622394 268783765 234587821 203871793
58173B03871793k6995419k3383483k0070990j7148188j4628079j2477857j0656356
$$ 203871793 176876374 153492891 133421901 116273713 101645634 89167777 78511421
58166G8511421r124597p837260o748118n824987n046935m390379l830333l351534
$$ 78511421 69386824 61549564 54801446 48976459 43929524 39539145 35708812 32357278
58158C2357278k945731k600304k300248k038370j813027j618083j444667j290355
$$ 32357278 29411547 26811243 24510995 22472625 20659598 19041515 17596848 16306493
58150A6306493j157169j042352r39654q47875p69847p04452o47072n96292n52959
$$ 16306493 15149324 14106972 13167318 12319443 11549596 10845144 10198072 9601780 9048821
58141I048821n14325m76047m38728m05912l77150l49149l22240k99345k79848
$$ 9048821 8534496 8058449 7619721 7213809 6836659 6487510 6165270 5865925 5586077
58132E586077k60441k40986k24002k09443j95332j82209j71804j62514j51460
$$ 5586077 5325636 5084650 4860648 4651205 4455873 4273664 4101860 3939346 3787886
58123C787886j39779j30959j25003j19122j12842j07573j02437r5597q8595q4474
$$ 3787886 3648107 3517148 3392145 3273023 3160181 3052608 2950171 2854574 2765979 2681505
58113B681505q2382p8837p3488o8995o5997o2868n9737n8114n7155n4677n1419
$$ 2681505 2599123 2520286 2446798 2377803 2311806 2248938 2189201 2131087 2073932 2019255 1967836
58102A967836m9948m9888m8633m6170m4856m4690m3315m0564l8767l8408l7441
$$ 1967836 1917888 1868000 1819367 1773197 1728341 1683651 1640336 1599772 1561005 1522597 1485156
58091A485156l5172l3027l1377k9106k6419k4688k3634k1953k0484k1160k3120
$$ 1485156 1449984 1416957 1385580 1356474 1330055 1305367 1281733 1259780 1239296 1218136 1195016
58080A195016k3536k2147k1366k1945k2256k1827k1804k1854k0366j8007j7302
$$ 1195016 1171480 1149333 1127967 1106022 1083766 1061939 1040135 1018281 997915 979908 962606
58069I62606j8274j8248j6534j5489j6163j6528j5179j3400j2353j1327r990r462
$$ 962606 944332 926084 909550 894061 877898 861370 846191 832791 820438 809111 799121 789659
58057G89659r930r934r089q886r785j0195r417q841r114q801p267o238o964q093
$$ 789659 779729 769795 760706 751820 742035 731840 722423 713582 704468 695667 688400 682162 675198 667105
58043F67105q068p553p808q453q496q176q210q360q055p442o875o261n684n694
$$ 667105 659037 651484 643676 635223 626727 618551 610341 601981 593926 586484 579609 573348 567664 561970
58029E61970o386p092p434p660p818p623p277p187o937n901m759m846o004o737
$$ 561970 555584 548492 541058 533398 525580 517957 510680 503493 496556 490655 485896 481050 475046 468309
58015D68309o499o039n531m343k861k465l242l679l075k370k042j239K68J224
$$ 468309 461810 455771 450240 445897 443036 440571 437329 433650 430575 428205 426163 424924 425192 426416
58001D26416R04L18L76M35k82j182j366j117j300k069k929l457l441k959k567
$$ 426416 427320 427638 428014 428449 428167 426985 425619 424502 423202 421133 418204 414747 411306 408347 405780
57986D05780k731l095l035k752k882l306l536l846m665n310m929m325m949o268
$$ 405780 403049 399954 396919 394167 391285 387979 384443 380597 375932 370622 365693 361368 356419 350151
57972C50151o290m737l458l357l159j902n56j87l07o4M00P41J252K073K653K667
$$ 350151 343861 339124 335666 332309 329150 327248 326692 326505 326198 326134 326534 327275 328527 330600 333253 335920
57956C35920K389J809N19j147k165k331k399k516k033j102q41j443j779j283o80
$$ 335920 338309 340118 340637 339490 337325 334994 332595 330079 328046 326944 326103 324660 322881 321598 320918
57941C20918l17M75J819K773L065L680M974N901N895N857O397O745O297N618M886
$$ 320918 320601 321076 322895 325668 328733 332413 337387 343288 349183 355040 361437 368182 374479 380097 384983
57926C84983L034l39l690n493o190o984p870q208q100p968p616o887o398o519
$$ 384983 388017 387678 383988 378495 372305 365321 357451 349243 341143 333175 325559 318672 312274 305755
57912C05755o489n529m092l036k340j624j084r20n75M85J817K611K727K502K095
$$ 305755 299266 293737 289645 286609 284269 282645 281561 280641 280066 280551 282368 284979 287706 290208 292303
57897B92303J671J521J551J294Q03P51J303J880K334L229M467M925M040K651J603
$$ 292303 293974 295495 297046 298340 299143 299894 301197 303077 305411 308640 313107 318032 322072 324723 326326
57882C26326P18j88o15n21r37k441m080m758m697m590m356l740l282l520l988
$$ 326326 327044 326856 326241 325720 324783 322342 318262 313504 308807 304217 299861 296121 292839 289319 285331
57867B85331l892l292k775k556k521k521k153j046L20J063J492K878N194O579
$$ 285331 281439 278147 275372 272816 270295 267774 265621 264575 264895 265958 267450 270328 275522 282101
57853B82101N992M866N005O078O540N908M785L500K090R93N54L64J6j46J04R8
$$ 282101 288093 292959 297964 304042 310582 316490 321275 324775 326865 327858 328412 328776 328792 328646 328750 328848
57837C28848o90j590j749j507j732k412k917l089l165l117k803k314j621n99K74
$$ 328848 328158 326568 324819 323312 321580 319168 316251 313162 309997 306880 304077 301763 300142 299543 299817
57822B99817J94n20m76O58J370N23j021k075k961m468o118o993p278p619p784
$$ 299817 300011 299491 299015 299673 301043 301566 300545 298470 295509 291041 284923 277930 270652 263033 255249
57807B55249p284o516n990n289m017k932k788l016k821k650l094l321k337r14
$$ 255249 247965 241449 235459 230170 226153 223221 220433 217417 214596 211946 208852 205531 203194 202280
57793B02280n47j105j265p71m83n37j66P84J700K398L159L786L929M040M683N363
$$ 202280 201733 200628 199363 198592 198109 197572 197406 198190 199890 202288 205447 209233 213162 217202 221885 227248
57777B27248N248M694M639M974M904M415L979L319K002P48M94O20j15j324j591
$$ 227248 232496 237190 241829 246803 251707 256122 260101 263420 265422 266170 266664 267284 267169 265845 264254
57762B64254r41o64r20o64Rk91j758k892l044l318m220m511l385j962j400j107
$$ 264254 263313 262649 261729 261065 261074 260783 259025 256133 253089 249771 245551 241040 237655 235693 234293 233186
57746B33186j27J046J461J395J628J897J489P47O61J244J513J016L73K09L05R4
$$ 233186 233059 234105 235566 236961 238589 240486 241975 242722 243383 244627 246140 247156 247529 247738 248043 248137
57730B48137m41p40m06K16M39J82J43Q12J728K199K296K448K452J755N86r9J28
$$ 248137 247696 246956 246550 246766 247205 247387 247530 248342 250070 252269 254565 257013 259465 261220 261806 261707 261835
57713B61835P05R20N52k78j234j732j451q48o35q72j180j562k173k561k114j153
$$ 261835 262540 263460 264012 263734 262500 260768 259317 258469 257834 256962 255782 254220 252047 249486 247372 246219
57697B46219o08o72q16r76j623k562k844k189j436j292j601k099k885l671l595
$$ 246219 245611 244939 244123 243147 241524 238962 236118 233929 232493 231201 229600 227501 224616 220945 217350
57682B17350k386r33j41K12R22K348M359O822R565J2226J4619J7003J9868K3630
$$ 217350 214964 214031 213890 214102 215024 217372 221731 228553 238118 250344 264963 281966 301834 325464
57668C25464K8559L4409L9850M2580M0342L1960J7976Q83j5537k8066l5605l8774
$$ 325464 354023 388432 428282 470862 511204 543164 561140 562023 546486 518420 482815 444041
57656D44041l8427l5168l0024k4493j9731j6158j3755j2155j0613q708o956n974
$$ 444041 405614 370446 340422 315929 296198 280040 266285 254130 243517 234809 227853 221879
57644B21879n286l872j768j13M22K09k89j000j570j353l90M67P67R45J341J541
$$ 221879 216593 212721 210953 210840 211262 211471 211182 210182 208612 207259 206869 207336 208103 209048 210389 211930
57628B11930J075P9r85j708j743j165q10j448k581k959k332j700j726j979j997
$$ 211930 213005 213084 212099 210391 208648 207483 206673 205225 202644 199685 197353 195653 193927 191948 189951
57613A89951j928j795j231m42l28j084j652j193k50K47L01M39O77O56K74l23j006
$$ 189951 188023 186228 184997 184555 184227 183143 181491 180298 180048 180295 180596 181035 181712 182368 182642 182319 181313
57596A81313j442j238o72o85j650k776l140k732k034j292o94o50j239j836j864
$$ 181313 179871 178633 177961 177276 175626 172850 169710 166978 164944 163652 162958 162308 161069 159233 157369
57581A57369j522j371j569j882k083k015j680j450j671j954j527m67K23L1l86
$$ 157369 155847 154476 152907 151025 148942 146927 145247 143797 142126 140172 138645 138178 138401 138432 138046
57566A38046l79l38q87j777k302k265j920j330m46M29Q50O97J67m80r97j261j389
$$ 138046 137667 137329 136442 134665 132363 130098 128178 126848 126402 126831 127681 128378 128545 128065 127068 125807 124418
57549A24418j438j058k8J006J081L02k12J69J019J894K812L479L177J991J024
$$ 124418 122980 121922 121894 122900 123981 124283 124071 124240 125259 127153 129965 133444 136621 138612 139636
57534A39636Q02N38l48j159j292j527k749m236m584l812l197l285l297k593j642
$$ 139636 140438 140976 140628 139469 138177 136650 133901 129665 125081 121269 118072 114787 111490 108897 107255
57519A07255j315j830k606k783j884k86J029J436J244J178J679K799M264N376
$$ 107255 105940 104110 101504 98721 96837 96551 97580 99016 100260 101438 103117 105916 110180 115556
57505A15556N423M528L582L060K559J812J347J556J846J375J19j334k474k861
$$ 115556 120979 125507 129089 132149 134708 136520 137867 139423 141269 142644 142763 141429 138955 136094
57491A36094k153q16j50q03j808j807p59L03P03M75k11j093j625j461r93p79p94
$$ 136094 133941 133125 132975 132172 130364 128557 127798 128101 128804 129279 129068 127975 126350 124889 123896 123117 122323
57474A22323p41o83p27m97L26J280J603J170M53p9o8O82J684J921J143L38L04
$$ 122323 121582 120899 120172 119675 120001 121281 122884 124054 124507 124428 124360 125042 126726 128647 129790 130128 130432
57457A30432M78P7l98m4P90J022O04M35O69N57k3k02M29J106J035M38K2Q5M11
$$ 130432 130910 130987 130589 130545 131335 132357 132961 133396 134065 134622 134599 134397 134826 135932 136967 137405 137427 137512 137923
57438A37923N79K30m94q03r3J137J766J377N59j4j44J74Q84J649K080K226K372
$$ 137923 138502 138732 138238 137435 137342 138479 140245 141622 142181 142167 142023 142197 143081 144730 146810 149036 151408
57421A51408K451K164J555R09K87k77l62L00J039R34J88n9O07J272J014Q5n88
$$ 151408 153859 156023 157578 158487 158774 158497 158135 158435 159474 160408 160596 160537 161144 162416 163430 163515 162927
57404A62927n22O3P14J087J079Q00M15N0l5M74J380J863J411N76K51M83O03L10
$$ 162927 162405 162468 163182 164269 165348 166148 166563 166613 166578 167052 168432 170295 171706 172282 172533 173016 173619 173929
57386A73929l3j09k8K6R7M20J308K759L916L572J729N0r9O39P66J52j44J57K24
$$ 173929 173896 173787 173759 173785 173882 174302 175610 178369 182285 185857 187586 187636 187537 188176 188942 189094 188950 189107 189331
57367A89331k12l78J54Q01J062J233J575J757J522J124P51L20J12P67K166L162
$$ 189331 189119 188741 188895 189696 190758 191991 193566 195323 196845 197969 198720 199040 199152 199919 202085 205247
57351B05247K930J934J198J206J868K858L566L398K597K160K540L006K690J732
$$ 205247 208177 210111 211309 212515 214383 217241 220807 224205 226802 228962 231502 234508 237198 238930
57337B38930R12P11J128J860K380K239J724J597J971K044J342N27M53J011J493
$$ 238930 239842 240553 241681 243541 245921 248160 249884 251481 253452 255496 256838 257365 257818 258829 260322
57322B60322J635J635J622J611J723J939J970J794J904K543L160L148K758K702
$$ 260322 261957 263592 265214 266825 268548 270487 272457 274251 276155 278698 281858 285006 287764 290466
57308B90466L110L572L849L952L693K912K129K219L267M273M297L587L255L983
$$ 290466 293576 297148 300997 304949 308642 311554 313683 315902 319169 323442 327739 331326 334581 338564
57294C38564N213N701M839L324K399K588L484M604N845O968P365O887O364O633
$$ 338564 343777 349478 354317 357641 360040 362628 366112 370716 376561 383529 390894 397781 404145 410778
57280D10778P321P328O452N742O069O963P282O656N758N280N146M881M448M299
$$ 410778 418099 425427 431879 437621 443690 450653 457935 464591 470349 475629 480775 485656 490104 494403
57266D94403M646N053M928M260L587L309L352L497L711M048M459M824N001M828
$$ 494403 499049 504102 509030 513290 516877 520186 523538 527035 530746 534794 539253 544077 549078 553906
57252E53906M299L808L964M908O035O627O603O478O654P064P497P954Q533R129
$$ 553906 558205 562013 565977 570885 576920 583547 590150 596628 603282 610346 617843 625797 634330 643459
57238F43459R483R492R340R244R268R425R768J0222J0456J0252R911R948J0415
$$ 643459 652942 662434 671774 681018 690286 699711 709479 719701 730157 740409 750320 760268 770683
57225G70683J0876J1114J1465J2261J3289J4021J4168J3786J3214J2995J3493
$$ 770683 781559 792673 804138 816399 829688 843709 857877 871663 884877 897872 911365
57214I11365J4356J4737J4368J4004J4441J5517J6486J7025J7364J7705J8059
$$ 911365 925721 940458 954826 968830 983271 998788 1015274 1032299 1049663 1067368 1085427
57203A085427J8481J8958J9219J9144J9065J9239J9289J8774J8128J8303J9539
$$ 1085427 1103908 1122866 1142085 1161229 1180294 1199533 1218822 1237596 1255724 1274027 1293566
57192A293566K1081K2187K2792K3127K3217K3040K2750K2608K2809K3457K4431
$$ 1293566 1314647 1336834 1359626 1382753 1405970 1429010 1451760 1474368 1497177 1520634 1545065
57181A545065K5347K5888K6121K6324K6631K7021K7396K7466K6872K5715K4563
$$ 1545065 1570412 1596300 1622421 1648745 1675376 1702397 1729793 1757259 1784131 1809846 1834409
57170A834409K3715K2843K1706K0619J9782J8879J7980J8064J9671K1631K2277
$$ 1834409 1858124 1880967 1902673 1923292 1943074 1961953 1979933 1997997 2017668 2039299 2061576
57159B061576K1529K0684K0498K0740K1316K2371K3218K2703K1039J9979K0592
$$ 2061576 2083105 2103789 2124287 2145027 2166343 2188714 2211932 2234635 2255674 2275653 2296245
57148B296245K1960K2653K2421K1748K0709J9207J7778J7229J7725J8755J9710
$$ 2296245 2318205 2340858 2363279 2385027 2405736 2424943 2442721 2459950 2477675 2496430 2516140
57137B516140K0133J9838J9176J8839J9101J9501J9539J9207J8625J7612J5964
$$ 2516140 2536273 2556111 2575287 2594126 2613227 2632728 2652267 2671474 2690099 2707711 2723675
57126B723675J3865J1722R971R073R385J0826J3028J5934J9774K4423K9263L3840
$$ 2723675 2737540 2749262 2759233 2768306 2777691 2788517 2801545 2817479 2837253 2861676 2890939 2924779
57114B924779L8178M2397M6503N0699N5494O1366O8696P7958Q9566J03571J19995
$$ 2924779 2962957 3005354 3051857 3102556 3158050 3219416 3288112 3366070 3455636 3559207 3679202
57103C679202J39232J61657J87190K16243K50938K94475L49118M15373M92782
$$ 3679202 3818434 3980091 4167281 4383524 4634462 4928937 5278055 5693428 6186210
57094F186210N80465O76793P79438Q85746R92144J093318J183043J255986J307791
$$ 6186210 6766675 7443468 8222906 9108652 10100796 11194114 12377157 13633143 14940934
57085A4940934J333331J325312J273657J165632R90137P48408M63671J77172p0582
$$ 14940934 16274265 17599577 18873234 20038866 21029003 21777411 22241082 22418254 22347672
57076B2347672k58716l90915m87057n71216o61913p65843q77138r83132j071827
$$ 22347672 22088956 21698041 21210984 20639768 19977855 19212012 18334874 17351742 16279915
57067A6279915j135179j168581j170787j144759j096622j032805r58575q78513
$$ 16279915 15144736 13976155 12805368 11660609 10563987 9531182 8572607 7694094
57059G694094p96775p16414o39354n67084n00734m40701l86966l39666k98761
$$ 7694094 6897319 6180905 5541551 4974467 4473733 4033032 3646066 3306400 3007639
57050C007639k63496k32975k06830j84730j65740j49075j34783j22722j11557
$$ 3007639 2744143 2511168 2304338 2119608 1953868 1804793 1670010 1547288 1435731
57041A435731r9947q8326p8110o9476o1146n2078m1884k9950j6109k827M820K676
$$ 1435731 1335784 1247458 1169348 1099872 1038726 986648 944764 914814 898705 895878 900698 903374
57029I03374r123k6294m3221n5664o2068o3358o1443n7697n2699m6959m1100l5442
$$ 903374 894251 867957 824736 769072 707004 643646 582203 524506 471807 424848 383748 348306
57017C48306l0022k5117k1141j8063j5411j2857j0397q157o421n676o023o776
$$ 348306 318284 293167 272026 253963 238552 225695 215298 207141 200720 195044 189021 182245
57005A82245p183p212p167o962o473o154o456o961p003o776o871p064o600n537
$$ 182245 175062 167850 160683 153721 147248 141094 134638 127677 120674 113898 107027 99963 93363 87826
56991H7826m623l986l000j505k6J309L022N249P435R155J0271J0112P729L396
$$ 87826 83203 79217 76217 74712 74686 75995 79017 84266 91701 100856 111127 121239 128968 132364
56977A32364j132m362o249p245p262o274n102m634m627m041k421l68J271K275
$$ 132364 131232 126870 120621 113376 106114 99840 94738 90104 85477 81436 79015 78647 79918 82193
56963H2193L135M514O640R187J1755J4203J6386J7805J7893J6332J2792O913p96
$$ 82193 85328 89842 96482 105669 117424 131627 148013 165818 183711 200043 212835 219748 218952
56950B18952q370j3667j6119j6670j6216j4921j2882j0414p644m608j801K34J872
$$ 218952 210582 196915 180796 164126 147910 132989 120107 109693 102049 97441 95640 95874 97746
56937I7746M091P091J0042J2412J4630J7339K0574K3769K5670K4377J8611R315
$$ 97746 101837 108928 118970 131382 146012 163351 183925 207694 233364 257741 276352 285667
56925B85667q26r640j6413k0789k2254k1219j9305j7686j6009j3660j1115r211
$$ 285667 284841 275201 258788 237999 215745 194526 175221 157535 141526 127866 116751 107540
56913A07540p951o841n887n263m600l443k058j082o01k11L23R99J828K716L387
$$ 107540 99589 92748 86861 81598 76998 73555 71497 70415 69814 69603 69926 70925 72753 75469 78856
56898G8856L898M730N945O832P034P392Q882J1113J2840J3731J4721J6574J8928
$$ 78856 82754 87484 93429 100261 107295 114687 123569 134682 147522 161253 175974 192548 211476
56885B11476K0820K1408J9933J5779R258K023l882p589r786j1453j2532j2168
$$ 211476 232296 253704 273637 289416 298674 300697 296815 289226 279440 267987 255455 243287
56873B43287j0139p446n118k951l0L841P979J2001J6265K0988K5836L0713L6162
$$ 243287 233148 225702 220584 217633 217603 221444 229423 241424 257689 278677 304513 335226 371388
56860C71388M2297M7804N0454M8393M0693K7522J0594o799k1132l0419l4672l5027
$$ 371388 413685 461489 511943 560336 601029 628551 639145 632346 611214 580795 546123 511096
56848E11096l2727k8769k3791j8099j1856n295J360Q131J5256K2967L1251L9846
$$ 511096 478369 449600 425809 407710 395854 390559 391919 400050 415306 438273 469524 509370
56836E09370M8596N7814O7823P7530Q3637Q1863O9481M6892J7423j3699m0761
$$ 509370 557966 615780 683603 761133 844770 926633 996114 1043006 1060429 1046730 1005969
56825A005969n9509o8879p0749o7933o2462n5448m7545l9111l0375k1730j3531
$$ 1005969 946460 877581 806832 738899 676437 620989 573444 534333 503958 482228 468697
56814D68697n562K707J1219J9371K7065L4998M3492N1523N7017N7538N0750L5493
$$ 468697 463135 465842 477061 496432 523497 558495 601987 653510 710527 768065 818815 854308
56802H54308J3385j1061l2727m8373n7193n9943n8226n3853m8094m1495l4576
$$ 854308 867693 856632 823905 775532 718339 658396 600170 546317 498223 456728 422152
56791D22152k8125k2474j7188j1961p162k893J771P676J4214J9933K4183K7209
$$ 422152 394027 371553 354365 342404 335242 332349 334120 341796 356010 375943 400126 427335
56779D27335K8673K7064K0951J0451k553j5265k5223l1373l4260l5052l4449l2564
$$ 427335 456008 483072 504023 514474 511921 496656 471433 440060 405800 370748 336299 303735
56767C03735k9533k5787k1800j8012j4900j2807j1611j0753r645q093o492n569
$$ 303735 274202 248415 226615 208603 193703 180896 169285 158532 148887 140794 134302 128733
56755A28733n629o043n852m943m121l952m061l828l213k538j957j535j406j452
$$ 128733 123104 117061 111209 106266 102145 98193 94132 90304 87091 84553 82596 81061 79655 78203
56741G8203j209n19J09J98LK8K58L34J89L3j22l48m23j5P22J188J038O34O38J221
$$ 78203 76994 76475 76584 76782 76785 76813 77071 77405 77594 77627 77505 77157 76734 76719 77441 78629 79667 80301 80939 82160
56721H2160J719J316J89m57J55J267J667J441J603K155J897M59q45q25K6N63N75
$$ 82160 83879 85195 85384 84927 85082 86349 88016 89457 91060 93215 95112 95571 94726 93901 93927 94490 95065
56704I5065M74K61j53l16N6L08k11r68j070p59r24j503j565q88k92k78l72J8Q12
$$ 95065 95539 95800 95647 95331 95387 95695 95484 94516 93446 92687 91763 90260 88695 87807 87515 87237 86865 86883 87695
56685H7695J528J697J058m4n58K53J718K456K125J700J879K148J695O34j85j22
$$ 87695 89223 90920 91978 91934 91376 91629 93347 95803 97928 99628 101507 103655 105350 105984 105799 105677
56669A05677P78J977K834K976K468J607O73jM2J027K635M297N587O172N804M767
$$ 105677 106455 108432 111266 114242 116710 118317 118990 118989 119031 120058 122693 126990 132577 138749 144553 149320
56653A49320L981M071M691N176N441N635N379M231K668J693J485J299O83j1n16
$$ 149320 153301 157372 162063 167239 172680 178315 183694 187925 190593 192286 193771 195070 195753 195742 195226
56638A95226j176k307l626m669n353n831o109o080n673m890l924l208l092l371
$$ 195226 194050 191743 188117 183448 178095 172264 166155 160075 154402 149512 145588 142380 139288 135917
56624A35917l487l220k867k776k947l117k974k371j547j099j384k012k200j617
$$ 135917 132430 129210 126343 123567 120620 117503 114529 112158 110611 109512 108128 106116 103916 102299
56610A02299p29l36q40j772k043j030M75R81J49o38p1J400K309K068J299O62K64
$$ 102299 101570 101234 100394 98622 96579 95549 96024 97005 97154 96516 96445 97845 100154 102222 103521 104183 104447
56593A04447J20L05N74N01J45%K35N04N57N57P15R80J235J470J699J912K101K145
$$ 104447 104567 104872 105446 105947 106092 106092 106327 106831 107388 107945 108660 109640 110875 112345 114044 115956 118057 120202
56575A20202J917J562J425J468J216O31M19J017J785J921J710K082L181M255M827
$$ 120202 122119 123681 125106 126574 127790 128421 128840 129857 131642 133563 135273 137355 140536 144791 149618
56560A49618N192N648N965N810N205M438L798L432L260L118L062L240L347K729
$$ 149618 154810 160458 166423 172233 177438 181876 185674 189106 192366 195484 198546 201786 205133 207862
56546B07862J367J71q3L54P87R00O01k32j252j639j280j181j999k995l285l250
$$ 207862 209229 209400 209317 209671 210458 211358 211959 211727 210475 208836 207556 206375 204376 201381 198096 194846
56530A94846l599l991l857l781m494n222m683l330k773l226l317k435j478j046
$$ 194846 191247 187256 183399 179618 175124 169902 165219 161889 159116 155890 152573 150138 148660 147614
56516A47614o46j16j40p89j027l94J58k12j012j410j373j102m14O26J276J138
$$ 147614 146968 146852 146712 145923 144896 144502 144660 144448 143436 142026 140653 139551 139137 139763 141039 142177
56500A42177Q01Q31Q99N60J13K2K6l70r85j161o35K10P53N96j26p69q03l51K12
$$ 142177 142978 143809 144708 145268 145381 145403 145429 145059 144074 142913 142278 142488 143241 143837 143711 142942 142139 141788 142000
56481A42000Q10J336J200J27r61r50j37K84J28K40P35P39O1l97k93m07j066j389
$$ 142000 142810 144146 145346 145473 144512 143562 143425 143709 143837 144077 144812 145551 145612 145215 144922 144515 143449 142060
56463A42060p65J57O44Q64J077R73N55M70Q10P13j11o37j15P08Q60N65M88N69
$$ 142060 141295 141452 142096 142960 144037 145010 145565 146035 146845 147558 147447 146810 146695 147403 148263 148828 149316 149885
56445A49885O08R76J738K036J391P49J094J860J908J261O69J40o95j343r52J32
$$ 149885 150493 151469 153207 155243 156634 157383 158477 160337 162245 163506 164175 164315 163620 162277 161325 161457
56429A61457O32O6p51r39m52K21N47K31m43p52m23M0L06Q64K033L028K867J739
$$ 161457 162089 162155 161404 160465 160013 160234 160781 161012 160569 159817 159394 159434 159740 160604 162637 165665 168532 170271
56411A70271O05q0m33l78J92P47N37l62j190j516j472j200p64m38m89p28o94j84
$$ 170271 170876 170796 170363 169985 170177 170924 171461 171099 169909 168393 166921 165721 164957 164519 164030 163302 162608 162424
56393A62424P07J706K294K001J202J021J915K922K922K116J598J858K392K503
$$ 162424 163131 164837 167131 169132 170334 171355 173270 176192 179114 181230 182828 184686 187078 189581
56379A89581J927R39K37K72M98j00j417k075j318j02M64P28J598K931L920M305
$$ 189581 191508 192447 192684 192956 193454 193354 191937 189862 188544 188442 188906 189634 191232 194163 198083 202388
56363B02388M172L223J506K13L88J295J436Q08O79J302J499P59J94Q31K063K559
$$ 202388 206560 209783 211289 211502 211890 213185 214621 215429 216108 217410 218909 219668 219862 220693 222756 225315
56347B25315K025J224P59N09J48k51l55j03J43J55K51P72J349J320Q30O62Q93
$$ 225315 227340 228564 229323 229832 229980 229729 229374 229271 229414 229569 229820 230592 231941 233261 234091 234753 235646
56330B35646P27m0m37J74J013J085O49N69R21J160J192J346J702K087K377K256
$$ 235646 236373 236333 235896 236070 237083 238168 238817 239386 240307 241467 242659 244005 245707 247794 250171 252427
56314B52427J278k45j067m43R27J972K490K629K189J341J138K109L168L091K351
$$ 252427 253705 253460 252393 251950 252877 254849 257339 259968 262157 263498 264636 266745 269913 273004 275355
56299B75355K260K919L432L573L895M434M664M518M399M406M480M962N998O801
$$ 275355 277615 280534 283966 287539 291434 295868 300532 305050 309449 313855 318335 323297 329295 336096
56285C36096O527N585N005N074N468O151P012P277O627O243P313R054R812R659
$$ 336096 342623 348208 353213 358287 363755 369906 376918 384195 390822 397065 404378 413432 423244 432903
56271D32903J0198J1925J3576J4184J4269J4693J5595J6802J8225J9627K0877
$$ 432903 443101 455026 468602 482786 497055 511748 527343 544145 562370 581997 602874
56260F02874K2430K4836K7951L1397L5386M0160M5250N0326N6128O3238P0726
$$ 602874 625304 650140 678091 709488 744874 785034 830284 880610 936738 999976 1070702
56249A070702P7510Q4309R2375J00886J07739J12665J17317J22089J25048J24457
$$ 1070702 1148212 1232521 1324896 1425782 1533521 1646186 1763503 1885592 2010640 2135097
56239B135097J20464J13699J04006R1251P5930N8294L8292J6802m395k4332m3205
$$ 2135097 2255561 2369260 2473266 2564517 2640447 2698741 2737033 2753835 2749440 2725108 2681903
56228B681903o0582p4962q5667r3753j00253j04788j06718j06478j04941j02383
$$ 2681903 2621321 2546359 2460692 2366939 2266686 2161898 2055180 1948702 1843761 1741378
56218A741378r8794r4435q9517q4017p8235p2783o7809o2984n8274n3819m9226
$$ 1741378 1642584 1548149 1458632 1374615 1296380 1223597 1155788 1092804 1034530 980711 931485
56207I31485m4105l9226l5790l3451l0607k6760k3101k0478j8350j6257j4684
$$ 931485 887380 848154 812364 778913 748306 721546 698445 677967 659617 643360 628676
56196F28676j3822j2879j1400j0007r153q248o775n197m121l510l200l196l074
$$ 628676 614854 601975 590575 580568 571415 563167 556392 551195 547074 543564 540364 537168 534094
56183E34094k200r53n47j197j688j288p90r89j354r92M7J163K072K704K978L107
$$ 534094 531894 530941 530394 529197 527509 526221 525431 524442 523088 522096 522143 523306 525378 528082 531060 534167
56167E34167L402L668L637L890N137O620O800N777N389O552Q186R301J0339J1693
$$ 534167 537569 541237 544874 548764 553901 560521 567321 573098 578487 585039 593225 602526 612865 624558
56153F24558J2641J2826J3350J5224J7823K0090K2221K5186K9361L4512M0530
$$ 624558 637199 650025 663375 678599 696422 716512 738733 763919 793280 827792 868322
56142H68322M7354N4723O2394O9868P5799P8533P7517P3296O6300N6971M7102
$$ 868322 915676 970399 1032793 1102661 1178460 1256993 1334510 1407806 1474106 1531077 1578179
56131A578179L9345L4939L3052L2469L2274L0787K5990J7862Q768Q34n581j0519
$$ 1578179 1617524 1652463 1685515 1717984 1750258 1781045 1807035 1824897 1833665 1834499 1828918 1818399
56119A818399j3602j5576j8886k5496l5156m6404n7740o7231p2749p3677p1287
$$ 1818399 1804797 1789221 1770335 1744839 1709683 1663279 1605539 1538308 1465559 1391882 1320595
56108A320595o6801o0425n2681m4908l7807l1088k5015k0490j7135j3419r266
$$ 1320595 1253794 1193369 1140688 1095780 1057973 1026885 1001870 981380 964245 950826 941560
56097I41560o446n515m705k835j006k33L58J611K771L324M293O157P496P317O840
$$ 941560 935114 929599 924894 922059 921053 920820 921178 922789 925560 928884 933177 939334 946830 954147 960987
56082I60987P386Q355Q823R357J0531J1480J1563J1774J2883J3852J3675J3128
$$ 960987 968373 976728 985551 994908 1005439 1016919 1028482 1040256 1053139 1066991 1080666 1093794
56070A093794J3242J3741J4337J5654J7445J7984J6749J5643J6022J6746J6810
$$ 1093794 1107036 1120777 1135114 1150768 1168213 1186197 1202946 1218589 1234611 1251357 1268167
56059A268167J7419J9438K1221K1216K0623K1118K2047K2153K2045K2585K2813
$$ 1268167 1285586 1305024 1326245 1347461 1368084 1389202 1411249 1433402 1455447 1478032 1500845
56048A500845K1888K1144K1847K2850K2842K2981K4717K7016K8213K8800K9854
$$ 1500845 1522733 1543877 1565724 1588574 1611416 1634397 1659114 1686130 1714343 1743143 1772997
56037A772997L0710L0672L1079L3043L5148L6013L6986L9629M2679M4372M5534
$$ 1772997 1803707 1834379 1865458 1898501 1933649 1969662 2006648 2046277 2088956 2133328 2178862
56026B178862M7453M8984M8931M9068N1415N4644N6557N8070O1212O5194O8080
$$ 2178862 2226315 2275299 2324230 2373298 2424713 2479357 2535914 2593984 2655196 2720390 2788470
56015B788470P0495P4100P8153Q1148Q4034Q8347R3002R6368R9526J04060J08886
$$ 2788470 2858965 2933065 3011218 3092366 3176400 3264747 3357749 3454117 3553643 3657703 3766589
56004C766589J12835J17850J25730J34181J40206J45034J51478J59003J65768
$$ 3766589 3879424 3997274 4123004 4257185 4397391 4542425 4693903 4852906 5018674
55995E018674J73007J82764J93802K04304K16068K31350K48328K64455K81352
$$ 5018674 5191681 5374445 5568247 5772551 5988619 6219969 6468297 6732752 7014104
55986G014104L01430L23047L44291L67999L97302M29926M62878M98892N41821
$$ 7014104 7315534 7638581 7982872 8350871 8748173 9178099 9640977 10139869 10681690
55977A0681690N89828O40026O95519P60610Q33813R13483J005284J115561J242853
$$ 10681690 11271518 11911544 12607063 13367673 14201486 15114969 16120253 17235814 18478667
55968A8478667J385344J550942J749853J983815K254082K573191K956525L410529
$$ 18478667 19864011 21414953 23164806 25148621 27402703 29975894 32932419 36342948
55960C6342948L944424M586128N372245O333818P510720Q964940J0749890J2873194
$$ 36342948 40287372 44873500 50245745 56579563 64090283 73055223 83805113 96678307
55952I6678307J5316937J8086870K1215882K4729418K8599193L2586875L5915907
$$ 96678307 111995244 130082114 151297996 176027414 204626607 237213482 273129389
55945B73129389L7073292L4246984K6408034J4244739P4224j3259185k3617707
$$ 273129389 310202681 344449665 370857699 385102438 385176662 371917477 348299770
55938C48299770l0126858l2994014l3026157l1199246k8374044k5163525k1942477
$$ 348299770 318172912 285178898 252152741 220953495 192579451 167415926 145473449
55931A45473449j8926437j6228256j3880399j1864752j0150199q704622p487027
$$ 145473449 126547012 110318756 96438357 84573605 74423406 65718784 58231757
55924E8231757o453410n573246m828050m196730l655619l190439k795042k459285
$$ 58231757 51778347 46205101 41377051 37180321 33524702 30334263 27539221 25079936
55916B5079936k169023j916535j700342j515497j353418j210280j086815r80546
$$ 25079936 22910913 20994378 19294036 17778539 16425121 15214841 14128026 13147480
55908A3147480q86080q01986p29861o67586o10557n58353n13374m74078m36288
$$ 13147480 12261400 11459414 10729553 10061967 9451410 8893057 8379683 7905605 7469317
55899G469317m00008l68397l40986l14275k88203k65778k46874k28317k09650
$$ 7469317 7069309 6700912 6359926 6045651 5757448 5491670 5244796 5016479 4806829
55890D806829j93331j79729j67255j56884j51120j48686j45302j39660j33941
$$ 4806829 4613498 4433769 4266514 4109630 3958510 3809824 3664522 3524862 3390921
55881C390921j28794j22485j14965j08156j02179r5468q8661q4209q2094p9804
$$ 3390921 3262127 3139642 3024677 2916521 2814342 2718874 2630213 2546004 2463910 2384106
55871B384106p6518p3619p1225o7883o3706o0314n7749n4712n1489m9399m7810
$$ 2384106 2307588 2233969 2162744 2094861 2031155 1970841 1913092 1858380 1806891 1757492 1709682
55860A709682m5140m2173m0846m0365l8285l4997l3212l3153l2269k9844k7997
$$ 1709682 1664542 1622369 1581523 1541158 1502873 1467876 1434664 1401511 1369242 1339398 1311401
55849A311401k7606k7004k5440k4541k5396k7026k8402k9328k9081k6837k3765
$$ 1311401 1283795 1256791 1231351 1206810 1181414 1154388 1125986 1096658 1067577 1040740 1016975
55838A016975k2037k1598k0566j8745j7830j8022j7583j6042j4867j4528j3786
$$ 1016975 994938 973340 952774 934029 916199 898177 880594 864552 849685 835157 821371
55827H21371j2403j1621j1417j0287q374p944r796j1965j2956j3591j4586j4917
$$ 821371 808968 797347 785930 775643 767269 759325 749529 737564 724608 711017 696431 681514
55815F81514j3849j2443j1707j1176j0311r462q582o892m680l542l915m185l140
$$ 681514 667665 655222 643515 632339 622028 612566 603984 597092 592412 588870 584955 580770 577630
55802E77630j505k74P41J788K310K141K019K107J496j26j749k692l399l978l541
$$ 577630 576125 575851 576592 578380 580690 582831 584850 586957 588453 588327 586578 583886 580487 576509 572968
55787E72968j896m07l93j851m354p782j1499j4150j5013j4563j3284j1143q527
$$ 572968 571072 570665 570272 568421 564067 556285 544786 530636 515623 501060 487776 476633 468106
55774D68106o303m473k140P03K657K599O66k670p004j1134j3277j2869j1034r024
$$ 468106 461803 457330 455190 455893 458550 461149 461815 459145 452141 441007 427730 414861 403827 394803
55760C94803p310o242n997n752m488k907k862m694o835q295r546j0545j0076p863
$$ 394803 387493 381251 375254 369502 365014 362107 359245 354551 347716 339421 329875 319330 309254 301391
55746C01391n444l960k904j858j625k459l011k332j439j563k293k704l014l654
$$ 301391 295947 291987 289083 287225 285600 283141 280130 277798 276359 274796 272503 269799 266785 263131
55732B63131l951l148j859j233j403j838k413l148l675l833m069m422m137k974
$$ 263131 259180 256032 254173 252940 251537 249699 247286 244138 240463 236630 232561 228139 224002 221028
55718B21028j893j537j163OJ374K039K322L035L959M184L446K155O89n44r30l62
$$ 221028 219135 217598 216435 216441 217815 219854 222176 225211 229170 233354 236800 238955 239644 239100 238170 237808
55702B37808L84N44R3q23k299l986m960m963m859n224n415m794l789k977k088
$$ 237808 238192 238736 238829 238006 235707 231721 226761 221798 216939 211715 206300 201506 197717 194740 192652
55687A92652q95p5j56m55j04O36J022J087J252J469J607J932K298J727j93k252
$$ 192652 191757 191682 191526 191071 190967 191603 192625 193712 194964 196433 198040 199972 202270 203997 203804 201552
55671B01552l028k662k178j865j427j099j228j285n40O11J117Q18L90R3l66q78
$$ 201552 198524 195862 193684 191819 190392 189293 188065 186780 186240 186851 187968 188786 189176 189269 188903 188025
55655A88025q77k49N65J215J604J548J016M59L35M59L72Jn60j413k470l180l279
$$ 188025 187148 186899 187464 188679 190283 191831 192847 193306 193641 194100 194472 194473 193913 192500 190030 186850 183571
55638A83571l302l748m297m412m154l765l187k624k775l667m126l355k214j791
$$ 183571 180269 176521 172224 167812 163658 159893 156706 154082 151307 147640 143514 140159 137945 136154
55624A36154j611o10P75J148L49l96n04o17j135j519j384j146j173j303j436j800
$$ 136154 134543 133933 134708 135856 136205 135809 135305 134688 133553 132034 130650 129504 128331 127028 125592 123792
55608A23792k304k425k048j741j934k333k386j888j061l71k30n54p10l39J09R7
$$ 123792 121488 119063 117015 115274 113340 111007 108621 106733 105672 105301 105071 104517 103807 103468 103577 103674
55592A03674j00O2L90K10n07j106j215j013p10m03l13m10q8J002K040J935R55
$$ 103674 103574 103636 104026 104236 103729 102623 101408 100395 99685 99282 98969 98559 98471 99473 101513 103448 104403
55575A04403N21J338K729L811M353M328L586K412J546J247R29J02r03j479j547
$$ 104403 104924 106262 108991 112802 117155 121483 125069 127481 129027 130274 131203 131305 130402 128923 127376
55560A27376j513j811k612l661m314m067l160k306j895j885k269l024l611l301
$$ 127376 125863 124052 121440 117779 113465 109398 106238 103932 102037 100152 97883 94859 91248 87947
55546H7947k120q68p9M78J101J617J759J581J186N36j97n22k07L52N96M40J83
$$ 87947 85827 84959 84880 85358 86459 88076 89835 91416 92602 93138 92941 92419 92212 92564 93160 93600 93783
55529I3783K7j34n31j262k065k443k186j700j615k076k692l051l043k792k584
$$ 93783 93810 93676 93145 91883 89818 87375 85189 83489 81874 79798 77106 74055 71012 68220 65636
55514F5636k729l203l510l195k406j616r67k21P74J872K788L209K912K093J352
$$ 65636 62907 59704 56194 52999 50593 48977 48010 47789 48563 50435 53223 56432 59344 61437 62789
55499F2789J049R11N88K10N8J06L42J017J974K233J126m71j061m93o2n41j105
$$ 62789 63838 64749 65337 65547 65605 65711 66053 67070 69044 71277 72403 71932 70871 70378 70316 69775 68670
55482F8670o01Q46J964J727L19j018j127j12P59O40K36P38J999K626J859M16o72
$$ 68670 68069 68915 70879 72606 72925 71907 70780 70668 71427 72067 72303 73041 75040 77666 79525 79941 79269
55465G9269j231j621j926j890j335l97M33N22j69p29k54Q77J334N66n61r46n06
$$ 79269 78038 76417 74491 72601 71266 70869 71302 71824 71655 70926 70672 71549 72883 73449 72888 71942 71436
55448G1436N7J35l95j169j540j120k99K30M27Q30J499J744J108L9p43j007q87
$$ 71436 71493 71628 71233 70064 68524 67404 67105 67335 67762 68592 70091 71835 72943 72982 72239 71232 70345
55431G0345n29r2K18L63L82J22n01r82o63K37P84O31M82Q83J424J568J512J677
$$ 70345 69816 69724 69942 70305 70687 70809 70308 69326 68663 68900 69684 70315 70797 71680 73104 74672 76184 77861
55413G7861J915J810J324N71n83k038k993k709j574p70r34j589j953j790j354
$$ 77861 79776 81586 82910 83481 82898 80860 77867 75158 73584 72814 71880 70291 68338 66548 65194
55398F5194q83l81J90O31N82oo38p35k45M58J115J652J813J311M24j46j45k6j83
$$ 65194 64311 63930 64120 64751 65333 65327 64689 63954 63709 64167 65282 66934 68747 70058 70482 70336 70191 70165 69982
55379F9982m20m20k42o6J46M43O39N33N5p89j753k152j478l06J82k43n69j52L00
$$ 69982 69562 69142 68900 68834 68980 69423 70062 70595 70650 69861 68108 65956 64478 64172 64354 64111 63542 63390 63690
55360F3690%n58m07L22O78M02J50K60L18N1j38J43O04O88K59l53p60p41l03K59
$$ 63690 63690 63132 62725 63047 63725 64127 64277 64537 64855 64906 64768 64911 65515 66203 66462 66109 65349 64608 64305 64564
55340F4564N18K98j45m31m85n76q69j111r31m47k18m06l91L32J180J128J79n56
$$ 64564 65082 65380 65235 64804 64319 63743 62874 61763 60832 60385 60167 59761 59370 59702 60882 62010 62189 61633
55322F1633m12N7J43N2K79O06M53j34n74o35n99n83l08M02J277J807J653R05O7
$$ 61633 61221 61278 61421 61473 61752 62358 62811 62677 62103 61468 60869 60286 59978 60380 61657 63464 65117 66022 66089
55303F6089l98n72q34j061o93J92O19Q0n48j90Q25J286Q73L73K56J40k35m75l12
$$ 66089 65691 65119 64285 63224 62531 62723 63342 63422 62874 62684 63509 64795 65668 66041 66297 66437 66202 65727 65415
55284F5415j25k51m90o05p68j010q95k02N15O43L23M4k24p98j384j283m56K77
$$ 65415 65290 65039 64549 63944 63176 62166 61271 61069 61584 62227 62550 62594 62370 61572 60188 58905 58449 58726
55266E8726L58K20N61J299J693J299M24l40p15q14q35p86n10N8O76R94R84J013
$$ 58726 59084 59304 59865 61164 62857 64156 64580 64240 63525 62711 61876 61090 60580 60638 61314 62308 63292 64305
55248F4305J309J511J099J88m38k08N57J054Q59K33l06n24o73j191k144k929k782
$$ 64305 65614 67125 68224 68412 67974 67766 68323 69377 70236 70469 70163 69639 68966 67775 65631 62702 59920
55231E9920j636k64N39O07J91m31q49n49M52J234R34j16p42l88L47O61M44R9q5
$$ 59920 58284 58020 58559 59166 59357 58926 58077 57528 57980 59214 60148 60032 59290 58902 59249 59910 60354 60453 60368
55212F0368r7n9j17k46j40M36J159J363Q13qn07n10j67K99O55P63P51Q48J003
$$ 60368 60271 60212 60095 59849 59709 60145 61304 62667 63480 63472 62965 62455 62288 62587 63242 64005 64756 65604 66607
55193F6607R69P43O03O38N62J01o68j318j293l47R51J459P22l37n98k21j94o66
$$ 66607 67576 68319 68922 69560 70122 70223 69555 68237 66944 66597 67548 69007 69729 69392 68794 68573 68379 67713
55175F7713q70n53l17l43l3O48P29k05j085q45N2N07M50N70R75J153R61P10M99
$$ 67713 66843 66290 65973 65630 65597 66245 66974 66769 65684 64839 64891 65398 65848 66418 67393 68546 69507 70217 70716
55156G0716K22M3J21J05l20p07m01L53O94L71r2l50n58p52o54k53J22L57O46R13
$$ 70716 70938 70981 71102 71207 70887 70180 69779 70132 70826 71197 71105 70755 70197 69445 68791 68538 68660 69017 69663 70576
55136G0576P39%q22j116o41M07J473J917J633J229J185J104L64q04j572j678j556
$$ 70576 71315 71315 70493 69377 68736 69143 70616 72533 74166 75395 76580 77684 78048 77244 75672 73994 72438
55119G2438j383q96k28Nk44j66O35J318R25j78p48l32K56J99k09q8P71J598J631
$$ 72438 71055 70159 69931 69936 69692 69526 70161 71479 72404 72226 71478 71146 71402 71601 71392 71304 72075 73673 75304
55100G5304R76L02J1J9J74L77L49j63q43r85l93L91Q96J128R92J93q89j064P2
$$ 75304 76280 76582 76593 76612 76786 77163 77512 77349 76506 75521 75128 75519 76415 77543 78535 78728 77839 76775 76847
55081G6847J241J076Nn17j82K0l74o36j97M67O17J34o81j511j971j781j179o23
$$ 76847 78088 79164 79169 78652 78470 78490 78116 77480 77283 77750 78367 78501 77820 76309 74338 72557 71378 70755
55063G0755o3Q45J804J991J230K88j79k59j88N7L38L31J82M17R04P89o8n17L29
$$ 70755 70692 71537 73341 75332 76562 76850 76671 76412 76224 76281 76619 76950 77132 77549 78453 79242 79174 78657 78986
55044G8986J661J888N46j425k881l304k714j521m27N1rj73j32K62J129K279L080
$$ 78986 80647 82535 83081 81656 78775 75471 72757 71236 70809 70860 70851 70678 70546 70808 71937 74216 77296
55027G7296K980K070R60J81j21j03j07l93q69j203j261j180j013o59k02P9J70
$$ 77296 80276 82346 83306 83487 83366 83263 83156 82763 81894 80691 79430 78250 77237 76578 76376 76455 76625
55010G6625L23N40N40L60M27Q40J134J065J001J183J187O33j14n03o46j056j746
$$ 76625 76948 77488 78028 78388 78815 79655 80789 81854 82855 84038 85225 85858 85744 85241 84595 83539 81793
54993H1793k173j875q12P00J985K222J147n36j813k230j957j288m65K79Q97J560
$$ 81793 79620 77745 76933 77633 79618 81840 82987 82451 80638 78408 76451 75163 74698 74977 75874 77434
54977G7434K235K442J888J016N66O84Q72O80J73k48k78o2j66r03j639j334Q6J433
$$ 77434 79669 82111 83999 85015 85581 86265 87137 87817 87990 87742 87464 87402 87236 86333 84694 83360 83446 84879
54959H4879J706J233Q83P53L41m00r65j094r57o52j69K41K19j36l51k54j31k05
$$ 84879 86585 87818 88701 89454 89795 89395 88430 87336 86379 85727 85558 85799 86018 85882 85531 85277 85146 84941
54941H4941m30p08r51r51n58k0K30M0l60o14l50N92J760K240J677Q11N09O71P50
$$ 84941 84511 83803 82852 81901 81343 81323 81553 81593 81233 80619 80269 80861 82621 84861 86538 87349 87858 88529 89279
54922H9279Q91J649K787L399L312L373M024M535M108L084K363K120J702O10r39
$$ 89279 90170 91819 94606 98005 101317 104690 108714 113249 117357 120441 122804 124924 126626 127236 126297
54907A26297k332l096l143k760k442k605l293m079m234l271j504J22R06R42N85
$$ 126297 123965 120869 117726 114966 112524 109919 106626 102547 98313 95042 93538 93660 94566 95508 96093
54892I6093j53j205j940j747r78m45j49O15J804K356J738Q78Q82J578K029K008
$$ 96093 95940 94735 92795 91048 90070 89625 89476 90091 91895 94251 95989 96867 97749 99327 101356 103364
54876A03364K069K466K811K871K991L521M187M286L381J741J41q94j674k891m473
$$ 103364 105433 107899 110710 113581 116572 120093 124280 128566 131947 133688 133829 132935 131261 128370 123897
54861A23897n304m520k762j601j785k616l009k642j879j095m75k11m42r73j338
$$ 123897 118593 114073 111311 109710 107925 105309 102300 99658 97779 96684 96209 95998 95556 94583 93245
54846I3245j233q10m77m55o30p79q21p64n20RN70N94k13j317j739j070Q5P30M40
$$ 93245 92012 91202 90725 90270 89640 88861 88040 87276 86756 86765 87335 87929 87716 86399 84660 83590 83675 84405 84845
54827H4845l41q06m87L85J066R56K71p1N59J666K129J479L39n26j063j529j752
$$ 84845 84504 83698 83211 83596 84662 85618 85889 85818 86377 88043 90172 91651 91990 91464 90401 88872 87120
54810H7120j350n50m4k3N2M60O67J17q15j234q84l73k49l06jP23J327J314Q53
$$ 87120 85770 85220 85176 85153 85205 85665 86332 86449 85634 84400 83516 83143 82894 82588 82587 83310 84637 85951 86804
54791H6804N61P27R59Q14N34O97J243J449R81L80J64N1m25r84r34k44M61Q40J153
$$ 86804 87365 88092 89051 89865 90399 91096 92339 93788 94769 95149 95313 95364 94939 93955 93021 92777 93238 94078 95231
54772I5231J631K055K140J814J148M35L81J608L686N255N390M466L413K585J833
$$ 95231 96862 98917 101057 102871 104019 104454 104835 106443 110129 115384 120774 125240 128653 131238 133071
54757A33071J219R52P77O8j304k679l390l501l478l450l118k353j537j201j470
$$ 133071 134290 135242 136019 136087 134783 132104 128714 125213 121735 118285 115167 112814 111277 110076 108606
54742A08606j949k099j663q51j21K42L86O04Q24O58j9q08j233j140m87P53K121
$$ 108606 106657 104558 102895 102044 101923 102165 102551 103155 103979 104637 104618 103810 102577 101437 100950 101703 103824
54725A03824K596J751O36O80J821K673K568K364K884L555L359K272J043J00o42
$$ 103824 106420 108171 108807 109487 111308 113981 116549 118913 121797 125352 128711 130983 132026 132126 131484
54710A31484j293k003l013m052m234l222j992j615j813j631j010o26n22j42L93
$$ 131484 130191 128188 125175 121123 116889 113667 111675 110060 108247 106616 105606 104980 104458 104316 104709
54695A04709L42l15p08n12l68o55r27r47j241k140l098l483l243k459j124K59
$$ 104709 105051 104736 104028 103516 103148 102493 101566 100619 99378 97238 94140 90657 87414 84955 83831 84090
54679H4090P69L41kK87M29j98p44r2J283J892J266L73J17M22P34O98K61l53p69
$$ 84090 84859 85200 85198 85485 85914 85716 84972 84880 86163 88055 89321 89694 89811 90233 90967 91665 91926 91573 90804
54660I0804q48q23p77m17K58O58N47O36J495K374K119Q43l69j059j560j733r25
$$ 90804 89956 89133 88356 87939 88197 88855 89402 90038 91533 93907 96026 96869 96500 95441 93881 92148 91223
54643I1223O26J588J230L42o5j26m81j006j045n37q2MN1M04Q31Q60M47J25L71
$$ 91223 91849 93437 94667 95009 94944 94818 94337 93331 92286 91749 91667 91671 91722 92126 92957 93817 94264 94389 94760
54624I4760R44J142P32K51J67J33l71j075j232p93m41m85m66p7K94K57J5j10j86
$$ 94760 95704 96846 97578 97829 97996 98129 97758 96683 95451 94658 94217 93732 93266 93189 93483 93740 93755 93645 93459
54605I3459l07k39J05L44J80j11k07l12o41p07J21J525K380K089J181N06L09K75
$$ 93459 93152 92913 93018 93362 93542 93431 93224 92912 92271 91564 91685 93210 95590 97679 98860 99366 99675 99950
54587I9950Q7k85o62q11n73j5N45O92J68q61j731j705o72O73J476J400O37m78
$$ 99950 100037 99752 99090 98279 97706 97691 98236 98928 99096 98235 96504 94799 94127 94800 96276 97676 98313 97835
54569I7835j520j906j262Q4J276J685J399R23O27M89K64j73o40q05n86k03J01
$$ 97835 96315 94409 93147 93231 94507 96192 97591 98514 99141 99630 99894 99721 99081 98276 97690 97487 97588
54552I7588K54K04r5l76j30O90J368J281Q20Q46J444J845J596J117Q97Q01M80
$$ 97588 97842 98046 97951 97575 97445 98135 99503 100784 101604 102450 103894 105739 107335 108452 109349 110150 110630
54535A10630L0k15j33K77J059J942K200J408J47n87n79n01q84j487j746j406o58
$$ 110630 110660 110445 110312 110589 111648 113590 115790 117198 117345 116758 116179 115678 114794 113307 111561 110155 109497
54518A09497N9L07qm67o15n17n35o03l41J63L25M7J6O24J209R65J32m24m61m42
$$ 109497 109556 109863 109855 109388 108773 108256 107721 107118 106777 106940 107265 107312 107328 107952 109161 110126 110258 109834 109373 108931
54498A08931n16l43O6J03m25p82j95J080K089K212J528L92p98j561j491o77K23
$$ 108931 108415 108072 108138 108241 107816 107034 106839 107919 110008 112220 113748 114140 113342 111781 110290 109613 109836
54481A09836M96j0p22q26p6Q88J275J099J104J622K052J713Q18R3k21m18n52l10
$$ 109836 110332 110322 109600 108774 108698 109586 110861 111960 113064 114686 116738 118451 119269 119362 119141 118723 118171 117861
54463A17861K56N28J42m17m75o2K10J0m09o73p23o81n56k78J48O12J029J344J469
$$ 117861 118117 118645 118787 118370 117895 117833 118043 118053 117644 116971 116248 115567 115011 114733 114881 115493 116522 117866 119335
54444A19335J335J035P97P32O25J64o20j225j161n04J36K25j68n27m82k04j17
$$ 119335 120670 121705 122502 123234 123859 124023 123403 122178 121017 120513 120649 120874 120706 120179 119697 119493 119376
54427A19376l52n65m16m6J40O5N7K35K34k47q64j064q94r03j201j095JJ649K730
$$ 119376 119024 118459 118043 117997 118137 118202 118259 118494 118728 118481 117617 116553 115659 114756 113555 112460 112461 114110 116840
54408A16840K590J600N91R2J20M40Q45J232J585J877K003J805J205L13n18q29
$$ 116840 119430 121030 121621 121713 121833 122273 123118 124350 125935 127812 129815 131620 132825 133138 132620 131791
54392A31791l98M17P91J96j011j850j752j102p08q62j150j069n68O0O11J111J593
$$ 131791 131393 131810 132601 132797 131786 129936 128184 127082 126374 125512 124362 123293 122725 122785 123396 124507 126100
54375A26100J882J689R53J8n60n21p4M44J025J807K541K554J551K40j93P91K589
$$ 126100 127982 129671 130624 130642 130082 129561 129487 129931 130956 132763 135304 137858 139409 139649 139456 140247 142836
54358A42836M091M620M214L235J922L27j378k717l200k855k312k217k588k889
$$ 142836 146927 151547 155761 158996 160918 161245 159867 157150 153950 151095 148783 146566 143978 141089
54344A41089k715k272k086k344k578k138j027j00j45q70j207p48k95n74j018n81
$$ 141089 138374 136102 134016 131672 129094 126956 125929 125829 125684 124814 123607 122859 122564 121990 120972 120391
54328A20391N30R48O0j105j373j004r95j414j344l58Q48J489J598J571J367O39
$$ 120391 120921 121869 121929 120824 119451 118447 117452 116038 114694 114336 115184 116673 118271 119842 121209 121848
54312A21848m90j352j361n61M50R72O92k3l86nN62L92o13j478j281k45O64R58
$$ 121848 121358 120006 118645 118084 118534 119506 120198 120175 119789 119784 120346 120738 120125 118647 117366 117121 117785 118743
54294A18743R48R97J031Q93O57L02l88j299j757j247p8J025J640J584O78p93j737
$$ 118743 119691 120688 121719 122612 123269 123571 123183 121884 120127 118880 118802 119827 121467 123051 123729 122936 121199
54277A21199j270O5Q73O58K12K08L76L11J71J38n0m79o37j76M91R07J290J909
$$ 121199 119929 119994 120867 121525 121737 121945 122321 122632 122803 122941 122891 122412 121775 121599 122090 122997 124287 126196
54259A26196K337K061J375Q87M88k93j263j722j518j086o14O2P19Q13L32j49l10
$$ 126196 128533 130594 131969 132856 133344 133051 131788 130066 128548 127462 126848 126910 127629 128442 128774 128625 128315
54242A28315l06j13M88J151J099L00k88r2K43q3q44j209r09l86j27l52j049j815
$$ 128315 128009 127896 128384 129535 130634 130934 130646 130554 130797 130714 129870 128661 127752 127366 127239 126887 125838 124023
54224A24023k022j457n84J51P96J317J176J88p82p91k26k81j123j692j351p65
$$ 124023 122001 120544 119960 120111 120907 122224 123400 123588 122806 122015 121789 121508 120385 118693 117342 116577
54208A16577o64o41Q7J309J994J655Q06J52j58k92l21k60k15k86m15m72m25k86
$$ 116577 115913 115272 115359 116668 118662 120317 121123 121275 121117 120825 120504 120244 120029 119743 119328 118856 118431 118145
54190A18145q6J00J67J47K49N67Q52P39K43j59LO71J274J253O24j7j05K14J96
$$ 118145 118059 118159 118326 118473 118722 119289 120141 120880 121123 120964 120967 121638 122912 124165 124789 124772 124667 124881 125077
54171A25077n47j443j588q70j08N3j15j0L41L32k80r74j085n40J63O02P66P82
$$ 125077 124530 123087 121499 120629 120521 120574 120459 120449 120790 121122 120842 119868 118783 118243 118406 119008 119774 120556
54153A20556N30j72j023j250m94N76R97P41O80J262J911J952J534J174R32N81
$$ 120556 121086 120914 119891 118641 118147 118723 119720 120461 121141 122403 124314 126266 127800 128974 129906 130487
54137A30487J89o7l78r26j279q43J27P13N47J55Pj00m32p03m64J86O93O59K21
$$ 130487 130676 130609 130231 129305 128026 127183 127310 128023 128570 128725 128732 128632 128200 127497 127033 127219 127912 128571 128792
54118A28792j24mL89N00J78L3N99J485J880J706J495J296O30m06r10m56L07O90
$$ 128792 128668 128664 129053 129553 129731 129764 130363 131848 133728 135434 136929 138225 138855 138449 137539 137083 137390 138080
54100A38080Q60J152J316J105J015J607K562L130L201L193L327L666M503N845
$$ 138080 138940 140092 141408 142513 143528 145135 147697 150827 154028 157221 160548 164214 168717 174562
54086A74562O714N996L884J652n8j773l795n259n204l982k941k897l487l861l666
$$ 174562 181276 187272 191156 192808 192750 190977 187182 181923 176719 172737 169796 166899 163412 159551 155885
54071A55885l197k812k411j567k28R88J412J090N77J31m55j202j608j225k40P54
$$ 155885 152688 149876 147465 145898 145670 146658 148070 149160 149737 149868 149413 148211 146603 145378 145138 145892
54055A45892J392J786K232K868L530L949M101M242M533M713M470M007L816L920
$$ 145892 147284 149070 151302 154170 157700 161649 165750 169992 174525 179238 183708 187715 191531 195451
54041A95451L760L039K250K026K333K674K901L276L812M007L483K581J913J561
$$ 195451 199211 202250 204500 206526 208859 211533 214434 217710 221522 225529 229012 231593 233506 235067
54027B35067J092L43k20j54K87M46N8n79j152j613j947k074k144k492l124l627
$$ 235067 236159 236502 236282 236128 236415 236861 236919 236340 235188 233575 231628 229554 227410 224918 221794 218167
54011B18167l742l690l644l384k835k505k831l356l236k410j643j468j672j963
$$ 218167 214425 210735 207091 203707 200872 198367 195536 192180 188944 186534 184891 183423 181751 179788
53997A79788k436l156l742l759l202k334j302k61L88K32o26j522j752j140j62
$$ 179788 177352 174196 170454 166695 163493 161159 159857 159596 159984 160216 159590 158068 156316 155176 155014
53982A55014M60L73j29m66l30J58P13J116J266J191J014P18J50n47p66j28Q71
$$ 155014 155474 155847 155718 155252 154922 155080 155793 156909 158175 159366 160380 161098 161248 160701 159935 159807 160678
53965A60678J420J532J922K740L237L020K850L585M905N885O527P794J0088J2426
$$ 160678 162098 163630 165552 168292 171529 174549 177399 180984 185889 191774 198301 206095 216183 228609
53951B28609J3353J2240R387N444J177k479m774n690n863n858n624m803l384j811
$$ 228609 241962 254202 263589 269033 270210 267731 262957 257267 251404 245546 239922 235119 231735 229924
53937B29924m41Q04K061K979K984K164J554K146L689M829M502L056J783J555K051
$$ 229924 229483 230287 232348 235327 238311 240475 242029 244175 247864 252693 257195 260251 262034 263589 265640
53922B65640K393K270K198K742L768M673N155N543O266P209P657O910M942K533
$$ 265640 268033 270303 272501 275243 279011 283684 288839 294382 300648 307857 315514 322424 327366 329899
53908C29899P04j08k76m25q10j347k010k796l380l299k578j893j922k782m168
$$ 329899 330603 330495 330219 329794 328984 327637 325627 322831 319451 316152 313574 311681 309759 306977 302809
53893C02809n697o926p377o984o300n968o079o269o276o041n530m816m279m220
$$ 302809 297112 290186 282809 275825 269525 263557 257478 251209 244933 238892 233362 228546 224267 220047
53879B20047m362m195l791l639l629k961j439j84l34j509k331k220j850j828j851
$$ 220047 215685 211490 207699 204060 200431 197470 196031 195847 195513 194004 191673 189453 187603 185775 183924
53864A83924j474r45p35p87p86q09j096j453j454j127r03r26r21p18m48j98L4
$$ 183924 182450 181505 180770 179983 179197 178388 177292 175839 174385 173258 172355 171429 170508 169790 169342 169144 169178
53847A69178L9m26j110j417j236j053j117j066o70l70n76r63r18l57L43R63J426
$$ 169178 169217 168791 167681 166264 165028 163975 162858 161792 161122 160752 160176 159213 158295 157938 158281 159244 160670
53830A60670J490J036N04M56Q08R87P46L26p5m37m89J86J454K468K542J828J002
$$ 160670 162160 163196 163700 164156 164964 165951 166697 167023 166948 166511 166022 166208 167662 170130 172672 174500 175502
53813A75502N66O37J118J801K456K948L269L460L620L953M557N207N609N742N696
$$ 175502 176068 176705 177823 179624 182080 185028 188297 191757 195377 199330 203887 209094 214703 220445 226141
53798B26141N318M401L199K311J989J960J949J934J840J451P99K36r7m97j132
$$ 226141 231459 235860 239059 241370 243359 245319 247268 249202 251042 252493 253292 253528 253431 252934 251802
53783B51802j685j804j699j944k868m274n552o008n377m158l207k869k824k802
$$ 251802 250117 248313 246614 244670 241802 237528 231976 225968 220591 216433 213226 210357 207533 204731
53769B04731k972l413l705l420k736k141j822j651j522j376j046m86PJ30q1m26
$$ 204731 201759 198346 194641 191221 188485 186344 184522 182871 181349 179973 178927 178441 178448 178578 178497 178071
53753A78071q57j289j379q79j70K7n29j350j715j261j89Q99J460J457J279J158
$$ 178071 177214 175925 174546 173667 173497 173524 172995 171645 169930 168669 168480 169379 170839 172296 173575 174733
53737A74733R27N08K14K77M35M23M91Q87J199Q39P9j80L65J064J323J315J465
$$ 174733 175660 176168 176382 176659 177094 177517 178008 178895 180094 180933 181012 180832 181197 182261 183584 184899 186364
53720A86364J736J800J541J074N80M15R56K041K817K612J782J297J561K015J975
$$ 186364 188100 189900 191441 192515 193095 193510 194466 196507 199324 201936 203718 205015 206576 208591 210566
53705B10566J497J195J423J913K227K280K338K567K903L265L689M071M049L365
$$ 210566 212063 213258 214681 216594 218821 221101 223439 226006 228909 232174 235863 239934 243983 247348
53691B47348K293J458J181J157Q31lr39j331r54k96Lq0n6K20K55k48p56n96k4
$$ 247348 249641 251099 252280 253437 254268 254265 253326 251995 251041 250745 250748 250668 250612 250832 251087 250839 250083 249487 249463
53672B49463Q0n43j163j032k40N20O39j4j031j633j311m39O5j51n26m25J5J87
$$ 249463 249543 249000 247837 246805 246565 247085 247724 247710 246679 245046 243735 243296 243361 243210 242684 242259 242274 242461
53654B42461j52o60p90k29Q47J709J607O65n9K12R54J033K82j61O38K138K872
$$ 242461 242309 241649 240859 240630 241477 243186 244793 245458 245399 245611 246565 247598 247880 247719 248357 250495 253367
53637B53367K190R70N49J222K091K271J937J967K797L969M735M820M479M046L632
$$ 253367 255557 256527 257076 258298 260389 262660 264597 266564 269361 273330 278065 282885 287364 291410 295042
53622B95042L198K717K298K063J983J891J790J941K478L034L044K432J660J162
$$ 295042 298240 300957 303255 305318 307301 309192 310982 312923 315401 318435 321479 323911 325571 326733
53608C26733J064J371K068K906L539L955M369M648M293L260K186J496Q46p0p06
$$ 326733 327797 329168 331236 334142 337681 341636 346005 350653 354946 358206 360392 361888 362734 362664 361958
53593C61958l82N86J211J115O88J58o43j510j749j269r99j672k753l137k596j910
$$ 361958 361576 362162 363373 364488 365176 365334 364691 363181 361432 360163 359164 357492 354739 351602 349006 347096
53577C47096j721j847j776j420j171j377j877k061j478m29K46N5o18j003p82j83
$$ 347096 345375 343528 341752 340332 339161 337784 335907 333846 332368 331939 332185 332240 331622 330619 329837 329654
53561C29654M90J059J333J167P34M68N64P83P96O09M67M89N49M92L30J56m9l78
$$ 329654 330144 331203 332536 333703 334437 334905 335469 336252 337048 337657 338124 338613 339162 339654 339984 340140 340091 339713
53543C39713o69l89Q62K753M389N210N430N477N376N068M927N402O314P140P951
$$ 339713 339044 338655 339517 342270 346659 351869 357299 362776 368152 373220 378147 383549 389863 397003 404954
53528D04954R312J1050J1986J1452J0477J0591J1774J2531J2078J1470J2126J3945
$$ 404954 414266 425316 437302 448754 459231 469822 481596 494127 506205 517675 529801 543746
53516E43746J5604J6402J6936J7907J9089J9864K0318K1107K2424K3661K4261
$$ 543746 559350 575752 592688 610595 629684 649548 669866 690973 713397 737058 761319
53505G61319K4375K4401K4254K3580K2490K1541K0979K0455J9663J8823J8322
$$ 761319 785694 810095 834349 857929 880419 901960 922939 943394 963057 981880 1000202
53494A000202J8182J8197J8317J8540J8607J8259J7697J7437J7631J7836J7595
$$ 1000202 1018384 1036581 1054898 1073438 1092045 1110304 1128001 1145438 1163069 1180905 1198500
53483A198500J7003J6552J6591J7017J7372J7176J6199J4567J2598J0517Q371
$$ 1198500 1215503 1232055 1248646 1265663 1283035 1300211 1316410 1330977 1343575 1354092 1362463
53472A362463O123L772J375r19l022n103p521j0301j2796j4126j4077j3324j2806
$$ 1362463 1368586 1372358 1373733 1372814 1369792 1364689 1357168 1346867 1334071 1319945 1305868 1292544 1279738
53459A279738j2972j3666j4518j5365j6398j7839j9470k0605k0762k0232j9631
$$ 1279738 1266766 1253100 1238582 1223217 1206819 1188980 1169510 1148905 1128143 1107911 1088280
53448A088280j9133j8504j7836j7576j7712j7504j6372j4588j2671j0558p944
$$ 1088280 1069147 1050643 1032807 1015231 997519 980015 963643 949055 936384 925826 917882
53437I17882n209l298k623k584k319j590o90J78J143K395L963N783P755R628J0954
$$ 917882 912673 909375 906752 904168 901849 900259 899569 899747 900890 903285 907248 913031 920786 930414 941368
53422I41368J1442J1433J1778J3016J4763J6197J7134J8207J9915K1950K3660
$$ 941368 952810 964243 976021 989037 1003800 1019997 1037131 1055338 1075253 1097203 1120863
53411A120863K4878K5938K7128K8487L0045L1801L3524L4892L5936L7144L8974
$$ 1120863 1145741 1171679 1198807 1227294 1257339 1289140 1322664 1357556 1393492 1430636 1469610
53400A469610M1442M4164M6708M8851N0596N1964N2878N3327N3587N4017N4517
$$ 1469610 1511052 1555216 1601924 1650775 1701371 1753335 1806213 1859540 1913127 1967144 2021661
53389B021661N4502N3601N2147N0743M9571M8363M6867M5011M2787M0298L7711
$$ 2021661 2076163 2129764 2181911 2232654 2282225 2330588 2377455 2422466 2465253 2505551 2543262
53378B543262L4918L1420K6934K1914J7081J2627Q347M292N70l441q848j5922
$$ 2543262 2578180 2609600 2636534 2658448 2675529 2688156 2696503 2700795 2701365 2697924 2689076 2673154
53366B673154k3624l0709l6749m1775m5609m8095m9606n0720n1566n1966n1971
$$ 2673154 2649530 2618821 2582072 2540297 2494688 2446593 2396987 2346267 2294701 2242735 2190764
53355B190764n1781n1248m9999m8033m5774m3588m1629m0206l9760m0265m0965
$$ 2190764 2138983 2087735 2037736 1989703 1943929 1900341 1858712 1818506 1778746 1738481 1697516
53344A697516m1011m0193l8908l7506l5896l3782l1126k8342k5971k4167k2566
$$ 1697516 1656505 1616312 1577404 1539898 1504002 1470220 1439094 1410752 1384781 1360614 1338048
53333A338048k0733j8641j6573j4725j3142j1996j1598j1983j2713j3240j3402
$$ 1338048 1317315 1298674 1282101 1267376 1254234 1242238 1230640 1218657 1205944 1192704 1179302
53322A179302j3410j3466j3530j3369j2748j1558r957q301o842n549m283l030
$$ 1179302 1165892 1152426 1138896 1125527 1112779 1101221 1091264 1082963 1076121 1070572 1066289 1063259
53310A063259j770k74J595L388M332M302M251N239P237R340J1046J2787J4993
$$ 1063259 1061489 1061215 1062810 1066198 1070530 1074832 1079083 1084322 1091559 1100899 1111945 1124732 1139725
53297A139725J7245J8811J9734K0782K2402K4164K5393K5951K6129K6069K5551
$$ 1139725 1156970 1175781 1195515 1216297 1238699 1262863 1288256 1314207 1340336 1366405 1391956
53286A391956K4304K2280J9747J7307J5680J5044J4560J2954R816O063K838K09
$$ 1391956 1416260 1438540 1458287 1475594 1491274 1506318 1520878 1533832 1543648 1549711 1552549 1552758
53274A552758k601n860q888j1038j2555j4145j6142j8542k1279k3946k5702k6173
$$ 1552758 1550157 1544297 1535409 1524371 1511816 1497671 1481529 1462987 1441708 1417762 1392060 1365887
53262A365887k6255k7094k8459k9003k8253k7341k7344k7864k7870k7161k6200
$$ 1365887 1339632 1312538 1284079 1255076 1226823 1199482 1172138 1144274 1116404 1089243 1063043
53251A063043k5124k3803k2590k2140k2583k3508k4645k5838k6502k5943k4247
$$ 1063043 1037919 1014116 991526 969386 946803 923295 898650 872812 846310 820367 796120
53240G96120k2298k0791j9754j8973j8256j7296j5879j4303j3017j1837j0228
$$ 796120 773822 753031 733277 714304 696048 678752 662873 648570 635553 623716 613488
53229F13488q353p075o734o765o818p353q564r635r866r919j0992j3069j4869
$$ 613488 605135 598060 591326 584561 577743 570390 561826 552191 542325 532406 521414 508345 493476
53216D93476j5422j4860j3713j2249j0761r746r334q927p897o451n415n228n509
$$ 493476 478054 463194 449481 437232 426471 416725 407391 398464 390567 384116 378701 373473 367964
53203C67964n730n957o592p516p970p483o573o134o380o799o936o692n967m694
$$ 367964 362234 356277 349685 342169 334199 326716 320143 314009 307629 300830 293894 287202 281235 276541
53189B76541l394l014l827m957n339m813l929l164k677k515k560k463k063j659
$$ 276541 273147 270133 266306 261349 256010 251197 247268 244104 241427 238912 236352 233889 231826 230167
53175B30167j520j427j108q58j176j888k204j677p24j28k67q27j090o37J08K37
$$ 230167 228647 227220 226112 225254 224078 222190 219986 218309 217585 217457 217190 216363 215273 214636 214744 214981
53159B14981m67j145r37j10M63N68O03N61m1j100j708j323m89J1J36J96J05l38
$$ 214981 214514 213369 212432 212322 212785 213353 213956 214517 214476 213376 211668 210345 209856 209867 210003 210199 210304 209966
53141B09966p60n99n0N7n00q88l09R10J820K141K405K854K865J896N20j71l0P
$$ 209966 209206 208607 208557 208614 208114 207226 206917 207827 209647 211788 214193 217047 219912 221808 222328 222157 222127 222134
53123B22134o64j426j395o83q9O7J53L26K15m02j096j316j040o79n44o50q89j121
$$ 222134 221470 220044 218649 217966 217877 217944 218097 218423 218638 218236 217140 215824 214784 214105 213561 212911 212022 210901
53105B10901j177r05m06p3k93r56j375r54k6M44N1n38n72k43k10n03n95l47r8
$$ 210901 209724 208819 208413 208340 208047 207091 205716 204762 204736 205180 205231 204693 204121 203878 203668 203165 202570 202223 202125
53086B02125J20O45J385J697J338Q55O82N36J20k11j12J7l61r91j272j316j684
$$ 202125 202245 202890 204275 205972 207310 208165 208847 209383 209503 209292 209180 209197 208836 207845 206573 205257 203573
53069B03573k163j770k85J080J023k88j618k199k265k211j924j148n6Q84J392
$$ 203573 201410 199640 199355 200435 201458 201170 199552 197353 195088 192877 190953 189805 189749 190633 192025
53054A92025J456J117N28R2J52M53L63k38o46k46N60Q21L16j81j6M96N62l5p58
$$ 192025 193481 194598 195126 195218 195370 195823 196186 195948 195302 195056 195616 196437 196753 196572 196556 197052 197614 197579 196821
53035A96821j002o82j47K05K01r7m93p71p22k72L38O16K89l13o14m31k9M15R75
$$ 196821 195819 195137 194990 195195 195396 195299 194806 194035 193313 193041 193379 193995 194284 193971 193357 192926 192897 193312 194287
53016A94287J516J591J042L73J60L84O70R62J422J825J594N80o41j397j564j409
$$ 194287 195803 197394 198436 198809 198969 199353 200023 200985 202407 204232 205826 206406 205765 204368 202804 201395
53000B01395j088n59P6N38O83P03Q43R82O91j86j109j295n71M18R87J065R88Q83
$$ 201395 200307 199748 199824 200362 201045 201748 202591 203573 204264 204078 202969 201674 201103 201521 202508 203573 204561 205444
52982B05444P30O90R17J029M73n19r15j88Q35J005L95J01O16J185J022M96N74
$$ 205444 206174 206864 207781 208810 209283 208764 207849 207661 208496 209501 209896 209997 210613 211798 212820 213316 213890
52965B13890J443K274K273J451L71m59p73n86k32j79n56r86j049p09k22J78K97
$$ 213890 215333 217607 219880 221331 221702 221243 220470 219884 219652 219473 218917 217931 216882 216173 215951 216129 216426
52948B16426q1r54j875k300k161j836j580j251o55L9M35L43n9l94l96o8L60O27
$$ 216426 216345 215391 213516 211216 209055 207219 205639 204388 203733 203772 204207 204550 204491 204097 203701 203633 203993 204620
52930B04620N75J40n82j206j259p10j67k03n74n02K69J083J159M44n37j320j728
$$ 204620 205195 205335 204753 203547 202288 201578 201411 201208 200634 200132 200401 201484 202643 203087 202550 201230 199502
52913A99502j718j358q94n79m16k20R8M36O02L99j78p73q19j65O71J093J113J123
$$ 199502 197784 196426 195532 194953 194537 194317 194415 194851 195453 195852 195674 194901 194082 193917 194588 195681 196794 197917
52895A97917J138Q20J97j68K5L49K56j17j41M65J312J727J325K95o42p61r4N27
$$ 197917 199055 199875 200072 199904 199929 200278 200534 200417 200276 200741 202053 203780 205105 205400 204758 203997 203903 204430
52877B04430M44L7J69J017J912K328K390K347K117J620J056N31j47r47j352j088
$$ 204430 204874 204911 205080 206097 208009 210337 212727 215074 217191 218811 219867 220398 220251 219304 217952 216864
52861B16864p09q69j306j227n72j57n51j405k060k239k013j613j481j946k633
$$ 216864 216155 215286 213980 212753 212181 212024 211473 210068 208008 205769 203756 202143 200662 198716 196083
52846A96083k639j636m20Rn25j442k137k260j715q36k36q7J40P98J312R00k13
$$ 196083 193444 191808 191388 191397 190872 189430 187293 185033 183318 182482 182246 182159 182299 183097 184409 185309 185096
52829A85096r98r48m79r5K38O27Q59P68N80N13L70p2m92k72O92J741K167K028
$$ 185096 184098 183150 182671 182576 182814 183441 184300 185068 185648 186161 186531 186459 185967 185695 186387 188128 190295 192323
52811A92323J989K424K819K393J101k73j154j799k636l371l322k470j609j328
$$ 192323 194312 196736 199555 201948 203049 202776 201622 199823 197187 193816 190494 188024 186415 185087
52797A85087j307q75N0Q60J033O98L94L53K97m8m82o75p40r71j152p32J85P63
$$ 185087 183780 182905 182955 183815 184848 185546 185940 186293 186590 186542 186060 185385 184645 183674 182522 181790 181975 182738
52779A82738O42M38N90N39k25j034r61l07m5j80O5O28N34l75j007p57m07p02j138
$$ 182738 183380 183818 184408 184947 184722 183688 182727 182420 182375 182195 182260 182888 183422 183047 182040 181283 180876 180174 179036
52760A79036r25k75J69M64R44J324J101N67M29P04P97N43L93N39O87O70P38J032
$$ 179036 178111 177836 178005 178469 179413 180737 181838 182405 182834 183538 184335 184878 185271 185810 186497 187167 187905 188937
52742A88937J370J639J993K464K716K406J589O82J48J87O09R87J091J017Q92O43
$$ 188937 190307 191946 193939 196403 199119 201525 203114 203796 203944 204131 204740 205727 206818 207835 208727 209370
52726B09370K06k58n69p62r39j107j324j678j968j801j189p25p75r20o44j40Q2
$$ 209370 209576 209318 208749 207987 207048 205941 204617 202939 200971 199170 197981 197256 196481 195561 194917 194777 194859
52709A94859P5K80O82Q21N68K50K8k38m55k23N13J294J753J971K017J646P70j33
$$ 194859 194934 195214 195896 196717 197285 197535 197563 197325 196870 196647 197160 198454 200207 202178 204195 205841 206611 206478
52691B06478n12l83j81j26p5J5o6m42q66j063j146j374j560j152j38O25M56j26
$$ 206478 205966 205583 205402 205276 205201 205216 205150 204708 203842 202779 201633 200259 198699 197547 197409 198034 198490 198364
52673A98364j24M44O09J6n40m87k92m07k90O07J656J904J533J411J555J296P34
$$ 198364 198240 198684 199293 199309 198769 198282 197990 197583 197293 197900 199556 201460 202993 204404 205959 207255 207989
52656B07989P98J663K345K119J352N81k25j051j461j408j574k284k784k322j280
$$ 207989 208787 210450 212795 214914 216266 216847 216622 215571 214110 212702 211128 208844 206060 203738 202458
52641B02458n38k20J12M80N43L75L24L20P4j53K18J060J549J355J099J309J622
$$ 202458 201920 201700 201812 202292 202835 203210 203534 203854 203928 203775 203993 205053 206602 207957 209056 210365 211987
52624B11987J391O12j91p26j050j216j155q99n86l09j63l01o90r30o52l8M04N47
$$ 211987 213378 213990 213799 213073 212023 210807 209652 208753 208167 207858 207695 207394 206704 205774 205122 205084 205488 206035
52606B06035O97Q99P15on87k81P35J576J727J341O48k49r66r24j28P25J198J551
$$ 206035 206732 207631 208346 208340 207753 207472 208207 209783 211510 212851 213499 213250 212284 211360 211232 211957 213155 214706
52588B14706J932J805Q18l64q17o05m79o21n91l23k66m56l34K76P66O10M5m12
$$ 214706 216638 218443 219261 218897 218080 217475 216996 216375 215784 215461 215195 214739 214405 214681 215447 216057 216102 215690
52570B15690n17j71O29J332J103l3r02o44J06J98l73o89n18o58j529k307j973
$$ 215690 215173 215002 215631 216963 218066 218033 217131 216487 216593 216791 216418 215729 215211 214553 213024 210717 208744
52553B08744o81M69P83O40P88J340J668J204J32q21j153r13l41M45J288J836J823
$$ 208744 208063 208532 209315 209955 210743 212083 213751 214955 215087 214266 213113 212200 211859 212304 213592 215428 217251
52536B17251J397Q49J83o91j474j545o88N01J128Q40J14k75l2M07M44N6k07l2
$$ 217251 218648 219497 219680 218989 217515 215970 215282 215783 216911 217751 217865 217590 217558 217965 218409 218465 218258 218226
52518B18226J75j35q57j340j239q01l16K63R88J602J877J995K220K397K153J519
$$ 218226 218401 218266 217409 216069 214830 214029 213713 213976 214964 216566 218443 220438 222658 225055 227208 228727
52502B28727Q82L79k46j039j610j753j874k342k771k424j233O6P89Q59N54J82
$$ 228727 229609 229988 229742 228703 227093 225340 223466 221124 218353 215929 214696 214762 215551 216410 216964 217146
52486B17146O0L63Q28R63O60K50m6k58k48K00P23N22m35j068n68M74R38O67L63
$$ 217146 217206 217569 218397 219360 220020 220270 220224 219966 219718 219918 220641 221163 220728 219660 219092 219566 220504 221171 221534
52467B21534L88N49P91J262J743J791J500J373J477J364R38O27O27N70J33n69
$$ 221534 221922 222471 223262 224524 226267 228058 229558 230931 232408 233772 234710 235337 235964 236534 236667 236098
52451B36098j386k272k953k986k439j915j734j529q99L5R24J502J513Q04k31p95
$$ 236098 234712 232440 229487 226501 224062 222147 220413 218884 217985 218020 218944 220446 221959 222763 222532 221737
52435B21737n30J36N88N54J7p91j232p36L57J045R13M70J40k13n73m34L05R69
$$ 221737 221207 221343 221931 222485 222502 221711 220479 219743 220100 221145 222058 222528 222668 222455 221882 221448 221753 222722
52417B22722J135J263J721K084K112K543L988N843P240Q503J0334J2071J2021
$$ 222722 223857 225120 226841 228925 231037 233580 237568 243411 250651 259154 269488 281559 293580
52404B93580R527N600J569j940m609o123o608o636o547o223n663n112m591l893
$$ 293580 303107 308707 310276 308336 303727 297604 290996 284360 277813 271590 265927 260815 256224 252331
52390B52331l064k308j427j11J277J919J720J484J691J893J653J310J319J450
$$ 252331 249267 246959 245532 245421 246698 248617 250337 251821 253512 255405 257058 258368 259687 261137
52376B61137J278J019J243K016K812L257L477L784M228M574M467L684K360R77
$$ 261137 262415 263434 264677 266693 269505 272762 276239 280023 284251 288825 293292 296976 299336 300313
52362C00313J24J65R57J852K164J804J306J073R80R06J163J856K317J895J124
$$ 300313 300437 300602 301559 303411 305575 307379 308685 309758 310738 311644 312807 314663 316980 318875 319999
52347C19999J185K234L192L298L045L225L866M560N158N628N810N856O437P948
$$ 319999 321184 323418 326610 329908 332953 336178 340044 344604 349762 355390 361200 367056 373493 381441
52333C81441R808J1163J1955J2812J4069J5456J6589J7340J7787J8209J8972K0118
$$ 381441 391249 402412 414367 427179 441248 456704 473293 490633 508420 526629 545601 565719
52321E65719K1175K1718K1874K1902K1529K0327J8617J7359J7012J6978J6421
$$ 565719 586894 608612 630486 652388 673917 694244 712861 730220 747232 764210 780631
52310G80631J5260J4092J3375J2948J2231J0776Q707O732N541N116M779L995K887
$$ 780631 795891 809983 823358 836306 848537 859313 868020 874752 880293 885409 890188 894183 897070
52297H97070J779N34j213l241m715n278n712p030q995j0205r779q382p175o210
$$ 897070 898849 899383 898170 894929 890214 884936 879224 872194 863199 852994 843215 834833 827658 821448
52283H21448m538j751J286L510M834N920P148Q330R233R992J0866J1915J3001
$$ 821448 816910 815159 816445 819955 824789 830709 837857 846187 855420 865412 876278 888193 901194
52270I01194J3909J4313J3837J2462J0850R984J0231J0929J1131J0690J0249J0222
$$ 901194 915103 929416 943253 955715 966565 976549 986780 997709 1008840 1019530 1029779 1040001
52258A040001J0196R602Q505P378O383N287L931K355O21j101k477l450m626o606
$$ 1040001 1050197 1059799 1068304 1075682 1082065 1087352 1091283 1093638 1094259 1093158 1090681 1087231 1082605 1075999
52244A075999r012j0801j1523j1675j1778j1788j1668j1698j1821j1343r870q060
$$ 1075999 1066987 1056186 1044663 1032988 1021210 1009422 997754 986056 974235 962892 953022 944962
52232I44962o850o277n738n037m513m280m025l586l021k190q37P20J656J719J720
$$ 944962 938112 931835 926097 921060 916547 912267 908242 904656 901635 899445 898608 899328 900984 902703 904423
52217I04423K554M071N296N616N349N278N819O640O966O353N209M371M085L717
$$ 904423 906977 911048 916344 921960 927309 932587 938406 945046 952012 958365 963574 967945 972030 975747
52203I75747K748J672J442K205L138L535L498L420L378L288L214L082K516J510
$$ 975747 978495 980167 981609 983814 986952 990487 993985 997405 1000783 1004071 1007285 1010367 1012883 1014393
52189A014393Q51J185J908J649q8k470m519n958o746o756o308o304p091p778p353
$$ 1014393 1015244 1016429 1018337 1019986 1019898 1017428 1012909 1006951 1000205 993449 987141 980837 973746 965968 958615
52174I58615o033m770l909l159k558k465k628k288j338n10k11PN08R02Q40P55
$$ 958615 952582 947812 943903 940744 938186 935721 933093 930805 929467 928957 928746 928753 929261 930163 931003 931758
52158I31758J210J995K477K499K387K289K105J930K018K258K145J422N00Q0M05
$$ 931758 932968 934963 937440 939939 942326 944615 946720 948650 950668 952926 955071 956493 956993 957073 957478
52143I57478R91J113O56K91O90J684K570L083L593M400N405O673Q605J1208J3690
$$ 957478 958469 959582 960238 960529 961219 962903 965473 968556 972149 976549 981954 988627 997232 1008440 1022130
52128A022130J5315J6400J7881K0095K2457K4246K5343K6106K6862K7566K7889
$$ 1022130 1037445 1053845 1071726 1091821 1114278 1138524 1163867 1189973 1216835 1244401 1272290
52117A272290K7595K6822K5781K4257K1829J8725J5937J4162J2913J1135Q433
$$ 1272290 1299885 1326707 1352488 1376745 1398574 1417299 1433236 1447398 1460311 1471446 1479879
52106A479879N315K483K57j406k743m023n287o341p125p868q693r405r922j0617
$$ 1479879 1485194 1487677 1487934 1486528 1483785 1479762 1474475 1468134 1461009 1453141 1444448 1435043 1425121 1414504
52092A414504j1771j3073j4050j4745j5408j5728j5058j3259j0843q238n514k802
$$ 1414504 1402733 1389660 1375610 1360865 1345457 1329729 1314671 1301412 1290569 1282331 1276817 1274015
52080A274015m39J502L327N242P065Q598R935J1312J2902J4754J6608J7823J7884
$$ 1274015 1273576 1275078 1278405 1283647 1290712 1299310 1309245 1320557 1333459 1348213 1364821 1382644 1400528
52067A400528J7052J6123J5463J4702J3478J2013J0709R513P992N854L222N80
$$ 1400528 1417580 1433703 1449166 1463868 1477346 1489359 1500068 1509581 1517573 1523427 1526649 1527229
52055A527229j506k808l697m839o561q764j1311j4124j6839j8922k0290k1385
$$ 1527229 1525723 1522915 1519218 1514379 1507818 1499054 1487743 1473619 1456780 1437858 1417568 1396183
52043A396183k2439k3141k3292k3276k3387k3110k1761j9597j7722j6769j6227
$$ 1396183 1373744 1350603 1327311 1304035 1280648 1257538 1235777 1216180 1198458 1181689 1165462
52032A165462j5212j3518j1673j0295r605r516r938j0857j2113j3208j3580j3167
$$ 1165462 1150250 1136732 1125059 1114764 1105159 1095643 1085705 1074848 1062735 1049527 1035947 1022780
52020A022780j2514j2126j1920j1600j1271j1321j1682j1835j1622j1591j2197
$$ 1022780 1010266 998140 986220 974620 963349 952028 940346 928511 916889 905298 893101
$$ [...]
##END NTUPLES=NMR SPECTRUM
##END=
