
##TITLE=AC1302_PERAH12114_6535671_KetVU1Pe3j
##JCAMPDX= 6.0         $$ Bruker NMR JCAMP-DX V2.0
##DATA TYPE= NMR SPECTRUM
##DATA CLASS= NTUPLES
##ORIGIN= BRUKER
##OWNER= Administrator
$$ 1.72 TOPSPIN		Version 2.1
$$ 2012-12-11 21:45:35.915 -0500  Administrator@X
$$ Compression mode = diff/dup
##.OBSERVE FREQUENCY= 400.02188249412
##.OBSERVE NUCLEUS= ^1H
##.ACQUISITION MODE= SIMULTANEOUS (DQD)
##.ACQUISITION SCHEME= undefined
##.AVERAGES= 64
##.DIGITISER RES= 22
##SPECTROMETER/DATA SYSTEM= spect
##.PULSE SEQUENCE= noesygpps1d.comp
##.SOLVENT NAME= COFFEE_meoh
##.SHIFT REFERENCE= INTERNAL, COFFEE_meoh, 1, 14.96102
##AUDIT TRAIL= $$ (NUMBER, WHEN, WHO, WHERE, PROCESS, VERSION, WHAT)
$$ ##TITLE= Audit trail, TOPSPIN		Version 2.1
$$ ##JCAMPDX= 5.01
$$ ##ORIGIN= Bruker BioSpin GmbH
$$ ##OWNER= Administrator
$$ $$ E:\/data/COFFEE/nmr/AC1302_PERAH12114_6535671_KetVU1Pe3j/62/pdata/1/auditp.txt
$$ ##AUDIT TRAIL=  $$ (NUMBER, WHEN, WHO, WHERE, PROCESS, VERSION, WHAT)
(   1,<2012-12-11 21:45:29.743 -0500>,<Administrator>,<X>,<go>,<TOPSPIN 2.1>,
      <created by zg
	started at 2012-12-11 21:33:59.024 -0500,
	POWCHK enabled, PULCHK disabled,
       configuration hash MD5:
       86 BA 57 50 F2 9D 5C 9B 26 00 A9 28 5F 66 2E 89
       data hash MD5: 64K
       21 68 39 29 8D 35 EF 6D 8E 7B 7B 31 C7 C5 78 D8>)
(   2,<2012-12-11 21:45:32.884 -0500>,<Administrator>,<X>,<proc1d>,<TOPSPIN 2.1>,
      <Start of raw data processing
       efp LB = 0.3 FT_mod = 6 PKNL = 1 PHC0 = 0 PHC1 = 0 SI = 128K 
       data hash MD5: 128K
       BB 1C 31 34 B1 73 27 BC 87 3E 42 03 84 4A 08 87>)
(   3,<2012-12-11 21:45:34.055 -0500>,<Administrator>,<X>,<proc1d>,<TOPSPIN 2.1>,
      <pk PHC0 = -81.44714 PHC1 = 0 
       data hash MD5: 128K
       F1 D6 43 E0 49 09 F9 87 65 28 FB AD ED D2 89 3E>)
(   4,<2012-12-11 21:45:34.868 -0500>,<Administrator>,<X>,<proc1d>,<TOPSPIN 2.1>,
      <abs ABSG = 1 
       data hash MD5: 128K
       C1 19 2F D0 D2 E1 0C B5 B1 7E A4 C8 BE D4 D9 1D>)
(   5,<2012-12-11 21:45:35.040 -0500>,<Administrator>,<X>,<proc1d>,<TOPSPIN 2.1>,
      <abs ABSG = 2 
       data hash MD5: 128K
       6C 30 C9 EF 7B 2A F7 0B 2F ED BC C2 9F B4 36 AC>)
(   6,<2012-12-11 21:45:35.212 -0500>,<Administrator>,<X>,<proc1d>,<TOPSPIN 2.1>,
      <abs ABSG = 3 
       data hash MD5: 128K
       2D 94 6B 3C 22 B2 B4 63 3F 2F 40 23 93 2E 11 49>)
(   7,<2012-12-11 21:45:35.399 -0500>,<Administrator>,<X>,<proc1d>,<TOPSPIN 2.1>,
      <abs ABSG = 4 
       data hash MD5: 128K
       CA 62 FC AB EE 63 E4 3A CF 3E 17 7B 26 76 55 6B>)
(   8,<2012-12-11 21:45:35.571 -0500>,<Administrator>,<X>,<proc1d>,<TOPSPIN 2.1>,
      <abs ABSG = 5 
       data hash MD5: 128K
       F0 0E A0 10 04 96 DC A0 A0 0A 3F 87 EE EA 20 27>)
$$ ##END=
$$ 
$$ $$ hash MD5
$$ $$ 27 29 CF BA 63 5D 35 22 62 70 0C 5B 97 48 7D 7E
##$RELAX= 
##$RELAX= 
##$RELAX= 
##$RELAX= 
##$RELAX= 
##$RELAX= 
##$RELAX= 
##$RELAX= 
##$RELAX= 
$$ Bruker specific parameters
$$ --------------------------
##$DU= <E:\>
##$EXPNO= 62
$$ [...]
##$TP07= 0
##$TPNAME0= <>
##$TPNAME1= <>
##$TPNAME2= <>
##$TPNAME3= <>
##$TPNAME4= <>
##$TPNAME5= <>
##$TPNAME6= <>
##$TPNAME7= <>
##$TPOAL= (0..7)
0.5 0.5 0.5 0.5 0.5 0.5 0.5 0.5
##$TPOFFS= (0..7)
0 0 0 0 0 0 0 0
##$TUNHIN= 0
##$TUNHOUT= 0
##$TUNXOUT= 0
##$USERA1= <user>
##$USERA2= <user>
##$USERA3= <user>
##$USERA4= <user>
##$USERA5= <user>
##$V9= 5
##$VALIST= <valist>
##$VCLIST= <CCCCCCCCCCCCCCC>
##$VD= 0
##$VDLIST= <DDDDDDDDDDDDDDD>
##$VPLIST= <PPPPPPPPPPPPPPP>
##$VTLIST= <TTTTTTTTTTTTTTT>
##$WBST= 2048
##$WBSW= 25
##$XGAIN= (0..3)
0 0 0 0
##$XL= 0
##$YL= 0
##$YMAX_a= 5763779
##$YMIN_a= -11833283
##$ZGOPTNS= <>
##$ZL1= 120
##$ZL2= 120
##$ZL3= 120
##$ZL4= 120
##$ABSF1= 14.96102
##$ABSF2= -5.597161
##$ABSG= 5
##$ABSL= 3
##$ALPHA= 0
##$AQORDER= 0
##$ASSFAC= 0
##$ASSFACI= 0
##$ASSFACX= 0
##$ASSWID= 0
##$AUNMP= <proc_prof1d_extract.lims>
##$AXLEFT= 0
##$AXNAME= <>
##$AXNUC= <1H>
##$AXRIGHT= 0
##$AXTYPE= 0
##$AXUNIT= <>
##$AZFE= 0.1
##$AZFW= 0.1
##$BCFW= 0
##$BC_mod= 0
##$BYTORDP= 0
##$COROFFS= 0
##$CY= 15
##$DATMOD= 1
##$DC= 0
##$DFILT= <>
##$DTYPP= 0
##$F1P= 0
##$F2P= 0
##$FCOR= 0.5
##$FTSIZE= 131072
##$FT_mod= 6
##$GAMMA= 0
##$GB= 0
##$INTBC= 1
##$INTSCL= 1
##$ISEN= 128
##$LB= 0.3
##$LEV0= 0
##$LPBIN= 0
##$MAXI= 10000
##$MC2= 0
##$MEAN= 0
##$ME_mod= 0
##$MI= 0
##$NCOEF= 0
##$NC_proc= -2
##$NLEV= 6
##$NOISF1= 0
##$NOISF2= 0
##$NSP= 0
##$NTH_PI= 0
##$NZP= 0
##$OFFSET= 14.96102
##$PC= 1
##$PHC0= -81.44714
##$PHC1= 0
##$PH_mod= 1
##$PKNL= yes
##$PPARMOD= 0
##$PPDIAG= 0
##$PPIPTYP= 0
##$PPMPNUM= 2147483647
##$PPRESOL= 1
##$PSCAL= 4
##$PSIGN= 0
##$PYNMP= <proc.py>
##$REVERSE= no
##$SF= 400.020009628891
##$SI= 131072
##$SIGF1= 0
##$SIGF2= 0
##$SINO= 400
##$SIOLD= 131072
##$SPECTYP= <>
##$SREGLST= <1H.CDCl3>
##$SSB= 0
##$STSI= 131072
##$STSR= 0
##$SW_p= 8223.68421052631
##$SYMM= 0
##$S_DEV= 0
##$TDeff= 65536
##$TDoff= 0
##$TI= <>
##$TILT= no
##$TM1= 0
##$TM2= 0
##$TOPLEV= 0
##$USERP1= <user>
##$USERP2= <user>
##$USERP3= <user>
##$USERP4= <user>
##$USERP5= <user>
##$WDW= 1
##$XDIM= 131072
##$YMAX_p= 398616246
##$YMIN_p= -12408
##$CURPLOT= <Network HP LaserJet P1505>
##$CURPRIN= <$Network HP LaserJet P1505>
##$DFORMAT= <normdp>
##$LAYOUT= <+/1D_H.xwp>
##$LFORMAT= <normlp>
##$PFORMAT= <normpl>
##$SURQMSG= 1
$$ End of Bruker specific parameters
$$ ---------------------------------
##NTUPLES= NMR SPECTRUM
##VAR_NAME=  FREQUENCY,     SPECTRUM/REAL,   SPECTRUM/IMAG
##SYMBOL=    X,             R,               I
##VAR_TYPE=  INDEPENDENT,   DEPENDENT,       DEPENDENT
##VAR_FORM=  AFFN,          ASDF,            ASDF
##VAR_DIM=   131072,        131072,          131072
##UNITS=     HZ,            ARBITRARY UNITS, ARBITRARY UNITS
##FACTOR=    0.0627417313425164, 1,          1
##FIRST=     8223.62146879497, 3000,         -58756
##LAST=      0,             4239,            -58228
##MIN=       0,             -12408,          0
##MAX=       8223.62146879497, 398616246,    0
$$ Real data points
##PAGE= N=1
##DATA TABLE= (X++(R..R)), XYDATA
$$ [...]
$$ plain form
63952 793629 852797 920757 998362 1086607 1186521 1298714 1423507 1561358 1712532 1876088
63942 1876088 2049646 2230431 2416412 2606272 2798470 2990443 3178436 3357957 3524591
63933 3524591 3674606 3804814 3912094 3993449 4046696 4070751 4065113 4029415 3963837 3869736 3749644
63922 3749644 3606812 3445114 3269209 3084258 2895089 2705509 2518310 2335723 2159771
63913 2159771 1992272 1834712 1688302 1554213 1433442 1326155 1231284 1147173 1072683 1007332
63903 1007332 950344 900173 855402 815726 781546 752654 727822 705698 685688 667780 651798
63892 651798 637157 623266 609887 596967 584325 571803 559747 549032 540348 533693 528781 525784
63880 525784 525235 527268 531422 537237 544633 553655 564341 577014 592174 609737 628789 648517 669083
$$ packed form
63952G93629N9168O7960P7605Q8245R9914J12193J24793J37851J51174J63556
63942A876088J73558J80785J85981J89860J92198J91973J87993J79521J66634
63933C524591J50015J30208J07280Q1355N3247K4055n638l5698o5578r4101j20092
63922C749644j42832j61698j75905j84951j89169j89580j87199j82587j75952
63913B159771j67499j57560j46410j34089j20771j07287r4871q4111p4490o5351
63903A007332n6988n0171m4771l9676l4180k8892k4832k2124k0010j7908j5982
63892F51798j4641j3891j3379j2920j2642j2522j2056j0715q684o655m912k997
63880E25784n49K033M154N815P396R022J0686J2673J5160J7563J9052J9728K0566
$$ plain form
63867 669083 691192 715043 740088 765620 791100 815978 839626 861525 881361 899013 914541
63856 914541 927936 938694 945932 949186 948808 945290 938618 928729 916104 901215 883667 862714 838584
63843 838584 812557 785656 757980 729424 700322 671035 641586 612120 583285 555735 529633
63832 529633 505033 482328 461824 443053 425051 407358 390470 375239 361930 349903 338194
63821 338194 326495 315486 306014 298161 291432 285633 280857 276613 271881 266507 261799 259014 257703 256349
63807 256349 254332 252349 250925 249493 247287 244419 241529 238824 236059 233230 230660 228374 225927 223094
63793 223094 220376 218473 217441 216752 216088 215589 215212 214355 212562 210339 208720 208098 207917 207484 206624 205495
63777 205495 204282 203263 202676 202352 201890 201425 201719 203118 204902 206085 206471 206468 206302 206029 205882 205867 205278 203489
$$ packed form
63867F69083K2109K3851K5045K5532K5480K4878K3648K1899J9836J7652J5528
63856I14541J3395J0758P238L254l78l518o672r889j2625j4889j7548k0953k4130
63843H38584k6027k6901k7676k8556k9102k9287k9449k9466k8835k7550k6102
63832E29633k4600k2705k0504j8771j8002j7693j6888j5231j3309j2027j1709
63821C38194j1699j1009r472p853o729n799m776m244m732n374m708k785j311j354
63807B56349k017j983j424j432k206k868k890k705k765k829k570k286k447k833
63793B23094k718j903j032o89o64m99l77q57j793k223j619o22j81m33q60j129
63777B05495j213j019n87l24m62m65K94J399J784J183L86lj66k73j47j5n89j789
$$ plain form
63759 203489 201113 199497 198996 198676 197897 197210 197209 197401 197032 196421 196557 197669 199034 200184 201466 203265 205368
63742 205368 207416 209502 211898 214463 216676 218223 219302 220443 222145 224574 227366 229804 231425 232582
63728 232582 234261 237232 241431 246179 250868 255310 259553 263646 267690 271851 276081 279912 282757 284424
63714 284424 285135 285029 283837 281193 277119 272118 266900 262067 258011 254931 252888 251826 251522 251576 251637 251675
63698 251675 252011 253036 254987 257911 261673 265964 270458 274983 279421 283475 286806 289440 291790 294042
63684 294042 295791 296504 296208 295485 294874 294483 294114 293554 292764 291923 291245 290666 289908 289022 288665 289472 291245 293108
63666 293108 294430 295274 295901 296325 296542 296772 297052 296734 294802 290861 285669 280569 276380 272913 269581 266384
63650 266384 264007 262852 262296 261315 259668 257971 256708 255794 255310 255947 258197 261511 264879 268015 271375
$$ packed form
63759B03489k376j616n01l20p79o87jJ92l69o11J36J112J365J150J282J799K103
63742B05368K048K086K396K565K213J547J079J141J702K429K792K438J621J157
63728B32582J679K971M199M748M689M442M243M093M044M161M230L831K845J667
63714B84424P11j06j192k644m074n001n218m833m056l080k043j062l04N4O1L8
63698B51675L36J025J951K924L762M291M494M525M438M054L331K634K350K252
63684B94042J749P13k96p23o11l91l69n60p90q41o78n79p58q86l57Q07J773J863
63666B93108J322Q44O27M24K17K30K80l18j932l941n192n100m189l467l332l197
63650B66384k377j155n56r81j647j697j263r14m84O37K250L314L368L136L360
$$ plain form
63635 271375 275207 279300 283736 289160 295871 303118 309764 315559 321456 328824 338462 350129 362657 374692
63621 374692 385757 396760 409306 424440 442110 461719 482952 505959 530953 557833 586187
63610 586187 615532 645499 675802 706023 735378 762536 785734 803275 814223 818722 817719 812504
63598 812504 804579 795616 786983 779128 771635 763982 755932 747077 736396 722705 705502 685180 662610
63585 662610 638821 614892 591676 569516 548473 528832 511153 495846 483020 472702 464821 458930
63573 458930 454408 451154 449704 450410 452841 456325 460804 466709 474197 482909 492403 502431 512907 524014
63559 524014 536287 550102 565068 580486 596589 614822 636508 661619 689284 719198 751912
63548 751912 787725 825636 863400 898195 927171 947904 959007 960580 954146 942120 927114 911320
$$ packed form
63635B71375L832M093M436N424O711P247O646N795N897P368R638J1667J2528J2035
63621C74692J1065J1003J2546J5134J7670J9609K1233K3007K4994K6880K8354
63610E86187K9345K9967L0303L0221K9355K7158K3198J7541J0948M499j003n215
63598H12504p925q963q633p855p493p653q050q855j0681j3691j7203k0322k2570
63585F62610k3789k3929k3216k2160k1043j9641j7679j5307j2826j0318p881n891
63573D58930m522l254j450P06K431L484M479N905P488Q712R494J0028J0476J1107
63559E24014J2273J3815J4966J5418J6103J8233K1686K5111K7665K9914L2714
63548G51912L5813L7911L7764L4795K8976K0733J1103J573o434j2026j5006j5794
$$ plain form
63536 911320 896172 882457 870667 861061 853319 846312 838520 828749 816407 801146 782549 760387
63524 760387 735152 707990 679884 651000 621058 590282 559740 530727 504099 480306 459625
63513 459625 441957 426543 412385 399032 386756 375952 366720 359023 352841 347934 343738 339753 335897
63500 335897 332313 329050 326137 323763 322027 320583 318866 316660 314262 312056 310180 308669 307748 307810 309124
63485 309124 311553 314560 317604 320597 323888 327695 331677 335264 338302 341129 344074 347117 350034 352545
63471 352545 354232 354569 353245 350423 346534 341925 336813 331494 326422 321962 318154 314814 311959 310003
63457 310003 309346 309757 310445 310876 311332 312513 314879 318659 324160 331542 340316 349619 359130 369339 380877
63442 380877 393966 408738 425677 445433 468382 494422 522929 552660 581914 609029 632664
$$ packed form
63536I11320j5148j3715j1790r606p742p007p792r771j2342j5261j8597k2162
63524G60387k5235k7162k8106k8884k9942l0776l0542k9013k6628k3793k0681
63513D59625j7668j5414j4158j3353j2276j0804r232p697o182m907m196l985l856
63500C35897l584l263k913k374j736j444j717k206k398k206j876j511r21O2J314
63485C09124K429L007L044K993L291L807L982L587L038K827K945L043K917K511
63471C52545J687L37j324k822l889m609n112n319n072m460l808l340k855j956
63457C10003o57M11O88M31M56J181K366L780N501P382Q774R303R511J0209J1538
63442C80877J3089J4772J6939J9756K2949K6040K8507K9731K9254K7115K3635
$$ plain form
63431 632664 651774 665870 675537 682313 687754 692947 699082 707862 720726 737970 759156 784134 813086
63418 813086 845681 880803 917032 952785 985995 1014285 1035814 1049795 1056344 1056370 1051592 1043992 1034851
63405 1034851 1024582 1013473 1002087 990681 978747 965399 949771 930781 907186 878611 846308
63394 846308 812292 777797 743105 708740 676046 646232 619325 594575 571719 551423 534421
63383 534421 520585 509088 499292 491212 485184 481469 480301 481854 485788 491094 496932 503594 512161 523201
63369 523201 536286 550892 567125 585201 604778 625432 647580 672310 700255 731034 763848
63358 763848 798227 834023 870862 907772 943227 975446 1002647 1023132 1035494 1039323 1035980 1028254
63346 1028254 1018754 1008543 997477 985544 973332 961223 948665 934503 917751 897938 874973
$$ packed form
63431F32664J9110J4096R667O776N441N193O135Q780J2864J7244K1186K4978K8952
63418H13086L2595L5122L6229L5753L3210K8290K1529J3981O549K6m778p600r141
63405A034851j0269j1109j1386j1406j1934j3348j5628j8990k3595k8575l2303
63394H46308l4016l4495l4692l4365l2694k9814k6907k4750k2856k0296j7002
63383E34421j3836j1497r796q080o028l715j168J553L934N306N838O662Q567J1040
63369E23201J3085J4606J6233J8076J9577K0654K2148K4730K7945L0779L2814
63358G63848L4379L5796L6839L6910L5455L2219K7201K0485J2362L829l343p726
63346A028254r500j0211j1066j1933j2212j2109j2558j4162j6752j9813k2965
$$ plain form
63335 874973 849021 820527 790250 759156 728107 697607 668012 640171 615554 595419 579974
63324 579974 568690 561209 557237 555452 553208 547862 538281 524929 508847 490971 472191 453550 436187
63311 436187 420999 408139 396820 385979 375416 365983 358380 352153 346358 340925 336697 334116 332445
63298 332445 330489 327619 323982 320170 316919 314671 313103 311356 309020 306579 304583 302818 300822 298866
63284 298866 297649 297095 296271 294795 293542 293417 293893 293551 291919 290046 289128 289173 289339 289151 288819 288555 288157
63267 288157 287445 286782 286829 287934 289988 292721 295823 298726 300707 301566 302041 303187 305337 307919 310269 312308
63251 312308 314402 316974 320466 325290 331410 338104 344564 350744 357412 365423 375132 386339 398415 410564
63237 410564 422443 434688 448489 464457 482138 500736 519988 540120 561224 582981 604916
$$ packed form
63335H74973k5952k8494l0277l1094l1049l0500k9595k7841k4617k0135j5445
63324E79974j1284p481l972j785k244n346r581j3352j6082j7876j8780j8641j7363
63311D36187j5188j2860j1319j0841j0563r433p603o227n795n433m228k581j671
63298C32445j956k870l637l812l251k248j568j747k336k441j996j765j996j956
63284B98866j217n54q24j476j253j25M76l42j632j873r18M5J66j88l32k64l98
63267B88157p12o63M7J105K054K733L102K903J981Q59M75J146K150K582K350K039
63251C12308K094K572L492M824O120O694O460O180O668Q011R709J1207J2076J2149
63237D10564J1879J2245J3801J5968J7681J8598J9252K0132K1104K1757K1935
$$ plain form
63226 604916 626672 648042 668853 688931 708279 727395 747184 768204 790014 811644 832691
63215 832691 853444 873826 892840 909458 923485 934975 943158 946646 944580 937022 924320 906757
63203 906757 884915 859866 832782 804667 776475 749074 723009 698668 676647 657529 641253
63192 641253 627308 615758 607480 603077 602077 603712 608085 615907 627246 641060 656022 671440 687422
63179 687422 704488 723021 742768 762775 782047 800303 817911 835176 851991 868120 883431
63168 883431 897720 910601 921730 930894 937643 941072 940218 934659 924595 910460 892688 871730 848011
63155 848011 821753 793137 762837 732235 702781 675113 649032 624348 601442 580775 562147
63144 562147 544838 528458 513286 499763 488035 478106 470026 463555 457918 452318 446714 441806 438251
$$ packed form
63226F04916K1756K1370K0811K0078J9348J9116J9789K1020K1810K1630K1047
63215H32691K0753K0382J9014J6618J4027J1490Q183L488k066p558j2702j7563
63203I06757k1842k5049k7084k8115k8192k7401k6065k4341k2021j9118j6276
63192F41253j3945j1550q278m403j000J635M373P822J1339J3814J4962J5418J5982
63179F87422J7066J8533J9747K0007J9272J8256J7608J7265J6815J6129J5311
63168H83431J4289J2881J1129R164O749L429q54n559j0064j4135j7772k0958k3719
63155H48011k6258k8616l0300l0602k9454k7668k6081k4684k2906k0667j8628
63144E62147j7309j6380j5172j3523j1728r929q080o471n637n600n604m908l555
$$ plain form
63131 438251 436148 435221 435143 435532 435965 436331 437054 438687 441215 443972 446368 448617 451589 455883 461154 466444
63115 466444 471121 475308 479382 483306 486701 489434 491780 493955 495738 496720 496792 496232 495432 494726 494420 494672
63099 494672 495189 495216 494160 492294 490677 490181 490620 491014 490706 490082 490071 491121 492833 494490 495721 496607 497425
63082 497425 498476 500069 502427 505572 509381 513813 518938 524660 530532 536039 541175 546647 553335 561567
63068 561567 570955 580945 591418 602714 615197 628943 643823 659826 677219 696417 717671 740921
63056 740921 765997 793054 822703 855630 892114 931971 974848 1020358 1067970 1117048 1167173
63045 1167173 1218194 1269792 1321151 1371444 1420626 1469431 1518482 1567684 1616617 1665200 1713664
63034 1713664 1762018 1809868 1856630 1901531 1943299 1980177 2010372 2032384 2044955 2047122 2038531 2019505
$$ packed form
63131D38251k103r27p8L89M33L66P23J633K528K757K396K249K972M294N271N290
63115D66444M677M187M074L924L395K733K346K175J783R82P2n60q00p06l06K52
63099D94672N17K7j056j866j617m96M39L94l08o24j1J050J712J657J231Q86Q18
63082D97425J051J593K358L145L809M432N125N722N872N507N136N472O688Q232
63068E61567R388R990J0473J1296J2483J3746J4880J6003J7393J9198K1254K3250
63056G40921K5076K7057K9649L2927L6484L9857M2877M5510M7612M9078N0125
63045A167173N1021N1598N1359N0293M9182M8805M9051M9202M8933M8583M8464
63034A713664M8354M7850M6762M4901M1768L6878L0195K2012J2571K167q591j9026
$$ plain form
63022 2019505 1990605 1952368 1905630 1851884 1792985 1730602 1666176 1601269 1537669 1477189 1421451
63011 1421451 1371668 1328340 1291341 1260664 1236982 1221066 1212689 1210520 1213263 1220539 1232596 1249497
62999 1249497 1270779 1295567 1322838 1351773 1382041 1413568 1445974 1478560 1510946 1543310 1575729
62988 1575729 1607620 1638190 1667179 1694697 1720382 1743052 1761180 1773408 1778692 1776311 1765871 1747159
62976 1747159 1719943 1684092 1640008 1588929 1532823 1473938 1414131 1354368 1294947 1236350 1179764
62965 1179764 1126560 1077407 1032143 990409 952101 917167 885213 855505 827358 800566 775485
62954 775485 752533 731567 711902 693055 675178 658543 642912 627793 613156 599469 587056
62943 587056 575721 564947 554163 542945 531411 520338 510461 501714 493616 486248 480216 475520 471300
$$ packed form
63022B019505k8900l8237m6738n3746n8899o2383o4426o4907o3600o0480n5738
63011A421451m9783m3328l6999l0677k3682j5916q377k169K743P276J2057J6901
62999A249497K1282K4788K7271K8935L0268L1527L2406L2586L2386L2364L2419
62988A575729L1891L0570K8989K7518K5685K2670J8128J2228N284k381j0440j8712
62976A747159k7216l5851m4084n1079n6106n8885n9807n9763n9421n8597n6586
62965A179764n3204m9153m5264m1734l8308l4934l1954k9708k8147k6792k5081
62954G75485k2952k0966j9665j8847j7877j6635j5631j5119j4637j3687j2413
62943E87056j1335j0774j0784j1218j1534j1073r877q747q098p368o032m696m220
$$ plain form
62930 471300 467037 463359 461072 459856 458630 456991 455573 454955 454834 454497 453672 452623 451577 450424 448966
62915 448966 447248 445468 443635 441546 439228 437182 435842 434849 433281 430716 427760 425349 423852 423030 422476
62900 422476 421738 420359 418259 415981 414186 412986 412167 411842 412369 413583 414704 415205 415362 415696 416198 416453
62884 416453 416358 416332 416835 417890 419115 420113 420781 421295 421800 422219 422406 422404 422384 422398 422414 422539 422903 423236 422960 421963
62864 421963 420989 420862 421487 422013 421910 421442 421079 421045 421673 423575 426814 430238 432512 433838 435821 439265 442884
62847 442884 444877 445249 445581 446718 447811 447924 447526 447622 448089 447883 446720 445606 445472 445981 446103 445471 444740
62830 444740 444783 445849 447524 449291 451012 452843 454760 456368 457397 458250 459783 462482 466015 469593 472605
62815 472605 474932 476915 479048 481478 483814 485663 487360 489832 493609 498279 503090 507830 512909 518782
$$ packed form
62930D71300m263l678k287j216j226j639j418o18j21l37q25j049j046j153j458
62915D48966j718j780j833k089k318k046j340r93j568k565k956k411j497q22n54
62900D22476p38j379k100k278j795j200q19l25N27J214J121N01J57L34N02K55
62884D16453r5k6N03J055J225R98O68N14N05M19J87kk0J4J6J25L64L33k76r97
62864D21963r74j27O25N26j03m68l63l4O28J902L239L424K274J326J983L444L619
62847D42884J993L72L32J137J093J13l98R6M67k06j163j114j34N09J22o32p31
62830D44740M3J066J675J767J721J831J917J608J029Q53J533K699L533L578L012
62815D72605K327J983K133K430K336J849J697K472L777M670M811M740N079N873
$$ plain form
62801 518782 525498 532679 539826 546849 554347 563072 573026 583570 594674 607569 623591 642825 664503
62788 664503 688531 715817 747104 782308 821186 863978 911008 962280 1017895 1078408 1144236
62777 1144236 1215041 1290070 1368669 1449846 1531632 1611587 1687872 1759152 1823586 1878727 1922662
62766 1922662 1954545 1973754 1979213 1970202 1947321 1911993 1865297 1808051 1742008 1670202 1595719 1520404
62754 1520404 1444906 1369638 1295397 1223315 1154483 1089638 1029083 972929 921353 874457 831868
62743 831868 792788 756650 723575 694054 668335 646202 627089 610196 594753 580536 567993
62732 567993 557545 548854 541176 534320 528770 524768 521808 519349 517597 517133 517988 519570 521506 524085
62718 524085 527799 532810 539060 546645 555778 566510 578721 592444 608012 625842 646086 668552
$$ packed form
62801E18782O716P181P147P023P498Q725R954J0544J1104J2895J6022J9234K1678
62788F64503K4028K7286L1287L5204L8878M2792M7030N1272N5615O0513O5828
62777A144236P0805P5029P8599Q1177Q1786P9955P6285P1280O4434N5141M3935
62766A922662L1883J9209N459r011k2881l5328m6696n7246o6043p1806p4483p5315
62754A520404p5498p5268p4241p2082o8832o4845o0555n6154n1576m6896m2589
62743H31868l9080l6138l3075k9521k5719k2133j9113j6893j5443j4217j2543
62732E67993j0448q691p678o856n550m002k960k459j752m64Q55J582J936K579
62718E24085L714N011O250P585R133J0732J2211J3723J5568J7830K0244K2466
$$ plain form
62706 668552 693061 719890 749810 783557 821258 862532 907180 955606 1008413 1065701 1126914
62695 1126914 1191317 1258369 1327541 1397831 1467495 1534297 1596021 1650843 1697217 1733517 1758070
62684 1758070 1769730 1768291 1754181 1727897 1690095 1642143 1586081 1523844 1456893 1386834 1315873
62673 1315873 1246107 1178538 1113348 1051098 992940 939499 890204 844202 801540 762896 728419
62662 728419 697485 669519 644465 622273 602474 584587 568563 554399 541536 529117 516862
62651 516862 505395 495640 488020 482214 477397 472672 467551 462230 457364 453428 450360 447798 445520 443554
62637 443554 441987 440826 439994 439287 438311 436623 434102 431198 428727 427312 426927 426998 426988 426861 426943 427436 428241
62620 428241 429293 430804 433018 435850 438970 442184 445569 449328 453696 458917 465045 471789 478785 486048
$$ packed form
62706F68552K4509K6829K9920L3747L7701M1274M4648M8426N2807N7288O1213
62695A126914O4403O7052O9172P0290O9664O6802O1724N4822M6374L6300K4553
62684A758070J1660j439j4110k6284l7802m7952n6062o2237o6951p0059p0961
62673A315873o9766o7569o5190o2250n8158n3441m9295m6002m2662l8644l4477
62662G28419l0934k7966k5054k2192j9799j7887j6024j4164j2863j2419j2255
62651E16862j1467r755p620n806m817m725n121n321m866l936l068k562k278j966
62637D43554j567j161q32p07r76j688k521k904k471j415l85P1j0j27Q2M93Q05
62620D28241J052J511K214K832L120L214L385L759M368N221O128O744O996P263
$$ plain form
62606 486048 493917 502560 511930 522311 534496 549118 566041 584746 605098 627390 651853 678612
62594 678612 708058 740706 776500 814559 853700 892842 930870 966546 998910 1027455 1051601
62583 1051601 1070247 1082156 1086654 1083765 1073947 1058019 1037029 1011685 982014 948056 910856 872250
62571 872250 833625 795420 757951 722123 688855 658206 629627 602937 578598 557040 538130
62560 538130 521415 506582 493480 481852 471293 461530 452695 445210 439284 434508 430122 425742 421625
62547 421625 418104 415031 412139 409744 408588 408911 410040 411024 411352 410949 409899 408534 407510 407309 407731 408227
62531 408227 408729 409819 412057 415492 419978 425735 433339 443223 455252 468775 483127 498236 514777
62518 514777 533598 555044 579055 605810 635817 669141 704944 742144 780313 819503 859282
$$ packed form
62606D86048P869Q643R370J0381J2185J4622J6923J8705K0352K2292K4463K6759
62594F78612K9446L2648L5794L8059L9141L9142L8028L5676L2364K8545K4146
62583A051601J8646J1909M498k889r818j5928k0990k5344k9671l3958l7200l8606
62571H72250l8625l8205l7469l5828l3268l0649k8579k6690k4339k1558j8910
62560E38130j6715j4833j3102j1628j0559r763q835p485n926m776m386m380m117
62547D21625l521l073k892k395j156L23J129R84L28m03j050j365j024k01M22M96
62531D08227N02J090K238L435M486N757P604R884J2029J3523J4352J5109J6541
62518E14777J8821K1446K4011K6755L0007L3324L5803L7200L8169L9190L9779
$$ plain form
62507 859282 898361 935145 968324 996885 1020013 1037252 1048568 1054028 1053514 1046929 1034543 1017014
62495 1017014 995178 970034 942890 915314 888815 864494 842897 824153 808321 795626 786300
62484 786300 780244 777098 776699 779150 784160 790526 796665 801690 805629 808493 809535 807743 802845 795355
62470 795355 785592 773021 756870 737177 714948 691367 667240 643182 619846 597616 576399 556139
62458 556139 537386 520856 506528 493742 482332 473052 466532 462210 458771 455435 452396 450209 449249
62445 449249 449697 451516 454218 457042 459602 462217 465451 469487 473987 478438 482516 486149 489290 491629
62431 491629 492651 492029 489744 485714 479667 471802 463363 455867 449701 443980 437887 431556 425442 419485
62417 419485 413438 407603 402595 398563 395162 392145 389456 386884 384220 381767 380092 379134 378074 376336
$$ packed form
62507H59282L9079L6784L3179K8561K3128J7239J1316N460n14o585j2386j7529
62495A017014k1836k5144k7144k7576k6499k4321k1597j8744j5832j2695r326
62484G86300o056l146l99K451N010O366O139N025L939K864J042j792m898p490
62470G95355r763j2571j6151j9693k2229k3581k4127k4058k3336k2230k1217k0260
62458E56139j8753j6530j4328j2786j1410r280o520m322l439l336l039k187r60
62445D49249M48J819K702K824K560K615L234M036M500M451M078L633L141K339
62431D91629J022o22k285m030o047p865q439p496o166n721o093o331o114n957
62417D19485o047n835n008m032l401l017k689k572k664k453j675r58j060j738
$$ plain form
62403 376336 374258 372470 371113 370093 369806 370922 373473 376581 379288 381399 383379 385612 387955 390016
62389 390016 391715 393444 395612 398124 400573 402972 406031 410473 416200 422478 428872 435659 443251 451517
62375 451517 459912 468160 476599 485906 496586 508730 522186 536932 553291 571763 592699 616185
62363 616185 642247 671012 702691 737554 775976 818406 865147 916130 970758 1027784 1085397
62352 1085397 1141733 1195353 1244949 1288591 1323885 1349318 1365101 1372296 1371492 1362902 1347440 1326664
62340 1326664 1301427 1271351 1236016 1196184 1153500 1109505 1065381 1022141 980469 940633 903105
62329 903105 868941 838934 812585 788591 766283 745967 727814 711170 695095 679021 662606
62318 662606 645532 627807 609917 592348 575220 558588 542682 527561 512919 498696 485608
$$ packed form
62403C76336k078j788j357j020k87J116K551L108K707K111J980K233K343K061
62389C90016J699J729K168K512K449K399L059M442N727O278O394O787P592Q266
62375D51517Q395Q248Q439R307J0680J2144J3456J4746J6359J8472K0936K3486
62363F16185K6062K8765L1679L4863L8422M2430M6741N0983N4628N7026N7613
62352A085397N6336N3620M9596M3642L5294K5433J5783P195q04q590j5462k0776
62340A326664k5237l0076l5335l9832m2684m3995m4124m3240m1672l9836l7528
62329I03105l4164l0007k6349k3994k2308k0316j8153j6644j6075j6074j6415
62318F62606j7074j7725j7890j7569j7128j6632j5906j5121j4642j4223j3088
$$ plain form
62307 485608 474618 465950 458950 452784 447015 441648 436983 433371 430856 429102 427816 427109 427203 427970 429069
62292 429069 430399 432123 434286 436696 439115 441397 443584 446069 449484 454177 459952 466579 474225 482954
62278 482954 492177 501257 510524 520974 532946 545798 559026 572950 588057 604364 621918 641273
62266 641273 662846 686225 710788 736830 765493 797675 833541 872950 915759 961636 1010135
62255 1010135 1061140 1114765 1170512 1226738 1281090 1331260 1375199 1411039 1437344 1453596 1460299
62244 1460299 1458458 1448906 1432007 1407920 1377036 1340041 1297532 1249780 1197153 1140784 1082635 1024763
62232 1024763 968571 914713 863553 815622 771726 732622 698486 668688 642228 618420 597132
62221 597132 578383 562000 547725 535434 524977 515863 507359 499001 490948 483735 477719 472796 468609
$$ packed form
62307D85608j0990q668p000o166n769n367m665l612k515j754j286p07R4P67J099
62292D29069J330J724K163K410K419K282K187K485L415M693N775O627P646Q729
62278D82954R223R080R267J0450J1972J2852J3228J3924J5107J6307J7554J9355
62266F41273K1573K3379K4563K6042K8663L2182L5866L9409M2809M5877M8499
62255A010135N1005N3625N5747N6226N4352N0170M3939L5840K6305J6252O703
62244A460299j841r552j6899k4087l0884l6995m2509m7752n2627n6369n8149n7872
62232A024763n6192n3858n1160m7931m3896l9104l4136k9798k6460k3808k1288
62221E97132j8749j6383j4275j2291j0457r114q504q358q053p213o016m923m187
$$ plain form
62208 468609 464963 461943 459669 458032 456754 455691 455043 455285 456866 459815 463550 467248 470637 474378 479394
62193 479394 485791 492696 499312 505942 513715 523360 534405 545573 555836 565079 573891 582844 592085
62180 592085 601552 611350 621571 631793 641163 649309 657057 665962 677186 691050 707617 727376 751237
62167 751237 780046 814092 852837 894961 938837 983115 1026828 1068916 1107898 1142112 1170138
62156 1170138 1190992 1204229 1210209 1210112 1205345 1196801 1184592 1168292 1147252 1120997 1089853 1055268
62144 1055268 1019279 983498 948658 915028 882965 853132 826451 803811 785424 770398 757377
62133 757377 745755 735935 728284 722337 717375 713258 710147 707750 705644 704333 705230 709217 715654 723129
62119 723129 730850 738844 746990 754365 759769 762683 763522 763046 761780 760086 758426 757040 755288 751760 745377
$$ packed form
62208D68609l646l020k274j637j278j063o48K42J581K949L735L698L389L741N016
62193D79394O397O905O616O630P773R645J1045J1168J0263R243Q812Q953R241
62180E92085R467R798J0221J0222R370Q146P748Q905J1224J3864J6567J9759K3861
62167G51237K8809L4046L8745M2124M3876M4278M3713M2088L8982L4214K8026
62156A170138K0854J3237N980r7m767q544j2209j6300k1040k6255l1144l4585
62144A055268l5989l5781l4840l3630l2063k9833k6681k2640j8387j5026j3021
62133G57377j1622r820p651n947m962m117l111k397k106j311Q97L987O437P475
62119G23129P721P994Q146P375N404K914Q39m76j266j694j660j386j752l528o383
$$ plain form
62104 745377 736175 724821 711850 697937 684603 673756 666270 661556 658765 657875 659185 662251 665985
62091 665985 669774 674022 679479 686288 693822 701405 709120 717789 728027 739412 750915 762190 774097
62078 774097 787753 803446 820701 839107 858659 879466 901529 924823 949380 975319 1002878
62067 1002878 1032224 1063059 1094664 1126585 1159040 1192236 1225469 1257184 1285714 1309624 1327626
62056 1327626 1338922 1343687 1342823 1337130 1327026 1312936 1295364 1274424 1249792 1221265 1189031 1153377
62044 1153377 1114724 1074138 1033184 992904 953346 914440 876833 841306 807759 775448 744127
62033 744127 714397 686923 661865 639209 619175 601985 587419 574848 563633 553335 543604 534034
62021 534034 524258 514213 504259 494936 486586 479197 472551 466450 460901 456241 452941 451076 450090 449352
$$ packed form
62104G45377r202j1354j2971j3913j3334j0847p486m714k791q90J310L066L734
62091F65985L789M248N457O809P534P583P715Q669J0238J1385J1503J1275J1907
62078G74097J3656J5693J7255J8406J9552K0807K2063K3294K4557K5939K7559
62067A002878K9346L0835L1605L1921L2455L3196L3233L1715K8530K3910J8002
62056A327626J1296M765q64n693j0104j4090j7572k0940k4632k8527l2234l5654
62044A153377l8653m0586m0954m0280l9558l8906l7607l5527l3547l2311l1321
62033G44127k9730k7474k5058k2656k0034j7190j4566j2571j1215j0298r731r570
62021E34034r776j0045r954r323q350p389o646o101n549m660l300j865r86p38
$$ plain form
62007 449352 448824 448765 448969 448994 449256 451120 455375 461080 466421 470356 472970 474681 475756 476361 476385 475339 473024
61990 473024 470119 467431 464631 460556 454856 448522 442560 436830 430678 424110 417781 412118 406915 401679
61976 401679 396123 390521 385732 382559 380846 379495 377548 374948 372098 369250 366676 364929 364300 364313 364287
61961 364287 364269 364911 366584 369079 371974 374784 376986 378614 380810 385012 391363 398495 405154 411512 418589
61946 418589 426909 436144 445796 455790 466622 479205 494314 511788 530437 549116 567691 586594
61934 586594 605658 624021 641193 657594 673713 689198 703159 715177 725516 734342 741164 745240
61922 745240 746322 744785 741149 735721 728774 720851 712749 705303 699312 695568 694735 697062 702340 710155
61908 710155 720118 731825 744787 758497 772394 785571 796656 804320 807924 807558 803531 796162 786102
$$ packed form
62007D49352n28n9K04K5K62J864M255N705N341L935K614J711J075O05K4j046k315
61990D73024k905k688k800m075n700o334n962n730o152o568o329n663n203n236
61976D01679n556n602m789l173j713j351j947k600k850k848k574j747o29J3k6
61961C64287j8O42J673K495K895K810K202J628K196M202O351P132O659O358P077
61946D18589Q320R235R652R994J0832J2583J5109J7474J8649J8679J8575J8903
61934E86594J9064J8363J7172J6401J6119J5485J3961J2018J0339Q826O822M076
61922G45240J082j537l636n428o947p923q102p446n991l744q33K327N278P815
61908G10155R963J1707J2962J3710J3897J3177J1085P664L604l66m027p369j0060
$$ plain form
61895 786102 774373 761675 747796 732092 714527 695940 677331 659282 642157 626427 612397
61884 612397 599792 587917 576168 564224 551968 539600 527726 516924 507123 497802 488853 480867
61872 480867 474348 469016 464201 459778 456368 454705 455032 457029 460052 463561 467618 472979 480458 490154
61858 490154 501533 514228 528515 544923 563771 585220 609511 636736 666408 697556 729366
61847 729366 761612 794321 827068 858695 887784 913353 935033 952609 965574 973313 975711 973418
61835 973418 967397 958294 946463 932733 919028 907878 901029 898601 899801 904238 912149 923373 936649
61822 936649 950209 962625 972770 979439 981621 978976 971506 958869 940635 917239 890113 860646
61810 860646 829435 796753 763330 730376 699049 670093 643732 619720 597706 577653 559730
$$ packed form
61895G86102j1729j2698j3879j5704j7565j8587j8609j8049j7125j5730j4030
61884F12397j2605j1875j1749j1944j2256j2368j1874j0802r801r321q949p986
61872D80867o519n332m815m423l410j663L27J997L023L509M057N361P479R696
61858D90154J1379J2695J4287J6408J8848K1449K4291K7225K9672L1148L1810
61847G29366L2246L2709L2747L1627K9089K5569K1680J7576J2965P739K398k293
61835I73418o021r103j1831j3730j3705j1150o849k428J200M437P911J1224J3276
61822I36649J3560J2416J0145O669K182k645p470j2637j8234k3396k7126k9467
61810H60646l1211l2682l3423l2954l1327k8956k6361k4012k2014k0053j7923
$$ plain form
61799 559730 543833 529539 516625 505208 495279 486554 478921 472499 467037 461894 457000 453195 450940
61786 450940 449245 446709 443309 440279 438316 436845 435185 433592 432770 432881 433449 433828 433570 432636 431512 430781
61770 430781 430416 429776 428424 426613 424852 423443 422644 422849 424228 426472 429160 432120 435215 438107 440574
61755 440574 442791 444974 446962 448468 449523 450300 450663 450257 449022 447349 445766 444624 443897 443077 441433
61740 441433 438703 435424 432438 430241 428985 428750 429338 430066 430301 430177 430359 431155 432288 433543 435082 437045
61724 437045 439265 441527 443749 445787 447487 449113 451328 454405 457717 460282 461635 461974 461697 461127 460513
61709 460513 459931 459188 458010 456338 454250 451687 448451 444573 440556 437208 435074 433925 432805 430844 428082
61694 428082 425343 423221 421500 419715 417913 416449 415271 413880 412051 410084 408143 405739 402299 398132
$$ packed form
61799E59730j5897j4294j2914j1417r929q725p633o422n462n143m894l805k255
61786D50940j695k536l400l030j963j471j660j593q22J11N68L79k58r34j124p31
61770D30781l65o40j352j811j761j409p99K05J379K244K688K960L095K892K467
61755D40574K217K183J988J506J055P77L63m06j235j673j583j142p27q20j644
61740D41433k730l279k986k197j256k35N88P28K35j24J82P96J133J255J539J963
61724D37045K220K262K222K038J700J626K215L077L312K565J353L39k77n70o14
61709D60513n82p43j178j672k088k563l236l878m017l348k134j149j120j961k762
61694D28082k739k122j721j785j802j464j178j391j829j967j941k404l440m167
$$ plain form
61680 398132 394426 392116 390970 389945 388337 386295 384257 382189 379705 376797 374128 372510 372251 372998 373991
61665 373991 374408 373777 372298 370635 369233 367980 366653 365460 364830 364889 365496 366728 368817 371522 374018 375714
61649 375714 376999 378877 381949 385952 390194 394174 397781 401100 404211 407152 409990 412779 415308 416957
61635 416957 417064 415672 413679 411972 410379 407852 403731 398527 393265 388436 383998 380141 377287 375228
61621 375228 372972 370023 367358 366374 367025 367796 367599 366848 366233 365219 362690 358740 354858 352222 350505 348643
61605 348643 346092 342932 339207 334800 329825 324707 319852 315495 311791 308732 306015 303256 300402 297743
61591 297743 295563 293899 292600 291354 289755 287599 285159 282940 281171 279747 278578 277651 276776 275710 274668
61576 274668 274256 274611 274998 274605 273459 272218 271352 271018 271479 272933 274863 276202 276469 276314 276653 277621 278680
$$ packed form
61680C98132l706k310j146j025j608k042k038k068k484k908k669j618k59P47R93
61665C73991M17o31j479j663j402j253j327j193o30N9O07J232K089K705K496J696
61649C75714J285J878L072M003M242L980L607L319L111K941K838K789K529J649
61635D16957J07j392j993j707j593k527m121n204n262m829m438l857k854k059
61621C75228k256k949k665r84O51P71j97p51o15j014k529l950l882k636j717j862
61605C48643k551l160l725m407m975n118m855m357l704l059k717k759k854k659
61591B97743k180j664j299j246j599k156k440k219j769j424j169r27q75j066j042
61576B74668m12L55L87l93j146j241q66l34M61J454J930J339K67j55L39R68J059
$$ plain form
61559 278680 279430 279881 280139 280254 280344 280509 280681 280817 281180 282045 283113 283638 283297 282605 282322 282704 283571 284782
61541 284782 286285 287834 289125 290294 291919 294263 296709 298285 298783 299088 300249 302386 304720 306495 307514
61526 307514 307768 307073 305470 303646 302423 301873 301429 300817 300288 299791 298547 295994 292762 290155 288811 288353
61510 288353 288249 288400 288842 289376 289781 290001 289974 289544 288758 287987 287508 287232 287003 286899 286969 287000 286945 287302 288524 290127
61490 290127 290974 290575 289638 289175 289500 290423 291999 294480 297638 300610 302578 303377 303379 303049 302717 302611 302939 303878
61472 303878 305411 307094 308137 308032 307143 306451 306661 307698 309073 310417 311545 312339 312833 313209 313483 313379
61456 313379 312802 312266 312446 313372 314429 315162 315728 316452 317281 317912 318198 318233 318154 318033 317887 317681 317454 317516 318367
61437 318367 320213 322590 324659 325912 326641 327746 329950 333072 336111 338298 339947 341965 344597 347147
$$ packed form
61559B78680P50M51K58J15R0J65J72J36L63Q65J068N25l41o92k83L82Q67J211
61541B84782J503J549J291J169J625K344K446J576M98L05J161K137K334J775J019
61526C07514K54o95j603j824j223n50m44o12n29m97j244k553l232k607j344m58
61510B88353j04J51M42N34M05K20k7m30p86p71m79k76k29j04P0L1n5L57J222J603
61490B90127Q47l99r37m63L25R23J576K481L158K972J968P99Kl30l32j06L28R39
61472C03878J533J683J043j05q89o92K10J037J375J344J128P94M94L76K74j04
61456C13379n77n36J80R26J057P33N66P24Q29O31K86L5p9j21j46k06k27O2Q51
61437C18367J846K377K069J253P29J105K204L122L039K187J649K018K632K550
$$ plain form
61423 347147 349083 350819 353001 355475 357531 358939 360166 361588 363023 364065 364452 364037 362816 361127 359425
61408 359425 357729 355601 352858 349990 347682 346141 345080 344165 343229 342151 340794 339122 337338 335880 335188
61393 335188 335369 336124 337127 338349 339875 341581 343296 345132 347201 349081 350074 350110 349888 350012 350419 350884
61377 350884 351552 352646 354051 355529 356980 358187 358720 358585 358625 359736 361871 364247 366295 367972 369430
61362 369430 371005 373393 377105 381677 385950 389288 392127 395321 399464 404851 411575 419418 427969 436924
61348 436924 445897 454062 460628 465782 470472 475014 478612 480672 481923 483547 485648 487366 488297 488972 489836
61333 489836 490454 490013 488284 485728 482827 479577 475675 471111 466401 462122 458291 454531 450870 448008 446532
61318 446532 446171 446137 445998 445920 446249 447267 449243 452359 456584 461910 468580 476751 486011 495666 505433 515462
$$ packed form
61423C47147J936J736K182K474K056J408J227J422J435J042L87m15j221j689j702
61408C59425j696k128k743k868k308j541j061r15r36j078j357j672j784j458o92
61393C35188J81P55J003J222J526J706J715J836K069J880R93L6k22J24M07M65
61377C50884O68J094J405J478J451J207N33j35M0J111K135K376K048J677J458
61362C69430J575K388L712M572M273L338K839L194M143N387O724P843Q551Q955
61348D36924Q973Q165O566N154M690M542L598K060J251J624K101J718R31O75Q64
61333D89836O18m41j729k556k901l250l902m564m710m279l831l760l661k862j476
61318D46532l61l4j39p8L29J018J976L116M225N326O670Q171R260R655R767J0029
$$ plain form
61302 515462 525623 535258 543754 550978 556990 561656 564797 566407 566536 565185 562544 559115 555375 551446
61288 551446 547204 542484 537067 530799 523973 517337 511378 505818 500206 494838 490614 487991 486540 485702
61274 485702 485596 486771 489356 492736 496033 498731 500886 502934 505371 508445 512082 516098 520528 525690
61260 525690 531881 539059 546948 555422 564598 574361 583932 592134 598134 601763 603183 602573 600303 597062
61246 597062 593388 589097 583580 576783 569659 563401 558341 553797 548965 543771 538742 534234 530067 526008
61232 526008 522341 519680 518280 517857 518160 519345 521553 524399 527255 529949 532800 536008 539376 542694 546042
61217 546042 549616 553550 558005 563084 568445 573395 577651 581677 585896 589912 593040 595421 597953 601120
61203 601120 604574 608061 612124 617454 623990 631201 639023 648102 659213 672787 688713 706061 723015
$$ packed form
61302E15462J0161R635Q496P224O012M666L141J610J29j351k641l429l740l929
61288E51446m242m720n417o268o826o636n959n560n612n368m224k623j451q38
61274D85702j06J175K585L380L297K698K155K048K437L074L637M016M430N162
61260E25690O191P178P889Q474R176R763R571Q202O000L629J420o10k270l241
61246E97062l674m291n517o797p124o258n060m544m832n194n029m508m167m059
61232E26008l667k661j400m23L03J185K208K846K856K694K851L208L368L318L348
61217E46042L574L934M455N079N361M950M256M026M219M016L128K381K532L167
61203F01120L454L487M063N330O536P211P822R079J1111J3574J5926J7348J6954
$$ plain form
61190 723015 737696 749273 758095 764845 769969 773872 776986 779288 780150 779071 776356 772809 768939 764683
61176 764683 759630 753248 745270 736202 727190 718878 710599 701202 690490 679243 667946 656292 644117
61163 644117 632021 620561 609439 598078 586617 575715 565632 556165 547412 539979 534396 530807
61151 530807 529264 529671 531248 532608 532785 531886 530478 528681 526238 523083 519303 514734 509178 503033 497191
61136 497191 492216 488051 484642 482373 481632 482367 484430 488048 493496 500481 508324 516752 526097 536677
61122 536677 548371 560977 574576 589348 605238 622073 639804 658357 677459 696929 717022
61111 717022 738066 759692 780787 800381 818266 834581 849032 860955 870116 877057 882422 886042
61099 886042 886854 883772 876657 866508 854763 842305 829026 814274 797777 780102 762211 744611
$$ packed form
61190G23015J4681J1577Q822O750N124L903L114K302Q62j079k715l547l870m256
61176G64683n053o382p978r068r012q312q279r397j0712j1247j1297j1654j2175
61163F44117j2096j1460j1122j1361j1461j0902j0083r467q753p433n583l589
61151E30807j543M07J577J360J77q99j408j797k443l155l780m569n556o145n842
61136D97191m975m165l409k269p41P35K063L618N448O985P843Q428R345J0580
61122E36677J1694J2606J3599J4772J5890J6835J7731J8553J9102J9470K0093
61111G17022K1044K1626K1095J9594J7885J6315J4451J1923R161O941N365L620
61099H86042Q12l082p115j0149j1745j2458j3279j4752j6497j7675j7891j7600
$$ plain form
61087 744611 727091 709354 691794 675435 661042 648424 636797 625777 615816 607567 600996 595333
61075 595333 589945 585045 581376 579286 578282 577607 577115 577409 579142 582315 586375 590916 596054 602038 608680
61060 608680 615431 622075 629115 637324 647000 657823 669362 681573 694845 709729 726587 745316
61048 745316 765416 786573 809157 833809 860439 888057 915842 944083 973713 1005181 1038209
61037 1038209 1072452 1107837 1144288 1181718 1220518 1261644 1305924 1353399 1403365 1454816 1506879
61026 1506879 1559317 1612857 1668798 1728293 1792348 1862527 1940979 2029477 2128858 2239715 2363176
61015 2363176 2500884 2655114 2829758 3030694 3264527 3537439 3856201 4230170 4671797
61006 4671797 5196058 5820677 6566322 7455053 8509322 9754064 11214599 12896109 14744982
$$ packed form
61087G44611j7520j7737j7560j6359j4393j2618j1627j1020r961q249o571n663
61075E95333n388m900l669k090j004o75m92K94J733L173M060M541N138N984O642
61060F08680O751O644P040Q209R676J0823J1539J2211J3272J4884J6858J8729
61048G45316K0100K1157K2584K4652K6630K7618K7785K8241K9630L1468L3028
61037A038209L4243L5385L6451L7430L8800M1126M4280M7475M9966N1451N2063
61026A506879N2438N3540N5941N9495O4055P0179P8452Q8498R9381J10857J23461
61015B363176J37708J54230J74644K00936K33833K72912L18762L73969M41627
61006D671797N24261O24619P45645Q88731J054269J244742J460535J681510J848873
$$ plain form
60997 14744982 16620756 18315527 19625561 20434415 20754878 20711366 20487062 20268811 20199838
60988 20199838 20335241 20609732 20846317 20821306 20358568 19398576 18006256 16326744 14526083
60979 14526083 12747142 11089119 9605498 8313152 7205925 6266653 5474652 4809524
60971 4809524 4252973 3789042 3403216 3081849 2812630 2585146 2390668 2221824 2072911
60962 2072911 1940229 1821555 1715201 1619747 1534251 1458143 1390700 1330892 1277768 1230596 1188415
60951 1188415 1149685 1112737 1076630 1041400 1007471 975071 944257 915231 888269 863380 840276
60940 840276 818660 798310 778877 759924 741292 723223 706023 689759 674378 659816 645926
60929 645926 632579 619997 608651 598628 589414 580570 572288 564980 558661 553178 548678 545354 542901
$$ packed form
60997A4744982J875774J694771J310034Q08854L20463m3512k24304k18251o8973
60988B0199838J35403K74491K36585k5011m62738r59992j392320j679512j800661
60979A4526083j778941j658023j483621j292346j107227r39272p92001o65128
60971D809524n56551m63931l85826l21367k69219k27484j94478j68844j48913
60962B072911j32682j18674j06354r5454q5496p6108o7443n9808n3124m7172m2181
60951A188415l8730l6948l6107l5230l3929l2400l0814k9026k6962k4889k3104
60940H40276k1616k0350j9433j8953j8632j8069j7200j6264j5381j4562j3890
60929F45926j3347j2582j1346j0023r214q844q282p308o319n483m500l324k453
$$ plain form
60916 542901 540760 538755 536958 535143 532996 530818 529351 528798 528646 528550 528760 529522 530662 531974 533353 534274
60900 534274 533865 532083 530236 529682 530301 530834 530382 528910 526570 523347 519443 515273 510837 505624 499441
60885 499441 492931 486887 481290 475378 468564 461004 453211 445444 437703 430206 423488 417894 413197 408999
60871 408999 405315 402424 400230 398288 396513 395376 395204 395714 396567 397942 400151 403016 406073 409119 412127
60856 412127 414806 416830 418404 420096 422109 424191 426242 428522 431102 433589 435585 437136 438553 440056
60842 440056 441687 443279 444414 444700 444190 443225 441777 439400 436045 432466 429451 426958 424462 421939 419937
60827 419937 418691 417710 416420 414820 413207 411498 409244 406289 403087 400213 397709 395115 392045 388508
60813 388508 384692 380691 376593 372667 369245 366461 364215 362306 360450 358240 355305 351608 347485 343404
$$ packed form
60916E42901k141k005j797j815k147k178j467n53j52r6K10P62J140J312J379R21
60900E34274m09j782j847n54O19N33m52j472k340l223l904m170m436n213o183
60885D99441o510o044n597n912o814p560p793p767p741p497o718n594m697m198
60871D08999l684k891k194j942j775j137j72N10Q53J375K209K865L057L046L008
60856D12127K679K024J574J692K013K082K051K280K580K487J996J551J417J503
60842D40056J631J592J135K86n10r65j448k377l355l579l015k493k496k523k002
60827D19937j246r81j290j600j613j709k254k955l202k874k504k594l070l537
60813C88508l816m001m098l926l422k784k246j909j856k210k935l697m123m081
$$ plain form
60799 343404 339715 336533 333739 331147 328781 326892 325556 324409 323065 321701 320898 320876 321174 321221 320963 320781
60783 320781 321007 321661 322531 323381 324168 325122 326486 328182 329848 331226 332400 333761 335945 339586 344638 349904
60767 349904 353827 355991 357459 359397 361824 363979 365354 365835 365309 363907 362434 361717 361557 360955 359498
60752 359498 357772 356281 354765 353024 351682 351407 351799 351845 351262 350645 350318 349781 348480 346453 343867 340496
60736 340496 336151 331265 326540 322232 318270 314868 312358 310395 307975 304578 300858 297832 295760 294186
60722 294186 292867 292143 292444 293784 295761 297738 299094 299621 299762 300131 300823 301498 302083 302916 304036 304932 305325
60705 305325 305752 306931 308863 311071 313439 316171 319029 321319 322809 324098 325823 327936 330078 332227
60691 332227 334543 336810 338555 339698 340714 342014 343420 344405 344734 344751 345048 345873 346919 347701 348068 348209
$$ packed form
60799C43404l689l182k794k592k366j889j336j147j344j364q03k2K98M7k58j82
60783C20781K26O54Q70Q50P87R54J364J696J666J378J174J361K184L641N052N266
60767C49904L923K164J468J938K427K155J375M81n26j402j473p17j60o02j457
60752C59498j726j491j516j741j342k75L92M6n83o17l27n37j301k027k586l371
60736C40496m345m886m725m308l962l402k510j963k420l397l720l026k072j574
60722B94186j319p24L01J340J977J977J356N27J41L69O92O75N85Q33J120Q96L93
60705C05325M27J179J932K208K368K732K858K290J490J289J725K113K142K149
60691C32227K316K267J745J143J016J300J406R85L29J7K97Q25J046P82L67J41
$$ plain form
60675 348209 348184 347752 346819 345849 345520 345936 346333 345672 343526 340427 337381 334946 332786 330193 327031 323839
60659 323839 320973 318064 314757 311702 310205 310772 312495 314096 315251 316563 318524 320969 323557 326313
60645 326313 329400 332475 334577 334885 333547 331616 330082 329035 327871 326195 324263 322492 320834 318952
60631 318952 316934 315515 315356 316177 316848 316489 315357 314466 314395 314798 315102 315277 315597 315981 316018 315572 314953 314534
60613 314534 314569 315282 316650 318114 319087 319791 320964 322573 323617 323649 323709 324979 327067 328506 328670 328261 328036
60596 328036 328069 328368 329243 330665 332014 333000 334235 336335 338854 340721 341510 341766 342185 342895 343513 343593 343047
60579 343047 342351 342322 343472 345579 347989 350260 352459 355020 358398 362732 367801 373474 380181 388517 398199
60564 398199 407798 415860 422071 427141 431816 436254 440048 442410 442512 440116 435934 431158 426712 423051
$$ packed form
60675C48209k5m32r33r70l29M16L97o61k146l099l046k435k160k593l162l192
60659C23839k866k909l307l055j497N67J723J601J155J312J961K445K588K756
60645C26313L087L075K102L08j338j931j534j047j164j676j932j771j658j882
60631C18952k018j419j59Q21O71l59j132q91p1M03L04J75L20L84L7m46o19m19
60613C14534L5P13J368J464R73P04J173J609J044L2O0J270K088J439J64m09k25
60596C28036L3K99Q75J422J349R86J235K100K519J867P89K56M19P10O18Q0n46
60579C43047o96k9J150K107K410K271K199K561L378M334N069N673O707Q336R682
60564C98199R599Q062O211N070M675M438L794K362J02k396m182m776m446l661
$$ plain form
60550 423051 420489 419349 419846 421983 425489 429840 434560 439680 445629 452642 460659 469888 480879 493686
60536 493686 507559 521839 536449 550847 563285 572096 577323 580049 580510 578070 572905 566342 559379
60523 559379 552146 545098 539354 535227 531596 527600 523906 521395 519510 517193 514848 514027 515339 517847
60509 517847 520577 523589 527370 532050 537656 544584 553475 564934 579482 597503 619113 644326 673247
60496 673247 705812 741444 779350 818925 859392 899183 936261 968999 996148 1016066 1026769
60485 1026769 1027065 1017122 997863 970399 936245 897332 855324 811364 766838 723808 684101 648315
60473 648315 616179 587532 562353 540205 520373 502555 486794 472792 459926 448120 438065
60462 438065 430243 424148 418818 413858 409525 405959 402747 399344 395706 392392 390047 388753 387833 386326
$$ packed form
60550D23051k562j140M97K137L506M351M720N120N949P013Q017R229J0991J2807
60536D93686J3873J4280J4610J4398J2438Q811N227K726M61k440n165o563o963
60523E59379p233p048n744m127l631l996l694k511j885k317k345q21J312K508
60509E17847K730L012L781M680N606O928Q891J1459J4548J8021K1610K5213K8921
60496F73247L2565L5632L7906L9575M0467L9791L7078L2738K7149J9918J0703
60485A026769K96r943j9259k7464l4154l8913m2008m3960m4526m3030l9707l5786
60473F48315l2136k8647k5179k2148j9832j7818j5761j4002j2866j1806j0055
60462D38065p822o095n330m960m333l566l212l403l638l314k345j294r20j507
$$ plain form
60448 386326 383735 380313 376663 373230 370175 367517 365146 362877 360748 359220 358757 359225 359967 360482 360722
60433 360722 360684 360151 359070 357839 356833 355929 354887 353991 353741 353972 353917 353267 352663 352902 354086 355889 358164
60416 358164 360814 363313 364912 365341 365051 364798 365215 366588 368588 370277 370742 369904 368487 367263 366623 366825
60400 366825 368141 370496 373313 376035 378663 381483 384390 386843 388561 389906 391403 393038 394358 395241
60386 395241 396308 398427 401953 406572 411672 416602 420775 423946 426489 429089 432066 435233 438422 441678
60372 441678 444810 447269 448827 449993 451299 452540 453234 453585 454370 455916 457791 459530 461120 462664 464144
60357 464144 465764 468144 471872 477117 483735 491414 499552 507406 514644 521463 527934 533488 537316 539036
60343 539036 538725 536611 532994 528277 522744 516496 509838 503459 497855 492803 487861 483224 479569 477037
$$ packed form
60448C86326k591l422l650l433l055k658k371k269k129j528m63M68P42N15K40
60433C60722l8n33j081j231j006r04j042q96k50K31n5o50o04K39J184J803K275
60416C58164K650K499J599M29k90k53M17J373K000J689M65q38j417j224o40K02
60400C66825J316K355K817K722K628K820K907K453J718J345J497J635J320Q83
60386C95241J067K119L526M619N100M930M173L171K543K600K977L167L189L256
60372D41678L132K459J558J166J306J241O94L51P85J546J875J739J590J544J480
60357D64144J620K380L728N245O618P679Q138P854P238O819O471N554L828J720
60343E39036l11k114l617m717n533o248o658o379n604n052m942m637l655k532
$$ plain form
60329 477037 474961 472717 470323 467886 464949 460993 456444 452585 450279 449110 448008 446486 445018 444424
60315 444424 445308 448034 452705 458852 465483 471911 478521 486332 495827 506473 517436 528331 539066
60302 539066 549319 558500 566145 572059 576119 578058 577432 573744 566777 556987 545480 533352 521100
60289 521100 508783 496659 485405 475674 467638 461047 455611 451164 447518 444272 440917 437167 433144
60276 433144 429157 425381 421894 418964 416961 415856 415070 414086 413082 412623 412852 413304 413475 413139 412036 409831
60260 409831 406793 404165 403166 403638 404196 403877 403096 402729 402814 402760 402500 402675 403572 404599 405127 405325 405734 406358
60242 406358 406708 406541 406106 405708 405445 405333 405349 405325 405136 405065 405646 407032 408736 410127 411038 411839 413019 414734
60224 414734 416614 418104 419110 420210 422047 424670 427729 431095 434847 438820 442733 446832 451799 457822
$$ packed form
60329D77037k076k244k394k437k937l956m549l859k306j169j102j522j468n94
60315D44424Q84K726M671O147O631O428O610P811R495J0646J0963J0895J0735
60302E39066J0253R181P645N914M060J939o26l688o967r790j1507j2128j2252
60289E21100j2317j2124j1254r731q036o591n436m447l646l246l355l750m023
60276D33144l987l776l487k930k003j105p86r84j004m59K29M52J71l36j103k205
60260D09831l038k628r99M72N58l19p81l67Q5n4k60J75Q97J027N28J98M09O24
60242D06358L50j67m35l98k63j12J6k4j89p1N81J386J704J391R11Q01J180J715
60224D14734J880J490J006J100J837K623L059L366L752L973L913M099M967O023
$$ plain form
60210 457822 464223 470238 475756 481016 486004 490493 494391 497731 500581 503217 506093 509363 512710 515918
60196 515918 519175 522405 524661 524840 522915 520028 517381 515463 514176 513200 512124 510678 508947 507147 505206
60181 505206 502941 500568 498538 496740 494452 491433 488676 487528 488169 489327 489554 488480 486785 485287 484277
60166 484277 483609 483067 482544 482003 481413 480714 479850 478890 478116 477817 477939 478155 478378 478946 480029 481119 481519 481242
60148 481242 480986 481241 481808 482201 482098 481418 480453 479962 480630 482298 484248 486311 489039 492654 496595 500468
60132 500468 504628 509267 513660 517024 519530 521670 523205 523692 523658 524215 525651 527321 528759 529995 530865
60117 530865 531114 531251 532233 534019 535408 535659 535358 535226 534966 533908 532093 529959 527534 524680 521752 519345
60101 519345 517547 516070 514895 514301 514352 514823 515580 516659 518077 519839 521982 524392 526719 528763 530749
$$ packed form
60210D57822O401O015N518N260M988M489L898L340K850K636K876L270L347L208
60196E15918L257L230K256J79j925k887k647j918j287r76j076j446j731j800j941
60181E05206k265k373k030j798k288l019k757j148O41J158K27j074j695j498j010
60166D84277o68n42n23n41n90o99q64r60p74k99J22K16K23N68J083J090M00k77
60148D81242k56K55N67L93j03o80r65m91O68J668J950K063K728L615L941L873
60132E00468M160M639M393L364K506K140J535M87l4N57J436J670J438J236Q70
60117E30865K49J37R82J786J389K51l01j32k60j058j815k134k425k854k928k407
60101E19345j798j477j175n94N1M71P57J079J418J762K143K410K327K044J986
$$ plain form
60086 530749 532923 535101 536901 538200 539004 539073 538096 536147 533666 530977 528088 524853 521106 516712 511681
60071 511681 506144 500100 493436 486424 479887 474515 470134 466014 461779 457716 454266 451495 449024 446268
60057 446268 442900 439262 436134 433852 431929 429856 428009 427276 427964 429610 431727 434127 436514 438430 439872
60042 439872 441486 443853 446909 450343 454093 458043 461451 463258 463066 461535 459634 457658 455132 451700
60028 451700 447890 444765 442816 441390 439382 436337 432686 429078 425727 422356 418502 413867 408604 403290
60014 403290 398464 394212 390372 387006 384308 382098 379879 377573 375793 375068 375045 374800 373849 372547 371576 371310
59998 371310 371666 372338 373049 373759 374660 375857 377080 377889 378292 378943 380535 383084 386008 388783 391236 393236
59982 393236 394522 395065 395291 395575 395680 395084 393794 392421 391412 390570 389463 387919 385973 383697 381382 379630
$$ packed form
60086E30749K174K178J800J299Q04O9r77j949k481k689k889l235l747m394n031
60071E11681n537o044o664p012o537n372m381m120m235m063l450k771k471k756
60057D46268l368l638l128k282j923k073j847p33O88J646K117K400K387J916J442
60042D39872J614K367L056L434L750L950L408J807j92j531j901j976k526l432
60028D51700l810l125j949j426k008l045l651l608l351l371l854m635n263n314
60014D03290m826m252l840l366k698k210k219k306j780p25k3k45r51j302r71k66
59998C71310L56O72P11P10R01J197J223Q09M03O51J592K549K924K775K453K000
59982C93236J286N43K26K84J05n96j290j373j009q42j107j544j946k276k315j752
$$ plain form
59966 379630 378890 379035 379599 380244 380777 380945 380667 380327 380420 380876 381137 380977 380864 381328 382254 383063 383450 383688 384209
59947 384209 385082 385961 386462 386483 386133 385487 384528 383291 381856 380234 378455 376842 375905 375870 376510 377539 378829
59930 378829 380140 381106 381885 383433 386534 390779 395052 398866 402554 406226 409311 411376 412693 413649 414148
59915 414148 414103 414036 414569 415521 416115 416085 416040 416693 418091 419815 421588 423420 425323 427147 428754 430169 431449
59898 431449 432436 432776 432336 431598 431516 432859 435654 439234 442789 445935 448888 452190 456244 461044 466310 471766
59882 471766 477237 482582 487709 492715 497853 503283 508888 514323 519235 523448 526964 529780 531656 532217
59868 532217 531403 529715 527859 526218 524800 523544 522378 521044 519239 517082 515213 514232 514172 514674 515611 517346
59852 517346 520356 524737 530114 536054 542383 548933 555008 559386 561104 560202 557725 555199 554050 554971 557362
$$ packed form
59966C79630p40J45N64O45N33J68k78l40R3M56K61j60j13M64R26Q09L87K38N21
59947C84209Q73Q79N01K1l50o46r59j237j435j622j779j613r37l5O40J029J290
59930C78829J311R66P79J548L101M245M273L814L688L672L085K065J317R56M99
59915D14148m5o7N33R52N94l0m5O53J398J724J773J832J903J824J607J415J280
59898D31449R87L40m40p38q2J343K795L580L555L146K953L302M054M800N266N456
59882D71766N471N345N127N006N138N430N605N435M912M213L516K816J876N61
59868E32217q14j688j856j641j418j256j166j334j805k157j869r81o0N02R37J735
59852E17346L010M381N377N940O329O550O075M378J718r02k477k526j149R21K391
$$ plain form
59837 557362 559623 560425 559620 557697 554756 550641 545810 541249 537438 534100 531116 528906 527549 526196 523944
59822 523944 520928 518059 515941 514433 513013 511175 508668 505760 503113 501044 499056 496356 492679 488331
59808 488331 483704 479112 474954 471535 468696 465922 462853 459608 456608 454202 452285 450266 447703 445017
59794 445017 443123 442220 441468 440223 438979 438483 438470 438109 437407 437253 438083 439263 439913 439667 438610 437165 436171
59777 436171 436388 437672 439195 440630 442484 445022 447636 449726 451609 453963 456785 459516 461928 464315
59763 464315 466882 469371 471395 472937 474588 477196 481004 485055 487973 489543 491025 493587 496929 499988
59749 499988 502485 505057 508083 511175 513867 516202 518495 520932 523511 526103 528555 530994 533903 537543
59735 537543 541420 544809 547677 550555 553557 556131 557932 559354 560918 562580 563939 564778 565135 565123 564918
$$ packed form
59837E57362K261Q02q05j923k941m115m831m561l811l338k984k210j357j353k252
59822E23944l016k869k118j508j420j838k507k908k647k069j988k700l677m348
59808D88331m627m592m158l419k839k774l069l245l000k406j917k019k563k686
59794D45017j894r03p52j245j244m96j3l61p02j54Q30J180O50k46j057j445r94
59777D36171K17J284J523J435J854K538K614K090J883K354K822K731K412K387
59763D64315K567K489K024J542J651K608L808M051K918J570J482K562L342L059
59749D99988K497K572L026L092K692K335K293K437K579K592K452K439K909L640
59735E37543L877L389K868K878L002K574J801J422J564J662J359Q39L57j2k05
$$ plain form
59720 564918 564644 564131 563127 561933 561401 561941 562894 563241 562641 561340 559423 556772 553757 551349 550313 550552
59704 550552 551380 552219 552919 553611 554442 555504 556947 558955 561422 563660 564819 564746 564143 563632 562985 561598 559434
59687 559434 557083 555071 553543 552461 551600 550442 548634 546538 544830 543525 541972 539843 537442 534808
59673 534808 531237 526199 520230 514334 508894 503736 499027 495408 493204 492000 491072 489896 488268 486346
59659 486346 484727 484181 485079 487092 489435 491398 492789 494044 495750 497949 500047 501553 502579 503273 503098
59644 503098 501239 497655 493275 489167 485901 483608 482028 480423 478001 474741 471482 469032 467521 466703
59630 466703 466407 466453 466507 466307 465735 464476 462016 458238 453708 449061 444449 439886 435716 432265 429274 426147
59614 426147 422654 419077 415901 413691 412924 413443 414284 414616 414706 415380 416738 418107 419240 420645 422510 424069
$$ packed form
59720E64918k74n13j004j194n32N40R53L47o00j301j917k651l015k408j036K39
59704E50552Q28Q39P00O92Q31J062J443K008K467K238J159p3o03n11o47j387k164
59687E59434k351k012j528j082q61j158j808k096j708j305j553k129k401k634
59673E34808l571n038n969n896n440n158m709l619k204j204r28j176j628j922
59659D86346j619n46Q98K013K343J963J391J255J706K199K098J506J026O94j75
59644E03098j859l584m380m108l266k293j580j605k422l260l259k450j511q18
59630D66703k96M6N4k00n72j259k460l778m530m647m612m563m170l451k991l127
59614D26147l493l577l176k210p67N19Q41L32R0O74J358J369J133J405J865J559
$$ plain form
59598 424069 424607 424565 425068 426651 428887 431136 433166 435186 437599 440680 444185 447361 449587 450872 451455
59583 451455 451075 449132 445621 441520 438041 435660 433975 432321 430388 428407 426852 425914 425188 423956 421894
59568 421894 419446 417412 416151 415249 413956 411946 409629 407768 406782 406479 406455 406644 407364 408816 410727 412583
59552 412583 414150 415612 417248 419172 421464 424367 428129 432688 437727 443132 449254 456676 465910 477429
59538 477429 491666 508569 526957 544508 558522 566939 569029 565610 558692 550580 542951 536666 532200
59525 532200 529859 529445 530109 530984 531895 533148 534653 535613 535133 532965 529555 525554 521384 517005 511926 505560
59509 505560 497861 489566 481625 474404 467673 461364 455936 451770 448519 445515 442716 440718 439713 438929
59495 438929 437485 435482 433710 432472 431317 429996 429010 428847 429182 429377 429477 430030 431079 432085 433045 434948
$$ packed form
59598D24069N38m2N03J583K236K249K030K020K413L081L505L176K226J285N83
59583D51455l80j943l511m101l479k381j685j654j933j981j555r38p26j232k062
59568D21894k448k034j261r02j293k010k317j861r86l03k4J89P20J452J911J856
59552D12583J567J462J636J924K292K903L762M559N039N405O122P422R234J1519
59538D77429J4237J6903J8388J7551J4014Q417K090l419o918q112p629o285m466
59525E32200k341m14O64Q75R11J253J505R60m80k168l410m001m170m379n079o366
59509E05560p699q295p941p221o731o309n428m166l251l004k799j998j005p84
59495D38929j444k003j772j238j155j321r86j63L35J95J00N53J049J006R60J903
$$ plain form
59479 434948 438546 443113 447087 449804 451943 454244 456486 458029 458860 459564 460560 461852 463459 465526 467914
59464 467914 470056 471448 472064 472255 472532 473572 476042 480020 484750 489315 493601 498350 504251 511091 517797
59449 517797 523239 527025 529654 531884 533890 535117 534981 533470 530919 527462 523061 517950 512635 507482
59435 507482 502662 498500 495449 493545 492238 491037 490154 490290 491940 495050 499218 504046 509483 515967 524151
59420 524151 534347 546352 559859 574785 591106 608722 627864 649265 673232 698259 720777
59409 720777 736568 742701 738795 727118 711590 696036 682754 672612 666317 665058 669431 677873 686656
59396 686656 691690 690381 682150 667901 649493 629393 609977 592636 577620 564892 554903 548179
59384 548179 544341 542014 539961 537991 536598 536015 536013 536437 537501 539422 542054 545031 548144 551404 554725
$$ packed form
59479D34948L598M567L974K717K139K301K242J543Q31P04R96J292J607K067K388
59464D67914K142J392O16J91K77J040K470L978M730M565M286M749N901O840O706
59449E17797N442L786K629K230K006J227j36j511k551l457m401n111n315n153
59435E07482m820m162l051j904j307j201q83J36J650L110M168M828N437O484Q184
59420E24151J0196J2005J3507J4926J6321J7616J9142K1401K3967K5027K2518
59409G20777J5791O133l906j1677j5528j5554j3282j0142o295j259M373Q442Q783
59396F86656N034j309q231j4249j8408k0100j9416j7341j5016j2728r989o724
59384E48179l838k327k053j970j393n83kM24J064J921K632K977L113L260L321
$$ plain form
59369 554725 557672 559695 560760 561667 563433 566189 568971 570852 572074 573744 576544 580148 583862 587447
59355 587447 591251 595884 601944 609752 619173 629877 641813 655174 669776 684791 699304 712947
59343 712947 725838 738164 749911 760718 769792 776290 780067 781691 781476 778894 773444 765717 756913
59330 756913 747482 736995 725398 713587 702399 691661 680769 669795 659500 650388 642213 634415
59318 634415 626733 619353 612653 606808 601655 597018 593131 590343 588312 585979 582795 579664 578145 578936
59304 578936 581714 586388 593627 603699 615184 625299 631369 631877 626536 616038 601839 585818 569773
59291 569773 555060 542437 532044 523550 516603 511133 507142 504243 501770 499488 497958 497935 499474 501879
59277 501879 504565 507711 511978 517789 525081 533572 542889 552459 561610 570020 577896 585598 593236 600717
$$ packed form
59369E54725K947K023J065R07J766K756K782J881J222J670K800L604L714L585
59355E87447L804M633O060P808R421J0704J1936J3361J4602J5015J4513J3643
59343G12947J2891J2326J1747J0807R074O498L777J624k15k582n450p727q804
59330G56913r431j0487j1597j1811j1188j0738j0892j0974j0295r112q175p798
59318F34415p682p380o700n845n153m637l887k788k031k333l184l131j519P91
59304E78936K778M674P239J0072J1485J0115O070N08n341j0498j4199j6021j6045
59291E69773j4713j2623j0393q494o947n470l991k899k473k282j530k3J539K405
59277E01879K686L146M267N811P292Q491R317R570R151Q410P876P702P638P481
$$ plain form
59263 600717 607885 614265 618857 620614 619255 615449 610246 604604 599299 594778 590841 586838 582480 578242
59249 578242 574747 571974 569434 567008 565234 564714 565494 567186 569486 572406 576014 580112 584323 588554 593209
59234 593209 598664 604582 609985 614113 616916 618542 618741 617184 614186 610615 607048 603343 599119 594305
59220 594305 589071 583509 577589 571293 564713 558140 552114 547136 543132 539338 534943 529861 524805 520655
59206 520655 517824 516097 514896 513701 512294 510705 509031 507357 505848 504724 504113 503985 504263 504913 505916
59191 505916 507267 509024 511238 513848 516798 520233 524359 529010 533569 537514 540895 544169 547732 551723
59177 551723 556071 560478 564523 568077 571536 575425 579863 584683 589966 595980 602545 608853 614174 618402
59163 618402 621728 624081 625253 625352 624706 623321 620791 616739 611127 604158 596235 588004 580033 572277 564193
$$ packed form
59263F00717P168O380M592J757j359l806n203n642n305m521l937m003m358m238
59249E78242l495k773k540k426j774n20P80J692K300K920L608M098M211M231M655
59234E93209N455N918N403M128K803J626J99j557k998l571l567l705m224m814
59220E94305n234n562n920o296o580o573o026m978m004l794m395n082n056m150
59206E20655k831j727j201j195j407j589j674j674j509j124o11j28K78O50J003
59191E05916J351J757K214K610K950L435M126M651M559L945L381L274L563L991
59177E51723M348M407M045L554L459L889M438M820N283O014O565O308N321M228
59163F18402L326K353J172R9o46j385k530m052n612o969p923q231p971p756q084
$$ plain form
59148 564193 555563 546919 538940 531789 525306 519479 514180 508728 502379 495287 488430 482497 477412 473077
59134 473077 469933 468286 467556 466769 465624 464608 464146 464107 464177 464403 465284 467467 471294 476462 482260 488321
59118 488321 494918 502284 509933 517198 524296 532210 541382 551021 559984 567982 575649 583704 592313 601093
59104 601093 609511 617288 624496 631116 636651 640463 642561 643639 644159 643814 642206 639713 637257 635335 633692
59089 633692 631991 630429 629516 629339 629216 628168 625779 622462 618773 614615 609473 603407 597312 591954 587031
59074 587031 581568 575078 568041 561343 555486 550342 545501 540816 536560 532951 529597 525802 521496 517446
59060 517446 514271 511597 508575 504971 501316 498162 495632 493643 492075 490663 489060 487096 484819 482369
59046 482369 480076 478563 478299 479000 479874 480478 480932 481234 480964 480085 479587 480648 483147 485588 486763 487124 488143
$$ packed form
59148E64193q630q644p979p151o483n827n299n452o349p092o857n933n085m335
59134D73077l144j647p30p87j145j016m62l9P0K26Q81K183L827N168N798O061
59118D88321O597P366P649P265P098P914R172R639Q963P998P667Q055Q609Q780
59104F01093Q418P777P208O620N535L812K098J078N20l45j608k493k456j922j643
59089F33692j701j562r13j77j23j048k389l317l689m158n142o066o095n358m923
59074E87031n463o490p037o698n857n144m841m685m256l609l354l795m306m050
59060E17446l175k674l022l604l655l154k530j989j568j412j603j964k277k450
59046D82369k293j513k64P01Q74O04M54L02k70q79m98J061K499K441J175L61J019
$$ plain form
59029 488143 490585 493970 497766 502402 508632 516337 524682 533320 542671 552910 563432 573637 583527
59016 583527 593026 601322 607619 612104 615399 617362 617311 615367 612742 610537 608947 607825 607301 607526 608352
59001 608352 609681 611754 614720 618235 621801 625226 628482 631378 633680 635416 636786 637769 637966 636826 634168
58986 634168 630605 627261 624726 622391 619222 615172 611373 608995 608456 609660 612320 615880 619853 624563
58972 624563 630951 639285 648679 658214 667814 677544 686829 695158 703043 711376 720111 728439 735993 743020
58958 743020 749418 754426 757364 757992 756103 751463 744331 735482 725510 714598 702986 691097 679093
58945 679093 666938 655052 644222 634583 625364 616131 607735 601393 597088 593485 589345 584634 580299
58932 580299 577379 576291 576627 577378 577489 576412 574380 572254 570938 570614 570590 570093 569125 568185 567293 565918 563968
$$ packed form
59029D88143K442L385L796M636O230P705Q345Q638R351J0239J0522J0205R890
59016E83527R499Q296O297M485L295J963n1j944k625k205j590j122n24K25Q26
59001F08352J329K073K966L515L566L425L256K896K302J736J370R83J97j140k658
58986F34168l563l344k535k335l169m050l799k378n39J204K660L560L973M710
58972F24563O388Q334R394R535R600R730R285Q329P885Q333Q735Q328P554P027
58958G43020O398N008K938O28j889m640p132q849r972j0912j1612j1889j2004
58945F79093j2155j1886j0830r639r219r233q396o342m305l603m140m711m335
58932E80299k920j088L36P51J11j077k032k126j316l24k4m97r68r40q92j375j950
$$ plain form
58915 563968 562220 561375 561213 561107 560955 561116 561764 562921 564921 568235 572864 578438 584923 592683 601756 611564
58899 611564 621547 631689 642169 652820 663206 673041 682355 691496 701213 712521 726099 741726
58887 741726 758407 775030 790791 805176 817871 828818 838142 845809 851385 854311 854449 852255 848323
58874 848323 842844 835592 826425 815666 804103 792695 782241 773136 765378 758815 753301 748535 743935
58861 743935 739021 733821 728524 722814 716121 708560 700936 693431 684978 674641 663167 652364 643171
58848 643171 635189 627972 621729 616446 611270 605424 599147 593090 587229 581080 574737 568944 564075 559639
58834 559639 555047 550444 546428 543160 540092 536723 533403 531099 530357 530768 531736 533390 536218 539902 543241
58819 543241 545437 546880 548417 550430 553053 556584 560990 565360 568716 571133 573313 575142 575566 574060
$$ packed form
58915E63968j748q45j62j06j52J61O48J157K000L314M629N574O485P760R073R808
58899F11564R983J0142J0480J0651J0386R835R314R141R717J1308J3578J5627
58887G41726J6681J6623J5761J4385J2695J0947R324P667N576K926J38k194l932
58874H48323n479p252r167j0759j1563j1408j0454r105p758o563n514m766m600
58861G43935m914n200n297n710o693p561p624p505q453j0337j1474j0803r193
58848F43171p982p217o243n283n176n846o277o057n861o149o343n793m869m436
58834E59639m592m603m016l268l068l369l320k304p42M11R68J654K828L684L339
58819E43241K196J443J537K013K623L531M406M370L356K417K180J829M24j506
$$ plain form
58805 574060 571482 569111 567424 566087 564635 562710 559990 556349 552003 547283 542404 537565 532986 528650
58791 528650 524238 519569 514933 510874 507775 505767 504786 504631 505112 506208 507903 509995 512401 515555 519902
58776 519902 524878 528994 531278 532144 532583 532962 533014 532442 530940 528021 523484 517881 511966 505912 499660 493805
58760 493805 489304 486201 483417 480171 477112 475588 476003 477348 478344 478791 479621 481721 484949 488428 491516
58745 491516 494160 496469 498519 500662 503480 507179 511455 516098 521057 525719 529024 530952 533078 536764
58731 536764 541478 545965 550492 556476 564005 571182 576306 579563 582148 584737 587370 590044 592768 595592
58717 595592 598992 603670 609575 615750 621528 627176 632954 638331 642742 646340 649154 650051 647577 641626
58703 641626 633537 624605 615110 604647 592745 579220 564510 549739 536043 523808 512777 502666
$$ packed form
58805E74060k578k371j687j337j452j925k720l641m346m720m879m839m579m336
58791E28650m412m669m636m059l099k008r81j55M81J096J695K092K406L154M347
58776E19902M976M116K284Q66M39L79N2n72j502k919m537n603n915o054o252n855
58760D93805m501l103k784l246l059j524M15J345R96M47Q30K100L228L479L088
58745D91516K644K309K050K143K818L699M276M643M959M662L305J928K126L686
58731E36764M714M487M527N984P529P177N124L257K585K589K633K674K724K824
58717E95592L400M678N905O175N778N648N778N377M411L598K814Q97k474n951
58703F41626q089q932r495j0463j1902j3525j4710j4771j3696j2235j1031j0111
$$ plain form
58691 502666 493296 484437 476056 468617 462614 457893 453826 450044 446579 443453 440628 438305 436786 435998
58677 435998 435503 434933 434158 433176 432270 432081 433113 435279 438358 442748 449189 457775 467782 478479 489625
58662 489625 501101 512496 523132 532125 538437 541411 541376 539335 535986 531402 525714 519546 513533 507816
58648 507816 502275 497024 492384 488508 485202 482105 479026 476161 473839 471920 469701 466756 463638 461269
58634 461269 459768 458382 456588 454669 453100 451918 450935 450211 450053 450783 452591 455401 458788 462306 465896
58619 465896 469710 473636 477441 481321 485680 490309 494308 497099 499010 500630 502078 503248 504318 505535
58605 505535 506730 507413 507186 505917 503758 501234 499061 497564 496469 495397 494322 493392 492619 492012 491755 492033
58589 492033 492881 494369 496641 499654 503304 508025 514736 523706 533743 543048 550781 557435 563849 570259
$$ packed form
58691E02666r370q859q381p439o003m721m067l782l465l126k825k323j519p88
58677D35998m95n70p75r82r06j89J032K166L079M390O441Q586J0007J0697J1146
58662D89625J1476J1395J0636Q993O312K974l5k041l349m584n688o168o013n717
58648E07816n541n251m640l876l306l097l079k865k322j919k219k945l118k369
58634D61269j501j386j794j919j569j182r83p24j58P30J808K810L387L518L590
58619D65896L814L926L805L880M359M629L999K791J911J620J448J170J070J217
58605E05535J195O83k27j269k159k524k173j497j095j072j075r30p73o07k57K78
58589D92033Q48J488K272L013L650M721O711Q970J0037R305P733O654O414O410
$$ plain form
58575 570259 576315 581699 586692 592194 598997 606960 615261 623678 633167 644764 658282 672701 687623
58562 687623 703668 721481 740888 761082 781104 800040 817244 832560 845965 856909 864436 868215
58550 868215 869051 868134 866087 863038 859203 854920 850231 844873 838624 831276 822320 811201 798060 783860
58536 783860 769432 754762 739527 724054 709209 695476 682822 671511 662313 655496 650238 645591
58524 645591 641603 638821 637009 635229 633070 630923 628891 626346 622969 619496 616770 614615 612329 609965
58510 609965 608336 607755 607434 606311 604115 601453 599112 597432 596201 594998 593599 592063 590514 589025 587699
58495 587699 586598 585515 584161 582781 582264 583270 585419 587713 589702 591933 595320 600390 607131 615272
58481 615272 624506 634569 645193 656049 666849 677562 688392 699311 709646 718209 723856 725957
$$ packed form
58575E70259O056N384M993N502O803P963Q301Q417R489J1597J3518J4419J4922
58562F87623J6045J7813J9407K0194K0022J8936J7204J5316J3405J0944P527L779
58550H68215Q36r17k047l049l835m283m689n358o249p348q956j1119j3141j4200
58536G83860j4428j4670j5235j5473j4845j3733j2654j1311r198o817n258m647
58524F45591l988k782j812j780k159k147k032k545l377l473k726k155k286k364
58510F09965j629n81l21j123k196k662k341j680j231j203j399j536j549j489j326
58495E87699j101j083j354j380n17J006K149K294J989K231L387N070O741Q141
58481F15272R234J0063J0624J0856J0800J0713J0830J0919J0335Q563N647K101
$$ plain form
58469 725957 724548 720250 714020 706845 699569 692801 686805 681529 676971 673524 671696 671528 672577 674508
58455 674508 677397 681453 686831 693730 702151 711320 719805 726486 731041 733338 733030 730188 725779 720861
58441 720861 715645 709996 704468 700085 697218 695403 694229 693684 693644 693795 694295 695873 698942 703099 707828
58426 707828 713204 719575 726911 734898 743302 751700 758958 763543 764567 762353 758013 752688 747138 741612
58412 741612 735838 729323 721977 714406 707405 701242 695690 690713 686655 683642 681306 679474 678677 679360 680900
58397 680900 682210 683321 685533 689743 695266 700668 705126 708556 711005 712626 713963 715620 717657 719749
58383 719749 721877 724480 728017 732601 737946 743439 748467 752996 757658 763070 769275 776004 783092 790311
58369 790311 797285 804064 811488 820365 830414 840487 849723 858058 865815 873316 880921 888961 897500 906282
$$ packed form
58469G25957j409m298o230p175p276o768n996n276m558l447j828j68J049J931
58455F74508K889M056N378O899Q421R169Q485O681M555K297l08k842m409m918
58441G20861n216n649n528m383k867j815j174n45m0J51N00J578L069M157M729
58426G07828N376O371P336P987Q404Q398P258M585J024k214m340n325n550n526
58412G41612n774o515p346p571p001o163n552m977m058l013k336j832p97O83J540
58397F80900J310J111K212M210N523N402M458L430K449J621J337J657K037K092
58383G19749K128K603L537M584N345N493N028M529M662N412O205O729P088P219
58369G90311O974O779P424Q877J0049J0073R236Q335P757P501P605Q040Q539Q782
$$ plain form
58355 906282 914800 922263 927928 931879 935192 938864 942802 946260 948954 951180 953171 955117 957659 961651
58341 961651 967297 974122 981879 990920 1001607 1013794 1027039 1040935 1055170 1069608 1084367 1099450
58329 1099450 1114317 1128105 1140198 1150324 1158321 1164339 1169209 1174015 1179171 1184257 1188824 1193075 1197712
58316 1197712 1203328 1209918 1216846 1223522 1230294 1238350 1248462 1260228 1272764 1285566 1298275 1310353
58304 1310353 1321809 1333714 1347062 1361501 1376036 1390619 1405937 1421968 1437927 1453616 1469705
58293 1469705 1486554 1503818 1521402 1539792 1559231 1579410 1600208 1621857 1644234 1666871 1689933
58282 1689933 1714295 1740417 1768049 1797257 1828678 1862276 1896821 1931355 1966461 2003423 2042623
58271 2042623 2083408 2125164 2167950 2212166 2257991 2305148 2353271 2402534 2453557 2506335 2559784
$$ packed form
58355I06282Q518P463N665L951L313L672L938L458K694K226J991J946K542L992
58341I61651N646O825P757R041J0687J2187J3245J3896J4235J4438J4759J5083
58329A099450J4867J3788J2093J0126P997O018M870M806N156N086M567M251M637
58316A197712N616O590O928O676O772Q056J0112J1766J2536J2802J2709J2078
58304A310353J1456J1905J3348J4439J4535J4583J5318J6031J5959J5689J6089
58293A469705J6849J7264J7584J8390J9439K0179K0798K1649K2377K2637K3062
58282A689933K4362K6122K7632K9208L1421L3598L4545L4534L5106L6962L9200
58271B042623M0785M1756M2786M4216M5825M7157M8123M9263N1023N2778N3449
$$ plain form
58260 2559784 2613135 2667335 2724017 2783202 2843150 2902506 2961519 3021074 3081751 3144286 3209991
58249 3209991 3280110 3355246 3435588 3521072 3611271 3705885 3805417 3910691 4021823 4138461 4260818
58238 4260818 4389551 4524902 4667073 4817114 4976244 5144606 5322090 5510021 5710450
58229 5710450 5924150 6151237 6393606 6654681 6936652 7240133 7566777 7920022 8302845
58220 8302845 8717037 9165311 9652019 10181351 10757275 11386027 12076336 12836595 13674449
58211 13674449 14600336 15629337 16779076 18068904 19522558 21169751 23045788 25195086
58203 25195086 27678772 30577235 33983991 37999030 42728267 48286746 54805302 62445636
58195 62445636 71421019 82010933 94564005 109488397 127222393 148191727 172790656
$$ packed form
58260B559784N3351N4200N6682N9185N9948N9356N9013N9555O0677O2535O5705
58249C209991P0119P5136Q0342Q5484R0199R4614R9532J05274J11132J16638J22357
58238D260818J28733J35351J42171J50041J59130J68362J77484J87931K00429
58229E710450K13700K27087K42369K61075K81971L03481L26644L53245L82823
58220H302845M14192M48274M86708N29332N75924O28752O90309P60259Q37854
58211A3674449R25887J029001J149739J289828J453654J647193J876037K149298
58203B5195086K483686K898463L406756M015039M729237N558479O518556P640334
58195F2445636Q975383J0589914J2553072J4924392J7733996K0969334K4598929
$$ plain form
58188 172790656 201379321 234144444 270626629 309003103 345663897 375697638 394334076
58181 394334076 398616246 388342917 365847795 334940288 299686115 263533670 228927051
58174 228927051 197302124 169292548 144996112 124206863 106577325 91714909 79230796
58167 79230796 68761277 59978322 52596667 46375508 41113724 36643365 32825180 29544888
58159 29544888 26708992 24241743 22083081 20185042 18507403 17016264 15685149 14494104
58151 14494104 13426265 12466324 11601953 10823951 10123669 9491711 8919822 8402197 7933695
58142 7933695 7507881 7117714 6757087 6421009 6105414 5807737 5526968 5262574 5013902
58133 5013902 4780710 4563099 4360434 4171157 3993998 3828477 3673984 3529304 3393431
$$ packed form
58188A72790656K8588665L2765123L6482185L8376474L6660794L0033741J8636438
58181C94334076M282170j0273329k2495122l0907507l5254173l6152445l4606619
58174B28927051l1624927k8009576k4296436k0789249j7629538j4862416j2484113
58167G9230796j0469519q782955p381655o221159n261784m470359l818185l280292
58159B9544888k835896k467249k158662j898039j677639j491139j331115j191045
58151A4494104j067839r59941q64371p78002p00282o31958n71889n17625m68502
58142G933695m25814l90167l60627l36078l15595k97677k80769k64394k48672
58133E013902k33192k17611k02665j89277j77159j65521j54493j44680j35873
$$ plain form
58124 3393431 3265994 3146535 3034151 2928111 2828142 2733956 2645236 2561953 2483749 2409003
58114 2409003 2335616 2262957 2192156 2124431 2060065 1998950 1940926 1885370 1831597 1779864 1730924
58103 1730924 1684450 1639104 1594440 1551521 1511287 1473499 1437692 1403948 1372158 1341612 1311974
58092 1311974 1283853 1257919 1234269 1212929 1193943 1176595 1159663 1142908 1127216 1112746 1098140
58081 1098140 1082225 1065349 1048283 1030918 1012968 994899 977092 958925 939749 920131 901174
58070 901174 883246 866307 850756 836892 824042 811355 799043 787844 777636 767691 758057 749558
58058 749558 742417 735822 728930 721451 713175 703721 693150 682269 672017 662765 654292 646216 638474
58045 638474 631524 625948 621624 617515 612546 606498 599833 592928 585847 578596 571246 563923 556911 550501
$$ packed form
58124C393431j27437j19459j12384j06040r9969r4186q8720q3283p8204p4746
58114B409003p3387p2659p0801o7725o4366o1115n8024n5556n3773n1733m8940
58103A730924m6474m5346m4664m2919m0234l7788l5807l3744l1790l0546k9638
58092A311974k8121k5934k3650k1340j8986j7348j6932j6755j5692j4470j4606
58081A098140j5915j6876j7066j7365j7950j8069j7807j8167j9176j9618j8957
58070I01174j7928j6939j5551j3864j2850j2687j2312j1199j0208r945r634q499
58058G49558p141o595o892p479q276r454j0571j0881j0252r252q473q076p742
58045F38474o950n576m324m109m969o048o665o905p081p251p350p323p012o410
$$ plain form
58031 550501 544518 538309 531442 524063 516312 507849 498415 488485 478902 470087 462065 454977 449074 444344
58017 444344 440474 437077 433745 430212 426784 424243 422932 422235 421366 420344 419733 419771 420251 421063 422207 423373
58001 423373 423975 423683 422607 421125 419805 419233 419497 419987 420125 420145 420765 422170 423729 424661 424642 423826 422594
57984 422594 421211 419515 417067 413739 409887 405717 400922 395387 389874 385323 381673 378049 374074 370314
57970 370314 367334 365000 362991 361447 360659 360435 360299 360253 360847 362323 364039 365085 365352 365526 365999 366324 366070
57953 366070 365550 365015 363605 360225 355391 351053 348298 346266 343789 341026 338752 337057 335822 335757 337704
57938 337704 341298 345536 350440 356935 365078 373563 381254 388194 394727 400541 405039 407965 409172 408324
57924 408324 405350 400745 395020 388180 380139 371315 362503 354368 347275 341232 335732 330013 323858 317911
$$ packed form
58031E50501n983o209o867p379p751q463r434r930r583q815q022p088n903m730
58017D44344l870l397l332l533l428k541j311o97q69j022o11L8M80Q12J144J166
58001D23373O02k92j076j482j320n72K64M90J38K0O20J405J559R32j9q16j232
57984D22594j383j696k448l328l852m170m795n535n513m551l650l624l975l760
57970C70314k980k334k009j544p88k24j36m6N94J476J716J046K67J74M73L25k54
57953C66070n20n35j410l380m834m338k755k032k477k763k274j695j235o5J947
57938C37704L594M238M904O495Q143Q485P691O940O533N814M498K926J207q48
57924D08324k974m605n725o840q041q824q812q135p093o043n500n719o155n947
$$ plain form
57910 317911 312962 309223 306568 305125 305164 306608 309087 312253 315686 318677 320713 322164 323899 326101 327953
57895 327953 328761 328940 329478 330794 332666 335035 338168 341920 345496 348322 350686 353140 355634 357738 359367
57880 359367 360648 361247 360540 358472 355591 352071 347361 341120 333981 327037 320976 316011 312197 309370 307094
57865 307094 305034 303174 301527 300070 299216 299775 301966 304930 307755 310526 313824 317679 321728 326014 330736
57850 330736 335467 339510 342948 346394 349663 351674 351972 351533 351625 352483 353462 353920 353542 352312 350675 349356
57834 349356 348608 347933 346890 345757 344963 344252 342961 340962 338830 337185 336269 336060 336312 336506 336230 335741 335768
57817 335768 336637 337855 338642 338524 337224 334328 329444 322633 314421 305477 296501 288221 281012 274444 267668
57802 267668 260529 253930 248850 245324 242780 240997 240109 239801 239252 238033 236544 235399 234880 235125 236270
$$ packed form
57910C17911m949l739k655j443L9J444K479L166L433K991K036J451J735K202J852
57895C27953Q08J79N38J316J872K369L133L752L576K826K364K454K494K104J629
57880C59367J281N99p07k068k881l520m710o241p139o944o061m965l814k827k276
57865C07094k060j860j647j457q54N59K191K964K825K771L298L855M049M286M722
57850C30736M731M043L438L446L269K011K98m39R2Q58R79M58l78j230j637j319
57834C49356p48o75j043j133p94p11j291j999k132j645r16k09K52J94k76m89K7
57817C35768Q69J218P87j18j300k896m884o811q212q944q976q280p209o568o776
57802B67668p139o599n080l526k544j783q88l08n49j219j489j145n19K45J145
$$ plain form
57787 236270 238085 239959 241580 243259 245291 247542 249997 253219 257665 262994 268569 274286 280319 286472
57773 286472 292430 298318 304250 309607 313569 316198 318154 319423 319291 317621 315240 312795 310096 306943
57759 306943 303804 301166 298854 296610 294840 294183 294602 295409 296048 296470 296992 298114 300297 303522 307149 310396
57743 310396 312787 314056 314018 312850 311131 309165 306560 302920 298733 294985 291975 289124 286031 283109 280861
57728 280861 279066 277225 275524 274717 275030 275787 276383 277076 278389 280160 281911 283918 287069 291464 295935
57713 295935 299326 301618 303321 304385 304438 303668 302668 301545 299933 297847 295916 294733 294515 295337 297096
57698 297096 299232 301037 302308 303150 303188 301665 298413 294098 289302 283982 278063 271910 265850 259728 253377
57683 253377 247230 242134 238723 237120 237030 238125 240640 245478 253195 263057 273914 286110 301656 322211
$$ packed form
57787B36270J815J874J621J679K032K251K455L222M446N329N575N717O033O153
57773B86472N958N888N932N357L962K629J956J269j32j670k381k445k699l153
57759C06943l139k638k312k244j770o57M19Q07O39M22N22J122K183L225L627L247
57743C10396K391J269l8j168j719j966k605l640m187l748l010k851l093k922k248
57728B80861j795j841j701q07L13P57N96O93J313J771J751K007L151M395M471
57713B95935L391K292J703J064N3p70j000j123j612k086j931j183k18Q22J759
57698B97096K136J805J271Q42L8j523l252m315m796n320n919o153o060o122o351
57683B53377o147n096l411j603r0J095K515M838P717R862J0857J2196J5546K0555
$$ plain form
57669 322211 347765 377737 412386 451996 494860 536614 571398 593594 599459 588458 563370 528763
57657 528763 489295 449093 411525 378379 349485 323885 301341 282260 266613 253836 243611
57646 243611 235877 230018 224920 220069 215960 213199 211724 211153 211308 212008 212755 213032 212798 212434 212319 212524
57630 212524 212758 212528 211535 210022 208560 207451 206480 205234 203413 200864 197657 194248 191338 189353 188190
57615 188190 187540 187239 187151 186920 186160 184888 183589 182720 182249 181802 181208 180740 180738 181124 181430 181201 180227 178449 175988
57596 175988 173289 170935 169115 167446 165451 163062 160574 158287 156313 154612 153044 151494 150030 148877
57582 148877 148183 147947 148092 148382 148306 147385 145686 143780 142111 140700 139457 138346 137103 135245 132683 129994
57566 129994 127834 126361 125428 124915 124522 123637 121955 119991 118544 117769 117164 116356 115536 115200 115714 117083 118848
$$ packed form
57669C22211K5554K9972L4649L9610M2864M1754L4784K2196N865j1001k5088l4607
57657E28763l9468m0202l7568l3146k8894k5600k2544j9081j5647j2777j0225
57646B43611p734n859n098m851m109k761j475n71J55P00P47K77k34l64j15K05
57630B12524K34k30r93j513j462j109r71j246j821k549l207l409k910j985j163
57615A88190o50l01q8k31p60j272j299q69m71m47n94m68kL86L06k29r74j778k461
57596A75988k699k354j820j669j995k389k488k287j974j701j568j550j464j153
57582A48877o94k36J45K90p6r21j699j906j669j411j243j111j243j858k562k689
57566A29994k160j473r33n13l93q85j682j964j447p75o05q08q20l36N14J369J765
$$ plain form
57549 118848 120340 121183 121436 121189 120430 119587 119689 121371 123976 126192 127514 128579 130158 132322 134635 136593
57533 136593 137689 137513 136086 134008 132100 130908 130489 130543 130733 130895 130895 130400 129176 127678 126913 127398 128614
57516 128614 129752 130615 131442 132289 133118 134205 135844 137837 139812 141907 144529 147520 150151 152002 153361
57501 153361 154722 156281 157902 159198 159694 159267 158318 157141 155355 152523 149207 146694 145585 145238 144725
57486 144725 143807 142849 142292 142379 142998 143628 143789 143619 143609 143787 143671 143042 142221 141451 140598 139676 139089 139051 139206 139191
57466 139191 139209 139722 140844 142294 143694 144767 145508 146300 147535 149015 150103 150579 150924 151589 152459 153235 153872
57449 153872 154355 154509 154373 154334 154530 154560 154163 153749 153767 153975 153941 153926 154552 155701 156501 156470 156072 155997 156381 156964 157577
57428 157577 158170 158676 159119 159657 160264 160563 160256 159582 159056 158765 158255 157158 155663 154294 153479 153524 154636 156559
$$ packed form
57549A18848J492Q43K53k47p59q43J02J682K605K216J322J065J579K164K313J958
57533A36593J096j76j427k078j908j192m19N4J90J62%m95j224j498p65M85J216
57516A28614J138Q63Q27Q47Q29J087J639J993J975K095K622K991K631J851J359
57501A53361J361J559J621J296M96m27r49j177j786k832l316k513j109l47n13
57486A44725r18r58n57Q7O19O30J61j70j0J78j16o29q21p70q53r22n87l8J55j5
57466A39191J8N13J122J450J400J073P41P92J235J480J088M76L45O65Q70P76O37
57449A53872M83J54j36l9J96L0l97m14J8K08l4j5O26J149Q00l1l98p5L84N83O13
57428A57577N93N06M43N38O07K99l07o74n26k91n10j097j495j369q15M5J112J923
$$ plain form
57410 156559 158350 159100 158974 159084 160098 161459 162239 162325 162263 162265 162021 161437 160925 160831 161014 161163 161183 161098 160875 160567
57390 160567 160465 160935 162131 163860 165633 166947 167679 168144 168633 169058 169255 169465 170159 171419 172782 173657 173736
57373 173736 173116 172291 171829 171768 171587 171101 171016 172012 173526 174197 173463 171993 170563 169367 168626 168984 170705 172988
57355 172988 174684 175466 175916 176654 177733 178777 179476 179923 180475 181225 181924 182626 183982 186264 188442 189179 188696
57338 188696 188625 189830 191376 192024 191730 191090 190235 189136 188263 187943 187527 186135 183949 181900 180297 178622
57322 178622 176647 174884 173848 173550 173847 174687 175767 176471 176462 176061 175831 176031 176569 177327 178388 180034 182472
57305 182472 185434 188120 189738 190120 189747 189328 189452 190447 192249 194485 196866 199434 202289 205222 207862
57290 207862 210098 212136 214226 216550 219321 222786 227058 231979 237099 241904 246255 250553 255221 260083
$$ packed form
57410A56559J791P50j26J10J014J361P80Q6o2Kk44n84n12r4J83J49K0q5k23l08
57390A60567j02M70J196J729J773J314P32M65M89M25J97K10O94J260J363Q75P9
57373A73736o20q25m62o1j81m86q5R96J514O71p34j470j430j196p41L58J721K283
57355A72988J696P82M50P38J079J044O99M47N52P50O99P02J356K282K178P37m83
57338A88696p1J205J546O48k94o40q55j099q73l20m16j392k186k049j603j675
57322A78622j975j763j036k98K97Q40J080P04rm01k30K00N38P58J061J646K438
57305A82472K962K686J618L82l73m19J24R95J802K236K381K568K855K933K640
57290B07862K236K038K090K324K771L465M272M921N120M805M351M298M668M862
$$ plain form
57276 260083 264593 268628 272527 276278 279244 280980 281817 282325 282629 282658 282558 282429 282057 281452 281259 281980 283039
57259 283039 283289 282388 281105 280285 280047 280036 280045 280258 281158 283157 286074 289037 291259 292845 294565 296922 299761
57242 299761 302622 305122 307067 308602 310233 312349 314713 316764 318397 320095 322271 324810 327343 329660
57228 329660 331826 334157 337207 341436 346701 352194 357100 361316 365482 370335 376064 382230 388293 394069
57214 394069 399635 404945 409866 414546 419473 425010 431123 437630 444468 451632 459086 466856 474911 482879
57200 482879 490222 496906 503615 511053 519237 527610 535630 543191 550708 558829 567743 576791 585233 593390
57186 593390 602438 612928 624165 635285 646269 657526 669144 681106 693703 707243 721784 737578
57174 737578 755225 774804 795388 816052 836915 858561 880899 903333 925732 948486 971899
$$ packed form
57276B60083M510M035L899L751K966J736Q37N08L04K9j00j29l72o05j93P21J059
57259B83039K50r01j283q20k38j1RK13R00J999K917K963K222J586J720K357K839
57242B99761K861K500J945J535J631K116K364K051J633J698K176K539K533K317
57228C29660K166K331L050M229N265N493M906M216M166M853N729O166O063N776
57214C94069N566N310M921M680M927N537O113O507O838P164P454P770Q055P968
57200D82879P343O684O709P438Q184Q373Q020P561P517Q121Q914R048Q442Q157
57186E93390R048J0490J1237J1120J0984J1257J1618J1962J2597J3540J4541J5794
57174G37578J7647J9579K0584K0664K0863K1646K2338K2434K2399K2754K3413
$$ plain form
57163 971899 996254 1022109 1049639 1077826 1105206 1131521 1157930 1185498 1214142 1243185 1272298
57152 1272298 1301532 1330802 1359707 1387765 1414737 1440733 1465981 1490578 1514760 1539389 1565607
57141 1565607 1593721 1622832 1651893 1680766 1709978 1739931 1770763 1802578 1835407 1869259 1904487
57130 1904487 1941670 1980922 2021883 2064705 2110460 2160287 2214863 2275034 2342131 2417127 2500167
57119 2500167 2591294 2690735 2798006 2911829 3031560 3157741 3290732 3430151 3576547 3732332
57109 3732332 3900079 4081307 4278251 4495598 4739132 5014070 5326435 5685309 6102617
57100 6102617 6592312 7171515 7861077 8682959 9658006 10807556 12155068 13723393 15531128
57091 15531128 17592357 19915980 22500586 25330223 28376281 31599535 34947920 38359962
$$ packed form
57163I71899K4355K5855K7530K8187K7380K6315K6409K7568K8644K9043K9113
57152A272298K9234K9270K8905K8058K6972K5996K5248K4597K4182K4629K6218
57141A565607K8114K9111K9061K8873K9212K9953L0832L1815L2829L3852L5228
57130A904487L7183L9252M0961M2822M5755M9827N4576O0171O7097P4996Q3040
57119B500167R1127R9441J07271J13823J19731J26181J32991J39419J46396J55785
57109C732332J67747J81228J96944K17347K43534K74938L12365L58874M17308
57100F102617M89695N79203O89562Q21882R75047J149550J347512J568325J807735
57091A5531128K061229K323623K584606K829637L046058L223254L348385L412042
$$ plain form
57083 38359962 41778473 45151902 48402012 51385436 53906581 55790695 56951793 57392686
57075 57392686 57152551 56266830 54769470 52711815 50168350 47230574 44001139 40587847
57067 40587847 37093977 33610763 30217016 26980475 23954973 21176909 18666040 16428360
57059 16428360 14457392 12735891 11240378 9945788 8827152 7860084 7022299 6294695
57051 6294695 5660673 5105694 4618155 4189354 3811633 3477428 3180592 2917164 2683996
57042 2683996 2477657 2295269 2135080 1995324 1873553 1767803 1677309 1601373 1538652 1488341
57032 1488341 1450962 1427301 1417690 1422703 1442365 1472553 1502920 1520286 1514594 1481885 1423539 1344875
57020 1344875 1253982 1159475 1067839 982647 905586 837212 776963 723639 676341 634622 597882
$$ packed form
57083C8359962L418511L373429L250110K983424K521145J884114J161098M40893
57075E7392686k40135q85721j497360k057655k543465k937776l229435l413292
57067D0587847l493870l483214l393747l236541l025502k778064k510869k237680
57059A6428360j970968j721501j495513j294590j118636r67068q37785p27604
57051F294695o34022n54979m87539m28801l77721l34205k96836k63428k33168
57042B683996k06339j82388j60189j39756j21771j05750r0494p5936o2721n0311
57032A488341l7379k3661r611N013J9662L0188L0367J7366n692l2709n8346p8664
57020A344875r0893r4507r1636q5192p7061o8374o0249n3324m7298m1719l6740
$$ plain form
57009 597882 565331 536626 511947 491242 473714 458189 443816 430370 417987 406638 395950
56998 395950 385708 376413 368879 363228 358728 354747 351341 348740 346824 345484 345093 346244 349421 355204
56984 355204 364308 376770 391115 404642 414566 419040 417535 410583 399093 383936 366321 348177
56972 348177 331383 316475 302746 289803 278439 269785 264266 261756 262131 265168 270374 277461 286783
56959 286783 298996 314487 333206 354518 376768 397257 412971 421358 420786 411175 394474 373844
56947 373844 351924 330227 310084 293046 279775 269461 261231 255549 253477 255094 259605 266634 276544
56934 276544 289739 306555 327743 353957 384337 415926 444554 466043 477031 475808 462978 441033
56922 441033 413005 381580 349210 318249 290451 266400 245645 227384 211099 196804 184816
$$ packed form
57009E97882l2551k8705k4679k0705j7528j5525j4373j3446j2383j1349j0688
56998C95950j0242r295p534n651m500l981l406k601j916j340l91J151L177N783
56984C55204R104J2462J4345J3527R924M474j505o952j1490j5157j7615j8144
56972C48177j6794j4908j3729j2943j1364q654n519k510L75L037N206P087R322
56959B86783J2213J5491J8719K1312K2250K0489J5714Q387n72r611j6701k0630
56947C73844k1920k1697k0143j7038j3271j0314q230n682k072J617M511P029R910
56934B76544J3195J6816K1188K6214L0380L1589K8628K1489J0988j223j2830k1945
56922D41033k8028l1425l2370l0961k7798k4051k0755j8261j6285j4295j1988
$$ plain form
56911 184816 175209 167489 160823 154574 148631 143390 139410 136890 135389 134305 133658 134028 135555 137487 139140
56896 139140 140950 144054 148925 154945 161404 168580 177682 189921 205727 224788 246705 271362 298335
56883 298335 325870 350816 369790 380537 382440 376467 364968 351051 337409 325498 315773 308410
56871 308410 303605 301561 302598 307229 315893 328832 346440 369477 398639 434133 475981 524367
56859 524367 578951 637447 694947 744761 780309 797191 794482 774581 741781 700795 656168 612216
56847 612216 572641 539944 515247 498621 489588 487716 493161 506725 529347 561710 604335 657685
56835 657685 721916 796691 881045 972403 1064804 1148337 1211476 1245116 1245380 1213964 1156845 1082424
56823 1082424 999463 915398 835723 764258 703360 653802 614960 585689 565334 554139 552816
$$ packed form
56911A84816r607p720o666o249n943n241l980k520j501j084o47L70J527J932J653
56896A39140J810L104M871O020O459P176R102J2239J5806J9061K1917K4657K6973
56883B98335K7535K4946J8974J0747J903n973j1499j3917j3642j1911r725p363
56871C08410m805k044J037M631Q664J2939J7608K3037K9162L5494M1848M8386
56859E24367N4584N8496N7500M9814L5548J6882k709j9901l2800m0986m4627m3952
56847F12216l9575l2697k4697j6626r033j872N445J3564K2622L2363M2625N3350
56835F57685O4231P4775Q4354R1358R2401Q3533O3139L3640K64l1416n7119p4421
56823A082424q2961q4065p9675p1465o0898m9558l8842k9271k0355j1195j323
$$ plain form
56812 552816 561694 580365 608291 645647 693026 749908 813448 878600 938830 986593 1014282 1016408
56800 1016408 991952 944923 882753 813792 745050 680790 622599 570827 526004 488871 459574
56789 459574 437528 422092 412968 409979 412907 421671 436324 456833 482944 513861 547451 579698
56777 579698 605502 620429 621851 609079 583273 547419 505618 461761 418781 378876 343693 313837
56765 313837 288603 266735 247448 230626 216297 204284 194272 185892 178714 172284 166281 160575
56753 160575 155188 150246 145838 141880 138144 134480 130941 127694 124876 122561 120750 119350 118234 117394
56739 117394 116923 116754 116496 115697 114339 113014 112418 112639 113045 113004 112568 112209 112015 111567 110775 110386 111239 113162
56721 113162 115028 115937 116046 116142 116713 117722 119183 121530 125137 129551 133539 136077 137181 137655 138271 139384
$$ packed form
56812E52816Q878J8671K7926L7356M7379N6882O3540O5152O0230M7763K7689K126
56800A016408k4456m7029o2170o8961o8742o4260n8191n1772m4823l7133k9297
56789D59574k2046j5436r124k989K928Q764J4653K0509K6111L0917L3590L2247
56777E79698K5804J4927J422j2772k5806l5854m1801m3857m2980l9905l5183k9856
56765C13837k5234k1868j9287j6822j4329j2013j0012q380p178o430o003n706
56753A60575n387m942m408l958l736l664l539l247k818k315j811j400j116q40
56739A17394m71j69k58p99j358j325n96K21M06m1m36l59j94m48p92l89Q53J923
56721A13162J866R09J09R6N71J009J461K347L607M414L988K538J104M74O16J113
$$ plain form
56705 139384 140991 142682 143620 143174 141687 140242 139613 139826 140687 142064 143462 144061 143604 142744 142087 141420 140434
56688 140434 139660 139933 141224 142734 144002 145177 146368 147519 148920 151034 153578 155524 156378 156856 157848
56673 157848 159214 160221 160841 161920 163998 166541 168588 169861 170918 172369 174331 176699 179576 183099
56659 183099 187041 190946 194702 198643 203009 207623 212156 216342 219802 222046 222964 223047 222932 222924 223175 223905
56643 223905 225091 226202 226624 226147 224742 222180 218306 213445 208025 201966 194981 187394 180145 173938 168795
56628 168795 164467 160826 157732 154892 152065 149206 146322 143364 140311 137243 134364 132027 130635 130314
56614 130314 130713 131218 131298 130649 129347 127997 127386 127740 128552 129278 129828 130151 129928 129157 128573 128884 129900 130922
56596 130922 131695 132424 133197 134067 135398 137376 139374 140552 140913 141065 141104 140585 139492 138390 137605 137084 137078 138042
$$ packed form
56705A39384J607J691R38m46j487j445o29K13Q61J377J398N99m57q60o57o67r86
56688A40434p74K73J291J510J268J175J191J151J401K114K544J946Q54M78R92
56673A57848J366J007O20J079K078K543K047J273J057J451J962K368K877L523
56659A83099L942L905L756L941M366M614M533M186L460K244R18Q3j15qK51P30
56643B23905J186J111M22m77j405k562l874m861n420o059o985p587p249o207n143
56628A68795m328l641l094k840k827k859k884k958l053l068k879k337j392l21
56614A30314L99N05Q0o49j302j350o11L54Q12P26N50L23k23p71n84L11J016J022
56596A30922P73P29P73Q70J331J978J998J178L61J52L9n19j093j102p85n21oR64
$$ plain form
56578 138042 139684 141059 141858 142802 144472 146551 148535 150353 151907 152866 153494 154978 158274 163103 168565
56563 168565 174186 179882 185542 191268 197545 204538 211624 218164 224272 230208 235584 240038 244280 249448
56549 249448 255433 260770 264409 266876 269341 272051 274130 274682 273753 272190 270736 269359 267543 265069 262217
56534 262217 259135 255421 250587 244716 238383 232112 226151 220571 215320 210363 205963 202623 200512 199181
56520 199181 198074 197007 195877 194264 191839 188942 186274 184119 182330 180935 180134 179690 178951 177748 176756
56505 176756 176608 176916 176722 175831 175203 175774 177084 177461 175668 172173 168712 166757 166554 167383 168320 168777 168714
56488 168714 168577 168840 169527 170288 170912 171470 171933 172013 171579 170942 170580 170697 171183 171803 172364 172922 173812 175159 176354
56469 176354 176540 175692 174714 174245 173989 173574 173461 174333 176005 177646 178890 180023 181133 181781 181615 180776 179583
$$ packed form
56578A38042J642J375P99R44J670K079J984J818J554R59O28J484L296M829N462
56563A68565N621N696N660N726O277O993P086O540O108N936N376M454M242N168
56549B49448N985N337L639K467K465K710K079N52r29j563j454j377j816k474k852
56534B62217l082l714m834n871o333o271n961n580n251m957m400l340k111j331
56520A99181j107j067j130j613k425k897k668k155j789j395q01m44p39j203r92
56505A76756j48L08j94q91o28N71J310L77j793l495l461j955k03Q29R37M57o3
56488A68714j37K63O87P61O24N58M63Q0m34o37l62J17M86O20N61N58Q90J347J195
56469A76354J86q48r78m69k56m15j13Q72J672J641J244J133J110O48j66q39j193
$$ plain form
56452 179583 178238 176980 176039 175282 174346 173371 173138 174086 175496 176194 175987 175912 176949 178841 180448 181029 180873
56435 180873 180802 181400 182755 184533 186041 186522 185820 184738 184399 185193 186530 187649 188384 189046 189779 190299 190303 190064
56417 190064 190442 192006 194137 195466 195479 195272 196213 198226 200076 201139 201961 203047 204073 204651 205064 205581
56401 205581 205726 204997 203988 203965 205323 207008 207647 206914 205670 204856 204374 203168 200561 197285 194752 193467
56385 193467 192827 192566 193461 196112 199761 203081 205630 207750 209471 210473 211030 211998 213669 215371 216476
56370 216476 217225 218256 219789 221618 223478 225010 225650 225089 223909 223374 224335 226379 228181 228869 228932 229614
56354 229614 231382 233333 234336 234476 234898 236291 238032 239065 239273 239589 240807 242705 244476 245656 246292
56339 246292 246388 245800 244866 244548 245525 247425 249453 251474 253844 256350 258124 258760 258834 259091 259669 260381 261190
$$ packed form
56452A79583j345j258r41p57r36r75k33R48J410O98k07p5J037J892J607N81j56
56435A80873p1N98J355J778J508M81p02j082l39P94J337J119P35O62P33N20Mk39
56417A90064L78J564K131J329J3k07R41K013J850J063Q22J086J026N78M13N17
56401B05581J45p29j009k3J358J685O39p33j244q14m82j206k607l276k533j285
56385A93467o40k61Q95K651L649L320K549K120J721J002N57R68J671J702J105
56370B16476P49J031J533J829J860J532O40n61j180n35R61K044J802O88O3O82
56354B29614J768J951J003J40M22J393J741J033K08L16J218J898J771J180O36
56339B46292R6n88r34l18R77J900K028K021K370K506J774O36P4K57N78P12Q09
$$ plain form
56322 261190 262048 262732 263238 263969 265231 266887 268767 270993 273612 276367 279197 282447 286183 289768 292605
56307 292605 294890 297133 299375 301459 303704 306646 310340 314547 319341 324854 330548 335458 339192 342184
56293 342184 345017 347980 351189 354537 357551 359910 362200 365620 370739 376956 383309 389430 395544 401947
56279 401947 408734 415897 423446 431490 440204 449638 459607 469890 480479 491605 503648 517089 532269
56266 532269 549050 567012 586164 607108 630256 655332 682033 710891 743038 779409 820635
56255 820635 867372 920154 979069 1044135 1115946 1195454 1283157 1378918 1482448 1593331 1710499
56244 1710499 1832125 1956222 2081096 2205136 2326380 2442262 2549662 2645247 2725943 2789068
56234 2789068 2832228 2853709 2853343 2832587 2793373 2737242 2665890 2581888 2488101 2386672 2279289
$$ packed form
56322B61190Q58O84N06P31J262J656J880K226K619K755K830L250L736L585K837
56307B92605K285K243K242K084K245K942L694M207M794N513N694M910L734K992
56293C42184K833K963L209L348L014K359K290L420N119O217O353O121O114O403
56279D01947O787P163P549Q044Q714R434R969J0283J0589J1126J2043J3441J5180
56266E32269J6781J7962J9152K0944K3148K5076K6701K8858L2147L6371M1226
56255H20635M6737N2782N8915O5066P1811P9508Q7703R5761J03530J10883J17168
56244A710499J21626J24097J24874J24040J21244J15882J07400R5585Q0696O3125
56234B789068M3160K1481l66k0756l9214n6131p1352q4002r3787j01429j07383
$$ plain form
56223 2279289 2168226 2056308 1945827 1838102 1734095 1634847 1541106 1452996 1370286 1292904
56213 1292904 1221142 1155433 1095654 1040683 989158 940931 897137 858389 823575 791110 760714
56202 760714 733126 708589 686660 667155 650188 635390 622113 610335 600406 591894 583763 575769
56190 575769 568673 562811 557474 552050 546905 542692 539462 536930 534995 533541 532223 530839 529584 528688
56176 528688 528165 528125 528895 530589 532814 534940 536461 537240 537794 539210 542222 546435 550935 555522 560695 566667
56160 566667 573226 580513 588965 598345 607741 616884 626735 638449 652373 668327 686144 705555 726230
56147 726230 748478 773473 802466 836231 875584 921926 976756 1040843 1114045 1195551 1283936
56136 1283936 1377012 1471673 1563830 1649012 1723965 1788092 1843170 1891777 1936246 1978536 2019677
$$ packed form
56223B279289j11063j11918j10481j07725j04007r9248r3741q8110q2710p7382
56213A292904p1762o5709n9779n4971n1525m8227m3794l8748l4814l2465l0396
56202G60714k7588k4537k1929j9505j6967j4798j3277j1778r929q512q131p994
56190E75769p096n862n337n424n145m213l230k532j935j454j318j384j255q96
56176E28688n23m0P70J694K225K126J521P79N54J416L012M213M500M587N173N972
56160E66667O559P287Q452R380R396R143R851J1714J3924J5954J7817J9411K0675
56147G26230K2248K4995K8993L3765L9353M6342N4830O4087P3202Q1506Q8385
56136A283936R3076R4661R2157Q5182P4953O4127N5078M8607M4469M2290M1141
$$ plain form
56125 2019677 2058714 2092735 2118482 2133961 2138829 2133939 2120682 2100191 2072750 2037916 1994900 1942599
56113 1942599 1879829 1806430 1724149 1636055 1545467 1455927 1371318 1294632 1226686 1166975 1115453
56102 1115453 1072435 1037186 1008112 984307 965516 950728 938410 928329 921496 917926 916030 914720
56090 914720 914547 916087 918750 922025 926415 932085 937855 942739 947434 953117 959645 966143 972655 980030
56076 980030 988681 998424 1009139 1020741 1032853 1045189 1057898 1071064 1084443 1098091 1112559 1127972
56064 1127972 1143685 1159339 1175376 1191916 1208089 1223250 1238017 1253258 1268776 1283832 1298303
56053 1298303 1312563 1326930 1341968 1358612 1377045 1396117 1414749 1433377 1453166 1474342 1496218
56042 1496218 1518501 1541708 1566501 1593185 1621682 1651615 1682705 1715254 1749718 1785674 1821932
$$ packed form
56125B019677L9037L4021K5747J5479M868m890j3257k0491k7441l4834m3016n2301
56113A942599o2770p3399q2281q8094r0588q9540q4609p6686o7946n9711n1522
56102A115453m3018l5249k9074k3805j8791j4788j2318j0081o833l570j896j310
56090I14720j73J540K663L275M390N670N770M884M695N683O528O498O512P375
56076I80030Q651R743J0715J1602J2112J2336J2709J3166J3379J3648J4468J5413
56064A127972J5713J5654J6037J6540J6173J5161J4767J5241J5518J5056J4471
56053A298303J4260J4367J5038J6644J8433J9072J8632J8628J9789K1176K1876
56042A496218K2283K3207K4793K6684K8497K9933L1090L2549L4464L5956L6258
$$ plain form
56031 1821932 1857858 1893813 1930253 1967396 2005916 2046657 2089217 2132020 2174300 2216876 2260639
56020 2260639 2305571 2351809 2400173 2450930 2503445 2557769 2615214 2676584 2741247 2808731 2879700
56009 2879700 2954526 3032587 3114034 3200620 3293532 3391885 3494579 3602111 3715314 3833887
55999 3833887 3957549 4087229 4223712 4366444 4514940 4670004 4832479 5002425 5180721
55990 5180721 5369771 5571389 5785834 6014105 6259144 6523520 6808184 7114883 7447151
55981 7447151 7807244 8194977 8611779 9063216 9555230 10090829 10673245 11309675 12009053
55972 12009053 12778969 13628000 14568902 15617144 16789743 18109175 19606118 21316612
55964 21316612 23282138 25557993 28218665 31350675 35043427 39390845 44498180 50485416
$$ packed form
56031A821932L5926L5955L6440L7143L8520M0741M2560M2803M2280M2576M3763
56020B260639M4932M6238M8364N0757N2515N4324N7445O1370O4663O7484P0969
56009B879700P4826P8061Q1447Q6586R2912R8353J02694J07532J13203J18573
55999C833887J23662J29680J36483J42732J48496J55064J62475J69946J78296
55990E180721J89050K01618K14445K28271K45039K64376K84664L06699L32268
55981G447151L60093L87733M16802M51437M92014N35599N82416O36430O99378
55972A2009053P69916Q49031R40902J048242J172599J319432J496943J710494
55964B1316612J965526K275855K660672L132010L692752M347418N107335N987236
$$ plain form
55956 50485416 57495492 65714637 75391437 86839766 100428343 116558916 135630576
55949 135630576 158015768 184067168 214045099 247742683 283788491 319090800 349108033
55942 349108033 369143688 376017766 369110992 350269799 322861618 290645389 256935379
55935 256935379 224183837 193910264 166853112 143210441 122860735 105519381 90838175
55928 90838175 78462532 68056004 59308782 51945713 45732395 40471871 35997217 32169539
55920 32169539 28878063 26034398 23564728 21408001 19517059 17854927 16388801 15089252
55912 15089252 13932887 12901576 11978896 11149561 10401301 9724584 9110670 8551683 8041693
55903 8041693 7575777 7148647 6755708 6394275 6061983 5754959 5469231 5202848 4954949
$$ packed form
55956E0485416P010076Q219145R676800J1448329J3588577J6130573J9071660
55949A35630576K2385192K6051400K9977931L3697584L6045808L5302309L0017233
55942C49108033K0035655O874078o906774j8841193k7408181l2216229l3710010
55935B56935379l2751542l0273573k7057152k3642671k0349706j7341354j4681206
55928I0838175j2375643j0406528q747222p363069o213318n260524m474654l827678
55920C2169539l291476k843665k469670k156727j890942j662132j466126j299549
55912A5089252j156365j031311r22680q29335p48260o76717o13914n58987n09990
55903H041693m65916m27130l92939l61433l32292l07024k85728k66383k47899
$$ plain form
55894 4954949 4723801 4507597 4306230 4120279 3948857 3790054 3642866 3507115 3381993
55885 3381993 3266108 3158357 3057318 2960316 2864611 2769313 2675196 2583110 2493582 2407276 2324565
55874 2324565 2244960 2167806 2093123 2021072 1951264 1883399 1817931 1755354 1695585 1638766 1585752
55863 1585752 1537051 1492123 1450500 1412395 1377295 1343256 1308996 1275693 1245266 1217696 1191447
55852 1191447 1165819 1141339 1118357 1096703 1076341 1056998 1037431 1016442 994487 973050 952594
55841 952594 932262 911504 890821 870825 851589 833039 815202 797961 781256 765520 751342
55830 751342 738742 727243 716465 706221 696319 686728 677621 668811 659671 650067 640732 632081 623277
55817 623277 613283 602309 591408 581137 571412 562298 554039 546682 540396 535738 532893 531142 529867
$$ packed form
55894D954949k31148k16204k01367j85951j71422j58803j47188j35751j25122
55885C381993j15885j07751j01039r7002r5705r5298r4117r2086q9528q6306q2711
55874B324565p9605p7154p4683p2051o9808o7865o5468o2577n9769n6819n3014
55863A585752m8701m4928m1623l8105l5100l4039l4260l3303l0427k7570k6249
55852A191447k5628k4480k2982k1654k0362j9343j9567k0989k1955k1437k0456
55841I52594k0332k0758k0683j9996j9236j8550j7837j7241j6705j5736j4178
55830G51342j2600j1499j0778j0244r902r591r107q810r140r604r335q651q804
55817F23277r994j0974j0901j0271r725r114q259p357o286m658k845j751j275
$$ plain form
55804 529867 529557 530970 533870 537581 542172 547943 554157 559521 563648 566803 568468 567491 563676 558004 551158
55789 551158 543038 533956 525164 517706 511435 505470 498931 491081 481551 470774 459725 449124 439444
55776 439444 431534 426425 424416 425132 428535 434980 443892 453092 459769 461781 458120 449036 436127 421593
55762 421593 406972 392852 379812 368824 360401 353943 348382 343061 337763 332424 327281 322914 319645
55749 319645 317045 314289 310835 306661 302116 297674 293591 289737 286006 282789 280552 278878 276593 273121
55735 273121 269231 266046 263705 261479 258958 256556 254858 253846 252898 251329 248796 245312 241075 236346
55721 236346 231404 226457 221633 217190 213678 211602 210919 211248 212659 215778 220773 226618 231787 235444 237567
55706 237567 238331 238004 237240 236761 236569 235895 233999 230682 226125 220688 214919 209307 203872 198316 192595 187090
$$ packed form
55804E29867l10J413K900L711M591N771O214N364M127L155J665r77l815n672o846
55789E51158q120r082q792p458o271n965o539p850r530j0777j1049j0601r680
55776D39444p910n109k009P16L403O445Q912R200O677K012l661r084j2909j4534
55762D21593j4621j4120j3040j0988q423o458n561n321n298n339n143m367l269
55749C19645k600k756l454m174m545m442m083l854l731l217k237j674k285l472
55735B73121l890l185k341k226k521k402j698j012r48j569k533l484m237m729
55721B36346m942m947m824m443l512k076o83L29J411L119M995N845N169L657K123
55706B37567P64l27p64m79j92o74j896l317m557n437n769n612n435n556n721n505
$$ plain form
55690 187090 182264 178460 175995 175019 175221 175994 176966 178188 179873 182258 185589 189829 194410 198645 202364
55675 202364 205760 208676 210497 210818 209803 207846 205287 202491 199809 197326 195015 193208 192458 192777 193393
55660 193393 193456 192813 191974 191640 192353 194290 197116 200227 203246 206187 209119 211868 214107 215511 215784 214742
55644 214742 212491 209395 205878 202253 198559 194386 189090 182506 175306 168384 162125 156622 152268 149486
55630 149486 147949 146761 145470 144377 143726 143170 142311 141274 140474 140100 140054 140129 140062 139642 138892 137915 136578 134615
55612 134615 132045 129135 126023 122757 119673 117210 115291 113454 111661 110358 109562 108598 107158 105978 105838
55597 105838 106323 106284 105350 104308 103945 104082 103966 103317 102696 102853 103915 105363 106816 108557 111047 114150 117284
55580 117284 120292 123588 127381 131333 135315 140009 146317 154436 163888 174189 185045 196047 206529
$$ packed form
55690A87090m826l804k465r76K02P73R72J222J685K385L331M240M581M235L719
55675B02364L396K916J821L21j015j957k559k796k682k483k311j807p50L19O16
55660A93393O3o43q39l34P13J937K826L111L019K941K932K749K239J404K73j042
55644B14742k251l096l517l625l694m173n296o584p200o922o259n503m354k782
55630A49486j537j188j291j093o51n56q59j037q00l74m6P5o7m20p50r77j337j963
55612A34615k570k910l112l266l084k463j919j837j793j303p96r64j440j180j40
55597A05838M85l9r34j042l63J37j16o49o21J57J062J448J453J741K490L103L134
55580A17284L008L296L793L952L982M694O308Q119R452J0301J0856J1002J0482
$$ plain form
55567 206529 215758 223073 228018 230559 231003 229502 225791 219726 211912 203462 195198 187339 179872 172850
55553 172850 166275 159963 153729 147637 142005 137086 132742 128560 124489 121262 119734 119677 119638 118377 116205
55538 116205 114543 114358 115457 117196 119288 121723 124234 126249 127325 127504 127164 126554 125500 123612 120802
55523 120802 117537 114518 112192 110542 109183 107596 105450 102903 100496 98642 97293 96209 95399 95116 95535
55508 95535 96687 98627 101409 104783 108143 110883 112661 113240 112315 109809 106317 102948 100488 98799 97183
55493 97183 95247 93182 91225 89179 86685 83783 80989 78866 77674 77308 77312 76996 75866 74092 72452 71698
55477 71698 71975 72840 73734 74438 75105 75890 76642 77106 77360 77766 78420 78989 79278 79559 80065 80503 80530 80425 80738
55458 80738 81419 81897 81911 81700 81323 80492 79251 78184 77629 77169 76280 75117 74230 73775 73372 72631 71511 70275
$$ packed form
55567B06529R229P315M945K541M44j501l711o065p814q450q264p859p467p022
55553A72850o575o312o234o092n632m919m344m182m071l227j528n7l9j261k172
55538A16205j662j85J099J739K092K435K511K015J076J79l40o10j054j888k810
55523A20802l265l019k326j650j359j587k146k547k407j854j349j084q10k83M19
55508I5535J152J940K782L374L360K740J778N79r25k506l492l369k460j689j616
55493I7183j936k065j957k046k494k902k794k123j192l66Ml16j130j774j640p54
55477G1698K77Q65Q94P04O67P85P52M64K54M06O54N69K89K81N06M38K7j05L13
55458H0738O81M78J4k11l77q31j241j067n55m60q89j163q87m55m03p41j120j236
$$ plain form
55440 70275 69290 68857 69074 69882 71143 72519 73428 73524 73226 73365 74259 75513 76741 77972 79309 80793 82775
55423 82775 85701 89168 91830 92763 92489 92206 92581 93806 96203 99837 103852 107074 109211 110748 111769
55408 111769 111719 110349 108152 105689 103069 100254 97311 94204 90921 87957 86007 84930 83691 81760 79946
55393 79946 79282 79563 79707 79263 78779 78705 78708 78311 77678 77324 77399 77621 77767 77810 77573 76666 75007 73232 72307 72639
55373 72639 73768 74958 75871 76491 76618 75884 74398 73002 72531 72938 73472 73723 74093 75050 76214 76613 75744
55356 75744 74137 72781 72250 72370 72453 71810 70407 69143 69144 70517 72134 72951 73170 73656 74521 75001 74647 73882
55338 73882 73243 72692 71954 71060 70228 69610 69433 69993 71137 72084 72135 71349 70299 69455 69111 69481 70394 71172 71323
55319 71323 71127 71070 70924 70057 68614 67641 67826 68637 69049 68797 68473 68564 68825 68744 68374 68420 69377 70816 71786 71868
$$ packed form
55440G0275r85m33K17Q08J261J376R09R6k98J39Q94J254J228J231J337J484J982
55423H2775K926L467K662R33k74k83L75J225K397L634M015L222K137J537J021
55408A11769n0j370k197k463k620k815k943l107l283k964j950j077j239j931j814
55393G9946o64K81J44m44m84p4Ll97o33l54P5K22J46M3k37r07j659j775r25L32
55373G2639J129J190R13O20J27p34j486j396m71M07N34K51L70R57J164L99q69
55356G5744j607j356n31J20Q3o43j403j264JJ373J617Q17K19M86Q65M80l54p65
55338G3882o39n51p38q94q32o18j77N60J144R47N1p86j050q44l44L70R13P78J51
55319G1323j96n7j46q67j443r73J85Q11M12k52l24R1K61q1l70M6R57J439R70Q2
$$ plain form
55299 71868 71480 71096 70627 69870 69172 69174 70020 71195 72093 72435 72258 71826 71493 71421 71490 71715 72469 73936 75571
55280 75571 76599 76949 77191 77629 78019 78143 78053 77677 76870 76071 76175 77291 78142 77372 75181 73087 72226 72442
55262 72442 72995 73499 73878 73893 73240 72039 70898 70373 70518 71047 71703 72345 72788 72850 72635 72533 72884 73757 75077
55243 75077 76676 78071 78534 77747 76269 75070 74647 74802 75105 75241 74988 74259 73243 72293 71656 71423 71615
55226 71615 72032 72222 72018 71963 72697 73938 74678 74521 74231 74661 75618 76202 75917 74965 73719 72467 71599 71577 72487
55207 72487 73875 75089 75687 75560 74912 74221 74028 74517 75263 75553 75065 74202 73640 73568 73617 73542 73630 74170 74815 74914
55187 74914 74376 73793 73719 74170 74850 75473 75803 75761 75580 75561 75653 75657 75754 76298 76973 76877 75764 74578 74355 75108 76301
55166 76301 77818 79719 81480 82414 82718 83270 84321 85181 85372 85304 85420 85352 84493 82986 81576 80703 80246 80073
$$ packed form
55299G1868l88l84m69p57o98KQ46J175Q98L42j77m32l33p2O9K25P54J467J635
55280G5571J028L50K42M38L90J24r0l76q07p99J04J116Q51p70k191k094q61K16
55262G2442N53N04L79J5o53j201j141n25J45N29O56O42M43O2k15j02L51Q73J320
55243G5077J599J395M63p87j478j199m23J55L03J36k53p29j016r50o37k33J92
55226G1615M17J90k04n5P34J241P40j57k90M30R57N84k85r52j246j252q68k2R10
55207G2487J388J214N98j27o48o91j93M89P46K90m88q63n62p2M9p5Q8N40O45R9
55187G4914n38n83p4M51O80O23L30m2j81j9R2MR7N44O75r6j113j186k23P53J193
55166G6301J517J901J761R34L04N52J051Q60J91o8J16o8q59j507j410q73m57j73
$$ plain form
55148 80073 80341 81176 82366 83471 84101 84145 83910 83978 84631 85472 85818 85515 85034 84768 84573 84174 83672 83367 83290
55129 83290 83285 83374 83627 83764 83380 82681 82459 83069 83811 83672 82426 80637 78880 77439 76639 76836 77922 79230
55111 79230 80130 80538 80796 81328 82396 83902 85348 86318 86993 87861 88873 89405 89224 88963 89258 89827 89884 89211
55093 89211 88311 87685 87434 87489 87709 87663 86788 85009 82969 81493 80984 81359 82354 83715 85231 86748 88156
55076 88156 89375 90432 91453 92447 93166 93338 93037 92606 92217 91726 91033 90346 89982 90069 90557 91353 92269 92938
55058 92938 93028 92592 92086 91943 92214 92675 93232 94032 95109 96035 96108 94893 92566 89790 87440 86339 86858 88497
55040 88497 90066 90605 90160 89505 89150 88827 88004 86677 85462 84961 85139 85404 85268 84844 84678 85117 85952 86640
55022 86640 86765 86309 85639 85274 85565 86461 87583 88469 88750 88278 87352 86701 86920 87813 88625 88952 89076 89366 89779
$$ packed form
55148H0073K68Q35J190J105O30M4k35O8O53Q41L46l03m81k66j95l99n02l05p7
55129H3290nQ9K53J37l84o99k22O10P42j39j246j789j757j441q00J97J086J308
55111G9230R00M08K58N32J068J506J446R70O75Q68J012N32j81k61K95N69N7o73
55093H9211r00o26k51N5K20m6q75j779k040j476n09L75R95J361J516J517J408
55076H8156J219J057J021R94P19J72l01m31l89m91o93o87l64Q7M88P96R16O69
55058I2938R0m36n06j43K71M61N57Q00J077R26P3j215k327k776k350j101N19J639
55040H8497J569N39m45o55l55l23q23j327j215n01J78K65j36m24j66M39Q35O88
55022H6640J25m56o70l65K91Q96J122Q86K81m72r26o51K19Q93Q12L27J24K90M13
$$ plain form
55003 89779 90177 90636 91116 91235 90853 90533 90864 91576 91967 91996 92308 93158 94046 94521 94709 94792 94604 94088 93653 93640
54983 93640 93807 93804 93807 94230 95017 95705 96093 96468 97179 98272 99468 100226 100000 98876 97873 98194 100020 102334
54965 102334 103945 104422 104030 103187 102221 101425 101011 101050 101522 102300 102996 103073 102311 101090 100059 99538 99357 99155
54947 99155 98670 97861 96989 96552 96919 97951 99113 99964 100392 100415 100038 99374 98708 98240 97957 97943 98610 100315 102802
54928 102802 105320 107372 109136 111164 113809 116952 120087 122728 125048 128047 132632 138338 143393 146379
54914 146379 147495 147850 147856 146953 144784 141912 139105 136407 133254 129311 124893 120706 117414 115332 114275
54899 114275 113636 112810 111580 110131 108674 107194 105652 104393 104123 105188 106931 108151 108370 108333 108933 110023
54883 110023 110810 111213 112110 114178 117112 120266 123501 126991 130626 134068 137153 139847 142015 143545 144517
$$ packed form
55003H9779L98M59M80J19l82l20L31P12L91K9L12Q50Q88M75J88Q3j88n16m35j3
54983I3640J67lLM23P87O88L88L75P11J093J196P58k26j124j003L21J826K314
54965A02334J611M77l92q43r66p96m14L9M72P78O96P7p62j221j031n21j81k02
54947I9155m85q09q72m37L67J032J162Q51M28K3l77o64o66m68k83j4O67J705K487
54928A02802K518K052J764K028K645L143L135K641K320K999M585N706N055K986
54914A46379J116L55Or03k169k872k807k698l153l943m418m187l292k082j057
54899A14275o39q26j230j449j457j480j542j259k70J065J743J220K19l7O00J090
54883A10023P87M03Q97K068K934L154L235L490L635L442L085K694K168J530R72
$$ plain form
54868 144517 144866 144115 141842 138235 133813 128869 123732 119312 116637 115702 115442 115038 114692 114843 115253 115330 114953
54851 114953 114401 113718 112737 111600 110778 110461 110312 109839 108771 107050 104787 102298 99889 97577 95311 93498
54835 93498 92896 93720 95153 96075 96137 95816 95613 95563 95549 95689 96195 97023 97845 98312 98311 98093 98198 99075 100584 101982
54815 101982 102546 102202 101485 100997 101005 101432 102006 102457 102781 103310 104309 105467 106014 105461 104079 102629 101796 101953
54797 101953 103155 105023 106788 107728 107658 106879 105720 104346 102959 101938 101669 102321 103702 105207 106043 105883
54781 105883 105375 105672 107215 109213 110541 111016 111491 112825 115093 117809 120576 123356 126372 129954 134356
54766 134356 139486 144851 149921 154477 158479 161700 163774 164681 164853 164625 163749 161663 158150 153524 148283
54751 148283 142854 137621 132895 128769 125219 122373 120347 118760 116889 114626 112908 112661 113506 114070 113603
$$ packed form
54868A44517L49p51k273l607m422m944n137m420k675r35k60m04l46J51M10P7l77
54851A14953n52o83r81j137q22l17j49m73j068j721k263k489k409k312k266j813
54835I3498o02Q24J433R22O2l21k03n0j4J40N06Q28Q22M67jk18J05Q77J509J398
54815A01982N64l44p17m88QM27N74M51L24N29R99J158N47n53j382j450q33J57
54797A01953J202J868J765R40p0p79j159j374j387j021k69O52J381J505Q36j60
54781A05883n08K97J543J998J328M75M75J334K268K716K767K780L016L582M402
54766A34356N130N365N070M556M002L221K074R07J72k28q76k086l513m626n241
54751A48283n429n233m726m126l550k846k026j587j871k263j718k47Q45N64m67
$$ plain form
54736 113603 112762 112651 113596 115153 116888 118698 120568 122489 124616 127139 129963 132715 135142 137338 139577
54721 139577 142089 144967 148091 151076 153406 154723 154936 154150 152561 150383 147714 144502 140800 137033 133770
54706 133770 131178 128909 126551 124070 121676 119437 117155 114608 111885 109564 108523 109326 111588 114009
54692 114009 115183 114498 112381 109864 107938 107086 107185 107788 108481 108971 108985 108372 107309 106209 105304 104588 104231
54675 104231 104676 106011 107506 108239 108090 107730 107599 107376 106666 105786 105464 105827 106070 105324 103711 102339 102199
54658 102199 103185 104318 104830 104755 104408 103725 102503 101109 100416 100915 102215 103550 104532 105281 106158 107534 109564
54641 109564 111876 113670 114372 114079 113199 111928 110409 109160 108797 109310 110042 110521 110889 111409 111930 112201 112367
54624 112367 112740 113218 113355 112978 112387 111906 111539 111222 111111 111396 111944 112320 112139 111369 110365 109621 109330 109154
$$ packed form
54736A13603q41j11R45J557J735J810J870J921K127K523K824K752K427K196K239
54721A39577K512K878L124K985K330J317K13p86j589k178k669l212l702l767l263
54706A33770k592k269k358k481k394k239k282k547k723k321j041Q03K262K421
54692A14009J174o85k117k517j926q52R9O03O93M90J4o13j063j100r05p16l57
54675A04231M45J335J495P33j49l60j31k23p10q80l22L63K43p46j613j372j40
54658A02199R86J133N12p5l47o83j222j394o93M99J300J335R82P49Q77J376K030
54641A09564K312J794P02k93q80j271j519j249l63N13P32M79L68N20N21K71J66
54624A12367L73M78J37l77n91m81l67l17j11K85N48L76j81p70j004p44k91j76
$$ plain form
54606 109154 108629 107878 107645 108377 109520 110073 109723 109020 108494 108120 107779 107750 108348 109388 110369 111042 111392 111268
54588 111268 110509 109505 109115 109796 111078 112120 112599 112818 113139 113583 113943 114038 113835 113428 112935 112304 111252 109545
54570 109545 107442 105749 105292 106303 108350 110758 112991 114671 115541 115643 115388 115172 114931 114355 113548 113072
54554 113072 113227 113702 114184 114851 115797 116435 116217 115757 116362 118348 120638 122255 123386 124542 125512 125906 126107
54537 126107 126728 127440 127342 126356 125343 124766 124217 123484 123130 123453 123635 122664 120720 118944 118094 117986 118130 118276
54519 118276 118354 118372 118499 118867 119239 119154 118468 117516 116721 116298 116263 116471 116593 116377 115976 115759 115817 115950 116190 116875
54499 116875 118031 119057 119404 119349 119786 121280 123524 125564 126400 125573 123561 121570 120677 121061 122220 123770
54483 123770 125724 127952 129799 130558 130183 129298 128569 128257 128387 129103 130627 132868 135252 137062 137974 138241
$$ packed form
54606A09154n25p51k33P32J143N53l50p03n26l74l41k9N98J040R81O73L50j24
54588A11268p59j004l90O81J282J042M79K19L21M44L60R5k03m07m93o31j052j707
54570A09545k103j693m57J011K047K408K233J680Q70J02k55k16k41n76q07m76
54554A13072J55M75M82O67R46O38k18m60O05J986K290J617J131J156R70L94K01
54537A26107O21P12r8r86j013n77n49p33l54L23J82r71j944j776q50j08J44J46
54519A18276P8J8J27L68L72q5o86r52p95m23l5K08J22k16m01k17N8J33K40O85
54499A16875J156J026L47n5M37J494K244K040Q36q27k012j991q93L84J159J550
54483A23770J954K228J847P59l75q85p29l12J30P16J524K241K384J810R12K67
$$ plain form
54467 138241 138411 138937 139958 141218 142145 142261 141675 140958 140417 139717 138487 137035 135978 135324 134474 133258 132406
54450 132406 132639 133678 134587 134864 134783 134729 134663 134337 133753 133192 132865 132636 132123 131137 129976 129142 128734 128407 128009
54431 128009 127968 128755 130200 131658 132670 133089 132766 131645 130219 129388 129686 130925 132668 134678 136747 138465
54415 138465 139420 139460 138651 137207 135564 134174 133045 131813 130462 129620 129836 130871 132113 133422 135082 137003
54399 137003 138537 139158 138983 138515 138130 137899 137652 137144 136358 135743 135905 136987 138535 140042 141362 142460 143076
54382 143076 142968 142398 142011 142171 142672 143168 143652 144301 145042 145591 145925 146425 147440 148939 150696 152522 154122
54365 154122 155071 155410 156104 158356 162353 167074 171337 174569 176500 176825 175627 173699 171881 170262 168395
54350 168395 166074 163473 160737 157950 155354 153098 150826 148057 145024 142657 141575 141472 141636 141675 141518
$$ packed form
54467A38241J70N26J021J260R27J16n86p17n41p00j230j452j057o54q50j216q52
54450A32406K33J039R09K77q1n4o6l26n84n61l27k29n13r86j161q34m08l27l98
54431A28009m1P87J445J458J012M19l23j121j426q31K98J239J743K010K069J718
54415A38465R55M0q09j444j643j390j129j232j351q42K16J035J242J309J660J921
54399A37003J534O21j75m68l85k31k47n08p86o15J62J082J548J507J320J098O16
54382A43076j08n70l87J60N01M96M84O49P41N49L34N00J015J499J757J826J600
54365A54122R49L39O94K252L997M721M263L232J931L25j198j928j818j619j867
54350A68395k321k601k736k787k596k256k272k769l033k367j082j03J64L9j57
$$ plain form
54335 141518 141068 140227 139178 138383 138260 138826 139614 140010 139858 139634 139826 140170 139842 138474 136699 135548 135467 135957
54317 135957 136061 135197 133697 132488 132114 132190 132019 131516 131077 130738 130113 129228 128722 128952 129412 129446 129079 128772 128649
54298 128649 128517 128414 128628 129212 129857 130261 130389 130427 130718 131657 133394 135587 137598 138938 139452 139252 138617 137886
54280 137886 137301 136983 137038 137443 137814 137655 137034 136661 136963 137466 137518 137323 137643 138598 139448 139654 139577 139779 140125 140033
54260 140033 139445 139052 139486 140600 141774 142755 143918 145593 147412 148624 149001 149065 149333 149657 149554 148893 147986
54243 147986 147176 146630 146400 146358 146095 145235 143914 142820 142663 143568 144849 145376 144527 142983 142206 142822 143834
54226 143834 143928 143177 142749 143096 143346 142763 141978 142193 143591 145111 145679 145164 144135 143060 141833 140008 137413
54209 137413 134550 132273 131070 130812 131183 132028 133188 134322 135194 135941 136781 137574 137996 138063 138198 138718 139493
$$ packed form
54335A41518m50q41j049p95j23N66P88L96j52k24J92L44l28j368j775j151q1M90
54317A35957J04q64j500j209l74P6j71n03m39l39o25q85n06K30M60L4l67l07j23
54298A28649j32j03K14N84O45M04J28L8K91R39J737K193K011J340N14k00o35p31
54280A37886n85l18N5M05L71j59o21l73L02N03N2j95L20R55Q50K06p7K02L46r2
54260A40033n88l93M34J114J174R81J163J675J819J212L77O4K68L24j03o61r07
54243A47986q10n46k30m2k63q60j321j094j57R05J281N27q49j544p77O16J012
54226A43834R4p51m28L47K50n83p85K15J398J520N68n15j029j075j227j825k595
54209A37413k863k277j203k58L71Q45J160J134Q72P47Q40P93M22O7J35N20P75
$$ plain form
54192 139493 140162 140502 140520 140251 139626 138592 137369 136451 136171 136215 135828 134655 133272 132666 133235 134452 135507
54175 135507 136098 136582 137427 138653 139861 140763 141566 142709 144294 145962 147309 148192 148611 148537 148031 147361 146796
54158 146796 146391 146046 145659 145112 144332 143544 143245 143670 144443 145011 145319 145718 146302 146729 146757 146661 146953 147785 148673
54139 148673 148781 147628 145740 144442 144652 145960 147163 147593 147454 147040 146370 145717 145751 146670 147785 148418 148743
54122 148743 149172 149464 149224 148927 149523 151109 152844 154164 155168 155775 155501 154456 153642 153732 154283 154800 155736
54105 155736 157643 159922 161445 162108 162844 164261 166194 168517 171488 175234 179666 184949 191177 197443 202120
54090 202120 204358 204570 203230 200155 195534 190681 186876 183965 180901 177305 173715 170617 168054 166136
54076 166136 165191 165335 166341 167984 170179 172930 176376 180594 184979 188244 189718 190296 191316 192665 192908
$$ packed form
54192A39493O69L40J8k69o25j034j223r18k80M4l87j173j383o06N69J217J055
54175A35507N91M84Q45J226J208R02Q03J143J585J668J347Q83M19p4n06o70n65
54158A46796m05l45l87n47p80p88k99M25P73N68L08L99N84M27K8r6K92Q32Q88
54139A48673J08j153j888j298K10J308J203M30j39m14o70o53L4R19J115O33L25
54122A48743M29K92k40k97N96J586J735J320J004O07k74j045q14R0N51N17R36
54105A55736J907K279J523O63P36J417J933K323K971L746M432N283O228O266M677
54090B02120K238K12j340l075m621m853l805k911l064l596l590l098k563j918
54076A66136r45J44J006J643K195K751L446M218M385L265J474N78J020J349K43
$$ plain form
54061 192908 191313 188790 186583 184879 183182 181289 179310 177173 174780 172397 170444 169068 168291 168391 169656
54046 169656 171799 174033 175847 177562 179990 183608 188080 192584 196586 200192 203751 207422 211314 215744
54032 215744 220829 225965 230279 233620 236640 239751 242583 244641 246029 247233 248586 250199 252015 253673
54018 253673 254677 254951 254825 254236 252475 249159 244979 240921 237040 232646 227551 222477 218185 214665 211377
54003 211377 208010 204863 202546 201234 200198 198358 195459 192374 190014 188327 186658 184719 182677 180668
53989 180668 178830 177619 177407 177779 177856 177304 176541 175932 175425 175075 175339 176609 178747 181178 183103 183726 182905
53972 182905 181687 181503 182566 183621 183613 183076 183470 185618 189267 193803 198822 204186 210083 217011 225405 235314
53956 235314 246609 259188 272540 285237 295346 301385 302774 299630 292639 283109 272715 262990 255054
$$ packed form
54061A92908j595k523k207j704j697j893j979k137k393k383j953j376p77J00J265
54046A69656K143K234J814J715K428L618M472M504M002L606L559L671L892M430
54032B15744N085N136M314L341L020L111K832K058J388J204J353J613J816J658
54018B53673J004K74j26n89j761l316m180m058l881m394n095n074m292l520l288
54003B11377l367l147k317j312j036j840k899l085k360j687j669j939k042k009
53989A80668j838j211k12L72P7n52p63o09n07l50K64J270K138K431J925O23q21
53972A82905j218j84J063J055qn37L94K148L649M536N019N364N897O928Q394R909
53956B35314J1295J2579J3352J2697J0109O039J389l144o991r530j0394r725p936
$$ plain form
53943 255054 249515 246175 243980 241851 239769 238668 239170 240835 242854 245053 247831 251336 255119 258532
53929 258532 261152 262903 264113 265487 267617 270323 272697 274075 274819 275881 277728 280005 282311 284881
53915 284881 288331 293020 298897 305745 313134 320290 326459 331502 335784 339404 341957 343184 343411 343037 341966
53900 341966 340014 337571 335289 333126 330290 326293 321659 317296 313418 309377 304448 298515 291945 285056
53886 285056 277901 270619 263771 258004 253295 248829 243891 238700 234100 230518 227600 224821 222025 219267
53872 219267 216524 213851 211561 209883 208500 206715 204191 201402 199237 198088 197349 195964 193621 191239
53858 191239 190007 190035 190290 189835 188658 187225 185782 184490 183771 183929 184523 184622 183747 182304 181102 180678 181003
53841 181003 181584 181868 181732 181509 181389 181064 180290 179504 179370 179803 180094 180004 180141 181050 182468 183777 184812 185916
$$ packed form
53943B55054n539l340k195k129k082j101N02J665K019K199K778L505L783L413
53929B58532K620J751J210J374K130K706K374J378P44J062J847K277K306K570
53915B84881L450M689N877O848P389P156O169N043M282L620K553J227K27l74j071
53900C41966j952k443k282k163k836l997m634m363l878m041m929n933o570o889
53886B85056p155p282o848n767m709m466m938n191m600l582k918k779k796k758
53872B19267k743k673k290j678j383j785k524k789k165j149p39j385k343k382
53858A91239j232K8K55m55j177j433j443j292p19J58N94R9q75j443j202m24L25
53841A81003N81K84j36k23j20l25p74p86j34M33K91r0J37R09J418J309J035J104
$$ plain form
53823 185916 187454 189483 191618 193079 193304 192734 192521 193153 193882 193912 193666 194207 195757 197595 199340 201504
53807 201504 204616 208414 212189 215508 218321 220794 223350 226641 231095 236466 241969 246758 250259 252290
53793 252290 253104 253339 253791 255067 257300 260051 262595 264443 265540 265918 265431 264059 262248 260575 259121
53778 259121 257519 255537 253212 250516 247325 243774 240225 236785 233266 229664 226242 223046 219773 216339
53764 216339 213118 210392 207989 205731 203818 202414 201221 199902 198615 197681 196979 196156 195252 194569 193989 192932
53748 192932 191192 189378 188327 188255 188691 189147 189667 190589 191812 192533 192029 190612 189473 189476 190465 191791 193030
53731 193030 193943 194270 194096 194094 194838 196050 197003 197534 198196 199524 201579 204109 206687 208786 210207 211431 213097
53714 213097 215179 217129 218742 220299 221846 222970 223531 224047 225104 226793 228937 231444 234171 236881 239598
$$ packed form
53823A85916J538K029K135J461K25n70k13O32P29L0k46N41J550J838J745K164
53807B01504L112L798L775L319K813K473K556L291M454N371N503M789L501K031
53793B52290Q14K35M52J276K233K751K544J848J097L78m87j372j811j673j454
53778B59121j602j982k325k696l191l551l549l440l519l602l422l196l273l434
53764B16339l221k726k403k258j913j404j193j319j287r34p02q23r04o83n80j057
53748A92932j740j814j051p2M36M56N20R22J223P21n04j417j139LR89J326J239
53731A93030R13L27j74kP44J212R53N31O62J328K055K530K578K099J421J224J666
53714B13097K082J950J613J557J547J124N61N16J057J689K144K507K727K710K717
$$ plain form
53699 239598 242636 246021 249340 252504 256165 260833 265893 270053 272656 274054 274806 275026 274598 273614 272410
53684 272410 271407 270990 271334 272191 272934 272916 271852 270039 268239 267136 266694 266187 265042 263525 262361 261896
53668 261896 261879 261937 261871 261555 261002 260605 260965 262261 264023 265613 266742 267438 267832 268203 268927 269991 270688 270173
53650 270173 268430 266408 265083 264568 264315 264030 264106 265111 267075 269410 271462 273025 274352 275827 277657
53635 277657 279805 282108 284407 286589 288619 290652 293103 296366 300372 304564 308533 312499 316949 321913
53621 321913 326911 331629 336172 340599 344643 348132 351311 354313 356658 357809 358144 358820 360553 363008 365515
53606 365515 367938 370525 373302 376041 378642 381085 383105 384366 385065 385966 387630 389829 391860 393305 394269
53591 394269 395050 395775 396316 396362 395592 393940 391702 389332 387167 385404 384085 382938 381398 379133 376507 374223
$$ packed form
53699B39598L038L385L319L164L661M668N060M160K603J398P52K20m28r84j204
53684B72410j003m17L44Q57P43j8j064j813j800j103m42n07j145j517j164m65
53668B61896j7N8o6l16n53l97L60J296J762J590J129O96L94L71P24J064O97n15
53650B70173j743k022j325n15k53k85P6J005J964K335K052J563J327J475J830
53635B77657K148K303K299K182K030K033K451L263M006M192L969L966M450M964
53621C21913M998M718M543M427M044L489L179L002K345J151L35O76J733K455K507
53606C65515K423K587K777K739K601K443K020J261O99R01J664K199K031J445R64
53591C94269P81P25N41M6p70j652k238k370k165j763j319j147j540k265k626k284
$$ plain form
53575 374223 372463 370685 368355 365563 362835 360609 359090 358293 357965 357649 357072 356409 355972 355822 355812 355828 355764
53558 355764 355519 355241 355336 355890 356336 356109 355441 355032 355072 355174 355285 356045 358041 361138 364752 368337 371431 373701
53540 373701 375389 377413 380605 384977 389953 395131 400520 406217 412194 418362 424639 431018 437711 445089
53526 445089 453350 462436 472405 483585 496051 509220 522404 535643 549586 564613 580528 597126
53514 597126 614582 633095 652534 672674 693535 715240 737786 761182 785577 810931 836648
53503 836648 861923 886505 910725 934732 958071 980315 1001773 1023131 1044470 1065150 1084780
53492 1084780 1103879 1123304 1143307 1163425 1183088 1202020 1220286 1238291 1256586 1275280 1293763
53481 1293763 1311419 1328454 1345548 1362770 1379450 1395122 1409810 1423195 1434365 1442947 1449846 1456077
$$ packed form
53575C74223j760j778k330k792k728k226j519p97l28l16n77o63m37j50j0J6o4
53558C55764k45k78R5N54M46k27o68m09M0J02J11P60J996L097L614L585L094K270
53540C73701J688K024L192M372M976N178N389N697N977O168O277O379O693P378
53526D45089Q261R086R969J1180J2466J3169J3184J3239J3943J5027J5915J6598
53514E97126J7456J8513J9439K0140K0861K1705K2546K3396K4395K5354K5717
53503H36648K5275K4582K4220K4007K3339K2244K1458K1358K1339K0680J9630
53492A084780J9099J9425K0003K0118J9663J8932J8266J8005J8295J8694J8483
53481A293763J7656J7035J7094J7222J6680J5672J4688J3385J1170Q582O899O231
$$ plain form
53469 1456077 1461228 1463809 1462936 1458934 1452352 1443243 1431660 1418249 1403935 1389291 1374433 1359298 1343784
53456 1343784 1327746 1311006 1293306 1274309 1253902 1232434 1210406 1187901 1164764 1141369 1118746
53445 1118746 1097621 1077696 1058264 1039333 1021717 1006086 992390 980398 970418 963108 958547 955792
53433 955792 953548 951253 949334 948413 948535 949372 950954 953808 958321 964332 971571 980233 990808 1003355
53419 1003355 1017307 1032076 1047714 1064860 1084094 1105532 1128951 1154081 1180629 1208164 1236312
53408 1236312 1265129 1295110 1326699 1359892 1394430 1430237 1467493 1506399 1547185 1590381 1636742
53397 1636742 1686633 1739529 1794279 1849879 1905917 1962387 2019282 2076466 2133788 2191122 2248282
53386 2248282 2304976 2360796 2415191 2467476 2517125 2564113 2608777 2651216 2691046 2727842 2761551
$$ packed form
53469A456077N151K581q73m002o582r109j1583j3411j4314j4644j4858j5135j5514
53456A343784j6038j6740j7700j8997k0407k1468k2028k2505k3137k3395k2623
53445A118746k1125j9925j9432j8931j7616j5631j3696j1992r980p310m561k755
53433I55792k244k295j919r21J22Q37J582K854M513O011P239Q662J0575J2547
53419A003355J3952J4769J5638J7146J9234K1438K3419K5130K6548K7535K8148
53408A236312K8817K9981L1589L3193L4538L5807L7256L8906M0786M3196M6361
53397A636742M9891N2896N4750N5600N6038N6470N6895N7184N7322N7334N7160
53386B248282N6694N5820N4395N2285M9649M6988M4664M2439L9830L6796L3709
$$ plain form
53375 2761551 2792049 2818529 2839843 2855526 2866090 2872221 2874017 2871039 2862675 2848234 2827040 2798779
53363 2798779 2763589 2721857 2674371 2622817 2569463 2515770 2461547 2405946 2349043 2291988 2235865
53352 2235865 2181035 2127533 2075526 2025229 1976765 1930175 1885312 1841713 1798826 1756309 1713931
53341 1713931 1671523 1629532 1589309 1552110 1517736 1484897 1453076 1423318 1396852 1373544 1352257
53330 1352257 1332348 1314228 1298611 1285613 1274497 1263946 1252672 1240122 1226743 1213478 1201000
53319 1201000 1189420 1178491 1167966 1157843 1148422 1140077 1132979 1127182 1122895 1120365 1119443 1119610 1120563 1122510
53305 1122510 1125774 1130427 1136454 1143947 1152901 1163143 1174739 1188136 1203572 1220611 1238668 1257862
53293 1257862 1278895 1302170 1327369 1353882 1381280 1409237 1437272 1464682 1490747 1515032 1537605
$$ packed form
53375B761551L0498K6480K1314J5683J0564O131J796k978q364j4441k1194k8261
53363B798779l5190m1732m7486n1554n3354n3693n4223n5601n6903n7055n6123
53352B235865n4830n3502n2007n0297m8464m6590m4863m3599m2887m2517m2378
53341A713931m2408m1991m0223l7199l4374l2839l1821k9758k6466k3308k1287
53330A352257j9909j8120j5617j2998j1116j0551j1274j2550j3379j3265j2478
53319A201000j1580j0929j0525j0123r421q345p098n797m287k530r22J67R53J947
53305A122510L264M653O027P493Q954J0242J1596J3397J5436J7039J8057J9194
53293A257862K1033K3275K5199K6513K7398K7957K8035K7410K6065K4285K2573
$$ plain form
53282 1537605 1558852 1578922 1597403 1613593 1626911 1636981 1643667 1647296 1648565 1647785 1644388 1637617 1627596
53269 1627596 1615204 1600926 1584372 1565106 1543413 1519908 1494765 1467812 1439214 1409626 1379635
53258 1379635 1349355 1318683 1287753 1256930 1226482 1196381 1166510 1136914 1107781 1079241 1051350
53247 1051350 1024233 998025 972532 947176 921531 895844 870769 846637 823263 800477 778456
53236 778456 757346 736873 716779 697559 680295 665572 652834 641100 630054 620025 611025 602410
53224 602410 593787 585647 578494 571566 563228 552757 541079 529446 517971 506050 493777 482093
53212 482093 471495 461317 450589 439216 428020 417854 408972 401110 393918 387219 380924 374777 368373
53199 368373 361597 354897 348790 343130 337202 330643 323886 317464 311286 304995 298787 293322 288867 284993
$$ packed form
53282A537605K1247K0070J8481J6190J3318J0070O686L629J269p80l397o771j0021
53269A627596j2392j4278j6554j9266k1693k3505k5143k6953k8598k9588k9991
53258A379635l0280l0672l0930l0823l0448l0101k9871k9596k9133k8540k7891
53247A051350k7117k6208k5493k5356k5645k5687k5075k4132k3374k2786k2021
53236G78456k1110k0473k0094j9220j7264j4723j2738j1734j1046j0029r000q615
53224F02410q623q140p153o928q338j0471j1678j1633j1475j1921j2273j1684
53212D82093j0598j0178j0728j1373j1196j0166q882p862p192o699o295o147o404
53199C68373o776o700o107n660n928o559o757o422o178o291o208n465m455l874
$$ plain form
53185 284993 281236 277630 274423 271629 269147 267066 265504 264244 262840 261018 258798 256311 253803 251725
53171 251725 250420 249609 248548 246871 244975 243361 241953 240415 238894 237945 237684 237453 236489 234675 232513
53156 232513 230550 228980 227600 226044 224168 222346 221278 221416 222627 224416 226297 227905 229009 229578 229745
53141 229745 229598 229141 228547 228211 228328 228627 228818 229123 230024 231517 233062 234340 235678 237462 239498 241271
53125 241271 242660 243879 244796 244844 243925 242964 243004 243880 244280 243312 241611 240612 240950 241931 242486 242240 241508 240494
53107 240494 238880 236381 233509 231387 230586 230460 230037 229367 229319 230058 230507 229805 228600 228179 228790 229636 230259
53090 230259 230934 231683 231863 231058 229713 228558 227871 227596 227585 227463 226840 225969 225680 226244 226878 226763 226006 225148
53072 225148 224298 223345 222466 221674 220365 218165 215894 214769 214772 214696 213760 212343 211092 210213 209776 209860 210098 209871
$$ packed form
53185B84993l757l606l207k794k482k081j562j260j404j822k220k487k508k078
53171B51725j305q11j061j677j896j614j408j538j521r49k61k31r64j814k162
53156B32513j963j570j380j556j876j822j068J38J211J789J881J608J104N69J67
53141B29745j47m57n94l36J17K99J91L05R01J493J545J278J338J784K036J773
53125B41271J389J219R17M8r19r61M0Q76M00r68j701r99L38R81N55k46p32j014
53107B40494j614k499k872k122q01j26m23o70m8P39M49p02j205m21O11Q46O23
53090B30259O75P49J80q05j345j155o87k75j1j22o23q71k89N64O34j15p57q58
53072B25148q50r53q79p92j309k200k271j125Lp6r36j417j251q79m37Q4K38k27
$$ plain form
53054 209871 209382 209800 211813 214615 216896 218342 219579 220998 222352 223313 223773 223589 222641 221320 220503 220758
53038 220758 221669 222126 221285 219278 217071 215697 215544 216278 217267 217981 218210 218190 218513 219543 220895 221791 222023
53021 222023 222202 222892 223887 224632 225012 225349 225797 226195 226454 226710 227005 227119 226802 226061 225183 224567 224471 224765 224953
53002 224953 224619 223876 223237 223027 223088 223061 222878 222862 223345 224220 224919 224943 224452 224196 224795 226198 227918 229593 231076
52983 231076 232128 232478 232346 232566 233833 235920 237956 239468 240866 242662 244570 245758 245932 245698 245692 245769 245440
52966 245440 244872 244927 246137 247909 248946 248367 246487 244617 244032 244851 245835 245431 243087 239539 236021 233503
52950 233503 232464 232805 233810 234506 234378 233567 232398 231026 229592 228315 227242 226289 225725 226101 227349 228417
52934 228417 228357 227477 226862 227005 227519 228049 228652 229167 228970 227688 225666 223421 221167 219231 218385 219121 220836
$$ packed form
53054B09871m89M18K013K802K281J446J237J419J354R61M60j84r48j321q17K55
53038B20758R11M57q41k007k207j374j53P34R89P14K29k0L23J030J352Q96K32
53021B22023J79O90R95P45L80L37M48L98K59K56K95J14l17p41q78o16r6K94J88
53002B24953l34p43o39k10O1k7j83j6M83Q75O99K4m91k56N99J403J720J675J483
52983B31076J052L50j32K20J267K087K036J512J398J796J908J188J74k34oP7l29
52966B45440n68N5J210J772J037n79j880j870n85Q19R84m04k344l548l518k518
52950B33503j039L41J005O96j28q11j169j372j434j277j073r53n64L76J248J068
52934B28417o0q80o15J43N14N30O03N15j97j282k022k245k254j936q46P36J715
$$ plain form
52917 220836 222376 223263 223879 224554 225148 225615 226247 227029 227326 226736 225908 225875 226795 227887 228604 229170 229789 229961
52899 229961 229089 227424 225852 224818 223949 222849 221840 221645 222479 223774 224834 225584 226516 228004 229870 231680
52883 231680 233183 234204 234336 233246 231360 229729 228912 228366 227321 225996 225452 226392 228576 231360 234291
52868 234291 237069 239405 241177 242477 243355 243749 243777 243786 243910 243795 242982 241440 239514 237499 235449 233330 231194
52851 231194 229152 227201 225125 222703 220080 217728 215830 213941 211638 209320 207763 206916 205824 203941
52837 203941 201932 200742 200415 200318 200155 200174 200590 201356 202448 203904 205580 207236 208805 210233 211142 211074 210051
52820 210051 208551 207021 205802 205497 206766 209474 212435 214434 215391 216304 218076 220532 222556 223118 222133
52805 222133 220291 218152 215721 213033 210684 209239 208342 207089 205347 204028 203832 204285 204463 204130 203600 202868
$$ packed form
52917B20836J540Q87O16O75N94M67O32P82K97n90q28l3R20J092P17N66O19J72
52899B29961q72j665j572j034q69j100j009j95Q34J295J060P50R32J488J866J810
52883B31680J503J021J32j090j886j631q17n46j045j325n44R40K184K784K931
52868B34291K778K336J772J300Q78L94K8RJ24j15q13j542j926k015k050k119k136
52851B31194k042j951k076k422k623k352j898j889k303k318j557q47j092j883
52837B03941k009j190l27r7j63J9M16P66J092J456J676J656J569J428R09o8j023
52820B10051j500j530j219l05J269K708K961J999R57R13J772K456K024N62r85
52805B22133j842k139k431k688k349j445q97j253j742j319j96M53J78l33n30p32
$$ plain form
52789 202868 201628 200124 199255 199614 200848 202171 203126 203639 203767 203785 204206 205211 206163 206133 204951 203395 202286
52772 202286 201758 201500 201300 201115 200879 200551 200174 199766 199365 199300 199984 201087 201417 200304 198797 198740 200657 203314
52754 203314 205449 207046 208557 209739 209995 209430 208821 208784 209566 211445 214640 218810 223160 227140 230682 233774
52738 233774 236196 237721 238209 237570 236028 234411 233724 234272 235485 236614 237265 237302 236749 235985 235582 235630 235467
52721 235467 234300 231962 228918 225804 223150 221266 220094 219199 218163 217005 216169 216071 216677 217472 217951 218225
52705 218225 218947 220469 222265 223537 224206 224806 225487 225747 225268 224446 223808 223412 223166 223244 223724 224180 224147 223782
52687 223782 223602 223731 223860 223815 223721 223633 223444 223119 222663 221924 220825 219726 219116 218949 218717 218239 217898 217980 218246
52668 218246 218429 218707 219365 220265 221025 221563 222124 222907 223912 225040 226120 226978 227772 229086 231370 234309 237132
$$ packed form
52789B02868j240j504q69L59J234J323R55N13J28J8M21J005R52l0j182j556j109
52772B02286n28k58k00j85k36l28l77m08m01o5O84J103L30j113j507n7J917K657
52754B03314K135J597J511J182K56n65o09l7P82J879L195M170M350L980L542L092
52738B33774K422J525M88o39j542j617o87N48J213J129O51L7n53p64m03M8j63
52721B35467j167k338l044l114k654j884j172q95j036j158q36r8O06P95M79K74
52705B18225P22J522J796J272O69O00O81K60m79q22o38l96k46P8M80M56l3l65
52687B23782j80J29J29m5r4q8j89l25m56p39j099j099o10j67k32m78l41Q2K66
52668B18246J83K78O58R00P60N38N61P83J005J128J080Q58P94J314K284K939K823
$$ plain form
52651 237132 239494 241619 243487 244392 243683 241676 239406 237523 235756 233522 230752 228002 225972 225083 225335
52636 225335 226339 227492 228341 228879 229453 230341 231517 232866 234484 236552 238884 240738 241250 240115 237817
52621 237817 235243 233096 231596 230530 229486 228145 226524 224975 223937 223649 224044 224815 225602 226253 227033 228430
52605 228430 230547 232724 233946 233731 232542 231327 230722 230669 230631 230172 229377 228733 228568 228739 228993 229409 230213 231257
52587 231257 232114 232741 233633 235164 237120 239049 240703 241892 242265 241662 240445 239099 237654 235893 233947
52572 233947 232274 231113 230378 230070 230329 231077 232037 233126 234373 235346 235249 233929 232329 231520 231548 231670 231461
52555 231461 231155 230999 230894 230858 231347 232690 234442 235738 236271 236547 237036 237391 236864 235375 233790 233021 233115 233453
52537 233453 233678 234097 235136 236637 237880 238334 238299 238633 239759 241096 241736 241569 241302 241286 240908 239529 237574
$$ packed form
52651B37132K362K125J868R05p09k007k270j883j767k234k770k750k030q89K52
52636B25335J004J153Q49N38N74Q88J176J349J618K068K332J854N12j135k298
52621B37817k574k147j500j066j044j341j621j549j038k88L95P71P87O51P80J397
52605B28430K117K177J222k15j189j215o05n3l8m59p95o44j65J71K54M16Q04J044
52587B31257Q57O27Q92J531J956J929J654J189L73o03j217j346j445j761j946
52572B33947j673j161p35l08K59P48R60J089J247R73r7j320j600q09K8J22k09
52555B31461l06j56j05l6M89J343J752J296N33K76M89L55n27j489j585p69R4L38
52537B33453K25M19J039J501J243M54l5L34J126J337O40j67k67j6l78j379j955
$$ plain form
52520 237574 236118 235619 235692 236022 236803 238169 239771 241261 242768 244630 246905 249336 251563 253240 254230 254807
52504 254807 255345 255653 255057 253347 251228 249494 248122 246614 244932 243543 242663 242005 241330 240814 240694 240862
52488 240862 241023 241035 240905 240526 239718 238589 237679 237476 237758 237749 237118 236550 236981 238426 240004 240993 241320 241081 240334
52469 240334 239586 239783 241343 243682 246106 248638 251424 253890 255352 256145 257310 259188 261051 262147 262417
52454 262417 262041 260995 259280 257103 254603 251832 249145 247167 246142 245720 245513 245408 245204 244572 243666 243184
52438 243184 243388 243516 242681 240962 239138 237686 236629 236047 236026 236210 236024 235438 235012 235209 236107 237792 240333
52421 240333 243248 245556 246741 247268 247891 248825 249910 251203 252987 255447 258768 263377 269655 277513 286556
52406 286556 296500 306972 316947 324948 329980 331909 330921 327149 321096 313976 307090 300979 295425 290116
$$ packed form
52520B37574j456m99P3L30P81J366J602J490J507J862K275K431K227J677R90N77
52504B54807N38L08n96j710k119j734j372j508j682j389q80o58o75n16j20J68
52488B40862J61J2j30l79q08j129r10k03K82ro31n68M31J445J578R89L27k39p47
52469B40334p48J97J560K339K424K532K786K466J462P93J165J878J863J096K70
52454B62417l76j046j715k177k500k771k687j978j025m22k07j05k04o32r06m82
52438B43184K04J28q35j719j824j452j057n82k1J84j86n86m26J97Q98J685K541
52421B40333K915K308J185N27O23R34J085J293J784K460L321M609O278P858R043
52406B86556R944J0472R975Q001N032J929r88l772o053p120o886o111n554n309
$$ plain form
52392 290116 285032 280407 276628 274076 272735 272049 271478 271064 271087 271313 271128 270434 269911 270234 271474 273417 275911
52375 275911 278579 280760 282291 284049 287060 291210 295447 299263 303261 307978 312668 315774 316490 315517 314299
52360 314299 313764 313795 313737 313250 312656 312517 312999 313761 314396 314872 315567 317033 319666 323342 327262 330400 332334
52343 332334 333624 335241 337661 340635 343752 347032 350855 355451 360629 366059 371729 377974 385106 393144
52329 393144 401987 411692 422407 434103 446575 459709 473564 488147 503241 518566 534000 549641
52317 549641 565718 582466 599940 617876 635843 653550 670918 687886 704360 720449 736469
52306 736469 752494 768074 782712 796505 810009 823465 836473 848510 859494 869623 878845 886722
52294 886722 892800 896965 899387 900160 899067 895819 890603 884256 877666 871082 864325 857633 851771 847142
$$ packed form
52392B90116n084m625l779k552j341o86n71m14K3K26j85o94n23L23J240J943K494
52375B75911K668K181J531J758L011M150M237L816L998M717M690L106P16r73j218
52360C14299n35L1n8m87n94j39M82P62O35M76O95J466K633L676L920L138J934
52343C32334J290J617K420K974L117L280L823M596N178N430N670O245P132Q038
52329C93144Q843R705J0715J1696J2472J3134J3855J4583J5094J5325J5434J5641
52317E49641J6077J6748J7474J7936J7967J7707J7368J6968J6474J6089J6020
52306G36469J6025J5580J4638J3793J3504J3456J3008J2037J0984J0129R222P877
52294H86722O078M165K422P73j093l248n216o347o590o584o757o692n862m629
$$ plain form
52280 847142 843261 839584 836456 834684 834386 834903 835904 837923 841633 847038 853594 860691 867908 875212 883184
52265 883184 892563 903313 914555 925725 937243 949616 962415 974852 986974 999476 1012439 1025037
52253 1025037 1036540 1046978 1056726 1066014 1074899 1083100 1089682 1093542 1094480 1093273 1090522 1086004 1079459 1071432
52239 1071432 1062845 1054097 1045028 1035440 1025251 1014513 1003714 993736 984996 976809 968166 959079 950729
52226 950729 944259 939721 936195 932641 928644 924629 921357 919090 917340 915616 914213 913938 915143 917355
52212 917355 919902 922630 925923 930158 935173 940234 944571 947958 950687 953110 955544 958502 962440 966990
52198 966990 971088 974336 977782 982766 989310 996225 1002481 1007737 1011716 1013982 1014556 1014064 1012991 1011294 1008904
52183 1008904 1006009 1002453 997425 990342 981840 973411 966127 959990 954462 949189 944045 938790 933159 927432
$$ packed form
52280H47142l881l677l128j772k98N17J001K019L710N405O556P097P217P304P972
52265H83184R379J0750J1242J1170J1518J2373J2799J2437J2122J2502J2963J2598
52253A025037J1503J0438R748R288Q885Q201O582L860R38j207k751m518o545q027
52239A071432q587q748r069r588j0189j0738j0799r978q740q187q643r087q350
52226I50729o470m538l526l554l997m015l272k267j750j724j403k75J205K212
52212I17355K547K728L293M235N015N061M337L387K729K423K434K958L938M550
52198I66990M098L248L446M984O544O915O256N256L979K266N74m92j073j697k390
52183A008904k895l556n028p083q502q429p284o137n528n273n144n255n631n727
$$ plain form
52169 927432 922629 919728 918663 918484 918630 919581 921897 924993 927507 928728 929126 929473 930032 930741 931654 932861
52153 932861 934231 935519 936578 937359 937892 938349 939016 940090 941552 943136 944296 944434 943487 942195 941409 941222
52137 941222 941109 940884 941050 942216 944596 948197 953099 959400 967214 976822 988549 1002426 1018317 1036288
52123 1036288 1056394 1078057 1100194 1122142 1144051 1166298 1188994 1212211 1235992 1259797 1282476
52112 1282476 1303311 1322736 1341607 1360051 1377407 1393057 1406927 1419385 1430877 1441422 1450242
52101 1450242 1456283 1459488 1461102 1462311 1462901 1461732 1458052 1451731 1442617 1430622 1416447 1401303 1385685
52088 1385685 1369156 1351757 1334933 1320402 1308368 1297494 1286664 1276288 1267705 1261654 1257575 1254285
52076 1254285 1251083 1248257 1246809 1247865 1252108 1259440 1269002 1279618 1290335 1300773 1311212 1322497 1335510
$$ packed form
52169I27432m803k901j065j79J46R51K316L096K514J221L98L47N59P09R13J207
52153I32861J370J288J059P81N33M57O67J074J462J584J160J38r47j292p86j87
52137I41222j13k25J66J166K380L601M902O301P814R608J1727J3877J5891J7971
52123A036288K0106K1663K2137K1948K1909K2247K2696K3217K3781K3805K2679
52112A282476K0835J9425J8871J8444J7356J5650J3870J2458J1492J0545Q820
52101A450242O041L205J614J209N90j169l680o321r114j1995j4175j5144j5618
52088A385685j6529j7399j6824j4531j2034j0874j0830j0376q583o051m079l290
52076A254285l202k826j448J056M243P332R562J0616J0717J0438J0439J1285J3013
$$ plain form
52063 1335510 1350349 1366066 1381432 1395909 1409665 1422861 1435354 1446954 1457417 1466175 1472612 1476720
52051 1476720 1478974 1479448 1477607 1473187 1466644 1458394 1448212 1435844 1421752 1406705 1391035 1374867 1358697
52038 1358697 1343023 1327608 1311787 1295462 1279189 1263311 1247626 1231981 1216600 1201627 1186804
$$ packed form
52063A335510J4839J5717J5366J4477J3756J3196J2493J1600J0463Q758O437M108
52051A476720K254M74j841m420o543q250j0182j2368j4092j5047j5670j6168j6170
52038A358697j5674j5415j5821j6325j6273j5878j5685j5645j5381j4973j4823
$$ [...]
##END NTUPLES=NMR SPECTRUM
##END=
