
##TITLE=AC1302_PERAH12114_6535671_KetVU1Pe3j
##JCAMPDX= 6.0         $$ Bruker NMR JCAMP-DX V2.0
##DATA TYPE= NMR SPECTRUM
##DATA CLASS= NTUPLES
##ORIGIN= BRUKER
##OWNER= Administrator
$$ 1.72 TOPSPIN		Version 2.1
$$ 2012-12-11 23:22:26.924 -0500  Administrator@X
$$ Compression mode = diff/dup
##.OBSERVE FREQUENCY= 400.02188249412
##.OBSERVE NUCLEUS= ^1H
##.ACQUISITION MODE= SIMULTANEOUS (DQD)
##.ACQUISITION SCHEME= undefined
##.AVERAGES= 8
##.DIGITISER RES= 22
##SPECTROMETER/DATA SYSTEM= spect
##.PULSE SEQUENCE= zg30
##.SOLVENT NAME= COFFEE_meoh
##.SHIFT REFERENCE= INTERNAL, COFFEE_meoh, 1, 14.98509
##AUDIT TRAIL= $$ (NUMBER, WHEN, WHO, WHERE, PROCESS, VERSION, WHAT)
$$ ##TITLE= Audit trail, TOPSPIN		Version 2.1
$$ ##JCAMPDX= 5.01
$$ ##ORIGIN= Bruker BioSpin GmbH
$$ ##OWNER= Administrator
$$ $$ E:\/data/COFFEE/nmr/AC1302_PERAH12114_6535671_KetVU1Pe3j/70/pdata/1/auditp.txt
$$ ##AUDIT TRAIL=  $$ (NUMBER, WHEN, WHO, WHERE, PROCESS, VERSION, WHAT)
(   1,<2012-12-11 23:22:18.517 -0500>,<Administrator>,<X>,<go>,<TOPSPIN 2.1>,
      <created by zg
	started at 2012-12-11 23:21:11.877 -0500,
	POWCHK enabled, PULCHK disabled,
       configuration hash MD5:
       86 BA 57 50 F2 9D 5C 9B 26 00 A9 28 5F 66 2E 89
       data hash MD5: 64K
       23 6F 5D 08 E3 73 87 42 46 94 65 17 BE 11 F8 97>)
(   2,<2012-12-11 23:22:21.674 -0500>,<Administrator>,<X>,<proc1d>,<TOPSPIN 2.1>,
      <Start of raw data processing
       efp LB = 0 FT_mod = 6 PKNL = 1 PHC0 = 0 PHC1 = 0 SI = 32K 
       data hash MD5: 32K
       DD 72 D4 2F A2 AA 56 42 C6 3F 1A 9F 6F 95 A2 13>)
(   3,<2012-12-11 23:22:22.205 -0500>,<Administrator>,<X>,<proc1d>,<TOPSPIN 2.1>,
      <pk PHC0 = 96.9104 PHC1 = 0 
       data hash MD5: 32K
       45 9C 16 6E A7 50 27 73 58 EB C2 FD 67 61 C4 FE>)
(   4,<2012-12-11 23:22:22.439 -0500>,<Administrator>,<X>,<proc1d>,<TOPSPIN 2.1>,
      <abs ABSG = 1 
       data hash MD5: 32K
       D3 2E 05 0A AA 36 3D 7C 64 64 A5 01 51 12 5B 3B>)
(   5,<2012-12-11 23:22:22.595 -0500>,<Administrator>,<X>,<proc1d>,<TOPSPIN 2.1>,
      <abs ABSG = 2 
       data hash MD5: 32K
       BE D8 63 1A 81 28 DF 5A A5 1B 37 C1 10 77 E0 9B>)
(   6,<2012-12-11 23:22:22.752 -0500>,<Administrator>,<X>,<proc1d>,<TOPSPIN 2.1>,
      <abs ABSG = 3 
       data hash MD5: 32K
       63 28 A2 FC 24 9B 21 62 43 77 AE B5 8A 99 F9 68>)
(   7,<2012-12-11 23:22:22.908 -0500>,<Administrator>,<X>,<proc1d>,<TOPSPIN 2.1>,
      <abs ABSG = 4 
       data hash MD5: 32K
       C3 DD 40 3D 21 8C B5 89 08 67 62 F1 AA BA 8D 00>)
(   8,<2012-12-11 23:22:23.064 -0500>,<Administrator>,<X>,<proc1d>,<TOPSPIN 2.1>,
      <abs ABSG = 5 
       data hash MD5: 32K
       22 1E F6 9C AF B3 D8 93 28 FF AA 33 AB B8 9F E8>)
$$ ##END=
$$ 
$$ $$ hash MD5
$$ $$ 63 46 19 38 A8 1C 3C 37 DB 19 45 87 AC 72 D6 A3
##$RELAX= 
##$RELAX= 
##$RELAX= 
##$RELAX= 
##$RELAX= 
##$RELAX= 
##$RELAX= 
##$RELAX= 
$$ Bruker specific parameters
$$ --------------------------
##$DU= <E:\>
##$EXPNO= 70
$$ [...]
150 150 150 150 150 150 150 150
##$TP07= 0
##$TPNAME0= <>
##$TPNAME1= <>
##$TPNAME2= <>
##$TPNAME3= <>
##$TPNAME4= <>
##$TPNAME5= <>
##$TPNAME6= <>
##$TPNAME7= <>
##$TPOAL= (0..7)
0.5 0.5 0.5 0.5 0.5 0.5 0.5 0.5
##$TPOFFS= (0..7)
0 0 0 0 0 0 0 0
##$TUNHIN= 0
##$TUNHOUT= 0
##$TUNXOUT= 0
##$USERA1= <user>
##$USERA2= <user>
##$USERA3= <user>
##$USERA4= <user>
##$USERA5= <user>
##$V9= 5
##$VALIST= <valist>
##$VCLIST= <CCCCCCCCCCCCCCC>
##$VD= 0
##$VDLIST= <DDDDDDDDDDDDDDD>
##$VPLIST= <PPPPPPPPPPPPPPP>
##$VTLIST= <TTTTTTTTTTTTTTT>
##$WBST= 2048
##$WBSW= 25
##$XGAIN= (0..3)
0 0 0 0
##$XL= 0
##$YL= 0
##$YMAX_a= 671150
##$YMIN_a= -570113
##$ZGOPTNS= <>
##$ZL1= 120
##$ZL2= 120
##$ZL3= 120
##$ZL4= 120
##$ABSF1= 14.98509
##$ABSF2= -5.573092
##$ABSG= 5
##$ABSL= 3
##$ALPHA= 0
##$AQORDER= 0
##$ASSFAC= 0
##$ASSFACI= 0
##$ASSFACX= 0
##$ASSWID= 0
##$AUNMP= <proc_prof1d_extract_pilot.lims>
##$AXLEFT= 0
##$AXNAME= <>
##$AXNUC= <1H>
##$AXRIGHT= 0
##$AXTYPE= 0
##$AXUNIT= <>
##$AZFE= 0.1
##$AZFW= 0.1
##$BCFW= 0
##$BC_mod= 0
##$BYTORDP= 0
##$COROFFS= 0
##$CY= 15
##$DATMOD= 1
##$DC= 0
##$DFILT= <>
##$DTYPP= 0
##$F1P= 0
##$F2P= 0
##$FCOR= 0.5
##$FTSIZE= 32768
##$FT_mod= 6
##$GAMMA= 0
##$GB= 0
##$INTBC= 1
##$INTSCL= 1
##$ISEN= 128
##$LB= 0
##$LEV0= 0
##$LPBIN= 0
##$MAXI= 10000
##$MC2= 0
##$MEAN= 0
##$ME_mod= 0
##$MI= 0
##$NCOEF= 0
##$NC_proc= -8
##$NLEV= 6
##$NOISF1= 0
##$NOISF2= 0
##$NSP= 0
##$NTH_PI= 0
##$NZP= 0
##$OFFSET= 14.98509
##$PC= 1
##$PHC0= 96.9104
##$PHC1= 0
##$PH_mod= 1
##$PKNL= yes
##$PPARMOD= 0
##$PPDIAG= 0
##$PPIPTYP= 0
##$PPMPNUM= 2147483647
##$PPRESOL= 1
##$PSCAL= 4
##$PSIGN= 0
##$PYNMP= <proc.py>
##$REVERSE= no
##$SF= 400.02
##$SI= 32768
##$SIGF1= 0
##$SIGF2= 0
##$SINO= 400
##$SIOLD= 32768
##$SPECTYP= <>
##$SREGLST= <1H.CDCl3>
##$SSB= 0
##$STSI= 32768
##$STSR= 0
##$SW_p= 8223.68421052631
##$SYMM= 0
##$S_DEV= 0
##$TDeff= 65536
##$TDoff= 0
##$TI= <>
##$TILT= no
##$TM1= 0
##$TM2= 0
##$TOPLEV= 0
##$USERP1= <user>
##$USERP2= <user>
##$USERP3= <user>
##$USERP4= <user>
##$USERP5= <user>
##$WDW= 1
##$XDIM= 32768
##$YMAX_p= 476253139
##$YMIN_p= -1179310
##$CURPLOT= <Network HP LaserJet P1505>
##$CURPRIN= <$Network HP LaserJet P1505>
##$DFORMAT= <normdp>
##$LAYOUT= <+/1D_H.xwp>
##$LFORMAT= <normlp>
##$PFORMAT= <normpl>
##$SURQMSG= 1
$$ End of Bruker specific parameters
$$ ---------------------------------
##NTUPLES= NMR SPECTRUM
##VAR_NAME=  FREQUENCY,     SPECTRUM/REAL,   SPECTRUM/IMAG
##SYMBOL=    X,             R,               I
##VAR_TYPE=  INDEPENDENT,   DEPENDENT,       DEPENDENT
##VAR_FORM=  AFFN,          ASDF,            ASDF
##VAR_DIM=   32768,         32768,           32768
##UNITS=     HZ,            ARBITRARY UNITS, ARBITRARY UNITS
##FACTOR=    0.250966925370066, 1,           1
##FIRST=     8223.43324360094, 97870,        -108484
##LAST=      0,             -220738,         14898
##MIN=       0,             -1179310,        0
##MAX=       8223.43324360094, 476253139,    0
$$ Real data points
##PAGE= N=1
##DATA TABLE= (X++(R..R)), XYDATA
$$ [...]
$$ plain form
19522 -319134 -48675 -304720 171915 20626 -26711 -202126 -126712 -120119 -6342 304250 -7036
19510 -204553 -283092 -111889 3248 75044 643227 -366399 220894 -76667 859 -200936 -284295
19499 -284295 -49086 -302869 -296230 -79638 -169379 56501 228631 -26587 142647 340039 -131438
19487 100130 -29558 -35371 160772 -40957 -100006 87467 41078 119759 153645 -287294 -119256
19475 226847 -246580 -228590 -335124 -129618 -75535 -163332 -99300 120978 323652 -255911
19464 11407 -159693 -202755 -305235 -304834 2820 -206800 -217321 -245821 -123079 -291267 -142590
19452 243841 -121749 -54428 -166680 -381 -446173 -56120 101439 221828 -6237 -387637 142792
19440 -71414 -151866 -357338 -85132 -11952 -63744 -22577 -251906 -23360 -20448 -23631 -180343
$$ packed form
19522c19134d8675k56045A71915B0626b6711j75415P5414O593f342C04250g036
19510b04553p8539a11889C248P1796N68183c66399B20894g6667H59b00936q3359
19499b84295d9086k53783O639g9638q9741E6501J72130b6587A42647J97392a31438
19487A00130b9558n813A60772d0957n9049H7467D1078P8681L3886b87294a19256
19475B26847b46580J7990j06534a29618N4083q7797O4032A20978K02674b55911
19464A1407a59693m3062j02480M01B820b06800j0521k8500J22742j68188a42590
19452B43841a21749e4428j12252c81m45792e6120A01439J20389f237l81400A42792
19440g1414q0452k05472h5132a1952n1792b2577k29329b3360K912l183j56712
$$ plain form
19429 -180343 -333275 -79559 301872 122927 26662 -12414 -119901 108654 28281 -219858
19418 -69154 -111403 158825 -127426 29296 83746 28640 -65169 248068 -186020 -158387 -156180
19407 -156180 -105447 -46528 -173804 125094 149398 123985 142502 -247801 108849 -141136
19396 -60485 287902 -4658 33557 -34666 -436618 46443 -150669 -258663 -268517 -86113 -163099
19385 -163099 -271616 -220055 214078 -38613 -106014 -49485 -179900 -325805 -24665 208394
19374 72375 -233356 249950 -98877 -244099 98414 248761 -70743 -4762 51112 -249188 26471
19362 -356002 -59512 396788 307897 7221 67321 444903 -19009 -32936 -217663 -403262 178913
19350 61917 90861 -2324 -156700 -118191 107387 -68987 46899 -45393 -244398 -188086 -250898
$$ packed form
19429a80343j52932g9559C01872A22927B6662a2414j07487A08654B8281b19858
19418f9154m2249A58825a27426B9296N4450B8640f5169B48068a86020K7633K207
19407a56180N0733d6528j27276A25094K4304k5413J8517b47801A08849a41136
19396f0485B87902d658C3557c4666m01952D6443a50669j07994r854h6113p6986
19385a63099j08517N1561B14078c8613o7401d9485j30415j45905b4665B08394
19374G2375b33356B49950i8877j45222I8414J50347g0743d762E1112b49188B6471
19362c56002e9512C96788q8891G221O0100L77582a9009j3927j84727j85599A78913
19350F1917K8944b324j54376L8509A07387f8987D6899d5393j99005N6312o2812
$$ plain form
19339 -250898 170900 -131153 231678 -211594 -269619 166799 -88103 -311711 -84619 -252988
19329 -252988 206407 -211096 -518534 217821 -213185 240344 10124 482472 -87801 -41470
19318 -278128 16381 178981 -93497 -283629 80977 103511 -2234 -165912 -85957 -61108 -201215
19307 -201215 -269936 -457156 -36435 -79091 -120296 -75249 -43305 -275287 69702 -73743 84892
19295 331998 87807 255335 -27302 -27172 -216289 150409 -99535 88278 -195642 148344 -124526
19283 -108420 -43462 81912 -374107 -183867 -77959 135220 -6306 150853 -35680 -24840 -28333
19272 -28333 -163106 -82460 -9453 65004 174433 -78638 17634 -333807 -403125 98340 -228211
19260 -200295 238681 -39085 183491 181556 -123847 -59970 -60694 -165380 -63836 -88469 117554
$$ packed form
19339b50898A70900a31153B31678b11594n8025A66799h8103k23608h4619j68369
19329b52988B06407b11096l07438B17821b13185B40344A0124M72348h7801d1470
19318b78128A6381J62600i3497j90132H0977K2534b234j63678P9955K4849j40107
19307b01215o8721j87220c6435m2656m1205M5047L1944k31982F9702g3743H4892
19295C31998H7807J67528b7302J30j89117A50409i9535H8278a95642A48344a24526
19283a08420d3462H1912c74107a83867g7959A35220f306A50853c5680J0840l493
19272b8333j34773Q0646i453F5004J09429g8638A7634c33807o9318I8340b28211
19260b00295B38681c9085A83491j935a23847e9970p24j04686f3836k4633A17554
$$ plain form
19248 -104647 -158331 -266585 -231648 -12069 -156978 58219 -90377 -289945 16300 264460 -174943
19236 -45531 -203713 -87480 -101002 -186162 38417 -204520 -85782 161845 61144 -59091 -88837
19225 -88837 74606 -239797 -203236 -1359 -182226 61434 119353 235582 -150803 75359 -341799
19213 -158652 -219362 -36942 -78564 -30145 159339 13541 238137 -352901 -209083 -165147 -281281
19202 -281281 -210758 -66823 -73567 -113376 -177824 22627 -126716 90440 -431567 -502812 176843
19190 -4655 -337973 -244732 -68945 -183383 -429364 -256856 -35950 -184092 -415589 76257 -126030
19178 61850 106072 190042 211095 -335708 -66943 69072 344423 80141 -243733 -98539 119193
19166 -91711 -174238 187184 -83711 -287598 409891 -121418 -112900 -95036 -72410 -10121 88722
$$ packed form
19248a04647n3684j08254L4937a2069j44909E8219i0377j99568A6300K48160a74943
19236d5531j58182h7480j3522q5160C8417b04520h5782A61845F1144e9091k9746
19225h8837G4606b39797L6561a359j80867F1434N7919J16229a50803G5359c41799
19213a58652o0710c6942m1622c0145A59339A3541K24596c52901J43818M3936j16134
19202b81281P0523f6823o744l9809o4448B2627a26716I0440d31567p1245A76843
19190d655l33318R3241f8945j14438k45981J72508c5950j48142k31497G6257a26030
19178F1850M4222Q3970K1053c35708f6943F9072K75351H0141b43733i8539A19193
19166i1711q2527A87184h3711k03887D09891a21418Q518J7864K2626a0121H8722
$$ plain form
19154 -110826 -293059 46922 182790 14189 -223361 -81655 85437 -42604 -196666 -32001 -429301
19143 -429301 -168637 -213456 206751 -49934 166799 -33365 -351001 -13575 21793 -114252
19132 -242400 -52570 -54445 -121228 -315593 -49941 -333555 -127477 -130367 -100858 110372 114269
19121 114269 -53372 3907 132276 -219042 -145906 -489007 -25836 -52841 78489 -147642 133134
19109 12872 107055 370816 -2322 203313 -264146 255664 60878 -110310 74363 -337337 -13204
19097 -76620 -156302 -273455 261640 169825 41612 -110057 -214538 -338529 -154863 28404
19086 119590 205249 103596 -152527 -50016 -180469 39033 -50495 -352899 -72382 -253594
19076 -253594 63708 -242578 256807 111000 -9810 44433 34302 198675 -172721 -12007 245297
$$ packed form
19154a10826j82233D6922J35868A4189b23361h1655H5437d2604j54062c2001l97300
19143d29301a68637m4819B06751d9934A66799c3365l17636a3575B1793a14252
19132b42400e2570j875o6783j94365d9941k83614a27477k890K9509A10372L897
19121A14269e3372C907J28369b19042P3136l43101b5836k7005G8489a47642A33134
19109A2872R4183K63761b322B03313b64146B55664F0878a10310G4363c37337a3204
19097g6620p9682j17153B61640r1815D1612a10057j04481j23991a54863B8404
19086A19590Q5659j01653a52527e0016j30453C9033e0495l02404g2382j81212
19076b53594F3708b42578B56807A11000i810D4433j0131J64373a72721a2007B45297
$$ plain form
19064 -207061 84270 -53156 303754 382960 57890 161404 -136261 215374 -193050 74096
19053 114487 -92916 23432 -319727 -66268 -12447 74109 44046 1946 443566 115284 163264
19042 163264 38926 90181 136976 74196 -36282 -305308 232643 -134535 34337 -190166 -275834
19031 -275834 -101940 -59668 124189 -4752 184725 -41974 -12684 357168 -19623 24721 128502
19020 128502 16775 -74011 144041 -186079 -306831 -240901 261727 53299 -207790 -44037
19009 182268 280621 -342672 -194502 -167089 160528 -148236 -293789 132374 143979 170915
18999 170915 85689 -232803 -231420 201801 -397825 -239129 33610 -290607 -152037 -273883
18989 -273883 -117511 -495192 -61029 -10812 -207083 -113258 33905 -117034 -76032 -151051 -29334
$$ packed form
19064b07061H4270e3156C03754P9206E7890J03514a36261B15374a93050G4096
19053A14487i2916B3432c19727f6268a2447G4109l0063A946M41620A15284M7980
19042A63264C8926N1255M6795o2780c6282k69026B32643a34535C4337a90166q5668
19031b75834a01940M2272A24189d752A84725d1974a2684C57168a9623B4721J03781
19020A28502A6775g4011A44041a86079j20752O5930B61727E3299b07790d4037
19009A82268R8353c42672J48170K7413A60528a48236j45553A32374J1605K6936
18999A70915q5226b32803J383B01801c97825J58696C3610b90607J38570j21846
18989b73883a17511l77681f1029a0812j96271R3825C3905a17034M1002p5019b9334
$$ plain form
18977 -69522 -224621 10724 -194668 -247822 -168873 38758 -22863 -24880 2578 -55061 -345938
18966 -345938 70470 -274393 -336116 -153576 81609 -106027 428652 -88628 233500 -388850
18955 36258 115394 38955 21873 55019 -133500 -192366 54537 42174 -85899 91825 -75854
18943 -49945 -405707 -240263 -244463 -206590 -358333 -184255 160322 -76428 -131503 -1160 -153390
18932 -153390 43280 79073 -238706 -5453 -99883 27913 61079 480171 278001 -114834 -152173
18921 -152173 -41137 148602 -14021 -1191 -218882 -163828 219758 244018 -256425 -7712 -132855
18910 -132855 -356509 85529 -185704 38031 -209964 -204555 -197342 18692 39567 -194572 -56486
18898 -152256 173820 -41628 153597 -119435 101128 -27717 -342692 -165835 118438 -96257
$$ packed form
18977f9522j55099A0724a94668n3154P8949C8758b2863k017B578e5061k90877
18966c45938G0470b74393o1723a53576H1609a06027D28652h8628B33500c88850
18955C6258P9136C8955j7082L3146a33500n8866E4537j2363h5899I1825g5854
18943d9945l55762J65444m200L7873j51743J74078A60322g6428n5075a160j52230
18932a53390D3280L5793b38706e453r4430B7913L3166M19092k02170a14834l7339
18921a52173d1137A48602a4021a191k17691N5054B19758K4260b56425g712j25143
18910a32855k23654H5529a85704C8031b09964N409P213A8692K0875a94572e6486
18898a52256A73820d1628A53597a19435A01128b7717l14975a65835A18438i6257
$$ plain form
18887 -337561 -227928 -152360 190985 98729 -45064 313280 169619 -138436 -92313 -37783
18876 79744 -430110 -102797 -407010 -181170 -173948 77476 -76347 -151936 -154043 -22663 26459
18864 -336345 -123675 -256215 -159139 -267108 -33077 35247 -147536 -123320 92503 -28611 -194310
18853 -194310 195586 402770 218394 -124352 80422 -181094 187 215413 -27913 68759 -300124
18841 101919 -17414 -93908 -66424 -100420 -59071 26814 189784 -171478 -279357 -26941 -401679
18830 -401679 -44103 -308205 53791 32432 -321206 -232891 -84872 -532034 47499 174036 -248894
18818 176669 147168 181554 -175391 -217476 -132812 203125 -42729 -133665 157559 -67399 -14690
18806 248818 -141201 -111119 -33758 96671 34371 -12991 84938 -198499 -104206 -277231 89586
$$ packed form
18887c37561J09633P5568A90985r2256d5064C13280j43661a38436M6123c7783
18876G9744d30110a02797l04213a81170P222G7476g6347p5589k107b2663B6459
18864c36345a23675j32540R7076j07969c3077C5247a47536K4216I2503b8611j65699
18853a94310A95586K07184j84376a24352H0422a81094A87K15226b7913F8759c00124
18841A01919a7414p6494K7484l3996M1349B6814J62970a71478j07879b6941l74738
18830d01679d4103k64102E3791k1359c21206Q8315h4872m47162D7499J26537b48894
18818A76669k9501L4386a75391m2085Q4664B03125d2729r0936A57559f7399a4690
18806B48818a41201L0082c3758I6671C4371a2991H4938a98499R4293j73025H9586
$$ plain form
18794 229644 -428294 -186957 122370 -133372 196581 -155919 -460595 33283 -30906 89554
18783 265597 123728 -360824 110459 -200638 -238304 149825 -13879 -362955 -116576 382663
18772 111195 45206 -223907 -352350 -50186 128451 68803 -185584 -152442 70701 -387666
18761 291206 118303 253119 -122329 136696 -124530 -202089 -108239 21732 64477 -123248
18750 -475968 313711 92862 137150 -290971 75238 91932 56922 -130462 -97926 -202486 35667
18738 -65115 86169 98331 -259581 168641 -283123 251841 139018 -33072 -23780 139054 256928
18727 256928 90282 -62351 168903 154252 34712 -70192 197978 79061 195222 287646 -204587
18715 -74322 -307585 -112050 -19143 -115413 -228151 41040 -8440 -175340 -95156 -281500 266667
$$ packed form
18794B29644d28294a86957A22370a33372A96581a55919l04676C3283c0906H9554
18783B65597A23728c60824A10459b00638l7666A49825a3879l49076a16576C82663
18772A11195D5206b23907j28443e0186A28451n9648a85584L3142G0701c87666
18761B91206A18303J34816a22329A36696a24530p7559R3850B1732M2745a23248
18750d75968C13711I2862M4288b90971G5238J6694l5010a30462L2536j04560C5667
18738f5115H6169J2162b59581A68641b83123B51841j12823c3072R292A39054J17874
18727B56928I0282f2351A68903j4651C4712g0192A97978G9061J16161R2424b04587
18715g4322k33263a12050a9143r6270j12738D1040h440j66900Q0184j86344B66667
$$ plain form
18703 -219984 94834 -229005 -117582 -524013 47347 -83073 -435213 -46371 20250 -237487
18692 -119162 -509961 80699 -21011 -16294 248839 -4478 -92783 139312 31793 40939 -124508
18680 -33100 296786 124404 -308285 -233241 -82199 -81771 25560 -153350 106136 37992 -469851
18668 191654 -144526 -3308 118053 -57696 209115 -93700 -46616 -13680 -256453 -93972 -343191
18657 -343191 84482 -48077 35438 7264 -219866 -22508 44137 44094 -32637 -123411 76201 -62968
18644 206481 -238417 -207569 81624 86444 280401 82532 -177706 228525 -12908 -343453 -205475
18633 -205475 -74351 -218991 90118 -42329 -33438 -198990 262809 -61811 -51004 -443584 -92961
18621 42161 -167098 -268945 10438 316696 -225684 -191341 -175325 56213 -396645 112264
$$ packed form
18703b19984I4834b29005J11423m06431D7347h3073l52140d6371B0250b37487
18692a19162l90799H0699b1011M717B48839d478q8305A39312C1793R146a24508
18680c3100B96786A24404c08285P5044h2199M28B5560a53350A06136C7992d69851
18668A91654a44526c308A18053e7696B09115i3700d6616a3680k42773i3972k49219
18657c43191H4482d8077C5438G264b19866b2508D4137m3c2637r0774G6201f2968
18644B06481b38417L0848H1624M820J93957H2532a77706B28525a2908l30545J37978
18633b05475g4351j44640I0118d2329Q891j65552B62809f1811J0807l92580i2961
18621D2161a67098j01847A0438L06258b25684L4343J6016E6213c96645A12264
$$ plain form
18610 -349086 137465 2666 -197819 334616 -80432 -131000 -2250 -201308 219699 -192374 -58373
18598 -99511 46983 -61122 37691 266889 -305721 -194037 31518 -128603 -188283 90694 121402
18587 121402 -29804 -184449 -111180 -204573 -45555 -161997 -280223 -256540 -60840 434811 14529
18575 -446130 -183494 -26521 238959 -70660 45710 -84997 27599 -265989 -167663 -165528 -205596
18564 -205596 66536 41209 -114605 -122467 -50401 -157748 -133512 -187538 49732 -166913 21146
18552 105465 5745 -51954 -12916 47364 -121819 -61908 6845 379643 -131724 -76963 -37545
18540 -171687 -77198 249655 -73069 -181433 366233 -399801 -37903 -366469 -336409 -279753
18530 -279753 2598 255500 -94536 -104102 -39089 210155 -136741 168901 -5113 29163 193227
$$ packed form
18610c49086A37465B666a97819C34616h0432n0568b250j99058B19699a92374e8373
18598i9511D6983f1122C7691K29198c05721J11684C1518a28603n9680I0694L0708
18587A21402b9804j54645P3269r3393d5555j16442j18226K3683f0840D34811A4529
18575d46130a83494b6521B38959g0660D5710h4997B7599b65989R8326K135m0068
18564b05596F6536k5327a14605p862e0401j07347K4236n4026D9732a66913B1146
18552A05465E745e1954a2916D7364a21819N9911F845L72798a31724N4761c7545
18540a71687g7198B49655g3069j08364C66233c99801c7903l28566L0060N6656
18530b79753B598K52902i4536r566c9089B10155a36741A68901e113B9163J64064
$$ plain form
18519 193227 -52976 -82084 -159357 185238 -30698 -47093 36457 -24017 126119 -193110 -250320
18508 -250320 -283848 -79483 120935 -365536 88901 163692 -348035 -377118 265760 -160613
18497 127634 -13811 8434 123188 -15802 -105235 -228487 -249449 -31810 51763 -46209 -8406
18485 112798 -258556 -223333 -636 -217644 243825 -516273 -206662 -64876 38530 -67222 -305450
18474 -305450 64002 138688 35500 315910 -255509 -346912 -373825 124101 187271 39069 -222901
18462 129696 439661 -224220 -186260 -231858 -393924 195554 -308224 -26290 61099 195298
18452 195298 -152562 221007 -104930 45259 16269 -344895 -306683 37698 -18131 -310712
18442 -310712 -242937 33443 -17121 221389 85338 -57239 87033 -88636 158394 147749 149032
$$ packed form
18519A93227e2976k9108p7273A85238c0698j6395C6457b4017A26119a93110n7210
18508b50320l3528g9483A20935c65536H8901P4791c48035k9083B65760a60613
18497A27634a3811H434J14754a5802q9433j23252k0962c1810E1763d6209h406
18485A12798b58556L5223f36k17008B43825e16273b06662f4876C8530f7222k38228
18474c05450F4002P4686C5500K80410b55509r1403k6913A24101O3170C9069b22901
18462A29696L09965b24220L7960m5598j62066A95554c08224b6290F1099J34199
18452A95298a52562B21007a04930D5259A6269c44895L8212C7698a8131k92581
18442c10712O7775C3443a7121B21389H5338e7239H7033h8636A58394j0645J283
$$ plain form
18431 149032 -83105 -25934 -14632 -196192 86685 -27948 -115065 -17055 138510 -314332 65832
18419 53355 -144400 208871 -54538 -107575 -64930 -238094 -138915 24828 -213118 214931 65078
18407 -90979 311145 -137667 92779 85407 178088 161932 -347545 -113542 145585 49408 -85535
18395 -147504 70828 -190858 113501 -69554 -505344 -8943 -23253 -99005 -292071 -108690 21054
18383 -36645 -168078 15367 -227415 -63341 112679 234306 270993 86883 -25935 -29317 4394
18371 64345 -154472 158613 118369 66271 134780 31233 227228 204530 -56564 128137 -183217
18359 73009 64256 -25878 81528 -30853 -60357 -66391 -95811 75274 311035 -269448 -117808
18347 -123145 -58 40845 -170278 -349431 -194278 178218 164416 -292893 51561 -383494 -5902
$$ packed form
18431A49032h3105b5934J1302j81560H6685b7948q7117a7055A38510c14332F5832
18419E3355a44400B08871e4538n3037M2645j73164R9179B4828b13118B14931F5078
18407i0979C11145a37667I2779p372R2681j6156c47545a13542A45585D9408h5535
18395a47504G0828a90858A13501f9554m35790h943j4310p5752j93066a08690B1054
18383c6645j31433A5367b27415f3341A12679J21627L6687H6883b5935l382D394
18371F4345a54472A58613m0244n2098O8509C1233J95995k2698e6564A28137a83217
18359G3009q753b5878H1528c0853k9504o034k9420G5274K35761b69448a17808
18347a23145e8D0845a70278j79153J55153A78218j3802b92893E1561c83494e902
$$ plain form
18335 90896 -82573 268554 -136197 -27223 -144893 -59822 57842 -92563 159769 23961 -104279
18323 -1858 46202 164740 -8568 -301248 359231 60285 34517 -223499 40659 76157 226740
18312 226740 -15883 38236 -104712 80201 -95603 -551408 -246604 153416 -38975 105315
18301 -284680 -82710 -22901 -261289 372354 -108771 -208330 -134184 57872 401311 115105
18290 -285583 67201 33285 -55625 195495 -73350 -185705 -488031 239779 -202828 -291792
18280 -291792 503327 -17271 242019 -160581 41497 -204756 188221 -58344 -140745 166500
18269 -168848 79553 189817 -65374 -209821 -316767 -1958 -155229 192684 26316 -83177 316165
18257 188148 -68907 -42254 200306 -134852 264992 240403 -121601 180033 -231666 -52531
$$ packed form
18335I0896h2573B68554a36197b7223j17670e9822E7842i2563A59769B3961a04279
18323a858D6202J18538h568k92680C59231F0285k5768b23499D0659L5498J50583
18312B26740a5883C8236a04712H0201i5603m55805b46604A53416c8975A05315
18301b84680h2710b2901k38388C72354a08771r9559P4146E7872L43439A15105
18290b85583F7201C3285e5625A95495g3350j12355l02326B39779b02828q8964
18280b91792E03327a7271B42019a60581D1497b04756A88221e8344q2401A66500
18269a68848G9553J10264f5374j44447j06946a958j53271A92684B6316h3177C16165
18257A88148f8907K6653B00306a34852B64992k4589a21601A80033b31666e2531
$$ plain form
18246 -93124 -63154 -35450 -333135 90045 50195 -189992 -139615 61105 -235824 77583 -82981
18234 264435 -212945 34450 -418195 -28653 161090 177190 164936 -251162 -149784 -313889
18224 -313889 -26572 -142495 3400 -51092 -82218 -380003 -164534 -228971 -12449 -121075 -182582
18213 -182582 -4172 -14204 -296169 -74904 132977 96092 108211 -468888 -319177 26885 190464
18202 190464 39121 136114 477861 60934 -1774 69437 -157237 -149371 148121 174759 -7904
18190 -64631 -126786 153107 -305731 -275841 280106 65134 -288275 119018 13282 174898
18180 174898 47811 -488929 242312 -60520 -211378 230020 94643 -235503 -66796 10110
18169 -60190 -121677 -153058 -107646 -9561 53003 -146747 10795 -91533 23128 -62044 -331037
$$ packed form
18246i3124K9970K7704k97685I0045l9850a89992N0377F1105b35824G7583h2981
18234B64435b12945C4450d18195b8653A61090J6100j2254b51162J01378j64105
18224c13889b6572j15923C400e1092l1126k97785a64534o4437a2449j08626o1507
18213a82582d172j0032k81965g4904A32977l6885J2119d68888J49711B6885J63579
18202A90464C9121R6993L41747F0934a774F9437a57237P866A48121K6638g904
18190f4631o2155A53107c05731K9890B80106F5134b88275A19018A3282J61616
18180A74898D7811d88929B42312f0520j50858B30020I4643b35503f6796A0110
18169f0190o1487l1381M5412i561E3003a46747A0795i1533B3128f2044k68993
$$ plain form
18158 -331037 -138578 -116487 191636 14889 191555 -35402 256197 391482 494055 176401
18147 -162669 182206 92554 295552 -88449 4211 -66820 -70036 -150630 -61372 182544 36528
18135 -29598 -97808 -155347 57089 -175326 54459 -192348 -188605 -15191 154600 -403848 102632
18123 -54066 -57787 206509 -214621 -251893 -142227 -169964 -37381 49559 138684 328078 232133
18112 232133 72474 -204481 -27209 125035 -27342 144775 -90965 -33226 62070 -24750 31105
18100 -356025 -73149 94816 115621 367050 -169347 -128000 96713 -29655 201073 -247407 -63388
18088 119556 118954 26559 -59340 -16569 -174846 -345628 -220776 -12333 -288658 337411 -209114
18076 71045 -262546 -558910 -247719 -186235 45491 -83512 136891 -165896 -57817 -120586 -134289
$$ packed form
18158c31037a38578K2091A91636A4889J76666c5402B56197J35285J02573A76401
18147a62669A82206q9652K02998h8449D211f6820l216q0594f1372A82544C6528
18135b9598o8210n7539E7089a75326E4459a92348L743a5191A54600d03848A02632
18123e4066l721B06509b14621l7272J09666k7737c7381D9559Q9125J89394r5945
18112B32133G2474b04481b7209A25035b7342A44775i0965c3226F2070b4750C1105
18100c56025g3149I4816K0805K51429a69347M1347I6713b9655B01073b47407f3388
18088A19556o02B6559e9340a6569j58277j70782J24852a2333k76325C37411b09114
18076G1045b62546k96364b47719O1484D5491h3512A36891a65896e7817o2769j3703
$$ plain form
18065 -134289 326044 -5254 -10496 -230930 -34613 -37471 -483000 -72915 -95611 -181506 115449
18053 28624 -229275 -58538 -43421 143383 -116315 -227206 -90383 121060 -23005 -73019 -201263
18042 -201263 -52466 47655 167167 -186507 -97984 -63394 -178203 102475 -73668 8818 186828
18031 186828 333561 -1452 22164 -63839 -185807 136349 -412551 16096 73476 -472971 97246
18019 127879 76933 -10489 314235 64612 -3904 -553190 251318 -124579 91836 -115545 235801
18007 -447817 -100870 -65872 143551 -45787 140741 -202818 132051 -104143 514219 190772
17996 329763 -45344 121981 21157 -187147 126414 91538 65016 -182164 206934 183234
17986 183234 -65997 -85579 355009 -7227 -15577 -85432 219179 28701 217094 -4551 -22406
$$ packed form
18065a34289C26044e254n242k20434c4613k858m45529g2915k2696q5895A15449
18053B8624b29275e8538J5117A43383a16315j10891i0383A21060b3005n0014j28244
18042b01263e2466D7655J19512a86507Q8523L4590j14809A02475g3668H818J78010
18031A86828J46733a452B2164f3839j21968A36349d12551A6096N7380d72971I7246
18019A27879n0946a0489C14235F4612c904n49286B51318a24579I1836a15545B35801
18007d47817a00870L4998A43551d5787A40741b02818A32051a04143E14219A90772
17996C29763d5344A21981B1157a87147A26414l4876k6522a82164B06934k3700
17986A83234f5997j9582C55009g227q350o9855B19179B8701J88393d551j7855
$$ plain form
17975 -22406 158238 -373130 -112093 -111744 15691 28308 136510 -16368 -277404 33854 -257759
17963 31825 92404 82697 108426 71285 -116250 69773 -54578 11157 -141925 39465 15061
17951 28079 7597 -22594 303982 236825 2002 -14594 -104758 378264 247150 -258086 -38907
17939 -165429 280881 -280068 190418 283335 39705 61909 -91527 -137580 280719 -59618 150638
17927 31343 -462104 -194097 -116860 -346379 350387 -56315 146343 7857 181769 -80458 -135730
17916 -135730 354928 59296 229589 -144503 319732 341842 -205082 380051 -148173 226479
17905 -177056 232592 -95874 -94686 22001 -363134 80475 14249 66713 169030 129159 -95781
17893 29739 -19957 -37770 -547347 223954 -47350 -369561 42718 -338240 -15341 313317 352668
$$ packed form
17975b2406A58238c73130a12093L49A5691J2617J08202a6368k61036C3854b57759
17963C1825O0579r707K5729l7141a16250F9773e4578A1157a41925C9465A5061
17951B8079G597b2594C03982o7157B002a4594r0164C78264j31114b58086c8907
17939a65429B80881b80068A90418R2917C9705K2204i1527m6053B80719e9618A50638
17927C1343d62104a94097P7237k29519C50387e6315A46343G857J73912h0458n5272
17916a35730C54928E9296J70293a44503C19732K2110b05082C80051a48173B26479
17905a77056B32592i5874J188B2001c63134H0475A4249N2464J02317l9871i5781
17893B9739a9957j7813n09577B23954d7350l22211D2718c38240a5341C13317L9351
$$ plain form
17882 352668 40909 179965 -267650 25554 297645 190047 182107 58119 -87817 37757 7830
17870 159796 -300120 -140684 74752 61149 -100042 -223935 35517 -159655 -172982 -214195
17860 -214195 -97846 174704 -20251 -900 -32174 -143543 -182026 -71850 -15566 -10905 -21158 217642
17847 -98964 -317740 83297 -10200 -85348 -32015 377344 135765 -358210 -335050 -202590 279394
17835 -32892 -49055 -82195 241897 229174 45914 213555 -39798 68770 -169053 -77641 65250
17823 -50815 -6319 18687 -39914 -169325 -66092 -62516 30274 -188209 274497 104121 145415
17812 145415 78823 239283 237427 36899 27197 -192638 68110 -330161 -388502 261747 -78247
17800 -122 103548 -132093 -79393 255788 -102757 -222729 -93856 94942 5161 -29200 -58093
$$ packed form
17882C52668D0909J39056b67650B5554K72091j07598p940E8119h7817C7757G830
17870A59796c00120a40684G4752j3603a00042j23893C5517a59655j3327m1213
17860b14195i7846A74704b0251i00l1274j11369l8483g1850a5566M661j0253B17642
17847i8964k18776H3297a0200p5148c2015C77344A35765c58210K3160J32460B79394
17835c2892j6163l3140B41897j2723D5914J67641c9798F8770a69053g7641F5250
17823e0815f319A8687c9914j29411f6092L576C0274a88209B74497A04121M1294
17812A45415o6592J60460j856C6899r702a92638F8110c30161n8341B61747g8247
17800a22A03548a32093N2700B55788a02757j19972i3856I4942E161b9200k8893
$$ plain form
17789 -58093 98921 -19292 -65842 -252995 44035 -155908 -131583 -320743 120133 -326022 -167344
17778 -167344 169886 -301150 87308 -1688 -236962 37433 86067 -185602 -408905 -19039 -132508
17767 -132508 -135122 41937 47819 71017 93555 -102005 102396 37993 195684 -234981 -164220
17756 -164220 -4257 -19592 156121 -22358 -124645 177287 129619 209356 46391 83828 -98116
17744 17849 20676 375621 -77613 26930 -81549 -21609 -381355 166484 -181360 -136273 114362
17732 218723 -316732 -57335 214539 -63385 -35766 207634 188381 -204097 -136570 47815 109603
17721 109603 188633 119940 -482893 -280271 329387 199923 -79982 -89116 49218 105231 -221739
17709 -14066 335292 -53960 -34229 -83474 224284 -158521 2538 121689 -59221 10247 -106595
$$ packed form
17789e8093I8921a9292m6550j87153D4035a55908K4325j89160A20133c26022J58678
17778a67344A69886c01150H7308a688k35274C7433M8634a85602k23303a9039j13469
17767a32508k614D1937N882K3198K2538a02005A02396C7993J57691b34981P0761
17756a64220d257j5335A56121b2358j02287A77287m7668P9737D6391L7437i8116
17744A7849K827L54945g7613B6930h1549b1609l59746A66484a81360M5087A14362
17732B18723c16732e7335B14539f3385K7619B07634j9253b04097O7527D7815O1788
17721A09603P9030o8693d82893K02622C29387j29464g9982r134D9218N6013b21739
17709a4066C35292e3960J9731m9245B24284a58521B538J19151e9221A0247a06595
$$ plain form
17697 -120867 99936 142562 -300987 280410 175363 34182 451704 94283 157505 120366 112095
17686 112095 91201 -538612 235776 -59090 131759 -230917 -54000 -4040 280781 52930 -466976
17674 -193877 23150 305707 -96846 149992 -38615 218045 -22246 -23660 213007 105038 -244512
17662 -49528 7011 -249108 -217272 175398 66850 131544 -54453 -318679 157947 140506 339335
17651 339335 59848 232298 -32254 -73236 20596 -80431 -267613 174510 -8616 -106581 95954
17639 -122974 -175016 132765 38191 -100413 559365 -28687 441861 78451 -180389 -19534
17628 -230756 303388 -12932 -45094 224433 -290460 -123806 30847 -308579 188409 -90790
17617 220424 -89832 77283 112072 299496 -179442 55723 -15435 -66044 -81280 -66914 83503
$$ packed form
17697a20867I9936M2626c00987B80410j05047C4182M17522I4283O3222l7139q271
17686A12095k0894e38612B35776e9090A31759b30917e4000d040B80781E2930d66976
17674a93877B3150K82557i6846A49992c8615B18045b2246j414B13007A05038b44512
17662d9528G011b49108L1836A75398F6850O4694e4453k64226A57947j7441J98829
17651C39335E9848J72450c2254m0982B0596h0431j87182A74510h616r7965I5954
17639a22974n2042A32765C8191a00413E59365b8687D41861G8451a80389a9534
17628b30756C03388a2932l2162B24433b90460a23806C0847c08579A88409i0790
17617B20424h9832G7283L4789J87424a79442E5723a5435n0609j5236J4366H3503
$$ plain form
17605 120365 -256299 144871 230764 -226342 -199466 25088 224526 25245 8480 63810 -75596
17593 -66953 87272 143272 351849 -265023 145394 -233160 130114 -72016 -67935 -137789 -79768
17582 -79768 -256 -8752 209936 29945 218007 155282 67392 137667 445852 -182495 187457
17570 -23695 -132978 180254 44970 -325312 -2421 -40551 457635 82824 99644 -42908 342854
17558 222849 -302480 109869 -35205 248595 237437 273732 317228 58129 -97009 124828 365508
17547 365508 90149 -66414 217761 -299854 -413568 -21057 -159665 89905 -40423 -28660 239514
17535 202418 48207 -25814 219135 451662 -92931 252781 66141 342711 -220153 33066
17524 -65827 -29685 320922 542 216508 232925 10677 164189 16246 230875 15914 -206817
$$ packed form
17605A20365b56299A44871Q5893b26342K6876B5088J99438B5245H480N5330g5596
17593f6953H7272N6000K08577b65023A45394b33160A30114g2016M081o9854N8021
17582g9768b56q496B09936B9945J88062o2725F7392P0275L08185a82495A87457
17570b3695j09283A80254D4970c25312b421l8130D57635H2824J6820d2908C42854
17558B22849c02480A09869c5205B48595j1158L6295M3496E8129i7009A24828K40680
17547C65508I0149f6414B17761b99854j13714b1057j38608H9905d0423J1763B39514
17535B02418D8207b5814B19135K32527i2931B52781F6141K76570b20153C3066
17524f5827b9685C20922E42K15966J6417A0677J53512A6246K14629A5914b06817
$$ plain form
17512 -247198 13194 120858 245750 -65612 207271 -112803 364382 -91880 79558 -38485
17501 353831 191612 95992 -216308 -66410 286443 531470 185039 -90445 409138 90357
17490 114937 24105 -18633 98242 34360 126861 495312 -325456 37845 -103793 120706 30505
17478 -71956 288777 67575 507454 219315 406069 -160735 210566 20961 348712 277952
17468 277952 196911 398220 275892 -110018 177797 128156 83846 291373 502826 -53480
17457 66024 -111119 -56589 499277 110059 103556 66843 184956 72503 330698 417807 349982
17446 349982 147882 239148 437878 530293 399950 -66390 336070 266802 156949 204514
17436 204514 193658 230744 158224 32329 -43930 153239 305262 145509 287145 -194626
$$ packed form
17512b47198A3194J07664J24892f5612B07271a12803C64382i1880G9558c8485
17501C53831j62219r5620b16308f6410B86443K45027A85039i0445D09138I0357
17490A14937B4105a8633I8242C4360R2501L68451c25456C7845a03793A20706C0505
17478g1956B88777F7575M39879B19315J86754a60735B10566B0961L27751p0760
17468B77952q1041K01309j22328a10018A77797m9641m4310K07527K11453e3480
17457F6024a11119N4530D99277A10059o503l6713J18113G2503K58195Q7109o7825
17446C49982A47882R1266J98730R2415j30343f6390C36070o9268j09853M7565
17436B04514j0856L7086p2520C2329d3930A53239J52023A45509J41636a94626
$$ plain form
17425 136183 87198 -29102 62459 281565 315067 -26523 308601 229082 232090 299353 384383
17414 384383 26617 482076 368693 202760 -142273 259307 -144974 286579 122089 -31875
17403 169617 -247192 136433 -88776 292745 326036 115538 316043 245087 246720 256924 116169
17391 143084 99727 71766 380176 242648 6922 443927 396469 110609 450400 -306826
17380 175039 180248 55886 320415 232994 319752 -18414 -130100 231421 139334 140303 -69442
17368 70021 630620 -324999 68012 117749 141435 112366 211423 45644 -303508 -15380 178377
17356 169787 -171057 310795 638484 229355 144257 72646 359135 117388 187928 172375
17346 172375 496312 -146963 -65231 198980 -79375 204858 354731 129326 299944 226443
$$ packed form
17425A36183m8985b9102F2459K19106L3502b6523C08601p9519L008O7263Q5030
17414C84383B6617M55459j13383j65933a42273B59307a44974B86579A22089c1875
17403A69617b47192A36433h8776B92745L3291A15538K00505p0956J633J0204A16169
17391A43084m3357k7961L08410j37528F922M37005m7458A10609L39791c06826
17380A75039N209E5886K64529q7421Q6758a8414j11686B31421r2087R69f9442
17368G0021N60599c24999F8012M9737K3686k9069R9057D5644c03508a5380A78377
17356A69787a71057C10795L27689B29355q5098p1611K86489A17388P0540j5553
17346A72375L23937a46963f5231A98980g9375B04858J49873A29326J70618p3501
$$ plain form
17336 226443 64277 -297296 355614 -102860 252290 255664 177806 16862 145502 168399 445838
17325 445838 217412 1795 74318 52558 305901 125301 -38267 182245 218633 65908 -91212
17313 74084 290386 293196 343672 -71503 206202 224387 139853 455623 234223 47953 121077
17302 121077 98587 163027 471681 -57327 590772 353754 137325 47601 -33117 219226
17291 -27789 133871 76266 386983 155747 487782 214026 41898 237719 253800 212603
17281 212603 -44161 392670 278163 -138531 301666 118176 68336 306957 85412 -107403
17270 -22266 26732 248255 112146 202788 191113 309904 -3609 2132 257430 350664 380235
17259 380235 -78311 7029 224075 182406 172070 142266 62199 42266 441602 221779 235181
$$ packed form
17336B26443F4277b97296C55614a02860B52290L374p7858A6862J28640K2897K77439
17325D45838B17412A795P2523k1760K53343A25301c8267A82245L6388F5908i1212
17313G4084K16302K810N0476g1503B06202J8185q4534L15770k21400D7953P3124
17302A21077k2490O4440L08654e7327E90772k37018A37325D7601c3117B19226
17291b7789A33871n7605L10717A55747L32035B14026D1898J95821J6081m1197
17281B12603d4161C92670j14507a38531C01666A18176m9840K38621H5412a07403
17270b2266B6732K21523A12146R0642j1675J18791c609B132K55298R3234K9571
17259C80235g8311G029K17046m1669j0336k9804F2199j9933L99336k19823J3402
$$ plain form
17248 235181 374997 228407 179262 310167 -13753 197031 307035 114180 -164890 304099
17237 450907 310774 199183 -33529 349604 181497 233520 -12788 383095 41117 389163
17227 389163 224639 297164 55660 355859 502440 279561 534977 208595 481023 59190
17216 30403 -15583 480032 127303 111796 48502 196582 215165 339919 300689 206724 189078
17205 189078 210611 65372 46310 259892 460870 515489 55988 -92440 175552 240524 75452
17193 421025 255679 125537 182949 743802 428209 243594 440804 245615 232462 458301
17183 458301 375691 70270 598731 142425 151336 364007 433882 105234 562938 323040
17173 323040 344258 151492 149933 465146 486739 325100 102880 244485 592149 385004
$$ packed form
17248B35181J39816j46590m9145J30905a3753A97031J10004A14180a64890C04099
17237D50907j40133j11591c3529C49604j68107N2023a2788C83095D1117L48046
17227C89163j64524P2525E5660L00199J46581k22879K55416B08595K72428E9190
17216C0403a5583D80032A27303j5507D8502J48080J8583J24754l9230r3965j7646
17205A89078K1533F5372j9062K13582K00978N4619E5988i2440A75552O4972G5452
17193D21025j65346A25537N7412N60853l15593j84615J97210j95189j3153K25839
17183D58301q2610G0270N28461A42425Q911K12671O9875A05234M57704k39898
17173C23040K1218A51492j559L15213K1593j61639A02880J41605L47664k07145
$$ plain form
17163 385004 301556 196772 299593 517115 196156 114769 356661 408750 530406 112255
17152 583138 172150 624035 671725 512655 70237 492604 474715 -261853 368110 465856
17142 465856 567760 637102 343867 270977 351768 152720 338469 515899 425291 372206
17132 372206 483927 274719 378754 617771 268945 461898 290541 298230 520428 214726
17121 233370 285322 171478 170825 318921 327012 266762 516151 510179 274138 595790 303969
17110 303969 173968 45116 484176 376463 313128 549467 477826 167814 852143 341699
17099 393340 301369 433312 407515 313255 761520 238699 564096 362618 517826 766760
17089 766760 545770 189788 891962 553595 105514 339570 511072 348204 470591 276414
$$ packed form
17163C85004q3448j04784J02821K17522A96156q1387K41892N2089J21656A12255
17152E83138A72150M51885M7690j59070G0237M22367j7889b61853C68110R7746
17142D65856J01904O9342k93235p2890Q0791A52720J85749J77430r0608n3085
17132C72206J11721k09208J04035K39017B68945J92953j71357P689K22198B14726
17121B33370N1952j13844o53J48096Q091o0250K49389n972k36041L21652k91821
17110C03969j30001D5116M39060j07713o3335K36339p1641A67814O84329C41699
17099C93340r1971J31943k5797r4260M48265B38699L25397k01478J55208K48934
17089G66760k20990A89788P02174l38367A05514K34056J71502j62868J22387j94177
$$ plain form
17079 276414 632155 526022 737314 440124 112923 260504 437109 288577 362194 404593
17069 404593 668101 524476 534763 241141 756006 653296 402989 653233 617075 720271
17059 720271 668758 394753 220826 566706 726788 860104 370282 765936 567808 558316
17049 558316 390496 755941 715619 471806 389440 766735 349700 681109 553713 539248
17039 539248 634764 457518 858363 811144 879360 823978 690184 590557 1049309 940044
17029 940044 652894 591825 714871 779944 926843 891498 466092 720193 678997 798354
17019 798354 612650 575506 506848 1057485 862934 765388 563882 1000256 566280 608830
17009 608830 903424 656163 690437 791927 865697 1212634 746182 823475 819469 1126787
$$ packed form
17079B76414L55741j06133K11292k97190A12923J47581J76605j48532P3617M2399
17069D04593K63508j43625J0287B41141N14865j02710k50307K50244l6158J03196
17059G20271n1513k74005j73927L45880J60082J33316C70282L95654j98128r492
17049E58316j67820L65445m0322k43813q2366L77295C49700L31409j27396j4465
17039E39248R5516j77246M00845m7219O8216n5382j33794r9627M58752j09265
17029I40044k87150o1069J23046O5073J46899l5345m25406K54101m1196J19357
17019G98354j85704l7144o8658N50637j94551r7546k01506M36374m33976M2550
17009F08830K94594k47261L4274J01490P3770L46937m66452P7293m006L07318
$$ plain form
16999 1126787 1029370 1039009 921699 759546 832894 630678 896000 739362 682359 866678
16989 866678 746163 774487 1049976 799251 883114 656284 1004394 924404 1137612 848868
16979 848868 1086048 1010732 1160804 1191308 1178057 1012383 772451 1289383 974917 840572
16969 840572 1084737 975136 1667609 911088 1120200 882278 1239575 1093656 1337854 1074460
16959 1074460 1341454 1141707 950110 1339715 826624 1097024 988603 1250469 1063905
16950 1063905 1351150 1351762 1370024 1445878 1197453 1484340 1167108 1390130 1198995 1634892
16940 1634892 1243119 1135217 1087906 1557394 1407483 1323774 1352717 1198525 1498238 1462361
16930 1462361 1300956 1477809 1509140 1597436 1362610 1338176 1496909 1301455 1619680 2042209
$$ packed form
16999A126787r7417R639j17310j62153P3348k02216K65322j56638n7003J84319
16989H66678j20515K8324K75489k50725Q3863k26830L48110p9990K13208k88744
16979H48868K37180p5316J50072L0504j3251j65674k39932N16932l14466j34345
16969H40572K44165j09601O92473p56521K09112k37922L57297j45919K44198k63394
16959A074460K66994j99747j91597L89605n13091K70400j08421K61866j86564
16950A063905K87245O12J8262P5854k48425K86887l17232K23022j91135M35897
16940A634892l91773j07902m7311M69488j49911q3709K8943j54192K99713l5877
16930A462361j61405J76853L1331Q8296k34826k4434J58733j95454L18225M22529
$$ plain form
16920 2042209 1386983 1562745 1579574 1639681 1599970 1695524 1932282 2172014 1611406 1839337
16910 1839337 1715356 1876333 1809687 1890147 2177471 2070478 2147325 2087017 1827493 2037177
16900 2037177 2249302 1924657 2084608 2064766 2284560 2125472 2091740 2088956 2060843 2346719
16890 2346719 2295358 2351033 2271379 2216393 2587661 2641697 2286160 2359198 2517762 2345052
16880 2345052 2783850 2719985 2630359 2625163 2680943 2546639 2819144 2984264 2787808 2743770
16870 2743770 3045884 2956563 2721219 2907240 3152991 3072343 2871400 3237319 3181755 3344793
16860 3344793 3672622 3222775 3308176 3487316 4043620 3580053 3558086 3700961 3778358 3814200
16850 3814200 3737453 3884312 3906375 3860011 3754111 4573088 4420142 3879695 4227849 4428667
$$ packed form
16920B042209o55226J75762J6829O0107l9711R5554K36758K39732n60608K27931
16910A839337j23981J60977o6646Q0460K87324j06993P6847o0308k59524K09684
16900B037177K12125l24645J59951j9842K19794j59088l3732k784k8113K85876
16890B346719n1361N5675p9654n4986L71268N4036l55537P3038J58564j72710
16880B345052M38798o3865q9626n196N5780j34304K72505J65120j96456m4038
16870B743770L02114q9321k35344J86021K45751q0648k00943L65919n5564J63038
16860C344793L27829m49847Q5401J79140N56304m63567k1967J42875P7397L5842
16850C814200p6747J46859K2063m6364j05900Q18977j52946n40447L48154K00818
$$ plain form
16840 4428667 4349810 4323093 4351218 4288981 4482666 4892191 4801266 4789191 4731988 4994212 5236128
16829 5236128 5260037 5303763 5145933 5535202 6004166 5782089 5636311 6069142 5985731 6279859
16819 6279859 6327651 6518116 6672515 6890738 6786784 7127136 7408736 7471131 7255068 7406999
16809 7406999 7710636 8007366 8276835 8470200 8422978 8427294 8786289 9135000 9457002 9312277
16799 9312277 9614694 10035191 10321364 10383030 10938502 10826066 11436437 11554625 11764219 11858059
16789 11858059 12577403 13041942 13121438 13547573 13598272 14251068 14823846 15155773 15350470 15636146
16779 15636146 16282681 16745667 17520976 17926092 18406513 18951950 19446483 20080517 20658669
16770 20658669 21108346 22443441 23131036 23560521 24469423 25411960 26253723 27214610 28269334
$$ packed form
16840D428667p8857k6717K8125o2237J93685M09525r0925j2075n7203K62224K41916
16829E236128K3909M3726j57830L89269M68964k22077j45778M32831q3411K94128
16819F279859M7792J90465J54399K18223j03954L40352K81600O2395k16063J51931
16809G406999L03637K96730K69469J93365m7222M316L58995L48711L22002j44725
16799I312277L02417M20497K86173O1666N55472j12436O10371J18188K09594R3840
16789A1858059P19344M64539P9496M26135N0699O52796N72778L31927J94697K85676
16779A5636146O46535M62986P75309M05116M80421N45437M94533O34034N78152
16770B0658669M49677J335095O87595M29485R08902R42537Q41763R60887J054724
$$ plain form
16761 28269334 29501099 30643168 31792465 33079065 34334112 35782732 36907541 38580364
16753 38580364 40141252 42208638 44102126 46018420 48106577 50421111 52637907 54701825
16745 54701825 58015090 60465233 63316696 66665478 69753496 73401631 77204191 80997878
16737 80997878 85082970 89989860 94484363 98899805 104261880 109271616 115025425 120545145
16729 120545145 126353182 132120701 137776124 143644762 149078106 154741210 159724333 164417512
16721 164417512 168404305 171453978 174141389 175748325 176591904 176886121 176122953 174173632
16713 174173632 171602812 167781884 163362877 159069809 154035995 148110826 142448145 136659473
16705 136659473 130642940 124667375 118639960 113005924 107236232 101775499 96394821 91867380
$$ packed form
16761B8269334J231765J142069J149297J286600J255047J448620J124809J672823
16753C8580364J560888K067386J893488J916294K088157K314534K216796K063918
16745E4701825L313265K450143K851463L348782L088018L648135L802560L793687
16737H0997878M085092M906890M494503M415442N362075N009736N753809N519720
16729A20545145N808037N767519N655423N868638N433344N663104M983123M693179
16721A64417512L986793L049673K687411J606936Q43579K94217p63168j949321
16713A74173632k570820l820928m419007m293068n033814n925169n662681n788672
16705A36659473o016533n975565o027415n634036n769692n460733n380678m527441
$$ plain form
16697 91867380 86625123 82159523 78221562 74399128 70149827 66757700 63025565 60436890
16689 60436890 57304942 54593980 52161489 49525990 47046504 44955715 42987064 41351022
16681 41351022 39152823 37707248 35708992 34470280 32961353 31402799 29906107 29282751
16673 29282751 28103498 26851068 25980562 25117388 24028458 23485178 22425942 21614821 20911970
16664 20911970 20327698 19447417 19040435 18251523 18027915 17019793 16566084 16000563 15612461
16655 15612461 15282487 14806700 13894987 13965119 13313072 12922006 12602376 12058755 12067012 11686298
16645 11686298 11038850 11128130 10771789 10439044 10518884 9765294 9644461 9426015 9570238 9207731
16635 9207731 8814782 8706433 8506883 8210525 7979034 7746005 7657642 7796456 7202081 7034481
$$ packed form
16697I1867380n242257m465600l937961l822434m249301l392127l732135k588675
16689F0436890l131948k710962k432491k635499k479486k090789j968651j636042
16681D1351022k198199j445575j998256j238712j508927j558554j496692o23356
16673B9282751j179253j252430q70506q63174j088930n43280j059236q11121p02851
16664B0911970n84272q80281m06982p88912k23608j008122m53709n65521l88102
16655A5612461l29974m75787r11713P0132o52047l91066l19630n43621Q257l80714
16645A1686298o47448Q9280l56341l32745P9840p53590j20833k18446J44223l62507
16635I207731l92949j08349j99550k96358k31491k33029q8363J38814n94375j67600
$$ plain form
16625 7034481 7360764 6880414 6506447 6347005 6560359 6196684 6189520 6050524 6299602 6333840
16615 6333840 5605812 5610472 5768938 5321667 5848854 5110109 4935320 5159344 4916890 5101110
16605 5101110 4843378 4637610 4570607 4892187 4853626 4134258 4494443 4110752 4301558 4190715
16595 4190715 3969448 3953045 4059770 3754580 3621599 3875747 3690214 3877153 3504155 3405200
16585 3405200 3463931 3191031 3486806 3584421 3233542 3404209 3077409 3110934 3100067 2795737
16575 2795737 2599637 2926703 2924768 2782946 2543035 2824679 2393159 2492087 2723323 2659371
16565 2659371 2456517 2695050 2588243 2629182 2486875 2326655 2147518 2212597 2284641 2080676
16555 2080676 2277825 2224360 1939978 2076225 2021621 1892382 2267232 1977043 2071900 1888503
$$ packed form
16625G034481L26283m80350l73967j59442K13354l63675p164j38996K49078L4238
16615F333840p28028M660J58466m47271N27187p38745j74789K24024k42454J84220
16605E101110k57732k05768o7003L21580l8561p19368L60185l83691J90806j10843
16595D190715k21267j6403J06725l05190j32981K54148j85533J86939l72998r8955
16585C405200N8731k72900K95775R7615l50879J70667l26800L3525j0867l04330
16575B795737j96100L27066j935j41822k39911K81644m31520R8928K31236o3952
16565B659371k02854K38533j06807M0939j42307j60220j79137O5079P2044k03965
16555B080676J97149n3465k84382J36247n4604j29239L74850k90189R4857j83397
$$ plain form
16545 1888503 1866007 1748946 1783354 1901797 1682710 1628061 1760210 1536074 2054130 1708280
16535 1708280 1261768 1841749 1959119 1921373 1675920 1254796 1902999 1368299 1480446 1588946
16525 1588946 1172515 1410346 1792237 1536990 1485635 1245314 1581766 1492169 1371118 1566922
16515 1566922 1235780 1356213 1246304 1438782 1286047 1122833 1241868 1009631 1324459
16506 1324459 1336459 1338586 956494 1305117 1229840 1362402 1194844 1093478 1110463 1555264
16496 1555264 1095653 881195 1094914 1118649 1271552 1264180 1425342 1138169 1023030 886969
16486 886969 812406 970393 1203878 1114019 1214087 775183 1072473 1257791 689771 1096102
16476 1096102 1052217 1193918 611345 970536 1094857 753187 1039151 758501 709077 853415
$$ packed form
16545A888503k2496j17061L4408J18443k19087n4649J32149k24136N18056l45850
16535A708280m46512N79981J17370l7746k45453m21124O48203n34700J12147J08500
16525A588946m16431K37831L81891k55247n1355k40321L36452q9597j21051J95804
16515A566922l31142J20433j09909J92478j52735j63214J19035k32237L14828
16506A324459J2000K127l82092L48623p5277J32562j67558j01366J6985M44801
16496A555264m59611k14458K13719K3735J52903p372J61162k87173j15139j36061
16486H86969p4563J57987K33485q9859J00068m38904K97290J85318n68020M06331
16476A096102m3885J41701n82573L59191J24321l41670K85964k80650m9424J44338
$$ plain form
16466 853415 742451 947435 863349 776788 459311 1038864 749125 686403 756355 536054
16456 536054 879370 762701 927909 981141 829056 724426 733607 745289 728689 918731
16446 918731 702502 619002 860812 893593 767199 825834 831298 696160 803635 633350
16436 633350 941158 790241 878237 494993 716352 717283 482798 734723 530118 673227
16426 673227 340179 685012 756152 527217 413300 512469 471392 433101 638968 589562
16416 589562 601291 787292 617681 764578 968418 565364 319659 598392 576253 313668
16406 313668 444378 380709 365405 418679 323018 588329 262236 707668 230726 395176
16396 395176 669846 532986 709037 608535 199400 409828 520686 306509 398717 676691
$$ packed form
16466H53415j10964K04984q4086q6561l17477N79553k89739o2722O9952k20301
16456E36054L43316j16669J65208N3232j52085j04630R181J1682j6600J90042
16446I18731k16229q3500K41810L2781j26394N8635N464j35138J07475j70285
16436F33350L07808j50917Q7996l83244K21359R31k34485K51925k04605J43109
16426F73227l33048L44833P1140k28935j13917R9169m1077l8291K05867m9406
16416E89562J1729J86001j69611J46897K03840m03054k45705K78733k2139k62585
16406C13668J30710o3669j5304N3274r5661K65311B62236M45432B30726J64450
16396C95176K74670j36860J76051j00502A99400K10428J10858k14177R2208K77974
$$ plain form
16386 676691 374155 402649 385656 225457 386307 198075 446445 303368 422947 463388
16376 463388 434821 311071 427732 238534 383411 525214 520996 161972 327180 749609
16366 749609 381490 474322 457118 291182 298875 517941 360033 267096 199625 287468 389245
16355 389245 143665 24710 41483 286622 -31079 90324 361300 9014 475950 235396 255820
16344 255820 277134 673402 43276 403006 127186 621060 110227 216189 58339 141684
16334 141684 212842 250348 43331 563232 222327 294847 495381 371872 370491 184960 212996
16323 212996 180122 535233 90722 282156 236631 12089 541696 117193 440426 221131
16313 221131 475595 369214 384969 195594 415277 175800 276932 100588 -55112 -139254
$$ packed form
16386F76691l02536K8494j6993j60199J60850j88232K48370j43077J19579M0441
16376D63388k8567j23750J16661j89198J44877J41803m218A61972J65208M22429
16366G49609l68119R2832j7204j65936P693K19066j57908r2937o7471Q7843J01777
16355C89245A43665B4710J6773K45139c1079I0324K70976I014M66936B35396K0424
16344B55820K1314L96268D3276L59730A27186M93874A10227J05962E8339Q3345
16334A41684P1158L7506D3331N19901B22327P2520K00534j23509j381A84960K8036
16323B12996l2874L55111I0722J91434m5525A2089N29607A17193L23233k19295
16313B21131K54464j06381J5755j89375K19683A75800J01132A00588e5112q4142
$$ plain form
16303 -139254 418984 357251 565853 -342073 -106672 65515 517638 247470 169478 57161
16292 28137 349597 112091 30934 128938 172262 104419 43673 241962 570275 415225 196843
16280 275709 122448 195011 273240 512044 220521 305349 218105 453208 -54016 160565
16269 71964 171469 94203 -47878 394189 108923 556269 154462 47463 231438 186059 147033
16258 147033 223125 -45698 320312 178076 191947 194388 280994 42501 387411 169109 39174
16246 25162 341858 60888 368045 6831 -3339 -116113 439748 -2983 96572 374229 13872
16234 342473 -77401 -231910 355652 10152 149116 -80244 315101 -113459 -64173 415739
16223 204774 509875 301811 204139 154986 84365 392398 10568 -217683 253591 319514
$$ packed form
16303a39254D18984o1733K08602c42073a06672F5515M52123B47470p7992E7161
16292B8137L21460A12091C0934R8004M3324o7843D3673J98289L28313j55050A96843
16280B75709A22448P2563P8229K38804B20521Q4828q7244K35103e4016A60565
16269G1964R9505p7266d7878C94189A08923M47346A54462D7463J83975m5379l9026
16258A47033P6092d5698C20312j42236J3871K441Q6606D2501L44910A69109C9174
16246B5162L16696F0888L07157F831c339j12774D39748b983I6572K77657A3872
16234C42473g7401j54509C55652A0152J38964h0244C15101a13459M9286D15739
16223B04774L05101k08064r7672m9153p0621L08033A0568b17683B53591O5923
$$ plain form
16213 319514 -42198 49733 63891 291546 388976 -28179 39615 -43757 229948 105575 23911
16201 303088 298026 349357 511048 14290 268853 -13879 154510 -61673 182521 209192 -157726
16189 176753 4298 367301 -139151 -114200 377239 22419 -54077 263626 467006 -132552
16178 363480 -94285 70697 130325 101609 180992 315087 315909 -92396 -76626 25758 158362
16167 158362 93776 -99240 -20626 140890 31481 -40966 165244 62586 -8175 -129495 17943
16155 -169233 -28021 110206 4783 -6542 -158004 152643 198360 -158144 105719 65956 -88498
16143 -54576 -63169 162687 -121405 172752 199048 47509 78274 -7349 -155217 216120 -155205
16131 62881 -339060 -70171 -19407 505707 250207 373524 235214 -75910 18338 -1808 69580
$$ packed form
16213C19514d2198D9733J4158K27655R7430b8179C9615d3757B29948A05575B3911
16201C03088n062N1331J61691A4290K54563a3879A54510f1673A82521K6671a57726
16189A76753D298L63003a39151K4951C77239B2419e4077B63626K03380a32552
16178C63480i4285G0697N9628k8716P9383J34095Q22i2396J5770B5758J32604
16167A58362o4586i9240b0626A40890C1481d0966A65244F2586h175j21320A7943
16155a69233b8021A10206D783f542j51462A52643M5717a58144A05719l9763h8498
16143e4576q593A62687a21405A72752K6296D7509L0765g349j47868B16120a55205
16131F2881c39060g0171a9407E05707B50207J23317j38310g5910A8338a808F9580
$$ plain form
16119 -33889 -20867 128718 20840 121201 277730 201685 4327 28103 237421 20467 -216540
16107 439039 -88230 188968 166785 25933 -185805 -4750 -158982 -73784 275591 -25107 261189
16095 -124481 118123 -116497 -227629 -19996 208567 -146019 217888 -111169 56718 158790
16085 158790 -166243 300372 -123983 148947 -2472 181736 -16656 -82351 -7670 -159069 114032
16073 180867 -224465 -174397 -99725 275161 189687 159703 -98722 49161 -202751 -359751 94377
16061 -422739 -126807 141783 -172336 -35614 -165783 -219548 -236967 19967 37590 72780 127592
16050 127592 130770 96388 37436 -129237 41743 -65240 71969 59448 77433 -98940 46855
16038 185794 127805 115734 -8933 245919 38952 247039 -128803 -84677 -309320 14235 136272
$$ packed form
16119c3889J3022A28718B0840J00361J56529p6045D327K3776K09318B0467b16540
16107D39039h8230A88968k2183B5933a85805d750j54232g3784B75591b5107B61189
16095a24481A18123a16497j11132a9996B08567a46019B17888a11169E6718J02072
16085A58790a66243C00372a23983A48947b472A81736a6656o5695g670j51399A14032
16073A80867b24465N0068P4672B75161q5474k9984i8722D9161b02751j57000I4377
16061d22739a26807A41783a72336c5614j30169n3765j7419A9967J7623L5190N4812
16050A27592L178l4382C7436a29237D1743f5240G1969j2521J7985i8940D6855
16038A85794n7989j2071h933B45919C8952K08087a28803M4126k24643A4235J22037
$$ plain form
16027 136272 -27803 72952 -115064 133769 -37987 -120005 180511 43901 10275 -185314 -106679
16016 -106679 -61498 -266769 351444 -5728 -158229 -188454 136788 -126494 1440 -126402 133049
16004 -177001 -208084 -86776 -67025 216276 -68332 -36179 -99770 132870 46738 122494 157746
15993 157746 -4769 70469 -49860 271409 148293 86887 387903 -209523 557123 80815 205256
15982 205256 422095 222810 123076 -205178 26627 398375 53579 198555 329700 -300312
15971 -283682 267440 17303 -319407 108127 77795 -111558 6109 62631 -40635 38814 -98689
15959 139282 378105 -130955 -202169 81663 143458 -96888 169443 136319 154755 115152 -141220
15947 19438 183318 15191 -197131 -23462 90145 -398912 57765 126468 -195833 -255204 -100475
$$ packed form
16027A36272b7803G2952a15064A33769c7987q2018A80511D3901A0275a85314P8635
16016a06679M5181k05271C51444e728j52501l0225A36788a26494A440a26402A33049
16004a77001l1083h6776J9751B16276f8332L2153o3591A32870D6738P5756L5252
15993A57746d769G0469d9860B71409j23116o1406L01016b09523E57123H0815J24441
15982B05256K16839j99285r9734b05178B6627L71748E3579J44976J31145c00312
15971b83682B67440A7303c19407A08127l0332a11558F109N6522d0635C8814i8689
15959A39282K38823a30955p1214H1663O1795i6888A69443l3124J8436l9603a41220
15947A9438J63880A5191a97131b3462I0145c98912E7765O8703a95833n9371a00475
$$ plain form
15935 -226850 -85301 -344709 -103745 -72933 -386763 -102637 -12722 -176456 -239731 3675 -56447
15923 -72364 -33997 76584 -21160 32141 11904 -186878 227054 -205373 -137943 -314986 5695
15911 -59889 163221 -107905 319237 72891 -132770 -85135 327820 184628 -144471 209763
15900 4138 268148 269845 -38874 66648 31358 118907 243117 53286 -89602 -332897 -108939
15888 -14391 16776 -163301 -51194 -186067 204191 -245339 33027 -212897 -183767 174379
15877 -73746 -131544 261687 12689 308167 24315 -184572 20648 -2048 114508 32446 -17229
15865 20775 -155878 -285419 24512 -137678 -98986 -203339 255997 -12873 -56345 175720
15854 90532 -145987 40063 -213395 -27485 -266112 190567 -16408 -54138 -104870 20810 164025
$$ packed form
15935b26850h5301k59408a03745L0812l13830a02637a2722j63734o3275C675e6447
15923g2364c3997G6584b1160C2141A1904a86878B27054b05373O7430j77043E695
15911e9889A63221a07905C19237G2891a32770M7635C27820j43192a44471B09763
15900D138K64010J697c8874F6648C1358Q7549J24210E3286h9602k43295a08939
15888a4391A6776a63301e1194j34873B04191b45339C3027b12897K9130A74379
15877g3746n7798B61687A2689K95478B4315a84572B0648b048A14508C2446a7229
15865B0775a55878j29541B4512a37678L8692j04353B55997a2873m3472A75720
15854I0532a45987D0063b13395b7485k38627A90567a6408l7730n0732B0810J43215
$$ plain form
15843 164025 44584 -20356 20992 -163157 -49300 460285 -149935 9936 168547 85373 34615
15831 239822 -168427 312848 -159243 -312467 -55954 -61749 -165180 -135283 -51617 -17247 -55094
15820 -55094 107459 -236640 -50661 -30199 -389496 -144107 -315127 326477 -2900 -209429
15810 -209429 296468 -279597 -92585 50406 -143585 -92869 -283630 -28300 141423 -144917
15799 -135269 334831 7885 -248310 31532 -115328 -103051 -29676 -236006 239505 136156
15789 136156 -200540 -65326 -139719 124200 -58855 365237 -112710 142370 -507546 -35372
15778 -159914 -3694 128914 -151363 -70337 257958 8165 295156 -321982 29670 9132 -219120
15766 -168457 -33033 76 -4893 -75866 -88236 -304075 343152 92110 359844 17475 -24300 -20550
$$ packed form
15843A64025D4584b0356B0992a63157d9300D60285a49935I936J58611q3174C4615
15831B39822a68427C12848a59243j53224e5954n795j03431K9897e1617a7247l7847
15820e5094A07459b36640e0661K0462l59297a44107j71020C26477b900k06529
15810b09429B96468b79597i2585E0406a43585N0716j90761b8300A41423a44917
15799a35269C34831G885b48310C1532a15328J2277b9676k06330B39505j03349
15789A36156b00540f5326p4393A24200e8855C65237a12710A42370e07546c5372
15778a59914c694A28914a51363g0337B57958H165K86991c21982B9670I132b19120
15766a68457c3033G6d893p0973j2370k15839C43152I2110K67734A7475b4300L750
$$ plain form
15754 -20550 -207607 149615 -159851 -212271 -281204 45515 199701 63763 74285 -186466 -143941
15743 -143941 -186348 84231 408805 -117170 -101852 154326 -31707 97594 124133 -13536 78668
15731 -57561 -475529 150026 95131 -281337 257294 -205050 155968 57302 -209302 28845
15720 48934 161345 -247176 28788 -171096 -198031 -177840 -151723 63915 -82023 21229 449191
15709 449191 -48518 -195305 66089 -218979 -182118 40168 361171 -366147 -195009 -93347
15698 152690 -140407 -1045 -67076 -100482 -29485 198209 -181892 443985 120015 -4317 185913
15686 33767 -118757 161346 -149065 42609 -182260 29561 -82546 -180235 -21051 47069 -37688
15674 -32647 -146876 -23156 -140791 310761 -131371 -299667 88222 1518 11525 -343653 -293542
$$ packed form
15754b0550j87057A49615a59851n2420o8933D5515J54186F3763J0522a86466M2525
15743a43941m2407H4231L24574a17170J5318A54326c1707I7594K6539a3536G8668
15731e7561m17968A50026n4895b81337B57294b05050A55968E7302b09302B8845
15720D8934J12411b47176B8788a71096k6935K0191K6117F3915h2023B1229M27962
15709D49191d8518j46787F6089b18979L6861D0168L21003c66147J71138i3347
15698A52690a40407a045o6031l3406b9485A98209a81892D43985A20015d317A85913
15686C3767a18757A61346a49065D2609a82260B9561h2546r7689b1051D7069c7688
15674c2647j14229b3156j17635C10761a31371j68296H8222A518J0007c43653N0111
$$ plain form
15663 -293542 -11741 -182493 75184 -105059 141641 13658 113104 52028 -200569 251890
15652 226906 183216 -22597 -31431 -60764 71253 -6246 -78950 109558 -90160 -173312 -99296 -137600
15640 -137600 16467 245435 -120698 -24974 -66093 -102431 -136206 -149140 212449 130303 119323
15629 119323 96594 -164991 88424 181948 -160140 276370 5457 8767 -428916 175144 73807
15617 38740 -95306 -77099 -43595 -89969 28678 101603 -225826 76464 40500 -55875 167074
15605 -65559 -141691 44111 233359 -119703 139081 -344223 -189383 -145561 -90840 78747 -69035
15593 16772 157234 249460 93212 -181556 173118 191396 -248501 149204 75025 -123921
15582 265048 70445 -244601 53837 -649 37281 19181 -20101 75623 -309249 -26186 106014
$$ packed form
15663b93542a1741j70752G5184a05059A41641A3658R9446E2028b00569B51890
15652B26906m3690b2597q834k9333G1253f246p2704A09558i0160q3152P4016l8304
15640a37600A6467K28968a20698b4974m1119l6338l3775j2934B12449q2146j0980
15629A19323k2729a64991H8424R3524a60140B76370E457L310d28916A75144G3807
15617C8740i5306J8207L3504m6374B8678P2925b25826G6464l5964e5875A67074
15605f5559p6132D4111J89248a19703A39081c44223J54840M3822N4721G8747f9035
15593A6772J40462R2226I3212a81556A73118J8278b48501A49204p4179a23921
15582B65048G0445b44601E3837f49C7281j8100b0101G5623c09249b6186A06014
$$ plain form
15570 -149430 -80438 -278886 -90517 267772 150961 234523 -44407 -34153 -144682 86639 -95795
15558 164754 -82791 -83300 -150355 324743 -54511 -49092 -112382 -130284 -12785 -148593 -146636 -13462
15545 137261 101320 107690 93784 -9571 181325 -202056 145368 -164229 21591 -116029 -87845
15534 -87845 -202693 -184059 94109 76488 -121480 -221008 58046 -128365 404678 30115 -46018
15522 -208703 70057 -198881 -155551 -51780 147653 -255076 -4244 -92574 227123 304377 272949
15511 272949 -306929 43243 206930 217713 -174730 -73110 -162127 394054 -33387 1996 19878
15500 19878 60895 -141222 -58705 131215 6809 -8177 69368 338201 -33479 -120396 189613
15488 16857 99383 178622 -40504 115855 -182862 34266 -86550 202187 222775 74157 105569
$$ packed form
15570a49430O8992j98448i0517B67772j16811Q3562d4407J0254j10529H6639i5795
15558A64754h2791n09o7055C24743e4511N419o3290j7902a2785j35808J957a3462
15545A37261l5941O370j3906i571A81325b02056A45368a64229B1591a16029K8184
15534h7845j14848J8634I4109j7621a21480r9528E8046a28365D04678C0115d6018
15522b08703G0057a98881M3330e1780A47653b55076d244q8330B27123P7254l1428
15511B72949c06929D3243J63687J0783a74730g3110q9017C94054c3387A996J7882
15500A9878M1017a41222e8705A31215F809h177F9368K68833c3479q6917A89613
15488A6857Q2526P9239d0504A15855a82862C4266h6550B02187K0588G4157L1412
$$ plain form
15477 105569 -96004 -232847 -4297 -191900 103455 -65295 283633 -55577 -120854 -83956 20396
15465 -133369 488928 106679 62875 -43538 50678 276821 -238115 47475 -16324 69894 196286
15454 196286 -154130 6821 105755 -383659 107303 -140388 206421 -396243 -306383 228007
15443 -294629 -15301 128340 68241 83198 -19690 24357 37525 90729 -257635 108069 105173
15432 105173 -236466 -153893 22112 131660 156419 161969 273333 -20011 -88011 82038 -151202
15420 -206979 -136833 -150288 145087 21426 -5435 -11832 -142488 85865 183591 172368 -175800
15408 121414 -118596 -137522 -16785 96161 -47583 472286 -265931 132203 29926 -117340
15397 -87233 -103538 -150627 -174851 -110204 89490 -247311 -304622 23405 -126907 -48738 224950
$$ packed form
15477A05569i6004j36843d297j87603A03455f5295B83633e5577o5277L6898B0396
15465a33369D88928A06679m3804d3538E0678K26143b38115D7475a6324F9894J26392
15454A96286a54130F821R8934c83659A07303a40388B06421c96243Q9860B28007
15443b94629a5301A28340o0099J4957a9690B4357J3168N3204b57635A08069k896
15432A05173b36466Q2573B2112J09548K4759N550J11364b0011o8000H2038a51202
15420b06979P0146j3455A45087B1426e435o397j30656H5865R7726j1223a75800
15408A21414a18596j8926a6785I6161d7583D72286b65931A32203B9926a17340
15397h7233j6305m7089k4224O4647H9490b47311n7311B3405a26907d8738B24950
$$ plain form
15385 185765 -88874 336605 17157 -155040 -95141 -83606 323995 -382171 234719 -33906
15374 64781 325142 -1372 195251 -201967 -110877 -220117 47452 96959 36068 -100219 -169650
15363 -169650 -95152 99687 88754 -128286 -293600 302327 -103299 -103316 -200205 -49531 -46067
15352 -46067 -82353 38702 190875 150693 -56001 -187456 -364282 -448503 -177045 144046 30495
15340 45316 246381 187058 140946 -177453 108416 144385 365658 110527 -47741 -48401 74939
15328 36509 235396 -43744 175744 -73056 -70404 166807 424400 28604 356076 -416730 212513
15316 108953 -173375 152620 148948 -296383 -218338 17096 99358 7430 102911 -20655 312666
15304 63982 17075 182610 112205 41367 28230 -224149 -76426 38180 43802 -151966 36689
$$ packed form
15385A85765h8874C36605A7157a55040N9899J1535C23995c82171B34719c3906
15374F4781K60361a372A95251b01967R1090j09240D7452M9507C6068a00219o9431
15363a69650P4498I9687j0933a28286j65314C02327a03299j7r6889d9531L464
15352d6067l6286C8702J52173m0182e6001j31455j76826q4221a77045A44046C0495
15340D5316K01065n9323m6112a77453A08416L5969K21273A10527d7741o60G4939
15328C6509J98887d3744A75744g3056K652A66807K57593B8604L27472d16730B12513
15316A08953a73375A52620l672b96383P8045A7096Q2262G430R5481b0655C12666
15304F3982A7075J65535p0405D1367j3137b24149g6426C8180N622a51966C6689
$$ plain form
15292 -143792 -2551 137834 6092 164027 3241 -177561 185816 -156882 120250 45799 -27736
15280 340366 -100715 79998 -94584 55536 112587 312183 88972 15327 57096 189441 -95865
15268 70012 46686 -214150 264621 19139 190859 158903 54036 -17085 78246 157767 113670
15257 113670 100542 230725 -61212 285427 344023 143587 425274 799573 1318280 1545670
15247 1545670 1069457 1582597 646500 -21789 148231 327420 -335 89777 -232464 36517
15236 -86308 -72676 156393 30026 9249 145266 172898 389617 141794 222535 122143 -80361
15224 208108 34146 10130 -224316 100125 -221131 23756 -42620 81196 -340867 152568
15213 -280213 183658 151540 320078 303617 -7830 -154387 -27142 95571 169375 43599 232957
$$ packed form
15292a43792b551A37834F092J57935C241a77561A85816a56882A20250D5799b7736
15280C40366a00715G9998i4584E5536N7051J99596H8972A5327M1769J32345i5865
15268G0012k3326b14150B64621A9139J71720l1956E4036a7085G8246P9521m4097
15257A13670j3128J30183f1212B85427N8596A43587K81687L74299N18707K27390
15247A545670m76213N13140F46500b1789A48231J79189c35H9777b32464C6517
15236h6308J3632A56393C0026I249J36017K7632K16719A41794Q0741j00392h0361
15224B08108C4146A0130b24316A00125b21131B3756d2620H1196c40867A52568
15213b80213A83658l2118J68538j6461g830j46557b7142I5571P3804D3599J89358
$$ plain form
15202 232957 167936 -167768 -303835 385787 -30627 200014 178149 -121846 29829 -117577
15191 -52284 -14919 266620 -95474 305643 270199 -4709 148948 74494 -263600 269066 237824
15180 237824 -82771 103059 -73144 226014 93009 269911 101788 -49083 287679 30282
15169 -129197 6904 -4546 99377 -37631 240793 260996 105397 -95178 148175 189280 25813
15157 -68922 -42788 -139524 -139110 23519 271517 111979 -140566 263029 -196672 107506 -23088
15145 -51724 60823 -73412 -112532 54896 -144212 -80768 2250 239971 403306 427743 176880
15133 68732 176455 103224 138721 -94572 174061 416672 213953 154242 131448 127483 578665
15122 578665 348925 -115504 -204346 -34134 -347539 23869 29399 435554 -187314 -109702 -217900
$$ packed form
15202B32957o5021a67768j36067C85787c0627B00014k1865a21846B9829a17577
15191e2284a4919B66620i5474C05643l5444d709A48948p4454b63600B69066l1242
15180B37824h2771A03059g3144B26014I3009J76902A01788d9083B87679C0282
15169a29197F904d546I9377c7631B40793K0203A05397i5178A48175M1105B5813
15157f8922K6134r6736M14B3519K47998A11979a40566B63029a96672A07506b3088
15145e1724F0823g3412l9120E4896a44212O3444B250K37721J63335K4437A76880
15133F8732J07723p3231L5497i4572A74061K42611k02719n9711k2794l965M51182
15122E78665k29740a15504q8842c4134l13405B3869N530M06155a87314P7612j08198
$$ plain form
15111 -217900 150797 125955 304009 -101207 123625 79682 -183031 60657 418695 -112765
15100 207176 236138 165023 428936 -303905 -41338 -25265 225741 -20072 7773 159108 186360
15089 186360 290652 481235 585782 114315 205937 175431 170568 262949 380684 -110174
15078 301466 258477 33275 158871 445937 226366 581041 -87098 260141 272885 67816
15067 147977 31948 157033 19324 134133 317746 401537 127842 69597 178765 167453
15057 167453 196169 -38850 131808 45208 -117027 469466 9132 77327 72219 -118070 129395
15045 521553 275923 358456 40115 499162 139750 187391 125133 253848 374199 256006
15035 256006 88797 418754 174572 65505 27213 -42195 459275 284764 244592 374295
$$ packed form
15111b17900A50797k4842J78054a01207A23625m3943a83031F0657L58038a12765
15100B07176K8962p1115K63913c03905d1338J6073B25741b0072G773J51335K7252
15089A86360J04292J90583J04547A14315R1622l0506m863R2381J17735a10174
15078C01466m2989C3275J25596K87066k19571L54675h7098B60141J2744F7816
15067A47977C1948J25085A9324J14809J83613Q3791A27842n8245J09168j1312
15057A67453K8716c8850A31808D5208a17027D69466I132O8195n108a18070A29395
15045E21553k45630Q2533D0115M59047A39750M7641o2258J28715J20351j18193
15035B56006H8797L29957A74572F5505B7213d2195D59275j74511m0172J29703
$$ plain form
15025 374295 213903 177599 242719 145793 200919 -120556 -142144 232071 405141 196427
15014 362650 496899 238541 136035 332731 146906 37828 232379 245312 146016 -12710
15003 427243 509726 121522 223776 669246 358549 244647 95894 351221 29590 185508
14993 185508 165637 168692 133255 145122 49859 273113 422678 266511 261994 80584 260858
14982 260858 253068 507361 28694 418008 90535 201436 185481 121491 284271 49092 269811
14971 269811 292362 260673 58081 245758 -235568 359876 113859 205015 257966 182162 485082
14960 485082 468547 148524 335788 286010 311605 632373 59458 50689 290642 388817 345595
14949 345595 299067 427841 377602 480296 49824 179499 321162 481036 433657 503674
$$ packed form
15025C74295j60392l6304O5120r6926N5126a20556k1588B32071J73070A96427
15014C62650J34249B38541j02506J96696A46906C7828J94551J2933r9296a2710
15003D27243Q2483A21522J02254M45470l10697j13902I5894K55327B9590J55918
14993A85508j9871L055l5437J1867D9859K23254J49565j56167m517H0584J80274
14982B60858p790K54293B8694L89314I0535J10901j5955o3990J62780D9092K20719
14971B69811K2551l1689E8081J87677b35568C59876A13859R1156N2951p5804L02920
14960D85082j6535A48524J87264m9778K5595L20768E9458q769K39953R8175m3222
14949C45595m6528J28774n0239J02694D9824J29675J41663J59874m7379P0017
$$ plain form
14939 503674 423442 475664 431912 294397 158532 125836 110067 335307 155751 155158 356806
14928 356806 309485 624287 127014 364894 448303 189570 298584 449509 304648 252116
14918 252116 536611 232015 539029 86762 518039 26020 375900 482734 390787 756387
14908 756387 317235 393063 390197 368896 311317 284661 247823 237685 274038 157709 136328
14897 136328 458350 411415 718205 361450 319504 606623 359338 217982 255273 243600
14887 243600 262173 751885 188550 80572 411286 452047 476979 290856 264054 384489
14877 384489 574303 559150 188505 318031 -26832 212424 79695 235468 533096 337317
14867 337317 110594 323134 478939 308619 436389 367372 466789 423754 172861 446000
$$ packed form
14939E03674q0232N2222m3752j37515j35865l2696j5769K25240A55751n93K01648
14928C56806m7321L14802A27014K37880Q3409A89570J09014J50925j44861n2532
14918B52116K84495B32015L07014H6762M31277B6020L49880J06834r1947L65600
14908G56387C17235P5828k866k1301n7579k6656l6838j0138L6353j16329k1381
14897A36328L22022m6935L06790l56755m1946K87119k47285j41356L7291j1673
14887B43600J8573M89712A88550H0572L30714M0761K4932j86123k6802J20435
14877C84489J89814j5153A88505J29526b6832B12424G9695J55773K97628j95779
14867C37317A10594K12540J55805j70320J27770o9017R9417m3035A72861K73139
$$ plain form
14857 446000 89014 263429 626880 304087 563376 425723 737672 312273 562948 351690
14847 351690 245768 668075 616859 448772 202641 177565 390745 517719 458211 678935
14837 678935 405068 460088 206709 453828 425045 400331 481668 437254 336756 611186
14827 611186 216339 858254 391326 204205 600466 422103 732481 568596 529599 401681
14817 401681 59127 517131 589688 486027 626261 462456 833157 575186 653150 701588
14807 701588 577234 734758 425926 233389 297538 708861 759634 299545 724211 324249
14796 597479 887821 613671 496658 630714 485708 534498 344092 610864 953233 616388
14786 616388 586375 830651 573367 541883 770811 722896 663145 300014 406325 686410
$$ packed form
14857D46000H9014J74415L63451C04087K59289j37653L11949C12273K50675k11258
14847C51690j05922M22307n1216j68087B02641k5076K13180J26974n9508K20724
14837F78935k73867N5020B06709K47119k8783k4714Q1337m4414j00498K74430
14827F11186B16339O41915C91326j87121L96261j78363L10378j63885l8997j27918
14817D01681E9127M58004P2557j03661J40234j63805L70701k57971P7964M8438
14807G01588j24354J57524l08832j92537O4149M11323N0773B99545M24666C24249
14796E97479K90342k74150j17013J34056j45006M8790j90406K66772L42369l36845
14786F16388l0013K44276k57284l1484K28928m7915n9751C00014J06311K80085
$$ plain form
14776 686410 558932 617459 795905 278196 756219 894662 309819 645690 674557 283138
14765 540106 664422 824117 521375 562069 776161 711095 754727 607862 595983 737898
14755 737898 821302 715346 498750 746848 496958 668646 698820 718916 790467 546844
14745 546844 795082 609100 734275 561648 699144 821883 1031258 718248 646675 842421
14735 842421 701999 713171 660791 521528 612644 772468 738154 897441 712594 843438
14725 843438 477269 699477 899464 981384 813681 590720 1069048 1065602 526748 1099914
14715 1099914 690746 895467 1044423 722572 818549 754364 1033946 832978 853396 581288
14705 581288 537977 848379 1223380 785216 872906 1238988 938270 740141 1189712 945247
$$ packed form
14776F86410j27478N8527J78446B78196M78023J38443C09819L35871K8867B83138
14765E40106J24316J59695l02742M0694K14092o5066M3632j46865j1879J41915
14755G37898Q3404j05956k16596K48098k49890J71688L0174K0096P1551k43623
14745E46844K48238j85982J25175j72627J37496J22739K09375l13010p1573J95746
14735H42421j40422J1172n2380j39263R1116J59824l4314J59287j84847J30844
14725H43438l66169K22208J99987Q1920j67703k22961M78328l446E26748N73166
14715A099914m09168K04721J48956l21851R5977o4185K79582k00968K0418k72108
14705E81288m3311L10402L75001m38164Q7690L66082l00718j98129M49571k44465
$$ plain form
14695 945247 805075 1193906 1139321 829297 846000 943979 1123031 895568 768119 883522
14685 883522 1046311 1055386 814487 1172457 1025774 917547 1049982 928317 732556 1267460
14675 1267460 1050486 704806 1148157 1280170 1353721 886681 974099 1455294 999752 1021970
14665 1021970 1235048 1046451 932898 1589919 1333645 1414670 953862 1359841 1340938 1058195
14655 1058195 1195264 1054506 1294198 1365961 1393815 1402457 1238787 1381873 1277449 1253757
14645 1253757 1124652 1047056 1136694 1000892 1189390 1129907 871720 1461486 1397339 1269269
14635 1269269 1473083 1484748 1495370 1246993 1391740 1402187 1519963 1243132 835644 1319092
14625 1319092 1359262 1400399 1253698 1780515 1369015 1788863 1469750 1494292 1104813 1608451
$$ packed form
14695I45247j40172L88831n4585l10024J6703R7979J79052k27463j27449J15403
14685H83522J62789R075k40899L57970j46683j08227J32435j21665j95761N34904
14675A267460k16974l45680M43351J32013P3551m67040Q7418M81195m55542K2218
14665A021970K13078j88597j13553O57021k56274Q1025m60808M05979j8903k82743
14655A058195J37069j40758K39692P1763K7854Q642j63670J43086j04424k3692
14645A253757j29105p7596Q9638j35802J88498n9483k58187N89766o4147j28070
14635A269269K03814J1665J0622k48377J44747J0447J17776k76831m07488M83448
14625A319092M0170M1137j46701N26817m11500M19848l19113K4542l89479N03638
$$ plain form
14615 1608451 1754407 1866767 1478853 1379925 1871399 1340389 1873977 2122326 1632519 1542717
14605 1542717 1807617 1418575 1598111 1685147 1677369 1392235 2145348 1638041 2324460 1575520
14595 1575520 1768612 1540977 1826041 1985961 1955870 1746420 1962282 2148622 1914226 2049842
14585 2049842 1839810 1989080 2121687 2191111 1973998 2102990 2196041 2142343 2268513 2415781
14575 2415781 2226678 2493956 2456060 2582732 2361821 2347045 2349228 2468493 2676339 2442582
14565 2442582 2822894 2707226 2789850 2652503 3145893 2716879 3166649 3127478 3277741 3410374
14555 3410374 3562432 3710779 4260561 4710396 5001885 6448569 8252723 13409529 23716540
14546 23716540 44426065 44040754 19718979 7940271 4415256 2995526 2480019 2102007
$$ packed form
14615A608451J45956J12360l87914r8928M91474n31010N33588K48349m89807q9802
14605A542717K64900l89042J79536Q7036p778k85134P53113n07307O86419p48940
14595A575520J93092k27635K85064J59920l0091k09450K15862J86340k34396J35616
14585B049842k10032J49270J32607O9424k17113J28992R3051n3698J26170J47268
14575B415781j89103K67278l7896J26672k20911j4776K183J19265K07846k33757
14565B442582L80312j15668Q2624j37347M93390m29014M49770l9171J50263J32633
14555C410374J52058J48347N49782M49835K91489J446684J804154N156806J0307011
14546B3716540K0709525l85311A9718979G940271l525015j419730n15507l78012
$$ plain form
14538 2102007 2067908 2228065 1952361 2373935 2309644 2323421 2296666 2123018 2364012 2349292
14528 2349292 2203853 2131430 2310137 2313702 2659339 2607863 2416110 2411496 2741683 2948844
14518 2948844 2936814 2813709 2623762 2597421 2929681 3088916 2903357 3003636 2832045 3029664
14508 3029664 3306417 3263306 3441560 2948594 3099817 3477117 3113278 3360510 3484186 3607253
14498 3607253 3816419 3337145 3093748 3226522 3545196 3652127 3781507 3729268 3735954 3890953
14488 3890953 4165204 4002117 3901976 3820911 3987663 4071879 4096669 3613457 4457953 4169253
14478 4169253 4268552 4236425 4143436 4498414 4509047 4296802 4607973 4488369 4496193 5115994
14468 5115994 4692861 4679908 4614388 5091624 5071389 5027018 4922865 5401327 5551034 5059639
$$ packed form
14538B102007l4099J60157k75704M21574o4291J3777k6755j73648K40994j4720
14528B349292j45439p2423J78707L565L45637n1476j91753m614L30187K07161
14518B948844j2030j23105j89947k6341L32260J59235j85559J00279j71591J97619
14508C029664K76753m3111J78254m92966J51223L77300l63839K47232J23676J23067
14498C607253K09166m79274k43397J32774L18674J06931J29380n2239O686J54999
14488C890953K74251j63087j00141q1065J66752Q4216K4790m83212Q44496k88700
14478D169253R9299l2127r2989L54978J0633k12245L11171j19604P824O19801
14468E115994m23133j2953o5520M77236k0235m4371j04153M78462J49707m91395
$$ plain form
14458 5059639 5225985 5181749 5579261 5715758 5188101 5363197 5522696 5613157 5790750 5094766
14448 5094766 5723501 5777733 6338887 5772644 6180902 6185891 6349539 6284745 6531693 6562841
14438 6562841 6583226 6748382 6650820 6939005 7076339 6772983 6852876 7510429 7638928 7500774
14428 7500774 7622151 7710840 7714634 7918973 8353453 8306575 7937389 8375972 8572423 8594404
14418 8594404 8524390 8800161 8785335 9189256 9348195 9165815 9373108 9755639 9719436 9973454
14408 9973454 10128889 10109100 10371742 10195350 10572512 10813203 11067729 10908057 11159084 11261714
14398 11261714 11291431 11751368 12185257 11814135 12090621 12397691 12945632 12713308 13382589
14389 13382589 13590469 13704556 13652896 14089402 14287741 14776084 14931021 14892756 15298352 15745881
$$ packed form
14458E059639J66346m4236L97512J36497n27657J75096J59499R0461J77593o95984
14448E094766O28735N4232N61154n66243M08258M989J63648o4794K46948L1148
14438F562841K0385J65156r7562K88185J37334l03356P9893O57553J28499j38154
14428G500774J21377Q8689L794K04339M34480m6878l69186M38583J96451K1981
14418H594404p0014K75771j4826M03921J58939j82380K07293L82531l6203K54018
14408I973454J55435j9789K62642j76392L77162K40691K54526j59672K51027J02630
14398A1261714K9717M59937M33889l71122K76486L07070N47941k32324O69281
14389A3382589K07880J14087n1660M36506J98339M88343J54937l8265M05596M47529
$$ plain form
14379 15745881 15914858 16514881 16993692 17143846 17369254 18023522 18384838 18563221 18705946
14370 18705946 19067505 19555651 20026465 20488964 21066100 21643056 21938504 22251669 22741701
14361 22741701 23466461 24026561 24383550 24873225 25481525 25845221 26513587 27254153 27834520
14352 27834520 28475013 29206832 29876124 30826525 31274113 31958454 33057400 34038565 34765682
14343 34765682 35732527 36768826 37398115 38821306 39599761 40851282 42025972 43075566
14335 43075566 44734537 45583146 47145777 48495333 49872350 51441030 53205605 54749244
14327 54749244 56456082 58231658 60287726 62220571 64464993 66461762 68797208 71328301
14319 71328301 73839070 76714024 79218363 82060379 85592758 88532735 92289101 95665992
$$ packed form
14379A5745881J68977O00023M78811J50154K25408O54268L61316J78383J42725
14370A8705946L61559M88146M70814M62499N77136N76956K95448L13165M90032
14361B2741701P24760N60100L56989M89675O08300L63696O68366P40566N80367
14352B7834520O40493P31819O69292R50401M47588O84341J098946R81165P27117
14343C4765682R66845J036299O29289J423191P78455J251521J174690J049594
14335D3075566J658971Q48609J562631J349556J377017J568680J764575J543639
14327E4749244J706838J775576K056068J932845K244422J996769K335446K531093
14319G1328301K510769K874954K504339K842016L532379K939977L756366L376891
$$ plain form
14311 95665992 99855206 103509757 107943143 112325071 117086124 122355718 127449854 133256249
14303 133256249 139055396 145188374 152153086 158739456 166003083 173983944 182382798 190968495
14295 190968495 200489064 210199629 220607234 231353671 242625730 254710784 267505131
14288 267505131 280320952 294299737 308102342 322723733 337520878 352690563 368084357
14281 368084357 383231702 398214925 412646799 426709816 439650647 451667857 462110495
14274 462110495 470439177 475502653 476253139 475922755 473955427 473543528 469727710 464793519
14266 464793519 456420713 446212294 434271785 420580491 405675231 390565185 374473145
14259 374473145 358331261 342151081 325723284 310607984 296115822 281557960 267234069
$$ packed form
14311I5665992M189214L654551M433386M381928M761053N269594N094136N806395
14303A33256249N799147O132978O964712O586370P263627P980861Q398854Q585697
14295A90968495R520569R710565J0407605J0746437J1272059J2085054J2794347
14288B67505131J2815821J3978785J3802605J4621391J4797145J5169685J5393794
14281C68084357J5147345J4983223J4431874J4063017J2940831J2017210J0442638
14274D62110495Q328682N063476P50486l30384j967328m11899l815818m934191
14266D64793519q372806j0208419j1940509j3691294j4905260j5110046j6092040
14259C74473145j6141884j6180180j6427797j5115300j4492162j4557862j4323891
$$ plain form
14252 267234069 253993152 241202889 229008727 217734672 206961871 196609963 187239718
14245 187239718 178102727 169786715 161851662 154183683 146955333 140234414 133776957 128107736
14237 128107736 122847041 117351429 112242194 107272360 102881923 99059666 95492491 91556687
14229 91556687 87866876 84433086 81081488 78231532 75273935 72286205 69932215 67332455
14221 67332455 65146569 62984901 61131277 58937446 57014245 55099998 53390736 52138685
14213 52138685 50533434 48804853 47445347 45644446 44485670 43509586 42874169 41568396
14205 41568396 40251355 38641215 37840935 36635927 36130858 35485000 34211909 33298845 32169560
14196 32169560 31454547 30611879 30198016 29589647 28252673 27827719 26804524 26547453 25696842
$$ packed form
14252B67234069j3240917j2790263j2194162j1274055j0772801j0351908r370245
14245A87239718r136991q316012p935053p667979p228350o720919o457457n669221
14237A28107736n260695n495612n109235m969834m390437l822257l567175l935804
14229I1556687l689811l433790l351598k849956k957597k987730k353990k599760
14221F7332455k185886k161668j853624k193831j923201j914247j709262j252051
14213E2138685j605251j728581j359506j800901j158776r76084o35417j305773
14205D1568396j317041j610140q00280j205008n05069o45858j273091r13064j129285
14196C2169560p15013q42668m13863o08369j336974m24954j023195k57071q50611
$$ plain form
14187 25696842 25131214 24736670 24520108 23429060 23094021 22598421 22135449 21864466 21268832
14178 21268832 20872828 20447022 20110672 19633109 19424894 19007893 18410983 18184515 17967748
14169 17967748 17497361 17170192 17001484 16766648 16152807 15927752 15681337 15623880 15366865
14160 15366865 14992661 14768920 14586188 14249721 14158757 13938332 13470109 13283962 13152870
14151 13152870 13013539 12750065 12403536 12446060 11808627 11600086 11638071 11982985 11433617 10991886
14141 10991886 11164571 10860001 10517641 10722153 10529096 10142882 10580257 9749058 9855767
14132 9855767 9406531 9240156 9337953 9292744 9212951 9035301 9063606 8772385 8867769 8423574
14122 8423574 8120899 8261686 7870485 7468229 7881541 7974637 7732678 7550166 7391934 7521685
$$ packed form
14187B5696842n65628l94544k16562j091048l35039m95600m62972k70983n95634
14178B1268832l96004m25806l36350m77563k08215m17001n96910k26468k16767
14169A7967748m70387l27169j68708k34836o13841k25055k46415n7457k57015
14160A5366865l74204k23741j82732l36467r0964k20425m68223j86147j31092
14151A3152870j39331k63474l46529M2524o37433k08541L7985L44914n49368m41731
14141A0991886J72685l04570l42360K04512j93057l86214M37375q31199J06709
14132I855767m49236j66375R7797m5209p9793j77650K8305k91221R5384m44195
14122H423574l02675J40787l91201m02256M13312R3096k41959j82512j58232J29751
$$ plain form
14112 7521685 7418168 7277242 6999846 7096622 6724012 6781531 6912487 7014936 6598513 6607136
14102 6607136 6406361 6428970 6292655 5944098 6029379 5756109 5932306 5717959 5665539 5891572
14092 5891572 5564348 5612934 5274015 5410105 5712349 5690660 5283313 5344057 5452585 5480647
14082 5480647 5445213 5012223 5214734 5268194 4732667 5220545 4927799 4844528 4902839 4497273
14072 4497273 4517697 4496087 4533100 4331734 4240649 4451978 4288146 4202169 4036519 4119504
14062 4119504 3876057 4094502 4286182 4521164 4190361 3974047 4276369 3866436 3874114 4024280
14052 4024280 3674084 4261441 3497740 3544035 4135757 3268362 3252004 3832691 3737742 3345388
14042 3345388 3409659 3481190 3341709 3632396 3046827 2947819 3409954 3341291 3423397 3278674
$$ packed form
14112G521685j03517j40926k77396R6776l72610N7519J30956J02449m16423Q623
14102F607136k00775K2609j36315l48557Q5281k73270J76197k14347n2420K26033
14092E891572l27224M8586l38919J36090L02244k1689m07347O0744J08528K8062
14082E480647l5434m32990K02511N3460n35527M87878k92746q3271N8311m05566
14072D497273K0424k1610L7013k01366r1085K11329j63832q5977j65650Q2985
14062D119504k43447K18445J91680K34982l30803k16314L02322m09933P678J50166
14052D024280l50196N87357p63701M6295N91722q67395j6358N80687r4949l92354
14042C345388O4271P1531j39481K90687n85569r9008M62135o8663Q2106j44723
$$ plain form
14032 3278674 2859203 3271149 3287400 2879593 3155083 2822798 2791199 3106277 2705489 2942373
14022 2942373 2700937 2712317 2599400 2732479 2887339 2773941 2387549 2788884 2465113 2694852
14012 2694852 2745030 2596467 2367874 2685836 2011277 2443740 2673473 2396983 2338284 2299343
14002 2299343 2404008 2352145 2055627 2293527 2409972 2274460 2249166 2159764 2368017 2479748
13992 2479748 2483858 2506692 3115524 3882764 7086095 15725539 36020805 44819802 25761113
13983 25761113 12536453 8130553 5970728 4937607 4254904 3359053 3477097 3222308
13975 3222308 3120492 2815991 2680075 2437761 2846137 2654014 2393363 2631447 2418110
13966 2418110 2397030 2337743 2400711 2155613 2302013 2273804 2100338 1937300 2021205 2042168
$$ packed form
14032C278674m19471M11946J6251m07807K75490l32285l1599L15078m00788K36884
14022B942373k41436J1380j12917J33079J54860j13398l86392M01335l23771K29739
14012B694852N0178j48563k28593L17962o74559M32463K29733k76490n8699l8941
14002B299343J04665n1863k96518K37900J16445j35512k5294q9402K08253J11731
13992B479748M110K2834O08832P67240L203331Q639444K0295266Q798997j9058689
13983B5761113A2536453m405900k159825j033121o82703q95851J18044k54789
13975C222308j01816l04501j35916k42314M08376j92123k60651K38084k13337
13966B418110k1080n9287O2968k45098J46400k8209j73466j63038Q3905K0963
$$ plain form
13956 2042168 1949441 2452502 1843890 1840305 1943366 1988507 1931419 1939557 2066623 1978116 1978411
13945 1978411 1808868 1832430 1758694 2070251 1792438 1644868 1766902 1722280 1754142 2023709
13935 2023709 1739083 1361205 1154845 1660311 1781521 1401148 1702875 1632863 1584592 1549640
13925 1549640 1559548 1744879 2073797 1801218 1682066 1596575 1541179 1197587 1693670 1777670
13915 1777670 1339480 1371438 1561654 1070501 1605693 1463978 1255708 1630346 1784900 1233204
13905 1233204 1206911 1634378 1863658 1293087 1271236 1413375 1588092 1346875 1313217 1240429
13895 1240429 1399456 1128123 1263430 1447600 1126545 1474947 1438988 968033 1106428 1436941
13885 1436941 1235399 1467492 1369049 1333058 1479582 1015952 979244 1450169 1287086 1438398
$$ packed form
13956B042168r2727N03061o08612l585J03061M5141n7088Q138J27066q8507K95
13945A978411j69543K3562p3736L11557k77813j47570J22034m4622L1862K69567
13935B023709k84626l77878k06360N05466J21210l80373L01727p0012m8271l4952
13925A549640R908J85331L28918k72579j19152q5491n5396l43592M96083Q4000
13915A777670m38190L1958J90216m91153N35192j41715k08270L74638J54554n51696
13905A233204k6293M27467K29280n70571k1851J42139J74717k41217l3658p2788
13895A240429J59027k71333J35307J84170l21055L48402l5959m70955J38395L30513
13885A436941k01542K32093r8443l5991J46524m63630l6708M70925j63083J51312
$$ plain form
13875 1438398 1424261 1111371 1535396 1113817 1117081 1283040 1044255 1461013 1388735 1127568
13865 1127568 1266199 917693 1142952 1421753 850460 1122415 658755 1106861 912764
13856 912764 995184 820769 1070110 795049 729443 938634 815931 990200 1047030 1015181
13846 1015181 665363 932453 861235 1361948 652419 1065697 1203835 1131338 938284 923178
13836 923178 1036454 990247 968653 909135 873044 1242568 677467 390778 903717 771086
13826 771086 1292664 1014913 624623 774407 1067788 795676 718438 857646 973146 889848
13816 889848 997159 1230505 860632 908981 611491 809057 835319 707879 918220 909559
13806 909559 678951 864722 954363 612921 865249 662272 950202 689944 958598 744512
$$ packed form
13875A438398j4137l12890M24025m21579L264J65959k38785M16758p2278k61167
13865A127568J38631l48506K25259K78801n71293K71955m63660M48106j94097
13856I12764Q2420j74415K49341k75061o5606K09191j22703J74269N6830l1849
13846A015181l49818K67090p1218N00713F52419M13278J38138p2497j93054j5106
13836I23178J13276m6207k1594n9518l6091L69524n65101k86689N12939j32631
13826G71086N21578k77751l90290J49784K93381k72112p7238J39208J15500q3298
13816H89848J07311K33346l69873M8349k97490J97566K6262j27440K10341q661
13806I09559k30608J85771Q9641l41442K52328k02977K87930k60258K68654k14086
$$ plain form
13796 744512 1150972 883339 888173 798892 728398 983871 955482 1188444 593799 645281 932182
13785 932182 592125 649273 830497 483524 923670 636335 1057967 697614 746017 608193
13775 608193 959179 687219 1142540 737893 975536 1058861 777479 1030807 449294 377082
13765 377082 304248 377049 978721 799916 529178 406168 1004860 435662 584981 681296
13755 681296 434281 540212 764118 581858 808046 518373 566240 608911 519671 820365
13745 820365 657371 545379 703611 643552 256291 737443 713423 906971 527071 427214
13735 427214 600812 517404 847730 709282 474989 382341 544263 210563 612037 734995
13725 734995 529993 571441 609808 584951 544667 643527 451652 -34222 527795 565172 720648
$$ packed form
13796G44512M06460k67633M834q9281p0494K55473k8389K32962E93799N1482K86901
13785I32182l40057N7148J81224l46973M40146k87335M21632l60353M8403j37824
13775F08193L50986k71960M55321m04647K37643Q3325k81382K53328D49294p2212
13765C77082p2834P2801O01672j78805k70738j23010N98692D35662J49319R6315
13755F81296k47015J05931K23906j82260K26188k89673M7867M2671q9240L00694
13745H20365j62994j11992J58232o0059B56291M81152k4020J93548l79900r9857
13735D27214J73598q3408L30326j38448k34293r2648J61922B10563M01474J22958
13725G34995k05002M1448L8367k4857m0284R8860j91875c4222E27795L7377J55476
$$ plain form
13714 720648 614099 538905 393208 529349 537601 889795 150662 628162 489273 683032
13704 683032 413985 258028 606623 609858 856830 470605 503727 637760 301598 420114
13694 420114 623354 631151 354023 669081 512279 745273 481924 862513 519259 726004
13684 726004 657610 697955 266143 639459 455299 208148 268301 540857 641229 260580
13673 422996 349262 744775 277707 313432 654482 528271 437389 391529 556681 532456
13663 532456 388801 414249 598126 427323 370125 390749 386738 447689 515490 892091 457461
13652 457461 608529 714131 531547 529669 432803 667218 426906 58274 615820 251813
13641 521196 98735 627527 495586 350757 143637 447567 434307 531352 536662 762628
$$ packed form
13714G20648j06549p5194j45697J36141Q252L52194A50662M77500j38889J93759
13704F83032k69047j55957L48595L235K46972l86225L3122J34033C01598J18516
13694D20114K03240P797k77128L15058j56802K32994k63349L80589l43254K06745
13684G26004o8394M0345B66143L73316j84160B08148O0153K72556J00372B60580
13673D22996p3734L95513B77707L5725L41050j26211r0882m5860J65152k4225
13663E32456j43655K5448J83877j70803n7198K0624m011O0951O7801L76601m34630
13652D57461J51068J05602j82584j878r6866K34415k40312E8274N57546B51813
13641E21196I8735N28792j31941j44829A43637L03930j3260R7045N310K25966
$$ plain form
13631 762628 532192 473390 119073 527651 610135 561522 383297 355003 822455 483804
13621 483804 227473 476017 541836 301989 388066 247606 189115 283016 489349 408537
13611 408537 457918 218952 425791 553556 589681 132351 603980 376947 19712 405719
13601 405719 621279 486818 442635 188420 85445 247463 529002 411602 160313 824609
13591 824609 209350 436957 99963 459666 228427 498407 630782 277192 393406 230089
13581 230089 388793 381837 189041 149510 -99386 598438 317489 483473 521297 299221
13571 299221 291611 -23185 414337 458661 454138 350234 382813 147005 348388 46005 128507
13560 128507 193169 587925 205750 518294 433397 490910 104558 339270 337773 550938
$$ packed form
13631G62628k30436n8802A19073M08578Q2484m8613j78225k8294M67452l38651
13621D83804B27473K48544O5819k39847Q6077j40460n8491R3901K06333q0812
13611D08537M9381B18952K06839J27765L6125A32351M71629k27033A9712L86007
13601D05719K15560j34461m4183A88420H5445J62018K81539j17400A60313O64296
13591H24609B09350K27607I9963L59703B28427K69980J32375B77192J16214j63317
13581B30089J58704o956A89041l9531i9386E98438k80949J65984L7824k22076
13571B99221p610b3185D14337M4324m523j03904L2579A47005K01383D6005Q2502
13560A28507O4662L94756B05750L12544q4897N7513A04558K34712j497K13165
$$ plain form
13550 550938 291324 581039 247133 218316 641494 286063 164980 133010 171148 214872
13540 214872 341172 262477 557355 296586 390623 185364 405392 422350 612887 393959
13530 393959 546236 210125 317827 221778 61777 274052 429268 266062 358496 158993
13519 31755 396972 -31624 455573 110062 320719 228248 301542 456673 311402 -9938 518082
13507 246281 335483 254874 284869 267840 366535 392599 191382 78307 177599 444549 141383
13495 1215 252987 -140984 271030 98962 517614 96815 268385 496918 -71207 182671
13484 186553 394068 104657 137819 443798 506760 280887 117072 238688 222663 268725
13474 268725 441256 -123553 118133 -41248 329733 -99185 296424 118070 338041 317822
$$ packed form
13550E50938k59614K89715B47133k8817M23178B86063j21083l1970L8138M3724
13540B14872J26300p8695K94878k60769R4037A85364K20028J6958J90537k18928
13530C93959J52277B10125J07702r6049F1777K12275J55216j63206R2434A58993
13519C1755L65217c1624D55573A10062K10657r2471P3294J55131j45271i938E18082
13507B46281Q9202q0609K9995j7029R8695K6064A91382G8307R9292K66950A41383
13495A215K51772a40984B71030I8962M18652I6815J71570K28533g1207A82671
13484A86553K07515A04657L3162L05979O2962k25873A17072J21616j6025M6062
13474B68725J72531a23553A18133d1248C29733i9185B96424A18070K19971k0219
$$ plain form
13464 317822 478914 -82992 -52301 -162488 112220 -102614 374557 626010 117530 -84528
13453 258382 139718 -51552 317011 -39403 88856 -34241 187848 71550 -14245 109509 317851
13442 317851 -151455 -119739 109341 125824 375680 113559 36071 50725 87256 338273
13432 338273 100470 569901 349343 -41088 332884 136266 -158817 135119 93514 432839
13422 432839 152995 401374 226177 140020 143954 -149281 27502 529288 301339 -21959
13411 168352 230774 232873 320387 179037 33304 324542 449507 -14604 252271 497608 118102
13399 549994 239823 147772 18243 327049 359286 364521 280632 221326 44564 -40481 222380
13387 57970 109800 179598 134213 61083 88342 -55992 431280 127254 137009 67510 545329
$$ packed form
13464C17822J61092h2992L0691j10187A12220a02614C74557K51453A17530h4528
13453B58382j18664e1552C17011c9403H8856c4241A87848G1550a4245A09509K08342
13442C17851a51455L1716A09341J6483K49856A13559C6071J4654L6531K51017
13432C38273A00470M69431k20558d1088C32884A36266a58817A35119m1605L39325
13422D32839A52995K48379j75197q6157L934a49281B7502N01786k27949b1959
13411A68352O2422K099Q7514j41350C3304K91238J24965a4604B52271K45337A18102
13399E49994B39823r2051A8243L08806L2237N235q3889n9306D4564d0481B22380
13387E7970N1830O9798m5385F1083K7259e5992D31280A27254R755F7510M77819
$$ plain form
13376 545329 102302 324429 547079 128212 473131 328341 239567 235188 164134 386856
13366 386856 238202 268114 58441 79570 52346 324054 27867 280487 49924 130176 212728
13355 212728 -46711 -65770 158846 249517 344691 187036 40849 -25644 461115 179608 166320
13344 166320 215195 -37398 599769 227842 281423 337518 94863 264680 304206 24149 -152309
13332 343361 284694 141049 -90127 110638 194639 233800 264174 309401 -34291 453258 274302
13321 274302 157474 288683 229975 253393 309826 253912 248839 645125 356720 62410 158901
13310 158901 266254 -30805 5966 520864 93709 -117158 57730 244534 -184611 98393 135875
13299 135875 152720 166207 214569 163707 73130 69074 -95956 327652 58724 -225210 136273
$$ packed form
13376E45329A02302K22127K22650A28212L44919j44790q8774m379p1054K22722
13366C86856j48654K9912E8441K1129k7224K71708B7867K52620D9924Q0252Q2552
13355B12728d6711j9059A58846R0671R5174j57655D0849b5644D61115A79608j3288
13344A66320M8875c7398E99769B27842N3581N6095I4863J69817L9526B4149a52309
13332C43361n8667A41049i0127A10638Q4001L9161L0374M5227c4291D53258j78956
13321B74302j16828J31209n8708K3418N6433n5914n073L96286k88405F2410R6491
13310A58901J07353c0805E966N14898I3709a17158E7730J86804a84611I8393L7482
13299A35875J6845J3487M8362n0862G3130m056i5956C27652E8724b25210A36273
$$ plain form
13287 285482 -184374 -142368 101078 -101430 48254 -14629 257411 77667 308434 210849
13277 210849 125401 264525 415171 -44699 446115 229523 59080 140705 152175 183522 154055
13266 154055 232892 415079 313348 173961 210110 396415 268047 207810 -186051 -68151
13255 187445 -43220 196437 -285875 -109554 97593 72027 50752 13674 134499 154216 322381
13244 322381 -99876 71141 178755 112831 41469 105766 -314390 206351 154523 -27512 140134
13232 646028 79837 -133424 174841 -118660 -36216 362716 165351 547376 158832 -3884
13221 -22384 168724 76589 419983 16418 62389 190597 247343 -98679 126685 326046 79689
13209 442222 317848 187114 4367 37938 233596 285199 -46304 501544 -168293 -17171 -289366
$$ packed form
13287B85482a84374M2006A01078a01430D8254a4629B57411G7667K30767r7585
13277B10849q5448J39124J50646d4699D46115k16592E9080Q1625J1470L1347k9467
13266A54055P8837J82187j01731j39387L6149J86305j28368o0237a86051f8151
13255A87445d3220A96437b85875a09554I7593k5566k1275A3674J20825J9717J68165
13244C22381i9876G1141J07614o5924D1469O4297c14390B06351n1828b7512A40134
13232F46028G9837a33424A74841a18660c6216C62716A65351L82025A58832c884
13221b2384A68724G6589L43394A6418M5971J28208N6746i8679A26685J99361G9689
13209D42222j24374j30734D367L3571J95658N1603d6304E01544a68293a7171k72195
$$ plain form
13198 -289366 18076 139989 132929 175215 236925 -66960 -99550 54272 34515 -141263 -26123
13186 -8022 48157 358735 149532 20769 30844 -37639 366351 -201201 -263192 316474 250877
13175 250877 62031 108805 287193 84004 162795 -180165 -11411 -119842 164105 95401 71221
13164 71221 -172699 -251816 -408773 104146 28080 -53803 43800 209106 283914 -86081 163963
13152 83348 111602 -50321 -198217 68337 7266 2630 224275 -157140 250750 230641 -120991
13140 278337 1544 -131589 5018 -120699 29482 -222265 -259381 114222 279286 30300 271287
13129 271287 367015 385635 -77540 -99839 211690 207640 28142 -40083 76414 -64729 2735 -187399
13116 -193280 127853 91861 229090 -275247 -11026 28726 11546 282428 -24689 166622
$$ packed form
13198b89366A8076J21913p060M2286O1710f6960l2590E4272j9757a41263b6123
13186h022D8157L10578A49532B0769J0075c7639C66351b01201o1991C16474o5597
13175B50877F2031M6774J78388H4004P8791a80165a1411j08431A64105o8704k4180
13164G1221a72699p9117j56957A04146B8080e3803D3800J65306P4808h6081A63963
13152H3348K8254e0321j47896F8337G266B630K21645a57140B50750k0109a20991
13140B78337A544a31589E018a20699B9482b22265l7116A14222J65064C0300K40987
13129B71287R5728J8620g7540k2299B11690m050B8142d0083G6414f4729B735a87399
13116a93280A27853l5992J37229b75247a1026B8726A1546K70882b4689A66622
$$ plain form
13105 -169330 -96842 153061 176480 -236745 99861 87036 30453 228182 -313552 320249
13094 -73576 336667 -87355 172930 426471 -353624 326372 21017 104044 -64826 39347 -173097
13082 120212 211843 38476 333372 100290 -194707 145667 -19034 607605 223774 179402
13072 179402 -90871 240866 198600 124085 388751 419893 -94667 94247 159142 118229 206065
13061 206065 77879 138936 71126 243539 94811 205032 -82016 -56948 -285391 312939 -133680
13049 26511 48379 470397 31473 443479 -122847 275000 279194 145957 270288 123198
13038 61153 -71103 -81591 258805 -313018 123365 -136785 468259 -54790 -355092 -97883
13027 111916 168644 -252616 169196 339508 9233 343436 -167351 243970 112062 2761
$$ packed form
13105a69330P2488A53061K3419b36745I9861j2825C0453J97729c13552C20249
13094g3576C36667h7355A72930K53541c53624C26372B1017Q3027f4826C9347a73097
13082A20212R1631C8476K94896A00290a94707A45667a9034F07605B23774m4372
13072A79402i0871B40866m2266p4515K64666L1142i4667I4247O4895m0913Q7836
13061B06065G7879O1057o7810J72413I4811J10221h2016K5068k28443C12939a33680
13049B6511K1868M22018C1473M12006a22847B75000M194j33237J24331A23198
13038F1153g1103j0488B58805c13018A23365a36785D68259e4790l00302i7883
13027A11916N6728b52616A69196J70312I233L34203a67351B43970A12062B761
$$ plain form
13016 343713 2187 -56713 415434 156149 302067 -37331 41185 -44586 77427 -120528 16062
13004 -112857 102113 118195 90116 447844 49048 -202860 158978 -83927 24556 -36164 -154528
12993 -154528 15830 -35313 258685 -143999 111441 271716 -276637 -13583 -351703 151993
12982 160753 -1216 326226 61548 54872 -150453 -335456 16199 84264 -3956 -170146 -188994
12971 -188994 125087 128202 401950 -236091 146316 57918 -7356 308263 149365 314142
12961 314142 60308 -143045 128651 -123378 -50637 -249186 -104386 89504 -18564 49605
12950 -140838 155995 -188725 141436 129261 219158 124316 -63850 17037 243557 -47928 189294
12938 152059 -106314 118963 221566 -85165 -125314 -136403 132969 505353 -7599 -188733
$$ packed form
13016C43713B187e6713D15434A56149J45918c7331D1185d4586G7427a20528A6062
13004a12857A02113J6082k8079L57728D9048b02860A58978h3927B4556c6164j18364
12993a54528A5830c5313B58685a43999A11441J60275b76637a3583l38120A51993
12982A60753a216C26226F1548o676a50453j85003A6199O8065c956j66190j8848
12971a88994A25087L115K73748b36091A46316E7918g356C08263A49365J64777
12961C14142F0308a43045A28651a23378e0637j98549a04386H9504a8564D9605
12950a40838A55995a88725A41436j2175Q9897r4842f3850A7037K26520d7928A89294
12938A52059a06314A18963J02603h5165m0149j1089A32969L72384g599j81134
$$ plain form
12928 -188733 -70182 -38796 178723 -38079 -162308 -46214 28065 -2357 339401 414328 -62606
12916 92680 147469 -220514 -211113 160288 -101329 42574 256310 67223 -74731 -58249 -359066
12905 -359066 -15768 107242 295723 133365 78920 -107397 -128371 36068 21335 8578 133073
12894 133073 221733 256915 -87762 337587 -5866 -113649 -604 51641 192602 289176 133065
12882 -55234 -88059 45033 206722 47113 -251785 73953 -330184 -13158 -163638 17939 46583
12871 46583 -134011 -8668 106622 -16221 49818 -2239 -58238 -50511 -45634 -163352 66209 -198037
12858 444713 -132505 -269513 40462 -5671 255739 77712 -417911 107435 406299 229501
12848 229501 -150178 -45663 326782 -145219 -154934 135280 -30033 55214 45253 195197 261704
$$ packed form
12928a88733g0182L1386A78723c8079j24229d6214B8065b357C39401P4927f2606
12916I2680N4789b20514R401A60288a01329D2574K13736F7223g4731J6482l00817
12905c59066a5768A07242J88481A33365n4445a07397k0974C6068j4733H578J24495
12894A33073Q8660L5182h7762C37587e866j07783f04E1641J40961R6574A33065
12882e5234l2825D5033J61689D7113b51785G3953c30184a3158j50480A7939K8644
12871D6583a34011h668A06622a6221D9818b239n5999P727M877j17718F6209a98037
12858D44713a32505j37008D0462e671B55739G7712d17911A07435K98864j76798
12848B29501a50178d5663C26782a45219r715A35280c0033E5214r961J49944O6507
$$ plain form
12837 261704 55511 155392 -21746 -96980 -59845 189154 62804 44280 524652 -43561 -29021
12826 -29021 -140004 -377259 -48420 328366 -15908 -133745 106187 546093 241571 -241895
12815 89915 -184971 -173273 79352 -121697 -189189 -145036 -123455 109521 331259 -128751 -147394
12804 -147394 -32279 116173 141440 -257446 -141555 -596 4613 -11044 154477 167162 -275658
12792 -94155 199746 -182076 -17130 158005 -143153 -46868 16862 1721 -144696 -19981 140515
12780 55109 -121473 -116063 302099 4646 -277549 -235970 361859 98367 940 -32953 -254233
12769 -254233 -194579 176324 -210363 110427 157474 198380 -184399 -29687 65597 -57727 245917
12757 108644 -42571 -75225 -169117 -231895 -123202 -251352 132179 -203368 -36705 -12784 125405
$$ packed form
12837B61704E5511R9881b1746p5234L7135A89154F2804j8524M80372d3561J4540
12826b9021j10983k37255d8420C28366a5908j17837A06187M39906B41571b41895
12815H9915a84971J1698G9352a21697o7492M4153K1581A09521K21738a28751j8643
12804a47394c2279A16173K5267b57446J15891e96D613a1044A54477J2685b75658
12792i4155A99746a82076a7130A58005a43153d6868A6862A721a44696a9981A40515
12780E5109a21473N410C02099D646b77549M1579C61859I8367I40c2953k21280
12769b54233N9654A76324b10363A10427M7047M0906a84399b9687F5597e7727B45917
12757A08644d2571l2654r3892o2778J08693j28150A32179b03368c6705a2784A25405
$$ plain form
12745 178167 -34098 -227734 116666 -128428 402815 -27826 12916 140641 -81670 58135
12734 -95519 140130 366987 -170646 79632 346916 28270 -192599 236597 -308035 -30874
12723 -166845 -343116 220412 91862 61055 -20078 40530 57538 -79254 167913 21241 233552
12712 233552 4921 125860 220819 349843 217755 -301281 93347 36161 8473 361822 113638
12700 89360 260723 79730 127279 451889 320345 118273 234044 172087 161616 144484 67294
12688 242462 -106932 85526 53012 -208562 341075 194595 159582 -172917 338820 51938
12677 547318 35968 393260 281187 183659 63108 506209 -180719 -198197 -178407 7397 175502
12666 175502 25061 338356 225838 315540 -42001 457901 62553 -435150 463815 51259
$$ packed form
12745A78167c4098j93636A16666a28428D02815b7826A2916J27725h1670E8135
12734i5519A40130K26857a70646G9632K67284B8270a92599B36597c08035c0874
12723a66845j76271B20412I1862l0807b0078D0530J7008g9254A67913B1241K12311
12712B33552D921J20939R4959J29024j32088c01281I3347C6161H473L53349A13638
12700H9360J71363G9730M7549L24610j31544A18273J15771o1957j0471j7132F7294
12688B42462a06932H5526l2514b08562C41075j46480l5013a72917C38820E1938
12677E47318C5968L57292j12073r7528F3108M43101a80719j7478J9790G397J68105
12666A75502B5061L13295j12518Q9702d2001D57901F2553d35150D63815E1259
$$ plain form
12655 -100759 370134 72489 333559 189640 16431 76248 12720 -21743 -178446 203658
12644 -139278 144664 139436 120088 328787 74357 12441 -164778 435199 72356 -130762 161562
12632 152162 168683 61838 130898 -91122 201233 393536 121048 92648 249821 -144058
12621 132866 -291202 84313 58759 341784 52328 -251617 288757 101689 -118133 -92939
12611 -92939 108939 -6026 -71446 -71226 132369 -359389 -60161 265662 -499 -181211 143897
12599 18733 115958 65508 -211814 410084 287969 155644 239290 90763 108871 -46025 62663
12587 58150 -111722 77931 -86916 -53405 -30624 -22176 76871 -180071 65920 -95589 -213338
12576 -213338 225530 202597 -181213 78115 -2639 98653 -205761 140011 -181195 118189
$$ packed form
12655a00759C70134G2489K61070j43919A6431N9817A2720b1743j56703B03658
12644a39278A44664n228j9348K08699G4357A2441a64778D35199G2356a30762A61562
12632A52162J6521F1838O9060i1122B01233J92303A21048k8400J57173a44058
12621A32866b91202H4313k5554K83025E2328b51617B88757A01689a18133K5194
12611i2939A08939f026o5420K20A32369c59389f0161B65662d99j80712A43897
12599A8733R7225n0450b11814D10084j22115j32325Q3646I0763J8108d6025F2663
12587E8150a11722G7931h6916L3511K2781Q448G6871a80071F5920i5589j17749
12576b13338B25530k2933a81213G8115b639I8653b05761A40011a81195A18189
$$ plain form
12565 35061 -264691 -35276 -7376 65519 33306 200472 115800 176807 -132027 8616 36055
12554 36055 -147955 93002 -125352 -185364 313102 255185 -98264 -28292 -442041 174998 -126269
12542 39974 49730 -82626 -153580 2121 218848 -91979 -344903 201089 130716 48433 211689
12531 211689 -34916 200108 -56478 207634 -115248 77546 240053 143446 -85902 -238508
12521 -238508 -21894 -316276 75784 43549 136860 -151177 182773 253319 -69825 99438 -58597
12509 40731 112365 -204171 -261161 41398 -48825 -20236 28444 -174639 194211 280592 203109
12498 203109 49114 1778 -67604 -64027 -17299 -83292 -31852 -99191 -95546 -128562 -390476 -3929
12485 65836 -48184 365003 25104 -345953 -19899 200723 305531 86585 -273790 -45594 -110156
$$ packed form
12565C5061b64691c5276g376F5519l2213J67166q4672O1007a32027H616K7439
12554C6055a47955I3002a25352o0012C13102n7917i8264b8292m13749A74998a26269
12542C9974R756h2626p0954B121K16727i1979k52924B01089p0373D8433J63256
12531B11689c4916B00108e6478B07634a15248G7546J62507r6607h5902j52606
12521b38508b1894k94382G5784l2235R3311a51177A82773P0546f9825I9438e8597
12509D0731P1634b04171n6990D1398d8825b0236B8444a74639A94211Q6381p7483
12498B03109D9114A778f7604L577a7299o5993c1852o7339L645l3016k61914c929
12485F5836d8184C65003B5104c45953a9899B00723J04808H6585b73790d5594o4562
$$ plain form
12474 -110156 87340 175142 -161867 -91273 -145937 -359977 178622 301459 -424378 128760
12463 146788 204467 102688 -548681 -64169 -188727 122291 174781 -57210 180405 -135411
12452 -38027 414854 336060 47412 -184594 -95412 -167729 -57010 211892 98109 -200173 -176325
12441 -176325 195087 128777 -136594 71865 162461 185098 -295284 375173 302246 75875 -97299
12429 -210318 -167721 314856 77070 134538 -142640 -283717 -245750 -199833 -71868 -107672 -343182
12418 -343182 -131857 62333 62266 109796 208501 -147886 112126 -183777 63994 213495 109660
12407 109660 288792 -118548 -560004 -67109 -42989 -143961 -68264 -152079 123048 102881
12397 102881 -319240 -199103 43373 28364 -130298 -306793 186949 -44814 -97184 -341572
$$ packed form
12474a10156H7340Q7802a61867P0594n4664k14040A78622J22837d24378A28760
12463A46788N7679j01779e48681f4169j24558A22291N2490e7210A80405a35411
12452c8027D14854p8794D7412a84594Q9182p2317e7010B11892I8109b00173K3848
12441a76325A95087o6310a36594G1865R0596K2637b95284C75173p2927G5875i7299
12429b10318M2597C14856G7070N7468a42640j41077L7967M5917g1868l5804k35510
12418c43182a31857F2333o7M7530R8705a47886A12126a83777F3994J49501j03835
12407A09660J79132a18548m41456f7109K4120j00972f8264q3815A23048k0167
12397A02881c19240J20137D3373j5009a30298j76495A86949d4814n2370k44388
$$ plain form
12387 -341572 -439808 108213 -92876 167828 -41885 85526 228531 -100144 -76193 -29372 -129731
12376 -129731 -201465 48709 -174144 87862 -181751 -92834 85449 -27075 -178604 -55654 176831
12364 -145191 -267355 -89832 -170962 142098 -156252 -259743 287559 19537 -269830 204519
12353 365729 -376266 -368311 -153508 433292 -34115 143424 -123405 87350 292032 -282212
12342 -28038 -149443 -80244 -418330 -144485 -201773 136524 -132117 -386614 53551 295179
12332 295179 -124741 -89260 59499 -214091 -16269 106962 -24874 97139 287458 -276570
12321 -212760 21309 207614 -61496 95932 -24993 180726 -36369 -295621 -65597 -271679 45227
12309 -615 -138652 -288132 662 -73558 -151525 358440 126619 -80350 181582 98347 -186378
$$ packed form
12387c41572r8236A08213i2876A67828d1885H5526J43005a00144K3951b9372j00359
12376a29731p1734D8709a74144H7862a81751Q8917H5449b7075j51529e5654A76831
12364a45191j22164h9832q1130A42098a56252j03491B87559A9537b69830B04519
12353C65729c76266P955a53508D33292c4115A43424a23405H7350K04682b82212
12342b8038j21405O9199l38086a44485n7288A36524a32117k54497E3551K41628
12332B95179a24741L5481E9499b14091a6269A06962b4874I7139J90319b76570
12321b12760B1309J86305f1496I5932b4993A80726c6369k59252f5597k06082D5227
12309f15j38037j49480F62g3558p7967C58440A26619h0350A81582q3235a86378
$$ plain form
12297 71980 186364 197038 274682 -60244 -56119 89796 -53388 51342 -6726 55494 -6650 -49175
12285 -49175 183773 244889 73519 -86374 308297 -174589 189479 94153 144712 153404 314079
12274 314079 279681 94168 209505 217049 19999 36558 -92915 125937 -210837 -152967 -56260
12262 335798 25831 135428 -60338 -24184 -3569 -125852 -90981 186874 -45948 55880 150542
12251 150542 443466 134776 -63714 126438 4145 -228382 315519 164943 33591 97612
12241 97612 121729 231236 47783 186485 307848 156054 112415 223144 -166204 57114
12230 410732 256233 36222 15590 312482 -4672 205374 309706 81089 62407 -285068 477520
12218 89804 377199 123240 354451 178230 123543 167372 -75703 -395440 378994 81697
$$ packed form
12297G1980J14384J0674P7644f0244M125H9796e3388E1342f726E5494f650m2525
12285d9175A83773O1116G3519h6374C08297a74589A89479I4153N0559Q692J60675
12274C14079l4398I4168J15337P544A9999J6559i2915A25937b10837N7870e6260
12262C35798B5831J09597f0338b4184c569j22283L4871A86874d5948E5880R4662
12251A50542K92924A34776f3714A26438D145b28382C15519j50576C3591O4021
12241I7612K4117J09507D7783J38702J21363j51794m3639J10729a66204E7114
12230D10732j54499C6222A5590K96892d672B05374J04332H1089j8682b85068D77520
12218H9804K87395A23240K31211j76221n4687M3829g5703l19737C78994H1697
$$ plain form
12207 143546 -144166 310598 208547 68408 49234 254927 64642 -215186 283073 15950
12196 181819 436941 253073 152251 220505 210548 366035 -196213 155688 208826 -57693
12185 7420 104306 38229 201 136962 -9331 122121 270305 199013 -72253 176820 163107 -236442
12172 11263 370087 307264 186369 211371 145680 221915 161382 166762 295903 -32492 207208
12160 127364 330548 337316 -92635 37273 102456 268015 395749 107275 -111895 179553
12149 14366 -134789 81915 -14275 -364386 299436 40406 -48598 75463 226731 245379 480015
12138 480015 297267 -78373 221973 -302325 -99948 -85211 -241120 -277618 79693 -32092 28723
12126 585387 -313070 306772 -173380 -48496 185021 -43207 -25279 -106928 -259 -65185 -19693
$$ packed form
12207A43546a44166C10598j02051F8408j9174K05693F4642b15186B83073A5950
12196A81819K55122j83868j00822O8254r957J55487a96213A55688N3138e7693
12185G420R6886C8229B01J36761i331A22121J48184p1292g2253A76820j3713b36442
12172A1263L58824o2823j20895K5002o5691P6235o0533N380J29141c2492B07208
12160A27364K03184O768i2635C7273O5183J65559J27734A07275a11895A79553
12149A4366a34789H1915a4275l50111B99436D0406d8598G5463J51268J8648K34636
12138D80015j82748g8373B21973c02325i9948J4737j55909l6498G9693c2092B8723
12126E85387c13070C06772a73380d8496A85021d3207J7928q1649b59o4926a9693
$$ plain form
12114 10779 -100587 93550 -203657 -104131 -252682 -139573 -145299 -113795 196022 -116605 33062
12102 40589 -401921 38584 82088 20312 274558 227842 25511 -271443 105162 -51059 137877
12090 60098 -266993 -41209 -111774 102816 -4126 -72217 75484 91994 -50442 -66401 88047
12078 204280 249519 738124 1676347 977132 253419 195588 -532623 195174 386362 144549
12067 79728 91916 -77626 -88024 -378913 -44631 24370 -243631 37038 4479 164219 122649
12056 122649 204646 268255 136837 -171356 167645 -220968 -309920 -115654 -14369 -171366
12046 -171366 -264835 -213962 -114660 -252054 -17382 210817 200327 177621 97401 -335263 314271
12034 -98707 -169512 -20278 -101230 12124 -402651 -111494 109322 31356 171198 61386 -126830
$$ packed form
12114A0779a00587I3550b03657R9526j48551J13109n726L1504A96022a16605C3062
12102D0589d01921C8584M3504B0312K54246m6716B5511b71443A05162e1059A37877
12090F0098b66993d1209p0565A02816d126o8091G5484J6510e0442j5959H8047
12078B04280M5239M88605R38223o99215B53419n7831e32623A95174J91188A44549
12067G9728J2188g7626j0398k90889d4631B4370b43631C7038D479J59740m1570
12056A22649Q1997O3609j31418a71356A67645b20968q8952a15654a4369j56997
12046a71366r3469N0873R9302j37394a7382B10817j0490k2706q0220c35263C14271
12034i8707p0805b0278q0952A2124d02651a11494A09322C1356J39842F1386a26830
$$ plain form
12022 -103892 -76420 -105759 193990 -182305 -59522 -10524 -16121 -166296 -332021 194700 145153
12011 145153 -134720 -128527 -207894 172745 -189328 87860 33238 -137948 -117850 -77860 -34800
11999 376970 -182033 -152371 -150894 -153847 -78668 -19317 247321 313898 -126125 -36018 -69094
11988 -69094 154151 146054 -163276 2485 61698 -2055 286401 62908 -311508 -63582 -354059
11977 -354059 215143 -177083 342005 -8082 -111663 -81337 159449 -277486 17610 -135507
11966 209222 173810 -51750 -321827 71006 -9440 12556 -106180 206929 18446 -85317 106545
11954 129544 340286 220302 -33461 -115403 273414 -163070 -50605 65263 176564 -165656
11943 228762 -271942 73738 68483 63644 21084 97090 -119154 25982 -113876 -261183 213241
$$ packed form
12022a03892K7472k9339A93990a82305e9522a0524n597j50175j65725A94700m9547
12011A45153a34720O193p9367A72745a89328H7860C3238a37948K0098L9990c4800
11999C76970a82033K9662J477k953P5179a9317B47321O6577a26125c6018l3076
11988f9094A54151q097a63276B485N9213b055B86401F2908c11508f3582k90477
11977c54059B15143a77083C42005h082j03581L0326A59449b77486A7610a35507
11966B09222l5412e1750k70077G1006i440A2556a06180B06929A8446h5317A06545
11954A29544K10742j19984c3461q1942B73414a63070e0605F5263J11301a65656
11943B28762b71942G3738n255m839B1084P6006a19154B5982a13876j47307B13241
$$ plain form
11931 233851 36218 263648 -60972 -18155 -273458 330924 177564 -36098 95356 57017 -161156
11919 -130980 -12254 195955 -127244 -3891 -96641 -235632 -111838 60001 -3418 80643 -144529
11907 233603 -329461 -132793 -150082 -364631 29801 -162270 -54543 229013 -222775 -214474
11897 -214474 -311556 -14408 -359559 307516 -436313 344087 150975 -136523 -268483 254132
11886 123345 -397319 87335 106792 179280 265936 224092 -83308 -185933 288400 -344160 -237033
11875 -237033 61929 -188436 133314 -248747 53762 -256178 252670 7700 -156154 117703
11864 -97298 -34049 33843 -207689 -9154 -148211 -269329 158994 -42643 97729 59781 -49500
11852 7157 -58849 142376 -193346 -101386 -80780 -106533 186484 -68860 211965 60929 -180050
$$ packed form
11931B33851C6218K27430f0972a8155k55303C30924j53360c6098I5356l8339a61156
11919a30980a2254A95955a27244c891r2750j38991a11838F0001c418H0643a44529
11907B33603c29461a32793j7289k14549B9801a62270e4543B29013b22775Q301
11897b14474r7082a4408l45151C07516d36313C44087A50975a36523j31960B54132
11886A23345c97319H7335J9457P2488Q6656m1844h3308j02625B88400c44160J07127
11875b37033F1929a88436A33314b48747E3762b56178B52670G700a56154A17703
11864i7298c4049C3843b07689i154j39057j21118A58994d2643I7729l7948d9500
11852G157e8849A42376a93346R1960K0606k5753A86484f8860B11965F0929a80050
$$ plain form
11840 -121253 34118 329416 -27426 -235817 -23863 84238 -139751 -55730 -179175 163834
11829 -3936 18753 -38222 -311208 -133662 -189971 -104932 -215627 -1005 202817 -220078 -92494
11817 -225652 46072 -63868 142012 -46863 68780 150989 15089 -23735 22075 125936 -348807
11805 -117912 -152530 -80725 56300 221390 -346985 -228997 298581 94075 96310 -261517 248532
11793 240121 -7268 98125 234456 111702 -135384 -22437 -177498 -123791 -180025 -236956 98858
11781 5007 -131901 -195158 -162533 -62289 399058 383278 -95825 -16048 140359 133953 -190358
11769 19123 15343 -375587 -91178 125970 12318 72490 87099 -221937 -100822 69191 -247635
11757 145370 -53292 -168394 130603 -112911 32606 299074 -311795 -596650 69488 203292
$$ packed form
11840a21253C4118K95298b7426k08391b3863H4238a39751e5730j23445A63834
11829c936A8753c8222k72986a33662n6309Q5039j10695a005B02817b20078i2494
11817b25652D6072f3868A42012d6863F8780Q2209A5089b3735B2075J03861c48807
11805a17912l4618P1805E6300J65090c46985J17988B98581I4075K235b61517B48532
11793B40121g268I8125J36331A11702a35384b2437j55061N3707n6234n6931I8858
11781E007a31901o3257L2625f2289C99058j5780i5825a6048A40359o406a90358
11769A9123l780c75587i1178A25970A2318O0172J4609b21937a00822F9191b47635
11757A45370e3292j15102A30603a12911C2606K66468c11795k84855F9488J33804
$$ plain form
11747 203292 117386 152809 22191 -153141 -105979 -58276 57976 73781 -172622 -359586 150907
11735 361995 -177999 -143152 -131285 157992 34222 49014 -18903 -251353 376844 -75986 -53963
11724 -53963 19857 347918 -13065 -87153 -308159 -106589 -31624 -161503 -194834 73211 193462
11713 193462 -127444 198482 -28858 -52026 116097 527530 -86785 41827 440994 493332
11703 493332 -94770 141983 -143422 100133 -147516 217257 -127656 -62573 206551 -118916
11692 54363 -142275 -85508 -214607 21084 -396604 296306 -195324 374305 -121643 193723
11681 44454 173542 359405 -11509 311968 -112063 173082 141100 -129068 70446 -275542
11670 -233101 271628 -80094 12414 336550 334557 -119623 -67161 73624 -51749 -312525 -67265
$$ packed form
11747B03292q5906L5423B2191a53141M7162M7703E7976J5805a72622j86964A50907
11735C61995a77999L4847J1867A57992C4222J4792a8903k32450C76844g5986K2023
11724e3963A9857L28061a3065p4088k21006a06589c1624j29879l3331G3211J20251
11713A93462a27444A98482b8858k3168A16097M11433h6785D1827L99167N2338
11703D93332i4770A41983a43422A00133a47516B17257a27656f2573B06551a18916
11692E4363a42275N6767j29099B1084c96604B96306a95324C74305a21643A93723
11681D4454J29088J85863a1509C11968a12063A73082l1982a29068G0446b75542
11670b33101B71628h0094A2414L24136j993a19623N2462G3624e1749k60776f7265
$$ plain form
11658 13621 126154 179850 195564 -294321 24068 -346010 -372254 -80113 84421 108740 -141402
11646 90805 -182236 -182315 -3287 98925 -35134 27989 -243057 -172211 -92308 180062 24244 246597
11634 246597 -54574 39879 -139781 124804 -25177 48451 -1259 109776 183255 249438 -154356
11622 -201041 -76100 -121691 160665 133928 161688 14349 160046 180941 -91506 25831 -142751
11610 498017 120429 159788 78708 -96125 4865 134994 328885 -301762 266783 -137677
11599 -144217 -101408 108692 35102 -133073 -236481 260973 -136654 172892 66057 -56212
11588 35651 -368889 171976 253471 153466 -156659 139041 -98935 -140069 -58346 276053
11577 196040 426528 245558 -269440 308792 105374 191579 -163824 206752 18154 442825
$$ packed form
11658A3621J12533N3696J5714b94321B4068c46010k6244h0113H4421K4319a41402
11646I0805a82236p9c287I8925c5134B7989b43057P0846P9903A80062B4244K22353
11634B46597e4574C9879a39781A24804b5177D8451a259A09776P3479O6183a54356
11622b01041g6100m5591A60665k6737K7760A4349J45697K0895i1506B5831a42751
11610D98017A20429L9359G8708i6125D865J30129J93891c01762B66783a37677
11599a44217M2809A08692C5102a33073j03408B60973a36654A72892F6057e6212
11588C5651c68889A71976Q1495j00005a56659A39041i8935m1134e8346B76053
11577A96040K30488j80970b69440C08792A05374Q6205a63824B06752A8154M24671
$$ plain form
11567 442825 -183472 276636 125829 152561 -305145 60035 5794 364398 32477 94641 -181792
11555 44516 55933 57444 -204651 -787 196052 137852 129540 31317 366655 -52046 394368 24433
11542 10639 115240 101885 469993 -8876 133297 -97467 -191545 61068 5383 78886 418828
11531 418828 39587 306974 -81739 68994 -175701 163996 126289 -386099 10239 179136
11521 179136 -64333 333049 89058 220591 28274 155442 129783 305279 220762 215489 -73294
11509 128685 112749 185553 365144 -28048 295801 -192222 69261 52660 189483 -72025 -61970
11498 -61970 167448 -58541 -82101 206044 122657 44103 373775 -5863 -177706 284350 246471
11487 246471 367146 242200 229832 -149486 -34774 94519 101622 258170 108832 243151
$$ packed form
11567D42825a83472B76636A25829K6732c05145F0035E794L58604C2477O2164a81792
11555D4516J1417J511b04651g87A96052n8200q312C1317L35338e2046C94368B4433
11542A0639J04601j3355L68108h876A33297i7467r4078F1068E383P3503L39942
11531D18828C9587K67387h1739F8994a75701A63996l7707c86099A0239J68897
11521A79136f4333C33049H9058J31533B8274J27168k5659J75496q4517n273g3294
11509A28685j5936P2804J79591b8048B95801a92222F9261j6601J36823g2025J0055
11498f1970A67448e8541k3560B06044q3387D4103L29672e863j71843B84350l7879
11487B46471J20675j24946j2368a49486c4774I4519P103J56548A08832J34319
$$ plain form
11477 243151 50929 167691 137217 54544 234040 313650 -22602 101656 99183 -38148 454457
11465 266504 27051 310026 182973 251894 44774 -416005 94335 138457 78874 -76934 77984
11453 -188339 -266617 5574 -227125 -51596 99428 133871 59757 398637 249996 210694 -68963
11441 166941 118220 -36241 167005 -110052 -342586 129306 -103404 -213584 9490 332655
11431 332655 57678 36523 63845 288613 -137154 73343 -393 742 89311 61610 133570 100236
11419 100236 -254756 260790 6009 -284443 132138 299884 101645 41203 173072 -186973
11408 128778 -80015 -293882 -32289 -10836 250159 112432 -55922 363830 -176743 -47164
11397 -241940 -97674 -118081 127766 -196972 40549 58959 -3378 -121508 311917 -143479 60595
$$ packed form
11477B43151E0929J16762l0474E4544J79496P9610b2602A01656k473c8148D54457
11465B66504B7051K82975j27053O8921D4774d16005I4335M4122n9583g6934G7984
11453a88339p8278E574b27125e1596I9428L4443E9757L38880j48641l9302f8963
11441A66941m8721c6241A67005a10052k32534A29306a03404j10180I490L23165
11431C32655E7678k1155K7322K24768a37154G3343c93G42Q8569k7701P1960l3334
11419A00236b54756B60790F009b84443A32138J67746A01645D1203J31869a86973
11408A28778h0015k13867c2289a0836B50159A12432e5922C63830a76743d7164
11397b41940i7674k0407A27766a96972D0549J8410c378j18130C11917a43479F0595
$$ plain form
11385 113169 246245 -235904 -509407 -10235 -386189 113283 52418 -106272 -21543 -40676
11375 -40676 221479 101030 38362 183692 -17054 -32686 -343804 -198494 53337 151922 -112183
11363 410500 51993 294072 -217130 226414 -8534 99680 34410 139848 93692 -206376 118987
11351 157356 -97880 -99536 -246972 73442 147961 188477 140203 7673 -140875 -135739 227619
11339 -184494 -194725 -42787 91282 131746 340532 -70181 -124533 -9956 -331310 16596 355548
11328 355548 -152098 44958 -34856 53602 -81450 301111 -367537 -41613 68629 32218 185849
11317 185849 -120972 -104751 261106 64470 -363105 437984 101 92025 6884 -49514 121342
11305 198479 240254 -136641 -130823 -160860 144026 146343 -124117 -96808 -295870 371327 -20684
$$ packed form
11385A13169J33076b35904k73503a0235l75954A13283E2418a06272b1543j9133
11375d0676B21479A01030C8362J45330a7054j5632l11118J45310E3337R8585a12183
11363D10500E1993K42079b17130B26414h534I9680C4410J05438m6156b06376A18987
11351A57356i7880j656j47436G3442P4519M0516m8274G673a40875N136B27619
11339a84494j0231d2787I1282M0464K08786g0181n4352i956l21354A6596L38952
11328C55548a52098D4958c4856E3602h1450C01111c67537d1613F8629C2218J53631
11317A85849a20972J6221B61106F4470c63105D37984A01R1924F884d9514A21342
11305A98479M1775a36641N818l0037A44026K317a24117K7309j99062C71327b0684
$$ plain form
11293 26449 -98647 623509 138002 -196672 44183 -62039 138760 -32089 20419 -325753 -12717
11281 125994 -145271 -142441 11885 -39868 -19846 375578 -252869 148487 -30561 172896 -267938
11269 -146597 14521 -96021 -73283 -264485 -454342 36639 61061 -123662 -221525 28664 35725
11258 35725 -208950 -70919 103570 -148581 -13287 -77675 -35044 -330046 -47312 -371235 34478
11246 83265 -205400 -115087 -167788 -94580 -58615 -186272 -238107 -175241 163022 157065 -133242
11234 -275732 -100901 -70857 -107064 7857 -183092 -120313 170442 81258 -328840 -73603 65636
11222 105215 -32093 -99026 -486162 205091 -56548 -76685 -363034 186940 43920 -141281
11211 43206 -554 -166139 -210430 173203 96648 -196332 8307 -279444 145537 -161043 118888
$$ packed form
11293B6449i8647F23509A38002a96672D4183f2039A38760c2089B0419c25753a2717
11281A25994a45271K830A1885c9868a9846C75578b52869A48487c0561A72896b67938
11269a46597A4521i6021K2738j91202j89857C6639K4422a23662r7863B8664P061
11258C5725b08950g0919A03570a48581a3287o4388c5044k95002d7312l23923C4478
11246H3265b05400R0313n2701P3208L5965j27657n1835O2866A63022n957a33242
11234b75732a00901L0044l6207G857a83092O2779A70442H1258c28840g3603F5636
11222A05215c2093o6933l87136B05091e6548k0137k86349A86940D3920a41281
11211D3206e54j65585m4291A73203p6555a96332H307b79444A45537a61043A18888
$$ plain form
11199 214001 -175796 -111735 -123831 -228375 -184702 12955 41442 80933 -33894 64 -233128
11187 53239 -53418 -290141 -7809 112475 339745 -122025 -113072 -54641 -263604 -548693 70052
11175 98141 -83286 27704 -86756 -248310 -354962 -73858 -227790 -233518 37496 184168 -90842
11163 -76072 200227 -11317 233989 246482 8483 -73893 106938 15879 -119332 -185293 182010
11151 56121 57374 -116038 333356 290943 197564 -254814 202815 -48542 -76366 -12705 -61823
11140 -61823 222399 16789 -111192 -195651 175804 112473 214723 -25409 -30647 -35255 187341
11128 86091 -87789 187448 -176246 17250 -351514 139059 117602 -321014 196621 -69425
11117 -179303 264987 -225183 165083 282901 -46676 233021 -93528 -273675 187156 33854
$$ packed form
11199B14001a75796O4061j2096j04544M3673A2955K8487L9491c3894F4b33128
11187E3239e3418k36723g809A12475K27270a22025Q953e4641k08963k85089G0052
11175I8141h3286B7704h6756j61554j06652g3858j53932n728C7496J46672i0842
11163g6072B00227a1317B33989J2493H483g3893A06938A5879a19332o5961A82010
11151E6121J253a16038C33356m2413r3379b54814B02815d8542k7824a2705m9118
11140f1823B22399A6789a11192q4459A75804o3331J02250b5409n238m608A87341
11128H6091h7789A87448a76246A7250c51514A39059k1457c21014A96621f9425
11117a79303B64987b25183A65083J17818d6676B33021i3528j80147A87156C3854
$$ plain form
11106 404865 147115 382364 249096 97547 156955 325778 476130 344480 433902 -37862
11095 420429 9553 288456 -52685 170300 -133118 318938 161498 87785 81065 334278 425268
11084 425268 299573 78130 202483 224524 299204 316337 285567 238699 497411 240269 249651
11073 249651 -75414 321611 556949 146362 234771 435161 225750 110048 277652 306652
11063 306652 683989 381834 158407 352923 373739 672601 513210 467477 572790 709960
11053 709960 812251 691565 625894 857415 637389 708258 571907 1234342 956670 591732
11043 591732 916692 656553 854885 1046760 399599 926883 776060 612271 1011710 979833
11033 979833 1126635 240114 493458 634140 678696 796314 341113 830823 715337 704416
$$ packed form
11106D04865A47115K35249j33268I7547N9408J68823J50352j31650Q9422c7862
11095D20429I553K78903e2685A70300a33118C18938j57440p3713o720K53213R0990
11084D25268j25695G8130J24353K2041P4680J7133l0770m6868K58712B40269R382
11073B49651g5414C21611K35338A46362Q8409K00390k09411A10048J67604K9000
11063C06652L77337l02155A58407J94516K0816K98862j59391m5733J05313J37170
11053G09960J02291j20686o5671K31521k20026P0869j36351O62435k77672l64938
11043E91732L24960k60139J98332J91875C99599N27284j50823j63789L99439l1877
11033I79833J46802B40114K53344J40682M4556J17618C41113M89710j15486j0921
$$ plain form
11023 704416 942322 774617 601388 594490 809473 625214 580754 744775 303155 649591
11013 649591 251709 482062 499259 698339 544955 835828 536943 524863 739704 339521
11002 382816 614210 732941 477048 807069 790110 674048 819100 749982 649132 960182
10992 960182 660960 633845 748239 762845 844041 1179182 1191559 652272 1168961 1224814
10982 1224814 1044852 976290 1387999 1233494 1325540 1886631 1988127 1728775 2415878 2462838
10972 2462838 2785562 2810194 2772002 2313592 2760460 2612207 2151270 1873030 2016091 1844096
10962 1844096 1476338 1768576 1744474 1639964 1428769 1592200 1683100 1618093 1263744 1286518
10952 1286518 998061 1193623 879904 586913 537069 256375 401061 422985 290173 404753
$$ packed form
11023G04416K37906j67705j73229o898K14983j84259m4460J64021C03155L46436
11013F49591B51709K30353J7197J99080j53384K90873k98885j2080K14841C39521
11002C82816K31394J18731k55893L30021j6959j16062J45052o9118j00850L11050
10992I60182k99222k7115J14394J4606Q1196L35141J2377n39287N16689N5853
10982A224814j79962o8562M11709j54505R2046N61091J01496k59352O87103M6960
10972B462838L22724K4632l8192m58410M46868j48253m60937k78240J43061j71995
10962A844096l67758K92238k4102j04510k11195J63431R0900o5007l54349K2774
10952A286518k88457J95562l13719k92991m9844B56375J44686K1924j32812J14580
$$ plain form
10942 404753 347921 675510 346052 5484 -88659 -48389 -54234 584968 204780 108906 -30817
10930 -271924 84639 17010 358809 21998 4951 -130880 -5531 -98037 147375 335807 -7439
10918 -67127 62489 67933 222209 -191091 -31242 -131858 7813 188072 -3008 -267886 99797
10906 -268746 -123846 -52842 -131548 -176144 265647 145189 265632 228673 -17753 51161 128730
10895 128730 63375 268440 465677 -141283 169380 14587 56019 -38013 147952 -54299
10884 55540 -81557 -479532 -188748 -44365 70319 -273318 48954 98630 -310903 -89116 224838
10872 -304112 146569 -268971 139427 125430 498664 -368723 -124864 -152801 262302 -67789
10861 288955 -134704 292816 8963 -15931 75585 -156326 -212764 166213 190426 113384 -224675
$$ packed form
10942D04753n6832L27589l29458E484h8659M0270n845E84968B04780r5874c0817
10930b71924H4639A7010L41799B1998D951a30880e531r2506A47375J88432g439
10918f7127F2489N444J54276a91091c1242j00616G813J80259c008k64878I9797
10906b68746a23846e2842p8706m4596B65647j20458J20443l6959a7753E1161P7569
10895A28730F3375K05065J97237a41283A69380A4587M1432c8013A47952e4299
10884E5540h1557l97975a88748d4365G0319b73318D8954M9676c10903h9116B24838
10872c04112A46569b68971A39427j3997L73234c68723a24864k7937B62302f7789
10861B88955a34704B92816H963a5931G5585a56326n6438A66213K4213p7042b24675
$$ plain form
10849 -35918 -6149 110296 -4977 -357844 -77815 43200 2021 85979 -54212 -64059 155952 35004
10836 19582 59704 153683 61872 56227 82413 -134731 -44837 -167936 -93368 -14404 -5413 -335910
10824 -335910 -74114 -2386 307549 87556 -21256 239924 78944 99800 -369364 -185063 67324
10812 -179940 -13587 165054 -104009 149750 178577 -126370 -40197 -178708 278322 68396
10801 93547 -146871 -28510 -69613 -23185 -334001 -123167 -111733 54902 46293 77450 486009
10790 486009 67813 -410263 -90001 -182570 133208 -298063 -213037 -22120 -302721 -1235 -409883
10779 -409883 24491 -208351 -74293 -42784 -4226 46506 -78321 149025 220149 80920 -257029
10767 -39546 144630 175430 -30072 -2758 3297 -152340 -67714 -51576 -148725 80277 257159
$$ packed form
10849c5918f149A10296d977l52867g7815D3200B021Q3958e4212r847A55952C5004
10836A9582M0122R3979F1872n645K6186a34731d4837j23099P4568a4404e413l30497
10824c35910g4114b386C07549H7556b1256B39924G8944K0856c69364J84301F7324
10812a79940a3587A65054a04009A49750K8827a26370d0197j38511B78322F8396
10801I3547a46871b8510m1103b3185l10816a23167J1434E4902q609L1157M08559
10790D86009F7813d10263i0001r2569A33208b98063Q5026b2120k80601a235m08648
10779d09883B4491b08351g4293L1509d226D6506g8321A49025P1124H0920b57029
10767c9546A44630L0800c0072b758C297a52340f7714J6138r7149H0277J76882
$$ plain form
10756 257159 112793 -165492 80823 -313963 -20662 -151193 -25095 -13147 -237560 -138133
10746 -138133 220814 50008 -327215 72549 8401 -338343 76900 105182 -37929 94572 220627
10735 220627 171140 -23046 -88504 -326629 -75848 -108598 292197 -288078 6653 -50749 -220997
10724 -220997 -150175 -263115 -189527 -44185 43836 33601 132876 -199267 -326486 184101 -164715
10712 -34773 -26591 150242 27250 -126613 -162871 -294175 237341 -55924 -167360 243488 265867
10701 265867 -185245 -274132 -407046 6852 85703 102419 -255552 -115990 -166615 38946 -10363
10689 -61103 -305485 -322091 169978 69085 -112759 27187 -9367 -59157 60528 -164259 -72394
10677 183970 -69159 16068 186840 -325476 322188 99362 -75218 261349 -3344 -135927 55334
$$ packed form
10756B57159A12793a65492H0823c13963b0662j30531b5095J1948k24413R9427
10746a38133B20814E0008c27215G2549H401c38343G6900K8282c7929I4572J26055
10735B20627m9487b3046o5458k38125g5848l2750B92197b88078F653e0749j70248
10724b20997P0822j12940P3588d4185D3836j0235R9275a99267j27219A84101a64715
10712c4773Q182A50242B7250a26613l6258j31304B37341e5924j11436B43488K2379
10701B65867a85245q8887j32914F852P8851J6716b55552a15990n0625C8946a0363
10689f1103k44382j6606A69978F9085a12759B7187i367m9790F0528a64259g2394
10677A83970f9159A6068J70772c25476C22188I9362g5218B61349c344j32583E5334
$$ plain form
10665 -157450 -645533 26048 -241070 137991 166562 -30215 -239329 64704 -129648 -147335
10655 -147335 -170988 275221 160125 12019 -245915 -132065 -256354 30299 109315 -213037
10644 -205517 20699 153536 49889 -268818 -21512 457174 -43426 -138575 151046 -46125 90861
10632 -307514 110002 -251312 80473 -36919 45979 -24380 -54078 24793 -134654 -124862 31872
10620 -122087 70356 -2899 355337 -123959 89827 268269 -191487 48340 116923 55990 -186919
10608 -115859 -142232 19512 875 -60987 -175695 455108 -240758 137071 -38003 -274813 -194571
10597 -194571 126962 61144 -41106 73506 166105 -240942 -159243 -189153 44946 518598 -301141
10585 -103103 -266269 -279615 -137555 -310023 -41727 -118121 -194325 -283012 20209 -116897 -108049
$$ packed form
10665a57450m88083B6048b41070A37991K8571c0215k09114F4704a29648j7687
10655a47335k3653B75221j15096A2019b45915J13850j24289C0299P9016b13037
10644b05517B0699J32837D9889b68818b1512D57174d3426r5149A51046d6125I0861
10632c07514A10002b51312H0473c6919D5979b4380k9698B4793a34654R792C1872
10620a22087G0356b899C55337a23959H9827J78442a91487D8340O8583E5990a86919
10608a15859k6373A9512H75f0987j14708D55108b40758A37071c8003k36810Q0242
10597a94571A26962F1144d1106G3506R2599b40942Q1699k9910D4946M73652c01141
10585a03103j63166j3346a37555j72468d1727p6394p6204q8687B0209a16897Q848
$$ plain form
10574 -108049 25590 131944 -282656 -43015 -281883 -324887 -141951 54996 60757 204005 137428
10563 137428 399740 70787 -114168 80008 50172 148469 250034 -107043 94322 324171
10553 324171 100111 105487 91684 97368 328278 -151817 199583 -253646 -25157 -216864 -250501
10542 -250501 -277647 121874 -207243 153693 -166235 -22581 231876 -172644 -118817 -455359
10532 -455359 101381 47511 -21851 38419 23868 -141923 301994 166856 -325486 121909
10521 26289 184246 -107077 -92402 -113077 -77594 340468 233967 79104 7783 -75278 -245872
10510 -245872 -210374 -178595 -19790 57284 -87729 36061 245014 -302458 -345885 -149072 -23751
10498 11230 -1712 393051 -164668 -194504 186223 235001 -525623 -71382 -275885 295827 -46422
$$ packed form
10574a08049B5590J06354b82656d3015k38868m3004a41951E4996N761J43248o6577
10563A37428K62312G0787a14168H0008k9836R8297J01565a07043I4322K29849
10553C24171A00111N376j3803N684K30910a51817A99583b53646b5157j91707l3637
10542b50501k7146A21874b07243A53693a66235b2581B31876a72644N3827l36542
10532d55359A01381D7511b1851C8419j4551a41923C01994j35138c25486A21909
10521B6289J57957a07077J4675k0675L5483C40468j06501G9104G783g5278j70594
10510b45872L5498L1779a9790E7284h7729C6061K08953c02458m3427a49072b3751
10498A1230a712C93051a64668k9836A86223M8778e25623g1382k04503B95827d6422
$$ plain form
10486 28385 16573 -56296 -79178 -283556 386886 412392 363607 341579 142679 473020 186964
10474 80712 -59999 383293 39922 -283731 72512 211202 148261 -378504 19318 -7046 343118
10462 -250837 -200112 160680 108551 35197 35768 -199427 82203 342426 231991 344119 -79557
10450 -42089 -144427 123400 -203376 350894 142824 -672821 -10253 -183663 -107220 383485
10439 -64527 -24289 300301 -706396 -183121 75702 9481 197918 242301 -191052 12192 -51045
10427 -25746 -126939 70949 190409 -245212 -96149 -34799 -185973 -600313 129979 -109134
10416 226402 -80653 70690 430338 -1974 30295 10546 -327821 136547 216288 -63799 281514
10404 -238797 -47483 324169 -127587 -30112 -54994 41537 -345109 120332 -153211 276279
$$ packed form
10486B8385j1812e6296k2882k04378C86886K5506m8785k2028A42679L30341A86964
10474H0712e9999C83293C9922b83731G2512J38690o2941c78504A9318g046C43118
10462b50837N0725A60680n2129C5197N71a99427H2203K60223j10435J12128g9557
10450d2089j02338A23400b03376C50894A42824f72821a0253j73410P6443C83485
10439f4527b4289C00301g06396a83121G5702I481J88437M4383a91052A2192e1045
10427b5746j01193G0949J19460b45212i6149c4799j51174m14340A29979a09134
10416B26402h0653G0690L59648a974C0295A0546c27821A36547P9741f3799B81514
10404b38797d7483C24169a27587c0112k4882D1537c45109A20332a53211B76279
$$ plain form
10393 153730 -187834 203765 217696 284604 98570 128251 242384 -39624 -22393 -207105 -169087
10382 -169087 -132420 17365 10021 224734 -382472 322671 -174779 251950 167911 61266 388157
10371 388157 165162 40942 290848 263943 624665 482330 595236 521731 52230 324364
10361 324364 104841 188488 407152 51947 169097 78073 43346 801991 415167 329129
10351 329129 364926 643151 514381 327274 222671 265917 143815 454645 571785 163258
10340 58744 123776 212939 82438 -12360 266404 145967 239025 56886 237529 244583 240339
10329 240339 31621 251868 -208258 107535 51853 77790 121670 330912 270089 -122735
10318 124499 -86193 -24548 141074 -25618 46007 -102943 207896 -65187 47462 -11683 74262
$$ packed form
10393A53730a87834B03765J3931O6908I8570K9681J14133c9624J7231j84712L8018
10382a69087L6667A7365p344K14713c82472C22671a74779B51950q4039F1266L26891
10371C88157A65162D0942K49906k6905L60722j42335J12906p3505E2230K72134
10361C24364A04841Q3647K18664E1947J17150G8073l4727P58645l86824q6038
10351C29129L5797K78225j28770j87107j04603M3246j22102L10830J17140A63258
10340E8744O5032Q9163H2438a2360B66404j20437R3058E6886J80643P054m244
10329B40339C1621K20247b08258A07535E1853K5937M3880K09242o0823a22735
10318A24499h6193b4548A41074b5618D6007a02943B07896f5187D7462a1683G4262
$$ plain form
10306 169683 147677 -290512 -320905 -68164 -2030 -323761 -56582 95319 -260066 425294 162125
10294 54719 196087 83729 50208 -273275 -208548 323359 -25853 -185292 -256906 -177541 344058
10282 18035 97758 24901 199555 -18079 221797 -149951 42986 -56601 -146476 -222109 163611
10270 177715 144409 63782 -225724 -81965 -29691 -66971 457525 57078 146866 276190 224772
10259 224772 313180 -13532 192926 194813 297916 -68720 -43725 -88744 45612 89554 -101628
10247 167564 -146196 -304730 202338 -452418 -378465 86392 175590 357179 -105258 -117690
10237 -117690 -285935 125576 18588 9348 -3558 -274714 -304754 290221 -75847 -34019 176398
10225 -54062 -136064 -14786 18700 -99629 164305 164501 -51833 -237078 -160439 264861 -413321
$$ packed form
10306A69683k2006b90512l0393f8164b030l21731e6582I5319b60066D25294A62125
10294E4719J41368H3729l3521b73275O4727C23359b5853j59439p1614P9365C44058
10282A8035P9723B4901J74654a8079B21797a49951D2986e6601q9875p5633A63611
10270A77715l3306F3782b25724h1965b9691l7280D57525E7078Q9788J29324n1418
10259B24772Q8408a3532A92926J887J03103f8720K4995m5019D5612M3942a01628
10247A67564a46196j58534B02338d52418P3953H6392Q9198J81589a05258j2432
10237a17690j68245A25576A8588r240c558k71156l0040B90221g5847c4019A76398
10225e4062q2002a4786A8700i9629A64305J96e1833j85245P6639B64861d13321
$$ plain form
10213 66343 -80904 -146535 19058 -231729 -170677 -64561 -290411 -278729 212003 -156232 144725
10201 311797 -5989 -46698 -55681 186787 -94547 -354521 -66187 -6510 -74175 -204590 162105
10189 199637 -141624 -125293 128220 -54995 43982 28008 5403 -98133 -129732 -158492 -264418
10178 -264418 -312510 -347202 36844 -155473 38108 -485605 -60792 -108869 -102351 -141195 -330763
10167 -330763 -536242 129102 62176 -170686 287047 -26801 -117712 156080 3165 -148857
10156 -228023 -61367 33300 -58381 -145794 -63663 -96659 200638 -30141 -33745 112380 -94180
10144 -126202 -320822 -5810 107033 -192262 99536 -125036 -44765 90385 114448 -197387 -29574
10132 -212533 -306822 -389978 -44695 12768 -86413 25818 114178 -24080 -332290 -199458 -199043
$$ packed form
10213F6343h0904o5631A9058b31729O1052f4561k25850J1682B12003a56232A44725
10201C11797e989m0709q983A86787i4547k59974f6187f510o7665j30415A62105
10189A99637a41624J6331A28220e4995D3982j5974E403i8133l1599k8760j05926
10178b64418m8092l4692C6844a55473C8108d85605f0792m8077O518l8844j89568
10167c30763k05479A29102F2176a70686B87047b6801r0911A56080C165a48857
10156b28023f1367C3300e8381q7413f3663l2996B00638c0141l604A12380i4180
10144a26202j94620e810A07033a92262I9536a25036d4765I0385K4063a97387b9574
10132b12533r4289q3156d4695A2768h6413B5818Q8360b4080l08210J32832M15
$$ plain form
10121 -199043 -1415 137297 30651 -75604 227227 -383052 -46987 -259625 -278096 -104274 -79538
10110 -79538 57638 -123243 25995 -90338 18959 -225944 -243306 -274470 36808 186176 -122021
10098 -192241 -140018 -133271 -310651 226193 -231962 36021 183703 32755 -449199 -99524 -83268
10087 -83268 -52507 -150166 -17941 -242735 -284901 -2784 81736 -522359 -178575 76139 127959
10076 127959 -191278 -200998 111706 4838 -272115 39847 -55447 56367 -150664 -54744 96564
10064 -261046 -14367 260734 126593 23825 -265375 -400659 35437 119183 -377201 -130377
10053 -169174 -246112 83221 -261663 -211810 319959 117489 61868 -153446 -124929 -98581 -165916
10042 -165916 103488 -245899 263556 -168039 131379 -60633 101155 -127613 160081 -50732
$$ packed form
10121a99043a415A37297C0651g5604B27227c83052d6987k12638j8471a04274K4736
10110g9538E7638a23243B5995i0338A8959b25944j7362l1164C6808J49368a22021
10098a92241N2223O747j77380B26193b31962C6021J47682C2755d49199i9524J6256
10087h3268L0761r7659a7941k24794m2166b784H1736e22359a78575G6139N1820
10076A27959a91278r720A11706D838b72115C9847e5447E6367a50664e4744I6564
10064b61046a4367B60734A26593B3825b65375j35284C5437Q3746c77201a30377
10053a69174p6938H3221b61663M9853C19959A17489n5621a53446K8517K6348o7335
10042a65916A03488b45899B63556a68039A31379f0633A01155a27613A60081e0732
$$ plain form
10031 179521 308613 -26821 151851 310601 -127904 -162118 6565 -201079 49404 -208529
10020 85767 -332542 26843 -83989 -30028 92186 344770 235008 214132 -365143 -124399 1312
10008 -245477 -212939 73995 -401609 99833 32160 326798 64658 -153491 -128107 -143906 38518
9996 111844 -193765 -22301 -181941 -322067 25823 390652 -10545 351466 -174121 -100662
9986 -100662 -47209 -30005 -371046 -123274 -7476 -244644 -210347 -222532 -273668 103334 -77860
9974 -30244 -88072 -165007 -109165 93676 -101597 -46372 -373642 -259644 17707 -164849 -84350
9963 -84350 142754 -170487 -125690 -98024 -53573 45999 51781 -159164 -409062 -325329 337673
9951 352223 -155622 34656 -85382 -445967 -142459 -254233 -287915 -124400 -117930 -5105 -351895
$$ packed form
10031A79521J29092b6821A51851J58750a27904l4214F565b01079D9404b08529
10020H5767c32542B6843h3989c0028I2186K52584j09762k0876c65143a24399A312
10008b45477L2538G3995d01609I9833C2160K94638F4658a53491K5384j5799C8518
9996A11844a93765b2301j59640j40126B5823L64829a0545C51466a74121P3459
9986a00662d7209J7204l41041a23274g476k37168L4297j2185n1136A03334g7860
9974c0244n7828p6935N5842I3676a01597d6372l27270J13998A7707a64849Q0499
9963h4350A42754a70487M4797K7666M4451D5999N782a59164k49898Q3733C37673
9951C52223a55622C4656h5382l60585a42459j11774l3682a24400O470e105l46790
$$ plain form
9940 -351895 -48021 -59091 -195247 32597 -308165 -243047 160677 -79174 -218690 117890 -3947
9928 -127948 160396 -210681 -257032 181600 -39805 -3738 -53552 -278261 -258972 -120130 80438
9916 328376 98888 -318297 -255384 133288 15011 188331 49725 -80548 -75019 -50432 -425405
9905 -425405 -63871 -407226 -209558 -137154 -115212 55541 -158535 -267807 -1037 38390 -71861
9893 -57858 -301724 11555 22258 95985 66221 -367637 20128 -286320 -157256 177450 -67953
9881 -195991 120448 -220595 85777 269907 -380940 74556 43508 -79049 -34128 -309647 -154247
9869 47482 -72608 -250642 -157687 148707 -54353 -155248 -152480 -324688 -104756 63223 -215052
9857 30162 -172113 -212672 18458 -99596 -319751 -50035 167851 -14503 -159802 -99763 -165773
$$ packed form
9940c51895d8021j1070j36156C2597c08165O5118A60677g9174j39516A17890c947
9928a27948A60396b10681m6351A81600c9805c738m9814k24709J9289a20130H0438
9916C28376I8888c18297O2913A33288A5011J73320D9725h0548N529K4587l74973
9905d25405f3871l43355J97668P2404K1942E5541a58535j09272a037C8390g1861
9893e7858k43866A1555J0703P3727k9764c67637B0128b86320J29064A77450f7953
9881a95991A20448b20595H5777J84130c80940G4556l1048g9049c4128k75519a54247
9869D7482g2608j78034R2955A48707e4353j00895K768j72208a04756F3223b15052
9857C0162a72113m0559A8458i9596k20155e0035A67851a4503j45299O0039o6010
$$ plain form
9846 -165773 203526 -7576 -42054 23200 -52732 -102571 -144186 388874 -59539 10434 255809
9835 255809 -40225 29886 -95778 64850 -82745 38822 121106 -636123 -132746 -213656 -84288
9823 -87954 17893 -73 -282544 441408 -80548 -310909 -176499 168802 -339232 -32368 24217
9811 -54230 -183657 -94535 -148833 153204 -47353 179886 -189522 -239212 143687 116321 116397
9800 116397 -300798 -8172 -200466 -115773 -66837 160787 132368 -90673 -219754 -215322 -54988
9788 -509507 -141524 299918 -193336 139769 -171737 -191708 92139 -109097 234458 -308612
9777 89708 -55069 198632 -20204 221708 -408954 -205432 -47457 -119463 -360458 285667 -197463
9765 358581 -100819 -202434 193726 -86489 68314 -168820 -28593 109343 269623 -429112
$$ packed form
9846a65773B03526g576l4478B3200e2732m9839m1615C88874e9539A0434K45375
9835B55809d0225B9886i5778F4850h2745C8822Q2284f36123a32746q0910h4288
9823h7954A7893g3k82471D41408h0548k30361J34410A68802c39232c2368B4217
9811e4230j29427Q9122n4298A53204d7353A79886a89522m9690A43687k7366P6
9800A16397c00798h172j92294Q4693M8936A60787k8419i0673j29081M432e4988
9788e09507a41524B99918a93336A39769a71737j9971I2139a09097B34458c08612
9777H9708e5069A98632b0204B21708d08954K03522d7457p2006k40995B85667a97463
9765C58581a00819j01615A93726h6489F8314a68820b8593A09343J60280d29112
$$ plain form
9754 -7664 -268617 120242 -11616 142947 -379014 -199512 94806 204704 121962 28447 12814
9742 54719 -54223 -202441 82419 -187327 -319389 15364 -18575 -206707 -58941 -175459 176608
9730 -213971 46448 124578 -382951 -227007 -19254 127931 79785 216233 -104463 -10573 79601
9718 302469 58827 -172754 -198747 -100650 181076 -63630 -242318 -143774 189137 -129644 -154735
9707 -154735 -77998 -4778 -197792 -147710 -101008 -260594 -194412 -82597 -67336 -66955 21436 -245550
9694 279135 -77254 -168588 -170023 -131319 -23058 59170 41311 -102413 62435 -205153 -386299
9683 -386299 242524 -136580 28929 229505 -30586 -21598 228028 73300 -258810 394566 -168306
9671 -125098 -63666 -370710 -118824 164689 295151 -317681 252619 -307292 -240660 155516
$$ packed form
9754g664k60953A20242a1616A42947c79014J79502I4806J09898q2742B8447A2814
9742E4719e4223j48218H2419a87327j32062A5364a8575j88132e8941j16518A76608
9730b13971D6448P8130c82951J55944a9254A27931m8146J36448a04463a0573G9601
9718C02469E8827a72754k5993R8097A81076f3630j78688R8544A89137a29644k5091
9707a54735P6737d778j93014N0082M6702j59586O6182h2597J5261L81B1436b45550
9694B79135g7254r1334j435L8704b3058E9170j7859a02413F2435b05153j81146
9683c86299B42524a36580B8929K00576c0586Q988B28028G3300b58810C94566a68306
9671a25098O1432l07044a18824A64689J30462c17681B52619c07292O6632A55516
$$ plain form
9660 -204127 -247002 116370 71946 89909 -176553 150665 47604 -332914 41890 66558 -31524
9648 101937 223527 90055 -228148 -55838 157577 52060 -499050 128667 -334614 224566
9637 -125661 73435 -83250 -221803 36480 13731 -16808 -310382 -161816 164274 79335 -312932
9625 -299899 320841 -20285 -185825 -263143 -313843 -14156 -41081 -28206 227439 -227541 214269
9613 51755 20930 -1338 -16312 -62789 -396160 -84134 46538 -106038 -21639 -220933 90473
9601 -223246 -21301 45331 -53571 66913 -13633 -69497 -24670 -209030 196607 47952 -315517
9589 -242923 -147274 -211374 -415375 -119954 -3515 -66063 119117 -416575 65324 -192544 -136380
9578 -136380 -264104 -316037 -93240 -459493 -269492 153775 5730 -40572 -9343 -17959 -49091
$$ packed form
9660b04127m2875A16370m4424J7963a76553A50665D7604c32914D1890K4668c1524
9648A01937J21590I0055b28148e5838A57577E2060d99050A28667c34614B24566
9637a25661G3435h3250j38553C6480A3731a6808k93574J48566A64274G9335c12932
9625b99899C20841b0285j65540p7318n0700a4156k6925J2875B27439b27541B14269
9613E1755B0930a338j4974m6477l33371h4134D6538a06038b1639j99294I0473
9601b23246b1301D5331e3571F6913a3633n5864b4670j84360A96607D7952c15517
9589b42923R5649o4100k04001a19954c515o2548A19117d16575F5324a92544N6164
9578a36380j27724n1933i3240l66253J90001A53775E730d0572i343q616l1132
$$ plain form
9567 -49091 -140927 265390 -206851 -276321 -175431 231999 35489 -185711 -94264 -120693 -155338
9556 -155338 -183695 -19428 -187635 -144394 -353737 -197097 178920 -41491 -209036 -211744 63174
9544 -262436 -321420 -80021 27792 125389 -20041 -218697 226209 -25905 106493 -276713 -402933
9533 -402933 -73817 -373470 56680 -315264 -293020 113278 -58659 -126260 -454519 -13954 -204471
9522 -204471 -147437 74981 -119515 -20293 5137 -63305 -133713 -280436 -175581 -164460 33076
9510 71000 -96878 -234628 515599 -214678 -201039 -362867 -234361 -367398 27750 93112 -55302
9498 46940 -21477 -206594 -1966 -93583 33910 77918 -462198 -89095 -381791 147317 104577
9487 104577 -271171 -249414 -166302 -193622 -55027 -331922 294424 63354 165553 162126 -198422
$$ packed form
9567d9091r1836B65390b06851o9470J00890B31999C5489a85711R1447k6429l4645
9556a55338k8357a9428j68207M3241k09343J56640A78920d1491j67545k708F3174
9544b62436n8984h0021B7792R7597b0041j98656B26209b5905A06493b76713j26220
9533d02933g3817k99653E6680c15264K2244A13278e8659o7601l28259a3954j90517
9522b04471N7034G4981a19515b0293E137f3305p0408j46723J04855J1121C3076
9510G1000i6878j37750E15599b14678J3639j61828J28506j33037B7750O5362e5302
9498D6940b1477j85117a966r1617C3910M4008d62198h9095k92696A47317m2740
9487A04577b71171K1757Q3112k7320e5027k76895B94424F3354J02199l427a98422
$$ plain form
9475 106153 118474 -10307 -37539 140581 -53890 -328976 322933 91666 65287 -136670 -96322
9464 -96322 -171160 148750 -205030 -51384 -251420 104541 -282395 348393 -421712 64794
9453 -123139 -27558 -10689 153793 -17680 -49880 -44720 -232679 -310133 -277675 318660 -97907
9441 -144629 -89125 75425 43516 -216473 251478 -177947 -141268 -110845 253724 3082 103592
9430 103592 -274123 -20933 -57572 -145057 55250 -118562 100926 -275900 -21735 -33598 118642
9418 -326424 74066 195434 -138523 131234 39895 254667 -110803 -263927 359400 170612
9407 -264039 284950 -131628 4416 165827 -233907 -75840 -85447 -360161 -207856 -328574 224274
9395 -7296 -141961 63502 3778 -21955 196314 -265012 217800 284258 12671 113657 -27649
$$ packed form
9475A06153J2321a0307k7232A40581e3890k75086C22933I1666k6379a36670M0348
9464i6322p4838A48750b05030e1384k00036A04541b82395C48393d21712F4794
9453a23139b7558a0689A53793a7680l2200N160j87959p7454L2458C18660i7907
9441a44629N5504G5425l1909b16473B51478a77947L6679L0423B53724C082J00510
9430A03592b74123b0933l6639q7485E5250a18562A00926b75900b1735j1863A18642
9418c26424G4066J21368a38523A31234C9895K14772a10803j53124C59400A70612
9407b64039B84950a31628D416J61411b33907g5840r607k74714J52305j20718B24274
9395g296j34665F3502C778b1955A96314b65012B17800O6458A2671J00986b7649
$$ plain form
9383 -147547 -418535 5883 -88560 9086 -165298 -30251 -21834 26537 -21674 -220277 23390 20318
9371 20318 -186082 197173 -33775 135872 -389801 -341827 62440 -180164 -225422 97163 -133660
9359 -177450 -4165 195842 -456347 -361217 -536186 -151316 -159476 -19440 -59719 -310316 -35142
9347 82634 -178888 -233766 -8185 82742 -65477 -353902 67479 52648 21249 82894 10406 20953
9335 20953 110049 -106554 -163872 -142108 -153728 -372264 -12780 -29644 216151 -83599 260376
9323 -130543 95533 -307929 -88190 -144814 37652 162450 -190803 -117525 -116008 -75885 -189540
9312 -189540 632790 -302140 -31597 -92180 -301206 -236161 -28597 -179899 48399 21005 -267890
9300 -346783 -40247 -86401 -315038 351708 131256 -105324 62815 -113709 28640 -194599
$$ packed form
9383a47547k70988E883h8560I086a65298c0251Q417B6537b1674j98603B3390l072
9371B0318a86082A97173c3775A35872c89801M7974F2440a80164m5258I7163a33660
9359a77450d165A95842d56347R5130j74969a51316q160a9440m0279k50597c5142
9347H2634a78888n4878h185H2742f5477k88425F7479j4831B1249O1645A0406J0547
9335B0953Q9096a06554n7318K1764j1620k18536a2780j6864B16151h3599B60376
9323a30543I5533c07929h8190n6624C7652J24798a90803P3278J517M0123j13655
9312a89540F32790c02140c1597o0583k09026O5045b8597j51302D8399B1005b67890
9300c46783d0247m6154k28637C51708A31256a05324F2815a13709B8640a94599
$$ plain form
9289 -339100 -108859 406196 592543 -71621 175829 16764 -244872 -200980 -90144 -224013
9279 -224013 190319 -317548 -375963 -147643 11730 -142793 -415482 -314711 -232097 -386919
9269 -386919 121485 366895 160780 21170 143123 141560 -122127 -20477 -170074 20863 193364
9258 193364 -208603 189162 112306 108430 -611161 -133116 -135550 29606 -107859 393756 199134
9247 199134 -148795 -130903 35930 73444 -137634 -25610 149055 -104079 -205922 334352
9236 35873 271847 -151433 -58939 -195037 106113 216245 -77202 161729 48009 -73519 -74932
9225 -74932 -23659 -104970 -109684 155946 75361 141016 74302 73225 -213389 -123964 -242254 -249892
9213 -249892 127 -139350 -248251 277153 49402 -105900 -143960 -219856 42331 -13531 -15002
$$ packed form
9289c39100a08859D06196J86347g1621A75829A6764b44872M3892i0144j33869
9279b24013A90319c17548n8415a47643A1730a42793k72689J00771Q2614j54822
9269c86919A21485K45410A60780B1170J21953j563a22127b0477j49597B0863J72501
9258A93364b08603A89162p6856l876f11161a33116k434B9606a07859C93756j94622
9247A99134a48795J7892C5930L7514a37634b5610A49055a04079j01843C34352
9236C5873K35974a51433e8939j36098A06113J10132g7202A61729D8009g3519j413
9225g4932b3659q1311m714A55946G5361O5655o6714j077b13389Q9425j18290p638
9213b49892A27a39350j08901B77153D9402a05900l8060p5896D2331a3531j471
$$ plain form
9202 -15002 -99359 -348793 -138933 402584 114303 -132924 -110626 222275 -255657 169278
9191 80391 -265541 -247295 -94305 -232426 -39256 -411872 68851 -114452 -375707 -10266 -353652
9180 -353652 -135913 -126728 -277262 -69772 261141 -291481 -29969 -180670 -288692 -154764
9170 -154764 -245548 -147905 100148 -174209 -328355 -313120 -314754 -352529 25771 -446021 -216461
9158 6772 70618 -88969 -139826 -235067 350863 169444 -285282 -294982 -77411 -35318 -94665 -164740
9146 -164740 -464921 161819 -217174 79912 44398 -227453 -399841 221831 -96825 120883
9135 -87494 39219 -157834 -449399 78642 -153358 240310 -135252 33173 -10722 -104659 126538
9123 -34273 161306 -12056 21000 -237203 165492 -193428 72555 -112060 -122525 -148874 -129043
$$ packed form
9202a5002q4357k49434a38933D02584A14303a32924K2298B22275b55657A69278
9191H0391b65541J8246i4305j38121c9256l72616F8851a14452k61255a0266l43386
9180c53652a35913R185j50534f9772B61141b91481b9969j50701j08022J33928
9170a54764r0784R7643A00148a74209j54146J5235j634l7775B5771d46021b16461
9158F772O3846h8969n0857r5241C50863A69444b85282r700g7411c5318n9347p0075
9146a64740l00181A61819b17174G9912l5514b27453j72388B21831i6825A20883
9135h7494C9219a57834k91565G8642a53358B40310a35252C3173a0722r3937A26538
9123c4273A61306a2056B1000b37203A65492a93428G2555a12060j0465k6349J9831
$$ plain form
9112 -129043 104501 235715 98795 -420592 -88420 -7977 -52926 -154892 -223068 -390695 28900
9100 -8765 57612 -270647 286443 70724 71764 79511 1266 -82790 -104941 -314316 -132141 64344
9087 -144942 -142568 -38182 9347 -35271 -170832 -281908 -105333 283836 131861 -11076 -106601
9076 -106601 39718 -234542 208272 -261735 -67583 -77239 101906 -279187 109990 140645 -575
9064 145628 -249529 45357 178935 -240362 42507 -337257 13235 9543 127069 -234398 23143
9052 3433 -25613 -37701 -111382 -140307 53343 -244295 335548 -48045 -229618 -81475 -10584
9040 -45625 56571 -84192 -20843 -86992 261091 -120082 190284 -215438 -90256 46996 9932
9028 24022 -456168 -20841 270072 24783 190600 46282 -212703 -259599 103263 -105881 -94377
$$ packed form
9112a29043A04501J31214I8795d20592h8420g977m4949j01966o8176j67627B8900
9100h765E7612b70647B86443G0724J040P747A266h2790k2151k09375a32141F4344
9087a44942K374c8182I347c5271j35561j11076a05333B83836A31861a1076r5525
9076a06601C9718b34542B08272b61735f7583r656A01906b79187A09990L0655e75
9064A45628b49529D5357J33578b40362D2507c37257A3235l692J17526b34398B3143
9052C433b5613j2088p3681k8925E3343b44295C35548d8045j81573h1475a0584
9040d5625E6571h4192b0843o6149B61091a20082A90284b15438i0256D6996I932
9028B4022d56168b0841B70072B4783J65817D6282b12703m6896A03263a05881J1504
$$ plain form
9017 -94377 -179657 139637 -340139 158055 201003 25424 -181177 107913 97688 201875 -53327
9005 36805 -282378 -134900 36657 178261 185481 258395 6287 125904 331758 -71120 224210
8993 187439 -172183 72309 -74225 23703 116673 -204050 -385944 -83400 86978 265349 -158026
8981 -117268 134588 92504 -14681 -42811 -211452 152063 -180642 315912 -235932 -88565
8970 -210525 -72120 -199304 -14162 -11660 200075 -58636 -71507 -271508 -216333 53986 -37875
8958 -441622 -312701 -13335 37815 -10802 -262024 -204363 -107629 -25558 -348884 -162722 63774
8946 126121 -69594 20986 197130 76347 -252378 389501 -509265 -126777 271608 397115
8936 397115 -290640 32175 16793 -147139 40228 -9745 157546 25444 -44122 -59943 86722
$$ packed form
9017i4377q5280A39637c40139A58055M2948B5424a81177A07913j0225J04187e3327
9005C6805b82378a34900C6657J41604P220P2914F287J19617K05854g1120B24210
8993A87439a72183G2309g4225B3703R2970b04050j81894h3400H6978J78371a58026
8981a17268A34588m2084a4681k8130j68641A52063a80642C15912b35932h8565
8970b10525g2120j27184a4162K502B00075e8636j2871k00001N5175E3986c7875
8958d41622J28921a3335C7815a0802k51222N7661R6734b5558l23326a62722F3774
8946A26121f9594B0986J76144G6347b52378C89501e09265a26777B71608J25507
8936C97115b90640C2175j5382a47139D0228i745A57546B5444d4122j5821H6722
$$ plain form
8924 138561 836852 2184613 7938141 7012695 1881287 625309 290736 136178 -253882
8914 40073 78587 34074 -388677 97534 -144302 51874 -151446 17883 43996 -238628 242437
8902 -184124 -253196 113670 38181 -171282 -218843 -63767 124010 -49443 -54999 127848 -26468
8890 349368 -243453 -5627 364518 81863 195409 45997 66183 80332 -213508 -39654 76116
8878 -139799 -76256 18118 62825 -128729 308509 96913 -205649 129179 -153858 -50892 -166570
8867 -166570 -294449 -26971 86823 -253062 -4579 -188642 -100579 98238 225014 -49902 -155298
$$ packed form
8924A38561O98291J347761N753528r25446A881287F25309B90736A36178b53882
8914D0073L8514C4074c88677I7534a44302E1874a51446A7883K6113b38628B42437
8902a84124o9072A13670C8181a71282m7561f3767A24010d9443n556A27848b6468
8890C49368b43453e627C64518H1863J13546D5997K0186J4149b13508c9654G6116
8878a39799O3543A8118M4707a28729C08509I6913b05649A29179a53858e0892j15678
8867a66570j27879b6971H6823b53062d579j84063Q8063I8238J26776d9902j05396
$$ [...]
##END NTUPLES=NMR SPECTRUM
##END=
