
##TITLE=AC1302_PERAH12114_6535671_KetVU1Pe3j
##JCAMPDX= 6.0         $$ Bruker NMR JCAMP-DX V2.0
##DATA TYPE= NMR SPECTRUM
##DATA CLASS= NTUPLES
##ORIGIN= BRUKER
##OWNER= Administrator
$$ 1.72 TOPSPIN		Version 2.1
$$ 2012-12-11 23:35:30.738 -0500  Administrator@X
$$ Compression mode = diff/dup
##.OBSERVE FREQUENCY= 400.02188249412
##.OBSERVE NUCLEUS= ^1H
##.ACQUISITION MODE= SIMULTANEOUS (DQD)
##.ACQUISITION SCHEME= undefined
##.AVERAGES= 64
##.DIGITISER RES= 22
##SPECTROMETER/DATA SYSTEM= spect
##.PULSE SEQUENCE= noesygpps1d.comp
##.SOLVENT NAME= COFFEE_meoh
##.SHIFT REFERENCE= INTERNAL, COFFEE_meoh, 1, 14.96086
##AUDIT TRAIL= $$ (NUMBER, WHEN, WHO, WHERE, PROCESS, VERSION, WHAT)
$$ ##TITLE= Audit trail, TOPSPIN		Version 2.1
$$ ##JCAMPDX= 5.01
$$ ##ORIGIN= Bruker BioSpin GmbH
$$ ##OWNER= Administrator
$$ $$ E:\/data/COFFEE/nmr/AC1302_PERAH12114_6535671_KetVU1Pe3j/72/pdata/1/auditp.txt
$$ ##AUDIT TRAIL=  $$ (NUMBER, WHEN, WHO, WHERE, PROCESS, VERSION, WHAT)
(   1,<2012-12-11 23:35:24.582 -0500>,<Administrator>,<X>,<go>,<TOPSPIN 2.1>,
      <created by zg
	started at 2012-12-11 23:23:54.377 -0500,
	POWCHK enabled, PULCHK disabled,
       configuration hash MD5:
       86 BA 57 50 F2 9D 5C 9B 26 00 A9 28 5F 66 2E 89
       data hash MD5: 64K
       97 A0 8A 7D F6 BB EE DC 8A 56 C2 6C 9D 91 0C 93>)
(   2,<2012-12-11 23:35:27.753 -0500>,<Administrator>,<X>,<proc1d>,<TOPSPIN 2.1>,
      <Start of raw data processing
       efp LB = 0.3 FT_mod = 6 PKNL = 1 PHC0 = 0 PHC1 = 0 SI = 128K 
       data hash MD5: 128K
       19 F1 F6 8E CF 92 80 83 90 91 59 FB C8 96 5A 40>)
(   3,<2012-12-11 23:35:28.878 -0500>,<Administrator>,<X>,<proc1d>,<TOPSPIN 2.1>,
      <pk PHC0 = -80.8374 PHC1 = 0 
       data hash MD5: 128K
       A6 A0 77 5F 41 4E 68 B6 F0 23 B7 32 3D 7A F3 6C>)
(   4,<2012-12-11 23:35:29.660 -0500>,<Administrator>,<X>,<proc1d>,<TOPSPIN 2.1>,
      <abs ABSG = 1 
       data hash MD5: 128K
       A5 98 88 90 16 F1 DA DB AE A9 47 85 A2 B6 FE A1>)
(   5,<2012-12-11 23:35:29.832 -0500>,<Administrator>,<X>,<proc1d>,<TOPSPIN 2.1>,
      <abs ABSG = 2 
       data hash MD5: 128K
       36 EB A6 38 7A 94 F4 94 FD 67 35 4E 13 AB F9 27>)
(   6,<2012-12-11 23:35:30.003 -0500>,<Administrator>,<X>,<proc1d>,<TOPSPIN 2.1>,
      <abs ABSG = 3 
       data hash MD5: 128K
       EF 5D 58 8C 4C 78 97 37 9B 7F 31 5B DA 32 FB C7>)
(   7,<2012-12-11 23:35:30.191 -0500>,<Administrator>,<X>,<proc1d>,<TOPSPIN 2.1>,
      <abs ABSG = 4 
       data hash MD5: 128K
       11 D6 16 1D 78 D6 15 2B F6 C8 50 61 7B 92 01 F8>)
(   8,<2012-12-11 23:35:30.363 -0500>,<Administrator>,<X>,<proc1d>,<TOPSPIN 2.1>,
      <abs ABSG = 5 
       data hash MD5: 128K
       07 96 87 D9 31 E7 98 2D 8D 53 48 65 DC 9A AB C1>)
$$ ##END=
$$ 
$$ $$ hash MD5
$$ $$ 6E A6 1C 70 E6 34 0D 05 B7 24 E3 2D DC 59 05 64
##$RELAX= 
##$RELAX= 
##$RELAX= 
##$RELAX= 
##$RELAX= 
##$RELAX= 
##$RELAX= 
##$RELAX= 
##$RELAX= 
$$ Bruker specific parameters
$$ --------------------------
##$DU= <E:\>
##$EXPNO= 72
$$ [...]
##$TP07= 0
##$TPNAME0= <>
##$TPNAME1= <>
##$TPNAME2= <>
##$TPNAME3= <>
##$TPNAME4= <>
##$TPNAME5= <>
##$TPNAME6= <>
##$TPNAME7= <>
##$TPOAL= (0..7)
0.5 0.5 0.5 0.5 0.5 0.5 0.5 0.5
##$TPOFFS= (0..7)
0 0 0 0 0 0 0 0
##$TUNHIN= 0
##$TUNHOUT= 0
##$TUNXOUT= 0
##$USERA1= <user>
##$USERA2= <user>
##$USERA3= <user>
##$USERA4= <user>
##$USERA5= <user>
##$V9= 5
##$VALIST= <valist>
##$VCLIST= <CCCCCCCCCCCCCCC>
##$VD= 0
##$VDLIST= <DDDDDDDDDDDDDDD>
##$VPLIST= <PPPPPPPPPPPPPPP>
##$VTLIST= <TTTTTTTTTTTTTTT>
##$WBST= 2048
##$WBSW= 25
##$XGAIN= (0..3)
0 0 0 0
##$XL= 0
##$YL= 0
##$YMAX_a= 6389271
##$YMIN_a= -13119611
##$ZGOPTNS= <>
##$ZL1= 120
##$ZL2= 120
##$ZL3= 120
##$ZL4= 120
##$ABSF1= 14.96086
##$ABSF2= -5.597322
##$ABSG= 5
##$ABSL= 3
##$ALPHA= 0
##$AQORDER= 0
##$ASSFAC= 0
##$ASSFACI= 0
##$ASSFACX= 0
##$ASSWID= 0
##$AUNMP= <proc_prof1d_extract.lims>
##$AXLEFT= 0
##$AXNAME= <>
##$AXNUC= <1H>
##$AXRIGHT= 0
##$AXTYPE= 0
##$AXUNIT= <>
##$AZFE= 0.1
##$AZFW= 0.1
##$BCFW= 0
##$BC_mod= 0
##$BYTORDP= 0
##$COROFFS= 0
##$CY= 15
##$DATMOD= 1
##$DC= 0
##$DFILT= <>
##$DTYPP= 0
##$F1P= 0
##$F2P= 0
##$FCOR= 0.5
##$FTSIZE= 131072
##$FT_mod= 6
##$GAMMA= 0
##$GB= 0
##$INTBC= 1
##$INTSCL= 1
##$ISEN= 128
##$LB= 0.3
##$LEV0= 0
##$LPBIN= 0
##$MAXI= 10000
##$MC2= 0
##$MEAN= 0
##$ME_mod= 0
##$MI= 0
##$NCOEF= 0
##$NC_proc= -2
##$NLEV= 6
##$NOISF1= 0
##$NOISF2= 0
##$NSP= 0
##$NTH_PI= 0
##$NZP= 0
##$OFFSET= 14.96086
##$PC= 1
##$PHC0= -80.8374
##$PHC1= 0
##$PH_mod= 1
##$PKNL= yes
##$PPARMOD= 0
##$PPDIAG= 0
##$PPIPTYP= 0
##$PPMPNUM= 2147483647
##$PPRESOL= 1
##$PSCAL= 4
##$PSIGN= 0
##$PYNMP= <proc.py>
##$REVERSE= no
##$SF= 400.020009694084
##$SI= 131072
##$SIGF1= 0
##$SIGF2= 0
##$SINO= 400
##$SIOLD= 131072
##$SPECTYP= <>
##$SREGLST= <1H.CDCl3>
##$SSB= 0
##$STSI= 131072
##$STSR= 0
##$SW_p= 8223.68421052631
##$SYMM= 0
##$S_DEV= 0
##$TDeff= 65536
##$TDoff= 0
##$TI= <>
##$TILT= no
##$TM1= 0
##$TM2= 0
##$TOPLEV= 0
##$USERP1= <user>
##$USERP2= <user>
##$USERP3= <user>
##$USERP4= <user>
##$USERP5= <user>
##$WDW= 1
##$XDIM= 131072
##$YMAX_p= 445166838
##$YMIN_p= -17243
##$CURPLOT= <Network HP LaserJet P1505>
##$CURPRIN= <$Network HP LaserJet P1505>
##$DFORMAT= <normdp>
##$LAYOUT= <+/1D_H.xwp>
##$LFORMAT= <normlp>
##$PFORMAT= <normpl>
##$SURQMSG= 1
$$ End of Bruker specific parameters
$$ ---------------------------------
##NTUPLES= NMR SPECTRUM
##VAR_NAME=  FREQUENCY,     SPECTRUM/REAL,   SPECTRUM/IMAG
##SYMBOL=    X,             R,               I
##VAR_TYPE=  INDEPENDENT,   DEPENDENT,       DEPENDENT
##VAR_FORM=  AFFN,          ASDF,            ASDF
##VAR_DIM=   131072,        131072,          131072
##UNITS=     HZ,            ARBITRARY UNITS, ARBITRARY UNITS
##FACTOR=    0.0627417313425164, 1,          1
##FIRST=     8223.62146879497, -503,         -59053
##LAST=      0,             778,             -59635
##MIN=       0,             -17243,          0
##MAX=       8223.62146879497, 445166838,    0
$$ Real data points
##PAGE= N=1
##DATA TABLE= (X++(R..R)), XYDATA
$$ [...]
$$ plain form
63948 1268923 1386619 1518633 1665223 1825847 1999297 2183991 2378147 2579848 2787030
63939 2787030 2997418 3208344 3416341 3616769 3804010 3972444 4117464 4235690 4324586 4382353
63929 4382353 4408116 4401617 4362555 4290768 4187453 4055791 3899951 3723848 3531382 3327462
63919 3327462 3117835 2907625 2700455 2498998 2305789 2123164 1952817 1795806 1652778
63910 1652778 1523924 1408899 1307013 1217430 1139088 1070660 1010823 958541 913023 873615 839791
63899 839791 810933 785915 763196 741667 721269 702460 685145 668514 651958 635816 621074
63888 621074 608506 598196 589638 582154 575360 569480 565180 562966 562764 564230 567466 573246 582367 594805
63874 594805 609638 625851 643185 662136 683260 706551 731487 757491 784257 811670 839482
$$ packed form
63948A268923J17696J32014J46590J60624J73450J84694J94156K01701K07182
63939B787030K10388K10926K07997K00428J87241J68434J45020J18226Q8896N7767
63929D382353K5763o499l9062p1787j03315j31662j55840j76103j92466k03920
63919C327462k09627k10210k07170k01457j93209j82625j70347j57011j43028
63910A652778j28854j15025j01886q9583p8342o8428n9837n2282m5518l9408l3824
63899H39791k8858k5018k2719k1529k0398j8809j7315j6631j6556j6142j4742
63888F21074j2568j0310q558p484o794n880m300k214k02J466L236N780R121J2438
63874E94805J4833J6213J7334J8951K1124K3291K4936K6004K6766K7413K7812
$$ plain form
63863 839482 867068 893466 917704 939252 958314 975572 991378 1005032 1015031 1020295 1021091 1018490
63851 1018490 1012963 1003949 990859 974000 954163 931758 906899 880015 851638 821680 789685 755977
63839 755977 721877 688527 656142 624778 595087 567645 542057 517561 494259 472881 453448
63828 453448 435064 417282 400856 386717 374761 364042 353716 343398 333003 322869 313822 306553
63816 306553 300870 295880 290862 285747 280903 276839 274079 272797 272415 271835 270310 267948 265319 262739 260057
63801 260057 257029 253747 250697 248352 246634 244833 242230 238785 235161 232146 230187 229317 229160 228998 228190
63786 228190 226720 225133 223895 223035 222434 222040 221603 220566 218652 216427 214897 214593 215277 216461 217843 219193
63770 219193 220165 220447 220045 219318 218711 218367 218000 217242 216196 215403 215102 214824 214061 213100 212689 212997 213452 213696
$$ packed form
63863H39482K7586K6398K4238K1548J9062J7258J5806J3654R999N264P96k601
63851A018490n527r014j3090j6859j9837k2405k4859k6884k8377k9958l1995l3708
63839G55977l4100l3350l2385l1364k9691k7442k5588k4496k3302k1378j9433
63828D53448j8384j7782j6426j4139j1956j0719j0326j0318j0395j0134r047p269
63816C06553n683m990n018n115m844m064k760j282l82n80j525k362k629k580k682
63801B60057l028l282l050k345j718j801k603l445l624l015j959q70j57j62q08
63786B28190j470j587j238q60o01l94m37j037j914k225j530l04O84J184J382J350
63770B19193R72K82m02p27o07l44l67p58j046p93l01k78p63r61m11L08M55K44
$$ plain form
63752 213696 214073 214905 215850 216433 216910 218021 220004 222337 224453 226335 228261 230249 231959 233069 233698 234401
63736 234401 235661 237323 238741 239600 240391 241854 244135 246810 249563 252488 255776 259529 263893 268941 274316
63721 274316 279359 283740 287627 291047 293532 294734 295032 295105 295027 294243 292338 289447 285970 282282 278842 276198
63705 276198 274683 274207 274331 274405 273752 272242 270821 271010 273531 277577 281702 285233 288604 292622 297788 304057
63689 304057 310637 316084 319221 320298 320806 321884 323221 323803 323379 322657 322226 321812 320769 318959 316954 315499
63673 315499 314902 314902 315133 315685 317020 319199 321488 323130 324297 325659 326964 326804 324244 320159 316272 313086
63657 313086 309482 304387 298181 292233 287518 284081 281446 279098 276704 274306 272375 271380 271283 271634 272163
63642 272163 272953 274082 275399 276822 278583 280959 283989 287665 292195 297745 304037 310605 317400 324742
$$ packed form
63752B13696L77Q32R45N83M77J111J983K333K116J882J926J988J710J110O29P03
63736B34401J260J662J418Q59P91J463K281K675K753K925L288L753M364N048N375
63721B74316N043M381L887L420K485J202K98P3p8p84j905k891l477l688l440k644
63705B76198j515m76J24P4o53j510j421J89K521M046M125L531L371M018N166O269
63689C04057O580N447L137J077N08J078J337N82m24p22m31m14j043j810k005j455
63673C15499n97%K31N52J335K179K289J642J167J362J305j60k560m085l887l186
63657C13086l604n095o206n948m715l437k635k348k394k398j931r95r7L51N29
63642B72163P90J129J317J423J761K376L030L676M530N550O292O568O795P342
$$ plain form
63628 324742 332545 340096 346983 353976 362516 373374 386183 400281 415587 432414 450738 470058
63616 470058 490027 510983 533704 558641 585512 613646 642608 672248 702088 730863 756852
63605 756852 778556 794940 805332 809616 808653 804072 797424 789686 781637 774206 767962 762331 755803 747043
63591 747043 735647 721798 705571 686765 665346 641823 617256 592962 570187 549798 532080
63580 532080 516800 503577 492264 482922 475384 469055 463433 458854 456403 456859 459834 464210 469347 475610
63566 475610 483645 493365 503929 514633 525530 536959 548665 559851 570336 581347 594752 611511
63554 611511 631258 653457 678517 707532 741202 779232 820289 861896 900393 931688 952658
63543 952658 962091 960680 950593 935038 917501 900648 885734 873107 863045 855795 850884 846842
$$ packed form
63628C24742P803P551O887O993Q540J0858J2809J4098J5306J6827J8324J9320
63616D70058J9969K0956K2721K4937K6871K8134K8962K9640K9840K8775K5989
63605G56852K1704J6384J0392M284r63m581o648p738q049p431o244n631o528q760
63591G47043j1396j3849j6227j8806k1419k3523k4567k4294k2775k0389j7718
63580E32080j5280j3223j1313r342p538o329n622m579k451M56K975M376N137O263
63566D75610Q035R720J0564J0704J0897J1429J1706J1186J0485J1011J3405J6759
63554F11511J9747K2199K5060K9015L3670L8030M1057M1607L8497L1295K0970
63543I52658R433j411j0087j5555j7537j6853j4914j2627j0062p250m911m042
$$ plain form
63531 846842 841864 834616 824298 810220 791715 768593 741499 711664 680387 648751 617656 587871
63519 587871 560012 534535 511718 491523 473490 456958 441456 426980 413951 402893 393879 386119
63507 386119 378367 370115 362270 356218 352279 349517 347017 344719 342800 340938 338738 336447 334683 333644
63493 333644 333083 332845 332872 332827 332328 331548 331048 331009 331211 331877 333901 337862 343263 349039 354491 359428 363755
63476 363755 367380 370336 372645 374091 374388 373452 371312 367942 363483 358587 354201 350948 348773 347085 345091
63461 345091 342164 338259 334054 330538 328363 327644 328245 330049 332949 336807 341549 347222 353927 361702 370466
63446 370466 380060 390441 401939 415211 430816 448916 469572 493215 520429 551030 583440 615071
63434 615071 643338 666443 683567 694722 700582 702400 701942 701363 702831 707972 717523 731537 750004
$$ packed form
63531H46842m978p248j0318j4078j8505k3122k7094k9835l1277l1636l1095k9785
63519E87871k7859k5477k2817k0195j8033j6532j5502j4476j3029j1058r014p760
63507C86119p752q252p845o052l939k762k500k298j919j862k200k291j764j039
63493C33644n61k38K7m5m99p80n00l9K02O66K024L961N401N776N452M937M327
63476C63755L625K956K309J446K97r36k140l370m459m896m386l253k175j688j994
63461C45091k927l905m205l516k175p19O01J804K900L858M742N673O705P775Q764
63446C70466R594J0381J1498J3272J5605J8100K0656K3643K7214L0601L2410L1631
63434F15071K8267K3105J7124J1155N860J818m58n79J468N141R551J4014J8467
$$ plain form
63421 750004 773196 801334 833931 869576 906365 942340 975439 1003302 1023771 1035888 1040318 1038649
63409 1038649 1032410 1022948 1011874 1000955 991225 982439 973628 963979 952888 939411 922214 900301
63397 900301 873598 842799 809002 773668 738525 704970 673513 644084 616819 592284 570936
63386 570936 552695 537091 523561 511584 500937 492001 485551 482017 481128 482416 485700 490804 497164
63373 497164 504239 512206 521792 533401 546744 561400 577393 595124 615007 637291 662025 689071
63361 689071 718287 749750 783571 819402 856180 892341 926181 956133 980968 999874 1012236
63350 1012236 1017559 1015986 1008908 998733 987788 977436 967995 959053 949736 939097 926495 911484
63338 911484 893435 871739 846501 818643 789076 758240 726772 696137 668043 643443 622529
$$ packed form
63421G50004K3192K8138L2597L5645L6789L5975L3099K7863K0469J2117M430j669
63409A038649o239r462j1074j0919r730q786q811r649j1091j3477j7197k1913
63397I00301k6703l0799l3797l5334l5143l3555l1457k9429k7265k4535k1348
63386E70936j8241j5604j3530j1977j0647q936o450l534q89J288L284N104O360
63373D97164P075P967R586J1609J3343J4656J5993J7731J9883K2284K4734K7046
63361F89071K9216L1463L3821L5831L6778L6161L3840K9952K4835J8906J2362
63350A012236N323j573p078j0175j0945j0352r441q942r317j0639j2602j5011
63338I11484j8049k1696k5238k7858k9567l0836l1468l0635k8094k4600k0914
$$ plain form
63327 622529 605492 592675 584076 579246 577613 578221 578930 576617 568876 555561 538366 519141 498968
63314 498968 478702 459662 443257 429989 419106 409362 400037 391235 383376 376628 370826 365740 361251
63301 361251 357281 353669 350205 346785 343521 340675 338432 336723 335244 333668 331842 329882 328093 326707
63287 326707 325633 324484 322946 321036 318968 316911 315074 313843 313552 314047 314742 315159 315208 314927 314233 313099
63271 313099 311813 310924 310987 312336 314861 317892 320573 322529 324067 325637 327324 328978 330576 332246 334115
63256 334115 336313 338904 341634 344045 346175 348893 353118 358832 365301 372126 379517 387494 395530 403354
63242 403354 411578 421038 431801 443405 455922 470080 486166 503421 521019 539332 559566 582189
63230 582189 606227 630320 654001 677591 701229 724538 747174 769134 790464 811134 831454
$$ packed form
63327F22529j7037j2817q599m830j633O08P09k313p741j3315j7195j9225k0173
63314D98968k0266j9040j6405j3268j0883r744r325q802p859o748n802n086m489
63301C61251l970l612l464l420l264k846k243j709j479j576j826j960j789j386
63287C26707j074j149j538j910k068k057j837j231k91M95O95M17M9k81o94j134
63271C13099j286q89O3J349K525L031K681J956J538J570J687J654J598J670J869
63256C34115K198K591K730K411K130K718M225N714O469O825P391P977Q036P824
63242D03354Q224R460J0763J1604J2517J4158J6086J7255J7598J8313K0234K2623
63230E82189K4038K4093K3681K3590K3638K3309K2636K1960K1330K0670K0320
$$ plain form
63219 831454 852234 874187 897238 920639 943554 965316 985238 1002465 1016039 1024982 1028410 1025801
63207 1025801 1017210 1003131 984121 960603 933061 902367 869924 837395 806124 776850 750037
63196 750037 726326 706320 689936 676399 665151 656532 651369 650134 652711 658703 667624 678968 692402
63183 692402 707805 724843 742673 760474 778244 796723 816411 836924 857361 877031 895762
63172 895762 913791 931586 949583 967755 985305 1000869 1013167 1021549 1025892 1025972 1021064 1010408 994052
63159 994052 972951 948104 919893 888493 854717 820102 786142 753682 723014 694296 667785
63148 667785 643762 622285 602980 585182 568447 552958 539303 527799 518054 509242 500829 493022
63136 493022 486405 481121 476698 472846 470068 468969 469202 469777 470388 471663 473899 476360 478309 480041 482275
$$ packed form
63219H31454K0780K1953K3051K3401K2915K1762J9922J7227J3574Q943L428k609
63207A025801q591j4079j9010k3518k7542l0694l2443l2529l1271k9274k6813
63196G50037k3711k0006j6384j3537j1248q619n163j235K577N992Q921J1344J3434
63183F92402J5403J7038J7830J7801J7770J8479J9688K0513K0437J9670J8731
63172H95762J8029J7795J7997J8172J7550J5564J2298Q382M343Q0m908j0656j6356
63159I94052k1101k4847k8211l1400l3776l4615l3960l2460l0668k8718k6511
63148F67785k4023k1477j9305j7798j6735j5489j3655j1504r745q812q413p807
63136D93022o617n284m423l852k778j099K33N75O11J275K236K461J949J732K234
$$ plain form
63121 482275 485033 487859 490676 493727 496947 500169 503696 507871 512202 515729 518236 520394 522723 525156
63107 525156 527622 530230 532721 534518 535534 536297 537096 537681 538004 538416 538864 538668 537607 536496 536160 536457
63091 536457 536861 537428 538490 539860 541030 541837 542397 542769 543307 544919 548196 552523 556804 560910 565639 571357
63075 571357 577528 583721 590341 598075 607144 617331 628284 639582 650909 662403 674571 687717
63063 687717 701810 717025 734051 753688 776406 802378 831570 863654 898147 934894 974158
63052 974158 1016138 1060704 1107754 1157356 1209271 1262680 1316792 1371435 1426628 1481757 1535714
63041 1535714 1587966 1639129 1690377 1742400 1795011 1847572 1899691 1951426 2002680 2052375 2098473
63030 2098473 2139007 2172794 2198862 2215499 2220507 2212492 2191494 2158407 2114354 2060877 2000108 1934183
$$ packed form
63121D82275K758K826K817L051L220L222L527M175M331L527K507K158K329K433
63107E25156K466K608K491J797J016P63P99N85L23M12M48j96j061j111l36K97
63091E36457M04N67J062J370J170Q07N60L72N38J612L277M327M281M106M729N718
63075E71357O171O193O620P734R069J0187J0953J1298J1327J1494J2168J3146
63063F87717J4093J5215J7026J9637K2718K5972K9192L2084L4493L6747L9264
63052I74158M1980M4566M7050M9602N1915N3409N4112N4643N5193N5129N3957
63041A535714N2252N1163N1248N2023N2611N2561N2119N1735N1254M9695M6098
63030B098473M0534L3787K6068J6637N008q015k0998l3087m4053n3477o0769o5925
$$ plain form
63018 1934183 1864696 1793108 1721474 1652181 1586999 1526828 1472398 1424759 1384886 1353133 1329287
63007 1329287 1312956 1303694 1300996 1304354 1313355 1327613 1346695 1370105 1397182 1426989 1458522 1491117
62995 1491117 1524472 1558310 1592317 1626482 1661139 1696402 1731733 1766230 1799106 1829725 1857414
62984 1857414 1881474 1901095 1914975 1921294 1918455 1905808 1883446 1851550 1810367 1760741 1704269 1642846
62972 1642846 1578247 1511982 1445287 1379323 1315585 1255766 1200772 1149999 1102137 1056705 1014401
62961 1014401 976021 941510 910181 881332 854508 829463 806109 784253 763400 743136 723705
62950 723705 705762 689456 674142 659138 644405 630339 617223 605039 593558 582462 571665
62939 571665 561514 552333 543839 535545 527746 521446 517028 513632 510259 506883 503952 501319 498407 495209
$$ packed form
63018A934183o9487p1588p1634o9293o5182o0171n4430m7639l9873l1753k3846
63007A329287j6331r262k698L358R001J4258J9082K3410K7077K9807L1533L2595
62995A491117L3355L3838L4007L4165L4657L5263L5331L4497L2876L0619K7689
62984A857414K4060J9621J3880O319k839j2647k2362l1896m1183m9626n6472o1423
62972A642846o4599o6265o6695o5964o3738n9819n4994n0773m7862m5432m2304
62961A014401l8380l4511l1329k8849k6824k5045k3354k1856k0853k0264j9431
62950G23705j7943j6306j5314j5004j4733j4066j3116j2184j1481j1096j0797
62939E71665j0151r181q494q294p799o300m418l396l373l376k931k633k912l198
$$ plain form
62925 495209 492429 490646 489827 489643 489750 489689 488948 487352 485249 483195 481605 480626 480124 479661 478596 476374
62909 476374 472936 468975 465669 463791 463016 462322 461041 459246 457186 454905 452633 451007 450474 450761 451302
62894 451302 451939 452823 453829 454449 454224 453043 451165 449115 447461 446554 446652 448175 451351 455431 458888 460801
62878 460801 461662 462491 463606 464694 465507 465873 465429 464039 462219 460540 458898 457048 455522 455203 456127 457505
62862 457505 458863 460340 461902 463188 464310 465962 468402 471038 473366 475636 478247 481074 483834 486542
62848 486542 489140 491172 492284 492693 492733 492345 491439 490340 489348 488179 486513 484817 483970 484106 484462 484417 484125
62831 484125 484001 484096 484252 484474 484868 485472 486395 487896 490031 492412 494596 496635 498937 501657 504566 507515
62815 507515 510678 514166 517734 521083 524185 527070 529626 532004 534973 539323 544978 551251 557920 565415
$$ packed form
62925D95209k780j783q19j84J07o1p41j596k103k054j590r79n02m63j065k222
62909D76374l438l961l306j878p75o94j281j795k060k281k272j626n33K87N41
62894D51302O37Q84J006O20k25j181j878k050j654r07R8J523L176M080L457J913
62878D60801Q61Q29J115J088Q13L66m44j390j820j679j642j850j526l19R24J378
62862D57505J358J477J562J286J122J652K440K636K328K270K611K827K760K708
62848D86542K598K032J112M09M0l88r06j099r92j169j666j696q47J36L56m5k92
62831D84125j24R5J56K22L94O04R23J501K135K381K184K039K302K720K909K949
62815E07515L163L488L568L349L102K885K556K378K969M350N655O273O669P495
$$ plain form
62801 565415 573910 583009 592602 603174 614695 626031 636419 647093 660363 677141 696354 717027
62789 717027 740052 767470 800527 838920 881609 927992 978449 1034013 1095491 1162844 1235469
62778 1235469 1312887 1394760 1480283 1567981 1656243 1743697 1828874 1909701 1983437 2047004 2097526
62767 2097526 2132954 2152377 2155665 2143044 2115299 2074046 2021195 1958209 1886450 1808134 1726074
62756 1726074 1642278 1557547 1472771 1389861 1310827 1236478 1166682 1101475 1041262 986222 936219
62745 936219 891191 850960 814716 781341 750442 722506 697837 675825 655681 637540 622174
62734 622174 609643 598865 588926 580382 574540 571427 569250 566320 562990 561047 561462 563434 565617 567574
62720 567574 569895 573418 578608 585289 592855 601102 610890 623458 639023 656614 675443 695774 718218
$$ packed form
62801E65415Q495R099R593J0572J1521J1336J0388J0674J3270J6778J9213K0673
62789G17027K3025K7418L3057L8393M2689M6383N0457N5564O1478O7353P2625
62778A235469P7418Q1873Q5523Q7698Q8262Q7454Q5177Q0827P3736O3567N0522
62767B097526L5428J9423L288j2621k7745m1253n2851o2986p1759p8316q2060
62756A726074q3796q4731q4776q2910p9034p4349o9796o5207o0213n5040n0003
62745I36219m5028m0231l6244l3375l0899k7936k4669k2012k0144j8141j5366
62734F22174j2531j0778r939q544n842l113k177k930l330j943M15J972K183J957
62720E67574K321L523N190O681P566Q247R788J2568J5565J7591J8829K0331K2444
$$ plain form
62707 718218 742946 770127 800549 835148 874305 918080 966661 1019963 1077250 1137960 1202667
62696 1202667 1272403 1346975 1424604 1503116 1580746 1655649 1725382 1787289 1839102 1879047 1905778
62685 1905778 1918513 1916971 1901087 1871078 1827946 1773649 1710532 1640716 1566014 1488142 1408837
62674 1408837 1329969 1253586 1181564 1114930 1053620 997042 944812 896930 853400 813957 778169
62663 778169 745760 716775 691361 669337 650015 632571 616569 602039 589044 577306 566299
62652 566299 555597 545141 535151 525848 517230 509206 501913 495767 491119 487883 485556 483530 481390 479111
62638 479111 477047 475599 474785 474251 473722 473248 472906 472463 471526 469980 468111 466421 465377 465176 465630 466372 467248
62621 467248 468378 469842 471577 473666 476373 479687 483185 486618 490348 494909 500344 506311 512627 519378
$$ packed form
62707G18218K4728K7181L0422L4599L9157M3775M8581N3302N7287O0710O4707
62696A202667O9736P4572P7629P8512P7630P4903O9733O1907N1813L9945K6731
62685A905778J2735j542j5884l0009m3132n4297o3117o9816p4702p7872p9305
62674A408837p8868p6383p2022o6634o1310n6578n2230m7882m3530l9443l5788
62663G78169l2409k8985k5414k2024j9322j7444j6002j4530j2995j1738j1007
62652E66299j0702j0456r990r303q618q024p293o146m648l236k327k026k140k279
62638D79111k064j448q14n34n29m74l42m43r37j546j869j690j044k01M54P42Q76
62621D67248J130J464J735K089K707L314L498L433L730M561N435N967O316O751
$$ plain form
62607 519378 526714 534949 544653 556262 569665 584559 601100 619790 640880 664362 690501 719832
62595 719832 752527 788243 826671 867702 910797 954626 997687 1038970 1077622 1112177 1140615
62584 1140615 1161269 1173443 1177131 1172515 1159981 1140469 1115299 1085384 1050820 1011664 969104 925434
62572 925434 882704 841688 802365 764951 730023 697893 668437 641472 616866 594296 573407
62561 573407 554356 537823 524269 513396 504385 496410 488833 481310 473987 467421 462037 457640 453658
62548 453658 449886 446894 445548 446064 447620 449079 450005 450739 451477 451759 451090 449650 448051 446687 445758 445603
62532 445603 446486 448226 450620 454134 459602 467281 476666 487166 498456 510287 522743 536780 553759
62519 553759 574172 597463 623301 652282 684910 720630 758518 798390 840491 884382 928823
$$ packed form
62607E19378P336Q235R704J1609J3403J4894J6541J8690K1090K3482K6139K9331
62595G19832L2695L5716L8428M1031M3095M3829M3061M1283L8652L4555K8438
62584A140615K0654J2174L688m616j2534j9512k5170k9915l4564l9156m2560m3670
62572I25434m2730m1016l9323l7414l4928l2130k9456k6965k4606k2570k0889
62561E73407j9051j6533j3554j0873r011p975p577p523p323o566n384m397l982
62548D53658l772k992j346N16J556J459R26P34P38K82o69j440j599j364r29j55
62532D45603Q83J740K394L514N468P679R385J0500J1290J1831J2456J4037J6979
62519E53759K0413K3291K5838K8981L2628L5720L7888L9872M2101M3891M4441
$$ plain form
62508 928823 972543 1014406 1052895 1086165 1112823 1132270 1144295 1148776 1145912 1136258 1120326 1098524
62496 1098524 1071751 1041760 1010677 980209 951398 924842 900905 879807 861824 847435 837087
62485 837087 830781 828058 828452 831819 838043 846436 855609 863974 870324 874033 875000 873492 869690 863160 853005
62470 853005 838829 821307 801397 779246 754465 727445 699729 672868 647427 623352 600754
62459 600754 579882 560821 543775 529428 518355 510093 503268 496738 490345 484582 479960 476813 475394
62446 475394 475892 478342 482527 487868 493494 498635 503089 507293 511908 517257 522959 527971 531153 531964 530640
62431 530640 527657 523244 517497 510700 503247 495395 487371 479598 472502 466164 460392 455031 449873 444416
62417 444416 438184 431379 424800 418995 413845 409131 405118 402211 400331 398990 397928 397330 397454 398251 399394
$$ packed form
62508I28823M3720M1863L8489L3270K6658J9447J2025M481k864r654j5932k1802
62496A098524k6773k9991l1083l0468k8811k6556k3937k1098j7983j4389j0348
62485H37087o306k723L94L367O224Q393R173Q365O350L709R67j508l802o530j0155
62470H53005j4176j7522j9910k2151k4781k7020k7716k6861k5441k4075k2598
62459F00754k0872j9061j7046j4347j1073q262o825o530o393n763m622l147j419
62446D75394M98K450M185N341N626N141M454M204M615N349N702N012L182Q11j324
62431E30640k983m413n747o797p453p852q024p773p096o338n772n361n158n457
62417D44416o232o805o579n805n150m714m013k907j880j341j062n98J24P97J143
$$ plain form
62402 399394 400488 401265 401781 402487 403901 406135 408828 411574 414232 416741 418873 420455 421792 423556 426154
62387 426154 429327 432487 435285 437864 440751 444652 450091 456963 464588 472484 480914 490258 500019 509131
62373 509131 517446 526283 537044 549731 563411 577890 594171 613201 634844 658460 684139 712901
62361 712901 745772 782944 823943 868414 916547 968588 1023942 1080922 1137374 1191258 1240437
62350 1240437 1282366 1314814 1337107 1350272 1355778 1354422 1346580 1332904 1314125 1290363 1261256 1226922
62338 1226922 1188445 1147304 1104702 1061646 1019398 979435 942868 909992 880406 853497 828856
62327 828856 806404 786227 768275 752124 736940 721732 705747 688813 671296 653630 635891
62316 635891 617887 599701 581991 565636 551089 538154 526364 515477 505610 497080 490185 484948
$$ packed form
62402C99394J094P77N16P06J414K234K693K746K658K509K132J582J337J764K598
62387D26154L173L160K798K579K887L901N439O872P625P896Q430R344R761R112
62373E09131Q315Q837J0761J2687J3680J4479J6281J9030K1643K3616K5679K8762
62361G12901L2871L7172M0999M4471M8133N2041N5354N6980N6452N3884M9179
62350A240437M1929L2448K2293J3165N506j356p842j3676j8779k3762k9107l4334
62338A226922l8477m1141m2602m3056m2248l9963l6567l2876k9586k6909k4641
62327H28856k2452k0177j7952j6151j5184j5208j5985j6934j7517j7666j7739
62316F35891j8004j8186j7710j6355j4547j2935j1790j0887r867q530o895n237
$$ plain form
62304 484948 480882 477028 472537 467354 462277 458316 456045 455535 456507 458294 459896 460562 460478 460595 461693 463809
62288 463809 466705 470557 475842 482598 490087 497343 504010 510668 518337 527532 537799 548329 559039
62275 559039 570739 584072 598691 613832 629400 645935 663663 682255 701604 722189 744431
62264 744431 768204 793377 820422 850106 882938 919282 959636 1004245 1052578 1103595 1156363
62253 1156363 1209918 1262670 1312366 1356605 1393132 1420041 1436476 1443175 1441746 1433298 1418117 1396386
62241 1396386 1368311 1333547 1291523 1242918 1190113 1135627 1080573 1025151 970047 916665 866306
62230 866306 819819 777850 740728 708148 679465 654288 632388 613252 596291 581394 568674
62219 568674 557721 547753 538524 530461 523711 517653 511691 505985 501055 497000 493624 491035 489575 489139
$$ packed form
62304D84948m066l854m491n183n077l961k271n10R72J787J602O66q4J17J098K116
62288D63809K896L852N285O756P489P256O667O658P669R195J0267J0530J0710
62275E59039J1700J3333J4619J5141J5568J6535J7728J8592J9349K0585K2242
62264G44431K3773K5173K7045K9684L2832L6344M0354M4609M8333N1017N2768
62253A156363N3555N2752M9696M4239L6527K6909J6435O699j429q448j5181k1731
62241A396386k8075l4764m2024m8605n2805n4486n5054n5422n5104n3382n0359
62230H66306m6487m1969l7122l2580k8683k5177k1900j9136j6961j4897j2720
62219E68674j0953r968r229q063o750o058n962n706m930m055l376k589j460m36
$$ plain form
62205 489139 488962 488309 487253 486627 487213 489104 491885 495310 499510 504543 510086 515907 522386 530179 539315
62190 539315 549005 558439 567535 576825 586804 597562 608931 620798 633104 645482 657087 667079 675301
62177 675301 682158 687872 692477 696877 703216 713507 728179 746586 768570 794737 825348 859961
62165 859961 898235 940098 984721 1030060 1073926 1114812 1151262 1181130 1202501 1215234 1220995 1221655
62153 1221655 1217952 1209527 1195845 1176974 1153676 1126878 1097198 1065158 1031725 998147 965170 932949
62141 932949 902004 873762 849639 829854 813567 799948 788677 779617 772474 766815 762068 757604
62129 757604 753176 749263 746661 745693 746097 747646 750611 755505 762532 771352 781287 791638 801686 810391
62115 810391 816407 818886 818389 816605 814954 813650 812077 809558 805430 798893 789393 777154 763064 748230
$$ packed form
62205D89139j77o53j056o26N86J891K781L425M200N033N543N821O479P793R136
62190E39315R690R434R096R290R979J0758J1369J1867J2306J2378J1605R992Q222
62177F75301O857N714M605M400O339J0291J4672J8407K1984K6167L0611L4613
62165H59961L8274M1863M4623M5339M3866M0886L6450K9868K1371J2733N761O60
62153A221655l703q425j3682j8871k3298k6798k9680l2040l3433l3578l2977l2221
62141I32949l0945k8242k4123j9785j6287j3619j1271r060p143n659m747m464
62129G57604m428l913k602r68M04J549K965M894P027Q820R935J0351J0048Q705
62115H10391O016K479m97j784j651j304j573k519m128o537r500j2239j4090j4834
$$ plain form
62101 748230 733874 721307 711468 704477 699970 697827 698242 701213 706291 712868 720480 728845 737806 747243
62087 747243 756936 766621 776225 785902 795730 805707 816139 827690 840812 855482 871735 889983 910330
62074 910330 932017 954174 976918 1001059 1026867 1053676 1080707 1107677 1134662 1161914 1189939
62063 1189939 1219137 1249058 1278224 1304732 1326816 1343019 1352515 1355596 1353482 1347324 1337519 1324013
62051 1324013 1307003 1287076 1264682 1239546 1210667 1177155 1139281 1098563 1056699 1014660 973010
62040 973010 932627 894545 859279 826809 797008 769587 743806 718951 695078 672715 651969
62029 651969 632652 615229 600689 589156 579371 569948 560616 551899 544138 537196 530563 523400 515013
62016 515013 505802 497303 490731 485846 481689 478022 475402 474116 473787 474078 475231 477679 481461 486172 491341
$$ packed form
62101G48230j4356j2567r839o991m507k143M15K971N078O577P612Q365Q961R437
62087G47243R693R685R604R677R828R977J0432J1551J3122J4670J6253J8248K0347
62074I10330K1687K2157K2744K4141K5808K6809K7031K6970K6985K7252K8025
62063A189939K9198K9921K9166K6508K2084J6203R496L081k114o158r805j3506
62051A324013j7010j9927k2394k5136k8879l3512l7874m0718m1864m2039m1650
62040I73010m0383l8082l5266l2470k9801k7421k5781k4855k3873k2363k0746
62029F51969j9317j7423j4540j1533r785r423r332q717p761o942o633p163q387
62016E15013r211q499o572m885m157l667k620j286l29K91J153K448L782M711N169
$$ plain form
62001 491341 496730 502284 507782 512638 516246 518512 519718 519861 518535 515676 511973 508158 504172 499345
61987 499345 493180 485681 477169 468181 459401 451318 444029 437564 432134 427801 424170 420821 417822 415445
61973 415445 413486 411356 408779 406038 403574 401725 400796 400892 401572 402017 401782 401176 400875 401338 402664 404781
61957 404781 407621 411106 414983 418765 422056 425140 429025 434642 442091 450876 460691 471641 483817 497127
61943 497127 511637 527766 545925 566058 587574 609608 631358 652319 672209 690710 707572
61932 707572 723149 738500 754452 770575 785441 797862 807523 814479 818542 819364 816775 810890 802146
61919 802146 791397 779746 768162 757447 748576 742716 740737 742942 749299 759552 772945 788261
61907 788261 804401 820624 836032 849361 859766 867434 872740 874958 872521 864726 852656 838213
$$ packed form
62001D91341N389N554N498M856L608K266J206J43j326k859l703l815l986m827
61987D99345o165p499q512q988q780q083p289o465n430m333l631l349k999k377
61973D15445j959k130k577k741k464j849r29R6O80M45k35o06l01M63J326K117
61957D04781K840L485L877L782L291L084L885N617P449Q785R815J0950J2176J3310
61943D97127J4510J6129J8159K0133K1516K2034K1750K0961J9890J8501J6862
61932G07572J5577J5351J5952J6123J4866J2421R661O956M063Q22k589n885q744
61919H02146j0749j1651j1584j0715q871n860j979K205O357J0253J3393J5316
61907G88261J6140J6223J5408J3329J0405P668N306K218k437p795j2070j4443
$$ plain form
61895 838213 822679 806435 789557 772141 754214 735844 717445 699616 682517 665696 648785
61884 648785 632267 617223 604215 592642 581338 569686 557930 546580 535985 526567 518961 513422
61872 513422 509294 505562 501912 498896 497098 496653 497676 500549 505388 511608 518559 526415 536016 547909
61858 547909 561957 577837 595516 615216 637301 662243 690300 721108 753937 788369 824273
61847 824273 860962 896941 930880 962410 991466 1017133 1037730 1051995 1059720 1061343 1057500 1049084
61835 1049084 1037228 1022982 1007352 991848 978555 969198 964276 963463 966735 974618 987076 1002451
61823 1002451 1017939 1031271 1041742 1049436 1053666 1052633 1044712 1029701 1008536 982189 951364 917133
61811 917133 881204 845202 809904 775381 741729 709523 679650 652821 629162 608273 589815
$$ packed form
61895H38213j5534j6244j6878j7416j7927j8370j8399j7829j7099j6821j6911
61884F48785j6518j5044j3008j1573j1304j1652j1756j1350j0595r418p606n539
61872E13422m128l732l650l016j798m45J023K873M839O220O951P856R601J1893
61858E47909J4048J5880J7679J9700K2085K4942K8057L0808L2829L4432L5904
61847H24273L6689L5979L3939L1530K9056K5667K0597J4265P725J623l843q416
61835A049084j1856j4246j5630j5504j3293r357m922q13L272P883J2458J5375
61823A002451J5488J3332J0471P694M230j033p921j5011k1165k6347l0825l4231
61811I17133l5929l6002l5298l4523l3652l2206k9873k6829k3659k0889j8458
$$ plain form
61800 589815 573943 560949 550459 541398 532899 524963 518022 512128 506877 501960 497427 493384 489692
61787 489692 486060 482307 478472 474723 471205 467964 465046 462670 461162 460608 460595 460446 459768 458767 458013 457835
61771 457835 457969 457808 457057 456094 455652 456162 457466 459120 460890 463001 465950 469934 474394 478290 481051 483135
61755 483135 485398 488009 490288 491554 491741 491163 490041 488469 486578 484502 482321 480132 477999 475792 473280
61740 473280 470516 467889 465679 463824 462260 461257 461137 461819 462865 463935 465061 466535 468617 471236 473877
61725 473877 475932 477263 478327 479684 481522 483693 485992 488249 490373 492448 494641 496934 499120 501125
61711 501125 502965 504256 504191 502407 499555 496571 493547 489838 485241 480508 476511 473328 470417 467406 464351
61696 464351 461342 458290 455220 452476 450342 448543 446452 443838 441110 438701 436551 434431 432427 430656
$$ packed form
61800E89815j5872j2994j0490r061q499p936o941n894n251m917m533m043l692
61787D89692l632l753l835l749l518l241k918k376j508n54j3j49o78j001p54j78
61771D57835J34j61p51r63m42N10J304J654J770K111K949L984M460L896K761K084
61755D83135K263K611K279J266J87n78j122j572j891k076k181k189k133k207k512
61740D73280k764k627k210j855j564j003j20O82J046J070J126J474K082K619K641
61725D73877K055J331J064J357J838K171K299K257K124K075K193K293K186K005
61711E01125J840J291o5j784k852k984l024l709m597m733l997l183k911l011l055
61696D64351l009l052l070k744k134j799k091k614k728k409k150k120k004j771
$$ plain form
61682 430656 428778 426409 423893 421996 420770 419346 417124 414559 412446 410938 409611 408046 405927 403051
61668 403051 399732 396895 395224 394443 393854 393290 393037 393017 392709 391894 391072 390996 392019 393805 395514 396454 396821
61651 396821 397554 399293 401846 404947 408931 414090 419846 425324 430411 435432 440073 443621 446132 448276
61637 448276 449931 450035 448215 445515 442952 440225 436580 432225 428001 424102 420035 415640 411345 407431
61623 407431 403770 400426 397907 396512 395815 395066 393928 392683 391827 391567 391585 391184 389712 386947 383176 378944
61607 378944 374715 370653 366663 362692 358880 355293 351630 347540 343194 339176 335730 332455 328938 325327
61593 325327 321991 318942 315948 313044 310502 308419 306688 305407 304897 305228 305925 306281 305832 304543 302766
61578 302766 301088 299982 299408 298842 297842 296537 295456 294943 294904 295058 295213 295182 294671 293562 292265 291495 291571
$$ packed form
61682D30656j878k369k516j897j226j424k222k565k113j508j327j565k119k876
61668D03051l319k837j671p81n89n64k53k0l08q15q22p6J023J786J709R40L67
61651C96821P33J739K553L101L984N159N756N478N087N021M641L548K511K144
61637D48276J655J04j820k700k563k727l645m355m224l899m067m395m295l914
61623D07431l661l344k519j395o97p49j138j245q56k60J8m01j472k765l771m232
61607C78944m229m062l990l971l812l587l663m090m346m018l446l275l517l611
61593C25327l336l049k994k904k542k083j731j281n10L31O97L56m49j289j777
61578C02766j678j106n74n66j000j305j081n13l9J54J55l1n11j109j297p70P6
$$ plain form
61561 291571 292180 292924 293868 295308 297182 299047 300569 301750 302700 303513 304398 305662 307388 309268 310865 311978
61545 311978 312752 313578 314846 316596 318403 319786 320693 321380 321883 321956 321603 321366 321862 323241 325161 327090 328541
61528 328541 329286 329559 329817 330142 330049 329081 327386 325499 323726 322071 320651 319785 319570 319616 319465 319159 319195 319782
61510 319782 320409 320444 320089 320285 321416 322599 322710 321818 320912 320380 319607 318227 316897 316369 316473 316653 316923 317590
61492 317590 318419 318924 319306 320255 321825 323286 324189 324826 325461 325866 326007 326502 327773 329217 329825 329352 328360
61475 328360 327380 326659 326500 327126 328184 328999 329383 329661 329870 329694 329429 330163 332378 334916 336121 335702 334719
61458 334719 333999 333468 333072 333327 334498 335979 337080 337918 338911 339762 339687 338558 337224 336630 337096 338469 340462
61441 340462 342676 344654 346211 347562 349044 350872 353166 355922 358863 361612 364109 366645 369357 371973
$$ packed form
61561B91571O09P44R44J440J874J865J522J181R50Q13Q85J264J726J880J597J113
61545C11978P74Q26J268J750J807J383R07O87N03P3l53k37M96J379J920J929J451
61528C28541P45K73K58L25r3r68j695j887j773j655j420q66k15M6j51l06L6N87
61510C19782O27L5l55J96J131J183J11q92r06n32p73j380j330n28J04J80K70O67
61492C17590Q29N05L82R49J570J461R03O37O35M05J41M95J271J444O08m73r92
61475C28360r80p21j59O26J058Q15L84K78K09j76k65P34K215K538J205m19r83
61458C34719p20n31l96K55J171J481J101Q38R93Q51p5j129j334n94M66J373J993
61441C40462K214J978J557J351J482J828K294K756K941K749K497K536K712K616
$$ plain form
61427 371973 374208 376162 378091 379992 381708 383316 385090 387092 389080 390904 392713 394632 396395 397531
61413 397531 397843 397532 396853 395857 394508 392862 390992 388986 387142 385880 385163 384210 382268 379598 377205 375537
61397 375537 374000 371991 369852 368412 367961 368196 368883 370022 371422 372596 373186 373309 373474 374259 375855 377679
61381 377679 378682 378361 377325 376673 377007 378288 380296 382798 385507 388258 391062 393688 395598 396765 398125
61366 398125 400559 403780 406938 410027 413762 418197 422479 426085 429384 432760 436029 439054 442227 446032
61352 446032 450773 456942 465037 474586 484008 491934 498173 503159 507110 510163 512631 514621 515952 516886
61338 516886 518352 520923 524116 527166 529806 531730 532068 530276 527041 523338 518990 513118 505879 498796
61324 498796 493291 489493 486561 483596 480295 477183 475239 474941 475838 477408 479944 483996 489265 494809 500288
$$ packed form
61427C71973K235J954J929J901J716J608J774K002J988J824J809J919J763J136
61413C97531L12l11o79r96j349j646j870k006j844j262p17r53j942k670k393j668
61397C75537j537k009k139j440m51K35O87J139J400J174N90J23J65P85J596J824
61381C77679J003l21j036o52L34J281K008K502K709K751K804K626J910J167J360
61366C98125K434L221L158L089L735M435M282L606L299L376L269L025L173L805
61352D46032M741O169Q095R549R422P926O239M986L951L053K468J990J331R34
61338E16886J466K571L193L050K640J924L38j792l235l703m348n872p239p083
61324D98796n505l798k932k965l301l112j944k98Q97J570K536M052N269N544N479
$$ plain form
61309 500288 506366 513949 523536 535147 548167 561330 573491 584468 594591 603550 610406 614734 617041
61296 617041 617980 617817 616701 614658 611163 605575 598423 591484 585983 581319 576165 570353 564912 560434 556244
61281 556244 551392 545940 540840 536804 533744 531357 529846 529674 530746 532372 534111 536182 538789 541555
61267 541555 544079 546659 549921 554041 558992 565334 573979 585059 597564 610149 621833 631970 640214
61254 640214 646760 652099 656321 658988 659767 658750 656059 651659 645741 638857 631466 623708 615797 608215
61240 608215 601336 595129 589409 584071 579036 574321 570217 566998 564419 562001 559937 559176 560331 562999
61226 562999 566364 570036 573965 577979 581904 585904 590334 595367 600946 606909 612976 618863 624600 630493
61212 630493 636580 642337 647077 650493 652718 654182 655499 657222 659599 662794 667305 673714 681992 691503
$$ packed form
61309E00288O078P583R587J1611J3020J3163J2161J0977J0123Q959O856M328K307
61296F17041R39j63j116k043l495n588p152o939n501m664n154n812n441m478m190
61281E56244m852n452n100m036l060k387j511j72J072J626J739K071K607K766
61267E41555K524K580L262M120M951O342Q645J1080J2505J2585J1684J0137Q244
61254F40214O546N339M222K667P79j017k691m400n918o884p391p758p911p582
61240F08215o879o207n720n338n035m715m104l219k579k418k064p61J155K668
61226E62999L365L672L929M014L925M000M430N033N579N963O067N887N737N893
61212F30493O087N757M740L416K225J464J317J723K377L195M511O409Q278R511
$$ plain form
61198 691503 701815 712999 725092 737974 751999 767884 785356 802487 817064 828281 836566 842324
61186 842324 845678 847178 847772 847929 847363 845758 843173 839629 834857 828723 821537 813635 804956 795325 785013
61171 785013 774702 764834 755086 744608 732825 719958 706710 693514 680342 667149 654154 641503
61159 641503 629066 616892 605673 596394 589505 584623 581063 578590 577610 578639 581456 584822 587245 587968
61145 587968 587007 584373 579794 573313 565606 557489 549559 542507 537202 533956 532181 531281 531550 533566 537038
61130 537038 540993 545124 550307 557592 567127 578205 590069 602547 616122 631482 648853 667737
61118 667737 687411 707593 728459 750112 772272 794434 816171 837321 857986 878184 897415
61107 897415 914848 930106 943626 955953 966851 975352 980466 981665 978974 972978 964509 953940 941018
$$ packed form
61198F91503J0312J1184J2093J2882J4025J5885J7472J7131J4577J1217Q285N758
61186H42324L354J500N94J57n66j605k585l544m772o134p186p902q679r631j0312
61171G85013j0311r868r748j0478j1783j2867j3248j3196j3172j3193j2995j2651
61159F41503j2437j2174j1219r279o889m882l560k473r80J029K817L366K423P23
61145E87968r61k634m579o481p707q117p930p052n305l246j775r00K69K016L472
61130E37038L955M131N183P285R535J1078J1864J2478J3575J5360J7371J8884
61118F67737J9674K0182K0866K1653K2160K2162K1737K1150K0665K0198J9231
61107H97415J7433J5258J3520J2327J0898Q501N114J199k691n996q469j0569j2922
$$ plain form
61094 941018 925646 908566 890777 872579 853728 834407 815410 797336 780141 763667 748179
61083 748179 734117 721543 709998 698905 688162 678401 670501 664745 660639 657645 655697 654784 654554
61070 654554 654831 656151 659203 663979 669944 676773 684338 692242 700072 707992 716505 725776 735839 747222
61056 747222 760544 775512 791178 807289 824649 844048 865537 888879 913962 940530 968145
61045 968145 996745 1026752 1058502 1092039 1127406 1164503 1202750 1241716 1282014 1324619 1369303
61034 1369303 1415008 1461987 1512162 1566656 1624196 1682846 1742220 1802991 1865317 1929189 1995791
61023 1995791 2067258 2145388 2231538 2327237 2433678 2550789 2677881 2815301 2964976 3130276
61013 3130276 3316720 3532601 3787651 4091321 4453357 4885673 5402741 6021706 6765266
$$ packed form
61094I41018j5372j7080j7789j8198j8851j9321j8997j8074j7195j6474j5488
61083G48179j4062j2574j1545j1093j0743r761p900n756m106k994j948r13k30
61070F54554K77J320L052M776N965O829P565P904P830P920Q513R271J0063J1383
61056G47222J3322J4968J5666J6111J7360J9399K1489K3342K5083K6568K7615
61045I68145K8600L0007L1750L3537L5367L7097L8247L8966M0298M2605M4684
61034A369303M5705M6979N0175N4494N7540N8650N9374O0771O2326O3872O6602
61023A995791P1467P8130Q6150R5699J06441J17111J27092J37420J49675J65300
61013C130276J86444K15881K55050L03670L62036M32316N17068O18965P43560
$$ plain form
61004 6765266 7665024 8759955 10090201 11688958 13565828 15671500 17857819 19878452
60996 19878452 21463300 22436230 22794744 22696253 22375475 22061699 21930227 22066770 22425609
60987 22425609 22813317 22946639 22575786 21595414 20069977 18174281 16110168 14051564 12124212
60978 12124212 10402547 8914687 7655774 6604682 5735131 5019530 4431088 3946640 3547520
60969 3547520 3217747 2942738 2710105 2510345 2336135 2181728 2043291 1918757 1806633
60960 1806633 1705365 1613964 1532293 1460187 1396777 1341019 1292210 1249339 1210432 1173209 1136377
60949 1136377 1099975 1064663 1031000 999212 969231 940866 914009 888653 864714 842064 820721
60938 820721 800734 781805 763317 744922 726884 709662 693390 677967 663518 650476 639156
$$ packed form
61004F765266Q99758J094931J330246J598757J876870K105672K186319K020633
60996A9878452J584848R72930L58514r8491l20778l13776j31472J36543L58839
60987B2425609L87708J33322l70853r80372j525437j895696k064113k058604j927352
60978A2124212j721665j487860j258913j051092q69551p15601n88442m84448l99120
60969C547520l29773k75009k32633j99760j74210j54407j38437j24534j12124
60960A806633j01268r1401q1671p2106o3410n5758m8809m2871l8907l7223l6832
60949A136377l6402l5312l3663l1788k9981k8365k6857k5356k3939k2650k1343
60938H20721j9987j8929j8488j8395j8038j7222j6272j5423j4449j3042j1320
$$ plain form
60927 639156 629319 620257 611413 602957 595516 589259 583573 577943 572782 568879 566242 564105 562033 560367
60913 560367 559526 559524 560281 561748 563478 564738 565417 566261 567810 569597 570787 571128 570838 570066 568984 567937 566975
60896 566975 565631 563704 561753 560137 558012 554190 548760 542924 537333 531567 525328 519152 513512 508001
60882 508001 501914 495086 487712 479854 471716 463988 457281 451340 445401 439352 434026 430200 427654 425559
60868 425559 423560 422043 421352 421221 421410 422502 425392 429939 434809 438839 441860 443883 444407 443447 442616 443930
60852 443930 447616 452000 455554 458070 459851 460981 461835 463253 465454 467518 468591 468987 469379 469541 468728
60837 468728 466932 464851 462759 460252 457127 453877 451183 449362 448330 447661 446708 445099 443104 441194 439336
60822 439336 437205 435005 433443 432720 431999 430070 426269 420702 414116 407713 402621 399109 396447 393768 390843
$$ packed form
60927F39156r837r062q844q456p441o257n686n630n161l903k637k137k072j666
60913E60367q41kP57J467J730J260O79Q44J549J787J190L41k90p72j082j047r62
60896E66975j344j927j951j616k125l822n430n836n591n766o239o176n640n511
60882E08001o087o828p374p858q138p728o707n941n939o049n326l826k546k095
60868D25559j999j517o91j31J89J092K890M547M870M030L021K023N24r60q31J314
60852D43930L686M384L554K516J781J130Q54J418K201K064J073L96L92J62q13
60837D68728j796k081k092k507l125l250k694j821j032o69r53j609j995j910j858
60822D39336k131k200j562p23p21j929l801n567o586o403n092l512k662k679k925
$$ plain form
60807 390843 387837 384675 381087 377170 373438 370209 367205 363881 359967 355614 351246 347477 345000 344169
60793 344169 344588 345338 345818 346222 346995 347982 348431 347855 346654 345826 346198 347919 350386 352603 353879 354372 354813
60776 354813 355692 356995 358765 361422 365157 369280 372653 374772 376130 377510 379190 380880 382280 383537
60762 383537 385060 386828 388062 387875 386269 384135 382210 380499 378896 377787 377488 377468 376851 375613 374671 374699
60746 374699 375376 375943 376072 375944 375670 374862 372702 368546 362696 356488 351216 346916 342575 337632 332823 329290
60730 329290 327257 326023 325072 324603 324789 324971 324098 322021 319929 319188 319866 320812 321147 321263 322104 323883 325883
60713 325883 327274 327736 327438 326907 326873 327811 329534 331509 333547 335830 338345 340783 343115 345762 348945 352248
60697 352248 355108 357460 359553 361380 362677 363448 364156 365321 367070 369040 370621 371363 371328 371076 371223 371972
$$ packed form
60807C90843l006l162l588l917l732l229l004l324l914m353m368l769k477q31
60793C44169M19P50M80M04P73R87M49n76j201q28L72J721K467K217J276M93M41
60776C54813Q79J303J770K657L735M123L373K119J358J380J680J690J400J257
60762C83537J523J768J234j87j606k134j925j711j603j109k99k0o17j238r42K8
60746C74699O77N67J29j28k74q08k160m156n850o208n272m300m341m943m809l533
60730C29290k033j234r51m69J86J82q73k077k092p41O78R46L35J16Q41J779K000
60713C25883J391M62k98n31l4R38J723J975K038K283K515K438K332K647L183L303
60697C52248K860K352K093J827J297P71P08J165J749J970J581P42l5k52J47P49
$$ plain form
60681 371972 373071 374120 374928 375653 376625 377917 379075 379501 379180 378796 378862 378864 377577 374285 369455 364186 359281
60664 359281 355043 351670 349323 347719 346097 343905 341387 339222 337718 336754 336386 337007 338683 340766 342576
60649 342576 344227 346406 349368 352523 355033 356551 357275 357474 357149 356129 354390 352151 349642 346928 344156
60634 344156 341825 340449 339893 339428 338648 337974 338027 338775 339612 340031 339922 339467 339026 338991 339462 340309 341625 343649
60616 343649 345877 346945 346137 344601 344154 345017 345676 345065 343908 343590 344512 346025 347368 348086 347998 347295 346524
60599 346524 346123 346140 346611 347842 350009 352766 355578 358235 360803 363319 365723 367885 369486 370172 370031 369577
60583 369577 369067 368197 366797 365416 364779 364962 365618 366791 368970 372423 376933 382181 388013 394354 401257
60568 401257 409010 417819 427360 437007 446511 456049 465501 474086 480856 485250 486995 485967 482547 477805
$$ packed form
60681C71972J099J049Q08P25R72J292J158M26l21l84O6Kj287l292m830n269m905
60664C59281m238l373k347j604j622k192k518k165j504r64l68O21J676K083J810
60649C42576J651K179K962L155K510J518P24J99l25j020j739k239k509k714k772
60634C44156k331j376n56m65p80o74N3P48Q37M19j09m55m41l5M71Q47J316K024
60616C43649K228J068q08j536m47Q63O59o11j157l18R22J513J343P18q8p03p71
60599C46524m01J7M71J231K167K757K812K657K568K516K404K162J601O86j41m54
60583C69577n10q70j400j381o37J83O56J173K179L453M510N248N832O341O903
60568D01257P753Q809R541R647R504R538R452Q585O770M394J745j028l420m742
$$ plain form
60554 477805 472808 467809 462603 457683 454442 453862 455413 457763 460411 464069 469494 476564 484727 493795
60540 493795 503922 515305 528403 543977 562109 581226 598780 612935 623159 629380 631525 630084
60528 630084 626251 620927 614139 605963 597457 589950 583672 577810 571864 566301 561886 558931 557408 557249
60514 557249 558258 559956 561843 563752 565878 568535 571965 576257 581432 587694 595702 606454 620795 639069
60500 639069 661335 687796 718795 754261 793392 835078 878491 922879 966731 1007663 1043436
60489 1043436 1072760 1094730 1107846 1110245 1100901 1080157 1049258 1009976 964752 916459 867547 819657
60477 819657 774027 731745 693376 658894 628269 601674 578834 558719 540313 523401 508247
60466 508247 494897 483203 473106 464432 456747 449893 444317 440322 437293 434243 430880 427543 424261
$$ packed form
60554D77805m997m999n206m920l241n80J551K350K648L658N425P070Q163R068
60540D93795J0127J1383J3098J5574J8132J9117J7554J4155J0224O221K145j441
60528F30084l833n324o788q176q506p507o278n862n946n563m415k955j523j59
60514E57249J009J698J887J909K126K657L430M292N175O262Q008J0752J4341J8274
60500F39069K2266K6461L0999L5466L9131M1686M3413M4388M3852M0932L5773
60489A043436K9324K1970J3116K399r344k0744l0899l9282m5224m8293m8912m7890
60477H19657m5630m2282l8369l4482l0625k6595k2840k0115j8406j6912j5154
60466E08247j3350j1694j0097q674p685o854n576l995l029l050l363l337l282
$$ plain form
60453 424261 420658 416791 413371 410898 409023 407010 404534 401897 399698 398326 397535 396568 395013 393464 392910
60438 392910 393482 394234 394252 393555 392722 392016 391169 389860 388088 386119 384176 382244 380227 378365 377316 377601
60422 377601 379010 380769 382260 383441 384662 386265 388326 390541 392465 393980 395348 396614 397280 397023 396497
60407 396497 396883 398665 401352 404329 407360 410166 412186 413188 413723 414565 415937 417607 419547 422105 425523
60392 425523 429506 433303 436197 438083 439645 441752 444548 447259 449041 449905 450649 452012 454074 456448 458870
60377 458870 461495 464609 468149 471702 475018 478328 481934 485648 488907 491409 493279 494658 495544 496236 497550
60362 497550 500161 503794 507346 509934 511768 513938 517422 522361 528357 535311 543598 553263 563299 572170
60348 572170 578969 583760 586860 588230 587685 585310 581350 575967 569410 562352 555750 550310 546152 542960
$$ packed form
60453D24261l603l867l420k473j875k013k476k637k199j372p91r67j555j549n54
60438C92910N72P52J8o97q33p06q47j309j772j969j943j932k017j862j049K85
60422C77601J409J759J491J181J221J603K061K215J924J515J368J266O66k57n26
60407C96497L86J782K687K977L031K806K020J002N35Q42J372J670J940K558L418
60392D25523L983L797K894J886J562K107K796K711J782Q64P44J363K062K374K422
60377D58870K625L114L540L553L316L310L606L714L259K502J870J379Q86O92J314
60362D97550K611L633L552K588J834K170L484M939N996O954Q287R665J0036Q871
60348E72170O799M791L100J370n45k375l960n383o557p058o602n440m158l192
$$ plain form
60334 542960 540310 537870 535402 532675 529450 525592 521199 516580 512081 507875 503785 499365 494411 489514
60320 489514 485847 484099 483784 483887 484137 485291 488225 493188 500004 508525 518557 529595 541022 552453
60306 552453 563675 574410 584480 594128 603731 612973 620630 625498 627368 626695 623415 616672 606056
60293 606056 592710 578634 565009 551727 538566 526165 515482 506707 499211 492419 486362 481384
60281 481384 477530 474242 470644 466266 461620 457836 455622 454744 454524 454431 454092 453254 452132 451380 451282 451282 450731
60264 450731 449728 448749 447825 446726 445625 444853 444164 443061 441805 441279 441739 442414 442528 442072 441360 440564 440009
60247 440009 440255 441369 442522 442798 442121 441086 440122 439196 438112 436830 435626 435038 435474 436797 438542 440523
60231 440523 442881 445546 448180 450719 453353 455806 457338 457848 458334 459731 461830 463995 466451 470066 475027
$$ packed form
60334E42960k650k440k468k727l225l858m393m619m499m206m090m420m954m897
60320D89514l667j748l15J03K50J154K934M963O816Q521J0032J1038J1427J1431
60306E52453J1222J0735J0070R648R603R242P657M868J870o73l280o743j0616
60293F06056j3346j4076j3625j3282j3161j2401j0683q775p496o792o057m978
60281D81384l854l288l598m378m646l784k214q78k20r3l39q38j122p52r8%n51
60264D50731j003r79r24j099j101p72o89j103j256n26M60O75J14m56p12p96n55
60247D40009K46J114J153K76o77j035r64r26j084j282j204n88M36J323J745J981
60231D40523K358K665K634K539K634K453J532N10M86J397K099K165K456L615M961
$$ plain form
60216 475027 480512 485659 490310 494764 499352 504301 509576 514730 519294 523444 527892 533030 538493 543662
60202 543662 548291 552473 556287 559740 562866 565648 567870 569251 569745 569604 569077 568138 566623 564623 562622
60187 562622 561049 559787 558306 556280 553853 551288 548622 545836 543149 540941 539423 538494 537823 536972 535592
60172 535592 533697 531763 530374 529694 529222 528139 526070 523620 521957 521650 522038 522032 521351 520542 519940 519279 518469
60155 518469 518101 518713 519948 520915 521148 520818 520211 519439 518593 517829 517327 517358 518291 520269 522972 525926 529007
60138 529007 532461 536521 541150 546021 550579 554321 557279 560104 563376 566831 569510 570636 570231 569013
60124 569013 567876 567395 567580 568095 568767 569738 571052 572350 573206 573584 573727 573734 573523 573064 572381 571422 570154 568680
60106 568680 567020 564946 562347 559667 557567 556172 555023 553837 552917 552639 552858 553152 553547 554690 557207
$$ packed form
60216D75027N485N147M651M454M588M949N275N154M564M150M448N138N463N169
60202E43662M629M182L814L453L126K782K222J381M94j41n27r39j515k000k001
60187E62622j573j262j481k026k427k565k666k786k687k208j518r29o71q51j380
60172E35592j895j934j389o80m72j083k069k450j663l07L88oo81q09o02o61q10
60155E18469l68O12J235R67K33l30o07p72q46p64n02L1R33J978K703K954L081
60138E29007L454M060M629M871M558L742K958K825L272L455K679J126m05j218
60124E69013j137m81J85N15O72R71J314J298Q56L78J43Pk11m59o83r59j268j474
60106E68680j660k074k599k680k100j395j149j186r20k78K19K94L95J143K517
$$ plain form
60091 557207 560991 565258 569210 572524 575175 577101 578336 579291 580418 581491 581657 580427 578261 575840 573033
60076 573033 569032 563397 556610 549629 543166 537392 531984 526400 520277 513739 507283 501423 496457 492413
60062 492413 489082 486147 483374 480591 477512 473887 469977 466563 464192 462642 461389 460368 459975 460536 462119
60047 462119 464673 467922 471248 474117 476630 479298 482360 485692 489240 493054 496840 499970 502034 502948
60033 502948 502512 500502 497421 494507 492476 490633 487790 483795 479596 475912 472489 468771 464718 460615
60019 460615 456389 451580 445942 439810 433848 428583 424185 420503 417257 414304 411775 409890 408624 407662
60005 407662 406663 405476 404069 402497 401075 400338 400549 401325 402005 402385 402871 403902 405477 407339 409410 411879
59989 411879 414916 418399 421923 425097 427821 430170 431973 432777 432440 431531 430770 430199 429266 427659 425613 423436
$$ packed form
60091E57207L784M267L952L314K651J926J235R55J127J073J66j230k166k421k807
60076E73033m001n635o787o981o463n774n408n584o123o538o456n860m966m044
60062D92413l331k935k773k783l079l625l910l414k371j550j253j021l93N61J583
60047D62119K554L249L326K869K513K668L062L332L548L814L786L130K064R14
60033E02948m36k010l081k914k031j843k843l995m199l684l423l718m053m103
60019D60615m226m809n638o132n962n265m398l682l246k953k529j885j266r62
60005D07662r99j187j407j572j422p37K11P76O80L80M86J031J575J862K071K469
59989D11879L037L483L524L174K724K349J803Q04l37r09p61n71r33j607k046k177
$$ plain form
59973 423436 421152 418756 416414 414350 412855 412377 413141 414570 415651 416066 416525 417694 419289 420553 421143
59958 421143 421161 420687 419830 419031 418818 419305 420193 421150 422006 422796 423755 425001 426077 426252 425505 424730 424536 424321
59940 424321 423067 420632 417685 414727 411981 410001 409476 410180 410858 410522 409556 409280 410675 413725 417794 422375
59924 422375 427425 433059 439084 445066 450733 455860 459742 461388 460597 458410 456094 454105 452473 451630 452067
59909 452067 453438 454779 455546 455874 456002 456129 456737 458261 460339 462100 463356 464886 467317 470230 472655
59894 472655 474089 474796 475448 476702 478890 481985 485951 490992 497168 503903 510320 516072 521491 527005 532829
59879 532829 539084 545710 552277 558305 563738 568572 572185 573731 573268 571821 570193 568352 566148 563893
59865 563893 561898 560076 558460 557567 557691 558242 558305 557673 556904 556555 556850 558010 560502 564861 571358 579739
$$ packed form
59973D23436k284k396k342k064j495m78P64J429J081M15M59J169J595J264N90
59958D21143J8m74q57p99k13M87Q88R57Q56P90R59J246J076J75p47p75j94k15
59940D24321j254k435k947k958k746j980n25P04O78l36r66k76J395L050M069M581
59924D22375N050N634O025N982N667N127L882J646p91k187k316j989j632q43M37
59909D52067J371J341P67L28J28J27O08J524K078J761J256J530K431K913K425
59894D72655J434P07O52J254K188L095L966N041O176O735O417N752N419N514N824
59879E32829O255O626O567O028N433M834L613J546m63j447j628j841k204k255
59865E63893j995j822j616q93J24N51O3o32p69l49K95J160K492M359O497Q381
$$ plain form
59849 579739 589084 597946 604904 609194 610983 611104 610439 609424 608162 606956 606420 606914 608139 609467 610322
59834 610322 609945 607326 602043 594974 587629 580948 575251 570946 568379 567045 565842 564219 562396 560454
59820 560454 558047 555165 552339 549785 547060 543866 540464 536982 532987 528152 522793 517413 512298 507778
59806 507778 504200 501320 498400 495214 492275 489716 486842 483344 480078 477910 476497 475006 473385 472076
59792 472076 471007 469874 468981 468888 469470 470191 471091 472555 474279 475396 475652 475659 475946 476498 477272 478363 479566
59775 479566 480504 481375 482917 485340 487935 490033 491856 494036 496722 499542 502174 504607 506972 509342 511661
59760 511661 513779 515662 517566 519879 522765 526077 529576 533146 536890 541115 545998 551096 555438 558445
59746 558445 560502 562362 564316 566432 569242 573407 578641 583700 587596 590382 592640 594810 597217 600140
$$ packed form
59849E79739R345Q862O958M290J789J21o65j015j262j206n36M94J225J328Q55
59834F10322l77k619n283p069p345o681n697m305k567j334j203j623j823j942
59820E60454k407k882k826k554k725l194l402l482l995m835n359n380n115m520
59806E07778l578k880k920l186k939k559k874l498l266k168j413j491j621j309
59792D72076j069j133q93r3N82P21R00J464J724J117K56PK87N52P74J091J203
59775D79566R38Q71J542K423K595K098J823K180K686K820K632K433K365K370K319
59760E11661K118J883J904K313K886L312L499L570L744M225M883N098M342L007
59746E58445K057J860J954K116K810M165N234N059L896K786K258K170K407K923
$$ plain form
59732 600140 603392 606176 607781 608299 608455 608957 610179 612090 614185 615764 616615 617177 617732 617781 616742 615018
59716 615018 613720 613313 613155 612523 611490 610458 609351 607814 605900 604068 602636 601743 601661 602576 604090 605502
59700 605502 606667 608011 609630 611035 612021 613039 614298 615171 615087 614376 613511 612117 609642 606614 604129 602349
59684 602349 600552 598586 597019 595699 593477 589832 585717 582114 578654 574393 569197 563537 557557 551273
59670 551273 545276 540418 536967 534657 533287 532641 532154 531392 530708 530799 531675 532645 533216 533554 534165 535591 538219
59653 538219 541812 545317 547632 548554 548622 548229 547376 546137 544724 543046 540673 537382 533474 529509 525913
59638 525913 522730 519555 515980 512363 509870 509334 510262 511366 511798 511461 510434 508708 506376 503542 500108
59623 500108 496068 491897 488218 485198 482587 480053 477069 472920 467471 461666 456602 452465 449122 447351
$$ packed form
59732F00140L252K784J605N18J56N02J222J911K095J579Q51N62N55M9j039j724
59716F15018j298m07j58o32j033j032j107j537j914j832j432q93q2R15J514J412
59700F05502J165J344J619J405R86J018J259Q73q4p11q65j394k475l028k485j780
59684F02349j797j966j567j320k222l645m115l603l460m261n196n660n980o284
59670E51273n997m858l451k310j370o46m87p62o84R1Q76R70N71L38O11J426K628
59653E38219L593L505K315R22O8l93q53j239j413j678k373l291l908l965l596
59638E25913l183l175l575l617k493n36R28J104M32l37j027j726k332k834l434
59623E00108m040m171l679l020k611k534k984m149n449n805n064m137l343j771
$$ plain form
59609 447351 448255 451422 454845 457025 458264 459510 460854 461843 462557 463545 464984 466529 467888 469177 470787
59594 470787 473178 476596 480708 484552 487101 487948 487557 486901 486760 487082 487084 486175 484559 482674 480413 477504
59578 477504 474427 472164 471000 470264 469387 468478 467676 466671 465295 463915 462790 461515 459653 457527 455860
59563 455860 454830 453930 452599 450696 448540 446801 446137 446611 447602 448534 449514 451032 453243 455859 458607 461502
59547 461502 464794 468818 473850 479920 486891 494845 504321 516154 531200 549962 571716 593615 611178
59534 611178 620581 620872 614077 603507 592188 582361 575383 571483 569809 569174 568978 569464 571107 573810 576655
59519 576655 578421 578379 576686 574062 571019 567287 562042 554899 546684 538897 532245 525979 518924 510918 502940
59504 502940 495993 490355 485811 482132 479124 476506 473942 471168 468209 465618 464328 464906 466959 469485
$$ packed form
59609D47351R04L167L423K180J239J246J344R89P14R88J439J545J359J289J610
59594D70787K391L418M112L844K549Q47l91o56j41L22Kr09j616j885k261k909
59578D77504l077k263j164p36q77r09q02j005j376j380j125j275j862k126j667
59563D55860j030r00j331j903k156j739o64M74R91R32R80J518K211K616K748K895
59547D61502L292M024N032O070O971P954R476J1833J5046J8762K1754K1899J7563
59534F11178R403K91o795j0570j1319r827o978l900j674o35j96M86J643K703K845
59519E76655J766m2j693k624l043l732n245p143q215p787o652o266p055q006p978
59504E02940o947n638m544l679l008k618k564k774k959k591j290N78K053K526
$$ plain form
59490 469485 471701 473339 474364 474898 475318 476002 476913 477705 478155 478224 477925 477660 478388 480826 484448 487995 490976
59473 490976 494001 497520 501040 503904 506124 507947 509175 509506 509255 509263 510230 512372 515423 518702 521513 523848
59457 523848 526481 530198 535191 541357 548677 556947 565479 573490 580556 586421 590721 593263 594284 594008
59443 594008 592201 588499 582957 575929 567781 559210 551556 546078 542908 541122 539859 538932 538401 538135 538064
59428 538064 538496 539942 542705 546852 552470 559808 569165 580644 594062 609130 625704 643826 663693
59415 663693 685843 711174 739982 770359 797804 817144 825307 822495 811205 794726 776430 759562
59403 759562 746815 739907 739628 745928 757284 769834 777942 776784 765090 745419 721839 697538 674362
59390 674362 653576 636109 622147 611166 602517 595742 590372 585917 582214 579484 577965 577683 578565 580473
$$ packed form
59490D69485K216J638J025N34M20O84R11P92M50O9k99k65P28K438L622L547K981
59473D90976L025L519L520K864K220J823J228L31k51QR67K142L051L279K811K335
59457E23848K633L717M993O166P320Q270Q532Q011P066N865M300K542J021k76
59443E94008j807l702n542p028q148q571p654n478l170j786j263r27n31k66p1
59428E38064M32J446K763M147N618P338R357J1479J3418J5068J6574J8122J9867
59415F63693K2150K5331K8808L0377K7445J9340Q163k812j1290j6479j8296j6868
59403G59562j2747o908k79O300J1356J2550Q108j158j1694j9671k3580k4301k3176
59390F74362k0786j7467j3962j0981q649o775n370m455l703k730j519k82Q82J908
$$ plain form
59376 580473 583124 586181 589389 592406 594739 596264 597657 599769 602617 605477 607973 610438 613138 615716
59362 615716 617724 619324 621290 624578 629825 636779 644236 651131 657785 665558 675286 686764 699774 714513
59348 714513 730601 746643 761598 775916 790531 805290 819145 831445 842037 850335 855339 856756
59336 856756 855319 851770 846091 838013 827856 816492 804734 793045 781641 770512 759260 747240
59324 747240 734268 721224 709504 699603 690625 681625 673006 665882 660310 655120 649491 643676 637971
59311 637971 632116 626262 621559 618976 618341 619354 622761 629478 639110 650358 662380 674409 684181 688260
59297 688260 684528 673756 658577 641639 624828 609229 595118 582332 571024 561845 555227 550861
59285 550861 548005 545971 544303 542911 542200 542649 544236 546728 550521 556469 564598 573638 582350 590838 599998
$$ packed form
59376E80473K651L057L208L017K333J525J393K112K848K860K496K465K700K578
59362F15716K008J600J966L288N247O954P457O895O654P773R728J1478J3010J4739
59348G14513J6088J6042J4955J4318J4615J4759J3855J2300J0592Q298N004J417
59336H56756j437l549n679q078j0157j1364j1758j1689j1404j1129j1252j2020
59324G47240j2972j3044j1720r901q978r000q619p124n572n190n629n815n705
59311F37971n855n854m703k583o35J013L407O717R632J1248J2022J2029R772M079
59297F88260l732j0772j5179j6938j6811j5599j4111j2786j1308r179o618m366
59285E50861k856k034j668j392p11M49J587K492L793N948Q129R040Q712Q488R160
$$ plain form
59270 599998 610095 620542 630873 641049 650723 658974 665190 669732 673144 675041 674464 671347 666927
59257 666927 662390 657641 651906 645211 638601 632963 628238 623953 620039 616817 614503 613089 612549 612955 614425
59242 614425 617071 620909 625768 631341 637324 643430 649384 655111 660749 666201 670848 674028 675629 675815
59228 675815 674451 671368 667043 662257 657132 651206 644492 637638 630944 624119 617206 610820 605069 599205
59214 599205 592892 586950 582164 578150 574138 570171 566694 563567 560377 557257 554521 551909 549041 546271
59200 546271 544257 543048 542391 542592 544119 546607 549267 552055 555454 559135 561952 563460 564577 566489 569592
59185 569592 573666 578374 583294 587995 592394 596731 601120 605523 610111 615131 620401 625408 629951 634325
59171 634325 638900 643906 649417 655076 660031 663795 667028 670762 674917 678238 679716 679344 677450 674041
$$ packed form
59270E99998J0097J0447J0331J0176R674Q251O216M542L412J897n77l117m420
59257F66927m537m749n735o695o610n638m725m285l914l222k314j414n40M06J470
59242F14425K646L838M859N573N983O106N954N727N638N452M647L180J601J86
59228F75815j364l083m325m786n125n926o714o854o694o825o913o386n751n864
59214E99205o313n942m786m014m012l967l477l127l190l120k736k612k868k770
59200E46271k014j209o57K01J527K488K660K788L399L681K817J508J117J912L103
59185E69592M074M708M920M701M399M337M389M403M588N020N270N007M543M374
59171F34325M575N006N511N659M955L764L233L734M155L321J478l72j894l409
$$ plain form
59157 674041 669055 662704 655268 646946 638004 628722 619156 609355 599777 591013 583184 576040 569554 563794
59143 563794 558324 552427 546023 539768 534172 529174 524690 520961 518161 516078 514330 512551 510480 508300
59129 508300 506728 506271 506505 506737 507202 508863 512068 516158 520475 525038 530176 536248 543781 553109 563697
59114 563697 574480 584989 595430 605723 615342 624304 633373 642927 652448 661427 669986 678223 685688
59101 685688 691857 696474 699173 699583 698197 696262 694323 691744 688218 684866 683018 682548 682257 681418 680158
59086 680158 678709 677026 674925 672053 667992 662885 657554 652482 647133 640890 634195 628020 622558 617249
59072 617249 611945 607182 603174 599249 594523 588802 582713 577173 572707 569023 565287 561023 556645 552923
59058 552923 550096 547756 545407 542793 539851 536632 533290 529959 526743 523951 522093 521411 521552 521904 522126
$$ packed form
59157F74041m986o351p436q322q942r282r566r801r578q764p829p144o486n760
59143E63794n470n897o404o255n596m998m484l729k800k083j748j779k071k180
59129E08300j572m57K34K32M65J661L205M090M317M563N138O072P533R328J0588
59114E63697J0783J0509J0441J0293R619Q962R069R554R521Q979Q559Q237P465
59101F85688O169M617K699M10j386j935j939k579l526l352j848m70k91q39j260
59086F80158j449j683k101k872m061n107n331n072n349o243o695o175n462n309
59072F17249n304m763m008l925m726n721o089n540m466l684l736m264m378l722
59058E52923k827k340k349k614k942l219l342l331l216k792j858o82J41L52K22
$$ plain form
59043 522126 522267 522572 523272 524330 525293 525699 525720 526021 526828 527636 528152 529091 531543 535791 541225 547236 553743
59026 553743 560877 568578 576646 585019 593906 603691 614579 626242 637818 648324 657049 663739 668595
59013 668595 672040 674244 674959 674031 671914 669384 666955 665001 664169 665020 667326 670373 673969 678412 683487
58998 683487 688326 692469 696251 699818 702566 703999 704396 704106 702846 700339 697074 693789 690608 687312 684040
58983 684040 681102 678419 675810 673604 672376 672284 673262 675716 680405 687586 696665 706703 716927 726864
58969 726864 736334 745383 754083 762483 770832 779557 788786 798111 806980 815027 821789 826499 828586 828239
58955 828239 826074 822329 816546 808034 796571 782843 768210 753792 739779 725910 712523 700606
58943 700606 690766 682741 676045 670475 665704 661089 656311 651692 647467 643242 638678 634311 631118 629504
$$ packed form
59043E22126J41L05P00J058R63M06K1L01Q07Q08N16R39K452M248N434O011O507
59026E53743P134P701Q068Q373Q887R785J0888J1663J1576J0506Q725O690M856
59013F68595L445K204P15r28k117k530k429j954q32Q51K306L047L596M443N075
58998F83487M839M143L782L567K748J433L97k90j260k507l265l285l181l296l272
58983F84040k938k683k609k206j228r2R78K454M689P181R079J0038J0224R937
58969G26864R470R049Q700Q400Q349Q725R229R325Q869Q047O762M710K087l47
58955H28239k165l745n783q512j1463j3728j4633j4418j4013j3869j3387j1917
58943G00606r840q025o696n570m771m615m778m619m225m225m564m367l193j614
$$ plain form
58929 629504 629081 629177 629207 628828 628074 627230 626424 625597 624877 624468 624064 622997 621204 619486 618486 618014 617697 617675
58911 617675 618242 619360 621017 623528 627067 631442 636745 643632 652468 662759 673893 685816 698392
58898 698392 710796 722172 732449 741902 750559 758695 767310 777326 788842 801891 817270 835538
58886 835538 855541 874930 892033 906493 918368 927588 934221 938422 939988 938536 934106 927085 917730
58873 917730 906286 893477 880329 867643 855955 845674 836751 828561 820640 813191 806420 799874 793108
58860 793108 786420 780147 773706 766289 758232 750668 743952 737310 730009 722058 713703 705048 696302 687834
58846 687834 679877 672503 665761 659445 652976 646026 638924 631975 624781 616911 608920 602000 596819 593217
58832 593217 590628 588183 584974 581072 577922 576906 577857 579768 582377 585978 590147 593956 597279 600684
$$ packed form
58929F29504m23R6L0l79p54q44q06q27p20m09m04j067j793j718j000m72l17k2
58911F17675N67J118J657K511L539M375N303O887Q836J0291J1134J1923J2576
58898F98392J2404J1376J0277R453Q657Q136Q615J0016J1516J3049J5379J8268
58886H35538K0003J9389J7103J4460J1875R220O633M201J566j452m430p021r355
58873I17730j1444j2809j3148j2686j1688j0281q923q190p921p449o771o546o766
58860G93108o688o273o441p417q057p564o716o642p301p951q355q655q746q468
58846F87834p957p374o742o316o469o950p102o949p194p870p991o920n181l602
58832E93217k589k445l209l902l150j016R51J911K609L601M169L809L323L405
$$ plain form
58818 600684 604112 606876 609046 611671 615348 619495 623183 625904 627524 628268 628781 629392 629405 627972 625441
58803 625441 622835 620187 616611 611922 606910 601955 596666 591092 585908 581010 575273 568310 561391 556014
58789 556014 552461 550276 549184 548933 549098 549690 551227 553746 556522 559165 562129 565678 569245 572419 575608
58774 575608 579022 581764 582771 581972 579797 576175 570884 564429 557738 551333 545476 540800 537961 536784
58760 536784 536368 535994 535554 535258 535328 535934 537086 538623 540406 542349 544224 545768 547007 548152 549177 549965
58744 549965 550841 552329 554375 556518 558995 562751 567973 573468 578095 582137 586588 591722 597198 603166
58730 603166 610271 618511 626788 633820 639169 643296 646880 650179 652987 655127 656921 659005 661792 665378
58716 665378 669900 675578 682332 689657 696940 703620 709087 712839 714751 714850 712857 708374 701467 692589 681975
$$ packed form
58818F00684L428K764K170K625L677M147L688K721J620P44N13O11J3j433k531
58803F25441k606k648l576m689n012m955n289n574n184m898n737o963o919n377
58789E56014l553k185j092k51J65N92J537K519K776K643K964L549L567L174L189
58774E75608L414K742J007p99k175l622n291o455o691o405n857m676k839j177
58760E36784m16l74m40k96P0O06J152J537J783J943J875J544J239J145J025P88
58744E49965Q76J488K046K143K477L756N222N495M627M042M451N134N476N968
58730F03166P105Q240Q277P032N349M127L584L299K808K140J794K084K787L586
58716F65378M522N678O754P325P283O680N467L752J912R9j993m483o907q878j0614
$$ plain form
58701 681975 669614 655820 641201 625991 610005 593437 577208 562355 549426 538496 529273 521173
58689 521173 513797 507427 502584 499106 496199 493328 490408 487247 483621 480052 477662 476876 476861 476544 475679
58674 475679 474742 474378 475197 477600 481501 486504 492437 499335 507043 515425 524945 536306 549361 562795
58660 562795 574830 583773 588333 588377 585393 581306 576762 571297 564944 558536 552465 546394 540468 535590
58646 535590 532122 529345 526654 524241 522212 520060 517630 515681 514946 515404 516868 519385 522607 525782 528810
58631 528810 532326 536146 538730 538923 537299 534967 532009 528033 523498 519438 516412 514583 514328 515916 518995
58616 518995 523191 528860 536531 545850 555672 564941 572997 579378 583864 586505 587371 586588 584840 583221 582273
58601 582273 581632 580885 580165 579641 579056 578123 576845 575218 573273 571649 571340 572629 574917 577792 581495 586219
$$ packed form
58701F81975j2361j3794j4619j5210j5986j6568j6229j4853j2929j0930r223q100
58689E21173p376o370m843l478k907k871k920l161l626l569k390p86j5l17q65
58674D75679r37l64Q19K403L901N003N933O898P708Q382R520J1361J3055J3434
58660E62795J2035Q943M560M4k984m087m544n465o353o408o071o071n926m878
58646E35590l468k777k691k413k029k152k430j949p35M58J464K517L222L175L028
58631E28810L516L820K584J93j624k332k958l976m535m060l026j829k55J588L079
58616E18995M196N669P671R319R822R269Q056O381M486K641Q66p83j748j619r48
58601E82273o41p47p20n24n85r33j278j627j945j624l09J289K288K875L703M724
$$ plain form
58585 586219 591849 598523 606436 614959 623076 630873 639265 648068 655882 662367 668943 676474 683943 690455
58571 690455 696935 704541 712853 721134 730199 741451 755066 770690 788961 810557 834290 857768
58559 857768 879615 899714 917768 933140 945775 955872 962903 966222 966478 965193 963048 959718 955167
58546 955167 949940 944235 937708 930122 921352 910932 898493 884446 869460 853580 836655 819277
58534 819277 802409 786516 771913 759436 749653 741807 734705 728366 723650 720546 718029 715571 713602
58521 713602 712386 711464 710401 709227 707969 706384 704300 701745 698807 695803 693289 691374 689302 686318
58507 686318 682652 679159 676374 674435 673406 673019 672531 671593 670757 670528 670402 669627 668398 667551 667543 668454 670424
58490 670424 673306 676413 679399 682905 687695 693758 700957 709714 720116 731132 741819 752756 765159
$$ packed form
58585E86219N630O674P913Q523Q117P797Q392Q803P814O485O576P531P469O512
58571F90455O480P606Q312Q281R065J1252J3615J5624J8271K1596K3733K3478
58559H57768K1847K0099J8054J5372J2635J0097P031L319K56j285k145l330m551
58546I55167n227n705o527p586q770j0420j2439j4047j4986j5880j6925j7378
58534H19277j6868j5893j4603j2477r783p846p102o339m716l104k517k458j969
58521G13602j216r22j063j174j258j585k084k555k938l004k514j915k072k984
58507F86318l666l493k785j939j029l87m88r38q36k29j26p75j229q47qR11J970
58490F70424K882L107K986L506M790O063P199Q757J0402J1016J0687J0937J2403
$$ plain form
58477 765159 779098 793504 807316 819542 828854 834382 836632 836541 834021 828412 819956 809879 799454
58464 799454 789875 782479 777949 775672 774727 775051 776947 780195 784616 790776 799116 809058 819803 831012
58450 831012 841711 849731 853681 854592 854174 852400 848345 842464 836262 830357 824629 819630 816126 813751
58436 813751 811788 810721 811292 812601 813097 813089 814436 817983 823095 829452 837398 846537 855739 864569 873188
58421 873188 880919 886452 889377 890117 888607 884570 878892 873135 867836 862609 857549 852967 848238 842582
58407 842582 836639 831605 827226 822509 818015 815498 815482 817015 819597 823441 828125 832929 838342 845240 852739
58392 852739 858836 863092 866732 870339 873551 876864 881416 886850 891537 895040 898381 901844 904721 907338
58378 907338 911091 916206 921571 927040 933809 942221 951194 960107 969327 978742 987769 996884 1007069 1017739
$$ packed form
58477G65159J3939J4406J3812J2226R312N528K250r1k520n609q456j0077j0425
58464G99454r579p396m530k277r45L24J896L248M421O160Q340R942J0745J1209
58450H31012J0699Q020L950R11m18j774m055n881o202n905n728m999l504k375
58436H13751j963j067N71J309M96qJ347L547N112O357P946R139R202Q830Q619
58421H73188P731N533K925P40j510m037n678n757n299n227n060m582m729n656
58407H42582n943n034m379m717m494k517j6J533K582L844M684M804N413O898P499
58392H52739O097M256L640L607L212L313M552N434M687L503L341L463K877K617
58378I07338L753N115N365N469O769Q412Q973Q913R220R415R027R115J0185J0670
$$ plain form
58364 1017739 1027416 1036384 1046296 1057177 1067459 1077120 1087977 1100331 1112042 1121632 1129752 1136886 1142252
58351 1142252 1145863 1149207 1152916 1156080 1158727 1162600 1168490 1175108 1181586 1188886 1197713 1207290 1217263 1228755
58337 1228755 1242463 1257679 1274088 1292461 1312634 1332794 1351684 1369597 1386464 1401148 1413461
58326 1413461 1424693 1435260 1443908 1450139 1455326 1460653 1466066 1471941 1479519 1488765 1498085 1507026 1517114
58313 1517114 1529319 1542965 1557808 1574631 1592970 1610802 1627522 1644798 1663625 1683029 1702527
58302 1702527 1723200 1745278 1767313 1788849 1811261 1834927 1858192 1880292 1902644 1926105 1949605
58291 1949605 1972681 1996729 2022548 2049194 2076274 2104796 2134822 2165042 2195546 2228155 2263114
58280 2263114 2298514 2333881 2371177 2411318 2452942 2495541 2540403 2587507 2635091 2683329 2734767
$$ packed form
58364A017739R677Q968R912J0881J0282R661J0857J2354J1711R590Q120P134N366
58351A142252L611L344L709L164K647L873N890O618O478P300Q827R577R973J1492
58337A228755J3708J5216J6409J8373K0173K0160J8890J7913J6867J4684J2313
58326A413461J1232J0567Q648O231N187N327N413N875P578R246R320Q941J0088
58313A517114J2205J3646J4843J6823J8339J7832J6720J7276J8827J9404J9498
58302A702527K0673K2078K2035K1536K2412K3666K3265K2100K2352K3461K3500
58291A949605K3076K4048K5819K6646K7080K8522L0026L0220L0504L2609L4959
58280B263114L5400L5367L7296M0141M1624M2599M4862M7104M7584M8238N1438
$$ plain form
58269 2734767 2790051 2847037 2905110 2966292 3030941 3096741 3163324 3233372 3307659 3383622 3460456
58258 3460456 3540680 3624695 3708858 3791256 3874524 3960598 4047731 4135259 4226222 4322400 4421727
58247 4421727 4523399 4630656 4745700 4866920 4993828 5129370 5274513 5426191 5583608
58238 5583608 5750773 5929780 6117739 6313662 6521883 6745047 6980472 7227324 7490422
58229 7490422 7772668 8070926 8384007 8717463 9075779 9457518 9863265 10300335 10774110
58220 10774110 11283096 11828549 12420503 13068053 13772758 14538444 15378193 16304589 17323158
58211 17323158 18443436 19686452 21073437 22618544 24341800 26277908 28464352 30936550
58203 30936550 33748638 36988292 40762955 45190750 50421085 56648295 64090631 72977917
$$ packed form
58269B734767N5284N6986N8073O1182O4649O5800O6583P0048P4287P5963P6834
58258C460456Q0224Q4015Q4163Q2398Q3268Q6074Q7133Q7528R0963R6178R9327
58247D421727J01672J07257J15044J21220J26908J35542J45143J51678J57417
58238E583608J67165J79007J87959J95923K08221K23164K35425K46852K63098
58229G490422K82246K98258L13081L33456L58316L81739M05747M37070M73775
58220A0774110N08986N45453N91954O47550P04705P65686Q39749R26396J018569
58211A7323158J120278J243016J386985J545107J723256J936108K186444K472198
58203C0936550K812088L239654L774663M427795N230335O227210P442336Q887286
$$ plain form
58195 72977917 83585256 96270714 111474795 129718482 151626155 177900988 209178379
58188 209178379 245763138 287217946 331725832 375465290 412733768 437398292 445166838
58181 445166838 435227004 410188645 374647433 333545774 291136056 250550893 213710231
58174 213710231 181464633 153922257 130785695 111556942 95648015 82481227 71561069
58167 71561069 62476393 54875423 48469328 43042042 38427789 34481916 31082269 28139877
58159 28139877 25586209 23355513 21390168 19651123 18108241 16728079 15482044 14357097
58151 14357097 13346158 12434745 11606642 10854438 10173940 9554930 8986976 8467860 7996977
58142 7996977 7566162 7165392 6791837 6445366 6120920 5813388 5524712 5258322 5011173
$$ packed form
58195G2977917J0607339J2685458J5204081J8243687K1907673K6274833L1277391
58188B09178379L6584759M1454808M4507886M3739458L7268478K4664524P768546
58181D45166838r939834k5038359l5541212m1101659m2409718m0585163l6840662
58174B13710231l2245598k7542376k3136562j9228753j5908927j3166788j0920158
58167G1561069r084676p600970o406095n427286m614253l945873l399647k942392
58159B8139877k553668k230696j965345j739045j542882j380162j246035j124947
58151A4357097j010939r11413q28103p52204o80498o19010n67954n19116m70883
58142G996977m30815m00770l73555l46471l24446l07532k88676k66390k47149
$$ plain form
58133 5011173 4778359 4560660 4360430 4174623 3998867 3834064 3682194 3539826 3402566
58124 3402566 3272066 3152048 3040936 2934720 2833658 2739951 2651926 2566563 2484914 2409353
58114 2409353 2338263 2268829 2202318 2141275 2084166 2027919 1973156 1921873 1872608 1822922 1774175
58103 1774175 1728967 1686207 1643460 1601764 1563434 1527457 1491734 1457557 1427230 1399441 1371606
58092 1371606 1344633 1320740 1298696 1275903 1253281 1233435 1215730 1197756 1179948 1164130 1148972
58081 1148972 1131472 1111723 1091926 1071947 1050167 1027541 1006531 986990 967073 947252 929435
58070 929435 913164 896715 881004 868392 858365 848330 838016 829312 822331 815438 808622 803199
58058 803199 798547 792634 785354 778016 770046 759685 747588 736400 726963 718076 709617 702701 696989
$$ packed form
58133E011173k32814k17699k00230j85807j75756j64803j51870j42368j37260
58124C402566j30500j20018j11112j06216j01062r3707q8025q5363q1649p5561
58114B409353p1090o9434o6511o1043n7109n6247n4763n1283m9265m9686m8747
58103A774175m5208m2760m2747m1696l8330l5977l5723l4177l0327k7789k7835
58092A371606k6973k3893k2044k2793k2622j9846j7705j7974j7808j5818j5158
58081A148972j7500j9749j9797j9979k1780k2626k1010j9541j9917j9821j7817
58070I29435j6271j6449j5711j2612j0027j0035j0314q704o981o893o816n423
58058H03199m652n913p280p338p970j0361j2097j1188r437q887q459o916n712
$$ plain form
58045 696989 690928 684477 678756 673368 666946 659933 653928 648706 642822 636642 631743 627747 622878 617298
58031 617298 612700 608768 603238 595507 587178 578945 569954 560379 551696 544078 536247 528242 521708 517159
58017 517159 513407 509974 507607 506165 504400 502164 500639 500226 500275 500851 502507 504410 505070 504963 506043 508648
58001 508648 511246 513241 515612 518647 521537 524338 527948 531948 534879 536754 538766 540351 539234 534802
57987 534802 528822 522265 514063 503852 493422 484362 476350 468754 461924 455942 449930 443565 437712 432827
57973 432827 428309 424013 420763 418793 417283 415949 415422 415599 415401 414694 414726 416047 417739 419307 421521 424634
57957 424634 427493 429272 430605 432090 433109 432953 431859 430178 427736 424692 421908 419868 418326 417398 417793
57942 417793 419572 421978 424881 429104 434883 441330 447933 455333 464084 473807 483953 494216 503764 511244
$$ packed form
58045F96989o061o451n721n388o422p013o005n222n884o180m899l996m869n580
58031F17298m598l932n530p731q329q233q991r575q683p618p831q005o534m549
58017E17159l752l433k367j442j765k236j525m13M9N76J656J903O60j07J080K605
58001E08648K598J995K371L035K890K801L610M000K931J875K012J585j117m432
57987E34802n980o557q202j0211j0430r060q012p596o830n982o012o365n853m885
57973D32827m518m296l250j970j510j334n27J77j98p07L2J321J692J568K214L113
57957D24634K859J779J333J485J019j56j094j681k442l044k784k040j542r28L95
57942D17793J779K406K903M223N779O447O603P400Q751R723J0146J0263R548P480
$$ plain form
57928 511244 515992 518217 517773 514017 507193 498668 489448 479618 469416 459559 450155 440657 431277 423160
57914 423160 416822 411640 407252 404157 402614 402222 402924 405125 408434 411619 414192 416819 419789 422336 423916
57899 423916 424927 425847 426775 428115 430503 433740 436999 440232 444123 448565 452612 456102 459831 463895 467433
57884 467433 470263 473127 475933 477406 476937 475170 472360 467941 462313 457230 453516 449960 445335 440041
57870 440041 434981 430337 426322 423649 422337 421444 420802 421548 424020 426717 428458 430163 433246 437526 442043
57855 442043 446804 452394 458636 464818 470561 475651 479784 483212 486681 490010 491832 491528 490320 489613 489380
57840 489380 489045 488699 488407 487554 486071 485244 486022 487427 487884 487273 486484 485749 484752 483750 483239 482875 481838
57823 481838 480012 477984 476281 475370 475852 477859 480624 483247 485299 486177 484718 480272 473498 465377 456157
$$ packed form
57928E11244M748K225m44l756o824q525r220r830j0202r857r404r498r380q117
57914D23160o338n182m388l095j543l92P02K201L309L185K573K627K970K547J580
57899D23916J011R20R28J340K388L237L259L233L891M442M047L490L729M064L538
57884D67433K830K864K806J473m69j767k810m419n628n083l714l556m625n294
57870D40041n060m644m015k673j312q93o42P46K472K697J741J705L083M280M517
57855D42043M761N590O242O182N743N090M133L428L469L329J822l04j208p07k33
57840D89380l35l46k92q53j483q27P78J405M57o11p89p35r97j002n11l64j037
57823D81838j826k028j703r11M82K007K765K623K052Q78j459m446o774q121r220
$$ plain form
57808 456157 445999 435873 426861 419121 412248 406039 400273 394519 389009 384984 383403 383874 385430 387541
57794 387541 389761 391342 392113 392917 394319 395733 396646 397754 399835 402427 404776 407371 411316 416709 422817
57779 422817 429326 436326 443514 450489 457474 464787 471961 478255 483646 488426 492307 494797 496017 496245
57765 496245 495191 492656 489496 486908 485095 483521 482149 481462 481574 482243 483594 486059 489783 494726 501080
57750 501080 508879 517462 525870 533452 539681 543975 546347 547618 548378 548272 546964 545098 543624 542830 542798
57735 542798 543986 546456 549239 551457 553409 555604 557515 558478 559143 560622 562676 564143 564959 566399 569294
57720 569294 573172 577268 581445 585978 591094 596748 602283 606540 608956 610276 611576 612957 613810 613889 613435
57705 613435 612741 612368 613162 615208 617353 618678 619831 621883 624531 626638 627892 628549 627956 624884 619220
$$ packed form
57808D56157j0158j0126r012p740o873o209n766n754n510m025j581M71J556K111
57794C87541K220J581P71Q04J402J414R13J108K081K592K349K595L945N393O108
57779D22817O509P000P188O975O985P313P174O294N391M780L881K490J220K28
57765D96245j054k535l160k588j813j574j372o87J12O69J351K465L724M943O354
57750E01080P799Q583Q408P582O229M294K372J271P60j06j308j866j474p94l2
57735E42798J188K470K783K218J952K195J911R63O65J479K054J467Q16J440K895
57720E69294L878M096M177M533N116N654N535M257K416J320J300J381Q53P9m54
57705F13435o94l73P94K046K145J325J153K052K648K107J254O57n93l072n664
$$ plain form
57690 619220 612070 604314 596316 588864 582969 578678 575329 573010 572517 573846 576102 579117 583804 590594
57676 590594 598840 608300 620113 635692 655640 680358 710824 747946 791540 840259 891668 941556
57664 941556 983572 1010725 1018177 1005438 976456 937539 894514 851248 810253 773700 743143 718793
57652 718793 699890 685604 674979 666510 658832 651820 646175 642050 638877 636439 635175 635370 636842 639432
57638 639432 642979 646760 649833 652091 654240 656591 658658 660171 661695 663881 666646 669419 671768 673598
57624 673598 675052 676394 677696 678684 679184 679588 680516 682162 684334 686874 689627 692315 694967 698143 702195
57609 702195 706631 710782 714702 718767 722882 726881 731213 736196 740984 744401 746661 749125 752339 755375
57595 755375 757221 757861 757885 757900 758505 759956 761660 762691 762979 763349 764451 766322 768910 772200 775809 779280
$$ packed form
57690F19220p150p756p998p452n895m291l349k319m93J329K256L015M687O790
57676E90594Q246R460J1813J5579J9948K4718L0466L7122M3594M8719N1409M9888
57664I41556M2016K7153P452j2739k8982l8917m3025m3266m0995l6553l0557k4350
57652G18793j8903j4286j0625q469p678p012n645m125l173k438j264J95J472K590
57638F39432L547L781L073K258K149K351K067J513J524K186K765K773K349J830
57624F73598J454J342J302R88N00M04R28J646K172K540K753K688K652L176M052
57609G02195M436M151L920M065M115L999M332M983M788L417K260K464L214L036
57595G55375J846O40K4J5O05J451J704J031K88L70J102J871K588L290L609L471
$$ plain form
57579 779280 782746 786527 790162 792758 794335 795935 798296 801262 804514 808028 811677 815242 818904 822981
57565 822981 827199 831078 834931 839515 844699 849536 853769 858182 863263 868595 873755 878783 883476 887328
57551 887328 890625 894592 899905 905881 911626 917231 923359 930303 937874 945662 953156 960177 967316 975281
57537 975281 983740 991645 998751 1005827 1013212 1020297 1026860 1033847 1042241 1051889 1061946 1071738 1080826 1089014
57523 1089014 1096783 1105011 1113885 1122686 1130946 1139010 1147210 1155322 1163173 1170919 1178387 1185041 1190959 1196935
57509 1196935 1203182 1208913 1213706 1218364 1223891 1230446 1237795 1245770 1253702 1260386 1265372 1269495 1273552 1277358
57495 1277358 1280741 1284367 1288746 1293415 1298005 1303141 1309211 1315247 1320252 1324858 1330325 1336496 1342230 1347461
57481 1347461 1353325 1360294 1367556 1374409 1381100 1388052 1395229 1402598 1410421 1418722 1427114 1435443 1444149 1453689
$$ packed form
57579G79280L466L781L635K596J577J600K361K966L252L514L649L565L662M077
57565H22981M218L879L853M584N184M837M233M413N081N332N160N028M693L852
57551H87328L297L967N313N976N745N605O128O944P571P788P494P021P139P965
57537I75281Q459P905P106P076P385P085O563O987Q394R648J0057R792R088Q188
57523A089014P769Q228Q874Q801Q260Q064Q200Q112P851P746P468O654N918N976
57509A196935O247N731M793M658N527O555P349P975P932O684M986M123M057L806
57495A277358L383L626M379M669M590N136O070O036N005M606N467O171N734N231
57481A347461N864O969P262O853O691O952P177P369P823Q301Q392Q329Q706R540
$$ plain form
57467 1453689 1463956 1474465 1484861 1495166 1505679 1516652 1527895 1538794 1548914 1558464 1568033 1578030
57455 1578030 1588519 1599317 1610083 1620568 1630975 1641796 1653149 1664681 1676226 1688083 1700368
57444 1700368 1712627 1724411 1735801 1746998 1757914 1768620 1779722 1791735 1804390 1817026 1829404
57433 1829404 1841721 1854125 1866611 1879166 1891697 1904072 1916447 1929244 1942569 1956041 1969370
57422 1969370 1982624 1995790 2008732 2021868 2036104 2051551 2067053 2081605 2095689 2110510 2126417
57411 2126417 2142827 2159211 2175344 2190873 2205509 2219585 2233817 2248483 2263289 2277895 2292291
57400 2292291 2306881 2322423 2339443 2357346 2374708 2390993 2407444 2425580 2445243 2464904 2483538
57389 2483538 2501389 2519138 2537218 2555895 2575266 2595026 2614757 2634462 2654352 2674225 2693626
$$ packed form
57467A453689J0267J0509J0396J0305J0513J0973J1243J0899J0120R550R569R997
57455A578030J0489J0798J0766J0485J0407J0821J1353J1532J1545J1857J2285
57444A700368J2259J1784J1390J1197J0916J0706J1102J2013J2655J2636J2378
57433A829404J2317J2404J2486J2555J2531J2375J2375J2797J3325J3472J3329
57422A969370J3254J3166J2942J3136J4236J5447J5502J4552J4084J4821J5907
57411B126417J6410J6384J6133J5529J4636J4076J4232J4666J4806J4606J4396
57400B292291J4590J5542J7020J7903J7362J6285J6451J8136J9663J9661J8634
57389B483538J7851J7749J8080J8677J9371J9760J9731J9705J9890J9873J9401
$$ plain form
57378 2693626 2712634 2731957 2752086 2772709 2793070 2812728 2831982 2851582 2871879 2892269 2911824
57367 2911824 2930536 2949348 2968794 2988399 3007870 3028058 3049820 3072484 3094421 3114965 3134919
57356 3134919 3155301 3176419 3198216 3220660 3243555 3266520 3289395 3312366 3335588 3359022 3382628
57345 3382628 3406438 3430431 3454620 3479181 3504189 3529281 3553882 3577768 3601246 3624915 3649360
57334 3649360 3674852 3701145 3727671 3754039 3780090 3805499 3829859 3853359 3876828 3900828 3925231
57323 3925231 3949971 3975479 4001893 4028428 4054243 4079496 4104917 4130753 4156796 4183044 4209559
57312 4209559 4235915 4261569 4286701 4312038 4337902 4363977 4390003 4416220 4443056 4470669 4498755
57301 4498755 4526666 4553869 4580408 4606661 4632654 4658215 4683904 4710999 4740042 4770057 4799614
$$ packed form
57378B693626J9008J9323K0129K0623K0361J9658J9254J9600K0297K0390J9555
57367B911824J8712J8812J9446J9605J9471K0188K1762K2664K1937K0544J9954
57356C134919K0382K1118K1797K2444K2895K2965K2875K2971K3222K3434K3606
57345C382628K3810K3993K4189K4561K5008K5092K4601K3886K3478K3669K4445
57334C649360K5492K6293K6526K6368K6051K5409K4360K3500K3469K4000K4403
57323C925231K4740K5508K6414K6535K5815K5253K5421K5836K6043K6248K6515
57312D209559K6356K5654K5132K5337K5864K6075K6026K6217K6836K7613K8086
57301D498755K7911K7203K6539K6253K5993K5561K5689K7095K9043L0015K9557
$$ plain form
57290 4799614 4828037 4855205 4881140 4906574 4933017 4961180 4989871 5017390 5043495 5069072 5094550
57279 5094550 5119859 5145449 5171925 5198814 5225024 5250549 5276518 5303463 5330744 5357928 5385559
57268 5385559 5414105 5443093 5471860 5500513 5529647 5559597 5590312 5621590 5653072 5684315 5715055
57257 5715055 5745272 5774974 5804134 5832736 5860650 5887699 5914091 5940404 5966738 5992315 6016447
57246 6016447 6039469 6062116 6084499 6106432 6128249 6150271 6171839 6191993 6211008 6230297 6250871
57235 6250871 6272827 6296124 6320717 6345900 6370770 6395602 6421692 6449554 6478218 6506632 6534693
57224 6534693 6562401 6589000 6613671 6636452 6657803 6677746 6695970 6712397 6727195 6740507 6752472
57213 6752472 6763235 6772757 6780893 6787733 6793469 6797879 6800471 6801206 6800553 6798711 6795344 6790231 6783624 6775796
$$ packed form
57290D799614K8423K7168K5935K5434K6443K8163K8691K7519K6105K5577K5478
57279E094550K5309K5590K6476K6889K6210K5525K5969K6945K7281K7184K7631
57268E385559K8546K8988K8767K8653K9134K9950L0715L1278L1482L1243L0740
57257E715055L0217K9702K9160K8602K7914K7049K6392K6313K6334K5577K4132
57246F016447K3022K2647K2383K1933K1817K2022K1568K0154J9015J9289K0574
57235F250871K1956K3297K4593K5183K4870K4832K6090K7862K8664K8414K8061
57224F534693K7708K6599K4671K2781K1351J9943J8224J6427J4798J3312J1965
57213F752472J0763R522Q136O840N736M410K592P35o53j842l367n113o607p828
$$ plain form
57199 6775796 6766787 6756842 6746529 6736078 6725083 6713227 6700993 6689389 6679205 6670644 6663363 6656641
57187 6656641 6649765 6642395 6634466 6625879 6616622 6607057 6597583 6587986 6577589 6566146 6554228 6542671 6531953
57174 6531953 6522068 6512639 6503189 6493669 6484665 6476738 6469662 6462731 6455720 6449114 6443475 6439024 6435740 6433397
57160 6433397 6431516 6429656 6427652 6425346 6422384 6418609 6414313 6409537 6403497 6395226 6384434 6371082 6354537
57147 6354537 6333925 6309045 6280197 6247333 6210138 6168668 6123124 6073334 6019463 5962960 5905812
57136 5905812 5848953 5792497 5737529 5686510 5641637 5603602 5572165 5547020 5527799 5513845 5504319
57125 5504319 5498093 5493434 5488234 5480555 5468870 5452404 5432031 5410596 5391628 5378047 5372554 5378363
57113 5378363 5398125 5432392 5480179 5540881 5614811 5702762 5806809 5931725 6084558 6272981
$$ packed form
57199F775796r009r945j0313j0451j0995j1856j2234j1604j0184q561p281o722
57187F656641o876p370p929q587r257r565r474r597j0397j1443j1918j1557j0718
57174F531953r885r429r450r520r004p927p076o931p011o606n639m451l284k343
57160F433397j881j860k004k306k962l775m296m776o040q271j0792j3352j6545
57147F354537k0612k4880k8848l2864l7195m1470m5544m9790n3871n6503n7148
57136E905812n6859n6456n4968n1019m4873l8035l1437k5145j9221j3954r526
57125E504319o226m659n200p679j1685j6466k0373k1435j8968j3581n493N809
57113E378363J9762L4267M7787O0702P3930Q7951J04047J24916J52833J88423
$$ plain form
57103 6272981 6505218 6791344 7143483 7575165 8102089 8743769 9523642 10467973 11605508
57094 11605508 12966780 14580834 16471221 18654281 21138179 23919557 26979666 30283205
57086 30283205 33777557 37389987 41028418 44590554 47972693 51067543 53760668 55946157
57078 55946157 57557349 58579328 59024008 58892804 58165977 56824395 54876615 52369927
57070 52369927 49387566 46040883 42457695 38767334 35088060 31520373 28143439 25012476
57062 25012476 22159264 19596401 17321831 15321844 13574686 12055430 10739134 9601171
57054 9601171 8617396 7765730 7027215 6385328 5825226 5334100 4901406 4518345 4177573
57045 4177573 3873331 3600920 3355844 3134028 2932666 2749944 2584087 2433571 2298124
$$ packed form
57103F272981K32237K86126L52139M31682N26924O41680P79873R44331J137535
57094A1605508J361272J614054J890387K183060K483898K781378L060109L303539
57086C0283205L494352L612430L638431L562136L382139L094850K693125K185489
57078E5946157J611192J021979M44680j31204p26827j341582j947780k506688
57070E2369927k982361l346683l583188l690361l679274l567687l376934l130963
57062B5012476k853212k562863k274570j999987j747158j519256j316296j137963
57054I601171r83775q51666p38515o41887n60102m91126m32694l83061l40772
57045D177573l04242k72411k45076k21816k01362j82722j65857j50516j35447
$$ plain form
57036 2298124 2178389 2074583 1986448 1914467 1859996 1824036 1806513 1806134 1818903 1835873 1843694
57025 1843694 1829207 1784697 1710081 1611687 1499267 1382743 1269781 1165089 1070955 987920
57015 987920 915342 852264 797923 751297 710675 674412 641887 613127 587791 565230 545129
57004 545129 527237 510722 494683 479114 464536 450903 437779 425375 414358 404687 395629 387000
56992 387000 379451 373440 368788 365389 363505 363244 364577 368078 374817 385003 397060 408168 415375 416449
56978 416449 410557 398515 382129 363170 343043 322998 304030 286761 271828 260075 251892 246778
56966 246778 244201 244471 248072 254654 263537 274871 289410 307457 328807 353150 379266 403981 423119
56953 423119 433678 434585 425955 408996 386461 361774 337260 313920 292714 274882 260924 250348
$$ packed form
57036B298124j19735j03806q8135p1981n4471l5960j7523l79J2769J6970P821
57025A843694j4487m4510p4616r8394j12420j16524j12962j04692r4134q3035
57015I87920p2578o3078n4341m6626m0622l6263l2525k8760k5336k2561k0101
57004E45129j7892j6515j6039j5569j4578j3633j3124j2404j1017r671r058q629
56992C87000p549o011m652l399j884k61J333L501O739J0186J2057J1108P207J074
56978D16449n892j2042j6386j8959k0127k0045j8968j7269j4933j1753q183n114
56966B46778k577K70L601O582Q883J1334J4539J8047K1350K4343K6116K4715J9138
56953D23119J0559R07q630j6959k2535k4687k4514k3340k1206j7832j3958j0576
$$ plain form
56941 250348 242676 237902 236042 237226 242258 252046 266498 284959 307632 335268 367250 400981 433170
56928 433170 460487 479040 485115 477543 458578 431960 400878 368005 336052 307204 282369 261435
56916 261435 243763 228349 214351 201829 191355 182832 175565 169509 165303 162835 160980 159220 158414
56903 158414 159384 161748 164742 168247 172370 176926 182003 188238 195932 204741 214820 227325 243031 261289
56889 261289 281231 303211 328035 355309 383322 409919 432461 447589 452577 447278 434057 415723
56877 415723 394119 370704 347638 327572 312363 302284 296656 295184 298342 306413 318858 335361
56865 335361 357099 386046 423108 467961 520613 581577 649458 718859 781239 827775 851946
56854 851946 851169 827527 786855 736386 682691 631001 584993 546489 515893 493521 480250 476775
$$ packed form
56941B50348p672m774j860J184N032R788J4452J8461K2673K7636L1982L3731L2189
56928D33170K7317J8553O075p572j8965k6618l1082l2873l1953k8848k4835k0934
56916B61435j7672j5414j3998j2522j0474q523p267o056m206k468j855j760q06
56903A58414R70K364K994L505M123M556N077O235P694Q809J0079J2505J5706J8258
56889B61289J9942K1980K4824K7274K8013K6597K2542J5128M988n299j3221j8334
56877D15723k1604k3415k3066k0066j5209j0079n628j472L158Q071J2445J6503
56865C35361K1738K8947L7062M4853N2652O0964O7881O9401O2380M6536K4171
56854H51946p77k3642m0672n0469n3695n1690m6008l8504l0596k2372j3271l475
$$ plain form
56842 476775 482963 498382 523038 557433 602500 659705 730507 815209 912442 1019035 1128727
56831 1128727 1230499 1309913 1354210 1357209 1320401 1251110 1160164 1059312 958267 863200 777851
56820 777851 705143 646943 603071 571842 551671 541675 541265 550212 569106 598984 640420 693250
56808 693250 756879 829792 908019 983853 1046357 1084254 1090205 1063806 1010895 940048 859617 776973
56796 776973 698427 628378 568635 518929 477935 444114 416737 396665 385414 383079 387975 398716
56784 398716 415681 439786 470772 507302 547423 587477 621304 642231 646300 633255 605193 565491
56772 565491 518639 469431 421478 376702 336084 300211 269148 242621 220493 202680 188511
56761 188511 176703 166117 156304 147353 139510 132910 127397 122616 118349 114630 111443 108619 106147 104175
$$ packed form
56842D76775O188J5419K4656L4395M5067N7205P0802Q4702R7233J06593J09692
56831A128727J01772P9414M4297K999l6808o9291r0946j00852j01045r5067q5349
56820G77851p2708n8200m3872l1229k0171r996m10Q947J8894K9878M1436N2830
56808F93250O3629P2913P8227P5834O2504L7897N951k6399n2911p0847q0431q2644
56796G76973p8546p0049n9743m9706m0994l3821k7377k0072j1251k335M896J0741
56784C98716J6965K4105L0986L6530M0121M0054L3827K0927M069j3045k8062l9702
56772E65491m6852m9208m7953m4776m0618l5873l1063k6527k2128j7813j4169
56761A88511j1808j0586r813q951p843o600n513m781m267l719l187k824k472j972
$$ plain form
56747 104175 102541 100701 98326 95582 92688 89705 86910 84761 83262 81986 80943 80652 81044 81172 80592
56732 80592 80156 80683 81574 81605 80578 79298 78323 77561 76842 76100 75256 74525 74620 76038 78396 80939 83335 85445
56714 85445 86841 87332 87670 88994 91640 94991 98276 100996 102907 104145 105189 106273 107108 107500 107706 107803
56698 107803 107288 105948 104496 103674 103255 102693 102171 102133 102256 101906 101280 101097 101381 101540 101531 101940 102852 103529 103415
56679 103415 102785 102181 101779 101447 101035 100454 99751 99102 98552 97913 97116 96401 95927 95570 95315 95368 95579 95361 94604
56660 94604 93993 93911 93739 92896 91884 91500 91596 91501 91197 91196 91650 92427 93661 95387 97190 99101 102283 107696
56642 107696 114510 121033 126856 132800 139003 144540 149063 153369 157933 161992 164695 166334 167779 169246
56628 169246 170108 169716 168162 166342 165145 164360 162781 159791 156405 154065 152843 151689 150076 148433 147100
$$ packed form
56747A04175j634j840k375k744k894k983k795k149j499j276j043k91L92J28n80
56732H0592m36N27Q91L1j027j280r75p62p19p42q44p31R5J418K358K543K396K110
56714H5445J396M91L38J324K646L351L285K720J911J238J044J084Q35L92K06R7
56698A07803n15j340j452q22m19n62n22l8J23l50o26j83K84J59rM09R12O77j14
56679A03415o30o04m02l32m12n81p03o49n50o39p97p15m74l57k55N3K11k18p57
56660I4604o11q2j72q43j012l84R6r5l04jM54P77J234J726J803J911L182N413
56642A07696O814O523N823N944O203N537M523M306M564M059K703J639J445J467
56628A69246Q62l92j554j820j197p85j579k990l386k340j222j154j613j643j333
$$ plain form
56613 147100 145930 144974 144604 144704 144536 143673 142495 141607 141294 141610 142491 143611 144476 144664 143885 142150 140209
56596 140209 139291 139915 141394 142916 144432 145870 146461 145885 145310 145986 147385 148085 148015 148304 149263 150169 150910
56579 150910 152079 153294 153232 151833 150896 151749 153656 155267 156425 157679 159089 160533 162483 165504 169394
56564 169394 173490 177531 181832 186957 193518 201730 210854 219570 227202 234104 240741 247002 252657 257762
56550 257762 262318 266183 269671 273572 278103 282321 284984 285658 284781 283035 280886 278398 275259 271238 266590
56535 266590 261734 256707 251382 245925 240367 234061 226555 218915 213097 209769 207692 205521 203299 201794
56521 201794 201236 201248 201421 201487 201329 201095 200857 200088 198101 195180 192595 191176 190478 189636 188475 187411 186689
56504 186689 186064 185000 183086 180571 178408 177369 177146 176788 175838 174532 173127 171766 170841 170670 170832 170610
$$ packed form
56613A47100j170r56l70J00j68q63j178q88l13L16Q81J120Q65J88p79j735j941
56596A40209r18O24J479J522J516J438N91n76n75O76J399P00p0K89R59R06P41
56579A50910J169J215o2j399r37Q53J907J611J158J254J410J444J950L021L890
56564A69394M096M041M301N125O561Q212R124Q716P632O902O637O261N655N105
56550B57762M556L865L488L901M531M218K663O74q77j746k149k488l139m021m648
56535B66590m856n027n325n457n558o306p506p640n818l328k077k171k222j505
56521B01794n58J2J73O6j58k34k38p69j987k921k585j419o98q42j161j064p22
56504A86689o25j064j914k515k163j039k23l58r50j306j405j361r25j71J62k22
$$ plain form
56488 170610 170065 169898 170323 170904 171490 172387 173546 174426 174772 174763 174390 173548 172734 172727 173452 174008 173925 173566 173318 173261
56468 173261 173553 174202 174499 173827 172943 173209 174474 175097 174316 173246 173061 173546 174043 174640 175646 176750 177395
56451 177395 177329 176466 175039 174120 174942 177309 179582 180612 180720 180537 180099 179576 179660 180557 181619 182543 183929
56434 183929 186001 187861 188665 188613 188106 186924 184994 183048 181780 181092 180759 180978 181719 182500 183350 184957 187221
56417 187221 188836 189101 189061 189907 191265 192044 192092 191909 191535 190879 190535 191106 192077 192286 191222 189261 187122 185756
56399 185756 186135 188327 191124 193222 194386 195054 195511 195997 196932 198315 199433 199686 199142 197893 195697 192808
56383 192808 190291 188845 188119 187870 188926 192258 197766 204739 212757 221361 229555 236473 242026 246339 249263
56368 249263 251016 252460 253989 254937 254843 254450 254657 255320 255938 256777 258380 260556 262652 264260 265058 264778 264022
$$ packed form
56488A70610n45j67M25N81N86Q97J159Q80L46rl73q42q14pP25N56q3l59k48n7
56468A73261K92O49K97o72q84K66J265O23p81j070j85M85M97N97J006J104O45
56451A77395o6q63j427r19Q22K367K273J030J08j83m38n23Q4Q97J062R24J386
56434A83929K072J860Q04n2n07j182j930j946j268o88l33K19P41P81Q50J607K264
56417A87221J615K65m0Q46J358P79M8j83l74o56l44N71R71K09j064j961k139j366
56399A85756L79K192K797K098J164O68M57M86R35J383J118K53n44j249k196k889
56383A92808k517j446p26k49J056L332N508O973Q018Q604Q194O918N553M313K924
56368B49263J753J444J529R48r4l93K07O63O18Q39J603K176K096J608P98k80p56
$$ plain form
56351 264022 264231 265966 268014 269051 269340 269879 270699 271120 271058 271040 271359 272044 273184 274648 276042 277491 279621
56334 279621 282211 283968 284421 284890 286557 288639 289696 289767 289909 290400 290753 290929 291289 291805 292366 293407 295252
56317 295252 297389 299265 301178 303491 305780 307655 309653 312317 315212 317823 320532 323695 326824 329841
56303 329841 334004 340064 346478 351105 353953 356672 359969 363267 366443 370202 374860 380105 385772 391691
56289 391691 397120 401560 405742 410685 416230 421653 427089 433128 439678 446581 454703 464865 476210 487131
56275 487131 497388 507906 519046 530681 543503 558488 575258 592536 610038 628479 648049
56264 648049 668518 690661 715884 744395 775268 808459 845398 887507 935431 989783 1051375
56253 1051375 1120637 1197898 1284120 1380202 1485601 1598769 1718805 1845548 1978192 2114975
$$ packed form
56351B64022K09J735K048J037K89N39Q20M21o2j8L19O85J140J464J394J449K130
56334B79621K590J757M53M69J667K082J057P1J42M91L53J76L60N16N61J041J845
56317B95252K137J876J913K313K289J875J998K664K895K611K709L163L129L017
56303C29841M163O060O414M627K848K719L297L298L176L759M658N245N667N919
56289C91691N429M440M182M943N545N423N436O039O550O903Q122J0162J1345J0921
56275D87131J0257J0518J1140J1635J2822J4985J6770J7278J7502J8441J9570
56264F48049K0469K2143K5223K8511L0873L3191L6939M2109M7924N4352O1592
56253A051375O9262P7261Q6222R6082J05399J13168J20036J26743J32644J36783
$$ plain form
56243 2114975 2254018 2393240 2529492 2658878 2777896 2883445 2972141 3040833 3087587 3111321
56233 3111321 3111058 3086764 3040479 2975351 2893970 2798683 2692790 2579824 2462020 2340876 2218761
56222 2218761 2098425 1981253 1867498 1758035 1654455 1557654 1467643 1384528 1308418 1238661
56212 1238661 1174346 1115234 1061179 1011339 965176 923378 886336 852600 820509 790574 764497
56201 764497 742523 723566 707157 693275 680858 668570 656631 645953 636040 625819 616043 608589
56189 608589 603704 600058 597155 595443 594380 592727 590678 589481 589086 588329 587228 586838 587042 586855 586784 588404
56173 588404 591625 594816 597660 601384 606121 610675 615080 620716 627548 633885 639367 645623 653389 661498
56159 661498 669391 678141 688216 698675 709429 721977 737003 753375 770347 788759 809348 832049
$$ packed form
56243B114975J39043J39222J36252J29386J19018J05549Q8696O8692M6754K3734
56233C111321k63k4294m6285o5128q1381r5287j05893j12966j17804j21144j22115
56222B218761j20336j17172j13755j09463j03580r6801r0011q3115p6110o9757
56212A238661o4315n9112n4055m9840m6163m1798l7042l3736l2091k9935k6077
56201G64497k1974j8957j6409j3882j2417j2288j1939j0678r913j0221r776p454
56189F08589m885l646k903j712j063j653k049j197l95p57j101l90K04j87p1J620
56173E88404L221L191K844L724M737M554M405N636O832O337N482O256P766Q109
56159F61498P893Q750J0075J0459J0754J2548J5026J6372J6972J8412K0589K2701
$$ plain form
56147 832049 857652 888040 924059 965293 1012649 1069002 1136444 1214804 1303362 1401496 1506563
56136 1506563 1613187 1715797 1810390 1893765 1963781 2021557 2071399 2117351 2161163 2203487 2244279
56125 2244279 2281054 2309244 2325734 2330577 2324942 2309784 2287037 2259188 2226062 2184064 2129859 2063029
56113 2063029 1984561 1895416 1798229 1698362 1601525 1511340 1429769 1358034 1296153 1243269 1199223
56102 1199223 1164325 1137313 1115496 1097338 1082927 1071826 1062878 1056383 1053799 1054689 1056587 1058448 1061594
56089 1061594 1066704 1072645 1078907 1086317 1094633 1102377 1109838 1119255 1131133 1143385 1154951 1167069 1180051
56076 1180051 1192236 1203415 1215869 1230586 1245698 1260175 1275745 1293516 1311953 1329938 1348719
56065 1348719 1369011 1389236 1408425 1427880 1448314 1468368 1487609 1507815 1529646 1551217 1571610
$$ packed form
56147H32049K5603L0388L6019M1234M7356N6353O7442P8360Q8558R8134J05067
56136A506563J06624J02610R4593Q3375P0016N7776M9842M5952M3812M2324M0792
56125B244279L6775K8190J6490M843n635j5158k2747k7849l3126m1998n4205o6830
56113B063029p8468q9145r7187r9867r6837r0185q1571p1735o1881n2884m4046
56102A199223l4898k7012k1817j8158j4411j1101q948o495k584Q90J898J861L146
56089A061594N110N941O262P410Q316P744P461R417J1878J2252J1566J2118J2982
56076A180051J2185J1179J2454J4717J5112J4477J5570J7771J8437J7985J8781
56065A348719K0292K0225J9189J9455K0434K0054J9241K0206K1831K1571K0393
$$ plain form
56054 1571610 1592412 1614069 1634305 1652233 1670591 1691660 1714264 1736905 1760577 1786271 1812966
56043 1812966 1840216 1869535 1901207 1933113 1964712 1998680 2036545 2076214 2115800 2156242 2198152
56032 2198152 2240098 2282189 2327315 2376588 2427519 2478775 2532273 2588390 2643940 2697579 2752463
56021 2752463 2810814 2870835 2931855 2997238 3068707 3142944 3217470 3294808 3377175 3462305 3548615
56010 3548615 3639297 3737017 3839530 3944794 4055368 4173527 4297216 4425071 4560047 4703770
56000 4703770 4853028 5006367 5168160 5341288 5521961 5706950 5899660 6103778 6317611
55991 6317611 6540489 6777943 7034213 7306294 7591734 7895492 8222668 8571813 8942279
55982 8942279 9340600 9772406 10235930 10731107 11266920 11852162 12487908 13177383 13933558
$$ packed form
56054A571610K0802K1657K0236J7928J8358K1069K2604K2641K3672K5694K6695
56043A812966K7250K9319L1672L1906L1599L3968L7865L9669L9586M0442M1910
56032B198152M1946M2091M5126M9273N0931N1256N3498N6117N5550N3639N4884
56021B752463N8351O0021O1020O5383P1469P4237P4526P7338Q2367Q5130Q6310
56010C548615R0682R7720J02513J05264J10574J18159J23689J27855J34976J43723
56000D703770J49258J53339J61793J73128J80673J84989J92710K04118K13833
55991F317611K22878K37454K56270K72081K85440L03758L27176L49145L70466
55982H942279L98321M31806M63524M95177N35813N85242O35746O89475P56175
$$ plain form
55973 13933558 14768033 15682914 16683909 17791000 19025967 20401525 21934987 23661070
55965 23661070 25619610 27845673 30387877 33324555 36749524 40761411 45487641 51103507
55957 51103507 57809370 65811528 75355036 86764779 100441378 116852831 136564949
55950 136564949 160238999 188512888 221785504 259885819 301491120 343418215 380497912
55943 380497912 406764170 417651629 411785414 391153658 359830195 322400170 282939779
55936 282939779 244570674 209311486 178150079 151325875 128654753 109729912 94026289
55929 94026289 81003570 70190051 61191473 53664214 47319975 41942471 37368092 33453968
55921 33453968 30078816 27156847 24624681 22419297 20482859 18777261 17275357 15944560
$$ packed form
55973A3933558Q34475R14881J000995J107091J234967J375558J533462J726083
55965B3661070J958540K226063K542204K936678L424969M011887M726230N615866
55957E1103507O705863Q002158R543508J1409743J3676599J6411453J9712118
55950A36564949K3674050K8273889L3272616L8100315M1605301M1927095L7079697
55943C80497912K6266258J0887459n866215k0631756l1323463l7430025l9460391
55936B82939779l8369105l5259188l1161407k6824204k2671122j8924841j5703623
55929I4026289j3022719j0813519q998578p527259o344239n377504m574379l914124
55921C3453968l375152k921969k532166k205384j936438j705598j501904j330797
$$ plain form
55913 15944560 14753081 13683617 12725998 11862968 11075962 10357577 9705273 9108917 8556441
55904 8556441 8045660 7578691 7150021 6751044 6381177 6043570 5734330 5446118 5178276
55895 5178276 4933712 4709671 4500680 4306879 4130638 3968503 3815014 3671135 3540739
55886 3540739 3421885 3309311 3202134 3101289 3002562 2900324 2795872 2694718 2597963 2503326
55876 2503326 2412137 2327855 2249501 2173372 2099738 2031464 1967805 1905737 1845861 1790983 1740375
55865 1740375 1691151 1643747 1600378 1559669 1518371 1476983 1438347 1402149 1366088 1330947 1299161
55854 1299161 1269822 1240431 1212239 1188404 1167896 1146500 1122993 1099288 1075411 1049545 1022496
55843 1022496 997089 973408 949222 924767 902562 882782 863198 843556 825874 810587 796326
$$ packed form
55913A5944560j191479j069464r57619q63030p87006p18385o52304n96356n52476
55904H556441n10781m66969m28670l98977l69867l37607l09240k88212k67842
55895E178276k44564k24041k08991j93801j76241j62135j53489j43879j30396
55886C540739j18854j12574j07177j00845r8727j02238j04452j01154r6755r4637
55876B503326r1189q4282p8354p6129p3634o8274o3659o2068n9876n4878n0608
55865A740375m9224m7404m3369m0709m1298m1388l8636l6198l6061l5141l1786
55854A299161k9339k9391k8192k3835k0508k1396k3507k3705k3877k5866k7049
55843A022496k5407k3681k4186k4455k2205j9780j9584j9642j7682j5287j4261
$$ plain form
55832 796326 783258 772685 763535 753154 741549 731218 722897 714925 706650 698997 691728 683403 673929
55819 673929 664193 653592 641019 627760 616289 606707 597542 589300 583745 580112 575708 570206 566069
55806 566069 564697 565264 567316 571398 576986 582667 588509 595656 603640 610526 615389 618236 618106 614015 607278
55791 607278 600134 592637 583688 574384 567114 561832 556352 549916 543141 534907 523101 508730 495864
55778 495864 486901 480957 477425 477928 483852 494605 509049 526010 542472 553684 556339 550283 537038
55765 537038 518610 497890 477935 460127 444401 431067 420610 412109 404132 397076 392392 389598
55753 389598 386342 381392 375256 367886 358252 346447 334041 322145 311069 301740 295183 290627 286358
55740 286358 282389 279933 278371 275381 270297 264827 260229 256173 252683 250579 249511 247945 245654 243911
$$ packed form
55832G96326j3068j0573r150j0381j1605j0331q321p972q275p653p269q325r474
55819F73929r736j0601j2573j3259j1471r582r165q242n555l633m404n502m137
55806E66069j372N67K052M082N588N681N842P147P984O886M863K847j30m091o737
55791F07278p144p497q949r304p270n282n480o436o775q234j1806j4371j2866
55778D95864q963n944l532N03N924J0753J4444J6961J6462J1212K655o056j3245
55765E37038j8428k0720j9955j7808j5726j3334j0457q501p977p056m684k794
55753C89598l256m950o136p370r634j1805j2406j1896j1076r329o557m556m269
55740B86358l969k456j562k990n084n470m598m056l490k104j068j566k291j743
$$ plain form
55726 243911 242741 240377 236152 231656 228278 225693 223487 222194 221895 221720 221556 222602 225689 230663 237609
55711 237609 246617 255914 262412 264914 264991 264241 262631 260088 257501 255182 252120 247643 242253 236238 229190
55696 229190 221600 215163 210646 206930 202876 198719 195113 192254 190471 190182 190855 191445 192064 193705 196248
55681 196248 198613 200989 204811 210212 215567 219967 223963 227421 229040 228745 228259 228287 227353 224546 221272
55666 221272 219038 217403 215440 213426 211775 210001 208066 207194 208000 209290 209988 210896 213255 216861 220791
55651 220791 224658 228009 229796 229645 228486 226945 224393 220597 216759 213686 210263 205130 198662 192000
55637 192000 185286 178280 171685 166426 162346 158812 155918 154011 152812 151970 151687 151921 151870 151179 150713 151158
55621 151158 151722 151191 149502 147412 145481 144145 143787 143860 142874 140186 136870 134043 131376 128202 124906 122071
$$ packed form
55726B43911j170k364m225m496l378k585k206j293k99j75j64J046L087M974O946
55711B37609R008R297O498K502P7p50j610k543k587k319l062m477n390o015p048
55696B29190p590o437m517l716m054m157l606k859j783k89O73N90O19J641K543
55681A96248K365K376L822N401N355M400L996L458J619k95m86K8r34k807l274
55666B21272k234j635j963k014j651j774j935q72Q06J290O98R08K359L606L930
55651B20791L867L351J787j51j159j541k552l796l838l073l423n133o468o662
55637A92000o714p006o595n259m080l534k894j907j199q42k83K34n1o91m66M45
55621A51158N64n31j689k090j931j336l58P3r86k688l316k827k667l174l296k835
$$ plain form
55605 122071 119309 116210 113577 112419 112410 112536 112679 113362 114437 115100 114891 113819 111965 109752 108142 107770
55589 107770 108266 109012 110005 111440 113146 115057 117521 120551 123476 125962 128666 132323 136936 142347 148660
55574 148660 155579 162401 169340 177783 188302 199382 208937 216122 220833 222558 220915 216523 210270 202399
55560 202399 193191 183700 174807 166245 157504 148992 141384 134643 128650 124044 121367 119995 118831 117472
55546 117472 115907 113919 111772 110639 111223 112606 113449 113643 113754 113663 112997 112245 112101 112131 111321 109667 108068
55529 108068 106882 105631 103991 102181 100441 98737 96812 94140 90342 86056 82625 80438 78533 76557
55515 76557 75971 78231 82659 87384 91532 95197 97990 99184 98943 98080 96845 95103 93350 92264 91457
55500 91457 89924 87657 85795 85276 86266 88707 92301 96045 98817 100574 102197 104183 106132 107385 107527
$$ packed form
55605A22071k762l099k633j158rJ26J43O83J075O63k09j072j854k213j610l72
55589A07770M96P46R93J435J706J911K464L030K925K486K704L657M613N411O313
55574A48660O919O822O939Q443J0519J1080R555P185M711J725j643m392o253p871
55560B02399r208r491q893q562q741q512p608o741n993m606k677j372j164j359
55546A17472j565j988k147j133N84J383Q43J94J11r1o66p52j44L0q10j654j599
55529A08068j186j251j640j810j740j704j925k672l798m286l431k187j905j976
55515G6557n86K260M428M725M148L665K793J194k41q63j235j742j753j086q07
55500I1457j533k267j862n19R90K441L594L744K772J757J623J986J949J253J42
$$ plain form
55485 107527 106427 104492 102716 101884 101886 102223 102738 103338 103579 103244 102774 102495 102024 101103 100227 99617 98434 96141
55467 96141 93879 93174 93843 94477 94566 94766 95374 95953 96391 97056 97878 98363 98527 98787 99017 98725 98120 97960 98375
55448 98375 98814 99072 99413 99657 99176 97911 96552 95644 95212 95169 95333 95176 94372 93450 93126 93203 93001 92613 92746
55429 92746 93490 94301 95114 96412 98193 99911 101506 103550 106281 109408 112907 117034 121433 125225 128233
55414 128233 131246 134767 138199 140515 141112 139858 136983 133137 129008 124728 120098 115309 110865 106910
55400 106910 103246 100010 97726 96687 96772 97705 98943 99606 99237 98427 98014 97915 97497 96763 96261 95997 95455 94599
55382 94599 93899 93360 92459 91173 90192 89915 89937 89689 89010 88060 87189 86795 86792 86483 85563 84894 85467 86968 88268
55363 88268 89059 89979 91269 92397 92958 92968 92320 90929 89398 88594 88576 88863 89556 91025 92582 92824 91514
$$ packed form
55485A07527j100j935j776q32KL37N15O00K41l35m70k79m71r21q76o10j183k293
55467I6141k262p05O69O34Q9K00O08N79M38O65Q22M85J64K60K30k92o05j60M15
55448I8375M39K58L41K44m81j265j359r08m32m3J64j57q04r22l24P7k02l88J33
55429I2746P44Q11Q13J298J781J718J595K044K731L127L499M127M399L792L008
55414A28233L013L521L432K316N97j254k875l846m129m280m630m789m444l955
55400A06910l664l236k284j039Q5R33J238O63l69q10m13r9m18p34n02k64n42q56
55382I4599p00n39r01j286r81k77K2k48o79r50q71l94ll09r20o69N73J501J300
55363H8268P91R20J290J128N61J0o48j391j531q04j8K87O93J469J557K42j310
$$ plain form
55346 91514 89920 88982 88307 87336 86396 85939 85671 85044 84047 83096 82622 82965 84043 84987 84797 83551 82363 82065
55328 82065 82539 83308 83988 84163 83653 83077 83320 84378 85428 86018 86267 85962 84565 82369 80644 80259 80885
55311 80885 81734 82297 82291 81723 81129 80957 80734 79785 78664 78676 79966 81388 82417 83786 85840 87660 88470 88669
55293 88669 88776 88509 87667 86923 86865 87079 86937 86517 86094 85482 84584 83866 83592 83244 82356 81273 80498 79933 79341
55274 79341 78952 78973 79091 79016 78949 79062 79094 78905 78786 78867 78957 79323 80731 83124 85093 85346 84039 82161 80384
55255 80384 79176 79191 80667 82938 85148 86938 88040 88043 87180 86544 86767 87208 87088 86631 86348 86018 85309 84689
55237 84689 84681 84855 84514 83857 83500 83400 83277 83599 84966 86819 87854 87581 86555 85328 84116 83311 83211 83284
55219 83284 82639 81420 80900 81975 84217 86535 88221 89223 89900 90648 91496 92033 91924 91299 90355 88962 87174
$$ packed form
55346I1514j594r38o75r71r40m57k68o27r97r51m74L43J078R44j90j246j188k98
55328H2065M74P69O80J75n10n76K43J058J050N90K49l05j397k196j725l85O26
55311H0885Q49N63on68n94j72k23r49j121J2J290J422J029J369K054J820Q10J99
55293H8669J07k67q42p44n8K14j42m20m23o12q98p18k74l48q88j083p75n65n92
55274G9341l89K1J18p5o7J13L2j89j19Q1R0L66J408K393J969K53j307j878j777
55255H0384j208J5J476K271K210J790J102Lq63o36K23M41j20m57k83l30p09o20
55237H4689qJ74l41o57l57j00j23L22J367J853J035k73j026j227j212q05j00P3
55219H3284o45j219n20J075K242K318J686J002O77P48Q48N37j09o25r44j393j788
$$ plain form
55202 87174 85771 85682 86938 88680 90047 90632 90314 89257 88037 87313 87272 87633 88056 88356 88533 88787 89215 89401
55184 89401 88782 87611 86909 87076 87237 86510 85293 84598 84643 84899 85078 85265 85380 85341 85558 86460 87658 88319 88300
55165 88300 88257 88678 89409 90106 90549 90562 90157 89740 89758 90210 90831 91591 92514 93260 93368 92790 91792 90587 89538
55146 89538 89328 90267 91591 92138 91671 90952 90642 90665 90593 90090 89009 87588 86555 86540 87353 88190 88532 88468 88254
55127 88254 87989 87712 87474 87324 87403 87907 88760 89536 89927 89996 89829 89368 88834 88784 89359 90049 90603 91562 93295 95126
55107 95126 96197 96652 97170 97776 98033 97977 97968 97909 97627 97730 99004 101042 102530 102945 102959 103094 102981 102269 101388
55088 101388 101030 101467 102649 104361 106065 107124 107427 107371 107179 106704 105861 104738 103287 101574 100292 100286 101488
55071 101488 102967 104097 104979 105651 105747 105251 104834 105026 105598 106022 106015 105368 103869 101778 99864 98593 97683 96780
$$ packed form
55202H7174j403q9J256J742J367N85l18j057j220p24m1L61M23L00J77K54M28J86
55184H9401o19j171p02J67J61p27j217o95M5K56J79J87J15l9K17R02J198O61j9
55165H8300m3M21P31O97M43J3m05m17J8M52O21P60R23P46J08n78r98j205j049
55146H9538k10R39J324N47m67p19l10K3p2n03j081j421j033j5Q13Q37L42o4k14
55127H8254k65k77k38j50P9N04Q53P76L91O9j67m61n34n0N75O90N54R59J733J831
55107I5126J071M55N18O06K57n6rn9k82J03J274K038J488M15J4J35j13p12q81
55088A01388l58M37J182J712J704J059L03n6j92m75q43j123j451j713j282oJ202
55071A01488J479J130Q82O72R6m96m17J92N72M24po47j499k091j914j271r10r03
$$ plain form
55053 96780 96130 96199 96980 98028 98946 99582 99988 100364 100831 101165 101122 101017 101500 102616 103568 103718 103359 103203 103472
55034 103472 103858 104088 104125 104012 103809 103629 103532 103490 103547 103860 104423 104906 104837 103890 102065 99821 98039 97524 98411
55015 98411 100144 102016 103574 104605 105062 105086 104899 104618 104243 103728 102913 101600 99929 98509 97897 98138 99026
54998 99026 100534 102547 104446 105511 105675 105533 105746 106745 108634 110831 112145 111948 111133 111182 112362 113594
54982 113594 114024 113893 113776 113824 113993 114309 114562 114323 113544 112639 111823 110902 109901 109252 109156 109345 109730 110616 111948
54963 111948 112979 113147 112792 112597 112745 113047 113414 113769 113884 113802 114064 115059 116387 117265 117330 116730 115752 114784 114415
54944 114415 115006 116210 117200 117366 116634 115349 114129 113655 114190 115284 116194 116620 116891 117476 118535 119980 121853
54927 121853 124429 127861 131796 135569 138882 142090 145722 149932 154522 159152 163228 165983 167066 166795
$$ packed form
55053I6780o50O9P81J048R18O36M06L76M67L34m3j05M83J116R52J50l59j56K69
55034A03472L86K30L7j13k03j80r7m2N7L13N63M83o9r47j825k244j782n15Q87
55015I8411J733J872J558J031M57K4j87k81l75n15q15j313j671j420o12K41Q88
54998I9026J508K013J899J065J64j42K13R99J889K197J314j97q15M9J180J232
54982A13594M30j31j17M8J69L16K53k39p79r05q16r21j001o49r6J89L85Q86J332
54963A11948J031J68l55j95J48L02L67L55J15q2K62R95J328Q78O5o00r78r68l69
54944A14415N91J204R90J66p32j285j220m74N35J094R10M26K71N85J059J445J873
54927A21853K576L432L935L773L313L208L632M210M590M630M076K755J083k71
$$ plain form
54913 166795 165397 162398 157412 151264 145585 141370 138478 136384 134668 132888 130832 128945 127771 126933
54899 126933 125534 123578 122038 121332 120745 119723 118781 118599 119063 119765 120647 121604 122218 122601 123817 126604 130210
54882 130210 133323 135758 138465 142195 146916 152285 157822 162678 165981 167591 168100 168052 167457 165928 163000
54867 163000 158489 152885 147278 142563 138881 135977 133762 132234 131215 130570 130370 130463 130214 129061 127047
54852 127047 124519 121719 119049 117181 116320 115769 114853 113794 113006 112029 110163 107917 106695 106947 107591 107484
54836 107484 106654 105737 104979 104299 103783 103565 103516 103449 103404 103416 103293 102992 102946 103601 104723 105564 105721 105496 105366 105395
54816 105395 105371 105310 105545 106335 107609 109158 110845 112527 113971 115046 115847 116444 116671 116408 115860 115252 114481
54799 114481 113430 112431 111880 111583 111112 110704 110980 111732 111897 111086 110324 110760 112333 114215 115912 117260 117953
$$ packed form
54913A66795j398k999m986o148n679m215k892k094j716j780k056j887j174q38
54899A26933j399j956j540p06n87j022r42j82M64P02Q82R57O14L83J216K787L606
54882A30210L113K435K707L730M721N369N537M856L303J610N09m8n95j529k928
54867A63000m511n604n607m715l682k904k215j528j019o45k00R3k49j153k014
54852A27047k528k800k670j868q61n51r16j059p88r77j866k246j222K52O44j07
54836A07484q30r17p58o80n16k18m9o7m5J2j23l01m6O55J122Q41J57k25j30K9
54816A05395k4o1K35P90J274J549J687J682J444J075Q01N97K27k63n48o08p71
54799A14481j051r99n51k97m71m08K76P52J65q11p62M36J573J882J697J348O93
$$ plain form
54782 117953 117942 117970 118930 120826 122986 125082 127284 129635 131986 134494 137575 141323 145455 149750 154105
54767 154105 158316 162353 166644 171484 176265 179981 182403 184018 184803 183934 180987 176716 172132 167363 161945
54752 161945 155910 150014 144980 140906 137487 134532 132192 130700 129958 129470 128797 128022 127621 127931 128844 129978
54736 129978 131002 131781 132335 132650 132655 132532 132961 134663 137602 141027 144416 147969 151953 156164 160388 164819
54720 164819 169392 173163 175091 175175 174144 172263 169265 165300 161087 157091 153256 149635 146529 143876 141256
54705 141256 138678 136689 135469 134516 133479 132600 131992 131212 130037 129021 128681 128603 127997 126785 125540 124656
54689 124656 124135 123965 124065 124021 123447 122541 121788 121234 120617 120135 120353 121256 122032 122085 121741 121536 121319 120572 119302
54670 119302 118020 116958 115926 115018 114842 115753 117277 118676 119815 121073 122589 123994 124856 124992 124449 123551
$$ packed form
54782A17953j1K8R60J896K160K096K202K351K351K508L081L748M132M295M355
54767A54105M211M037M291M840M781L716K422J615P85q69k947m271m584m769n418
54752A61945o035n896n034m074l419k955k340j492p42m88o73p75m01L10R13J134
54736A29978J024P79N54L15Nj23M29J702K939L425L389L553L984M211M224M431
54720A64819M573L771J928Q4j031j881k998l965m213l996l835l621l106k653k620
54705A41256k578j989j220r53j037q79o08p80j175j016l40p8o06j212j245q84
54689A24656n21j70J00m4n74r06p53n54o17m82K18R03P76N3l44k05k17p47j270
54670A19302j282j062j032r08j76R11J524J399J139J258J516J405Q62J36n43q98
$$ plain form
54654 123551 122929 122995 123309 122954 121684 120231 119286 118763 118412 118513 119295 120133 120148 119481 119206 119911 121083 121978
54636 121978 122427 122502 122032 120959 119826 119355 119700 120452 121257 122070 122838 123317 123320 122998 122709 122642 122646 122462 122081 121742
54616 121742 121552 121292 120778 120263 120198 120611 120988 120875 120334 119693 119040 118188 117073 116016 115578 116181 117815 119972
54598 119972 121846 122685 122111 120353 118213 116667 116274 116849 117743 118438 118892 119338 119880 120334 120520 120576 120783 121056
54580 121056 120938 120277 119681 119879 120779 121634 122059 122359 122843 123425 124114 125222 126738 128000 128457 128333 128163 128114
54562 128114 128226 128777 129748 130280 129486 127643 125931 125087 125013 125553 126786 128396 129544 129765 129507 129516 130090 131184
54544 131184 132765 134712 136594 137868 138285 138078 137914 138532 140038 141535 141865 140823 139299 138228 137790 137674
54528 137674 137585 137234 136285 134664 132662 130543 128334 126184 124548 123711 123426 123346 123579 124391 125486 126074 125802
$$ packed form
54654A23551o22O6L14l55j270j453r45n23l51J01P82Q38J5o67k75P05J172Q95
54636A21978M49P5m70j073j133m71L45P52Q05Q13P68M79Ll22k89o7Mj84l81l39
54616A21742j90k60n14n15o5M13L77j13n41o41o53q52j115j057m38O03J634K157
54598A19972J874Q39n74j758k140j546l93N75Q94O95M54M46N42M54J86N6K07K73
54580A21056j18o61n96J98R00Q55M25L00M84N82O89J108J516J262M57j24j70m9
54562A28114J12N51R71N32p94j843j712q44p4N40J233J610J148K21k58RN74J094
54544A31184J581J947J882J274M17k07j64O18J506J497L30j042j524j071m38j16
54528A37674q9l51r49j621k002k119k209k150j636q37k85q0K33Q12J095N88k72
$$ plain form
54511 125802 125335 125690 127038 128420 128796 128186 127499 127340 127423 127278 127034 127156 127761 128666 129826 131212 132473
54494 132473 133275 133896 134909 136296 137351 137498 136780 135624 134619 134445 135352 136583 136901 135943 134601 133998
54478 133998 134495 135785 137327 138528 139055 139263 139850 140935 141982 142775 143770 145151 146247 146425 146007 145683
54462 145683 145433 144766 143789 143343 144030 145546 147018 147712 147467 146744 146227 146230 146543 146906 147368 147952 148294 147975 147071
54443 147071 146094 145430 145065 144766 144377 143969 143783 143931 144216 144413 144628 145035 145377 145294 145150 145822 147428 148958
54425 148958 149538 149453 149386 149280 148678 147807 147449 147878 148665 149490 150549 152009 153583 154780 155220 154687 153240 151365
54407 151365 149716 148593 147844 147263 146867 146818 147305 148431 150033 151660 152953 153921 154691 155178 155326 155515 156325
54390 156325 157909 159812 161365 162045 161651 160514 159488 159357 160184 161385 162398 163016 163163 162734 161745 160442
$$ packed form
54511A25802m67L55J348J382L76o10o87j59Q3j45k44J22O05R05J160J386J261
54494A32473Q02O21J013J387J055J47p18j156j005j74R07J231L18r58j342o03
54478A33998M97J290J542J201N27K08N87J085J047P93R95J381J096J78m18l24
54462A45683k50o67r77m46O87J516J472O94k45p23n17LL13L63M62N84L42l19r04
54443A47071r77o64l65k99l89m08j86J48K85J97K15M07L42q3j44O72J606J530
54425A48958N80q5o7j06o02q71l58M29P87Q25J059J460J574J197M40n33j447j875
54407A51365j649j123p49n81l96m9M87J126J602J627J293R68P70M87J48J89Q10
54390A56325J584J903J553O80l94j137j026j31Q27J201J013O18J47m29r89j303
$$ plain form
54374 160442 159225 158589 159027 160696 163176 165727 167819 169380 170754 172586 175477 179334 183135 185774 187142
54359 187142 188093 189307 190532 191007 190281 188491 186119 183655 181359 179106 176550 173561 170515 168021 166344
54344 166344 165082 163486 161123 158226 155362 152884 150811 149156 148125 147941 148605 149819 151047 151761 151860
54329 151860 151731 151645 151371 150771 150475 151226 152639 153541 153668 154041 155202 156050 155281 153268 151582 151041 151142 151148
54311 151148 150808 150099 149083 148105 147465 146895 146004 145142 145128 146087 147287 148212 149068 150032 150739 150849 150563 150248
54293 150248 149990 149838 149995 150439 150676 150233 149200 148076 147333 147256 147895 148949 149937 150634 151141 151448 151251 150374
54275 150374 149160 148235 148046 148650 149754 150940 152063 153389 155089 156770 157947 158837 160086 161723 163048
54260 163048 163691 164047 164405 164432 163992 163824 164695 166328 167831 168841 169512 169643 168675 166642 164407 162755 161738
$$ packed form
54374A60442j217o36M38J669K480K551K092J561J374J832K891L857L801K639J368
54359A87142R51J214J225M75p26j790k372k464k296k253k556k989l046k494j677
54344A66344j262j596k363k897k864k478k073j655j031j84O64J214J228P14R9
54329A51860j29q6k74o00k96P51J413R02J27L73J161Q48p69k013j686n41J01O
54311A51148l40p09j016r78o40n70q91q62j4R59J200R25Q56R64P07J10k86l15
54293A50248k58j52J57M44K37m43j033j124p43p7O39J054R88O97N07L07j97q77
54275A50374j214r25j89O04J104J186J123J326J700J681J177Q90J249J637J325
54260A63048O43L56L58K7m40j68Q71J633J503J010O71J31r68k033k235j652j017
$$ plain form
54243 161738 161069 160646 160386 159971 159137 158049 157122 156592 156450 156611 156904 157047 156975 157095 157843 158929 159362 158507
54225 158507 156862 155517 155013 155062 155217 155332 155329 155043 154517 154061 153731 153121 151980 150668 149615 148690 147641 146836
54207 146836 146925 147886 149092 150234 151529 152956 153998 154397 154525 154765 155007 155075 155126 155269 155268 154981 154700 154607 154290
54188 154290 153267 151744 150413 149743 149823 150591 151768 152793 153316 153610 154075 154580 154785 154917 155563 156732 157744
54171 157744 158160 158263 158475 158764 158826 158530 158010 157622 157900 159078 160485 160928 159959 158385 157182 156357 155397 154428
54153 154428 154151 154647 155018 154436 153038 151510 150243 149291 148796 148956 149692 150730 151945 153286 154508 155416
54137 155416 156333 157811 159752 161295 161843 161775 161774 161799 161218 159870 158496 158048 158779 160059 160922 160859 160310 160288 161306
54118 161306 162791 163823 164254 164732 165775 167349 169347 171782 174243 175796 175950 175380 175154 175462 175628 175340
$$ packed form
54243A61738o69m23k60m15q34j088r27n30j42J61K93J43p2J20P48J086M33q55
54225A58507j645j345n04M9J55J15lk86n26m56l30o10j141j312j053r25j049q05
54207A46836Q9R61J206J142J295J427J042L99J28K40K42O8N1J43jk87k81r3l17
54188A54290j023j523j331o70Q0P68J177J025N23K94M65N05K05J32O46J169J012
54171A57744M16J03K12K89O2k96n20l88K78J178J407M43r69j574j203q25r60r69
54153A54428k77M96L71n82j398j528j267r52m95J60P36J038J215J341J222R08
54137A55416R17J478J941J543N48o8jK5n81j348j374m48P31J280Q63o3n49k2J018
54118A61306J485J032M31M78J043J574J998K435K461J553J54n70k26L08J66k88
$$ plain form
54102 175340 175269 176345 178841 182437 186887 192252 198525 205276 211736 217132 220893 222725 222595 220612 216867
54087 216867 211466 204873 198169 192634 188864 186451 184676 183364 182829 183162 183999 184979 186067 187330 188761
54072 188761 190522 192992 196240 199623 202288 204008 205225 206263 206830 206388 204785 202323 199421 196464 193892
54057 193892 192084 191036 190356 189769 189455 189652 190099 190257 190132 190460 191872 194189 196765 199277 201860 204703
54041 204703 207930 211818 216682 222392 228310 233814 238782 243507 248282 253088 257574 261316 264206 266542
54027 266542 268647 270519 271966 272937 273528 273815 273930 274126 274452 274510 273840 272446 270617 268422 265774 262820
54011 262820 259736 256207 251707 246345 240870 235751 230822 226057 222045 219344 217797 216855 216166 215508 214523
53996 214523 212976 211067 209176 207457 205927 204651 203554 202282 200581 198610 196684 194959 193567 192720
$$ packed form
54102A75340p1J076K496L596M450N365O273O751O460N396L761J832j30j983l745
54087B16867n401o593o704n535l770k413j775j312n35L33Q37R80J088J263J431
54072A88761J761K470L248L383K665J720J217J038N67m42j603k462k902k957k572
54057A93892j808j048o80n87l14J97M47J58j25L28J412K317K576K512K583K843
54041B04703L227L888M864N710N918N504M968M725M775M806M486L742K890K336
54027B66542K105J872J447R71N91K87J15J96L26N8o70j394j829k195k648k954
54011B62820l084l529m500n362n475n119m929m765m012k701j547r42o89o58r85
53996B14523j547j909j891j719j530j276j097j272j701j971j926j725j392q47
$$ plain form
53982 192720 192346 192015 191609 191701 192796 194467 195807 196533 197028 197459 197603 197647 198515 201028 205105 210059 215335
53965 215335 220683 225905 230908 236077 242246 250127 259855 271209 284066 298179 312355 324259 331577
53952 331577 333432 330434 323601 313851 302527 291492 282077 274275 267485 261730 257704 255884 256184 258302
53938 258302 261800 265825 269346 271922 273987 276243 278972 281927 284657 286883 288745 290680 292957 295409
53924 295409 297752 299979 302250 304635 307310 310756 315295 320532 325796 331112 337197 344317 351604 357825
53910 357825 362539 366243 369536 372450 374564 375534 375376 374290 372430 370028 367585 365477 363286 359998 355227
53895 355227 349841 344898 340313 335192 329192 322812 316401 309705 302626 295689 289352 283386 277370 271401
53881 271401 265898 261020 256737 253152 250240 247441 244060 240121 236435 233746 232086 231004 230089 229048
$$ packed form
53982A92720l74l31m06R2J095J671J340P26M95M31J44M4Q68K513M077M954N276
53965B15335N348N222N003N169O169P881R728J1354J2857J4113J4176J1904P318
53952C31577J855k998o833r750j1324j1035r415p802o790n755m026j820L00K118
53938B58302L498M025L521K576K065K256K729K955K730K226J862J935K277K452
53924B95409K343K227K271K385K675L446M539N237N264N316O085P120P287O221
53910C57825M714L704L293K914K114R70j58j086j860k402k443k108k191l288m771
53895C55227n386m943m585n121o000o380o411o696p079o937o337n966o016n969
53881B71401n503m878m283l585k912k799l381l939l686k689j660j082r15j041
$$ plain form
53867 229048 227539 225276 222340 219206 216315 213707 211179 208722 206620 205093 204086 203462 203163 202974 202409
53852 202409 201208 199799 198831 198318 197690 196776 196185 196406 196985 196997 196153 195005 194173 193784 193710 193969 194710 195934
53834 195934 197353 198459 198717 197907 196415 195096 194677 195269 196453 197785 199110 200427 201649 202627 203361 204075
53818 204075 205101 206719 209018 211767 214456 216655 218379 220028 221973 224306 226910 229568 232010 234174
53804 234174 236532 239866 244516 250019 255612 260925 266000 270868 275310 278924 281363 282733 283896 286010
53790 286010 289427 293240 296184 297782 298317 298047 297027 295532 294001 292447 290389 287497 283959 280118 276089
53775 276089 271902 267696 263601 259618 255752 252071 248590 245239 242005 238960 236173 233746 231816 230260
53761 230260 228504 225951 222626 219110 215937 213340 211432 210148 209053 207781 206742 206810 208117 209686 210571
$$ packed form
53867B29048j509k263k936l134k891k608k528k457k102j527j007o24k99j89n65
53852B02409j201j409r68n13o28r14n91K21N79J2q44j148q32l89p4K59P41J224
53834A95934J419J106K58q10j492j319m19N92J184J332J325J317J222R78P34P14
53818B04075J026J618K299K749K689K199J724J649J945K333K604K658K442K164
53804B34174K358L334M650N503N593N313N075M868M442L614K439J370J163K114
53790B86010L417L813K944J598N35k70j020j495j531j554k058k892l538l841m029
53775B76089m187m206m095l983l866l681l481l351l234l045k787k427j930j556
53761B30260j756k553l325l516l173k597j908j284j095j272j039O8J307J569Q85
$$ plain form
53746 210571 210885 211335 212104 212700 212630 211822 210459 208780 207080 205696 204972 205245 206629 208686 210538 211532 211745
53729 211745 211768 212179 213258 214895 216556 217623 218050 218532 219804 221912 224317 226480 228122 229174 229800 230340
53713 230340 230991 231630 232174 232951 234433 236667 239249 241805 244316 246991 250001 253388 257074 260943 264933
53698 264933 268976 272901 276552 280026 283544 287010 289923 291925 293208 294203 295027 295434 295183 294291 293044
53683 293044 291844 290919 290151 289368 288811 288921 289554 289883 289353 288334 287453 286733 285883 285123 284977 285358 285547 285216
53665 285216 284893 285175 285898 286410 286368 285971 285565 285258 284926 284407 283714 283090 282822 282962 283309 283671 284090 284748 285741
53646 285741 286975 288278 289555 290761 291722 292230 292467 293150 294883 297395 299748 301336 302373 303395 304773
53631 304773 306810 309739 313299 316767 319852 323143 327287 332158 337344 342959 349193 355370 360325 363725
$$ packed form
53746B10571L14M50P69N96p0q08j363j679j700j384p24K73J384K057J852R94K13
53729B11745K3M11J079J637J661J067M27M82J272K108K405K163J642J052O26N40
53713B30340O51O39N44P77J482K234K582K556K511K675L010L387L686L869L990
53698B64933M043L925L651L474L518L466K913K002J283R95Q24M07k51q92j247
53683B93044j200r25p68p83n57J10O33L29n30j019q81p20q50p60j46L81J89l31
53665B85216l23K82P23N12m2l97m06l07l32n19o93o24k68J40L47L62M19O58R93
53646B85741J234J303J277J206R61N08K37O83J733K512K353J588J037J022J378
53631C04773K037K929L560L468L085L291M144M871N186N615O234O177M955L400
$$ plain form
53617 363725 366252 368432 370086 371087 371917 373119 374840 377208 380520 384583 388462 391468 394050 397146
53603 397146 400992 405094 409141 413200 417083 420190 422198 423418 424245 424567 424009 422536 420567 418579 416783
53588 416783 415112 413351 411303 408994 406743 404965 403843 403197 402595 401578 399883 397728 395845 394955 394921
53573 394921 394635 393089 390524 388132 386651 385698 384600 383311 382121 380975 379723 378727 378467 378650 378467 377846
53557 377846 377684 378527 379735 380445 380784 381432 382387 382916 382717 382443 382920 384334 386385 388817 391499 394228 396843
53540 396843 399452 402337 405631 409276 413330 418080 423703 429885 436051 442111 448823 457102 466956 477405
53526 477405 487607 497796 508845 521062 533787 546200 558223 570516 583811 598442 614392
53515 614392 631565 649967 669717 690972 713779 737934 762998 788536 814348 840452 866736
$$ packed form
53617C63725K527K180J654J001Q30J202J721K368L312M063L879L006K582L096
53603C97146L846M102M047M059L883L107K008J220Q27L22n58j473j969j988j796
53588D16783j671j761k048k309k251j778j122o46o02j017j695k155j883q90l4
53573C94921k86j546k565k392j481r53j098j289j190j146j252r96k60J83j83o21
53557C77846j62Q43J208P10L39O48R55N29j99k74M77J414K051K432K682K729K615
53540C96843K609K885L294L645M054M750N623O182O166O060O712Q279R854J0449
53526D77405J0202J0189J1049J2217J2725J2413J2023J2293J3295J4631J5950
53515F14392J7173J8402J9750K1255K2807K4155K5064K5538K5812K6104K6284
$$ plain form
53504 866736 892688 917608 941143 963585 985620 1007863 1030589 1053679 1076605 1098619 1119238
53493 1119238 1138659 1157581 1176564 1195637 1214477 1232802 1250590 1268144 1286014 1304647 1323886
53482 1323886 1342994 1361406 1379392 1397693 1416499 1435076 1452419 1467918 1481199 1491700 1498968
53471 1498968 1503391 1506166 1508212 1509181 1507698 1502556 1493626 1481802 1468291 1454001 1439385 1424606 1409687
53458 1409687 1394550 1379057 1363088 1346521 1329073 1310310 1290001 1268367 1245870 1222837 1199596
53447 1199596 1176852 1155520 1135968 1117670 1099826 1082149 1064951 1048805 1034382 1022374 1013103
53436 1013103 1006195 1000916 996794 993700 991519 990195 990133 992023 996029 1001442 1007408 1013785 1021062 1029666
53422 1029666 1039682 1051105 1064029 1078537 1094631 1112268 1131289 1151341 1172132 1193820 1216858
$$ packed form
53504H66736K5952K4920K3535K2442K2035K2243K2726K3090K2926K2014K0619
53493A119238J9421J8922J8983J9073J8840J8325J7788J7554J7870J8633J9239
53482A323886J9108J8412J7986J8301J8806J8577J7343J5499J3281J0501P268
53471A498968M423K775K046R69j483n142q930j1824j3511j4290j4616j4779j4919
53458A409687j5137j5493j5969j6567j7448j8763k0309k1634k2497k3033k3241
53447A199596k2744k1332j9552j8298j7844j7677j7198j6146j4423j2008r271
53436A013103o908n279m122l094k181j324o2J890M006N413N966O377P277Q604
53422A029666J0016J1423J2924J4508J6094J7637J9021K0052K0791K1688K3038
$$ plain form
53411 1216858 1241422 1267246 1294201 1322712 1353300 1385847 1419693 1454496 1490716 1529190 1570472
53400 1570472 1614660 1661583 1710976 1762651 1816569 1872479 1929446 1986228 2042483 2099254 2157680
53389 2157680 2217383 2276633 2334000 2389237 2442585 2494090 2543901 2592553 2640292 2686463 2730034
53378 2730034 2770400 2807201 2839775 2867512 2890612 2909819 2925310 2936434 2942569 2943624 2939373 2928787
53366 2928787 2910506 2883841 2849161 2807589 2760596 2709674 2655981 2600222 2542991 2485168 2427797
53355 2427797 2371563 2316576 2262702 2210016 2158839 2109419 2061702 2015448 1970477 1926633 1883554
53344 1883554 1840688 1797674 1754575 1711734 1669609 1628882 1590468 1555052 1522651 1492820 1465240
53333 1465240 1439997 1417423 1397851 1381328 1367249 1354405 1341714 1328889 1316090 1303065 1289104
$$ packed form
53411A216858K4564K5824K6955K8511L0588L2547L3846L4803L6220L8474M1282
53400A570472M4188M6923M9393N1675N3918N5910N6967N6782N6255N6771N8426
53389B157680N9703N9250N7367N5237N3348N1505M9811M8652M7739M6171M3571
53378B730034M0366L6801L2574K7737K3100J9207J5491J1124O135J055m251j0586
53366B928787j8281k6665l4680m1572m6993n0922n3693n5759n7231n7823n7371
53355B427797n6234n4987n3874n2686n1177m9420m7717m6254m4971m3844m3079
53344A883554m2866m3014m3099m2841m2125m0727l8414l5416l2401k9831k7580
53333A465240k5243k2574j9572j6523j4079j2844j2691j2825j2799j3025j3961
$$ plain form
53322 1289104 1273883 1257980 1242416 1227994 1215115 1203816 1193734 1184308 1175344 1167228 1160529 1155583
53310 1155583 1152579 1151717 1152944 1155655 1159038 1162775 1167289 1173266 1181042 1190479 1201341 1213656 1227602
53297 1227602 1243095 1259799 1277703 1297436 1319675 1344319 1370517 1397436 1424672 1452006 1479113
53286 1479113 1505548 1530744 1554136 1575710 1596342 1616929 1636993 1654673 1668355 1677880 1683932 1686819
53274 1686819 1686393 1682750 1676410 1667820 1657052 1643925 1628140 1609468 1588101 1564706 1539896 1513800
53262 1513800 1486371 1457858 1428617 1398684 1367974 1336815 1305844 1275294 1244780 1213906 1182886
53251 1182886 1152447 1123268 1095574 1069171 1043738 1018965 994392 969368 943519 917214 891219
53240 891219 865840 840888 816548 793685 772933 754021 736372 719929 704848 690909 677913
$$ packed form
53322A289104j5221j5903j5564j4422j2879j1299j0082r426q964q116o699m946
53310A155583l004q62J227K711L383L737M514N977P776R437J0862J2315J3946
53297A227602J5493J6704J7904J9733K2239K4644K6198K6919K7236K7334K7107
53286A479113K6435K5196K3392K1574K0632K0587K0064J7680J3682R525O052K887
53274A686819m26l643o340q590j0768j3127j5785j8672k1367k3395k4810k6096
53262A513800k7429k8513k9241k9933l0710l1159l0971l0550l0514l0874l1020
53251A182886l0439k9179k7694k6403k5433k4773k4573k5024k5849k6305k5995
53240H91219k5379k4952k4340k2863k0752j8912j7649j6443j5081j3939j2996
$$ plain form
53229 677913 666339 656780 648836 641294 633406 625306 617173 608705 599562 589700 579072 567553 555331
53216 555331 542833 530075 516677 502777 489364 477368 466835 457323 448622 440659 433088 425460
53204 425460 417628 409691 401786 394125 386899 379870 372462 364581 356931 350065 343532 336535 329128 322101
53190 322101 315871 310149 304704 299753 295436 291473 287616 284072 281226 279194 277826 276895 276124 275212 274010
53175 274010 272589 271062 269491 267934 266376 264567 262204 259407 256753 254720 253278 252136 251160 250313 249371
53160 249371 248000 246195 244473 243565 243875 245211 246964 248546 249638 250065 249657 248448 246866 245398 244124
53145 244124 242890 241948 241940 243061 244637 245863 246584 246992 246946 246246 245390 245282 246021 246643 246426 245920 246224 247602
53127 247602 249335 250718 251582 251914 251651 251160 251351 252850 255191 257212 258187 258295 258061 257683 257058 256198 255353
$$ packed form
53229F77913j1574r559p944p542p888q100q133q468r143r862j0628j1519j2222
53216E55331j2498j2758j3398j3900j3413j1996j0533r512q701p963p571p628
53204D25460p832p937p905p661p226p029p408p881p650o866o533o997p407p027
53190C22101o230n722n445m951m317l963l857l544k846k032j368r31p71r12j202
53175B74010j421j527j571j557j558j809k363k797k654k033j442j142r76q47r42
53160B49371j371j805j722r08L10J336J753J582J092M27m08j209j582j468j274
53145B44124j234r42qJ121J576J226P21M08m6p00q56j08P39O22k17n06L04J378
53127B47602J733J383Q64L32k63m91J91J499K341K021R75J08k34l78o25q60q45
$$ plain form
53110 255353 254771 254496 254370 254086 253310 251910 250191 248730 247842 247249 246425 245220 243978 243056 242438 241927 241482
53093 241482 241178 240985 240847 240889 241288 241952 242560 242989 243410 243881 244064 243624 242757 242086 242008 242303 242461 242303 242212 242643
53073 242643 243390 243517 242263 240033 238162 237608 238056 238462 238198 237385 236377 235378 234559 234079 233791 233192 231943
53056 231943 230386 229361 229482 230606 231959 232836 233218 233713 234829 236382 237693 238273 238166 237696 237146 236653
53040 236653 236136 235304 234008 232670 232053 232423 233244 233913 234493 235314 236101 236079 235064 233945 233746 234437 235051 234940
53022 234940 234630 235293 237485 240536 243214 244888 245903 246818 247576 247714 247219 246736 246753 246968 246766 246063 245295
53005 245295 244694 244023 243082 242056 241204 240535 240007 239792 240038 240564 241058 241477 241993 242685 243576 244859 246699 248757
52987 248757 250287 250852 250743 250582 250729 251148 251629 251966 252153 252544 253574 255107 256254 256161 254982 253820 253720
$$ packed form
53110B55353n82k75j26k84p76j400j719j461q88n93q24j205j242r22o18n11m45
53093B41482l04j93j38M2L99O64O08M29M21M71J83m40q67o71p8K95J58j58r1M31
53073B42643P47J27j254k230j871n54M48M06k64q13j008r99q19m80k88n99j249
53056B31943j557j025J21J124J353Q77L82M95J116J553J311N80j07m70n50m93
53040B36653n17q32j296j338o17L70Q21O69N80Q21P87k2j015j119j99O91O14j11
53022B34940l10O63K192L051K678J674J015R15P58J38m95m83J7K15k02p03p68
53005B45295o01o71r41j026q52o69n28k15K46N26M94M19N16O92Q91J283J840K058
52987B48757J530N65j09j61J47M19M81L37J87L91J030J533J147r3j179j162j00
$$ plain form
52970 253720 254849 256592 258216 259296 259735 259604 259122 258712 258819 259503 260275 260591 260447 260244 260075 259540 258404
52953 258404 257026 255791 254414 252348 249836 248101 248264 250176 252418 253465 252975 252003 251824 252471 252672 251407
52937 251407 249156 247296 246536 246485 246521 246434 246180 245606 244727 243831 243053 242202 241246 240636 240875 241965 243475 244903
52919 244903 245743 245548 244295 242556 241038 240084 239736 239957 240420 240370 239218 237274 235471 234364 233775 233405 233354
52902 233354 233821 234646 235449 236033 236376 236409 236129 235890 236289 237561 239235 240562 241318 242041 243459 245736 248325
52885 248325 250441 251566 251622 250894 249839 248780 247705 246474 245252 244505 244465 244792 244985 245001 245249 246075 247539
52868 247539 249580 252127 254925 257510 259466 260639 261047 260753 259849 258435 256518 254119 251560 249406 247941
52853 247941 246793 245279 243090 240521 238097 236180 234807 233683 232289 230288 227900 225738 224172 223063
$$ packed form
52970B53720J129J743J624J080M39j31m82m10J07O84P72L16j44k03j69n35j136
52953B58404j378j235j377k066k512j735J63J912K242J047m90r72j79O47K01j265
52937B51407k251j860p60n1L6q7k54n74q79q96p78q51r56o10K39J090J510J428
52919B44903Q40j95j253j739j518r54l48K21M63n0j152j944j803j107n89l70n1
52902B33354M67Q25Q03N84L43L3k80k39L99J272J674J327P56P23J418K277K589
52885B48325K116J125N6p28j055j059j075j231j222p47m0L27J93J6K48Q26J464
52868B47539K041K547K798K585J956J173M08k94r04j414j917k399k559k154j465
52853B47941j148j514k189k569k424j917j373j124j394k001k388k162j566j109
$$ plain form
52839 223063 222138 221301 220443 219328 218060 217383 218007 219743 221766 223636 225498 227285 228456 228790 228788 228877 228799
52822 228799 228312 227870 227936 228148 228089 228481 230457 233676 236415 237815 238883 240635 242336 242565 241258 239523
52806 239523 237849 235718 233004 230580 229128 228184 226868 225026 223131 221406 219646 217781 216215 215481 215746
52791 215746 216672 217711 218561 219339 220268 221269 222060 222575 223093 223905 225048 226371 227606 228367 228361 227793 227318 227371
52773 227371 227653 227463 226459 224974 223626 222757 222228 221648 220763 219638 218473 217361 216377 215817 216145 217581
52757 217581 219858 222409 224657 226153 226667 226329 225545 224745 224295 224629 226124 228669 231657 234635 237730 241111
52741 241111 244264 246318 247128 247537 248354 249442 250121 250224 250281 250708 251321 251816 252377 253322 254300 254360 253073 251224
52723 251224 249988 249502 248691 246648 243845 241706 241064 241283 240945 239267 236835 235007 234599 235146 235491 235054
$$ packed form
52839B23063r25q37q58j115j268o77O24J736K023J870J862J787J171L34kQ9p8
52822B28799m87m42O6K12n9L92J976L219K739J400J068J752J701K29j307j735
52806B39523j674k131k714k424j452r44j316j842j895j725j760j865j566p34K65
52791B15746R26J039Q50P78R29J001P91N15N18Q12J143J323J235P61on68m75N3
52773B27371K82j90j004j485j348q69n29n80q85j125j165j112r84n60L28J436
52757B17581K277K551K248J496N14l38p84q00m50L34J495K545K988K978L095L381
52741B41111L153K054Q10M09Q17J088O79J03N7M27O13M95N61R45R78O0j287j849
52723B51224j236m86q11k043k803k139o42K19l38j678k432j828m08N47L45m37
$$ plain form
52707 235054 234372 234373 235332 236740 237986 238798 239104 238875 238312 237890 237898 238046 237818 237192 236759 237063 237986 238883 239218
52688 239218 238991 238648 238695 239346 240405 241379 241723 241110 239584 237611 235891 234942 234778 235064 235603 236498 237769
52671 237769 238982 239534 239240 238452 237624 237043 237009 237928 239931 242528 244883 246442 247232 247731 248642 250621 253814
52654 253814 257610 261072 263711 265573 266578 266184 264068 260913 258053 256245 255068 253687 251963 250579
52640 250579 250125 250334 250373 249845 249284 249549 250823 252401 253519 254136 254791 255910 257522 259492 261507 262789
52624 262789 262344 259951 256672 253991 252450 251449 250309 249146 248561 248835 249627 250293 250358 249820 249146 248833 248868
52607 248868 248825 248568 248566 249285 250490 251488 251915 251955 251869 251692 251408 251094 250833 250716 250994 251916 253377 254941 256347
52588 256347 257710 259170 260570 261645 262314 262661 262838 263088 263551 263975 263944 263568 263540 264162 264756 264526 263768 263561
$$ packed form
52707B35054o82JR59J408J246Q12L06k29n63m22QJ48k28o26m33L04R23Q97L35
52688B39218k27l43M7O51J059R74L44o13j526j973j720r49j64K86N39Q95J271
52671B37769J213N52k94p88q28n81l4R19K003K597K355J559P90M99R11J979L193
52654B53814L796L462K639J862J005l94k116l155k860j808j177j381j724j384
52640B50579m54K09L9n28n61K65J274J578J118O17O55J119J612J970K015J282
52624B62789m45k393l279k681j541j001j140j163n85K74P92O66O5n38o74l13L5
52607B48868m3k57kP19J205R98M27M0q6j77k84l14k61j17K78R22J461J564J406
52588B56347J363J460J400J075O69L47J77K50M63M24l1l76k8O22N94k30p58k07
$$ plain form
52570 263561 264316 265272 265545 265104 264483 263972 263449 262690 261496 259733 257592 255703 254670 254527 254855 255295 255658
52553 255658 255720 255346 254921 255181 256370 257792 258510 258315 257720 257162 256622 256049 255713 255858 256299 256618 256608 256280 255624
52534 255624 254771 254302 254885 256446 258045 258829 258910 259041 259655 260498 261143 261536 261959 262547 262986 262758 261787 260745
52516 260745 260470 261015 261612 261757 262029 263441 266176 269379 272200 274588 276905 279088 280484 280403 278678 275657
52500 275657 271892 267912 264309 261748 260582 260404 260313 259830 259338 259433 260078 260750 261150 261355 261372 261083 260715 260844
52482 260844 261710 262907 263997 265095 266505 268039 269124 269565 269818 270394 271198 271657 271427 270852 270597 270945 271567
52465 271567 272056 272494 273349 274932 277133 279569 281713 282998 283079 282109 280563 278789 276919 275090 273404 271611
52449 271611 269215 266144 263108 261091 260542 261087 261850 262039 261475 260612 259971 259605 259312 259130 259143 258895 257712
$$ packed form
52570B63561P55R56K73m41o21n11n23p59j194j763k141j889j033j43L28M40L63
52553B55658O2l74m25K60J189J422P18j95n95n58n40n73l36J45M41L19j0l28o56
52534B55624q53m69N83J561J599P84Q1J31O14Q43O45L93M23N88M39k28r71j042
52516B60745k75N45N97J45K72J412K735L203K821K388K317K183J396q1j725l021
52500B75657l765l980l603k561j166j78r1m83m92R5O45O72M00K05J7k89l68J29
52482B60844Q66J197J090J098J410J534J085M41K53N76Q04M59k30n75k55L48O22
52465B71567M89M38Q55J583K201K436K144J285Q1r70j546j774j870j829j686j793
52449B71611k396l071l036k017n49N45P63J89n64q63o41l66k93j82J3k48j183
$$ plain form
52432 257712 255816 254488 254713 256145 257789 259228 260664 262149 263405 264285 264901 265432 266175 267530 269521
52417 269521 271651 273742 276548 280743 285572 289561 292636 296595 303156 312352 323202 334990 347116
52404 347116 358279 366733 371230 371340 367237 359864 350972 342153 333789 325511 317550 310908 306097 302485
52390 302485 299218 296249 294073 292867 292321 292092 292062 292328 293168 294832 297120 299395 301273 303060 305196 307568
52374 307568 309864 312426 316090 321047 326339 330712 333668 335561 336996 338396 339882 341271 342309 342952
52360 342952 343301 343254 342612 341678 341292 341916 343059 344039 344944 346301 348039 349502 350483 351571 353316 355609 358099
52343 358099 360745 363686 367008 370899 375661 381236 387120 393030 399284 406190 413543 421204 429738 439786
52329 439786 451036 462596 474312 487000 501248 516715 532828 549540 566942 584643 602115
$$ packed form
52432B57712j896j328K25J432J644J439J436J485J256Q80O16N31P43J355J991
52417B69521K130K091K806M195M829L989L075L959O561R196J0850J1788J2126
52404C47116J1163Q454M497J10m103p373q892q819q364q278p961o642m811l612
52390C02485l267k969k176j206n46k29l0K66Q40J664K288K275J878J787K136K372
52374C07568K296K562L664M957N292M373K956J893J435J400J486J389J038O43
52360C42952L49m7o42r34l86O24J143R80R05J357J738J463R81J088J745K293K490
52343C58099K646K941L322L891M762N575N884N910O254O906P353P661Q534J0048
52329D39786J1250J1560J1716J2688J4248J5467J6113J6712J7402J7701J7472
$$ plain form
52318 602115 619398 636933 654789 672520 689836 707060 724753 743023 761363 779113 796030
52307 796030 812374 828451 844190 859358 874119 889025 904226 919009 932388 944059 954407
52296 954407 963652 971330 976711 979359 979128 975935 969978 962141 953818 946118 939280 932870 926367 919511
52282 919511 912391 905534 899886 896347 895105 895556 897037 899479 903185 908138 913910 920271 927468 935677
52268 935677 944412 952865 960846 969110 978660 989917 1002657 1016574 1031560 1047360 1063230 1078287
52256 1078287 1092271 1105774 1119496 1133344 1146412 1157844 1167432 1175262 1181051 1184201 1184488 1182363 1178454
52243 1178454 1173032 1166163 1158130 1149378 1140083 1130083 1119307 1108018 1096652 1085648 1075491 1066493
52231 1066493 1058319 1050058 1041182 1032208 1024022 1016654 1009286 1001544 994245 988582 984899 982678 981466 981334
$$ packed form
52318F02115J7283J7535J7856J7731J7316J7224J7693J8270J8340J7750J6917
52307G96030J6344J6077J5739J5168J4761J4906J5201J4783J3379J1671J0348
52296I54407R245P678N381K648k31l193n957p837q323p700o838o410o503o856
52282I19511p120o857n648l539j242M51J481K442L706M953N772O361P197Q209
52268I35677Q735Q453P981Q264R550J1257J2740J3917J4986J5800J5870J5057
52256A078287J3984J3503J3722J3848J3068J1432R588P830N789L150K87k125l909
52243A178454n422o869q033q752r295j0000j0776j1289j1366j1004j0157q998
52231A066493q174q261q876q974q186p368p368p742p299n663l683k221j212j32
$$ plain form
52217 981334 982384 984215 986195 988183 990769 994662 999808 1005185 1009616 1012773 1015289 1017925 1020863 1023916
52203 1023916 1027153 1031005 1035766 1041187 1046696 1051949 1057104 1062532 1068256 1073799 1078610 1082564 1085888 1088755
52189 1088755 1091162 1093103 1094467 1094719 1093115 1089397 1084025 1077555 1070175 1062104 1054018 1046556 1039604 1032560
52175 1032560 1025290 1018352 1012292 1007109 1002576 998718 995827 994213 994054 995253 997281 999343 1000896 1001973
52161 1001973 1002939 1004038 1005213 1006300 1007317 1008579 1010431 1012764 1014940 1016417 1017395 1018617 1020478 1022580
52147 1022580 1024236 1025206 1025769 1026226 1026518 1026331 1025427 1023809 1021709 1019592 1018168 1018118 1019531 1021746 1024118 1026952
$$ packed form
52217I81334J050J831J980J988K586L893N146N377M431L157K516K636K938L053
52203A023916L237L852M761N421N509N253N155N428N724N543M811L954L324K867
52189A088755K407J941J364K52j604l718n372o470p380q071q086p462o952p044
52175A032560p270o938o060n183m533l858k891j614j59J199K028K062J553J077
52161A001973R66J099J175J087J017J262J852K333K176J477R78J222J861K102
52147A022580J656R70N63M57K92j87r04j618k100k117j424n0J413K215K372K834
$$ [...]
##END NTUPLES=NMR SPECTRUM
##END=
