
##TITLE=AC1302_PERAH12114_6535671_KetVU1Pe3j
##JCAMPDX= 6.0         $$ Bruker NMR JCAMP-DX V2.0
##DATA TYPE= NMR SPECTRUM
##DATA CLASS= NTUPLES
##ORIGIN= BRUKER
##OWNER= Administrator
$$ 1.72 TOPSPIN		Version 2.1
$$ 2012-12-12 01:12:08.148 -0500  Administrator@X
$$ Compression mode = diff/dup
##.OBSERVE FREQUENCY= 400.02188249412
##.OBSERVE NUCLEUS= ^1H
##.ACQUISITION MODE= SIMULTANEOUS (DQD)
##.ACQUISITION SCHEME= undefined
##.AVERAGES= 8
##.DIGITISER RES= 22
##SPECTROMETER/DATA SYSTEM= spect
##.PULSE SEQUENCE= zg30
##.SOLVENT NAME= COFFEE_meoh
##.SHIFT REFERENCE= INTERNAL, COFFEE_meoh, 1, 14.98509
##AUDIT TRAIL= $$ (NUMBER, WHEN, WHO, WHERE, PROCESS, VERSION, WHAT)
$$ ##TITLE= Audit trail, TOPSPIN		Version 2.1
$$ ##JCAMPDX= 5.01
$$ ##ORIGIN= Bruker BioSpin GmbH
$$ ##OWNER= Administrator
$$ $$ E:\/data/COFFEE/nmr/AC1302_PERAH12114_6535671_KetVU1Pe3j/80/pdata/1/auditp.txt
$$ ##AUDIT TRAIL=  $$ (NUMBER, WHEN, WHO, WHERE, PROCESS, VERSION, WHAT)
(   1,<2012-12-12 01:11:59.523 -0500>,<Administrator>,<X>,<go>,<TOPSPIN 2.1>,
      <created by zg
	started at 2012-12-12 01:10:53.366 -0500,
	POWCHK enabled, PULCHK disabled,
       configuration hash MD5:
       86 BA 57 50 F2 9D 5C 9B 26 00 A9 28 5F 66 2E 89
       data hash MD5: 64K
       BA E9 B9 33 35 D0 A1 1E 49 B3 5B 5A D2 D5 C4 7D>)
(   2,<2012-12-12 01:12:02.648 -0500>,<Administrator>,<X>,<proc1d>,<TOPSPIN 2.1>,
      <Start of raw data processing
       efp LB = 0 FT_mod = 6 PKNL = 1 PHC0 = 0 PHC1 = 0 SI = 32K 
       data hash MD5: 32K
       79 E1 41 A6 A5 5E 0C A2 2D AE AE 21 38 11 0C 0C>)
(   3,<2012-12-12 01:12:03.194 -0500>,<Administrator>,<X>,<proc1d>,<TOPSPIN 2.1>,
      <pk PHC0 = 96.14685 PHC1 = 0 
       data hash MD5: 32K
       AB A2 E0 AF A3 48 54 AA C3 CA B4 4E F5 53 2F 62>)
(   4,<2012-12-12 01:12:03.444 -0500>,<Administrator>,<X>,<proc1d>,<TOPSPIN 2.1>,
      <abs ABSG = 1 
       data hash MD5: 32K
       0C 99 00 8B 45 ED A4 DC 01 B9 82 91 26 3A 4B 2E>)
(   5,<2012-12-12 01:12:03.601 -0500>,<Administrator>,<X>,<proc1d>,<TOPSPIN 2.1>,
      <abs ABSG = 2 
       data hash MD5: 32K
       C2 50 0C C9 2A 17 BF F8 1F EB 54 68 82 8B 92 58>)
(   6,<2012-12-12 01:12:03.757 -0500>,<Administrator>,<X>,<proc1d>,<TOPSPIN 2.1>,
      <abs ABSG = 3 
       data hash MD5: 32K
       B3 B9 E2 4F BA 57 8C E0 DA 87 EB 3E 89 09 65 F9>)
(   7,<2012-12-12 01:12:03.913 -0500>,<Administrator>,<X>,<proc1d>,<TOPSPIN 2.1>,
      <abs ABSG = 4 
       data hash MD5: 32K
       44 63 88 69 51 B2 4E DC C8 2A 7C 06 11 61 94 82>)
(   8,<2012-12-12 01:12:04.069 -0500>,<Administrator>,<X>,<proc1d>,<TOPSPIN 2.1>,
      <abs ABSG = 5 
       data hash MD5: 32K
       10 00 54 0F 22 43 2D 39 68 EC 5B 81 1E D4 A5 79>)
$$ ##END=
$$ 
$$ $$ hash MD5
$$ $$ 5D DF 55 06 11 CC 66 C2 9A EF 4F 6C 1B D4 1E 0A
##$RELAX= 
##$RELAX= 
##$RELAX= 
##$RELAX= 
##$RELAX= 
##$RELAX= 
##$RELAX= 
##$RELAX= 
$$ Bruker specific parameters
$$ --------------------------
##$DU= <E:\>
##$EXPNO= 80
$$ [...]
##$TP= (0..7)
150 150 150 150 150 150 150 150
##$TP07= 0
##$TPNAME0= <>
##$TPNAME1= <>
##$TPNAME2= <>
##$TPNAME3= <>
##$TPNAME4= <>
##$TPNAME5= <>
##$TPNAME6= <>
##$TPNAME7= <>
##$TPOAL= (0..7)
0.5 0.5 0.5 0.5 0.5 0.5 0.5 0.5
##$TPOFFS= (0..7)
0 0 0 0 0 0 0 0
##$TUNHIN= 0
##$TUNHOUT= 0
##$TUNXOUT= 0
##$USERA1= <user>
##$USERA2= <user>
##$USERA3= <user>
##$USERA4= <user>
##$USERA5= <user>
##$V9= 5
##$VALIST= <valist>
##$VCLIST= <CCCCCCCCCCCCCCC>
##$VD= 0
##$VDLIST= <DDDDDDDDDDDDDDD>
##$VPLIST= <PPPPPPPPPPPPPPP>
##$VTLIST= <TTTTTTTTTTTTTTT>
##$WBST= 2048
##$WBSW= 25
##$XGAIN= (0..3)
0 0 0 0
##$XL= 0
##$YL= 0
##$YMAX_a= 677016
##$YMIN_a= -575079
##$ZGOPTNS= <>
##$ZL1= 120
##$ZL2= 120
##$ZL3= 120
##$ZL4= 120
##$ABSF1= 14.98509
##$ABSF2= -5.573092
##$ABSG= 5
##$ABSL= 3
##$ALPHA= 0
##$AQORDER= 0
##$ASSFAC= 0
##$ASSFACI= 0
##$ASSFACX= 0
##$ASSWID= 0
##$AUNMP= <proc_prof1d_extract_pilot.lims>
##$AXLEFT= 0
##$AXNAME= <>
##$AXNUC= <1H>
##$AXRIGHT= 0
##$AXTYPE= 0
##$AXUNIT= <>
##$AZFE= 0.1
##$AZFW= 0.1
##$BCFW= 0
##$BC_mod= 0
##$BYTORDP= 0
##$COROFFS= 0
##$CY= 15
##$DATMOD= 1
##$DC= 0
##$DFILT= <>
##$DTYPP= 0
##$F1P= 0
##$F2P= 0
##$FCOR= 0.5
##$FTSIZE= 32768
##$FT_mod= 6
##$GAMMA= 0
##$GB= 0
##$INTBC= 1
##$INTSCL= 1
##$ISEN= 128
##$LB= 0
##$LEV0= 0
##$LPBIN= 0
##$MAXI= 10000
##$MC2= 0
##$MEAN= 0
##$ME_mod= 0
##$MI= 0
##$NCOEF= 0
##$NC_proc= -8
##$NLEV= 6
##$NOISF1= 0
##$NOISF2= 0
##$NSP= 0
##$NTH_PI= 0
##$NZP= 0
##$OFFSET= 14.98509
##$PC= 1
##$PHC0= 96.14685
##$PHC1= 0
##$PH_mod= 1
##$PKNL= yes
##$PPARMOD= 0
##$PPDIAG= 0
##$PPIPTYP= 0
##$PPMPNUM= 2147483647
##$PPRESOL= 1
##$PSCAL= 4
##$PSIGN= 0
##$PYNMP= <proc.py>
##$REVERSE= no
##$SF= 400.02
##$SI= 32768
##$SIGF1= 0
##$SIGF2= 0
##$SINO= 400
##$SIOLD= 32768
##$SPECTYP= <>
##$SREGLST= <1H.CDCl3>
##$SSB= 0
##$STSI= 32768
##$STSR= 0
##$SW_p= 8223.68421052631
##$SYMM= 0
##$S_DEV= 0
##$TDeff= 65536
##$TDoff= 0
##$TI= <>
##$TILT= no
##$TM1= 0
##$TM2= 0
##$TOPLEV= 0
##$USERP1= <user>
##$USERP2= <user>
##$USERP3= <user>
##$USERP4= <user>
##$USERP5= <user>
##$WDW= 1
##$XDIM= 32768
##$YMAX_p= 481369691
##$YMIN_p= -1056257
##$CURPLOT= <Network HP LaserJet P1505>
##$CURPRIN= <$Network HP LaserJet P1505>
##$DFORMAT= <normdp>
##$LAYOUT= <+/1D_H.xwp>
##$LFORMAT= <normlp>
##$PFORMAT= <normpl>
##$SURQMSG= 1
$$ End of Bruker specific parameters
$$ ---------------------------------
##NTUPLES= NMR SPECTRUM
##VAR_NAME=  FREQUENCY,     SPECTRUM/REAL,   SPECTRUM/IMAG
##SYMBOL=    X,             R,               I
##VAR_TYPE=  INDEPENDENT,   DEPENDENT,       DEPENDENT
##VAR_FORM=  AFFN,          ASDF,            ASDF
##VAR_DIM=   32768,         32768,           32768
##UNITS=     HZ,            ARBITRARY UNITS, ARBITRARY UNITS
##FACTOR=    0.250966925370066, 1,           1
##FIRST=     8223.43324360094, -213272,      133146
##LAST=      0,             7936,            5539
##MIN=       0,             -1056257,        0
##MAX=       8223.43324360094, 481369691,    0
$$ Real data points
##PAGE= N=1
##DATA TABLE= (X++(R..R)), XYDATA
$$ [...]
19537i2995A99282r0982K1889E3706c9027C12667j07371B2913a42841b4364j27807
$$ -92995 199282 108300 130189 53706 -39027 312667 205296 22913 -142841 -24364 -152171
19526a52171p60k86890a72k25916O0870k0033O1161B9510M8674K04746b03642
$$ -152171 -152931 -439821 -172 -226088 -165218 -185251 -124090 29510 78184 282930 -203642
19514F8423a75660e641A47186a36901I6185j0805b45190E6277a7048j168k10777
$$ 68423 -175660 -5641 147186 -136901 96185 85380 -245190 56277 -17048 -18216 -228993
19503b28993L8852P3048A65456e1180m5663J9479j6888l4326N5737F8679b27993
$$ -228993 -190141 -117093 165456 -51180 -96843 -77364 -94252 -128578 -72841 68679 -227993
19491C99546F6426J23931Q164J9220E749K2587a74854A30124l7995J8281b9520
$$ 399546 66426 190357 198521 217741 5749 28336 -174854 130124 92129 110410 -29520
19479B41313q5750b40466j12618A14725a55595B43476B3169c00499a25961q6099
$$ 241313 155563 -240466 -353084 114725 -155595 243476 23169 -300499 -125961 -212060
19469b12060A81487J25353a78436E2984J88552a90632J7559P3784c9896B51439
$$ -212060 181487 306840 -178436 52984 241536 -190632 -173073 -99289 -39896 251439
19458c5328l64254g7714b9653C73368F4005f3128j19639L1066A51814l8714h2123
$$ -35328 -399582 -77714 -29653 373368 64005 -63128 -182767 -151701 151814 113100 -82123
19446d7056B80452c53380A79784c74855J37760B02353E726K46650c02071N6961
$$ -47056 280452 -353380 179784 -374855 -237095 202353 5726 252376 -302071 -245110
19436b45110J01344A44788e7851j04718B9373a48987A1036a49438A32487b41098
$$ -245110 -143766 144788 -57851 -162569 29373 -148987 11036 -149438 132487 -241098
19425c78888D4127c36409A1573f4224j83381i3801k09483A22272c5086j50422
$$ -378888 44127 -336409 11573 -64224 -247605 -93801 -303284 122272 -35086 -185508
19415a85508A2996b19100n8355g2113o4690k05186K3745B33409d87498D04710
$$ -185508 12996 -219100 -277455 -72113 -136803 -341989 -318244 233409 -487498 404710
19404C67449f4404j94271J16371A48180J06891E6835h4628c9449H665a85380B4914
$$ 367449 -64404 -258675 -142304 148180 255071 56835 -84628 -39449 8665 -185380 24914
19392C06961d64414b28022p8852A20973b373A22147m1384b33865h6588j17258
$$ 306961 -464414 -228022 -306874 120973 -2373 122147 80763 -233865 -86588 -203846
19382b03846A80588j4581G465h7352j3585j17247A08346b24537A79549J05392
$$ -203846 180588 166007 7465 -87352 -100937 -218184 108346 -224537 179549 284941
19372B84941a05259F2202b07107B18926E5951K3603a47440r9305a08732j37022
$$ 284941 -105259 62202 -207107 218926 55951 79554 -147440 -246745 -108732 -245754
19362b45754N4151c3662q2469B23349b65962g2207A22247E048P7297b85815g5574
$$ -245754 -191603 -33662 -116131 223349 -265962 -72207 122247 5048 82345 -285815 -75574
19350a63535l12080J75979N2645Q3033B84191j38479a51358A26465l3862e17166
$$ -163535 -475615 -299636 -246991 -163958 284191 145712 -151358 126465 92603 -517166
19339a52509E491b48768c5349E1349g1546j01225K9653M7155B28a57764I4576
$$ -152509 5491 -248768 -35349 51349 -71546 -172771 -143118 -95963 228 -157764 94576
19327i908m32707a33545p6586G1840J70418i5570A68479a28615l30073H7783M9756
$$ -9908 -442615 -133545 -210131 71840 242258 -95570 168479 -128615 -458688 87783 137539
19316A37539R2946c10105A30490f6576I3294h6668j59084A13602a37904K1033
$$ 137539 230485 -310105 130490 -66576 93294 -86668 -245752 113602 -137904 -116871
19306a16871m03984J90218A75314K12517b12763r8514Q9810A62214b78223i4115
$$ -116871 -520855 -330637 175314 387831 -212763 -311277 -221467 162214 -278223 -94115
19295a83336k14477J03825J34251M7625H6667a42244d1343J7399k20750a12993
$$ -183336 -397813 -293988 -159737 -112112 86667 -142244 -41343 -23944 -244694 -112993
19284E53109A21252c6684f349o7239j9308j09028A99847o1015C8141J82939E8131
$$ 553109 121252 -36684 -6349 -73588 -92896 -201924 199847 138832 38141 221080 58131
19272I0626h7976k69759q8852K01550l2786a21007A30964a37229b7403j96362
$$ 90626 -87976 -357735 -446587 -245037 -277823 -121007 130964 -137229 -27403 -223765
19262b23765l81065a17898j58226P2459B03952F8280b65573j25038H0793K26729
$$ -223765 -604830 -117898 -276124 -203665 203952 68280 -265573 -390611 80793 307522
19252C07522d6170A42348b00833B1216h9915K6553l63508a71917a4358m9783j4056
$$ 307522 -46170 142348 -200833 21216 -89915 -63362 -426870 -171917 -14358 -64141 -78197
19241g8197A35672b29389D0570c23988g082k16533A46758J6390b43960E0086b85634
$$ -78197 135672 -229389 40570 -323988 -7082 -223615 146758 163148 -243960 50086 -285634
19229A31977a98899c4329k34367J06736r7921J14955j44805A11788C9734K77793
$$ 131977 -198899 -34329 -268696 -161960 -259881 -144926 -289731 111788 39734 317527
19219C17527I8815m3169K0295h4931o1054l901B28296a52274c9661A86087a61823
$$ 317527 98815 55646 75941 -84931 -145985 -149886 228296 -152274 -39661 186087 -161823
19207A50605a08844r309d65I8816b34120D25419e4512o0056b5914n639D6542K54791
$$ 150605 -108844 -118153 -465 98816 -234120 425419 -54512 -114568 -25914 -31553 46542 301333
19195C01333A24999c9984l21320a5461j13707c9490C5924c64623b3031A8034c2272
$$ 301333 124999 -39984 -361304 -15461 -129168 -39490 35924 -364623 -23031 18034 -32272
19183A75150a04492i819k12421A4448c24873c2837R647A4226h9786j13203R6026
$$ 175150 -104492 -9819 -222240 14448 -324873 -32837 -23190 14226 -89786 -202989 -106963
19172a06963o3608j04722D3820b21915i6995a7884A00217a27695D2460a9110f336
$$ -106963 -170571 -275293 43820 -221915 -96995 -17884 100217 -127695 42460 -19110 -6336
19160c38141d2126B1664p544Q6432b61004B4556b31445A36268B9327j3249d02307
$$ -338141 -42126 21664 14120 100552 -261004 24556 -231445 136268 29327 16078 -402307
19148b5770k05880B72242f9302j83319a16349K2216l27062i5927B31195J41417
$$ -25770 -231650 272242 -69302 -252621 -116349 -94133 -421195 -95927 231195 372612
19138C72612c5097A14247k8235b33801H1359b55134e4676l14469C9820b33949
$$ 372612 -35097 114247 86012 -233801 81359 -255134 -54676 -369145 39820 -233949
19127F5257b0996j17927A0370J50289b30328B38334D0858a75004C47848p7091
$$ 65257 -20996 -138923 10370 160659 -230328 238334 40858 -175004 347848 270757
19117B70757f7261j3932j98522B9848M16969f1148B42212c68792M8076g0797A86657
$$ 270757 -67261 -81193 -279715 29848 446817 -61148 242212 -368792 -320716 -70797 186657
19105A46978E5367b61666l10397b399r6171B19590b86431E4518e27664K23690
$$ 146978 55367 -261666 -572063 -2399 -98570 219590 -286431 54518 -527664 -303974
19095c03974Q2621p716O0893m2738j2917d8082j37657D65353b14916h2669j01071
$$ -303974 -221353 -229069 -168176 -210914 -223831 -48082 -185739 465353 -214916 -82669 -183740
19084a83740j29008j33597G1075L1116b76640o4765l2610J6783D68815h5826B43174
$$ -183740 -312748 -446345 71075 102191 -276640 -341405 -374015 -357232 468815 -85826 243174
19072B11937j0482n2512m4671a50385c1754k6056c421C5194N1016K51036a13497
$$ 211937 201455 148943 104272 -150385 -31754 -57810 -3421 35194 86210 337246 -113497
19060a65546e2751B62140f4284j85745A8080J8441J67792a63224n378n1518N5269
$$ -165546 -52751 262140 -64284 -250029 18080 36521 204313 -163224 -168602 -220120 -164851
19049a64851c4199j86890P9555B00333e8197G273J529c3370o8886A76082F1711
$$ -164851 -34199 -221089 -141534 200333 -58197 7273 8802 -33370 -102256 176082 61711
19037b54444g0814A37390f0455I7148J21044o9273b09665A54456n0628a02453
$$ -254444 -70814 137390 -60455 97148 218192 148919 -209665 154456 103828 -102453
19026A36098h8208C68227A60803g7484B79213A05796O9891Q3446H0167j7943h7856
$$ 136098 -88208 368227 160803 -77484 279213 105796 175687 259133 80167 62224 -87856
19014D2606f5372A70384a18614k8347j97762H9185K1347C599J31401b77803e2803
$$ 42606 -65372 170384 -118614 -146961 -344723 89185 110532 3599 135000 -277803 -52803
19002a05769l9881j43248J26553k48857f5496n413A69782b75149J37465A36118
$$ -105769 -145650 -288898 -162345 -411202 -65496 -70909 169782 -275149 -137684 136118
18991A27418J1605D8346K0634b5929k77751h264C5562c5063k46934D5204g3758
$$ 127418 139023 48346 68980 -25929 -303680 -8264 35562 -35063 -281997 45204 -73758
18979G0812b58694J0161B9858a45953e1552J5841E066a38399L8477q0569l9506
$$ 70812 -258694 -248533 29858 -145953 -51552 -35711 5066 -138399 -99922 -180491 -219997
18968b19997A41380a92739c3313j15402K580H520K02396b06065L7481g2521j99039
$$ -219997 141380 -192739 -33313 -148715 -146135 8520 210916 -206065 -168584 -72521 -271560
18957b71560a3812G0K32383G4290b67554A3402a91952L4820b2451j24116L2873
$$ -271560 -13812 70 232453 74290 -267554 13402 -191952 -157132 -22451 -146567 -113694
18946a13694A89681f2910G0963a02982B72602d3058B75842A4458a99491R1241
$$ -113694 189681 -62910 70963 -102982 272602 -43058 275842 14458 -199491 -108250
18936a08250B81287e5611B55370f2051J4679j7658p7556B52511D2889i9541A93755
$$ -108250 281287 -55611 255370 -62051 -47372 -65030 -142586 252511 42889 -99541 193755
18924b17602a5388j77986Q7089d7104d349k43156M9489g9415A0533M5081J78232
$$ -217602 -15388 -193374 -106285 -47104 -4349 -247505 -198016 -79415 10533 55614 233846
18913B33846l9312B4847J0550a6837j58306e3795k16446C7069b01106g5528Q582
$$ 233846 194534 24847 35397 -16837 -175143 -53795 -270241 37069 -201106 -75528 -66946
18902f6946R581C2339g8349l1802A1319R2341j3081K5033J72803j07229E9777
$$ -66946 -57365 32339 -78349 -110151 11319 103660 90579 115612 288415 181186 59777
18890a12383L6946p090J3105b5610k61508C3085J35474c7214k85279p243i1046
$$ -112383 -75437 -82527 -69422 -25610 -287118 33085 168559 -37214 -322493 -329736 -91046
18878h9271j68925A19067m8448B437e9741A40663h4040c1204j72449E4759o13
$$ -89271 -258196 119067 70619 2437 -59741 140663 -84040 -31204 -203653 54759 54146
18867E4146O1430J46756e3561j57858G1523l3949K05033b47911L6458P2190A24016
$$ 54146 115576 262332 -53561 -211419 71523 37574 242607 -247911 -211453 -139263 124016
18855b55147J20440m7521O7655J450B97409h2770m4092k07099A81793A6850g5598
$$ -255147 -134707 -182228 -114573 -113123 297409 -82770 -126862 -333961 181793 16850 -75598
18843h4785p5115A39443A2480J66319a08223k70034n8239J76125B74752j03233
$$ -84785 -159900 139443 12480 178799 -108223 -378257 -436496 -260371 274752 171519
18833A71519c76645C1508f4063k07572B61461b2773j78250n6873f0456l98685
$$ 171519 -376645 31508 -64063 -271635 261461 -22773 -201023 -257896 -60456 -459141
18823d59141A85625J9199f7315E5759M5975K4464a18988j3633j34182B1660b31752
$$ -459141 185625 204824 -67315 55759 101734 126198 -118988 -132621 -266803 21660 -231752
18811g7514A80456C3236J3579h0318E07554A5223L7906b2889A95784E2517a29498
$$ -77514 180456 33236 46815 -80318 507554 15223 53129 -22889 195784 52517 -129498
18799d6868D8525K87475e8454g255l82476A52141a83285C6241f4527M265B3206
$$ -46868 48525 336000 -58454 -7255 -389731 152141 -183285 36241 -64527 -60262 23206
18787a89522A4057J93961b05374B76313a81906o0405b0192F3282Q6732c9944p9005
$$ -189522 14057 208018 -205374 276313 -181906 -242311 -20192 63282 150014 -39944 -118949
18776a18949d9040j6031a9284r032j48263A36713k0770n924c14035a27147k09387
$$ -118949 -49040 -65071 -19284 -28316 -176579 136713 115943 110019 -314035 -127147 -336534
18765c36534D0490J75045B1915d36344D2834a33846B658a83868j28331P1870C02556
$$ -336534 40490 215535 21915 -436344 42834 -133846 2658 -183868 -312199 -240329 302556
18753a49099r6141O00E535K566a75895a3353G743a94427O2759B739c68023d7651
$$ -149099 -245240 -244640 5535 8101 -175895 -13353 7743 -194427 -131668 2739 -368023 -47651
18740C5809i8738B04480a21384k34464B45085a53705H9939J39495c70510b3962
$$ 35809 -98738 204480 -121384 -355848 245085 -153705 89939 229434 -370510 -23962
18729a2977r7426A56790b96962h526r3337G1178i8804m648A73760a64819l1379
$$ -12977 -110403 156790 -296962 -8526 -101863 71178 -98804 -103452 173760 -164819 -196198
18718a96198n8010A45072d5349C02390a7206E757J25609b34813e9275m4357H5799
$$ -196198 -254208 145072 -45349 302390 -17206 5757 131366 -234813 -59275 -103632 85799
18706a28462j27823a03759r515A06318a87002g4586N541i960j0855C8076J08807
$$ -128462 -256285 -103759 -113274 106318 -187002 -74586 -69045 -9960 -20815 38076 146883
18695A46883a68911c4725q5248K8531j22835B21376g31601B48844d0206j43516
$$ 146883 -168911 -34725 -119973 -91442 -214277 221376 -731601 248844 -40206 -183722
18685a83722M9161n40282b30533L5766b3678j49050K5488b6318B01191b21571
$$ -183722 -134561 -674843 -230533 -194767 -23678 -172728 -147240 -26318 201191 -221571
18674G969K26210b55493B52107a9125H7652b8586j67122f0632B02661r2024j0831
$$ 7969 234179 -255493 252107 -19125 87652 -28586 -195708 -60632 202661 110637 99806
18663I9806a47318A0573a61151N1023j65199m3276A88871o1178a95687O4941N4667
$$ 99806 -147318 10573 -161151 -110128 -275327 -318603 188871 127693 -195687 -130746 -76079
18652g6079j80266N2325Q7322k09804A24102b9234l2757l6080a4347j74390A57876
$$ -76079 -256345 -204020 -116698 -326502 124102 -29234 -61991 -98071 -14347 -188737 157876
18640i4392B36676b76292H7952g639n19002a67322k22613D22979b54368D6987
$$ -94392 236676 -276292 87952 -7639 -526641 -167322 -389935 422979 -254368 46987
18629c7256o3855B07760D1482a72640B42141b11658J00971j45797A97611a98422
$$ -37256 -101111 207760 41482 -172640 242141 -211658 -110687 -256484 197611 -198422
18618B66540q4594b13817A08878a75409C34328F9163b9639p5913n3520j6746A28790
$$ 266540 181946 -213817 108878 -175409 334328 69163 -29639 -105552 -159072 -175818 128790
18606c4274D728L14533p6794a20533B17076c63780i5010D9859r196O6468a762
$$ -34274 4728 319261 242467 -120533 217076 -363780 -95010 49859 40663 107131 -1762
18594e6224j62109N0507j06806J33333r5263J16984o0823D0451M5035d16197e9180
$$ -56224 -218333 -167826 -274632 -141299 -236562 -119578 -180401 40451 85486 -416197 -59180
18582A67908r134a94471A31293i3184n7467l1773g4434b9260j63508d7254A77089
$$ 167908 158774 -194471 131293 -93184 -150651 -182424 -74434 -29260 -192768 -47254 177089
18570A85916l703a00140l1379D0567J87003d53437b9469h983q0820j7985j375
$$ 185916 182213 -100140 -131519 40567 227570 -453437 -29469 -8983 -89803 -107788 -109163
18559a09163A44604c24825a47713m116j51354B0157b0804p2019M0276j68843A52029
$$ -109163 144604 -324825 -147713 -151829 -303183 20157 -20804 -92823 -52547 -221390 152029
18547b9930m2950A83214l6418g5549A31307c40710L8595b1427j2248j13241c3355
$$ -29930 -72880 183214 146796 -75549 131307 -340710 -302115 -21427 -33675 -146916 -33355
18535B2589d9320n1296A61338j7253O9457K86493q2837D247b12568J7013p6898
$$ 22589 -49320 -100616 161338 144085 213542 500035 417198 4247 -212568 -195555 -272453
18524b72453j26655H9138J40215L8103A26863K8459b41168B0199O699i5154j21467
$$ -272453 -399108 89138 229353 267456 126863 155322 -241168 20199 26898 -95154 -216621
18513b16621c0852F8818J06450a97406A47303C7497c35600d294p7281a1549A21290
$$ -216621 -30852 68818 175268 -197406 147303 37497 -335600 -4294 -81575 -11549 121290
18501a53073G5676a68869I5500j6808J90138D7654c44162M7437A51459m8506C0385
$$ -153073 75676 -168869 95500 78692 268830 47654 -344162 -296725 151459 102953 30385
18489B88710H6847d4784f395A36785E5818a3599A15426K70096a51761F2931d10448
$$ 288710 86847 -44784 -6395 136785 55818 -13599 115426 385522 -151761 62931 -410448
18477g9748F1132a17587B9525c53293j11304B54794a19966a2006o9610B98997
$$ -79748 61132 -117587 29525 -353293 -464597 254794 -119966 -12006 -81616 298997
18466a6936k11730M8260A14426k1827a51175I9687b89973H3929e7463k04313A61301
$$ -16936 -228666 -180406 114426 92599 -151175 99687 -289973 83929 -57463 -261776 161301
18454B063N2405A2e6168b5070n5316j16935a1211j56190A71470C3622N4395a69485
$$ 2063 54468 12 -56168 -25070 -80386 -197321 -11211 -167401 171470 33622 88017 -169485
18441b27007J06843j1763F3629a01675o0231A6294c18216A10318a54512c4782
$$ -227007 -120164 -131927 63629 -101675 -161906 16294 -318216 110318 -154512 -34782
18430c78151B14304j04889a25548l0347r0584o8008G5596c84420E3983d41905
$$ -378151 214304 109415 -125548 -155895 -246479 -314487 75596 -384420 53983 -441905
18419f84720b3915L606B14246b1526j93110B19090g0146B45167B6048J06465a10982
$$ -684720 -23915 -20309 214246 -21526 -214636 219090 -70146 245167 26048 132513 -110982
18407D1750b05057o055B54507F6582C2986d62450H9069b86063a19664A73595h5871
$$ 41750 -205057 -211112 254507 66582 32986 -462450 89069 -286063 -119664 173595 -85871
18395D9023d14418A70671A8139c37097H9060b59697a09282B9127J79312b01270
$$ 49023 -414418 170671 18139 -337097 89060 -259697 -109282 29127 208439 -201270
18384C009c7145k51365F1955a1502D2137J08441D376d0538A23087j632c10317
$$ 3009 -37145 -288510 61955 -11502 42137 150578 4376 -40538 123087 121455 -310317
18372E9613j4202A278c3110o0930B82932b0701A63506O7003b91071A11706l0914
$$ 59613 45411 1278 -33110 -94040 282932 -20701 163506 230509 -291071 111706 80792
18361H0792b83586N9022J07700r7235J1971k67665a09512A56967h7736o9296L9679
$$ 80792 -283586 -224564 -116864 -214099 -202128 -469793 -109512 156967 -87736 -157032 -117353
18350a17353a1370C0968a10552j6700l3962A3698b38556g6791j59775B14780a1641
$$ -117353 -11370 30968 -110552 -127252 -161214 13698 -238556 -76791 -236566 214780 -11641
18338a16982M1111j28738c0455k32499C40500I3266P350J09005a27861a6204B04920
$$ -116982 -75871 -204609 -30455 -262954 340500 93266 100616 209621 -127861 -16204 204920
18326D6610a59261j50696J35873b7823D9492L5878J4086f7021L2075p173a7672
$$ 46610 -159261 -309957 -174084 -27823 49492 85370 99456 -67021 -34946 -42119 -17672
18314b23590A9838h3364k1118B96861A27680a90928A08663d03130a02157m7834
$$ -223590 19838 -83364 -104482 296861 127680 -190928 108663 -403130 -102157 -149991
18304a49991B9734c46505h2021A69619E1396e3217G0531c16658A64222p3063C553
$$ -149991 29734 -346505 -82021 169619 51396 -53217 70531 -316658 164222 91159 3553
18292a3859n8156K6294E7668a34634P667B8070a13943B8049M8885A1598J17800
$$ -13859 -72015 -45721 57668 -134634 -126967 28070 -113943 28049 76934 11598 129398
18281A29398K5256l1795d95203I5734a6736j3296j51873l18427B02642B8520d18256
$$ 129398 154654 122859 -495203 95734 -16736 -30032 -181905 -500332 202642 28520 -418256
18269d1439o0144c7112A2183K4315J1275L24170j60429a5406B53249f2619j90542
$$ -41439 -101583 -37112 12183 36498 47773 371943 211514 -15406 253249 -62619 -253161
18258b53161E6717a32585A15332a64228k2236D649b57901L3817C49348b4172A22392
$$ -253161 56717 -132585 115332 -164228 -186464 4649 -257901 -224084 349348 -24172 122392
18246a22637C31728b14045D44a35023j78482h771m9330G3382b18522N7086C87461
$$ -122637 331728 -214045 444 -135023 -313505 -8771 -58101 73382 -218522 -161436 387461
18234a69458P9133B8170a95563C2179a48821I1426D5255N7110J70353b11623j38687
$$ -169458 -90325 28170 -195563 32179 -148821 91426 45255 102365 272718 -211623 -350310
18223c50310J03997d9092k81315j25384F4240h1796B53693a45035D9477a79689
$$ -350310 -246313 -49092 -330407 -455791 64240 -81796 253693 -145035 49477 -179689
18212A7591e232j36657l8491m5114q6951J34266o3819C2784J57675b92722a19793
$$ 17591 -5232 -141889 -180380 -225494 -312445 -178179 -241998 32784 190459 -292722 -119793
18200G8657J32473e9412j7035l34451e263j76570C2888N1094e8861b1954B3361
$$ 78657 211130 -59412 -76447 -410898 -5263 -181833 32888 83982 -58861 -21954 23361
18188H7579b87376B07410c42187E8133b14485d6551A32818c0983D29334C5146
$$ 87579 -287376 207410 -342187 58133 -214485 -46551 132818 -30983 429334 35146
18177a0193k61344H5542J10626a50527A04926a64679A5318K26927b41625d513
$$ -10193 -271537 85542 196168 -150527 104926 -164679 15318 242245 -241625 -4513
18166B98149B9363b43328i6590E6780M6132e6100K3227B57396a19376B57335a08031
$$ 298149 29363 -243328 -96590 56780 102912 -56100 -32873 257396 -119376 257335 -108031
18154C26560c53685H5489C3029L39314b9867j97367i5267p3227A77208b08579
$$ 326560 -353685 85489 33029 372343 -29867 -227234 -95267 -168494 177208 -208579
18143E7026J47494a40653F3373a02684A3987a7821L445d02j4470C04850a67096
$$ 57026 204520 -140653 63373 -102684 13987 -17821 -14376 -402 -14872 304850 -167096
18131A11316A509K38054p4420M7151b54093A16596a15863B56929b13l66522B92897
$$ 111316 1509 239563 165143 212294 -254093 116596 -115863 256929 -213 -366735 292897
18119b7685A33441b91742a00190D9517i516C3688a52018f2539c271j24929N0678
$$ -27685 133441 -291742 -100190 49517 -9516 33688 -152018 -62539 -3271 -128200 -77522
18108g7522I952a54442M879j164K4763G7533A9445N7015a78693A3610K45172i732
$$ -77522 9952 -154442 -149563 -150727 -125964 77533 19445 76460 -178693 13610 258782 -9732
18095b2117D0015a67993b159B8444h902C6862f927l51734A00687a00384c0673
$$ -22117 40015 -167993 -2159 28444 -8902 36862 -6927 -358661 100687 -100384 -30673
18083G4961G536c5065E75166h7247d1439A56973c09109K6290e1247j7923G1350
$$ 74961 7536 -35065 575166 -87247 -41439 156973 -309109 -282819 -51247 -69170 71350
18071C00295a29235A22833a72848E6902Q6408B395i8696q7007A87171e8210A23258
$$ 300295 -129235 122833 -172848 56902 143310 2395 -98696 -185703 187171 -58210 123258
18059a61412r2651B35897P0483b36252p3470i6949B39232b17857A15763K6947
$$ -161412 -254063 235897 306380 -236252 -309722 -96949 239232 -217857 115763 142710
18049A42710a86143E6341a65117o1381B9305a68885P2518j33892G4927A8244A084
$$ 142710 -186143 56341 -165117 -226498 29305 -168885 -96367 -230259 74927 18244 1084
18037H2114e1509l48778i1563j62257m8109k9681A4020a03586Q433l23777J73095
$$ 82114 -51509 -400287 -91563 -253820 -301929 -331610 14020 -103586 -95153 -418930 -245835
18026b45835g8304O061F465d4720A00004g0309B54336g4344k23313E2183a03672
$$ -245835 -78304 -72243 6465 -44720 100004 -70309 254336 -74344 -297657 52183 -103672
18014A9365h5090m34423E7065j8397A0410O3969a42413d4802j0126k27121M2247
$$ 19365 -85090 -519513 57065 38668 10410 74379 -142413 -44802 -54928 -282049 -239802
18003b39802A8521M2119K5395g9146c327I7733J18850a35612A76622A2753c0223
$$ -239802 18521 60640 86035 -79146 -3327 97733 216583 -135612 176622 12753 -30223
17991E8799i0273B04671a51505c5645j0822A6768b26210P6079B86778b6825j3539
$$ 58799 -90273 204671 -151505 -35645 -46467 16768 -226210 -150131 286778 -26825 -40364
17980d0364B54559r6391A0853b18940I8584a7686D06799b89922g9191B6054J35516
$$ -40364 254559 158168 10853 -218940 98584 -17686 406799 -289922 -79191 26054 161570
17969A61570d02731A68490H187a32801l277r8135G6762J46568i7979a8027q6866
$$ 161570 -402731 168490 8187 -132801 -136078 -234213 76762 223330 -97979 -18027 -104893
17958a04893k7486b0481B38688D3552b0726j12929a4366A22932a85358B16869
$$ -104893 -132379 -20481 238688 43552 -20726 -133655 -14366 122932 -185358 216869
17947a32801N5458k59388a19523j69023C78809E9206J63438b62681J19904j85215
$$ -132801 -77343 -336731 -119523 -288546 378809 59206 222644 -262681 -142777 -327992
17937c27992a35684A8110e9571j62075k8769A95270J8191N7853c8860m4591c7611
$$ -327992 -135684 18110 -59571 -221646 -250415 195270 213461 271314 -38860 -83451 -37611
17925g6798j44170q7866a52709A99921a01759A52749C6981a7306A32447a16487
$$ -76798 -220968 -308834 -152709 199921 -101759 152749 36981 -17306 132447 -116487
17914F9541c8678k20236F8983g8608j33466J00335A4994h2517A85022b77746A4957
$$ 69541 -38678 -258914 68983 -78608 -212074 -111739 14994 -82517 185022 -277746 14957
17902d53814b00031A61518h9397j86753a04381M774A95176R78b98159j15287e0928
$$ -453814 -200031 161518 -89397 -276150 -104381 -99607 195176 196154 -298159 -413446 -50928
17890A07325a15862B27341H9654B7614b52543A74474p0147d2923B30014B1520
$$ 107325 -115862 227341 89654 27614 -252543 174474 104327 -42923 230014 21520
17879a25105d5301j04544j66986A8077K12191k0319f8006E9733K16740b79149
$$ -125105 -45301 -149845 -316831 18077 230268 209949 -68006 59733 276473 -279149
17868b23507O0302B25592I7146J24779j08881b53700A26420K01874A40705b56739
$$ -223507 -163205 225592 97146 221925 113044 -253700 126420 328294 140705 -256739
17857E44870G8249d6190j89407A65913i2222A7665J23838C7410d5858E822b84694
$$ 544870 78249 -46190 -235597 165913 -92222 17665 141503 37410 -45858 5822 -284694
17845D7566M3616a21426C63045J15571b28266b0120o0253A67104n037A2173L90509
$$ 47566 91182 -121426 363045 478616 -228266 -20120 -80373 167104 162067 12173 402682
17834D02682e1672p2582k7028B96256b68384A59943g4424I9020K85343A82214
$$ 402682 -51672 -124254 -151282 296256 -268384 159943 -74424 99020 384363 182214
17823E4690J73948b36151C0605f4489A89776a79970f3724Q995B3926g424B23020
$$ 54690 228638 -236151 30605 -64489 189776 -179970 -63724 -54729 23926 -7424 223020
17811a90702a9924G7476c1859A08813h9267o7138G1693J11473n6844n9519a02906
$$ -190702 -19924 77476 -31859 108813 -89267 -156405 71693 183166 126322 66803 -102906
17799c9358k061B02671d687A44685b01475A35118i0345A6923N6768B7255J41867
$$ -39358 -41419 202671 -4687 144685 -201475 135118 -90345 16923 73691 27255 169122
17788A69122g7970j26044J7689L8937B46907a47560G4462K6816e7811o6134o3504
$$ 169122 -77970 -204014 -186325 -147388 246907 -147560 74462 101278 -57811 -123945 -187449
17777a87449C1107A5243Q8386N3487l076b38887n319d0340B862f6620H6025b48879
$$ -187449 31107 15243 103629 157116 154040 -238887 -244206 -40340 2862 -66620 86025 -248879
17764g5536H2512b52886N3775E335f4472k72592B15725b99972h0793J7318j59911
$$ -75536 82512 -252886 -199111 5335 -64472 -337064 215725 -299972 -80793 -63475 -223386
17753b23386D8841b01933B9508a8977j14683A25782a1213B6866J08358l1297g4101
$$ -223386 48841 -201933 29508 -18977 -133660 125782 -11213 26866 135224 103927 -74101
17741a98169j1020c3044k04016L5557A12377O7331m1965b02461B36568a13285
$$ -198169 -209189 -33044 -237060 -201503 112377 179708 137743 -202461 236568 -113285
17730A37729b4234a1340j85227D5145N6506m5686N8084a47558A2855J57684a9003
$$ 137729 -24234 -11340 -196567 45145 101651 55965 114049 -147558 12855 170539 -19003
17718E1216a34097B39109A02310J9747c78733B4108J60505e0000j45248B02950
$$ 51216 -134097 239109 102310 122057 -378733 24108 184613 -50000 -195248 202950
17707C33113j66045g7676a2540k21520E8905a83480m6247L8986H2550g8559K7719
$$ 333113 167068 -77676 -12540 -234060 58905 -183480 -229727 -190741 82550 -78559 -50840
17696e0840r9283H296J1115b38461A6155J58113P766a21648f0124C44022A31939
$$ -50840 -150123 8296 19411 -238461 16155 174268 182034 -121648 -60124 344022 131939
17684C11605C4817b92772A07395e4753j25113h6384j27268M1215A16004j9969
$$ 311605 34817 -292772 107395 -54753 -179866 -86384 -213652 -172437 116004 96035
17674I6035L34348a62017M1576H1143c28039a34079j18735B50333E3113O055K3736
$$ 96035 430383 -162017 -120441 81143 -328039 -134079 -252814 250333 53113 59168 82904
17663H2904O6525f4749l1541L0943K9756B11163j01803R9941j8111a72667A16895
$$ 82904 149429 -64749 -96290 -65347 -35591 211163 109360 209301 191190 -172667 116895
17651C1326J1880a78628P1493j34951e2909j69715C5952J26699a32397A26454
$$ 31326 43206 -178628 -107135 -242086 -52909 -222624 35952 162651 -132397 126454
17640A59817h7774C28148G9151a42428B63253N209g808A62295E5342P602a1660
$$ 159817 -87774 328148 79151 -142428 263253 268462 -7808 162295 55342 62944 -11660
17628C09244o5914C9046a90931F7675c34011b9270k1453G2219J22752n8575c1723
$$ 309244 243330 39046 -190931 67675 -334011 -29270 -50723 72219 194971 136396 -31723
17616B83594p9227o5832a8984j91822B60747e8088B36120a05942E6918J66505
$$ 283594 204367 138535 -18984 -210806 260747 -58088 236120 -105942 56918 223423
17606B23423a8694F7209c96812A82820F2713a54405B22371d5926c093j75519A01191
$$ 223423 -18694 67209 -396812 182820 62713 -154405 222371 -45926 -3093 -178612 101191
17594A63465b2713C84609D988K22467i5587K4482r4467G544K26091a89057B44207
$$ 163465 -22713 384609 4988 227455 -95587 -71105 -165572 7544 233635 -189057 244207
17582H7482K2184M7536g7990B14153b0104B28370a0219G1118e4394K2505G7617
$$ 87482 109666 157202 -77990 214153 -20104 228370 -10219 71118 -54394 -31889 77617
17570a60199c3590D3873K3244L80973e0918J1803I8417a86271D7942g5372l9809
$$ -160199 -33590 43873 67117 448090 -50918 -39115 98417 -186271 47942 -75372 -115181
17559a15181B38012K35081a29691E1806K1687J42912b25348B91198K7942j45487
$$ -115181 238012 473093 -129691 51806 73493 216405 -225348 291198 319140 173653
17549A73653Q9269d8585A8049J04564O8839c11636D7441f8394D31380C3794c5389
$$ 173653 262922 -48585 18049 122613 191452 -311636 47441 -68394 431380 33794 -35389
17537a84979A07748J23911K17082a34626A86343b50835B22973i403j66026c3760
$$ -184979 107748 231659 448741 -134626 186343 -250835 222973 -9403 -175429 -33760
17526C44553A53934a79654A03119F832M32090A76902E5066J54815c22497A84126
$$ 344553 153934 -179654 103119 6832 438922 176902 55066 209881 -322497 184126
17515a33722a0968B24804e2550C98710h1133p8204B93465G2924K35956a01420
$$ -133722 -10968 224804 -52550 398710 -81133 -159337 293465 72924 308880 -101420
17504A45895a86410a5638B30767p3209J8667H84L60055j28939K08965a67101B89047
$$ 145895 -186410 -15638 230767 157558 176225 884 360939 232000 440965 -167101 289047
17492A98813I348K54806A0117L74303j57029a36043G443b57595C06336g5259H0918
$$ 198813 9348 264154 10117 384420 227391 -136043 7443 -257595 306336 -75259 80918
17480C19189b6702D03008j38595c68695A18486K36664I4692M87764F5391f8955
$$ 319189 -26702 403008 264413 -368695 118486 355150 94692 582456 65391 -68955
17469A94974N9382f955j3462g090D78322a04298B54828a07657F7514e2209I7362
$$ 194974 254356 -6955 -20417 -7090 478322 -104298 254828 -107657 67514 -52209 97362
17457F4875J22782B1855a25979A76726a03153A45853L44644A16431M5515b4873
$$ 64875 187657 21855 -125979 176726 -103153 145853 490497 116431 161946 -24873
17446C68057A04340O6166Q0360J14936c4359A92854B5562L65082j5931h3784G8525
$$ 368057 104340 170506 250866 365802 -34359 192854 25562 390644 374713 -83784 78525
17434B73837A30745C1467P0352J5382N3508a8530B11818l589P0024J0049K45340
$$ 273837 130745 31467 101819 117201 170709 -18530 211818 208229 278253 288302 533642
17423E33642k06646q8726E7518K97889A01401K36865K12438k21557O2006r1624
$$ 533642 326996 238270 57518 355407 101401 338266 550704 329147 391153 299529
17413B99529l6645M9701K03241o6886G8597f663B65312j31837N8903E1620h1339
$$ 299529 262884 312585 515826 448940 78597 -6663 265312 133475 192378 51620 -81339
17401C46982a07669B7513L36776A53066G4897K23773a76926G6010J40121d0362
$$ 346982 -107669 27513 364289 153066 74897 298670 -176926 76010 216131 -40362
17390D08975A14302Q3542K5053c1827A18637a218B7198c9082C662R3463d09093
$$ 408975 114302 197844 222897 -31827 118637 -1218 27198 -39082 3662 97125 -409093
17378B31160b1763D41588j70958r8021R8581k2622I3655J26592E1942J08481L13382
$$ 231160 -21763 441588 270630 172609 271190 248568 93655 220247 51942 160423 473805
17367D73805j63893A06709e861C6914J32599E0728F567A990O2301d5572D42230
$$ 473805 309912 106709 -5861 36914 169513 50728 6567 1990 64291 -45572 442230
17355C60134e8083A24141J14219J5604f2770A2655M33455j41399j37563l9343
$$ 360134 -58083 124141 238360 253964 -62770 12655 446110 304711 167148 127805
17345A27805P9544J11251D5730Q4275L6345C6995R6706L59259A93676b4803m054
$$ 127805 207349 318600 45730 130005 166350 36995 133701 492960 193676 -24803 -28857
17334b8857j6241j42875B99741r2574F6742M66201A05745B5300L11123A24848
$$ -28857 -45098 -187973 299741 207167 66742 532943 105745 25300 336423 124848
17323f9264B7848J35044J12083o3579b14280F3249K1720h6740a0841F2428K96913
$$ -69264 27848 162892 274975 211396 -214280 63249 84969 -86740 -10841 62428 359341
17312C59341F0235A559L5592L03256j17320k7123K6334E2670J40101R9932A8260
$$ 359341 60235 1559 37151 340407 223087 195964 222298 52670 192771 292703 18260
17300b16775e4699C10779l5297D6297Q0362L41139A7246m093P8254d5676C6414
$$ -216775 -54699 310779 275482 46297 126659 467798 17246 13153 91407 -45676 36414
17288C8728M70803j41166e598A89789j6955J8003R6737A41013m6473P4441Q791
$$ 38728 509531 368365 -5598 189789 172834 190837 287574 141013 94540 168981 177772
17277A77772B0623J11763j7581e1425A26669j4970O2254J07184F8700a02325B03136
$$ 177772 20623 132386 114805 -51425 126669 111699 173953 281137 68700 -102325 203136
17265B58809P5979b4250D5246O02351A25054r355P2193l8761i9661G6089K33259
$$ 258809 334788 -24250 45246 647597 125054 115699 187892 149131 -99661 76089 309348
17254C09348H7174N1596L19575j36731A06730a19290C41785j33373K6979A15373
$$ 309348 87174 138770 458345 321614 106730 -119290 341785 208412 235391 115373
17243B30637H160N78773B43592J53613A89398J62571c7193B64809a23409B5733
$$ 230637 8160 586933 243592 397205 189398 351969 -37193 264809 -123409 25733
17232D05513r5098F8408K72410n6559A26267c1341B06989p6160J12612a45402
$$ 405513 310415 68408 340818 284259 126267 -31341 206989 130829 243441 -145402
17221B79850I4241K21582A27367M00013j28233j58867J87867A36597J47330A13877
$$ 279850 94241 315823 127367 527380 399147 240280 428147 136597 283927 113877
17210a57028I6511J90062J97868J983j93107J79329j91351J06988a01867m5594
$$ -157028 96511 286573 484441 486424 293317 472646 281295 388283 -101867 -147461
17200a47461C02796L5069H2810M37297B6110J31964L18551o0080r8162F0545K53805
$$ -147461 302796 337865 82810 520107 26110 158074 476625 416545 318383 60545 314350
17189C14350A23721K19382P3165j21425b10526D01849j50972J4514J16130o5156
$$ 314350 123721 343103 416268 294843 -210526 401849 250877 265391 381521 316365
17179C16365D9866K75970J03794A79016m5813M58322A87121M0334J11111N9780
$$ 316365 49866 325836 429630 179016 133203 591525 187121 227455 338566 398346
17169C98346A69839J55830F9200L39815j53545K81649A76849K52504p3329A12533
$$ 398346 169839 325669 69200 409015 255470 537119 176849 429353 356024 112533
17158C25472P0986j52174K67069k25034M3422J06900j53155A30367J63852j27139
$$ 325472 396458 244284 511353 286319 329741 436641 283486 130367 294219 167080
17148A67080p4768N21208I8310k4484O5474J71021Q1671j45236J84200j03030
$$ 167080 92312 613520 98310 73826 139300 310321 391992 246756 430956 327926
17138C27926o9593q5132a1648B08473C2330L04283L10500A76715L1404J63144
$$ 327926 258333 173201 -11648 208473 32330 336613 647113 176715 208119 371263
17128C71263j41582J89352q2702j60949N9957K10475J99537l16532A63623j3312
$$ 371263 229681 419033 336331 175382 235339 445814 645351 328819 163623 150311
17118A50311K39951J84001D6465K84524N2563j81501Q3961J06175P2246J18703
$$ 150311 390262 574263 46465 330989 383552 202051 286012 392187 464433 583136
17108E83136M5950k22591O9698J87617n580A80916J13611P9831J76175N8943L6623
$$ 583136 629086 406495 476193 663810 658230 180916 294527 374358 550533 609476 646099
17097F46099n6691J35097C37362p4997J72963Q4714Q0301A70124J31225M5154
$$ 646099 589408 724505 337362 262365 435328 520042 600343 170124 301349 346503
17087C46503K31549j14060j35958M60260j57596k15656J17670r0659L58202A83314
$$ 346503 578052 463992 328034 788294 630698 415042 532712 442053 800255 183314
17076D17228l8053n9085J13910k12399M84691k4400r1505k73062O37793l89152
$$ 417228 379175 320090 434000 221601 706292 681892 590387 317325 955118 565966
17066E65966P4378J61177j75637k56537L13157L2326j6850J06998k89386N9583
$$ 565966 640344 801521 625884 369347 682504 714830 697980 804978 515592 575175
17056E75175j97906M27765J5633l50888L59194G269O18059J09613k28273j00471
$$ 575175 377269 805034 820667 469779 828973 7269 625328 734941 506668 406197
17046D06197K27966k02716J98120k77963K14165M1195J8878k48876r0479L28717
$$ 406197 634163 431447 629567 351604 565769 606964 625842 376966 286487 615204
17036F15204j18333j41083L83930k1123l06969N8196J67768j23318p7188M37442
$$ 615204 496871 355788 739718 718595 411626 469822 637590 514272 437084 874526
17026H74526k41967n225k17110K34153J58900k34540K33559k94692J75054C26058
$$ 874526 632559 627334 410224 644377 803277 568737 802296 507604 682658 326058
17015C91893K90135J31615k20935K71951l19933N41694l23115k1927L3592k77553
$$ 391893 682028 813643 592708 864659 544726 1086420 763305 741378 774970 497417
17005D97417J78824L9227o7681M75455j97545j77618C73384K84392J17565k53366
$$ 497417 676241 715468 647787 1123242 925697 748079 373384 657776 775341 521975
16995E21975M4899L76316j63504r9912L90517j21373K93195n00495J36364k89254
$$ 521975 566874 943190 779686 679774 1070291 948918 1242113 741618 877982 588728
16985E88728K73608L70505j28121p8084P3811O5108k62432r7671K10571k62421
$$ 588728 862336 1232841 1104720 1026636 1100447 1165555 903123 805452 1016023 753602
16975G53602M53207n66115M30743m1695p6904J99820j32547j6900M5935j4597
$$ 753602 1206809 640694 1071437 1029742 952838 1152658 1020111 1003211 1049146 1034549
16965A034549k39825M27700j33829q6363J02328J06204r7326j28739L23998k30339
$$ 1034549 794724 1222424 1088595 1002232 1104560 1210764 1113438 984699 1308697 1078358
16955A078358K39814J07718n22084M09870l34818L08947k83532L03971Q9897j33104
$$ 1078358 1318172 1425890 903806 1313676 978858 1287805 1004273 1308244 1398141 1265037
16945A265037o2886o6446M12890n93952M09658k19856J36282K20363l52321L23120
$$ 1265037 1202151 1135705 1548595 954643 1364301 1144445 1280727 1501090 1148769 1471889
16935A471889J46010K9953k89681M50571o1306m04523J2523J22482j80860K25645
$$ 1471889 1617899 1647852 1358171 1808742 1747436 1342913 1355436 1477918 1297058 1522703
16925A522703m372j26960J34558j01984J93712L5569k15422K57216l03453M62823
$$ 1522703 1518331 1391371 1525929 1423945 1617657 1653226 1437804 1695020 1391567 1854390
16915A854390k99570Q9607K2166k5781J4526L89242q4255J09077j40366k22721
$$ 1854390 1554820 1644427 1666593 1640812 1655338 2044580 1960325 2069402 1929036 1706315
16905A706315K5475J66878R1711j63516M10174j44068l53056O83787l96832k98677
$$ 1706315 1731790 1898668 1990379 1826863 2237037 2092969 1739913 2423700 2026868 1728191
16895A728191P72N20271j60852K20747n23869N320M94644q8515K98757l28446
$$ 1728191 1728963 2249234 2088382 2309129 1785260 1790580 2285224 2196709 2495466 2167020
16885B167020M19569l16929Q1326j12512L11541J69839k29809j46341K35465J03358
$$ 2167020 2586589 2269660 2350986 2238474 2550015 2719854 2490045 2343704 2579169 2682527
16875B682527K10451l12389Q7531p303k3956k0116K63535l0891l32665P25835
$$ 2682527 2892978 2580589 2668120 2660817 2636861 2616745 2880280 2849389 2516724 3242559
16865C242559j37921O2444l56861L00762L177M07950l43344j70443J72449n5408
$$ 3242559 3104638 3167082 2810221 3110983 3114160 3522110 3178766 3008323 3180772 3125364
16855C125364R2976K31821k06914K68719M4296L84634k65670L42612l2215m49976
$$ 3125364 3218340 3450161 3243247 3511966 3556262 3940896 3675226 4017838 3985623 3535647
16845C535647L26602M31649j37390J29213k7770N4013J07870j53888M88790m52390
$$ 3535647 3862249 4293898 4156508 4285721 4257951 4311964 4419834 4265946 4754736 4302346
16835D302346M53283j02462J99224L611L9735J34057q2190L36721K0334M99080
$$ 4302346 4755629 4653167 4852391 4856002 4895737 5029794 4947604 5284325 5304659 5803739
16825E803739k93208M05369o05392N63877L36544L5935j73137o6030L07183M39505
$$ 5803739 5510531 5915900 5310508 5874385 6210929 6246864 6073727 6007697 6314880 6754385
16815F754385P6034j64626K94104L4120M56492J32101l5477K09933R2165L73386
$$ 6754385 6830419 6665793 6959897 6994017 7450509 7582610 7547133 7757066 7849231 8222617
16805H222617J54635k99360P58836k3146L96784k19852O31173j96081M89114K54298
$$ 8222617 8377252 8077892 8836728 8813582 9210366 8990514 9621687 9425606 9914720 10169018
16795A0169018J46895M30222K51303k15874N59478K44261M52031J52770R1061
$$ 10169018 10315913 10746135 10997438 10781564 11341042 11585303 12037334 12190104 12281165
16786A2281165O47694J84710M21052N92967L72717N90458O14297P9100M05323
$$ 12281165 12928859 13113569 13534621 14127588 14500305 15090763 15705060 15784160 16189483
16777A6189483N40462N45720L78455O42515L07443J179382K12114J010955O33621
$$ 16189483 16729945 17275665 17654120 18296635 18604078 19783460 19995574 21006529 21640150
16768B1640150Q10036O69605M08391R48021J550659M86794R35795J220615R28175
$$ 21640150 22450186 23119791 23528182 24476203 26026862 26513656 27449451 28670066 29598241
16759B9598241J205412J588014J066121J494601J369203J396046J844142J414215
$$ 29598241 30803653 32391667 33457788 34952389 36321592 37717638 39561780 40975995
16751D0975995K086586J776381J882492K519121J916858K860867K124065L281485
$$ 40975995 43062581 44838962 46721454 49240575 51157433 54018300 56142365 59423850
16743E9423850K955022L372968L217976L176037L637625M093332M258679M588880
$$ 59423850 62378872 65751840 68969816 72145853 75783478 79876810 84135489 88724369
16735H8724369M363552N241832N032652N182881N597450O065263N702526O134867
$$ 88724369 93087921 98329753 103362405 108545286 114142736 120207999 125910525 132045392
16727A32045392N938918O107554N677311N747784N361246M564611M793896L956469
$$ 132045392 137984310 144091864 149769175 155516959 160878205 165442816 170236712 174193181
16719A74193181K733110J756975J607462K36954m35263j872671k445214l119015
$$ 174193181 176926291 178683266 180290728 180527682 180092419 178219748 175774534 172655519
16711A72655519l669309m773838n120185n404752n780093n964503o422999n827474
$$ 172655519 168986210 164212372 159092187 153687435 147907342 141942839 135519840 129692366
16703A29692366o458135n682646n703471n761515n197086n744726m504580m700611
$$ 129692366 123234231 117551585 111848114 106086599 100889513 95144787 90640207 85939596
16695H5939596m367178m482157l902601l439278l538790l421564l137249k686514
$$ 85939596 81572418 77090261 73187660 69748382 66209592 62788028 59650779 56964265
16687E6964265k978334k579434k278956k568829j914104j955038k146715j245767
$$ 56964265 53985931 51406497 49127541 46558712 44644608 42689570 40542855 39297088
16679C9297088j956050j960690j123462j713521r70212j336475j428362r99281
$$ 39297088 37341038 35380348 34256886 32543365 31573153 30236678 28808316 27809035
16671B7809035r64185j003773o77547q60757j200947o04260n71219j235502j60788
$$ 27809035 26844850 25841077 25163530 24302773 23101826 22497566 21926347 20690845 20530057
16662B0530057j317495o28115n08079l87661n04756m12630n92069n31222p39219
$$ 20530057 19212562 18584447 18076368 17688707 17183951 16771321 16179252 15648030 14908811
16653A4908811n42379j51184k69181l90030m49669l40104p20462n5348l89862
$$ 14908811 14366432 14215248 13946067 13556037 13106368 12766264 12045802 11990454 11600592
16644A1600592j57600k56299o32493P9909l32414l34265k94211M8072l46256l45308
$$ 11600592 11442992 11186693 10554200 10634109 10301695 9967430 9673219 9721291 9375035 9029727
16634I029727l41687l66093L58056m95172k13677l17942J1753k02109K2031l09867
$$ 9029727 8688040 8321947 8680003 8184831 7971154 7653212 7664965 7462856 7484887 7175020
16624G175020J51222o53442L63522k32522l76112m78599L89299r7239Q9276p37678
$$ 7175020 7326242 6672800 7036322 6803800 6427688 5949089 6338388 6241149 6330425 5592747
16614E592747K54049k06110K8313j66561k06604l93348J76514J58769n61056K51956
$$ 5592747 5846796 5640686 5668999 5502438 5295834 4902486 5079000 5237769 4676713 4928669
16604D928669K16448l29578l9682m66667L4102J90658l28236j8476J31923q6661
$$ 4928669 5145117 4815539 4775857 4309190 4343292 4533950 4205714 4187238 4319161 4232500
16594D232500m21025L24865l60208K90755m50063J03970k7210l66916M44007k42079
$$ 4232500 3811475 4136340 3776132 4066887 3616824 3720794 3693584 3326668 3770675 3528596
16584C528596l42895L87527k38086J50107l49273J01150j22503l7394n6198Q4201
$$ 3528596 3185701 3573228 3335142 3485249 3135976 3237126 3114623 3077229 3021031 3105232
16574C105232k28862k06050M19839k06775J20768j5208m22455m0301J58944K6922
$$ 3105232 2876370 2670320 3090159 2883384 3004152 2988944 2566489 2526188 2685132 2712054
16564B712054J89139l88142J14868j78668p5294N1727J11209k77407m9358J69188
$$ 2712054 2901193 2513051 2627919 2449251 2373957 2425684 2536893 2259486 2210128 2379316
16554B379316L3522m89594N52588k52304j2581n9459K2720j36977p4333K24381
$$ 2379316 2412838 1923244 2475832 2223528 2210947 2151488 2174208 2037231 1962898 2187279
16544B187279j3149l10685Q6644N401K4983j82248q4152J12068o0612o3196n4108
$$ 2187279 2174130 1863445 1950089 1955490 1980473 1798225 1714073 1826141 1765529 1702333 1648225
16533A648225K50031P967k68190K07477L511j2416k43362K15174j76134J21296
$$ 1648225 1898256 1906223 1638033 1845510 1849021 1836605 1593243 1808417 1632283 1753579
16523A753579k02291J07383m26988L92862Q9192j96415K11483j95536p9900j5949
$$ 1753579 1551288 1658671 1231683 1624545 1713737 1517322 1728805 1533269 1453369 1437420
16513A437420j52116p7478j3786M4407P9651K501j3726k55975L96262J53715k23896
$$ 1437420 1285304 1207826 1194040 1238447 1318098 1320599 1306873 1050898 1447160 1600875 1376979
16502A376979k76031L89347j30623r8887k38727L47272j1110m86705j3761k70696
$$ 1376979 1100948 1490295 1359672 1260785 1022058 1369330 1358220 871515 857754 587058
16492E87058O35476k88945J72440l0887K4226m1276k29372N19074m89674j62820
$$ 587058 1222534 933589 1106029 1075142 1099368 1058092 828720 1347794 858120 695300
16482F95300L67401K4400j31374J48891K8234J35386m15125O1275m8930J26916
$$ 695300 1062701 1087101 955727 1104618 1132852 1268238 853113 914388 865458 992374
16472I92374L9842P2892k01767j73232L3762j19049N35337J6768l56736j25481
$$ 992374 1032216 1105108 903341 730109 763871 644822 1180159 1196927 840191 714710
16462G14710O8867J629R7759N872j17918o197K00708k39101l9746L1352J33977
$$ 714710 783577 785206 882965 888837 770919 764722 965430 726329 686583 717935 851912
16451H51912J42452m14456N73725k48781B46855N64535k21766J51858K7684j07518
$$ 851912 994364 579908 1153633 904852 246855 811390 589624 741482 769166 661648
16441F61648p0219L40883l95175J03209K17515k46351K38333j93549k01118J84553
$$ 661648 591429 932312 537137 640346 857861 611510 849843 656294 455176 639729
16431F39729O9899M06730k50068j28360Q4155j18843j80547J21284r300j93364
$$ 639729 709628 1116358 866290 737930 822085 703242 522695 643979 634679 441315
16421D41315J49028R0377m1855P4963m0498k4548J17096j54341J8418O8144N9623
$$ 441315 590343 680720 638865 713828 673330 648782 765878 611537 629955 698099 757722
16410G57722C46938k6238Q9098K86712A81165J71251J64426J7334B44183K46758
$$ 757722 346938 320700 409798 696510 181165 352416 516842 534176 244183 490941
16400D90941j39027l1449L0344N34168C40943N06480m16499n0378L12724A78476
$$ 490941 351914 320465 350809 884977 340943 847423 430924 380546 693270 178476
16389F01469k22553R9722N78317D04008o3515m2059R10K18026A47192J27316j3576
$$ 601469 378916 478638 1056955 404008 340493 298434 299344 517370 147192 274508 260932
16378B60932J69056A36920L61652C8544M21424o8765J07414P7526J31805k67153
$$ 260932 429988 136920 498572 38544 459968 391203 498617 576143 707948 440795
16368D40795B01320K40041b8162D36913j45609j7358K48335j15519N0236j0312
$$ 440795 201320 441361 -28162 436913 291304 273946 522281 406762 456998 446686
16358D46686k9193P6513A84319J99324J78406B46655P3699q7539I4846O6645K40496
$$ 446686 417493 494006 184319 383643 562049 246655 320354 232815 94846 161491 401987
16347D01987j31840j10240M24801R3799k04728k09564O9918j56454J42465K29579
$$ 401987 270147 159907 584708 678507 473779 264215 334133 177679 320144 549723
16337E49723B59129P1332A28497J14275M12039k53188R5774j16206A53433J35508
$$ 549723 259129 330461 128497 242772 654811 401623 497397 381191 153433 288941
16327B88941L99939B57050K63076B18852K27435n9239E1830L03976f4942I5783
$$ 288941 688880 257050 520126 218852 446287 387048 51830 355806 -64942 95783
16316C50610A31308R5869J21783i2432D61238j87586J29517J2846I6359D7004
$$ 350610 131308 227177 348960 -92432 461238 273652 403169 416015 96359 47004
16305F8248K14294m1619r0157M26363K4007n5218A88196K78519j03368i6822H8206
$$ 68248 282542 240923 150766 577129 601136 545918 188196 466715 363347 -96822 88206
16293d429A04614d845A15440J41902L7116J76022A91706C4491K39193j24467L42180
$$ -4429 104614 -4845 115440 257342 294458 470480 191706 34491 273684 149217 491397
16282D91397j72322p209o7819m0514J2646m8640L45349B12874c9720A89019N1229
$$ 491397 319075 311866 244047 203533 216179 167539 512888 212874 -39720 189019 240248
16271B40248D0871K6726a30665G2998J31801J6523q8404L51458c39188d9813j42077
$$ 240248 40871 67597 -130665 72998 204799 221322 132918 484376 -339188 -49813 -191890
16260a91890A08375L72584A82372o983h6203E3874N405L36306G4361k3161R8117
$$ -191890 108375 480959 182372 175389 -86203 53874 59279 395585 74361 51200 149317
16249A49317J36644c5720B30954p7225L00263k20046E8267a59358A96852I5283
$$ 149317 285961 -35720 230954 153729 453992 233946 58267 -159358 196852 95283
16238A45105p145Q1040K9001J04341B7475P31a4152F1817J46680b8900B56102
$$ 145105 137960 219000 248001 352342 27475 28206 -14152 61817 208497 -28900 256102
16226B63822A14418a43387B3333a85197h0553g9k33138e5164B76540K318g9784
$$ 263822 114418 -143387 23333 -185197 -80553 -79 -233217 -55164 276540 278858 -79784
16214D25619p2594D2862K53091j05708n9115E724J46638A0826K38564J16573d53424
$$ 425619 353025 42862 295953 190245 131130 5724 152362 10826 249390 365963 -453424
16202c211B59433o2697F9132j4668M9151a2795j3242A50027P2644b59754D44465
$$ -3211 259433 196736 69132 54464 103615 -12795 -26037 150027 222671 -259754 444465
16190A75068a52719f547A65008m7837K10734A58685g0279A51794l2882b093B91890
$$ 175068 -152719 -6547 165008 117171 327905 158685 -70279 151794 118912 -2093 291890
16178e741H9150a86605B38190g1225E8751j5318P0179J19994l4054a81932B90821
$$ -5741 89150 -186605 238190 -71225 58751 43433 113612 233606 199552 -181932 290821
16166B76224i2757B47711a2226G8721L45444f717p2043C63786b05815F9821N63881
$$ 276224 -92757 247711 -12226 78721 424165 -6717 -78760 363786 -205815 69821 633702
16155F33702A75028a94579J0463k16324J92597A79159j3223a23522k171B06209
$$ 633702 175028 -194579 -184116 -400440 -207843 179159 165936 -123522 -125693 206209
16144E2816B3243K36884h7385p0471B20727b79374A01363j8974m0543b77820B45397
$$ 52816 23243 260127 -87385 -157856 220727 -279374 101363 82389 41846 -277820 245397
16132a2514E5269b5879B66439f9652A05460L36691F9239g1945o6426A88883b96752
$$ -12514 55269 -25879 266439 -69652 105460 442151 69239 -71945 -138371 188883 -296752
16120G6841a97566A63176F9924a41473B25549b3906B11722f7658j16791A78521
$$ 76841 -197566 163176 69924 -141473 225549 -23906 211722 -67658 -184449 178521
16109A86583D1170K61426j04139e1650D8542J75252j05322P3540L8062B0676P1525
$$ 186583 41170 302596 198457 -51650 48542 223794 118472 192012 230074 20676 92201
16098I2201A4651a63001A71601p4763j2484L88803i880C29068a85718j01022C8197
$$ 92201 14651 -163001 171601 96838 84354 473157 -9880 329068 -185718 -286740 38197
16086A5476d2781l06739f9372K9109A76485J1680D4136Q6890c9606k7489A03566
$$ 15476 -42781 -349520 -69372 -40263 176485 188165 44136 131026 -39606 -67095 103566
16074H746B040J64577A1981J65019a50652A32797J7884p5297b39528b4654B6596
$$ 8746 2040 166617 11981 177000 -150652 132797 150681 75384 -239528 -24654 26596
16062A02663c5994j36388D9141B2620a57640A72568b49687J17831B8756N8065
$$ 102663 -35994 -172382 49141 22620 -157640 172568 -249687 -131856 28756 86821
16052H6821b89312A91565g4718D1606a01351K2472j06059E622h3447D2696h25
$$ 86821 -289312 191565 -74718 41606 -101351 -78879 -184938 5622 -83447 42696 -825
16040a7132l11975D8726a40393f7191I0041K77a79185A15498l4907l0703c19519
$$ -17132 -329107 48726 -140393 -67191 90041 90318 -179185 115498 80591 49888 -319519
16028a33983A41255K3648a77011P3731F5585f8975C0764K68180q9080a80303G3131
$$ -133983 141255 164903 -177011 -103280 65585 -68975 30764 298944 209864 -180303 73131
16016c27177B99002r0925d5627f130o2909q3455M870g0033m4816e7172c05k60567
$$ -327177 299002 208077 -45627 -6130 -69039 -152494 -147624 -70033 -114849 -57172 -305 -260872
16004b60872P6789P9360j10420j50001K2076D4427J48540b05628j0614A28492
$$ -260872 -184083 -104723 -215143 -365144 -343068 44427 192967 -205628 -216242 128492
15993B14348h8297j25529D75953B37181A565Q041a20673j3471k1068F4206J62431
$$ 214348 -88297 -213826 475953 237181 1565 9606 -120673 -134144 -155212 64206 226637
15982B26637l4861j5238R1144b39771C53172e0772k87706A37149D0892J51144
$$ 226637 191776 176538 267682 -239771 353172 -50772 -338478 137149 40892 192036
15972A92036a73050I7508N9194j3897b42334D57520A9542J38196N3194b48685
$$ 192036 -173050 97508 156702 142805 -242334 457520 19542 157738 210932 -248685
15961C89469j45311G3591c42289A06861e0707j12337j55145h7396I767b4174A7953
$$ 389469 244158 73591 -342289 106861 -50707 -163044 -318189 -87396 9767 -24174 17953
15949g1496A10746e9897H3047a07573A57291a84904A72906F0119J06636a79709
$$ -71496 110746 -59897 83047 -107573 157291 -184904 172906 60119 166755 -179709
15938b07568a7591j68093B74143a05009j77936K310M0718A52663J2297a15528
$$ -207568 -17591 -185684 274143 -105009 -282945 -280635 -239917 152663 164960 -115528
15927I5075c16463a41779H42d3795G7338e2017j15557F2762c47482G0437Q7199
$$ 95075 -316463 -141779 842 -43795 77338 -52017 -167574 62762 -347482 70437 157636
15916A57636d9097j47896N121J5552A38976a32456n0420B5651a70672J0204A72
$$ 157636 -49097 -196993 -191872 -176320 138976 -132456 -182876 25651 -170672 -160468 172
15904b59891j27979a8856p5391B12852p5915C2786J09756K08984A3573K72410
$$ -259891 -387870 -18856 -94247 212852 136937 32786 142542 351526 13573 285983
15894B85983a55092N572G4987b55196j75631a3188j82051P7368A2038K65854B2085
$$ 285983 -155092 -149520 74987 -255196 -430827 -13188 -195239 -117871 12038 277892 22085
15882e8043B76889F6254A2587b1917c042n5646b3391j55351B35680b08872i8547
$$ -58043 276889 66254 12587 -21917 -3042 -58688 -23391 -178742 235680 -208872 -98547
15870c25032J03635q3180A63527G1151a00902k04295i0677d2715j21988E5545
$$ -325032 -221397 -304577 163527 71151 -100902 -305197 -90677 -42715 -164703 55545
15859a13387H7022c37980a39310e2936o2468k84985a2842A48929o7723a22482
$$ -113387 87022 -337980 -139310 -52936 -115404 -400389 -12842 148929 81206 -122482
15848H45J7367K64193b41084A80137a8866E914a28860k502m8460f6056D0903d19669
$$ 845 18212 282405 -241084 180137 -18866 5914 -128860 -131362 -179822 -66056 40903 -419669
15835A92390p4357c06808k5102A33841m3746M0650a61250P6822q479E9016a36933
$$ 192390 118033 -306808 -331910 133841 90095 130745 -161250 -84428 -92907 59016 -136933
15823a87116e5130G9400A7332a39625N8896H9841b7798n6220I8994b87385R8350
$$ -187116 -55130 79400 17332 -139625 -80729 89841 -27798 -84018 98994 -287385 -189035
15812a89035a5303E9503b5983D20636i4130A72072J17156A21067m8825C3048J73976
$$ -189035 -15303 59503 -25983 420636 -94130 172072 289228 121067 72242 33048 207024
15801B07024q5694f2561c660j50292g6451p4597B87902b83518D6132a65687k86040
$$ 207024 121330 -62561 -3660 -153952 -76451 -151048 287902 -283518 46132 -165687 -451727
15790d51727d0918j4538q3764F5809d930E4887c66923B8040n175a64011B7198
$$ -451727 -40918 -55456 -139220 65809 -4930 54887 -366923 28040 22865 -164011 27198
15778b8064n847l463A16332b09171F4607J26732m644R3004K13965b6949l15606
$$ -28064 -33911 -37374 116332 -209171 64607 191339 186695 279699 493664 -26949 -342555
15767c42555F34890G21b32381A00601B9695J89754a45793B0377c98852C2339J10483
$$ -342555 634890 721 -232381 100601 29695 219449 -145793 20377 -398852 32339 142822
15756A42822g1443I1513B4674d6686p265k02211B79706C9599K43456f0083H9498
$$ 142822 -71443 91513 24674 -46686 -53951 -256162 279706 39599 283055 -60083 89498
15744I4780e3132C16292h9931e04j87203A67217e4866k68714J31731d8603k3640
$$ 94780 -53132 316292 -89931 -504 -187707 167217 -54866 -323580 -191849 -48603 -72243
15733g2243H6435i6181F0549j5853c7505j76950A0534b67892h0478C7030f32977
$$ -72243 86435 -96181 60549 44696 -37505 -214455 10534 -267892 -80478 37030 -632977
15721a99610j48577F0744a59579b1915n4884B31332d357k67818a28789C41915
$$ -199610 -348187 60744 -159579 -21915 -76799 231332 -4357 -272175 -128789 341915
15710d7860l9823j7225j56113I2162h9275C77978F3029c79580A74328e2379q5523
$$ -47860 -87683 -104908 -261021 92162 -89275 377978 63029 -379580 174328 -52379 -137902
15699a37902j7638J5624k3871e2202J5741F0822R0776J27666G6767L39729b09402
$$ -137902 -155540 -139916 -163787 -52202 -36461 60822 151598 279264 76767 416496 -209402
15687H4522a65645D4370a83844B63975e7784D8465c36640i7602m2370l28709E5226
$$ 84522 -165645 44370 -183844 263975 -57784 48465 -336640 -97602 -139972 -468681 55226
15675i271D15P4609c1513A67915i7247B6725b83045e8271j28267E5656c19198
$$ -9271 415 75024 -31513 167915 -97247 26725 -283045 -58271 -186538 55656 -319198
15663E8257d6927C5273J21143g5889r2605q9226B07086b49022g5404l4634n2326
$$ 58257 -46927 35273 156416 -75889 -168494 -257720 207086 -249022 -75404 -110038 -162364
15652a62364N0485B66462a67188l1396I5558j6929b40675i1980c4347p7176H794
$$ -162364 -111879 266462 -167188 -198584 95558 78629 -240675 -91980 -34347 -111523 8794
15640h813A73887a90906e5196o5387j49423c2339F1524J21093c91851E7754K39523
$$ -8813 173887 -190906 -55196 -120583 -270006 -32339 61524 182617 -391851 57754 297277
15629B97277a25966K4574n3466A45086B9931b7758l12510C29035A27388n0829
$$ 297277 -125966 -101392 -154858 145086 29931 -27758 -340268 329035 127388 76559
15619G6559A0345a31674A18664a05357B09544I0240l2989b10754a0030I5556h5855
$$ 76559 10345 -131674 118664 -105357 209544 90240 57251 -210754 -10030 95556 -85855
15607b64611l4052C5067c6091l16592Q5392d3995D8711e383n365m24609a58224
$$ -264611 -298663 35067 -36091 -352683 -267291 -43995 48711 -5383 -10748 -435357 -158224
15595a34534o1766f5400I6202b9059j3976j12449B22669b56908C35591c76404
$$ -134534 -196300 -65400 96202 -29059 -43035 -155484 222669 -256908 335591 -376404
15584B61633H3493a72825J6577a4230B5334a19381A43842J3861e495A31041l7313
$$ 261633 83493 -172825 -156248 -14230 25334 -119381 143842 157703 -5495 131041 93728
15573I3728J70314H0776a01161E4767a04923B61779a05412D2384b52014I101L35345
$$ 93728 264042 80776 -101161 54767 -104923 261779 -105412 42384 -252014 9101 344446
15562C44446D4918a70761N3980L4338j63572J11080B60672b95669f8002q7899
$$ 344446 44918 -170761 -116781 -82443 -246015 -134935 260672 -295669 -68002 -155901
15552a55901b1726k2248p1112D00742b2664l8438m824A83429G2502B7654Q3161
$$ -155901 -21726 -43974 -115086 400742 -22664 -61102 -65926 183429 72502 27654 110815
15541A10815K61259j56405c6098A96783B0110r864L88K14879n3516g2960C4885
$$ 110815 372074 215669 -36098 196783 20110 10246 10634 225513 171997 -72960 34885
15529B35146r1836n8070B3255a4272G8587Q6555b03853i1483A4441c9714a7448
$$ 235146 143310 85240 23255 -14272 78587 165142 -203853 -91483 14441 -39714 -17448
15517E9125P4818J3046n9759i9954C97487c34779A61427B4522a66158r6765A04914
$$ 59125 133943 146989 87230 -99954 397487 -334779 161427 24522 -166158 -262923 104914
15505C1553b47233e4900B9633A0591d4865C79356B787b30855D6300c4238r6890
$$ 31553 -247233 -54900 29633 10591 -44865 379356 2787 -230855 46300 -34238 -131128
15494a31128p397A93607g3575B25788a68814h2071A64057e1361D4386c7403J2916
$$ -131128 -138525 193607 -73575 225788 -168814 -82071 164057 -51361 44386 -37403 -24487
15483b4487j2803j16607m0311n6731C92227j15081e9072j41122B8802j510L89322
$$ -24487 -37290 -153897 -194208 -250939 392227 277146 -59072 -200194 28802 27292 416614
15472D16614C9243b03017A77705a04539A113a423j01374G2690e4106m02952a13199
$$ 416614 39243 -203017 177705 -104539 1113 -1423 -102797 72690 -54106 -457058 -113199
15460B3321a56328g0422A56380J5268d2710r5866l06464J80410G8159b37845a12729
$$ 23321 -156328 -70422 156380 171648 -42710 -138576 -445040 -264630 78159 -237845 -112729
15448d57539F1927i6617j54362A66310J6923b9950A28025J8788a91753c5571J4787
$$ -457539 61927 -96617 -250979 166310 183233 -29950 128025 146813 -191753 -35571 -20784
15437b0784j11659A88174b72122g1874A63685b09420A18833b15483C55000c7633
$$ -20784 -132443 188174 -272122 -71874 163685 -209420 118833 -215483 355000 -37633
15426D8076b84715A60086m7152b64205Q4210D2070J58236m7845b15319O289M0906
$$ 48076 -284715 160086 112934 -264205 -179995 42070 200306 152461 -215319 -209030 -168124
15415a68124A93063O7953d45199K14959b8721C9915a159A25520J24247K4998l1434
$$ -168124 193063 261016 -445199 -230240 -28721 39915 -1159 125520 249767 274765 243331
15404B43331c65899A5230R5462K7064a8620i088o5646B9181b58544f5290k90360
$$ 243331 -365899 15230 110692 137756 -18620 -9088 -74734 29181 -258544 -65290 -355650
15393c55650J68000a0410B65333G5380b3519j70452i3945A1930P6710Q0356p5529
$$ -355650 -187650 -10410 265333 75380 -23519 -193971 -93945 11930 88640 168996 93467
15382I3467K87570D7873a35328H1630a13515j45996a4775k70422d1443l71345
$$ 93467 381037 47873 -135328 81630 -113515 -259511 -14775 -285197 -41443 -412788
15372d12788c6069A10726M39125A37396d62444J62125a11081L1280A50961O8724
$$ -412788 -36069 110726 549851 137396 -462444 -300319 -111081 -79801 150961 219685
15362B19685d3110B37407b61987B70139F984K0873J10134g8523j10586A52052
$$ 219685 -43110 237407 -261987 270139 6984 27857 137991 -78523 -189109 152052
15351A25128C7808A108J96784Q1275F7127B0490K7549j6258d270j9788B14272
$$ 125128 37808 1108 197892 279167 67127 20490 48039 31781 -4270 -24058 214272
15339d01677d8782r9537A4301b23437A06961b34433H8323h7756j62068B16234
$$ -401677 -48782 -148319 14301 -223437 106961 -234433 88323 -87756 -249824 216234
15328A33210E6012M41631a19814D6463a26596j6049a734j54503D49167c9728p6865
$$ 133210 56012 497643 -119814 46463 -126596 -142645 -1734 -156237 449167 -39728 -116593
15317a16593k22575B8048N1667l9193P6592c5847j55B58064a637D6141e5913A98183
$$ -116593 -339168 28048 79715 40522 117114 -35847 -36002 258064 -1637 46141 -55913 198183
15304A87104Q9043B0335b16153A26258R845a13801B2146b77494G8201i2492B5051
$$ 187104 276147 20335 -216153 126258 136103 -113801 22146 -277494 78201 -92492 25051
15292A46885E8397b18979B61690G6243k6276F985K11780F7134g5216I023g3978
$$ 146885 58397 -218979 261690 76243 49967 6985 218765 67134 -75216 9023 -73978
15280b27813c1398A11627K26592b16425C6125d1337B42273C4410i4149G9201b31290
$$ -227813 -31398 111627 338219 -216425 36125 -41337 242273 34410 -94149 79201 -231290
15268C81932a48577B42987j20328a82127B81916j22460N4245L67695A2358K23052
$$ 381932 -148577 242987 122659 -182127 281916 159456 213701 581396 12358 235410
15258B35410q1166k8653R7840b13862B32187I4873j1724K63601L41067L85492
$$ 235410 154244 125591 223431 -213862 232187 94873 83149 346750 687817 1073309
15248A073309O30800k51951K91816p72702D36580a77125C41228D7646K67740E0209
$$ 1073309 1704109 1452158 1743974 971272 436580 -177125 341228 47646 315386 50209
15237A19435a61558B39183a15416D4514L3355J69499A3314a00743B60354f7118
$$ 119435 -161558 239183 -115416 44514 77869 247368 13314 -100743 260354 -67118
15226B00949a44332b2479A64762n6426K0144a7380l02732I2549c14532C10396
$$ 200949 -144332 -22479 164762 108336 128480 -17380 -320112 92549 -314532 310396
15215a4006l71783A67919m19c32601C17618g9069B13860h8188j50494C02886b02895
$$ -14006 -385789 167919 167500 -332601 317618 -79069 213860 -88188 -238682 302886 -202895
15203A28169A8058K00498f3641J0038A80201q3463c54709A08603J30303I5308
$$ 128169 18058 218556 -63641 -53603 180201 96738 -354709 108603 238906 95308
15192B28031O8566m4104c8773k8875A21033A6228J77281g4982b6457B66847A835
$$ 228031 296597 252493 -38773 -67648 121033 16228 193509 -74982 -26457 266847 1835
15180a43885A68810l4460O4846a50525A46159a65791o6392A69072K496D6470N8581
$$ -143885 168810 134350 199196 -150525 146159 -165791 -232183 169072 171568 46470 105051
15169A05051j5646i0037B29830n0001e3452B91416q6193m2739c44568G8097K10281
$$ 105051 89405 -90037 229830 179829 -53452 291416 205223 162484 -344568 78097 288378
15158B88378F4157J48119H5476M7209a05780B55071a24590A24583c54336B29180
$$ 288378 64157 212276 85476 132685 -105780 255071 -124590 124583 -354336 229180
15147I3602J96917j26730M7102a13292A0678i3912B69136A01700o684B6331J37042
$$ 93602 290519 163789 210891 -113292 10678 -93912 269136 101700 95016 26331 163373
15136A63373k6330o4868J80687B2860Q4290R6899Q6881A01341Q5949L2674c8631
$$ 163373 137043 72175 252862 22860 107150 204049 290930 101341 187290 219964 -38631
15124h0409q6882P1914H7436P726A4281O7601J91688a57243A871J53855p4045
$$ -80409 -167291 -95377 87436 95162 14281 81882 273570 -157243 1871 155726 81681
15113H1681J63936a16464m698l4161A50135P3351k843q9566a92343A13180i2517
$$ 81681 245617 -116464 -121162 -155323 150135 223486 220643 131077 -192343 113180 -92517
15101C79191a35438B1397J02965K30440c0996A62653a31040D58725k12112Q953
$$ 379191 -135438 21397 124362 354802 -30996 162653 -131040 458725 246613 255566
15091B55566a4717F4414h5740B19984d8099g442B01451c1257A23005K21286A44966
$$ 255566 -14717 64414 -85740 219984 -48099 -7442 201451 -31257 123005 344291 144966
15079B46725c1993H6829J51379b6978G881M61698C8831b22749g6101A78765a7728
$$ 246725 -31993 86829 238208 -26978 7881 469579 38831 -222749 -76101 178765 -17728
15067A42221H721J58787J75935j30730m3020p3413F236J46891C442b53296C62629
$$ 142221 8721 167508 343443 212713 169693 96280 6236 153127 3442 -253296 362629
15055B82085k3647k8979J34620A17189j7786N2761k5006C0396J11556J99090j53713
$$ 282085 258438 229459 364079 117189 99403 152164 127158 30396 141952 341042 187329
15044A87329Q9475H5861K6380a65101F29667A47854Q7207K03524k09347a62856
$$ 187329 276804 85861 112241 -165101 629667 147854 235061 438585 229238 -162856
15033G4099J46911I2465C7315N4978K03748j34386m3083J1046K37341r4750b7441
$$ 74099 221010 92465 37315 92293 296041 161655 118572 129618 366959 272209 -27441
15021A44497Q5068J62595A80480F9487J49807K35422A63435J00302i0727B38286
$$ 144497 229565 392160 180480 69487 219294 454716 163435 263737 -90727 238286
15010B49704r8470Q54J18823E9370M39181j69367j22734o8736Q7902N3051c8179
$$ 249704 151234 152088 270911 59370 498551 329184 206450 137714 225616 278667 -38179
14998B69190J48245j93914H1957b69734B08047J86395A72636n1183K55687A09939
$$ 269190 417435 223521 81957 -269734 208047 394442 172636 121453 377140 109939
14987a89401A47560a8160D04373K55865B47397K44602B04660a60875A60129K17936
$$ -189401 147560 -18160 404373 660238 247397 491999 204660 -160875 160129 378065
14977C78065J74980j69353j14851J70464A52732J6119a15577C00413m2699i468
$$ 378065 553045 383692 268841 439305 152732 168851 -115577 300413 257714 -9468
14966C59888I0287k8461J93924Q3895n2519A5467K62380J59938j33729J0411H3514
$$ 359888 90287 61826 255750 339645 287126 15467 277847 437785 304056 314467 83514
14954B13980n8373J11318K72077a3701B20500g9834c2687C31936j05151L37472
$$ 213980 155607 266925 539002 -13701 220500 -79834 -32687 331936 226785 564257
14944E64257a28486B36830j13284a17822B01448l3821a38361n6192E58957B17345
$$ 564257 -128486 236830 123546 -117822 201448 167627 -138361 -194553 558957 217345
14933E36153k12042q4429G35K17321R8729J48365B08675J53351j37794f9899C85935
$$ 536153 324111 239682 735 218056 316785 465150 208675 362026 224232 -69899 385935
14921B98002j19927J43204K8710G0156K15008k7413C4634K03869J64408M5742
$$ 298002 178075 321279 349989 70156 285164 257751 34634 238503 402911 448653
14911D48653k05262J42229r1980p7922B1192L03954l8392J8504p5409J15240J72650
$$ 448653 243391 385620 293640 215718 21192 325146 286754 305258 229849 345089 517739
14900E17739B50929J65270G7655J88164M85858A76346j5421J70481R066j5886
$$ 517739 250929 416199 77655 265819 751677 176346 160925 331406 340472 324586
14890C24586b0073D69803N7963k13172D6520L26114p0121J92666r0197o0619A64900
$$ 324586 -20073 469803 527766 314594 46520 372634 302513 495179 404982 344363 164900
14878C60441J04626j80036J13205J26460A57913K75029A32419R8540a13768C00251
$$ 360441 465067 285031 398236 524696 157913 432942 132419 230959 -113768 300251
14867C20172J21130J94479b8026D09235A67111L47559A86504J60826A73252K72182
$$ 320172 441302 635781 -28026 409235 167111 514670 186504 347330 173252 445434
14857D45434o432N6021n8441J23736j50981A34694J44180L74848k84894J56043
$$ 445434 439002 495023 436582 560318 409337 134694 278874 653722 368828 524871
14847E24871J6370j13599A86979P1012K05149K4674k39412L73741j75209J27932
$$ 524871 541241 427642 186979 257991 463140 487814 248402 622143 446934 574866
14837E74866A63928K28076N6693K66605B57107M25812j22175B68276L16697J32028
$$ 574866 163928 392004 448697 715302 257107 682919 560744 268276 584973 717001
14827G17001j79859j26063A03792J29340J81896P54q9922k8531K8590P8722J82692
$$ 717001 537142 411079 103792 233132 415028 415782 325860 297329 325919 404641 587333
14816E87333B83592K08273J41722p6401J89379B24347K67069L19134D03568R8198
$$ 587333 283592 491865 633587 557186 746565 224347 491416 810550 403568 501766
14806E01766L16495k75492p8985j13245p5061K51512R3055q4383J34119J87655
$$ 501766 818261 542769 463784 350539 275478 526990 620045 535662 669781 857436
14796H57436B90565K91868B27266L71729m9211K98076k34164N6517j56984J93237
$$ 857436 290565 582433 227266 598995 549784 847860 613696 670213 513229 706466
14786G06466M1022q0059Q057E5611N72804j0242R8429C26054L00273n7609j57047
$$ 706466 747488 667429 675486 55611 628415 618173 716602 326054 626327 568718 411671
14775D11671L09862k38837l3898M560K33496j28342K99132C6265P78589m1284
$$ 411671 721533 482696 448798 453358 686854 558512 857644 36265 814854 773570
14765G73570K9801n7598j93154J76576n1833k5917j50834J01446N2571O7541l6304
$$ 773570 803371 745773 552619 729195 677362 651445 500611 602057 654628 722169 685865
14754F85865K33237m9741k91876j82477P0817M46773l05549k08431M51775k22213
$$ 685865 919102 869361 577485 395008 465825 912598 607049 398618 850393 628180
14744F28180K86095J1889k70360B55997N87728l27271O67216l66105j73178N63214
$$ 628180 914275 926164 655804 255997 843725 516454 1183670 817565 644387 1207601
14734A207601n80934M19690j39710l20369J60819j75038M56418m63445o9830N00173
$$ 1207601 626667 1046357 906647 586278 747097 572059 1028477 565032 495202 995375
14724I95375k04366j27074J61822j1659j95453M02221q4145L14870l26139m62633
$$ 995375 791009 663935 825757 814098 618645 1020866 936721 1251591 925452 462819
14714D62819M16067n1942M838n4812J1634l5176K62452K03524j68933j77657K0489
$$ 462819 878886 826944 831782 776970 788604 753428 1015880 1219404 1050471 872814 893303
14703H93303n0650l4194J61216j47391J76846o2300j47677n4794K49467J45687
$$ 893303 842653 808459 969675 822284 999130 936830 789153 734359 983826 1129513
14693A129513k55759j57578L68246l51210Q4887K90159j07385j9125k1290J85435
$$ 1129513 873754 716176 1084422 733212 818099 1108258 1000873 981748 960458 1145893
14683A145893j14155j16160o4966K14026j34204j48069M82720k60453l6868M31181
$$ 1145893 1031738 915578 850612 1064638 930434 782365 1265085 1004632 967764 1398945
14673A398945m78613J19216j4027P8931J21833j87266l87377K99040J40606l01864
$$ 1398945 920332 1039548 1025521 1104452 1226285 1039019 651642 950682 1091288 789424
14663G89424K0840J63156O6981O569o5236O643j37432K06679L8366l15943M94144
$$ 789424 810264 973420 1040401 1046970 981734 988377 850945 1057624 1095990 780047 1274191
14652A274191l19163J62833k73939L7069J74293K22177K28359m83510K24650K71747
$$ 1274191 955028 1117861 843922 880991 1055284 1277461 1505820 1022310 1246960 1518707
14642A518707j29108j28237N4733O0717j36519j73780K92020L02J15719j96360
$$ 1518707 1389599 1261362 1316095 1376812 1240293 1066513 1358533 1358835 1474554 1278194
14632A278194J42922j83964j60653J73065J57777m9386k07266J62880J27891K88765
$$ 1278194 1421116 1237152 1076499 1249564 1407341 1357955 1150689 1313569 1441460 1730225
14622A730225m14177K20566j93083Q2806O7651p9662O4699J94816k15242l13235
$$ 1730225 1316048 1536614 1343531 1426337 1493988 1414326 1479025 1673841 1458599 1145364
14612A145364O86729m0055k84397j14188K47594n8246K15289k32826P556O7627
$$ 1145364 1832093 1792038 1507641 1393453 1641047 1582801 1798090 1565264 1572820 1640447
14602A640447J03664j54673K78467j85672M05319j36386l05144P9760k6469K0489
$$ 1640447 1744111 1589438 1867905 1682233 2087552 1951166 1646022 1725782 1699313 1719802
14592A719802j3773J87446J15263M2672j68809L13876n9681j17850j66680K52735
$$ 1719802 1706029 1893475 2008738 2051410 1882601 2196477 2136796 2018946 1852266 2105001
14582B105001q056j81988J93137J15386k73646M9953J20452m8258J27167K67760
$$ 2105001 2096945 1914957 2108094 2223480 1949834 1999787 2120239 2071981 2199148 2466908
14572B466908j75216J25186j0507l65107K64768M4633m06479M85917R3573M4601
$$ 2466908 2291692 2416878 2406371 2041264 2306032 2350665 1944186 2430103 2523676 2568277
14562B568277J59207l07497L80907K32331q4115K4295K63274r5358O64260j78359
$$ 2568277 2727484 2419987 2800894 3033225 2949110 2973405 3236679 3141321 3805581 3627222
14552C627222O21842N57512R03550J863296M561415Q981375J9024943R308657
$$ 3627222 4249064 4806576 5710126 7573422 12134837 21116212 40141155 49449812
14544D9449812k3958614I460885m616934j469776r30158k53661o6513l8522R9705
$$ 49449812 25491198 9460885 4843951 3374175 2444017 2190356 2123843 2085321 2185026
14535B185026k15585K20560j74461M5209J11743Q1543j33163K59295k0510K19121
$$ 2185026 1969441 2190001 2015540 2060749 2172492 2254035 2120872 2380167 2359657 2578778
14525B578778J23991l22821p8416M04583K88402n24442L95555j53312k00087P715
$$ 2578778 2702769 2379948 2301532 2706115 2994517 2470075 2865630 2712318 2512231 2519946
14515B519946L49365j22897L66483j05338l02354L75609K11962n55635J93712
$$ 2519946 2869311 2746414 3112897 3007559 2705205 3080814 3292776 2737141 2930853
14506B930853M3561K6222R7946m0086J03751J26593N0521p2993j8508K56965k19874
$$ 2930853 2974414 3000636 3098582 3058496 3162247 3288840 3339361 3266368 3247860 3504825 3284951
14495C284951Q6683K92737l33283N56200j92562n695j66801k23694M19378K38066
$$ 3284951 3371634 3664371 3331088 3887288 3694726 3689031 3522230 3298536 3717914 3955980
14485C955980n8064m2384P4021k25020K92214N6659n32179M86657L03376m14249
$$ 3955980 3897916 3855532 3929553 3704533 3996747 4053406 3521227 4007884 4311260 3897011
14475C897011L78654o4792P8838N6311K70891n06547K87256R3691J56326K64450
$$ 3897011 4275665 4210873 4289711 4346022 4616913 4110366 4397622 4491313 4647639 4912089
14465D912089n22415N90177j02511j03759L59965j12237j41408K86638O1974q7000
$$ 4912089 4389674 4979851 4877340 4773581 5133546 5021309 4879901 5166539 5228513 5141513
14455E141513J57781J20151J99364j32404M9116J08944j87811j96117N12435K20212
$$ 5141513 5299294 5419445 5618809 5486405 5535521 5644465 5456654 5260537 5772972 5993184
14445E993184l24842J32837P8357N13711n9811j02287P1634j9878Q0823K63453
$$ 5993184 5668342 5801179 5879536 6393247 6333436 6231149 6302783 6282905 6363728 6627181
14435F627181n0383N4138K03750J03199K66242l35070M98190j30944J55308J45602
$$ 6627181 6576798 6630936 6834686 6937885 7204127 6869057 7367247 7236303 7391611 7537213
14425G537213K36856J28994N5685j14095K80063L06080j58838K33357j34465N75459
$$ 7537213 7774069 7903063 7958748 7844653 8124716 8430796 8271958 8505315 8370850 8946309
14415H946309j99275L20316k42961P98679k69799m2035M13227j09748O27462n6944
$$ 8946309 8747034 9067350 8824389 9623068 9353269 9311234 9724461 9614713 10242175 10185231
14405A0185231n962M67338q1474J25550K72606L19307J21473J03913k72268M97706
$$ 10185231 10179269 10646607 10565133 10690683 10963289 11282596 11404069 11507982 11235714 11733420
14395A1733420K95910J97150r9043N40693J56628N8310L45955N05312L27142j28901
$$ 11733420 12029330 12226480 12127437 12668130 12824758 12883068 13229023 13734335 14061477 13932576
14385A3932576L91849L47482J43417K37278J51464O29689J02431L01395L09011
$$ 13932576 14324425 14671907 14815324 15052602 15204066 15833755 15936186 16237581 16546592
14376A6546592N86371K32902L29315L49208L63421J57210N62076K89059M97671
$$ 16546592 17132963 17365865 17695180 18044388 18407809 18565019 19127095 19416154 19913825
14367A9913825K43539M90937R27705N4J88930N68234P37529M66932M56296N92247
$$ 19913825 20157364 20648301 21576006 21576060 21764990 22333224 23070753 23537685 23993981 24586228
14357B4586228M96928J95209J058684N91975N78647M11847R28141N33420J010483
$$ 24586228 25083156 25278365 26337049 26929024 27507671 27919518 28847659 29381079 30391562
14348C0391562K59129J469644P04734O21162J016337Q52696Q93544O19977J202304
$$ 30391562 30650691 32120335 32825069 33446231 34462568 35315264 36208808 36828785 38031089
14339C8031089J290403R34003J097488J321066J230992J160280J330522J488948
$$ 38031089 39321492 40255495 41352983 42674049 43905041 45065321 46395843 47884791
14331D7884791J157998J571743J855038J328643K227042J541923K116506J896690
$$ 47884791 49042789 50614532 52469570 53798213 56025255 57567178 59683684 61580374
14323F1580374K027841K332759K311485K683170J984457K998747K704001K978077
$$ 61580374 63608215 65940974 68252459 70935629 72920086 75918833 78622834 81600911
14315H1600911L183081L044216L390707L846674L848836M073437M630907M235030
$$ 81600911 84783992 87828208 91218915 95065589 98914425 102987862 107618769 111853799
14307A11853799M989012M966730N777865N462456O263285O201655O923331P504405
$$ 111853799 116842811 121809541 127587406 133049862 139313147 145514802 152438133 159942538
14299A59942538P527358Q072412Q451136R513391R501903R842341J1027509J1073336
$$ 159942538 167469896 175542308 183993444 193506835 203008738 212851079 223878588 234951924
14291B34951924J2131441J2280986J2863186J3519441J4346874J4288557J5313287
$$ 234951924 247083365 259364351 272227537 285746978 300093852 314382409 329695696
14284C29695696J4876510J5681113J5422229J5541902J5245295J4421631J4100721
$$ 329695696 344572206 360253319 375675548 391217450 406462745 420884376 434985097
14277D34985097J2474537J1581195J0070096P849978M408788j65633k454210j608913
$$ 434985097 447459634 459040829 469110925 476960903 481369691 481204058 478749848 477140935
14269D77140935j592647n370850m206113p878281j0497707j1268053j3280996
$$ 477140935 475548288 470177438 465971325 458093044 447595337 436327284 423046288
14262D23046288j4180887j5338435j5483335j5458067j5702668j5571451j5876309
$$ 423046288 408865401 393526966 378043631 362585564 346882896 331311445 315435136
14255C15435136j4471625j4693616j4290242j3499058j2715796j2253635j1499848
$$ 315435136 300963511 286269895 271979653 258480595 245764799 233511164 222011316
14248B22011316j1057033j0049588r849674q880072q661233p951131p678596p695389
$$ 222011316 210954283 200904695 191055021 182174949 173513716 165562585 157883989 150188600
14240A50188600o696083o319757n768033n882838n034667n318693n081192m499598
$$ 150188600 143492517 137172760 131404727 125521889 120487222 115168529 110087337 105587739
14232A05587739l679212l975128l903356l739181l475511l547857l094363k887948
$$ 105587739 101908527 97933399 94030043 90290862 86815351 83267494 80173131 77285183
14224G7285183k511804k669251k489617k482939j952565k421981k053603j930234
$$ 77285183 74773379 72104128 69614511 67131572 65179007 62757026 60703423 58773189
14216E8773189j954371j733792k116690p03871k132917j787031j185170j305482
$$ 58773189 56818818 55085026 52968336 52264465 50131548 48344517 47159347 45853865
14208D5853865j361213m97876j098298j698538j370095j165205j098431n99309
$$ 45853865 44492652 43994776 42896478 41197940 39827845 38662640 37564209 36964900
14200C6964900n78057j328105j123485m83054j329889m60828q30226m24017r71235
$$ 36964900 36386843 35058738 33935253 33452199 32122310 31661482 30831256 30407239 29436004
14191B9436004p90024o54458p05032q87197l93418o59454m48536m13124q00937
$$ 29436004 28645980 27991522 27286490 26399293 26005875 25346421 24897885 24484761 23683824
14182B3683824o42091l12669m30760m85061p27967k55569o90841r9326l38035
$$ 23683824 23041733 22729064 22298304 21813243 21085276 20829707 20138866 20039540 19701505
14173A9701505m66322m2902p22664l52546l39805J34517o76108l84474k27897
$$ 19701505 19235183 19192281 18469617 18117071 17777266 17911783 17235675 16851201 16623304
14164A6623304j72527m63885l60789m08161j83407Q1875m30892m64499L0987k02292
$$ 16623304 16450777 15986892 15626103 15217942 15034535 15116410 14685518 14221019 14252006 14049714
14154A4049714l54107k37438m5555k68961J2316l49614k42121k16640l68041J76362
$$ 14049714 13695607 13458169 13412614 13143653 13155969 12806355 12564234 12347594 11979553 12155915
14144A2155915k92299j02777n92135l837L2224k03466o4728j53343k58105j81201
$$ 12155915 11863616 11760839 11168704 11164867 11197091 10993625 10928897 10775554 10517449 10336248
14134A0336248j7445j77434k24721k30594j79597k05908o6583J04789k20140j68879
$$ 10336248 10318803 10141369 9916648 9686054 9506457 9300549 9233966 9338755 9118615 8949736
14124H949736l27328L38738n16966J43917k7384j97307m02849L2433K94584n29511
$$ 8949736 8622408 8961146 8444180 8588097 8560713 8363406 7960557 7992990 8287574 7758063
14114G758063R5234k32640k37667Q685J44798n17797L50917j91736j31741k07690
$$ 7758063 7853297 7620657 7382990 7391675 7536473 7018676 7369593 7177857 7046116 6838426
14104F838426r046J15600J9369k68791k5776k21561o3782j60348m6880K29467
$$ 6838426 6829380 6944980 6964349 6695558 6669782 6448221 6384439 6224091 6177211 6406678
14094F406678n75756J32366J14615q2405l27697K44145q2933l06419k9944n2206
$$ 6406678 5830922 5963288 6077903 5995498 5667801 5911946 5829013 5522594 5492650 5440444
14084E440444J13266l75413K65944k51171L92919m42100L4023N3282l90332k09370
$$ 5440444 5553710 5178297 5444241 5193070 5585989 5143889 5177912 5231194 4840862 4631492
14074D631492N19891k54082J66597n24903Q18L12840n3386k24000j54236L19025
$$ 4631492 5151383 4897301 5063898 4538995 4539813 4852653 4799267 4575267 4421031 4740056
14064D740056p42772K55134K53847k10605m6750J77805j51013j76293q6591K94727
$$ 4740056 3997284 4252418 4506265 4295660 4248910 4426715 4275702 4099409 4012818 4307545
14054D307545m95011M5809J24131j38275j22588n2496J72427p7884j21234O7450
$$ 4307545 3812534 3858343 3982474 3844199 3721611 3669115 3841542 3763658 3642424 3709874
14044C709874L01773o38518M8146M12463l76883J30237q2664J33773l09422K97405
$$ 3709874 4011647 3373129 3421275 3833738 3456855 3587092 3504428 3638201 3328779 3626184
14034C626184l50608R2603K6242k09273k41650M28641j07926k12149j43530O1350
$$ 3626184 3275576 3368179 3394421 3185148 2943498 3372139 3264213 3052064 2908534 2969884
14024B969884k15338K90486r6621l05886j2152k3485R4033J98973m3222k36519
$$ 2969884 2754546 3045032 2948411 2642525 2630373 2606888 2700921 2899894 2856672 2620153
14014B620153L88185p41685M02530m7492l1926M5585J67078J61156p19522L32014
$$ 2620153 3008338 2266653 2669183 2621691 2589765 2635350 2802428 2963584 2244062 2576076
14004B576076k08963L65167k90315n0305m39859Q94743o30442k54378L27202j72030
$$ 2576076 2367113 2732280 2441965 2391660 1951801 2846544 2216102 1961724 2288926 2116896
13994B116896K25853j74739J84807j34400M85749Q85003K965963O670693J8153503
$$ 2116896 2342749 2168010 2352817 2218417 2704166 3589169 6555132 13225825 31379328
13985C1379328J7472286j8040930A5177707o185368k405500j254768q86203l60472
$$ 31379328 48851614 30810684 15177707 8992339 6586839 5332071 4445868 4085396
13977D085396k98505l32166k26918o8392k03977J71285l06509j42470k46998N348
$$ 4085396 3786891 3454725 3227807 3159415 2955438 3126723 2820214 2677744 2430746 2436094
13967B436094j87871L63437L155k49469k06708K07444k09210J36697j99340M11543
$$ 2436094 2248223 2611660 2614815 2365346 2158638 2366082 2156872 2293569 2094229 2505772
13957B505772j79537k92846J9689K29751k74603j82315K61824L12239l64286K72231
$$ 2505772 2326235 2033389 2053078 2282829 2008226 1825911 2087735 2399974 2035688 2307919
13947B307919l27471K23851l12502O21966o38897M13616m3462o33139K29633M2210
$$ 2307919 1980448 2204299 1891797 2513763 1874866 2288482 2245020 1611881 1841514 1883724
13937A883724m2553j71555r7911N323M63986q9104j57368k83349J29943J41092
$$ 1883724 1841171 1669616 1571705 1577028 2041014 1951910 1794542 1511193 1641136 1782228
13927A782228M02630m82289m38539J56952K26879p6298M71107k75902q4650J05926
$$ 1782228 2184858 1702569 1264030 1420982 1647861 1571563 2042670 1766768 1682118 1788044
13917A788044k56183L45188k72204l81449K91944J41449j34589M80837k72645
$$ 1788044 1531861 1877049 1604845 1223396 1515340 1656789 1522200 2003037 1730392
13908A730392m37492M95369j51852l63822N21562p82211K79627M45117l13908
$$ 1730392 1292900 1788269 1636417 1272595 1794157 1011946 1291573 1736690 1422782
13899A422782M7771j65580O1703J00539k100m32192N16256m0373m17426N11350
$$ 1422782 1470553 1304973 1366676 1467215 1465115 1032923 1549179 1508806 1091380 1602730
13889A602730j49894J39735K8007m72285K75577K0394k39217J78919j4626k9320
$$ 1602730 1452836 1592571 1620578 1148293 1423870 1444264 1205047 1383966 1369340 1340020
13879A340020j53361M4791l33375N37260k47027K15179n3723j39632P2723N78438
$$ 1340020 1186659 1231450 898075 1435335 1188308 1403487 1349764 1210132 1282855 1861293
13869A861293o50991P5293k20378L52539P7844o34907m1646L78647l13847N8378
$$ 1861293 1210302 1285595 1065217 1417756 1495600 860693 819047 1197694 883847 942225
13859I42225j40420r6245K86745q6188K90131j0312k01634M67503m04429k64965
$$ 942225 801805 705560 992305 906117 1196248 1185936 984302 1451805 1047376 782411
13849G82411L61490k61226J07070l8931K79413j2843j40470N4792r5576R3356
$$ 782411 1143901 882675 989745 950814 1230227 1217384 1076914 1131706 1036130 1129486
13839A129486m6165j38828j10402R7158K55071k69421J14802K11464j03566j55874
$$ 1129486 1083321 944493 834091 931249 1186320 916899 1031701 1243165 1139599 983725
13829I83725q9974L53725R7298l47881j51630o3748K89026k40791j57307L06690
$$ 983725 893751 1247476 1344774 996893 845263 781515 1070541 829750 672443 979133
13819I79133r4650k51607M68435j52375j82011l8613l6694N30095k62562j32845
$$ 979133 884483 632876 1101311 948936 766925 728312 691618 1221713 959151 826306
13809H26306J1226N34166m01721k59856j64914O97815K794j86649j07538k22160
$$ 826306 837532 1371698 969977 710121 545207 1243022 1245816 1059167 951629 729469
13799G29469K94510k19724l1052N8634J5859j25711J52342J22321k33438K19517
$$ 729469 1023979 804255 773203 831837 847696 721985 874327 996648 763210 982727
13789I82727k96066J53107M27782D49934K84500N10059E72487K31918K6974P8299
$$ 982727 686661 839768 1267550 449934 734434 1244493 572487 804405 831379 909678
13779I09678j99823J79630K73990D58431M69044K1980C39694L9799R15520n76791
$$ 909678 709855 889485 1163475 458431 927475 949455 339694 379493 1295013 718222
13769G18222o5988k9664K13498J63692k26814j65357K79273k84917R3571K17870
$$ 718222 652234 622570 836068 999760 772946 607589 886862 601945 695516 913386
13759I13386j68340j14076Q3677J04898k5845J43776L5913D27066J98067L55042
$$ 913386 745046 630970 714647 819545 793700 937476 973389 427066 625133 980175
13749I80175D62915L24433J83013l24783o7919j63129K93392q9363N4691J66943
$$ 980175 462915 787348 970361 645578 577659 414530 707922 618559 673250 840193
13739H40193k03352J31025k81236K15944R8003j90884L140j04242j34753J82298
$$ 840193 636841 767866 486630 702574 800577 609693 612833 508591 373838 556136
13729E56136q2031J24411K52572l52470K12877j94164R8820M491n4604M864j33072
$$ 556136 474105 598516 851088 498618 711495 517331 616151 620642 566038 570902 437830
13718D37830K84803J93954m39243J66752J89904k89069o2464n5758J76844j14942
$$ 437830 722633 916587 477344 644096 834000 544931 482467 426709 603553 488611
13708D88611K48734k52959J13333K07838l68284k4176J26001l4499j86865K03065
$$ 488611 737345 484386 597719 805557 437273 413097 539098 504599 317734 520799
13698E20799K3711P4422r4215r857q5669A93419M26604j54733N9996N7562k8452
$$ 520799 544510 618932 524717 514860 429191 193419 620023 465290 525286 582848 554396
13687E54396K12616k26261B01095N34438k61689J8620J09555j05979N3447m2046
$$ 554396 767012 540751 201095 735533 473844 492464 602019 496040 549487 507441
13677E07441J2782B18439M63520B27755L93105M869L9790j10871j68480J66152
$$ 507441 520223 218439 681959 227755 620860 625729 665519 554648 386168 552320
13667E52320n5267N2378o9989P913M47543B97530L56800j33773k30982J70426
$$ 552320 497053 549431 479442 487355 934898 297530 654330 520557 289575 460001
13657D60001j21899J48195K41114l26401j68773K91585K965J8673r1437j19219
$$ 460001 338102 486297 727411 401010 232237 523822 526787 545460 454023 334804
13647C34804M7871j29426K92016N8002k01290q8771J07308K09972B76728P618
$$ 334804 382675 253249 545265 603267 401977 313206 420514 630486 276728 284346
13637B84346o4450K81063A53480M33779O9247C07710q8263J60882J31752A20012
$$ 284346 219896 500959 153480 587259 656506 307710 219447 380329 512081 120012
13626C76641A41423M66989o3576r3276a527C92552j1369J55307m3641J68242A92565
$$ 376641 141423 608412 544836 451560 -1527 392552 381183 536490 492849 661091 192565
13614H27331C07815J79991p7971K58605j36791B46292R7354n5670O1800K49668
$$ 827331 307815 487806 409835 668440 531649 246292 343646 287976 349776 599444
13604E99444B46065K36182P1522j53870J24985j83045q3173q3918K07707L4191
$$ 599444 246065 482247 553769 399899 524884 341839 258666 174748 382455 416646
13594D16646j31683K66772j36252J9791p4427K75671j99888J2510j30780J0731
$$ 416646 284963 551735 415483 435274 360847 636518 436630 449140 318360 329091
13584C29091N3555o9227J58895A5981M76189k08012m6560J27646B1971J67311
$$ 329091 382646 313419 472314 15981 492170 284158 237598 365244 21971 189282
13574A89282p6610J2771L34984a44751A18798K6866j9649M46494L392B12607J93849
$$ 189282 112672 125443 460427 -144751 118798 145664 126015 572509 575901 212607 406456
13563D06456L24766A64575J95589j43975M8251J4771K66584j20938j45168J51354
$$ 406456 731222 164575 360164 216189 264440 279211 545795 424857 279689 431043
13553D31043M2582j41247o772A31059R9357J60664A25650M37292H6439K24585
$$ 431043 473625 332378 325606 131059 230416 391080 125650 562942 86439 311024
13543C11024K0204k1264l3334R0623A52789b9636D67192n6138A6692J89783k911
$$ 311024 331228 309964 276630 367253 152789 -29636 467192 411054 16692 206475 203564
13532B03564J58477M16700k54281j8919A95937K428N9803N75678j03396B24618
$$ 203564 362041 778741 524460 505541 195937 198365 258168 833846 730450 224618
13521B0905K17124r2926M384N35915j69102B11899K41567J01074k67274j34298
$$ 20905 238029 145103 149487 685402 516300 211899 453466 554540 287266 152968
13511A52968K6059N37625B48385J06722j44973K07532B04626Q488K010M08790
$$ 152968 179027 716652 248385 355107 210134 417666 204626 213114 215124 623914
13501F23914A87783K53402j23778a39631B15797N3255q7212J05371C9915A721
$$ 623914 187783 441185 317407 -139631 215797 269052 181840 287211 39915 1721
13490A43134k4217J37858J94633k20745r6447M56259k57255d4592D25593Q2919
$$ 143134 118917 256775 451408 230663 134216 590475 333220 -44592 425593 508512
13480E08512j95658A30282K36568J43728q4422o2990A19550K08379o4818J11860
$$ 508512 312854 130282 366850 510578 426156 363166 119550 327929 263111 374971
13470C74971A5616J52693J4681k7695K03203A10201a2322C41488J77176A47005
$$ 374971 15616 168309 182990 155295 358498 110201 -12322 341488 518664 147005
13459B96223r1729K38985k9258J69056H1476J92894r7778K4810g746A57611J41573
$$ 296223 204494 443479 414221 583277 81476 274370 176592 201402 -7746 157611 299184
13448B99184J03264q5743g4252B94677P8631j78656k5021N6385e1370A17692L31865
$$ 299184 402448 316705 -74252 294677 373308 194652 169631 226016 -51370 117692 449557
13437D49557A25196K27248R0425j82266F1914k1117J64722K0920H3608O5177B3424
$$ 449557 125196 352444 442869 260603 61914 40797 205519 226439 83608 148785 23424
13425D63866i7439A90709O5959j4879A10616O6777D2755N75623a01013B03408
$$ 463866 -97439 190709 256668 241789 110616 177393 42755 618378 -101013 203408
13414F8403B5197N37019j74692j64369r4167J98870K63168E7507J98084A12106
$$ 68403 25197 562216 387524 223155 128988 327858 591026 57507 255591 112106
13403A14387B7708K90670b01750d6162j20336B32564a40637b8833C61131n9113
$$ 114387 27708 318378 -201750 -46162 -166498 232564 -140637 -28833 361131 302018
13393C02018j05656c7088A78018J86239j36578J79770a62584A55584J15318J2739
$$ 302018 196362 -37088 178018 364257 227679 407449 -162584 155584 270902 283641
13383B83641r8128l5962J48935A2223L06301J62418k7528j86384Q774Q0493A74915
$$ 283641 185513 149551 298486 12223 318524 480942 453414 267030 275804 356297 174915
13371C7313J70738M6124A1426J97223B5188K66913q0281n8758J79891D3889K07964
$$ 37313 208051 254175 11426 208649 25188 292101 211820 153062 332953 43889 251853
13360B51853F3799J088K06349K19435B28832c1402D46402A84305F9783J53562
$$ 251853 63799 64887 271236 490671 228832 -31402 446402 184305 69783 223345
13350B23345M4302i5453B36683A16290L05897j809Q3436a38058B50330q3537J94716
$$ 223345 267647 -95453 236683 116290 422187 420378 503814 -138058 250330 166793 361509
13339C61509K53668j86061A78601q4348K80781I9353K40514C8820C485M06634
$$ 361509 615177 429116 178601 94253 375034 99353 339867 38820 3485 410119
13329D10119K8749j54461K8023E5382N2770l1720J13946L66640A77658P420K15148
$$ 410119 438868 284407 312430 55382 108152 76432 190378 557018 177658 185078 400226
13318D00226e9693A69370m0161j7625K88706A59916J61626J25620A82402O0918
$$ 400226 -59693 169370 129209 111584 400290 159916 321542 447162 182402 243320
13308B43320o5162J1580J7212m8384N4712o8743j0991K78635F1193a54554D6127
$$ 243320 178158 189738 206950 158566 213278 144535 133544 412179 61193 -154554 46127
13296C09469Q6500D6980L22641D9780K02744n9625b74453C87860j73016M21291
$$ 309469 395969 46980 369621 49780 252524 192899 -274453 387860 214844 636135
13286F36135c08024A85105a4142B32552a3108A98821K81282o3721b9134A49110
$$ 636135 -308024 185105 -14142 232552 -13108 198821 480103 416382 -29134 149110
13275B60203g6792B91700f6949A05160J21675n1183B1602K50906I5154l3340b6790
$$ 260203 -76792 291700 -66949 105160 226835 175652 21602 272508 95154 61814 -26790
13263D9548J7218K7266M07453H4024K8759J24627b25185A248K76409l7320Q8846
$$ 49548 66766 94032 501485 84024 112783 237410 -225185 1248 277657 240337 329183
13252C29183A45885G2533L9174A437J2887K2078b6494A45232O4836g7413H8354
$$ 329183 145885 72533 111707 1437 14324 36402 -26494 145232 210068 -77413 88354
13240B36397Q1105c51922a06695m8616D3300b3151B04552L9252g2791D89432j72083
$$ 236397 317502 -351922 -106695 -155311 43300 -23151 204552 243804 -72791 489432 317349
13229C17349K6770k945A62306J86174j07241r6920K44792H8790J53602J45057
$$ 317349 344119 341174 162306 348480 241239 144319 389111 88790 242392 387449
13219C87449A65626a27657A57226R9581h7578C3670a71895B22239q8407g955r5626
$$ 387449 165626 -127657 157226 256807 -87578 33670 -171895 222239 133832 -7955 -103581
13208a03581B85243h2173C46796M8857K4230c3656e501n0141A125L50064r7407
$$ -103581 285243 -82173 346796 395653 419883 -33656 -5501 -55642 1125 351189 253782
13197B53782j21777F4671J49941B4664a17830A22943n0389f7846j02425L1210
$$ 253782 132005 64671 214612 24664 -117830 122943 72554 -67846 -170271 -139061
13187a39061G099O4353J73358B9625K44831a85345B80478J84718I0161C9287K12120
$$ -139061 7099 71452 244810 29625 274456 -185345 280478 465196 90161 39287 251407
13176B51407A17123A8298A62a87405C27468j44198J0079b46183B64966J0387b63564
$$ 251407 117123 18298 162 -187405 327468 183270 193349 -246183 264966 275353 -263564
13164b32583C82021A41387a37215B58714H5609J26257D3611J91053J69981j16555
$$ -232583 382021 141387 -137215 258714 85609 211866 43611 234664 404645 288090
13154B88090b33146C58494G7484m211J18240A4588K24986R6994i0576C23849E268
$$ 288090 -233146 358494 77484 73273 191513 14588 239574 336568 -90576 323849 5268
13142C04422R2691a48399B98218m8891g6255H0250K54967F5356J63731j03527
$$ 304422 397113 -148399 298218 249327 -76255 80250 335217 65356 229087 125560
13132A25560E8995J86769J40462g9298E6107K47888kc65969C23904d43336E9610
$$ 125560 58995 245764 386226 -79298 56107 303995 303993 -365969 323904 -443336 59610
13120A59194a53057n8722B80597J14956A0122J60797j2828g5298B59232M8713
$$ 159194 -153057 -211779 280597 395553 10122 170919 158091 -75298 259232 307945
13110C07945J74042a62359P0461c1271f925B05444p9036h6313j05859A40487f1682
$$ 307945 481987 -162359 -91898 -31271 -6925 205444 126408 -86313 -192172 140487 -61682
13098A16273a55945H8702B3046K13640E0575c45457G2434b72879C62574r1244
$$ 116273 -155945 88702 23046 236686 50575 -345457 72434 -272879 362574 271330
13088B71330q5496h9647C8090K8263c8609l0676m0535A45140B228J27769O7468
$$ 271330 185834 -89647 38090 66353 -38609 -69285 -109820 145140 2228 129997 197465
13077A97465M4434r6196o9020Q4811F328K02766E6151Q2818a10424B17163r9093
$$ 197465 241899 145703 76683 161494 6328 209094 56151 138969 -110424 217163 118070
13066A18070a2268C78146A22417J51300E9177A7313K24209q606n2727k0961j5111
$$ 118070 -12268 378146 122417 273717 59177 17313 241522 232916 180189 159228 144117
13055A44117L05395I8904P8347K62175D7657K55263C8810B852a031C82809G4919
$$ 144117 449512 98904 177251 439426 47657 302920 38810 2852 -1031 382809 74919
13043C40531c47519i6950D3478J61726P8113j00251E0776j6187J07615a6467C2057
$$ 340531 -347519 -96950 43478 205204 283317 183066 50776 34589 142204 -16467 32057
13031B58373r7618C2334M0244J21028J85600H1973A5374h1419B05509J900D8719
$$ 258373 160755 32334 72578 193606 379206 81973 15374 -81419 205509 207409 48719
13019F9993J01906d1990j12034B79619b41565D6408K90452j12792m667G5809K572
$$ 69993 171899 -41990 -154024 279619 -241565 46408 336860 224068 219401 75809 78381
13008G8381J59692b3964H6589K3426K06510C0993J8758J11333n6335J7974j8716
$$ 78381 238073 -23964 86589 110015 316525 30993 49751 161084 104749 122723 104007
12997A04007c00594J34836D90747a00306c0368C30572b50771C372K08692j9048
$$ 104007 -300594 -165758 490747 -100306 -30368 330572 -250771 3372 212064 193016
12987A93016K23135j4186j54716N567J06028G7518p056a09436L6294A83297p8652
$$ 193016 416151 401965 247249 252816 358844 77518 70462 -109436 -73142 183297 104645
12976A04645f2049A52569l0622J66169h0482A01834P5545a82821h9992B24884
$$ 104645 -62049 152569 121947 288116 -80482 101834 177379 -182821 -89992 224884
12965F3229J80559j19859a59638D3392M4596M45768A85792d006C2120a26283j49645
$$ 63229 243788 123929 -159638 43392 87988 533756 185792 -4006 32120 -126283 -275928
12954b75928A71455F9873h160C26445A10581a25360A55366b45672B27348b93455
$$ -275928 171455 69873 -8160 326445 110581 -125360 155366 -245672 227348 -293455
12943f5497E9633J44711d1226o3005A55922D8275K11996D5106a30615G2758h5827
$$ -65497 59633 204344 -41226 -104231 155922 48275 260271 45106 -130615 72758 -85827
12931h0607p4601O1951B60032b06329q0096B38622j08229e723H0974d3147A88212
$$ -80607 -155208 -93257 260032 -206329 -286425 238622 130393 -5723 80974 -43147 188212
12919A50186b63744C41502j283b9915B17946F9560O537b10901G2608l3977J39304
$$ 150186 -263744 341502 340219 -29915 217946 69560 76097 -210901 72608 38631 177935
12908A77935m6361a8442r1104C35258G2372c3434B10515J7961N9063G5091J18608
$$ 177935 131574 -18442 -109546 335258 72372 -33434 210515 228476 287539 75091 193699
12897A93699J84411A51205P5524C3596a80967D00581E6695a29367K0601K1581
$$ 193699 378110 151205 226729 33596 -180967 400581 56695 -129367 -108766 -87185
12887h7185A84566J31150a0211k3622j17975l412n7491A52087k1315J25771e0727
$$ -87185 184566 315716 -10211 -33833 -151808 -155220 -212711 152087 130772 256543 -50727
12875H6174a03262C25202n3778F1346P7615K12411j26656Q6060a91336K8348D5861
$$ 86174 -103262 325202 271424 61346 138961 351372 224716 310776 -191336 -162988 45861
12863b84819B87985D4162P2038k3922e9582r9842P0084B2105J46085b08105E39422
$$ -284819 287985 44162 116200 92278 -59582 -159424 -89340 22105 168190 -208105 539422
12851D4269J1953L1718m2824e8439n1027B8962J20728g7901B53450a35266B25623
$$ 44269 56222 87940 45116 -58439 -109466 28962 149690 -77901 253450 -135266 225623
12839a7969B56822a33991C0771L841J82388D2922P1983c4185A07862B6152Q900
$$ -17969 256822 -133991 30771 34612 217000 42922 114905 -34185 107862 26152 35052
12828C5052h8448F462J24811a10015k3040j44803I0925F204K19370r8963C7751
$$ 35052 -88448 6462 131273 -110015 -133055 -277858 90925 6204 225574 126611 37751
12816B73696J00631F6641N7998J10264a9748j22893B52236j7332m0640a04374
$$ 273696 374327 66641 124639 234903 -19748 -142641 252236 234904 194264 -104374
12805b0597A21338a22650c198m3925j20709B71016a66144B3154a35643f4490j21736
$$ -20597 121338 -122650 -3198 -47123 -167832 271016 -166144 23154 -135643 -64490 -186226
12794a86226I8117a62522J2311f6535G9577b20773P9181A74483a11962p3286q8923
$$ -186226 98117 -162522 -150211 -66535 79577 -220773 -141592 174483 -111962 -185248 -274171
12783b74171I7509g2803A70233A9366a34238F1383h5818j09124P6347K2862B40213
$$ -274171 97509 -72803 170233 19366 -134238 61383 -85818 -194942 -118595 -95733 240213
12771a68308b3882B72016j02355j7036b1705C2258a12256A30283g4329B4726L55151
$$ -168308 -23882 272016 169661 152625 -21705 32258 -112256 130283 -74329 24726 379877
12760C79877j64307f9658E8921a05391D4223c32974J48360q0831A91059q0317
$$ 379877 215570 -69658 58921 -105391 44223 -332974 -184614 -265445 191059 110742
12750A10742R4018G121a95067J6835Q1182B66419j14861a6647k34988A97293r6308
$$ 110742 204760 7121 -195067 -178232 -97050 266419 151558 -16647 -251635 197293 100985
12739A00985a69543M104F38582a44612j35221a31578c1307A83951M1537a70905
$$ 100985 -169543 -165439 638582 -144612 -279833 -131578 -31307 183951 225488 -170905
12728a95386B63768h6460F4057N0287J11167b09967C16741b95987a28063b0318
$$ -195386 263768 -86460 64057 114344 225511 -209967 316741 -295987 -128063 -20318
12717h278j28860d6074A66943a8084A97730J79000D9912J10391a75020C36781
$$ -8278 -137138 -46074 166943 -18084 197730 376730 49912 160303 -175020 336781
12706A43563a8685A79918p6049b3158B68795e4267B99538d0138l1467B16216C5069
$$ 143563 -18685 179918 103869 -23158 268795 -54267 299538 -40138 -71605 216216 35069
12694a60682R295B49022C1823d50374C1899h3616B20395J18251a21613a5782B73775
$$ -160682 -151387 249022 31823 -450374 31899 -83616 220395 338646 -121613 -15782 273775
12682h6588A74987f1003B11295q3363F702J08972M53089a47332D57787D7804J03524
$$ -86588 174987 -61003 211295 127932 6702 115674 568763 -147332 457787 47804 151328
12671A51328J88033d2887A60808m1422f8438C7398R5810M1498F2330a9193A95768
$$ 151328 339361 -42887 160808 119386 -68438 37398 133208 174706 62330 -19193 195768
12659A67005B5813J23217Q742K24574j90014a5530A96817G4576i8058A27875b1448
$$ 167005 25813 149030 157772 382346 192332 -15530 196817 74576 -98058 127875 -21448
12647b25925A6898b2053H4053J31113b98574J28400D5115K8704b31252G9532l7615
$$ -225925 16898 -22053 84053 215166 -298574 -170174 45115 73819 -231252 79532 41917
12636D1917b43016e6994b5780C70204p6266h9541C18116q7509n0174Q4265r6321
$$ 41917 -243016 -56994 -25780 370204 293938 -89541 318116 230607 180433 264698 168377
12625A68377L7429b0926B0204a497A90888G1892a01017q1919A29969Q637e686
$$ 168377 205806 -20926 20204 -1497 190888 71892 -101017 -182936 129969 138606 -5686
12613A42807a94030e8356b244A12414a01738H0339J05171b5460a0762E2151K8683
$$ 142807 -194030 -58356 -2244 112414 -101738 80339 185510 -25460 -10762 52151 80834
12602H0834L21362H6117l9091K3687n47p120M1496a37749A82262e4474B79295
$$ 80834 402196 86117 47026 70713 70166 63046 104542 -137749 182262 -54474 279295
12590a23702j09580i0621l125b1330j48072G5780l2152b32389Q5059F5200J0882
$$ -123702 -233282 -90621 -93746 -21330 -169402 75780 43628 -232389 -147330 65200 76082
12579G6082J85170A01585l9607j3435a29204I3639D3513e5085A2419J27506a20783
$$ 76082 261252 101585 61978 48543 -129204 93639 43513 -55085 12419 139925 -120783
12567C6247d53643a46239D36678g3674A02095o099K24830a03977i386C31664g3318
$$ 36247 -453643 -146239 436678 -73674 102095 95996 320826 -103977 -9386 331664 -73318
12555B02938o6443a97243D9914a64680B03542F6704K4586A2849N6267N3728R1629
$$ 202938 136495 -197243 49914 -164680 203542 66704 91290 12849 69116 122844 214473
12544B14473a10959B49503C7145K17535A21128D4953K02279g7336E1690L8144
$$ 214473 -110959 249503 37145 254680 121128 44953 247232 -77336 51690 89834
12534H9834Q165Q7710b2277k2974A30605g943C36728A0021L9600f4921F375i2392
$$ 89834 97999 185709 -22277 -45251 130605 -7943 336728 10021 49621 -64921 6375 -92392
12521a43169A11609i2579j40138j3594e5910J1983A01682C2056J0351K3495a13274
$$ -143169 111609 -92579 -232717 -246311 -55910 -43927 101682 32056 42407 65902 -113274
12509I7017O3678J38391a45307a8968B8204a09142d9080A14472d29336f0315A34608
$$ 97017 160695 299086 -145307 -18968 28204 -109142 -49080 114472 -429336 -60315 134608
12497E5523J35082G557c23982J55611A09981A4344a33819a2034q7266d1930A28028
$$ 55523 190605 7557 -323982 -168371 109981 14344 -133819 -12034 -99300 -41930 128028
12485b42552D6586J68319H7809J0316P9696b03907b381G5053b77670q0638g9808
$$ -242552 46586 214905 87809 98125 177821 -203907 -2381 75053 -277670 -358308 -79808
12473g8647A95233g7206k30198B1475b80260B85P121J05362D9645b37401a5344
$$ -78647 195233 -77206 -307404 21475 -280260 285 7406 112768 49645 -237401 -15344
12461a04043k77495a83644M4376N5820j1434B40220B1579a81801B39021J45628
$$ -104043 -381538 -183644 -139268 -83448 -94882 240220 21579 -181801 239021 384649
12451C84649c12930G6557b88557A81125J05747a95967f4454A7028K49427a15868
$$ 384649 -312930 76557 -288557 181125 286872 -195967 -64454 17028 266455 -115868
12440B41090F0381d7880j46804j82925g853k04248a01455I8827J12537I9248A7273
$$ 241090 60381 -47880 -194684 -377609 -7853 -212101 -101455 98827 211364 99248 17273
12428b53151d7087k61832e460o18k7745a6003c178A49987a80293E2723M5560c5183
$$ -253151 -47087 -308919 -5460 -6078 -33823 -16003 -3178 149987 -180293 52723 98283 -35183
12415b04743a1948j29846B74851F7054j9118A1322g9034j4342B56032H2017j6841
$$ -204743 -11948 -141794 274851 67054 47936 11322 -79034 -93376 256032 82017 65176
12404F5176d3182B83299a4161m8640G308b6024A37341J69514e9510A78612b95197
$$ 65176 -43182 283299 -14161 -62801 7308 -26024 137341 306855 -59510 178612 -295197
12392H6301J00396a26369M3006k9690B5474a57730p653N7973A13253n396J65012
$$ 86301 186697 -126369 -83363 -113053 25474 -157730 -165383 -107410 113253 107857 272869
12381B72869a86316H7311a96463O6539d1481r7156p3700H7547J09103a32935j78359
$$ 272869 -186316 87311 -196463 -129924 -41481 -138637 -212337 87547 196650 -132935 -311294
12370c11294b4625k12662i324H9804N1220K0067o9646J68635b95612J10986c9512
$$ -311294 -24625 -237287 -9324 89804 141024 161091 91445 260080 -295612 -184626 -39512
12358c04316e924A8363g6662D9988i3580C07022f6159A30359c0591j22973D6023
$$ -304316 -5924 18363 -76662 49988 -93580 307022 -66159 130359 -30591 -153564 46023
12346h4159I7607a26124A42430j2562a34304q7115F4337e6466C58685g1575A70519
$$ -84159 97607 -126124 142430 129868 -134304 -221419 64337 -56466 358685 -71575 170519
12334c90400A67718B0803J84761A0707L2231g7855C56654E902g4509k49902C52096
$$ -390400 167718 20803 205564 10707 42938 -77855 356654 5902 -74509 -324411 352096
12322f6818A89746d09852A86926J44267d3679A85793a03470D0735b03349B60942
$$ -66818 189746 -409852 186926 331193 -43679 185793 -103470 40735 -203349 260942
12311A62140L36126d7099j66531i3341A65566D7884L5753a33472h292j42262c6742
$$ 162140 498266 -47099 -213630 -93341 165566 47884 83637 -133472 -8292 -150554 -36742
12299D91453c4274B20265a53651F1962f4900E9348O0836C7943J24573C7748K64579
$$ 491453 -34274 220265 -153651 61962 -64900 59348 120184 37943 162516 37748 302327
12288C02327d968n8822m6701A437a52832A22966k9724R1318G9450a88840C58893
$$ 302327 -4968 -63790 -110491 1437 -152832 122966 93242 184560 79450 -188840 358893
12276G0944R3900J56806j42589a953A0709K1999M1367K42182c8943A95162a13344
$$ 70944 164844 321650 179061 -1953 10709 32708 74075 316257 -38943 195162 -113344
12264A91968a4318B84913H0643a76379P9264Q042B80701C9490O7672Q8116b17934
$$ 191968 -14318 284913 80643 -176379 -97115 -89073 280701 39490 107162 195278 -217934
12252C6722K51906d3778a2168k3986A42916b19917j09071E92631A60790K6478
$$ 36722 288628 -43778 -12168 -36154 142916 -219917 -328988 592631 160790 187268
12242A87268J54157g0889r650B24774p7578J0984N05464F1165J05155K23427n9093
$$ 187268 341425 -70889 -80539 224774 147196 158180 663644 61165 166320 389747 330654
12231C30654b17243E5259g4005B050J84975L1388P5601k126F6295h2113B30687
$$ 330654 -217243 55259 -74005 2050 187025 218413 294014 291888 66295 -82113 230687
12219B27821i5647D63655j74120j35330B1490M59280p2353e4966K0460A16188
$$ 227821 -95647 463655 289535 154205 21490 480770 408417 -54966 -34506 116188
12208A44136a57295q8749B22507J1759a21262c9420B71062p9839J5125b53795
$$ 144136 -157295 -246044 222507 234266 -121262 -39420 271062 191223 206348 -253795
12197B00751K8548l4833Q6633K81188B33902P1449P2471P4094g4231A5747K16685
$$ 200751 229299 194466 281099 562287 233902 305351 377822 451916 -74231 15747 232432
12186B32432B1616h3440A32884J32437A10630l1657b22871D31346B1540L37498
$$ 232432 21616 -83440 132884 265321 110630 78973 -222871 431346 21540 359038
12176C59038j24854a03049k0796a2447B1351a638E8763J73150j01235Q8583L0920
$$ 359038 234184 -103049 -123845 -12447 21351 -1638 58763 231913 130678 219261 250181
12165B50181a35782j9979B17998a12948I0810m0136L5053Q5769a13586q3657M4331
$$ 250181 -135782 -155761 217998 -112948 90810 50674 85727 171496 -113586 -197243 -152912
12154a52912A96382a09026A05611D524O6898h2797D1534L8568a87617f9760C24634
$$ -152912 196382 -109026 105611 4524 71422 -82797 41534 80102 -187617 -69760 324634
12142a78928A14748B1596A0009c0744E2552b85042J06754L297B63771A490J67070
$$ -178928 114748 21596 10009 -30744 52552 -285042 -178288 -174991 263771 1490 168560
12131A68560a12019C27812A27796J33955J24399j11928c25179J41517A37326b22558
$$ 168560 -112019 327812 127796 261751 386150 274222 -325179 -183662 137326 -222558
12120C40774a22220I8423a25911M0144A2652f548A47174m0943J49705a21997G7905
$$ 340774 -122220 98423 -125911 -85767 12652 -6548 147174 106231 255936 -121997 77905
12108B76630i9914R072l5353C29846q0798c38797E6583a7043r0020q0276d1229
$$ 276630 -99914 -90842 -126195 329846 249048 -338797 56583 -17043 -107063 -187339 -41229
12096b01652D08359a67549a3546B68944f8053J7286F662K21b0495k0007A24998
$$ -201652 408359 -167549 -13546 268944 -68053 -50767 6662 6883 -20495 -40502 124998
12084b9605B94019a12670A60884E900J52600c02888f379F77549L98171P68023
$$ -29605 294019 -112670 160884 5900 158500 -302888 -6379 677549 1075720 1843743
12074A843743E34168B66050A32081o4337c402k7527F2775L949H643a88043J4861
$$ 1843743 534168 266050 132081 67744 -3402 -30929 62775 66724 8643 -188043 -173182
12063a73182H8081P2671a22603B83934a50601D7716L62916a71858A84007R8035
$$ -173182 88081 160752 -122603 283934 -150601 47716 410632 -171858 184007 282042
12053B82042c081j74458G7312J80663N945i1726c4410A17422j8507k2714C7472
$$ 282042 -3081 -177539 77312 257975 263920 -91726 -34410 117422 98915 76201 37472
12041b0729C88727b9190j6574p6676f0059B5348K37640c56112R5046h4444j93563
$$ -20729 388727 -29190 -45764 -122440 -60059 25348 262988 -356112 -261066 -84444 -278007
12030b78007O4660i9506B00274a6037j86393B4670i9165d7544l42288A05041a79261
$$ -278007 -213347 -99506 200274 -16037 -202430 24670 -99165 -47544 -389832 105041 -179261
12018A95764E7502A3651N9221K74151b17942B93943D9116J4388f0791H569N156
$$ 195764 57502 13651 72872 347023 -217942 293943 49116 63504 -60791 8569 13725
12007A3725b55100A71950a03695o7558A0156R3487i689j55964k7509Q7631A57534
$$ 13725 -255100 171950 -103695 -171253 10156 103643 -9689 -165653 -193162 -105531 157534
11995C72959b0869a913B86108D3588J73872o3102h217l69279e9614k80062A82033
$$ 372959 -20869 -1913 286108 43588 217460 154358 -8217 -377496 -59614 -339676 182033
11983B66154A31880F0622j3727A9725L2761R5411a24361K3289A82691e45505A17161
$$ 266154 131880 60622 46895 19725 52486 147897 -124361 -101072 182691 -545505 117161
11971G4178L5625a29266l3240c8207J042J3233B98683j08327a8067I2731b30669
$$ 74178 109803 -129266 -162506 -38207 -37165 -23932 298683 190356 -18067 92731 -230669
11959b41717L8591k34901f4834B3549K82167F4837b03263J1393A96456d4295C2591
$$ -241717 -203126 -438027 -64834 23549 305716 64837 -203263 -191870 196456 -44295 32591
11947a06513d4832D6948b81521C0502L0187R1725A8547K1149b5552q8659N4297
$$ -106513 -44832 46948 -281521 30502 60689 152414 18547 39696 -25552 -114211 -59914
11936e9914D36354a09606n2859f1911K6209B0070J49129B8503h0315k46373J24520
$$ -59914 436354 -109606 -162465 -61911 -35702 20070 169199 28503 -80315 -326688 -202168
11925b02168k7543A9894G661a9410r0045A3814J97144c58954a60260j36355j05940
$$ -202168 -229711 19894 7661 -19410 -109455 13814 210958 -358954 -160260 -296615 -402555
11914d02555G2996b57071B03322P2570a43756H895K52353a06026M8992j02306
$$ -402555 72996 -257071 203322 275892 -143756 8895 261248 -106026 -57034 -159340
11904a59340j54030B1418Q8507b81195A53597N5434q8088c3330j48378j32478
$$ -159340 -313370 21418 109925 -281195 153597 209031 120943 -33330 -181708 -314186
11894c14186H2570Q6736b05707a3975j68408a5515B19492r0242e7591C22841d6728
$$ -314186 82570 169306 -205707 -13975 -182383 -15515 219492 129250 -57591 322841 -46728
11882a67006D00430g0162D1876a21563A14598E2245a64527d0323B22831i5310
$$ -167006 400430 -70162 41876 -121563 114598 52245 -164527 -40323 222831 -95310
11871b9032A86797i3518D2565h7647l2898a1209j27941j11860J17904F875M2008
$$ -29032 186797 -93518 42565 -87647 -120545 -11209 -139150 -251010 -133106 6875 48883
11860D8883J96357a92928A4529n377K7509g1658A62063e3474q699j35126k51922
$$ 48883 245240 -192928 14529 9152 36661 -71658 162063 -53474 -62173 -197299 -449221
11849d49221F5527a70504E5115a98094D9047i1090L1223j20479q0940F147e2571
$$ -449221 65527 -170504 55115 -198094 49047 -91090 -59867 -180346 -261286 6147 -52571
11837b36817K7949f8627A24299n4195d1200j94696D0838K0986a35368j08093B47352
$$ -236817 -208868 -68627 124299 70104 -41200 -235896 40838 61824 -135368 -243461 247352
11825b10711C02023a27804A18108a69729A23171h5345A50219a39315B70138b5521
$$ -210711 302023 -127804 118108 -169729 123171 -85345 150219 -139315 270138 -25521
11814a62071O4871D1885Q9516i7485B01392c68315a28732e6284A49000g6037E8194
$$ -162071 -97200 41885 131401 -97485 201392 -368315 -128732 -56284 149000 -76037 58194
11802c02859E0570a35991A41687c14367B8028J24578a80825H8888b71897B15894
$$ -302859 50570 -135991 141687 -314367 28028 152606 -180825 88888 -271897 215894
11791a72789M5015r0388b0864j73312C1154a32192A73823b49081B65330a43525
$$ -172789 -127774 -218162 -20864 -194176 31154 -132192 173823 -249081 265330 -143525
11780A7181O0153l6177A1094J76034k1864m3976a14261j4831A18916m2968P5912
$$ 17181 77334 41157 11094 187128 165264 121288 -114261 -129092 118916 75948 151860
11769A51860E2109M53065c94787J29309O963A07801K71092j46073c52795h33A7521
$$ 151860 52109 505174 -394787 -265478 -258515 107801 378893 232820 -352795 -833 17521
11757a20117B7576i9710E184a79027j75984J71451J3598C2172J48155p210e4370
$$ -120117 27576 -99710 5184 -179027 -355011 -183560 -169962 32172 180327 173117 -54370
11745g8378j12394j97971g2335F4111R6195d13000a57913D7695N791k6260A420
$$ -78378 -190772 -388743 -72335 64111 160306 -413000 -157913 47695 53486 27226 1420
11733a47145B26406a81101e8447G0254b59633F8710d2362B7517J13552J29439
$$ -147145 226406 -181101 -58447 70254 -259633 68710 -42362 27517 141069 270508
11723B70508G1183K05571d4005l29389a61393E6187c3046B071a8776A33549d0953
$$ 270508 71183 276754 -44005 -373394 -161393 56187 -33046 2071 -18776 133549 -40953
11711A84624N5042j18412b31040B03036D5196L3791L34117a87538G8098l7860
$$ 184624 239666 121254 -231040 203036 45196 78987 413104 -187538 78098 40238
11701D0238R855a30712H9309O2831a78883D3784h7426j42012j40565D71019j95733
$$ 40238 50093 -130712 89309 152140 -178883 43784 -87426 -229438 -370003 471019 275286
11690B75286g3921A01649c0304j10236j289b1945G232h6242B34734J4131N3946
$$ 275286 -73921 101649 -30304 -140540 -141829 -21945 7232 -86242 234734 248865 302811
11679C02811J1392a7666A62832f4406j503D48315B386a02838b5189r0999H5065
$$ 302811 314203 -17666 162832 -64406 -65909 448315 2386 -102838 -25189 -116188 85065
11667h8106A47381D3432b11765B4015b88A59699i5858a2558B07511C4193K19992
$$ -88106 147381 43432 -211765 24015 -288 159699 -95858 -12558 207511 34193 254185
11656B54185j04813k4164a83181C70826c8154l9860L4197E7331a48893m08483
$$ 254185 149372 125208 -183181 370826 -38154 -78014 -43817 57331 -148893 -557376
11646e57376Q1379J78084f8198k08789A18570c12944I275L24474F2467K65273
$$ -557376 -475997 -297913 -68198 -276987 118570 -312944 9275 333749 62467 327740
11636C27740c40738d2531p1038B58367A14721c74232B22789P2630C8171N2418
$$ 327740 -340738 -42531 -113569 258367 114721 -374232 222789 295419 38171 90589
11626I0589K51658l3551N3641j68600p6921k6890c2287C11438A43823g2868A77256
$$ 90589 342247 308696 362337 193737 116816 89926 -32287 311438 143823 -72868 177256
11614h5414A9438J65178a52933o4663A21464J0993e03326A77971b0679A15140
$$ -85414 19438 184616 -152933 -217596 121464 132457 -503326 177971 -20679 115140
11603a90056i1998A61348k823O9393d9497A86704G6707B4033n9J80091o7252J46774
$$ -190056 -91998 161348 158525 227918 -49497 186704 76707 24033 23974 204065 136813 283587
11591B83587M6002G7418J33310a28093D9327B4385J92819i8270C44824B4382K01832
$$ 283587 329589 77418 210728 -128093 49327 24385 217204 -98270 344824 24382 226214
11580B26214K9311D5506a07364B2371a16469M0082q1500B20702C3693P6558J60812
$$ 226214 255525 45506 -107364 22371 -116469 -76387 -157887 220702 33693 110251 271063
11569B71063a48843l3638B99583H2447J34335J5363A01675D1642a11665B73984
$$ 271063 -148843 -182481 299583 82447 216782 232145 101675 41642 -111665 273984
11558I58J15397J73512n9048H2700J65622N5596j40697J05711l5112b98583J40833
$$ 958 116355 289867 230819 82700 248322 303918 163221 268932 233820 -298583 -157750
11547a57750C34199j18209o2269a6479G4549J18691J87640f5224B38973G0753
$$ -157750 334199 215990 153721 -16479 74549 193240 380880 -65224 238973 70753
11536A18135P9346n6929J03283i3158A86328B0655M09a05183k9285D31525k02662
$$ 118135 197481 140552 243835 -93158 186328 20655 21064 -105183 -134468 431525 228863
11525B28863C7602J86341a80266r8453A82078L870c8859F2424B1403K08189j10773
$$ 228863 37602 223943 -180266 -278719 182078 185948 -38859 62424 21403 229592 118819
11514A18819a09107C11147l9324J95615I836e198A46013e9205D93610A84698h9888
$$ 118819 -109107 311147 271823 467438 9836 -5198 146013 -59205 493610 184698 -89888
11502C90450j74182J5002i3773j1024r9650J4729D34446A7300J23516L33093A1083
$$ 390450 216268 231270 -93773 -104797 -204447 -189718 434446 17300 140816 473909 11083
11490A56117c17216a7860p8885B38867c1783B97612q2335q9574K23052j67200
$$ 156117 -317216 -17860 -96745 238867 -31783 297612 215277 125703 348755 181555
11480A81555N0288h0542j61808A50475i7984k18024a43976L0633M0563A62745
$$ 181555 231843 -80542 -242350 150475 -97984 -316008 -143976 -113343 -72780 162745
11469a14669C62493F0018J0068P3008L69J01429a28177A48286h4206k4766a7941
$$ -114669 362493 60018 70086 143094 143463 244892 -128177 148286 -84206 -108972 -17941
11457F5578a14250A54385o231p386n5681c68167A97271b11452q055A61687a48143
$$ 65578 -114250 154385 148154 140768 85087 -368167 197271 -211452 -219507 161687 -148143
11445A60445B9627b37551A44614i8555G3499L1037R3772M1406b37845b1328B98955
$$ 160445 29627 -237551 144614 -98555 73499 104536 198308 239714 -237845 -21328 298955
11433C40055i7943G6190a24983C44988a3453m9463j36904B55159e0679j46888
$$ 340055 -97943 76190 -124983 344988 -13453 -62916 -199820 255159 -50679 -197567
11423a97567Q1380C9033b6774p8684A55839h2237C18281e8166A0772R0803b78630
$$ -197567 -116187 39033 -26774 -105458 155839 -82237 318281 -58166 10772 101575 -278630
11411B93448A24000J27308b77829D50266b50105Q598E3745O499a29255d4157b1716
$$ 293448 124000 251308 -277829 450266 -250105 -241507 53745 60244 -129255 -44157 -21716
11399B9715d26193a05749G6828b43455R5184D0888Q7707a9468p250l6369r519
$$ 29715 -426193 -105749 76828 -243455 -148271 40888 128595 -19468 -26718 -63087 -72606
11388g2606k0802a8863m06997d0032A5080b96602A54261B90d8537j58003A43517
$$ -72606 -93408 -18863 -425860 -40032 15080 -296602 154261 290 -48537 -206540 143517
11376H0301g4602L6685B02242c6772k7116H108K0959b26219b7002B12755D9820
$$ 80301 -74602 -37917 202242 -36772 -63888 8108 29067 -226219 -27002 212755 49820
11364a28138j04549J06223j43854l2765C16392c2676j15670E4498e52072a7605
$$ -128138 -232687 -126464 -270318 -303083 316392 -32676 -148346 54498 -552072 -17605
11353F0474J1214k9378e1556I5994O0927m8153j5124K62537b43303H2751e8704
$$ 60474 71688 42310 -51556 95994 156921 108768 93644 356181 -243303 82751 -58704
11341E2507c84523b9358E58514k68311H5002a1701A24139a22420q1711A57394
$$ 52507 -384523 -29358 558514 290203 85002 -11701 124139 -122420 -204131 157394
11330e647A53290a60027A04540D8843a73773a024j16608A71258i8454A44090L205
$$ -5647 153290 -160027 104540 48843 -173773 -1024 -117632 171258 -98454 144090 147295
11319A47295a90216k6374A23160D2888K3180b10693f3815j62941A16408d64913
$$ 147295 -190216 -216590 123160 42888 66068 -210693 -63815 -226756 116408 -464913
11308b88425E1511P1403b91829A51354E9409a21004H0322C304a5033j73606C4086
$$ -288425 51511 122914 -291829 151354 59409 -121004 80322 3304 -15033 -188639 34086
11296B16063a4281p135G3640P4012a66809E0252g0035H6291J57730a44690j06150
$$ 216063 -14281 -21416 73640 147652 -166809 50252 -70035 86291 244021 -144690 -250840
11285b50840a7475j07444n9360d5745q3250j34959F8017k7985J12369n2106c41646
$$ -250840 -17475 -124919 -184279 -45745 -128995 -263954 68017 40032 152401 100295 -341646
11273A56914b26325B42956a3368A13402c8937k39516h4249j22601A83377j0632
$$ 156914 -226325 242956 -13368 113402 -38937 -278453 -84249 -206850 183377 172745
11263A72745J5339b0263l56781E8705b35297B60620q3258G4009d64106d6315B422
$$ 172745 188084 -20263 -377044 58705 -235297 260620 177362 74009 -464106 -46315 2422
11251B65389R4275a18750N8527G5619e7530E7871i8026m5891D46044b49671D77581
$$ 265389 359664 -118750 -60223 75619 -57530 57871 -98026 -143917 446044 -249671 477581
11239A63902n0076b80025G4505B120f0476n6291A38885J14030A03595m5065R9250
$$ 163902 113826 -280025 74505 2120 -60476 -116767 138885 252915 103595 58530 157780
11228A57780E0275K95188c6428j32801j34813O0546C0006a13923l7616k6469D8961
$$ 157780 50275 345463 -36428 -169229 -304042 -243496 30006 -113923 -151539 -178008 48961
11216A84920c54314a905k94967Q3076a05942H1335b65886a3036C0713d6159k85065
$$ 184920 -354314 -1905 -296872 -213796 -105942 81335 -265886 -13036 30713 -46159 -331224
11205c31224G0031R1849d9599E046a62785A48248e1011n6666A74404e2619j44939
$$ -331224 70031 161880 -49599 5046 -162785 148248 -51011 -107677 174404 -52619 -197558
11194a97558O3249A526J08497A016R5353a6370n5740r9085C73434c68708F5281
$$ -197558 -134309 1526 110023 1016 96369 -16370 -72110 -171195 373434 -368708 65281
11182f1604m74088d1096E4762R4711g5967q4768I9440c08321J47283E4950K19839
$$ -61604 -535692 -41096 54762 149473 -75967 -160735 99440 -308321 -161038 54950 274789
11171B74789a56920E1688f4087J3593B049h4916l0032M6607q4631A24102J13245
$$ 274789 -156920 51688 -64087 -50494 2049 -84916 -114948 -68341 -152972 124102 237347
11160B37347I9197b16859j1789N5059j79273C26968D61a79523A28054a35882k66452
$$ 237347 99197 -216859 -228648 -173589 -352862 326968 461 -179523 128054 -135882 -402334
11149d02334C3073d32340a13351n2098A63379p8612b55823H646J23981A8309K21311
$$ -402334 33073 -432340 -113351 -165449 163379 84767 -255823 8646 132627 18309 239620
11138B39620a18320p6590b0493B9877e2123a000B30975A08432e0429B1979c00364
$$ 239620 -118320 -194910 -20493 29877 -52123 -1000 230975 108432 -50429 21979 -300364
11126A85961b93387A33074a11391e5268F9606h5242C35678F6483i005C5063K59723
$$ 185961 -293387 133074 -111391 -55268 69606 -85242 335678 66483 -9005 35063 294786
11115B94786g2870A30685J17289E7188A2461M53398c1727B68042J12128a70253
$$ 294786 -72870 130685 247974 57188 12461 465859 -31727 268042 380170 -170253
11104A26764R4481r0930n8952J70171H5247L01437a53773B23975j5030I1559J13726
$$ 126764 221245 130315 71363 241534 85247 386684 -153773 223975 208945 91559 205285
11093B05285N8112b6959C32956D7613J69129A7095J24833N4513o6048J64838A11305
$$ 205285 263397 -26959 332956 47613 216742 17095 141928 196441 130393 295231 111305
11081C92846a48694C93232M6670D9672J33274l2942J27870A13861J81778J63593
$$ 392846 -148694 393232 439902 49672 182946 150004 277874 113861 295639 459232
11071D59232j31414K54587k8304B04092c5955C03703L11487k76460J35514N1747
$$ 459232 327818 582405 554101 204092 -35955 303703 615190 338730 474244 525991
11061E25991p0975l1192j92835N81781j93883K58793C61295K37919L69882m07087
$$ 525991 455016 423824 230989 812770 618887 877680 361295 599214 969096 562009
11051E62009R8895Q8363n5369p594k11890J91074P9469P7811q4417l21257L80269
$$ 562009 660904 749267 693898 686304 474414 665488 744957 822768 738351 417094 797363
11040G97363L26673m54205K60595j82236J19356J22783l35269j71749L9058K11023
$$ 797363 1124036 669831 930426 748190 867546 990329 655060 483311 522369 733392
11030G33392K25221k56476J58509J50272m96430K17570N1343k63927L76915k01597
$$ 733392 958613 702137 860646 1010918 514488 732058 783401 519474 896389 694792
11020F94792k58855J98369j06514J91136j26346o3937P481K5336J49226m5067
$$ 694792 435937 634306 527792 718928 592582 528645 536126 561462 710688 665621
11010F65621j1683k5984K06213j82224K54066j67290q4716q3097J09829B81589
$$ 665621 653938 627954 834167 651943 906009 738719 654003 570906 680735 281589
10999G36224m6314k65027l8738M94986o7710C80298K17507M3451K00787l99501
$$ 736224 689910 424883 386145 881131 813421 380298 597805 641256 842043 442542
10989D42542J33521R3477L39645k50894K01273J3560N4628K5746J1008M5803K84643
$$ 442542 576063 669540 1009185 758291 959564 973124 1027752 1053498 1064506 1110309 1394952
10978A394952j92298L04294L88619L2439N36398J20103j03745O32983l86007k2383
$$ 1394952 1202654 1506948 1895567 1928006 2464404 2584507 2480762 3113745 2727738 2705355
10968B705355L93905o39382l52619k62982K18900m22761L70807m62191n9618Q9577
$$ 2705355 3099260 2459878 2107259 1844277 2063177 1640416 2011223 1549032 1489414 1578991
10958A578991k46092L23263Q1438j85882K29107l30483k08793q8124o9380k11106
$$ 1578991 1332899 1656162 1737600 1551718 1780825 1450342 1241549 1153425 1084045 872939
10948H72939j67903k52492N1246H7671J73259B2027J01639K79880A13419J14258
$$ 872939 705036 452544 503790 87671 260930 22027 123666 403546 113419 227677
10938B27677j01942e5299B74079a69439A68409P6792j9830F6191J12978L1346
$$ 227677 125735 -55299 274079 -169439 168409 245201 225371 66191 179169 210515
10928B10515E5520L54438B1689K58779E965K31669q8409g2321j16951D16967g3830
$$ 210515 55520 409958 21689 280468 5965 237634 149225 -72321 -189272 416967 -73830
10916B19780a47958k56903c4594i725B52451G8991J12406q0193g2688m42157a0558
$$ 219780 -147958 -404861 -34594 -9725 252451 78991 191397 111204 -72688 -514845 -10558
10904d36018A48127a2690m078j44474B54731A8484J04939J7877h8493K78k84232
$$ -436018 148127 -12690 -16768 -161242 254731 18484 123423 141300 -88493 -88215 -372447
10893c72447I835K3790b82917A20961j4260J2777a56874E7044a28972c3649q2483
$$ -372447 9835 33625 -282917 120961 106701 119478 -156874 57044 -128972 -33649 -116132
10882a16132A15497G139a77151b5861A69383f3762k49918I1721N0599c09838f6658
$$ -116132 115497 7139 -177151 -25861 169383 -63762 -313680 91721 142320 -309838 -66658
10870e4445B371J58486a50109J7461k872M1244B27839d7866D2916d2068H0630
$$ -54445 2371 160857 -150109 -132648 -135520 -94276 227839 -47866 42916 -42068 80630
10858B07929B5977Q7397a62848a1845j66893C38869b53796a15307j31311h9404
$$ 207929 25977 113374 -162848 -11845 -178738 338869 -253796 -115307 -246618 -89404
10847f1424A99149K0686j06749J76795a84320A28116a33751j18250B11999n3808
$$ -61424 199149 219835 113086 289881 -184320 128116 -133751 -252001 211999 158191
10837A58191O5405c32468b1387C2947a71710j67622H2858J06269K446b74783B59468
$$ 158191 223596 -332468 -21387 32947 -171710 -339332 82858 189127 191573 -274783 259468
10825I0764R2576k7645b36533C24638a07805q636F2013A0724g3446C01287E6614
$$ 90764 183340 155695 -236533 324638 -107805 -116441 62013 10724 -73446 301287 56614
10813a09926E6004c40632N9156E4042K0219d18575e1899b3245k16083h2681j5914
$$ -109926 56004 -340632 -281476 54042 74261 -418575 -51899 -23245 -239328 -82681 -98595
10802i8595l6745l997B23152E3441O8070e94870A57072c1922k08177Q5046f4489
$$ -98595 -135340 -139337 223152 53441 121511 -594870 157072 -31922 -240099 -155053 -64489
10790b19939O3066B561K50694a86312b2558H5296N056B8869R156a74007C28174
$$ -219939 -156873 2561 253255 -186312 -22558 85296 90352 28869 38025 -174007 328174
10778B03254D4114i8600G666a29460B50172j24317d49961C03318O4383j55390
$$ 203254 44114 -98600 7666 -129460 250172 125855 -449961 303318 367701 212311
10768B12311K8807a79929C3326J6203b8584I913b8692l22970A1842b65533H9151
$$ 212311 241118 -179929 33326 49529 -28584 9913 -28692 -351662 11842 -265533 89151
10756a36733B47836a23762B687K8765J9906c41962a38097B7689b24457A3674R1425
$$ -136733 247836 -123762 2687 31452 51358 -341962 -138097 27689 -224457 13674 105099
10745A05099a084G2786j6613B793a4311A40659a37542A38218d49461A20488D4565
$$ 105099 -1084 72786 56173 2793 -14311 140659 -137542 138218 -449461 120488 44565
10733g3787l67143I3492d2347l0234A09578b32284K5395l995o6765k359b7853
$$ -73787 -440930 93492 -42347 -72581 109578 -232284 -206889 -210884 -277649 -280008 -27853
10721A7725F105K5126a75043C6129Q1856b87225A0161c01849H0542a65374I9956
$$ 17725 6105 31231 -175043 36129 117985 -287225 10161 -301849 80542 -165374 99956
10709e6887B53072D5154e4067A55366a48488A42532F6596a11452k2678J0429N2768
$$ -56887 253072 45154 -54067 155366 -148488 142532 66596 -111452 -134130 -123701 -70933
10698g0933c331j58968o7320F02h4678A31195e8219j5960A47704b74350J15582
$$ -70933 -3331 -162299 -229619 602 -84678 131195 -58219 -74179 147704 -274350 -158768
10687a58768A48794B9061b65143A19659J2549i0741B82322B0951N3714K293J14918
$$ -158768 148794 29061 -265143 119659 132208 -90741 282322 20951 74665 76958 191876
10676A91876J01502a14338D25015a62586P2580k15108j2827R6656o542D87629
$$ 191876 293378 -114338 425015 -162586 -90006 -305114 -317941 -221285 -227827 487629
10665a33815j24824J7882a6956n1280R351D4595b35213d7939j4111G1167a52998
$$ -133815 -258639 -240757 -16956 -68236 -58885 44595 -235213 -47939 -62050 71167 -152998
10653B27186a30478a5304j41628I554b04743D1295a32202o0698A6220a12941H5422
$$ 227186 -130478 -15304 -156932 9554 -204743 41295 -132202 -192900 16220 -112941 85422
10641b7902j32699C06200a46430A8840Q0538h0675b8854k6519m7207I866J68770
$$ -27902 -160601 306200 -146430 18840 99378 -80675 -28854 -55373 -102580 9866 178636
10630A78636b97043A8012R6364K42254b1788j22572A14756c25646J10676f9620
$$ 178636 -297043 18012 114376 356630 -21788 -144360 114756 -325646 -214970 -69620
10619C43355j04170k596c7542J7033q1272a512A75R2743f8830P270j56638j63466
$$ 343355 239185 236589 -37542 -20509 -101781 -1512 175 92918 -68830 -61560 -218198 -381664
10607c81664B26351b43380A37275k273b74485A56058C4901i2631B6763J3015L05869
$$ -381664 226351 -243380 137275 135002 -274485 156058 34901 -92631 26763 39778 345647
10596C45647H4711a77847j96596A24294f6496K2899k92k96931d7997j07301A27855
$$ 345647 84711 -177847 -374443 124294 -66496 -43597 -43889 -340820 -47997 -155298 127855
10584d8279A83787F5191a86898k71244B10322a92627R358j57151A68968a68062
$$ -48279 183787 65191 -186898 -458142 210322 -192627 -183269 -340420 168968 -168062
10573f8529r8777A52072C5248c80102A41674M816g7223j20238b6773m26584B7747
$$ -68529 -167306 152072 35248 -380102 141674 146490 -77223 -197461 -26773 -453357 27747
10561A08892a69558l88652C3816e3306J5162j20760G2027J38823c38109b8541
$$ 108892 -169558 -558210 33816 -53306 -38144 -158904 72027 210850 -338109 -28541
10550b10738k32324A14551c50195N1531A00488j176h9449o750B00154B1300a60455
$$ -210738 -443062 114551 -350195 -298664 100488 99312 -89449 -96199 200154 21300 -160455
10538a18310j10865B2203a59900D0543a39302G8808l2615J04459p2139i8275j2867
$$ -118310 -229175 22203 -159900 40543 -139302 78808 46193 150652 78513 -98275 -111142
10527a11142A91309a91735I5449A5226M1464J50607a34736j54922b3255o7490
$$ -111142 191309 -191735 95449 15226 56690 207297 -134736 -289658 -23255 -90745
10517i0745B85562c7082m20050A11503a27049A00149N0759f9118B06145d3230
$$ -90745 285562 -37082 -457132 111503 -127049 100149 150908 -69118 206145 -43230
10506a52915p9716f5240k34847A43665k3153b64690B83503a24019N7375K2452
$$ -152915 -232631 -65240 -300087 143665 120512 -264690 283503 -124019 -66644 -44192
10496d4192B40833D6362b84495A14202Q373F107J10168i8708d5719j27904d8518
$$ -44192 240833 46362 -284495 114202 122575 6107 116275 -98708 -45719 -173623 -48518
10484B26701K8849f4975B82495K3023K63562k57086I5850M7631a36471p3785B7644
$$ 226701 255550 -64975 282495 305518 569080 311994 95850 143481 -136471 -210256 27644
10472C21078D8775m341N9109f0033b4052A19718c09046h6978j50985H0705N88
$$ 321078 48775 44434 103543 -60033 -24052 119718 -309046 -86978 -237963 80705 81293
10461H1293J4303b1981G5495n98m059b28698d8740J599A06427g6148j67970J4785
$$ 81293 95596 -21981 75495 74897 70838 -228698 -48740 -47141 106427 -76148 -244118 -229333
10449b29333e451k47851b9137n1491B3117b73757B09192b76327G6431O6822D2697
$$ -229333 -5451 -253302 -29137 -80628 23117 -273757 209192 -276327 76431 143253 42697
10437b78395H4535K06952a86548B78502h0247g074l9m42031D7767b64370b6349
$$ -278395 84535 291487 -186548 278502 -80247 -7074 -7113 -449144 47767 -264370 -26349
10425C7828a40591k38254E701g1868H6552b02781n3913A85121k0733a92235A19314
$$ 37828 -140591 -378845 5701 -71868 86552 -202781 -256694 185121 164388 -192235 119314
10413a40079n6809a1597A33677D6590N7884C354c06041E2223i375m2001j54266
$$ -140079 -196888 -11597 133677 46590 104474 3354 -306041 52223 -9375 -51376 -205642
10402b05642C8963a80741A40289a10619A15044M1687c03925B5536J70527b306
$$ -205642 38963 -180741 140289 -110619 115044 156731 -303925 25536 196063 -2306
10391B95136e5077k3730C42366E4357f8580C7620P2650J00279n9720G735J5685
$$ 295136 -55077 -78807 342366 54357 -68580 37620 110270 210549 150829 7735 23420
10380B3420L81451C285L05590O6253A51473O3571J24371I1534L91771A11960K73181
$$ 23420 404871 3285 308875 375128 151473 215044 339415 91534 483305 111960 385141
10369C85141J6126r3565P8982N321j10191L9594L0932j69208J35624j56458K84599
$$ 385141 401267 307702 386684 392005 281814 321408 352340 183132 318756 162298 446897
10358D46897K6325F2755K51128p751C8112K76999n9129K30256A24686J90764K17302
$$ 446897 473222 62755 313883 306132 38112 315111 255982 486238 124686 315450 532752
10347E32752k53051e7101C20108K8034K4476A3105N46642I6068h0600C0383K00424
$$ 532752 279701 -57101 320108 348142 372618 13105 559747 96068 -80600 30383 230807
10336B30807L60877C4059J31655i32j2600A08821A9057K4813J3648K1259K90448
$$ 230807 591684 34059 165714 -932 -13532 108821 19057 43870 57518 78777 369225
10325C69225Q4809A08210K39827L02718G9818e0889C28341k1029J33113A12097
$$ 369225 454034 108210 348037 650755 79818 -50889 328341 307312 440425 112097
10314B41259r4635R1267c67936D74998i0840K2386a7696p2827H1254i2503A2801
$$ 241259 146624 237891 -367936 474998 -90840 -68454 -17696 -90523 81254 -92503 12801
10302A44781i7467A61273l9407a16275H0382R6969a1643a573A78896N251d5824
$$ 144781 -97467 161273 121866 -116275 80382 177351 -11643 -1573 178896 184147 -45824
10290a06428A53355i2359B06444h3992b9680j70747g0843k28313A62412p2011
$$ -106428 153355 -92359 206444 -83992 -29680 -200427 -70843 -299156 162412 90401
10280I0401M1937a58652c9694l0835m6037j17496a1805j4757k17720B19456M0321
$$ 90401 132338 -158652 -39694 -70529 -116566 -234062 -11805 -26562 -244282 219456 259777
10269B59777i1321k3978b3086k10547d4939C46251b12276C17664o5888a29293
$$ 259777 -91321 -115299 -23086 -233633 -44939 346251 -212276 317664 251776 -129293
10258C00994L42044B35662O3183q1810a39620I8948r422l4420c5697m4334r879
$$ 300994 643038 235662 298845 217035 -139620 98948 89526 55106 -35697 -80031 -89910
10247h9910B17596b04790C65345I7924a42750C35948N1667a22747b3771A86055
$$ -89910 217596 -204790 365345 97924 -142750 335948 387615 -122747 -23771 186055
10236a88694A85175d3377n4484o5259Q609l0110c2689E0855c42239E4912A3621
$$ -188694 185175 -43377 -97861 -163120 -154511 -184621 -32689 50855 -342239 54912 13621
10224a68343f4414k15247A82435J252a57826j57002r360B09367E2571a80121J8500
$$ -168343 -64414 -279661 182435 183687 -157826 -314828 -324188 209367 52571 -180121 -161621
10213a61621B41212I7538a31817E4786L1747c07586j04751d2913k13685h3964
$$ -161621 241212 97538 -131817 54786 86533 -307586 -412337 -42913 -256598 -83964
10202H2257h5830r2050J5926e3247k24713p4687A2682E863a65400M3206G4561
$$ 82257 -85830 -177880 -161954 -53247 -277960 -352647 12682 5863 -165400 -122194 74561
10190a28330A22800a40540L6700j30106A25160f1153j53082b6447k12307G0160
$$ -128330 122800 -140540 -103840 -233946 125160 -61153 -214235 -26447 -238754 70160
10179i3471A48412a98397l4160Q7038j7499C2435M0166j3863a9251k38291A23974
$$ -93471 148412 -198397 -232557 -145519 -163018 32435 72601 58738 -19251 -257542 123974
10167F2669b05091H1216B2104M5736c78187B57326I6244k4094J8327a76997n290
$$ 62669 -205091 81216 22104 67840 -378187 257326 96244 72150 90477 -176997 -182287
10156a82287j266C03082a59097A04339R4739e3897n0969m21530K57060E041c2343
$$ -182287 -183553 303082 -159097 104339 199078 -53897 -104866 -526396 -269336 5041 -32343
10144A24776c6924k63824k687R8182A45315b13193j82799a42245J4249k37822
$$ 124776 -36924 -300748 -303435 -205253 145315 -213193 -395992 -142245 -127996 -365818
10134c65818J79154D819a28708m3712A4750d7717l78728B16749b52486c141C4363
$$ -365818 -186664 4819 -128708 -172420 14750 -47717 -426445 216749 -252486 -3141 34363
10122G3923a73740A10769J28275g4896o8881B3679b54413a5441M019j5610B0168
$$ 73923 -173740 110769 239044 -74896 -143777 23679 -254413 -15441 -11422 -27032 20168
10110A14409a22682c451C9367b87923g0582k37205a44390K0935b1997E2523M8660
$$ 114409 -122682 -3451 39367 -287923 -70582 -307787 -144390 -123455 -21997 52523 101183
10099A01183f5968j05211k78305a67856B50141H9637k3628b6471a0258m60203
$$ 101183 -65968 -171179 -449484 -167856 250141 89637 66009 -26471 -10258 -470461
10089d70461A10565i3976M1152n8883k1545C60548a20802k91659B15100b18534
$$ -470461 110565 -93976 -52824 -111707 -133252 360548 -120802 -412461 215100 -218534
10078a13152C4909J69750k2918e009B68219g6674k16732O0803A86966a45073J556
$$ -113152 34909 204659 181741 -5009 268219 -76674 -293406 -232603 186966 -145073 -143517
10067a43517j08460J17599j22496Q6488A6666l501c35730a8153E7366a84733B44664
$$ -143517 -251977 -134378 -256874 -170386 16666 13165 -335730 -18153 57366 -184733 244664
10055a71844p458G7995c4940l0838B70022h864A05259c8820a6777j28576F0704
$$ -171844 -179302 77995 -34940 -65778 270022 -8864 105259 -38820 -16777 -145353 60704
10043a8133p6686j29209C82c85703N0129C6528A4105K10293d3702B20844e0989
$$ -18133 -94819 -224028 382 -385703 -335574 36528 14105 224398 -43702 220844 -50989
10031a71134C8264a20794K2941a4031k03931a6904k19715B21264i4098A36815
$$ -171134 38264 -120794 -97853 -14031 -217962 -16904 -236619 221264 -94098 136815
10020a73602g3635C00322b49946F5835a18658j11907F0176b1142j04139A7016
$$ -173602 -73635 300322 -249946 65835 -118658 -230565 60176 -21142 -125281 17016
10009b16075l63316b44890e9077j41187B6276i5521m01625J10931b1892C9708
$$ -216075 -579391 -244890 -59077 -200264 26276 -95521 -497146 -386215 -21892 39708
9998g3688K7165j03414n2528j14710a43286C59330b78831q2275f7649I7432c66587
$$ -73688 -46523 -149937 -202465 -317175 -143286 359330 -278831 -361106 -67649 97432 -366587
9986b29029i0843B7951J5443g2996k05639J22320N1015C7841J82608e6762m04266
$$ -229029 -90843 27951 43394 -72996 -278635 -156315 -105300 37841 220449 -56762 -461028
9975d61028B13706a26387a5861l8038k27950e9412a9716A27139a26678A67660
$$ -461028 213706 -126387 -15861 -53899 -281849 -59412 -19716 127139 -126678 167660
9964I3224J10283a34099k1457B47241a19090k13694A82032a09135C83536e2053
$$ 93224 203507 -134099 -155556 247241 -119090 -332784 182032 -109135 383536 -52053
9953C6034i9039B38046j09689K60684a20335j14119A86539b26836q2435d4318
$$ 36034 -99039 238046 128357 389041 -120335 -234454 186539 -226836 -309271 -44318
9942c49227a02576r0849N0183j3289d8820k0049B35641b9250n657m8380m4104
$$ -349227 -102576 -193425 -143242 -156531 -48820 -68869 235641 -29250 -34907 -83287 -127391
9931a27391C1018h9942j6430k42257a60861B44757a7894j60973E8734M5633k9406
$$ -127391 31018 -89942 -106372 -348629 -160861 244757 -17894 -178867 58734 104367 74961
9920G4961j4005b88182q413f1515a9073C9371J05928D6275a43257A61050D586
$$ 74961 60956 -288182 -296595 -61515 -19073 39371 145299 46275 -143257 161050 4586
9908a43240C7096M7433g4824c6771d223k41568r5432a18898l50775a64788n478
$$ -143240 37096 84529 -74824 -36771 -4223 -245791 -341223 -118898 -469673 -164788 -170266
9897a70266l26237D7584a25438r2525A89158a38520j47839A70062a10679C11807
$$ -170266 -496503 47584 -125438 -217963 189158 -138520 -286359 170062 -110679 311807
9886B66683a00113o1273A61999J72620i7080B8548a47648k58187H8337J34155
$$ 266683 -100113 -161386 161999 334619 -97080 28548 -147648 -405835 88337 222492
9876B22492a81889j04727C1183d00916d3183o9306c8730E4478a83617K5548F1681
$$ 222492 -181889 -286616 31183 -400916 -43183 -112489 -38730 54478 -183617 -158069 61681
9864a7352B80891b3495j82681Q6620A67736a92546c8110I1666c61347G2806L7576
$$ -17352 280891 -23495 -206176 -119556 167736 -192546 -38110 91666 -361347 72806 110382
9853A10382C0783L7209k7598h7388j23560e2238r1373k49349Q498J68092O9600
$$ 110382 30783 67992 40394 -87388 -210948 -52238 -143611 -392960 -384462 -216370 -146770
9842a46770g0749D1677K0911c5737p2534j952L262a1448p6553J3776j02452G1037
$$ -146770 -70749 41677 62588 -35737 -108271 -110223 -106961 -11448 -88001 -74225 -176677 71037
9829a75591A11040a70548I2635K68517a83549C37956B5891a29064h815p1110C20754
$$ -175591 111040 -170548 92635 361152 -183549 337956 25891 -129064 -8815 -79925 320754
9817c90948n2639a06953J7753l67313E1528d01066A55501b11125L7424A84570
$$ -390948 -443587 -106953 -89200 -456513 51528 -401066 155501 -211125 -173701 184570
9806d08607A8588a2625j22659m13144e0486k95845d1329a3880j22223B25654I9916
$$ -408607 18588 -12625 -135284 -548428 -50486 -346331 -41329 -13880 -136103 225654 99916
9794g2704k28133J38685j19883B77341c55905D5492i5053I6161c96022a2810A68789
$$ -72704 -300837 -162152 -282035 277341 -355905 45492 -95053 96161 -396022 -12810 168789
9782a54373G3915c66019f9135I0506b50626B07049b710l54157J03329B66914a01378
$$ -154373 73915 -366019 -69135 90506 -250626 207049 -2710 -356867 -253538 266914 -101378
9770e9583k64470I1004e06785a15996r0057c5898D01591A85184b65359M4034B20863
$$ -59583 -324053 91004 -506785 -115996 -206053 -35898 401591 185184 -265359 -221325 220863
9758a06131M1628j10673A5881a84705O0069L115M9944P326b8632A02963a76140
$$ -106131 -64503 -175176 15881 -184705 -124636 -121521 -71577 -64251 -28632 102963 -176140
9746A95310g4992m1993j89914Q6851C45867a5250k37124D2972Q2139k0248b86310
$$ 195310 -74992 -116985 -306899 -220048 345867 -15250 -252374 42972 125111 104863 -286310
9734C920a76891A6559f69959a29637O1252n0181k0846j99657A33745J12147b12624
$$ 3920 -176891 16559 -669959 -129637 -68385 -118566 -139412 -339069 133745 245892 -212624
9722f06067A73355b1516G6351P3616h3643l19926k16150a93810P7481k29672J4959
$$ -606067 173355 -21516 76351 149967 -83643 -403569 -619719 -193810 -116329 -346001 -331042
9711c31042a29737j55153B74028a21158j1579e5756j21666M4252J7311q261D4842
$$ -331042 -129737 -284890 274028 -121158 -132737 -55756 -177422 -133170 -115859 -124120 44842
9699b18432O6581k20355F209a14606A0978a38546A09251M6133b82272B39057C7613
$$ -218432 -151851 -372206 6209 -114606 10978 -138546 109251 155384 -282272 239057 37613
9687A88800I1855R0977c762C3866c62179g2562j73863A84681A0620i769A18350
$$ 188800 91855 182832 -3762 33866 -362179 -72562 -246425 184681 10620 -9769 118350
9675e5323B0442K35702a44634l0350g6189D5391K61441A4742b3591j01263d8878
$$ -55323 20442 256144 -144634 -174984 -76189 45391 306832 14742 -23591 -124854 -48878
9663i5307H9779a28955K6858r2531j1081h069A32734a97130B6691M09566D4378
$$ -95307 89779 -128955 -102097 -194628 -205709 -8069 132734 -197130 26691 436257 44378
9651A08018g4661B58512a56435C672e5747B14531Q5666c12809B9237J81948L3356
$$ 108018 -74661 258512 -156435 3672 -55747 214531 300197 -312809 29237 211185 244541
9640B44541b70910a09483L0698A60126b9643n0433A40113a11896k26464a06996
$$ 244541 -270910 -109483 -78785 160126 -29643 -80076 140113 -111896 -338360 -106996
9629d09754J95591H9547a5335F5361R14b46651B76995a73968p4644M4318R8816
$$ -409754 -214163 89547 -15335 65361 66275 -246651 276995 -173968 -248612 -204294 -105478
9618a05478d8200k61453L6072D3556f179k0297l21151R7100C1814J15682c87568
$$ -105478 -48200 -309653 -273581 43556 -6179 -26476 -347627 -250527 31814 147496 -387568
9606d8398n4102A66299d37163C0035b61625J04440j07438A65259o9929a35757
$$ -48398 -102500 166299 -437163 30035 -261625 -157185 -264623 165259 95330 -135757
9595B2425e7480m5312j43396A1759K65174d03567b827n9639C97603b54035I9390
$$ 22425 -57480 -102792 -246188 11759 276933 -403567 -2827 -62466 397603 -254035 99390
9583c1876p5256A43923J30468a56343c4652I3270K8324b7045j81910M7393H7680
$$ -31876 -107132 143923 274391 -156343 -34652 93270 121594 -27045 -208955 -161562 87680
9571a81854Q1106A52792Q5271b24864b6207F7610f7577r2968j93221a25462f0344
$$ -181854 -100748 152792 238063 -224864 -26207 67610 -67577 -160545 -353766 -125462 -60344
9559f5315k4536a8395A79554e0937r9266N2491C3415K01955L3460F19b38730n2141
$$ -65315 -89851 -18395 179554 -50937 -150203 -97712 33415 235370 268830 619 -238730 -290871
9547b90871M0163a0533A35021a09318n0184G7769a62376c7799A5630d6698l3385
$$ -290871 -250708 -10533 135021 -109318 -159502 77769 -162376 -37799 15630 -46698 -80083
9536h0083j59314d1314G4832a19693C2762d71245J47811g2836j37281c4950p6438
$$ -80083 -239397 -41314 74832 -119693 32762 -471245 -323434 -72836 -210117 -34950 -111388
9525a11388E3379K33193a83252L3910A90640L0888a02877E1415a05720j19446
$$ -111388 53379 286572 -183252 -149342 190640 221528 -102877 51415 -105720 -225166
9515b25166l3011A98511F7079a27096j80052A37885i1213j88454C4439b01299
$$ -225166 -258177 198511 67079 -127096 -307148 137885 -91213 -279667 34439 -201299
9504b74980P6979l03591a62687c0858l0842k04270H634K9608a7040l08868R8155
$$ -274980 -198001 -501592 -162687 -30858 -61700 -265970 8634 38242 -17040 -325908 -227753
9493b27753h382p6232A86173a74335A7538i9091I8733b45704J13960G4369a55445
$$ -227753 -8382 -84614 186173 -174335 17538 -99091 98733 -245704 -131744 74369 -155445
9481c65453f821p0225D8116I12i5345j6920r8753C6910b20128a07183o2483B36739
$$ -365453 -6821 -77046 48116 912 -95345 -112265 -211018 36910 -220128 -107183 -169666 236739
9468a13870l4042B2696a49132B07733a17483c6152m2945c8757A6612b94596J02548
$$ -113870 -147912 22696 -149132 207733 -117483 -36152 -79097 -38757 16612 -294596 -192048
9457a92048q5894Q1527f3025I6973e0709r1504b76j26592F1831A3206b4757k98901
$$ -192048 -277942 -196415 -63025 96973 -50709 -142213 -276 -126868 61831 13206 -24757 -323658
9445c23658J10305O8182n918A06932a15508I5201m6051a05528C52173b12093q3266
$$ -323658 -213353 -145171 -151089 106932 -115508 95201 49150 -105528 352173 -212093 -295359
9434b95359f4394C02526j19305c3410q5830D4985d65673c0072p9351J5279A13329
$$ -295359 -64394 302526 183221 -33410 -119240 44985 -465673 -30072 -109423 -94144 113329
9422c19207C45580E2243g5175j39610A65945F3169K2201J13985A4176a04782G0340
$$ -319207 345580 52243 -75175 -214785 165945 63169 85370 199355 14176 -104782 70340
9410a77962E5811a16407a3471F5622i6295j29256h0642j41205k76023B50486p0033
$$ -177962 55811 -116407 -13471 65622 -96295 -225551 -80642 -221847 -497870 250486 180453
9399A80453o8803E0904b67502j8718B8437e0573A17060K6499f3017K9888A7690
$$ 180453 111650 50904 -267502 -286220 28437 -50573 117060 143559 -63017 -33129 17690
9387B75303c72349J53144J04761R421A8484b7380l33518D3745K57348c2684o2797
$$ 275303 -372349 -219205 -114444 -105023 18484 -27380 -360898 43745 301093 -32684 -95481
9376i5481A62513G5758N7718L0337H1309J92144A13754C7472K62272b46131P3736
$$ -95481 162513 75758 133476 163813 81309 273453 113754 37472 299744 -246131 -172395
9365a72395k69862I1739b5751C0765p351b12027c3220o00894E649K7131a69918
$$ -172395 -442257 91739 -25751 30765 23414 -212027 -33220 -634114 5649 32780 -169918
9353a7512B03267a5839j68920G4573f4251l57515K03363J822R2509o616k23951
$$ -17512 203267 -15839 -184759 74573 -64251 -421766 -218403 -216581 -124072 -130688 -354639
9342c54639A56987b50895i4672e858q4135j46819D32138A76423F6813g9671c8057
$$ -354639 156987 -250895 -94672 -5858 -89993 -236812 432138 176423 66813 -79671 -38057
9330b95050g7675q792C3051J43039a43315c7588j41129O066q3617B48858a88385
$$ -295050 -77675 -86467 33051 176090 -143315 -37588 -178717 -172651 -256268 248858 -188385
9318F1603L73122a05354C80719c22274A71439E6887e7941l5391l4514j3063C7627
$$ 61603 434725 -105354 380719 -322274 171439 56887 -57941 -93332 -127846 -140909 37627
9306c2352A1755Q5168K9764A7857N5621j1625j9327a36411j03128d4284j5613
$$ -32352 11755 96923 126687 17857 73478 61853 42526 -136411 -239539 -44284 -59897
9295e9897B94215F8837j4872c09472B23984f9835a6527J722C2373F540J11376
$$ -59897 294215 68837 53965 -309472 223984 -69835 -16527 -14805 32373 6540 117916
9284A17916C3124j3411J0620g0077K4931k73517J48621B03371A4651R3803l2806
$$ 117916 33124 19713 30333 -70077 -45146 -318663 -170042 203371 14651 108454 75648
9273G5648a11446E5364b54936C4768f1891k20907j0429A98655r5505e6967K6469
$$ 75648 -111446 55364 -254936 34768 -61891 -282798 -293227 198655 103150 -56967 -30498
9262c0498m4745a4224A86087I472b04830k8216Q1888L2824B72261D0825a58931
$$ -30498 -75243 -14224 186087 9472 -204830 -233046 -151158 -118334 272261 40825 -158931
9250a80836E5345c10863a16012C64671F1374A965b4508A48952b05792G11i1510
$$ -180836 55345 -310863 -116012 364671 61374 1965 -24508 148952 -205792 711 -91510
9238F8338K3170a45397N446E8148O1371b18584f9897h752B63079A7692P338K98286
$$ 68338 91508 -145397 -139951 58148 119519 -218584 -69897 -8752 263079 17692 25030 323316
9226C23316G9184J9727b84146d8654k5248j63003b2973E5612K5858d18657G0129
$$ 323316 79184 98911 -284146 -48654 -73902 -236905 -22973 55612 81470 -418657 70129
9214b8955l57096F063a38971A09897c13697A67882c56691j7541n4491B34927n5868
$$ -28955 -386051 6063 -138971 109897 -313697 167882 -356691 -374232 -428723 234927 179059
9203A79059a33844l1670j44019C7034f3727l011l49198q5271B85095e2604j4984
$$ 179059 -133844 -165514 -309533 37034 -63727 -66738 -415936 -501207 285095 -52604 -67588
9192f7588K3310k02357j82768B04236f2907B63163b31944f5420B47059c77920
$$ -67588 -44278 -246635 -429403 204236 -62907 263163 -231944 -65420 247059 -377920
9181a22941j36939a29300J2549l81888A11718b37969f0701F1595b54325A05128
$$ -122941 -259880 -129300 -116751 -498639 111718 -237969 -60701 61595 -254325 105128
9170B7182K02432a30191j37948j29373D2250K38401b6225o1091H513a33404c7017
$$ 27182 229614 -130191 -268139 -397512 42250 280651 -26225 -87316 8513 -133404 -37017
9158a88780j92814g1617h236A10970i679j71186C76770D7744m313b8436l60064
$$ -188780 -381594 -71617 -8236 110970 -9679 -180865 376770 47744 43431 -28436 -388500
9147c88500B71633a18595A44261j2132e0372K2101k36046R6351l00115A50076
$$ -388500 271633 -118595 144261 132129 -50372 -28271 -264317 -167966 -468081 150076
9136a72658B56263r2396c72j22636N514k12813A29595g2917b8306A45476a65357
$$ -172658 256263 163867 -372 -123008 -117494 -330307 129595 -72917 -28306 145476 -165357
9124b05330B37146j15286J38752q0771N88N3607a19913D6117r05q749P8508i5788
$$ -205330 237146 121860 260612 179841 180429 234036 -119913 46117 45212 36463 114971 -95788
9111a84663B69446a64143H3894a58483j53363J9783c9799j9017l3915M5551k26481
$$ -184663 269446 -164143 83894 -158483 -311846 -292063 -39799 -58816 -92731 -47180 -273661
9100b73661a26938E0377j7411L6242a08749B5472O8034i220F7993a08999d3288
$$ -273661 -126938 50377 32966 69208 -108749 25472 93506 -9220 67993 -108999 -43288
9088b23241B38806G5591a84144d7350A44099P8592i6056d0149B73580j07657b23457
$$ -223241 238806 75591 -184144 -47350 144099 222691 -96056 -40149 273580 165923 -223457
9076I4157a88967g137I8396a75774B5150a57876C1729a42114p9988A21357L4206
$$ 94157 -188967 -7137 98396 -175774 25150 -157876 31729 -142114 -222102 121357 155563
9065A55563b41931g078B70923b7009k44702K5169A09568a05103L5680j4736k86931
$$ 155563 -241931 -7078 270923 -27009 -271711 -246542 109568 -105103 -69423 -84159 -371090
9054c71090r5621b8200m33099a64607m4199b5582j50168I1314G08a8460k37125
$$ -371090 -466711 -28200 -461299 -164607 -208806 -25582 -175750 91314 708 -18460 -255585
9043b55585i1974F5475J9564e6898m5975K2916C5341b1179j28638j7247m04320
$$ -255585 -91974 65475 85039 -56898 -102873 -79957 35341 -21179 -149817 -167064 -571384
9032e71384a47247C36681a86089f2826A29412B0238e30003e6082j63942o305a09507
$$ -571384 -147247 336681 -186089 -62826 129412 20238 -530003 -56082 -220024 -226329 -109507
9020a53986J9178j10134j9593Q5408A32874a56986K1508d4533n1090q2790Q640
$$ -153986 -134808 -244942 -264535 -179127 132874 -156986 -135478 -44533 -95623 -178413 -169773
9009a69773A51425a61493A16055c20698I5562g5495k01581K9395B69339A14883
$$ -169773 151425 -161493 116055 -320698 95562 -75495 -277076 -247681 269339 114883
8998a4631A8224P6067O9995c961A34498o3956a24085j67812B17006F0166g3959
$$ -14631 18224 94291 164286 -3961 134498 70542 -124085 -291897 217006 60166 -73959
8986A004a79359j26972H9449B033J23684b91178A49131A1609b06906k0518A09621
$$ 1004 -179359 -306331 89449 2033 125717 -291178 149131 11609 -206906 -227424 109621
8974C64554K4955f7449G3836b10121k399C27469f8038i914A35197b24914j69395
$$ 364554 389509 -67449 73836 -210121 -212520 327469 -68038 -9914 135197 -224914 -394309
8963c94309J61396E3833a60341P7617j46623G2432a94271j75866B06521A8617
$$ -394309 -232913 53833 -160341 -82724 -229347 72432 -194271 -370137 206521 18617
8952E421J14700a15071a6123m9037J5759a4401B53964a7818j24236k42585E39407
$$ 5421 120121 -115071 -16123 -65160 -49401 -14401 253964 -17818 -142054 -384639 539407
8940a49822M3767F0758c43864M9033m2343C57873o6465a32444q603b0897A21862
$$ -149822 -106055 60758 -343864 -294831 -337174 357873 291408 -132444 -141047 -20897 121862
8928G61J51041k9630C6920a96035F49473M64755K901618M732109C567651F77885
$$ 761 151802 122172 36920 -196035 649473 1114228 4015846 8747955 3567651 677885
8917D31710A53467F5597B4120a85948A77133a95264D4895L13032C8585J13088
$$ 431710 153467 65597 24120 -185948 177133 -195264 44895 357927 38585 151673
8907A51673G2674A5670a10958j38169a4994k05880f4853B7483a13553B91227i6495
$$ 151673 72674 15670 -110958 -249127 -14994 -220874 -64853 27483 -113553 291227 -96495
8895a02559b7980k46294E9814M4169R3780a14236G8685a55714g3968k7479D0125
$$ -102559 -27980 -274274 59814 103983 197763 -114236 78685 -155714 -73968 -101447 40125
$$ [...]
##END NTUPLES=NMR SPECTRUM
##END=
