
##TITLE=AC1302_PERAH12114_6615240_0rTI94FHjm
##JCAMPDX= 6.0         $$ Bruker NMR JCAMP-DX V2.0
##DATA TYPE= NMR SPECTRUM
##DATA CLASS= NTUPLES
##ORIGIN= BRUKER
##OWNER= Administrator
$$ 1.72 TOPSPIN		Version 2.1
$$ 2012-08-02 18:34:21.515 -0500  Administrator@TOPSPIN
$$ Compression mode = diff/dup
##.OBSERVE FREQUENCY= 400.02188249412
##.OBSERVE NUCLEUS= ^1H
##.ACQUISITION MODE= SIMULTANEOUS (DQD)
##.ACQUISITION SCHEME= undefined
##.AVERAGES= 8
##.DIGITISER RES= 22
##SPECTROMETER/DATA SYSTEM= spect
##.PULSE SEQUENCE= zg30
##.SOLVENT NAME= COFFEE_meoh
##.SHIFT REFERENCE= INTERNAL, COFFEE_meoh, 1, 14.98509
##AUDIT TRAIL= $$ (NUMBER, WHEN, WHO, WHERE, PROCESS, VERSION, WHAT)
$$ ##TITLE= Audit trail, TOPSPIN		Version 2.1
$$ ##JCAMPDX= 5.01
$$ ##ORIGIN= Bruker BioSpin GmbH
$$ ##OWNER= Administrator
$$ $$ C:\Bruker\TOPSPIN/data/COFFEE/nmr/AC1302_PERAH12114_6615240_0rTI94FHjm/10/pdata/1/auditp.txt
$$ ##AUDIT TRAIL=  $$ (NUMBER, WHEN, WHO, WHERE, PROCESS, VERSION, WHAT)
(   1,<2012-08-02 18:34:13.468 -0500>,<Administrator>,<TOPSPIN>,<go>,<TOPSPIN 2.1>,
      <created by zg
	started at 2012-08-02 18:33:06.421 -0500,
	POWCHK enabled, PULCHK disabled,
       configuration hash MD5:
       6B 1B 68 BB D9 2E 58 E2 7F 35 AD 54 07 DF 0E 41
       data hash MD5: 64K
       A6 26 0C F1 39 64 05 CE 8D 3A 3A 80 61 B9 36 DB>)
(   2,<2012-08-02 18:34:16.515 -0500>,<Administrator>,<TOPSPIN>,<proc1d>,<TOPSPIN 2.1>,
      <Start of raw data processing
       efp LB = 0 FT_mod = 6 PKNL = 1 PHC0 = 0 PHC1 = 0 SI = 32K 
       data hash MD5: 32K
       70 E0 C8 77 07 20 1B 21 96 BF D6 E3 BE EE C5 F1>)
(   3,<2012-08-02 18:34:16.937 -0500>,<Administrator>,<TOPSPIN>,<proc1d>,<TOPSPIN 2.1>,
      <pk PHC0 = 181.203 PHC1 = 0 
       data hash MD5: 32K
       06 FC DF A1 07 24 31 E8 EC DF 5F C5 D6 33 A6 E1>)
(   4,<2012-08-02 18:34:17.015 -0500>,<Administrator>,<TOPSPIN>,<proc1d>,<TOPSPIN 2.1>,
      <abs ABSG = 1 
       data hash MD5: 32K
       5B C0 6E 61 A1 01 5C 7B 82 F4 69 28 B6 F3 EC D7>)
(   5,<2012-08-02 18:34:17.062 -0500>,<Administrator>,<TOPSPIN>,<proc1d>,<TOPSPIN 2.1>,
      <abs ABSG = 2 
       data hash MD5: 32K
       90 F1 4E D2 99 9B 30 AB 5F 6C A8 A2 F5 9C 87 53>)
(   6,<2012-08-02 18:34:17.093 -0500>,<Administrator>,<TOPSPIN>,<proc1d>,<TOPSPIN 2.1>,
      <abs ABSG = 3 
       data hash MD5: 32K
       F2 A1 91 49 A0 DB 1D 33 74 59 9D AC 22 3A E6 75>)
(   7,<2012-08-02 18:34:17.125 -0500>,<Administrator>,<TOPSPIN>,<proc1d>,<TOPSPIN 2.1>,
      <abs ABSG = 4 
       data hash MD5: 32K
       3B 7F 1C CB 51 03 8A 8F A0 EE A1 6B 34 34 4D E3>)
(   8,<2012-08-02 18:34:17.156 -0500>,<Administrator>,<TOPSPIN>,<proc1d>,<TOPSPIN 2.1>,
      <abs ABSG = 5 
       data hash MD5: 32K
       10 D6 E1 A7 5E 33 6A 1E 4B CE B5 E0 C6 CA 11 20>)
$$ ##END=
$$ 
$$ $$ hash MD5
$$ $$ AF 62 CD 86 F9 B8 56 48 DE BB 34 36 28 A2 5D 9C
##$RELAX= 
##$RELAX= 
##$RELAX= 
##$RELAX= 
##$RELAX= 
##$RELAX= 
##$RELAX= 
$$ Bruker specific parameters
$$ --------------------------
$$ [...]
##$TP= (0..7)
150 150 150 150 150 150 150 150
##$TP07= 0
##$TPNAME0= <>
##$TPNAME1= <>
##$TPNAME2= <>
##$TPNAME3= <>
##$TPNAME4= <>
##$TPNAME5= <>
##$TPNAME6= <>
##$TPNAME7= <>
##$TPOAL= (0..7)
0.5 0.5 0.5 0.5 0.5 0.5 0.5 0.5
##$TPOFFS= (0..7)
0 0 0 0 0 0 0 0
##$TUNHIN= 0
##$TUNHOUT= 0
##$TUNXOUT= 0
##$USERA1= <user>
##$USERA2= <user>
##$USERA3= <user>
##$USERA4= <user>
##$USERA5= <user>
##$V9= 5
##$VALIST= <valist>
##$VCLIST= <CCCCCCCCCCCCCCC>
##$VD= 0
##$VDLIST= <DDDDDDDDDDDDDDD>
##$VPLIST= <PPPPPPPPPPPPPPP>
##$VTLIST= <TTTTTTTTTTTTTTT>
##$WBST= 1024
##$WBSW= 4
##$XGAIN= (0..3)
0 0 0 0
##$XL= 0
##$YL= 0
##$YMAX_a= 492878
##$YMIN_a= -646005
##$ZGOPTNS= <>
##$ZL1= 120
##$ZL2= 120
##$ZL3= 120
##$ZL4= 120
##$ABSF1= 14.98509
##$ABSF2= -5.573092
##$ABSG= 5
##$ABSL= 3
##$ALPHA= 0
##$AQORDER= 0
##$ASSFAC= 0
##$ASSFACI= 0
##$ASSFACX= 0
##$ASSWID= 0
##$AUNMP= <proc_prof1d_extract_pilot.lims>
##$AXLEFT= 0
##$AXNAME= <>
##$AXNUC= <1H>
##$AXRIGHT= 0
##$AXTYPE= 0
##$AXUNIT= <>
##$AZFE= 0.1
##$AZFW= 0.1
##$BCFW= 0
##$BC_mod= 0
##$BYTORDP= 0
##$COROFFS= 0
##$CY= 15
##$DATMOD= 1
##$DC= 0
##$DFILT= <>
##$DTYPP= 0
##$F1P= 0
##$F2P= 0
##$FCOR= 0.5
##$FTSIZE= 32768
##$FT_mod= 6
##$GAMMA= 0
##$GB= 0
##$INTBC= 1
##$INTSCL= 1
##$ISEN= 128
##$LB= 0
##$LEV0= 0
##$LPBIN= 0
##$MAXI= 10000
##$MC2= 0
##$MEAN= 0
##$ME_mod= 0
##$MI= 0
##$NCOEF= 0
##$NC_proc= -8
##$NLEV= 6
##$NOISF1= 0
##$NOISF2= 0
##$NSP= 0
##$NTH_PI= 0
##$NZP= 0
##$OFFSET= 14.98509
##$PC= 1
##$PHC0= 181.203
##$PHC1= 0
##$PH_mod= 1
##$PKNL= yes
##$PPARMOD= 0
##$PPDIAG= 0
##$PPIPTYP= 0
##$PPMPNUM= 2147483647
##$PPRESOL= 1
##$PSCAL= 4
##$PSIGN= 0
##$PYNMP= <proc.py>
##$REVERSE= no
##$SF= 400.02
##$SI= 32768
##$SIGF1= 0
##$SIGF2= 0
##$SINO= 400
##$SIOLD= 32768
##$SPECTYP= <>
##$SREGLST= <1H.CDCl3>
##$SSB= 0
##$STSI= 32768
##$STSR= 0
##$SW_p= 8223.68421052631
##$SYMM= 0
##$S_DEV= 0
##$TDeff= 65536
##$TDoff= 0
##$TI= <>
##$TILT= no
##$TM1= 0
##$TM2= 0
##$TOPLEV= 0
##$USERP1= <user>
##$USERP2= <user>
##$USERP3= <user>
##$USERP4= <user>
##$USERP5= <user>
##$WDW= 1
##$XDIM= 32768
##$YMAX_p= 458001960
##$YMIN_p= -695153
##$CURPLOT= <Network HP LaserJet P1505>
##$CURPRIN= <$Network HP LaserJet P1505>
##$DFORMAT= <normdp>
##$LAYOUT= <+/1D_H.xwp>
##$LFORMAT= <normlp>
##$PFORMAT= <normpl>
##$SURQMSG= 1
$$ End of Bruker specific parameters
$$ ---------------------------------
##NTUPLES= NMR SPECTRUM
##VAR_NAME=  FREQUENCY,     SPECTRUM/REAL,   SPECTRUM/IMAG
##SYMBOL=    X,             R,               I
##VAR_TYPE=  INDEPENDENT,   DEPENDENT,       DEPENDENT
##VAR_FORM=  AFFN,          ASDF,            ASDF
##VAR_DIM=   32768,         32768,           32768
##UNITS=     HZ,            ARBITRARY UNITS, ARBITRARY UNITS
##FACTOR=    0.250966925370066, 1,           1
##FIRST=     8223.43324360094, -126516,      -112108
##LAST=      0,             3691,            23554
##MIN=       0,             -695153,         0
##MAX=       8223.43324360094, 458001960,    0
$$ Real data points
##PAGE= N=1
##DATA TABLE= (X++(R..R)), XYDATA
$$ [...]
19479i0344p3290E6161N3190c34721h1263j95585g1058j00735M8562A21430d53428
19467B9400a95642P2234n5443j0715j81274A17153d623k12964B38236q0774g6409
19455b40369J2057M8182o9286a10646j33910G4048H824a21556B02836g1923l4336
19444a06259j35322K7545g6442k72893R2732A10731a918j55579i031j56474j5581
19433a81086G3583i0975k45630A93382a31044G5602g7287A03537A9165a77474
19422H2377J70776a8780B0782g8220k35607C8507b24513g2694K2999H9541C9757
19410g602l18782a02825p7985k436c2165g499k24838G244a08022C0523a37188
19398B9294l947b7456k0361J9900k12452M5136h580F0035d16252J11742B50680
$$ y = [-90344, -163634, 56161, 109351, -334721, -81263, -276848, -71058, -171793, -123231, 121430, -453428, 29400, -195642, -123408, -178851, -189566, -370840, 117153, -4623, -217587, 238236, 157462, -76409, -240369, -228312, -180130, -249416, -110646, -244556, 74048, 8824, -121556, 202836, -71923, -106259, -241581, -214036, -76442, -349335, -256603, 110731, -1918, -157497, -9031, -165505, -181086, 73583, -90975, -336605, 193382, -131044, 75602, -77287, 103537, 19165, -177474, 82377, 253153, -18780, 20782, -78220, -313827, 38507, -224513, -72694, -49695, 89541, 39757, -7602, -326384, -102825, -180810, -183246, -32165, -7499, -232337, 7244, -108022, 30523, -137188, 29294, 25347, -27456, -47817, -27917, -240369, -195233, -8580, 60035, -416252, -304510, 250680]
19386c4390m0711j20994H1724C4515j4024C263Q4938a49149I6597L4581e7710
19374D1457a46925p6786A1675a00862A7914L06259a54302K9130A23921M2584c8934
19362a0739o3165p5126d0469A45878k5202m5872J03934c2742k41001a12592D6171
19350a57042G7232b74351E1035K5818a27318i451q9723A21763j2436a53695e9486
19338a93297B14086b55266G3503h8240b7114k69658D3030F593e8225f683D0834
19326a61258P9708o8694m5427c5433q4465C1734a10546N3838m21238b51A01074
19314A68758n2253b54321f5813K3501j7765B63756E3072k1958a86333j18318p720
19303c12371c7703A45790a51365A72480a42035e3193E5477M2130K04481a1337
$$ y = [-34390, -75101, -196095, 81724, 34515, 20491, 3263, 88201, -149149, 96597, 131178, -57710, 41457, -146925, -223711, 11675, -100862, 17914, 324173, -154302, -125172, 123921, 166505, -38934, -10739, -73904, -149030, -40469, 145878, 120676, 74804, 178738, -32742, -273743, -112592, 46171, -157042, 77232, -274351, 51035, 76853, -127318, -9451, -99174, 121763, 109327, -153695, -59486, -193297, 214086, -255266, 73503, -88240, -27114, -296772, 43030, 6593, -58225, -6683, 40834, -161258, -81550, -150244, -195671, -35433, -119898, 31734, -110546, -56708, -477946, -251, 101074, 168758, 116505, -254321, -65813, -42312, -60077, 263756, 53072, 31114, -186333, -304651, -312371, -37703, 145790, -151365, 172480, -142035, -53193, 55477, 97607, 302088, -11337]
19292B15349b96488J00918p2041F9351f6304E0577J579L1988c95324J59209E5410
19280b16848h3740L4509j26473q1331J19609j20503D9604a31393O571E7738b83428
19268E0708b49299A30259b17703A72135j8735a12620q050n9859K6518C0616a63466
19256B48964b97502A16608d2878j00262N6814j31846D1348O7937a07532L0778
19246g6754B4420b15239k8445p5575d3613B6748E848b6930j16987K5696e5617
19234I2352c16802B1768J26390e9199j65272j97405A9464O1612M543a01351d7235
19222a71188N9647L2572j67165d416j96374A28903a07789D7401J19792f4057q4992
19211a49049H2609a00705j98647B2809d1684A680a04759D2122J05166K17814j65466
$$ y = [215349, -296488, -195570, -267611, 69351, -66304, 50577, 52156, 84144, -395324, -236115, 55410, -216848, -83740, -49231, -175704, -257035, -137426, -257929, 49604, -131393, -124822, 57738, -283428, 50708, -249299, 130259, -217703, 172135, 153400, -112620, -120670, -180529, -154011, 30616, -163466, 248964, -297502, 116608, -42878, -143140, -86326, -218172, 41348, 109285, -107532, -76754, 24420, -215239, -243684, -319259, -43613, 26748, 5848, -26930, -143917, -118221, -55617, 92352, -316802, 21768, 148158, -59199, -224471, -421876, 19464, 81076, 85619, -101351, -47235, -171188, -111541, -78969, -246134, -4416, -200790, 128903, -107789, 47401, 167193, -64057, -149049, 82609, -100705, -299352, 22809, -41684, 1680, -104759, 42122, 147288, 365102, 199636]
19200A99636a6208l61119j79355a36975N6312D06748a29958j31632P8889A25144
19189a87936q9802r3296J50066A12699a05606A27579H711O9718c94030i492C2532
19177G0655a69141c2270A40631a39125K6197j32675B33027c9033j5594r1549j31915
19166b78091J26074b9675j640D76268A00944a58627A48009G0818a20686D456c20486
19154A41791M3882B4421f4245r5376m4386k93130b5951j35122p6384p5481a54781
19142B43518C6248b00819b4342G6858a8949C21591a71114O6792C6302L4811J97099
19131B68212i2593B13167b94329B8592K630c9091B27594c34918a26715J7129k6988
19120a36574M486j22364D8579c31370F053a49930f2160r5032A78056d18745a43767
$$ y = [199636, -16208, -377327, -556682, -136975, -80663, 406748, -129958, -261590, -182701, 125144, -187936, -277738, -371034, -220968, 112699, -105606, 127579, 8711, 78429, -394030, -9492, 32532, 70655, -169141, -32270, 140631, -139125, -112928, -245603, 233027, -39033, -54627, -146176, -278091, -152017, -29675, -31315, 476268, 100944, -158627, 148009, 70818, -120686, 4456, -320486, 141791, 185673, 24421, -64245, -159621, -204007, -497137, -25951, -161073, -237457, -312938, -154781, 243518, 36248, -200819, -24342, 76858, -18949, 321591, -171114, -104322, 36302, 71113, 268212, -92593, 213167, -294329, 28592, 31222, -39091, 227594, -334918, -126715, -109586, -136574, -132088, -254452, 48579, -331370, 6053, -149930, -62160, -157192, 178056, -418745, -143767]
19108a30366g077D2384a71489R233P2053j22163D653Q1426g4745j3078C1849b6524
19095G6527b53845A35268g5200o8945I686c9105j3783A25336a24577E2738c46475
19083D1240d4208k07892a03684k52902D0440B339c2086C8026O3853b11328B23158
19071a09338A5007d2852A50389j6390a77554k0493p9526g8971I6900d2261n05628
19060e47889A3936a04497D0694a55941q1974j11516h957B21021d283B82632b32787
19048d8870E7113c6557C01128a29542r2144I4752e6509a9170C002c32796A48318
19036I6597a29306H5905b42415B47204A03937a21683H1058K4958J2837J49874
19026B68727i9059j78836I7683a24327A62588b86567A99879n0289n5350J04659
$$ y = [-130366, -7077, 42384, -171489, -162256, -90203, -212366, 4653, 86079, -74745, -87823, 31849, -26524, 76527, -253845, 135268, -75200, -144145, 9686, -39105, -52888, 125336, -124577, 52738, -346475, 41240, -44208, -252100, -103684, -356586, 40440, 2339, -32086, 38026, 101879, -211328, 223158, -109338, 15007, -42852, 150389, 133999, -177554, -198047, -277573, -78971, 96900, -42261, -547889, 13936, -104497, 40694, -155941, -237915, -349431, -8957, 221021, -4283, 282632, -232787, -48870, 57113, -36557, 301128, -129542, -221686, 94752, -56509, -19170, 3002, -332796, 148318, 96597, -129306, 85905, -242415, 247204, 103937, -121683, 81058, 106016, 118853, 268727, -99059, -277895, 97683, -124327, 162588, -286567, 199879, 149590, 94240, 198899]
19016A98899i1094c5242l70720c918B52320j04575a76655C63389b60431C3853
19005A74170E6162c40590B15956H1975C3138N1305b13053c8554q4941j7454A26868
18993A24119a76897r8700A89532d12394a73780j07755H2086C5574a37461A89963
18982f0019m391k54805N4457d8325j9047r6942H5436P2083c2313j39913A25444
18970C48834N44051D16245m2903I7940J26222f8163B62926K7920a37688j29508
18960b67196A54074k2732a67835P7790C0860N407g5883m8049l1596k3561N921
18949a73168d0967A35633o4257N5284l0712M191G18L9409i4386n2955j4286G7925
18936a55842b223j87494D8150J53117K37370B7369K01065b92928O3836d2074j60425
$$ y = [198899, -91094, -35242, -405962, -3918, 252320, 147745, -176655, 363389, -260431, 33853, 174170, 56162, -340590, 215956, 81975, 33138, 84443, -213053, -38554, -123495, -140949, 126868, 124119, -176897, -275597, 189532, -412394, -173780, -281535, 82086, 35574, -137461, 189963, -60019, -64410, -319215, -264758, -48325, -67372, -164314, 85436, 157519, -32313, -172226, 125444, 348834, 892885, 416245, 373342, 97940, 224162, -68163, 262926, 290846, -137688, -267196, 154074, 131342, -167835, -90045, 30860, 36267, -75883, -123932, -155528, -179089, -173168, -40967, 135633, 71376, 126660, 95948, 100139, 718, 40127, -94386, -147341, -161627, 77925, -155842, -2223, -189717, 48150, 201267, 438637, 27369, 228434, -292928, -229092, -42074, -202499]
18925b02499G5601a49981B38783j17734B8384K01626b76165a9302k913F3047K38369
18914C01416a4076C67568d1098I777Q2792c7024A59563O47194k35300j28708k21059
18903B21690K30871A13243L1618f7508A15835l9070c1310j19608f70j55521O1718
18892i4473C1566f2946j30928j44870J33082f3538i394p6608j79362f8787K4081
18881d4706f111B16013a9246A43901l0691b03550F2491a15481D9558j7679f3592
18869b51497B7981h4449J1934L3855D1914O8384c8458A4603a91653A58122i3887
18857g3699a9609B36449c9732k2082A35850e1531j60045h163l03605K9842D1941
18845A71722J06623e2699I59c5250j10671g1214k46279a09040A09617b0892B3241
$$ y = [-202499, 75601, -149981, 238783, 121049, 28384, 230010, -276165, -19302, -22215, 63047, 301416, -14076, 367568, -41098, 9777, 92569, -37024, 159563, 806757, 571457, 442749, 221690, 452561, 113243, 144861, -67508, 115835, 76765, -31310, -150918, -670, -156191, -94473, 31566, -62946, -193874, -338744, -205662, -63538, -9394, -86002, -265364, -68787, -44706, -6111, 216013, -19246, 143901, 113210, -203550, 62491, -115481, 49558, 31879, -63592, -251497, 27981, -84449, -72515, -38660, 41914, 110298, -38458, 14603, -191653, 158122, -93887, -73699, -19609, 236449, -39732, -61814, 135850, -51531, -211576, -8163, -311768, -281926, 41941, 171722, 278345, -52699, 959, -35250, -145921, -71214, -317493, -109040, 109617, -20892, 23241]
18833f6951A38903f17792a45464A64009o4328J89576e01006b12549A21353c40338
18822a16314A35199a48426a2594l06763J42179C23108J0190p9969b26689a265
18811A30243C62b74503F5663C0360K02191D4202a46410I9284a10940C3625Q251
18800D1876J0652b2102A09741a95653P7777O032B50232i159j09336j60445a05601
18788H7920J5134c97204a16145m3944P0480j30425h2960P493F670K57523b77796
18776A04890L2380a18344j42321F3336m189j7316b64079B40148r7396b98499n622
18765c04121D0204a93589q412G3755c05813j05768J31982M9347e1906A83971b73303
18753I1099a16942j31091Q483G1293j537b35131M0989l3063a00327C1167h8959
$$ y = [-66951, 138903, -617792, -145464, 164009, 99681, 289257, -501006, -212549, 121353, -340338, -116314, 135199, -148426, -12594, -319357, -177178, 323108, 333298, 253329, -226689, -1265, 130243, 362, -274503, 65663, 30360, 232551, 44202, -146410, 99284, -110940, 33625, 41876, 52528, -22102, 109741, -195653, -117876, -111844, 250232, -9159, -118495, -278940, -105601, 87920, 103054, -397204, -116145, -160089, -89609, -220034, -82960, -75467, 6670, 264193, -277796, 104890, 137270, -118344, -260665, 63336, 59147, 41831, -264079, 240148, 142752, -298499, -304121, 40204, -193589, -202001, 73755, -305813, -411581, -279599, -230252, -51906, 183971, -273303, 91099, -116942, -248033, -239550, 71293, 69756, -235131, -194142, -227205, -100327, 31167, -88959]
18741a57733b4051j12550j0544L7460B31171F2739P9660l087c25781C74910b70389
18729B98148b09064j9164Q9685E0194b01865B2346J82092M1139j00986o4761a29903
18717c36308a35768c1486J463L17k12656a14258G8781a84237C756b34467F3262
18705B65516h6277k31138I0294e3344j87958g3403A41594c0671B63675f9125k02326
18694b71451J08467a6657o0939j59930d9312j41212Q2038A9977O267Q737a47170
18682c11063P8175K4149d2041E1113f5573p5459m5785O4220j32384f9524A08707
18670G9130P9515O740i7141j35290m2321h8966n2455C2933A0048J03401c55148
18658G9872i0302j95298J386h9482C4806a15949b0171j19513M7337L3861j70927
$$ y = [-157733, -24051, -136601, -147145, -109685, 231171, 62739, 142399, 139312, -325781, 374910, -270389, 298148, -209064, -228228, -138543, 50194, -201865, 22346, 204438, 245577, 144591, 79830, -129903, -336308, -135768, -31486, -30023, -29706, -242362, -114258, 78781, -184237, 3756, -234467, 63262, 265516, -86277, -317415, 90294, -53344, -241302, -73403, 141594, -30671, 263675, -69125, -271451, -162984, -16657, -77596, -237526, -49312, -190524, -108486, 19977, 26244, 34981, -147170, -311063, -232888, -208739, -42041, 51113, -65573, -141032, -186817, -122597, -254981, -69524, 108707, 79130, 158645, 165385, -97141, -232431, -274752, -88966, -141421, 32933, 10048, 113449, -355148, 79872, -90302, -285600, -284214, -89482, 34806, -115949, -20171, -139684, -92347, -58486, -229413]
18647b29413L2604i3055J7736E9970k2099g7789k20952B72930I1941A5385M688
18636B0073h462A5949a70882F2519j9812a30625j52708J15033C0368a86855c8854
18624C0104a55920C44374a9911j52294P0433j05046j50693a28978k8284k3021
18614a80283B75580G0483h5225c7761j73317i1079I294L9971e7673j8905C7052
18602a59503j39412I5006d561B8651a62933a8702j2964h846o3524B10559F8302
18590e744G992J14093B3562N7398a52000b9727p4576j52471E5254c93415B48613
18578b58615D80709G3198a67074q9140J16167m6159N0414h947l8183j90503A96033
18566h9359r0576G422b51935F4354G001b86597B37761E4265a37773b496j25259
$$ y = [-229413, -196809, -93055, -75319, 59970, 37871, -77789, -298741, 272930, 91941, 15385, 20073, -8462, 15949, -170882, 62519, 42707, -130625, -283333, -168300, 30368, -186855, -38854, 30104, -155920, 344374, -19911, -172205, -101772, -206818, -357511, -128978, -157262, -180283, 275580, 70483, -85225, -37761, -211078, -91079, 9294, 49265, -57673, -76578, 37052, -159503, -298915, 95006, -4561, 28651, -162933, -18702, -31666, -8846, -72370, 210559, 68302, -5744, 7992, 122085, 23562, 80960, -152000, -29727, -104303, -256774, 55254, -393415, 248613, -258615, 480709, 73198, -167074, -256214, -140047, -186206, -135792, -8947, -47130, -237633, 196033, -89359, -179935, 7422, -251935, 64354, 7001, -286597, 237761, 54265, -137773, -2496, -127755]
18555a27755j5076f4667A16136b6688r4040d8027l1990l5552K4920B27580e4656
18543b95512f42F2561B3407e7547B99265c17669i5027A63599b51987h2813k20856
18532c03669c8186j38100A36929o7184J28788N6397a92253Q9198H4658K0760B9678
18520b44109a09839G8624J31981O0078B3038J6103K25926f1107k07020A82059
18509C27906A31780b14003E5729C67Q910c37131C5915a24805k88691J61153G4946
18497g3490A25583A9011c20453d5608A711P7097M2903l526a2275k16009E023a56364
18484c607o3748n6035j62487j36966J84311d5048A24480a70757B4004e2141a6700
18472G1760O1831a46924j56173J31638l25910a57854e0034l5656B30587b3524
$$ y = [-127755, -142831, -64667, 116136, -26688, -120728, -48027, -80017, -115569, -90649, 227580, -54656, -295512, -642, 62561, 23407, -57547, 299265, -317669, -95027, 163599, -251987, -82813, -303669, -38186, -176286, 136929, 69745, 198533, 254930, -192253, -103055, 84658, 105418, 29678, -244109, -109839, 78624, 210605, 270683, 23038, 39141, 265067, -61107, -268127, 182059, 327906, 131780, -214003, 55729, 367, 9277, -337131, 35915, -124805, -413496, -252343, 74946, -73490, 125583, 19011, -320453, -45608, 1711, 78808, 121711, 118185, -12275, -228284, 5023, -156364, -3607, -67355, -123390, -285877, -422843, -238532, -45048, 124480, -170757, 24004, -52141, -16700, 71760, 133591, -146924, -303097, -171459, -497369, -157854, -50034, -85690, 230587, -23524]
18461b24767F9739C2363f6881B4954b59796J27008r0595G5935B7684K76469J7535
18450C21688a09552q533q2797r6180j70338C3937a75197N0237k16699a28377j09853
18439b38230N3122e6376r9754B3626J16148D9531b89431Q8839C889c14463i6286
18427b44744A58156i5203h692A0073J08052A8258Q0054c10710A0036b10071L3261
18416a76810E3838j6255H988N4899c9279k79002A06817I323b35513D92690B12345
18404i9870j39958p997B04475b51450B44020k2039d3092j45464d9997B907P4168
18393G7075j2045a791o5892l7384o1992m4458A87015a26825A05241r138F725P0078
18381G6803a40087A46881E7149M0991e3645p223C0258P8679a82886A39003b3590
$$ y = [-224767, 69739, 32363, -66881, 24954, -259796, -132788, -223383, 75935, 27684, 304153, 321688, -109552, -118085, -200882, -297062, -467400, 33937, -175197, -124960, -341659, -128377, -238230, -185108, -56376, -156130, 23626, 139774, 49531, -289431, -200592, 3889, -314463, -96286, -244744, 158156, -95203, -8692, 10073, 118125, 18258, 98312, -310710, 10036, -210071, -176810, 53838, 37583, 8988, 63887, -39279, -318281, 106817, 9323, -235513, 492690, 212345, -99870, -239828, -247825, 204475, -251450, 244020, 221981, -43092, -188556, -49997, 2907, 77075, 65030, -1791, -67683, -105067, -167059, -211517, 187015, -126825, 105241, 96103, 6725, 76803, -140087, 146881, 57149, 98140, -53645, -60868, 30258, 108937, -182886, 139003, -23590]
18369A38671a6716m7964G4159K88880a22509K90n1813B11428L7800C9431b31934
18357c3635I8981L2043k254E9732b82286E748J18858a07880e538j94717h5117
18345F710a15714I8820c96602A33083a90675D7492d0255j23125c020k07936n9604
18334b70560b5078B32140b0926B897J42932J33914B6129i254k8111B90093e7808
18322b94693a01935o7831A80570a16040B15738a08850q6232g4763j17351P2896
18312a19218J31L7975G6411e9945A01536J09543a24185B34044c33584b2248j58701
18301a80949D3978J08181a65511K4797B4663a63228A25334G119b27833R9339A35467
18289a22822A45342c24225h4256B14721a40840A10261f791l82837a00094B302
$$ y = [138671, -16716, -64680, 74159, 363039, -122509, -122219, -174032, 211428, 249228, 39431, -231934, -33635, 98981, 131024, 128770, 59732, -282286, 5748, 124606, -107880, -5538, -200255, -85117, 6710, -115714, 98820, -396602, 133083, -190675, 47492, -40255, -163380, -3020, -210956, -270560, -25078, 232140, -20926, 2897, 145829, 279743, 26129, -9254, -37365, 290093, -57808, -294693, -101935, -169766, 180570, -116040, 215738, -108850, -195082, -74763, -192114, -119218, -119087, -81112, 76411, -59945, 101536, 211079, -124185, 234044, -333584, -22248, -180949, 43978, 152159, -165511, -140714, 24663, -163228, 125334, 7119, -227833, -128494, 135467, -122822, 145342, -324225, -84256, 214721, -140840, 110261, -6791, -389628, -100094, 2302]
18278H704a79839I9349a11494l203N7210B33053F1076a5731A15668c88500A71743
18266H4727P6353F9563a78678I2738J03571c79396a03541E2872A5857c3492j68668
18255b02160p5354B24425G1326J77085f9936p4159B81304f4541G701b2564M485
18244a8079C36741b29709A56083C0140c02769B04040l4817J6763a38134j41598
18234b79732q4629a6038r4448k25351B28664j3948H5011i6682I0338c74728E0697
18222b15847A85641a27525A43106l0286D7889N0529c16910j6197P6296k2008a35047
18210c0520n1008A85005A6624J5063K3404a22054M3181G7735J1322b27733H0873
18198C08918A33462N539a05608m24407a75788B97441B1025R6040b05855B1310
$$ y = [8704, -179839, 99349, -111494, -114697, -57487, 233053, 61076, -15731, 115668, -388500, 171743, 84727, 161080, 69563, -178678, 92738, 196309, -379396, -103541, 52872, 15857, -33492, -202160, -277514, 224425, 71326, 248411, -69936, -144095, 281304, -64541, 7701, -22564, -18079, 336741, -229709, 156083, 30140, -302769, 204040, 169223, 185986, -138134, -279732, -364361, -16038, -110486, -335837, 228664, 214716, 85011, -96682, 90338, -374728, 50697, -215847, 185641, -127525, 143106, 112820, 47889, 98418, -316910, -333107, -256811, -278819, -135047, -30520, -81528, 185005, 16624, 31687, 55091, -122054, -78873, 77735, 89057, -227733, 80873, 308918, 133462, 139001, -105608, -530015, -175788, 297441, 21025, 117065, -205855, 21310]
18187C76679j32373d833B2320K39172j04605m2843c50954h6576B9979k255i5352
18175a43395d8117k28275K9512B8225a99677j60752E3687b68419h6325C007N3064
18164E6071f8642b4405l1215D17462A74894a40401B6398J7239d6735j67261j62038
18153c76034e4292A68831f1537D6771M7639I923d5754k21015C1740a42666f6047
18141e7526o3792A08355J18258a73901j90969A49036d7641l8539B5353b9102J0956
18130a8146I5910b13375g7116c5064D8397K6093b44628M3297h3997J0521p0949
18119a44425A32433K47179e6186k6990A97472K02846a47871d0785d747l71565
18109c76312B0887L63104E5963k5878M217a86763A77403E2388b27517f6767p3396
$$ y = [376679, 244306, -4833, 22320, 261492, 156887, 114044, -350954, -86576, 29979, 27724, -95352, -143395, -48117, -276392, -246880, 28225, -199677, -360429, 53687, -268419, -86325, 3007, 56071, -68642, -24405, -55620, 417462, 174894, -140401, 26398, 43637, -46735, -213996, -376034, -54292, 168831, -61537, 46771, 94410, 9923, -45754, -266769, 31740, -142666, -66047, -57526, -121318, 108355, 226613, -173901, -364870, 149036, -47641, -86180, 25353, -29102, -18146, 95910, -213375, -77116, -35064, 48397, 74490, -244628, -201331, -83997, -73476, -144425, 132433, 379612, -56186, -83176, 197472, 400318, -147871, -40785, -4747, -376312, 20887, 383991, 55963, 30085, 34302, -186763, 177403, 52388, -227517, -66767, -140163]
18098a40163A32936g4760r8447A41377b75866O2587j10235B47647o7769R9051
18088B78929E7553a39292n1430C6963M7139N8902g6822p6922A43813b2837k5249
18077d8086k1008A2735J15284N4554a92186d7718A38128i4512A34254n8151h0237
18065a609C30230b6870C72573b39760A31058a9021g132q686k21187i0503J7386
18054g3117A68957f3180C54889j36401A7954b09849h4407q023K8370A05356b60393
18042A97906d4661m4646c2920A90812r4961b08747j96811i6247A31089M5837C1555
18030A09297J9157c09595A1267P8970J49216n2738f5422E3989k2202a79855j39701
18019c19556f8047q8079b3007j33538A9156K96652H7926b01881C13971A2748C025
$$ y = [-140163, 132936, -74760, -173207, 141377, -275866, -213279, -323514, 247647, 179878, 278929, 57553, -139292, -190722, 36963, 84102, 143004, -76822, -153744, 143813, -22837, -48086, -69094, 12735, 128019, 182573, -192186, -47718, 138128, -94512, 134254, 76103, -80237, -1609, 330230, -26870, 372573, -239760, 131058, -19021, -7132, -15818, -237005, -90503, -73117, 168957, -63180, 354889, 218488, 17954, -209849, -84407, -92430, -64060, 105356, -260393, 197906, -44661, -89307, -32920, 190812, 95851, -208747, -405558, -96247, 131089, 176926, 31555, 109297, 128454, -309595, 11267, 90237, 239453, 186715, -65422, 53989, 31787, -179855, -319556, -68047, -156126, -23007, -156545, 19156, 315808, 87926, -201881, 313971, 12748, 3025]
18007A97506j7960J79484A57195b20551J6025A08126I449K61220c8907j03999
17997a42906C79811a82888H3052D808c5027j47332D78661a55111n1350D0205c01809
17985A36040A0361P1480A7700a83262B5294c8065C08763A23788a87995F3893b2354
17973A67307J11741a73950A9503l403B995a10357I1373O7736G6186a06605g678
17961E6624R2352b69971A44641a18907r2976b9488E0385c32222a37543E7285N3848
17950A11133K75362a32336B00380i219A71291b42113C40102b05333B19241A05158
17939F0369I239M0686J93605H6800g898C13794D0602a3770o4954A58568j5777
17928A42791a8781k99577A6432J56547a24088a2515j4330j89874N6089A60642
$$ y = [197506, 179546, 359030, 157195, -220551, -204526, 108126, 9449, 270669, -38907, -142906, 379811, -182888, 83052, 4808, -35027, -182359, 478661, -155111, -206461, 40205, -301809, 136040, 10361, 81841, 17700, -183262, 25294, -38065, 308763, 123788, -187995, 63893, -22354, 167307, 279048, -173950, 19503, 16100, 2995, -110357, 91373, 159109, 76186, -106605, -7678, 56624, 148976, -269971, 144641, -118907, -211883, -29488, 50385, -332222, -137543, 57285, 111133, 386495, -132336, 200380, -9219, 171291, -242113, 340102, -205333, 219241, 105158, 60369, 9239, 49925, 243530, 86800, -7898, 313794, 40602, -13770, -78724, 158568, 142791, -18781, -318358, 16432, 172979, -124088, -12515, -26845, -216719, -160630, 160642]
17917b58046B16726r3441B9947o121J12968l9145k2957f9893G3253J32046r8448
17906A06851m817a87089D4207a04011A50746K37588E6369J71366c85192B99239
17895a44183B5857K1761Q4456J18553a5667j66542I1647d779A29296m4459a89134
17883b1524j69815A46857a50938b7716B07358D4887N2976K4770K00017k5415D7709
17871A04520J94120e0261J0554A63955J08912a30951k18822H8348a4200j75117
17861a89317A53824J39461a44124A87939e1782A21361b69696C1464J37000H3287
17850a19129F4465M04236A66002E0159Q3524b24534j81754B85995g471k49448
17840b56919F1688M1493J24245a95000A8005g5550I2890J12448L6474b80522f981
$$ y = [-258046, 216726, 123285, 29947, 23826, 136794, 97649, 74692, -69893, 73253, 205299, 106851, 102034, -187089, 44207, -104011, 150746, 388334, 56369, 227735, -385192, 299239, -144183, 25857, 47618, 132074, 250627, -15667, -182209, 91647, -4779, 129296, 84837, -189134, -21524, -191339, 146857, -150938, -27716, 207358, 44887, 97863, 122633, 322650, 297235, 47709, 104520, 298640, -50261, -39707, 163955, 272867, -130951, -349773, 88348, -14200, -189317, 153824, 293285, -144124, 187939, -51782, 121361, -269696, 31464, 168464, 83287, -119129, 64465, 468701, 166002, 50159, 133683, -224534, -406288, 285995, -7471, -256919, 61688, 103181, 227426, -195000, 18005, -75550, 92890, 205338, 241812, -280522, -6981]
17828a5722j98219B30216j06705m094a3169A71916c4875k77578d712k18045B39824
17816b98153H3258L60860C9248a72526B2390L61736d41510i4602d3836E1348b6346
17804B72508A15668a22554d3451B0278J35021N5783f8891A67104l5129b07575
17793D023J79918c27356c640H8460j8429a23876A25462J44658i302H955b43935
17781B00793o2396j3747b8460k02300R2769f1128A20686a1577F7290a37587C12734
17769I7549D4806J91029a48075A86828E5168L06364c6875A36381K21325M0622
17759C98328c021A24305i2125A34674c8953k71984B73789d3484j16805A5588J57183
17748A72771G9376M0447e1687D59649A53981R8998K26942e0667A69056d151B32962
$$ y = [-15722, -213941, 230216, 123511, 119417, -13169, 171916, -34875, -312453, -4712, -222757, 239824, -298153, 83258, 444118, 39248, -172526, 22390, 384126, -441510, -94602, -43836, 51348, -26346, 272508, 115668, -122554, -43451, 20278, 155299, 211082, -68891, 167104, 131975, -207575, 4023, 183941, -327356, -3640, 88460, 70031, -123876, 125462, 270120, -9302, 8955, -243935, 200793, 138397, 124650, -28460, -230760, -137991, -61128, 120686, -11577, 67290, -137587, 312734, 97549, 44806, 235835, -148075, 186828, 55168, 361532, -36875, 136381, 357706, 398328, -3021, 124305, -92125, 134674, -38953, -310937, 273789, -43484, -160289, 15588, 172771, 79376, 119823, -51687, 459649, 153981, 252979, 479921, -50667, 169056, -4151, 232962]
17736A46100m9743r813i7303J7701B35227i6418B9339L0011g3648A61166L5006
17725A96172a24366j76593A66539e6474I9917a367B32572j15484J15615c8534
17714F6693J09596c64116F1523J83832l151R2785k4839a66293A14926P5603C5226
17702B56367a24651B69639A09720d7531A32948k0218D9795A7481J79580K2089
17692B19150m8187D5751J73472A4415J71488j446D8340L6595L58789a0460A72157
17680C48154j73682q2300D3716R6791a11055F8931P4613l4524D9059B2791L82470
17669D05261G362L46560I9617K15201j25268B4265K23506a20952c6052n2811A53094
17657a60272E0273K98127r7969J47844H3382P7234p0451i7713E75069A32729d11135
$$ y = [146100, 96357, 86544, -97303, -79602, 235227, -96418, 29339, 59350, -73648, 161166, 196172, -124366, -300959, 166539, -56474, 99917, -1367, 232572, 117088, 232703, -38534, 66693, 176289, -364116, 61523, 245355, 242204, 334989, 310150, -166293, 114926, 190529, 35226, 256367, -124651, 269639, 109720, -47531, 132948, 112730, 49795, 17481, 197061, 219150, 170963, 45751, 219223, 14415, 185903, 184457, 48340, 84935, 443724, -10460, 172157, 348154, 174472, 92172, 43716, 140507, -111055, 68931, 143544, 109020, 49059, 22791, 405261, 7362, 353922, 99617, 314818, 189550, 24265, 247771, -120952, -36052, -88863, 153094, -160272, 50273, 348400, 250431, 398275, 83382, 160616, 90165, -97713, 575069, 132729, -411135]
17645C54452j04335A17573E220Q8902K5731l2590l1494J57720G0296L3603K5804
17634A29703k7597b6306B11999I587J71802R7571O0383b85494A4133e9408A18940
17622H8524i7295A26570A0966M2055J17262j1416a68416A47272J30919k4693F7690
17610A34663J60395A38674D6181L33661q0128j15356q1594C8449J85738m0166
17600A84021K27116j99978m3370a40185A70079j5457B2294J95468B0938f7441
17589C95269I1042K59308B8491N3102b28312B27413G8648O6221L3477e7799A8468
17577c1712A05128K50766A28936P9498N1990O1872A34467F7179J31672o4509a34577
17565B90394q5677n0235B5832R2549a31960B55926j19819l2775J18072J5717p9962
$$ y = [354452, 250117, 117573, 5220, 94122, 119853, 87263, 55769, 213489, 70296, 103899, 129703, 102106, -26306, 211999, 9587, 181389, 278960, 339343, -285494, 14133, -59408, 118940, 88524, -97295, 126570, 10966, 53021, 170283, 158867, -168416, 147272, 278191, 253498, 67690, 134663, 295058, 138674, 46181, 379842, 299714, 184358, 102764, 38449, 224187, 184021, 411137, 211159, 167789, -140185, 170079, 154622, 22294, 217762, 20938, -67441, 395269, 91042, 350350, 28491, 81593, -228312, 227413, 78648, 144869, 178346, -57799, 18468, -31712, 105128, 355894, 128936, 208434, 260424, 322296, 134467, 67179, 198851, 134342, -134577, 290394, 204717, 154482, 25832, 118381, -131960, 255926, 136107, 103332, 221404, 237121, 157159]
17554A57159a3613B52884F7941L14793K1385A25500g983A46891J14149n3917L31228
17543E38351j86658a00247B86036J9825A51864K04708o7221A35515L01024j91116
17533B45423p6080J32258M5890A68535D9747L68292J34568q2828L34564K80725
17523A085068J8284l68641K49342l34736r547B83893K53396j68168J49294J38881
17513F57296k85192J36197M53218K9521J4240j35460K20221l67208C50330N08116
17503H58446l62708j16934J34230j58760j50800G1535J42328m8503J25183j44725
17493A45818J45735p8169K2281C6626K92717k1407j6679L2913A0889M80257p0915
17482D20231O0295B25693G4181K33546L55239B38449O8815A15815K96260A92375
$$ y = [157159, -13613, 252884, 67941, 382734, 404119, 125500, -7983, 146891, 261040, 207123, 538351, 351693, -100247, 286036, 305861, 151864, 356572, 289351, 135515, 436539, 245423, 169343, 301601, 347491, 168535, 49747, 418039, 552607, 469779, 804343, 1085068, 1103352, 734711, 984053, 649317, 639770, 283893, 537289, 369121, 518415, 657296, 372104, 508301, 961519, 991040, 1005280, 869820, 1090041, 722833, 350330, 858446, 495738, 378804, 513034, 354274, 203474, 71535, 213863, 165360, 290543, 145818, 291553, 213384, 235665, 36626, 329343, 307936, 291257, 324170, 10889, 491146, 420231, 480526, 225693, 74181, 307727, 662966, 238449, 307264, 115815, 412075, 192375]
17471C83739I6377N71836C01178j27911L24724j50369O8659r5237A30732J17502
17461B48234J8805K34761j24961A57312c0178C70738J72677B37415J13929h8211
17450G0551N4223J89548K38865j11713A14139B9264L46120J90426J28351k21610
17440D72551j59041J62744j80824p0860K10973Q5296m874k08828O5553k0999J39715
17429D91406I7731L30378N6158j60282N05025k64366A91735a41094C96584J35130
17419E31714k10141b8515A38386L32191A68143P9565J99298k10100K25526j09398
17409C53034r7513J18462m9669L5580n6382j17938L0248M8286d6270F19209B3957
17397C94878k9038j62384Q6599o7031b8355j43847B90205K16088p4123J2450J07416
$$ y = [383739, 96377, 668213, 301178, 173267, 497991, 347622, 416281, 321044, 130732, 248234, 267039, 501800, 376839, 157312, -30178, 370738, 543415, 237415, 351344, -88211, 70551, 124774, 314322, 553187, 441474, 114139, 29264, 375384, 565810, 694161, 472551, 313510, 476254, 295430, 224570, 435543, 520839, 515965, 307137, 372690, 351691, 491406, 97731, 428109, 484267, 323985, 829010, 564644, 191735, -141094, 396584, 531714, 321573, -28515, 138386, 470577, 168143, 247708, 447006, 236906, 462432, 353034, 255521, 373983, 324314, 359894, 303512, 185574, 215822, 264108, -46270, 619209, 23957, 394878, 365840, 203456, 290055, 223024, -28355, -172202, 290205, 506293, 432170, 444620, 552036]
17386E52036B13550R4361A2006M53552j56736A24437M28145A20187J1572J26203
17376B57962J12397K9924r1566J19181n4429A54964L65114k04031J4485A33281
17365d332B93971F0452M4950B7635K24397h1664D21018B00838J79593J9694A44944
17353B98821q6112J14669N9705j75284J31970A41081Q2662J89381A94843J87707
17343C82550J7538C7906K46012o3461J62898j87731J08498l2016P0425M4634F6124
17331H1047J56142J4504F1329N44764f7490F2759e299D92472K0899A97725J22707
17320C20432j51852J15611H1053R6730l8094M15246B52008K22393A02785J25925
17310B28710e2078D61624o1440R3022P6760p0712n4108K7684j15318j8866J43186
$$ y = [552036, 213550, 307911, 12006, 465558, 308822, 124437, 552582, 120187, 131759, 257962, 370359, 400283, 308717, 427898, 373469, 154964, 520078, 316047, 330532, 133281, -4332, 293971, 60452, 105402, 27635, 252032, -81664, 421018, 200838, 380431, 400125, 144944, 298821, 212709, 327378, 387083, 211799, 343769, 141081, 223743, 413124, 194843, 382550, 400088, 37906, 283918, 220457, 383355, 195624, 304122, 272106, 342531, 387165, 66124, 81047, 237189, 251693, 61329, 606093, -67490, 62759, -5299, 492472, 513371, 197725, 320432, 168580, 284191, 81053, 177783, 139689, 554935, 252008, 474401, 102785, 228710, -52078, 461624, 400184, 493206, 569966, 499254, 445146, 472830, 357512, 338646, 481832]
17299D81832k21580K40282j65029b5969C27041j14863K49980L766n0063r2449
17289C23412A14599J75330j33319K57159A82210K2686Q7397L11843H9425L02900
17279C92325q0284A6828K86716m9618L1240n9906o2186Q1221b19107J04056B04824
17267D62527k7398A74776M984H7997M81584q2768j44619K03854j62115L4266l541
17256D14658D2974M21532o8324J4786j53144A09933L73179F7373L63360r7610
17246C33123J12445K5166B21811K17518n6101K80092l7086D0004L72871j68315
17236B44560K34100j58920J30926K99294l02725P2890n3718J4349j42779J90846
17226E28823j08758j71016J57055K44322d8192D96420p2315k00219K90140J31371
$$ y = [481832, 260252, 500534, 335505, -25969, 327041, 212178, 462158, 465924, 415861, 323412, 114599, 289929, 156610, 413769, 182210, 204896, 292293, 604136, 89425, 392325, 312041, 16828, 303544, 253926, 285166, 225260, 163074, 244295, -219107, -115051, 204824, 462527, 435129, 174776, 179760, 87997, 569581, 486813, 342194, 546048, 383933, 418199, 414658, 42974, 464506, 396182, 410968, 257824, 109933, 483112, 67373, 430733, 333123, 445568, 470734, 221811, 439329, 383228, 663320, 626234, 40004, 412875, 244560, 478660, 319740, 450666, 749960, 447235, 520125, 466407, 480756, 337977, 528823, 420065, 249049, 406104, 650426, -48192, 496420, 424105, 223886, 514026, 645397]
17216F45397B77161J85179j51546J62480B19605J74821J81775L14546l84330m151
17206E02266B23268K97656K42466B85932j9886J95301A60074L41305A24950K34568
17196C59518j1766p9423N2330j28K62960j91215j46891K20943q9119J06932r3160
17185C90981L89242N6625l77275J06648K29807k78386J8466j28238j95513L91442
17175F03799j07576B23065J53603L38538B21946L64710Q6983k6914j6105r0947
17165E39673j94612J21173J34364K08699k43665q9131k1402n8082M69247B13667
17154F08040J13422m5752O1226A80877M05854j31079j54042k9280N74699k63839
17144E83190j32007J04067j78223J55516o826J30885l24977K13416p1852M28477
$$ y = [645397, 277161, 462340, 310794, 473274, 219605, 394426, 576201, 890747, 506417, 502266, 223268, 520924, 763390, 285932, 266046, 461347, 160074, 501379, 124950, 359518, 347752, 268329, 320659, 320531, 583491, 392276, 245385, 466328, 377209, 484141, 390981, 780223, 836848, 459573, 566221, 796028, 517642, 536108, 407870, 212357, 603799, 496223, 223065, 376668, 715206, 221946, 586656, 673639, 646725, 630620, 539673, 345061, 466234, 600598, 809297, 565632, 476501, 455099, 397017, 866264, 213667, 608040, 721462, 675710, 736936, 180877, 586731, 455652, 301610, 272330, 847029, 583190, 451183, 555250, 377027, 532543, 525717, 656602, 331625, 545041, 473189, 901666]
17134I01666D25677N0577P0163j63151J19417K10782j18666k07427O1739o0631
17124C88480K49815j39300J82752J49330R8170j97560j95130J97158k10194L73934
17114H97455j83880j18120j27672Q0504P633L5659K91540r911l7500J2832l31574
17103E16966J56175J52314l03804K6260K95243k0545j41991k00131J37198K26302
17093H43987l54297o9363J65699K18832l82437O00006D72916K63100m1247Q1199
17083G75968p9222r0354L5043K80947m55694L12902J66260j23536j28668p766
17073F85880J2085K56711L6575l20164K56388R5031m71159N64765m26959l3444
17063F55709K76047k2494J29150k98974K45676L561k50368P330L97412j97958
$$ y = [901666, 425677, 476254, 546417, 383266, 502683, 713465, 594799, 387372, 449111, 388480, 638295, 498995, 681747, 831077, 929247, 731687, 536557, 733715, 523521, 897455, 713575, 595455, 467783, 548287, 555920, 591579, 883119, 873208, 835708, 848540, 516966, 673141, 825455, 521651, 547911, 843154, 822609, 680618, 480487, 617685, 843987, 489690, 420327, 586026, 804858, 422421, 1022427, 472916, 736016, 694769, 775968, 696746, 606392, 641435, 922382, 466688, 779590, 945850, 822314, 693646, 685880, 697965, 954676, 991251, 671087, 927475, 1022506, 551347, 1116112, 689153, 655709, 931756, 909262, 1038412, 739438, 985114, 988675, 738307, 745637, 1143049, 945091]
17053I45091O8970q0054n9467N3183K32031k72320l7777L86855k95444p8890K2126
17042H84304O3521K68805l05205l31175M41174n6062J46120j74296P2809K80492
17032A290487n1642j49463M3321j29174l7488j10435M08706q5782j62287k02444
17022H13799N38746j35695j3939l2992j59867J15826j27187L74303k17303m6833
17012A108858R6822N239q2711K38262o6194q8813K22848j87542p4069J37096R6919
17001A406715j42537l61726L06821q2376j3094j16460M22573K04329j49925J66256
16991A640576m1813l45137J4848K71453n21330N67548j55719L89947n37091J74330
16981A457612K02582p3895j22164p8822j73269M30166K4251k36218K56580K0877
$$ y = [945091, 1014061, 934007, 874540, 927723, 1159754, 887434, 849657, 1236512, 941068, 862178, 884304, 947825, 1216630, 911425, 580250, 1021424, 965362, 1111482, 937186, 1009995, 1290487, 1238845, 1089382, 1132703, 1003529, 966041, 855606, 1264312, 1178530, 1016243, 813799, 1352545, 1216850, 1202911, 1169919, 1010052, 1125878, 998691, 1372994, 1155691, 1108858, 1205680, 1210919, 1128208, 1366470, 1300276, 1211463, 1434311, 1246769, 1172700, 1309796, 1406715, 1264178, 902452, 1209273, 1126897, 1113803, 997343, 1419916, 1624245, 1474320, 1640576, 1598763, 1253626, 1268474, 1539927, 1018597, 1586145, 1430426, 1820373, 1283282, 1457612, 1660194, 1586299, 1464135, 1385313, 1212044, 1642210, 1666461, 1430243, 1686823, 1707700]
16971A707700k01064K42219j84966J40511j67726L23646k63936q0193J81397M6023
16961A743611j11751K40371m99627L92112n4493Q8804J39687Q4368k0626O2254
16951B064710k16016j50967J19672K53107j94723Q2689o8279r2184J39392j01328
16941A836073L9942n3197M77785l80494r8219M61809k24660R6801l46629N99759
16931B408970l36610K63573q3956L17892k47094O6931O816K3386j16167j16234
16921B187507M56740m06329J55828j87708K11675J48447p1970K88466l04462N83179
16911C061373l08038n627J09575j24869n3793M1152J80630O0528N1693k28788
16901B783836Q0704L25519j06147L58654j77453Q0438k75872m2796J96106J78428
$$ y = [1707700, 1506636, 1748855, 1563889, 1704400, 1536674, 1860320, 1596384, 1516191, 1697588, 1743611, 1631860, 1872231, 1372604, 1764716, 1710223, 1799027, 1938714, 2023082, 2002456, 2064710, 1848694, 1697727, 1817399, 2070506, 1875783, 1958472, 1890193, 1798009, 1937401, 1836073, 1876015, 1822818, 2300603, 1920109, 1821890, 2283699, 2059039, 2155840, 1809211, 2408970, 2072360, 2335933, 2251977, 2569869, 2322775, 2389706, 2396522, 2419908, 2303741, 2187507, 2644247, 2237918, 2393746, 2206038, 2417713, 2566160, 2494190, 2782656, 2478194, 3061373, 2753335, 2747708, 2857283, 2732414, 2678621, 2719773, 2900403, 2960931, 3012624, 2783836, 2864540, 3190059, 3083912, 3442566, 3265113, 3345551, 3069679, 3026883, 3222989, 3401417]
16891C401417K02958l50805J09040J72701l21165N72353k76264J2701j7310l889
16881C501737N97271l22131M44021k37385k44237M40856j74679L46366k98224
16872D053595j8109l6818P88575k71445m6629q4416n8015M09791K98665n38826
16862D496368M24813j41658J3583J83674k04659o8842M80588M3298L44652n3377
16852E518440j95150K52415M8758J70216j03699L68375M4982J06037J54534K73422
16842F638330k94669K08474r3682M26905j46480K54109O2128O3952O1903L29018
16832G509988P0626L21435l36850L69451K25871j67697L11743J34553K96091J60285
16822H895496R0013P1991K46355l422K63608M42513N5687Q5791K26856J39757
$$ y = [3401417, 3604375, 3253570, 3362610, 3535311, 3214146, 3786499, 3510235, 3522936, 3505626, 3501737, 4099008, 3776877, 4220898, 3983513, 3739276, 4180132, 4005453, 4351819, 4053595, 4035486, 3998668, 4787243, 4515798, 4469169, 4384753, 4326738, 4736529, 5035194, 4496368, 4921181, 4779523, 4793106, 4976780, 4772121, 4703279, 5183867, 5227165, 5571817, 5518440, 5323290, 5575705, 5624463, 5794679, 5690980, 6059355, 6104337, 6210374, 6364908, 6638330, 6343661, 6552135, 6458453, 6885358, 6738878, 6992987, 7055115, 7119067, 7180970, 7509988, 7580614, 7902049, 7565199, 7934650, 8160521, 7992824, 8304567, 8439120, 8735211, 8895496, 8985509, 9057500, 9303855, 9300433, 9564041, 10006554, 10062241, 10148032, 10374888, 10514645]
16812A0514645K08122K91170K81416L12043r1277M74519K02920J45284N03330
16803A2842172J042N95969K24054K15096L32115N30701L3250J53422O92154J54025
16793A5774000O56643N79607L27000K27987K64793P03153J42742R06664Q67986
16784B0450575K31631J34539Q29992N76924Q11565L38963P38330O88239N86213
16775B5386971O74449P64827Q96464R46022Q91078P35000P10787J205227J301953
16766C3512778N45771J451709J059054J194048J154087J268730J481490J651174
16758D3318841J292993J725245J608521J165482K257303J533868J900441K212349
16750E7015043J858807K334364K167804K130661K571772J972433K433881K603026
$$ y = [10514645, 10722767, 11013937, 11295353, 11607396, 11516119, 11990638, 12193558, 12338842, 12842172, 12843214, 13439183, 13663237, 13878333, 14210448, 14741149, 14774399, 14927821, 15619975, 15774000, 16430643, 17010250, 17337250, 17565237, 17830030, 18533183, 18675925, 19582589, 20450575, 20682206, 20816745, 21646737, 22223661, 23035226, 23374189, 24112519, 24800758, 25386971, 26061420, 26826247, 27722711, 28668733, 29559811, 30294811, 31005598, 32210825, 33512778, 34058549, 35510258, 36569312, 37763360, 38917447, 40186177, 41667667, 43318841, 44611834, 46337079, 47945600, 49111082, 51368385, 52902253, 54802694, 57015043, 58873850, 61208214, 63376018, 65506679, 68078451, 70050884, 72484765, 75087791]
16742G5087791K511883K945395K497279L216241K643129K461877K621100K676170
16734I6660865K699125K915271K226596K738439K359726J970711K120981J585065
16726A15276779J294695J359513J271686M62897N18648R4836m30559m28723j013671
16717A18406101j081454j152431j761230j694691k142203k015099k696701k501467
16709A03360825k345876l033170k649942k820853l111016k578437l058179k431551
16701H1331801l190033k405901k691280k568048k485132k749836k204315k146356
16693F0890900k200475k060133k175263j644128j994214j996153j560109j725533
16685D5534892j500149j760737j279146j527255j339174j324895j308460q90898
$$ y = [75087791, 77599674, 80545069, 83042348, 86258589, 88901718, 91363595, 93984695, 96660865, 99359990, 102275261, 104501857, 107240296, 109600022, 111570733, 113691714, 115276779, 116571474, 117930987, 119202673, 119665570, 120184218, 120279054, 119848495, 119419772, 118406101, 117324647, 116172216, 114410986, 112716295, 110574092, 108558993, 105862292, 103360825, 101014949, 97981779, 95331837, 92510984, 89399968, 86821531, 83763352, 81331801, 78141768, 75735867, 73044587, 70476539, 67991407, 65241571, 63037256, 60890900, 58690425, 56630292, 54455029, 52810901, 50816687, 48820534, 47260425, 45534892, 44034743, 42274006, 40994860, 39467605, 38128431, 36803536, 35495076, 34604178]
16677C4604178j152767j580597q09677o14788j113469q96539j034968p16965j018150
16668B5666258o60858q71758o92143k14834r82365r85850k96181o09998n75437
16659A9776834m29896n86466q11090K27807j202731R7524o65123k14347n06301
16650A5686211m74746p5306n42894n01246o5986o07172j8367m98468l29910j07398
16640A2464718l35408m03920q0028k44530l05360j51136l84080j20432m85430
16631I954394j15737k22677j65838k20556k71919l5476Q1619l20426l07184k72948
16621H103252L0132j9914o68374K87574p3645m18700M07469o95218l1301j12202
16611F809073k09890J47979k07834k25087l5241L7828l74811K88983n42263K01195
$$ y = [34604178, 33451411, 31870814, 31061137, 30446349, 29332880, 28436341, 27401373, 26684408, 25666258, 25005400, 24133642, 23441499, 23226665, 22244300, 21258450, 20962269, 20352271, 19776834, 19346938, 18760472, 17949382, 18177189, 16974458, 17071982, 16406859, 16192512, 15686211, 15211465, 15136159, 14593265, 14092019, 14026033, 13418861, 13400494, 12902026, 12572116, 12464718, 12129310, 11725390, 11645362, 11400832, 11095472, 10944336, 10560256, 10439824, 9954394, 9838657, 9615980, 9450142, 9229586, 8957667, 8922191, 9003810, 8683384, 8376200, 8103252, 8133384, 8113470, 7445096, 7732670, 7659025, 7240325, 7647794, 6952576, 6921275, 6809073, 6599183, 6747162, 6539328, 6314241, 6279000, 6316828, 5942017, 6231000, 5688737, 5889932]
16601E889932j30467o50962K79383r0430k09198K12634k05265Q7236j84780n9836
16591D938247n5659J23068m41461K02666l5501m04031K36068k27671Q0534j74234
16581D242026J11468O3455l45455J04533m57623K35684M5642l43122n7348K17966
16571C817226j64725O2364R779j41816p5577K8926l42771K52366k70371J60354
16561C335755k29003J44549J3177m3555k25152M3911O1380j47125l44787J66500
16551B775650j27997L04273K01101m78408k61014K64385L9322m0565J24772j27322
16541B674197P10K2445k75431N032J31828l03797J32882k37536N755o3091J89185
16530B282179j19053J27526j92155J17206J094j28348O1841J2180l33615K4845
$$ y = [5889932, 5759465, 5108503, 5387886, 5297456, 5088258, 5300892, 5095627, 5182863, 4998083, 4938247, 4882588, 5005656, 4564195, 4766861, 4731360, 4327329, 4563397, 4335726, 4416260, 4242026, 4353494, 4416949, 4071494, 4176027, 3718404, 3954088, 3999730, 3656608, 3599260, 3817226, 3652501, 3714865, 3724644, 3582828, 3507251, 3536177, 3193406, 3445772, 3175401, 3335755, 3106752, 3251301, 3264478, 3220923, 2995771, 3039682, 3101062, 2953937, 2609150, 2775650, 2647653, 2951926, 3153027, 2674619, 2413605, 2677990, 2717312, 2676747, 2801519, 2674197, 2674907, 2697352, 2421921, 2426953, 2558781, 2254984, 2387866, 2150330, 2156085, 2092994, 2282179, 2163126, 2290652, 2098497, 2215703, 2216797, 2088449, 2150290, 2162470, 1828855, 1853700]
16520A853700K54401O0417k86444J68731K4476k77363P5722L6580l1915K35940
16510B114245k20099j39670O4941J10302o9087m2629j0104j12726J59875l1115
16500A823933L01807m68212l88753L05965K22264l28914K59892o2957j47504q284
16490A509237K20953k4128k49691m3691l057j73708Q5443L00586k38283k0486
16480A363175k73467K78865O3355J4712L9158j37162O781J89490r0148j22797
16470A331962j30004k42041L82092k79410J39082J9058J24431R4635l21920J97552
16460A315437j09901K82581n26183r2432L68726N8793l08287J16093J76566k97926
16450I83467J17667l17444L15182k58642R800K68413q5966j60553J08248R7161
$$ y = [1853700, 2108101, 2168518, 1882074, 2050805, 2075281, 1797918, 1873640, 1910220, 1878305, 2114245, 1894146, 1754476, 1819417, 1929719, 1860632, 1818003, 1807899, 1695173, 1855048, 1823933, 2125740, 1657528, 1268775, 1574740, 1797004, 1468090, 1727982, 1665025, 1517521, 1509237, 1730190, 1706062, 1456371, 1412680, 1409623, 1235915, 1321358, 1621944, 1383661, 1363175, 1089708, 1368573, 1431928, 1446640, 1485798, 1348636, 1355417, 1544907, 1454759, 1331962, 1201958, 959917, 1342009, 1062599, 1201681, 1220739, 1345170, 1439805, 1117885, 1315437, 1205536, 1488117, 961934, 869502, 1238228, 1297021, 988734, 1104827, 1281393, 983467, 1101134, 783690, 1098872, 840230, 850030, 1118443, 1032477, 871924, 980172, 1077333]
16440A077333J13659M7527m54793L01548m24465L11685R9571J35712l33587j34176
16430G40014l5789M15269n4189K0996M092j31776j28755Q973K09946j51553k07866
16419F89362K86501m9650J62565l36854K99583k1993j84150R226Q0605R3509k12105
16408H16599P1271K47488m00661J31958k4517j73133L08826C68953M32623k38578
16398E62998K48121k94756J85918j7791K96709D45206M28828n0892j47770J43919
16388H19291O0690N6121j62053l61736L54453R1516m9036r0633k97785J73285
16378E94113R9322L37714k65583J17678p3997l73815J52523J51002N6529k08526
16368E86960o819J16183k40799R9196J20264k07053k28944J69704M21255C80947
$$ y = [1077333, 1190992, 1238519, 783726, 1085274, 660809, 972494, 1072065, 1207777, 874190, 740014, 704225, 1119494, 1065305, 1086301, 1090393, 958617, 829862, 838835, 1048781, 897228, 689362, 975863, 926213, 1088778, 751924, 1051507, 1029514, 845364, 854590, 935195, 1028704, 816599, 887870, 1135358, 734697, 866655, 842138, 669005, 977831, 368953, 801576, 562998, 811119, 516363, 702281, 684490, 981199, 445206, 874034, 823142, 675372, 819291, 879981, 936102, 774049, 412313, 766766, 858282, 809246, 718613, 420828, 594113, 693435, 1031149, 765566, 883244, 809247, 435432, 587955, 738957, 795486, 586960, 580141, 696324, 455525, 554721, 674985, 467932, 238988, 408692, 829947, 380947]
16357H25498l37957j19492J86533j95965J06660J9713j34070K45331O4918B74059
16346F08578B08382K55224o9854J74848J15387l09181J8079O1271p8740J26421
16336E01837n727k24500J95488N3333J07081A43606K49074j14704J88586j83857
16326B82705J51212K15457G4123J49581K87527A56188J80675J06064L3410n5326
16316D21011j06471O2027j6749p2149J37628A82627K37389A99882J33744N1203
16306C84829Q4240A66303L47287J7523G9656M06009k22850K99664k25542j10310
16296B26627E7694O27009A48397m9732K36653C2817K99832c8901B04653j5727
16286A88926L24305A59395J21283K69746A57700M08668B22581J83855p2392Q6332
$$ y = [825498, 487541, 368049, 554582, 358617, 465277, 484990, 350920, 596251, 661169, 274059, 608578, 208382, 463606, 393752, 568600, 683987, 374806, 392885, 454156, 375416, 501837, 496110, 271610, 467098, 520431, 627512, 143606, 392680, 277976, 466562, 282705, 433917, 649374, 74123, 223704, 511231, 156188, 336863, 442927, 476337, 421011, 314540, 376567, 359818, 287669, 425297, 182627, 420016, 199882, 333626, 384829, 469069, 166303, 513590, 531113, 79656, 485665, 262815, 562479, 336937, 226627, 57694, 684703, 148397, 98665, 335318, 32817, 332649, -38901, 204653, 188926, 513231, 159395, 280678, 550424, 157700, 566368, 222581, 406436, 334044, 420376]
16276D20376K71692F2782J92359e720D05518o9900J56330p4358p574A69216k2750
16265A46466N22325k30356B13006R5808q4745J60195j62858j7209L28617I5679
16254B61677A17009J59238D1601Q363a7852C36078q6296J99748B0434K15309J28301
16243C64044j28002d1199D44367q1910a19062E65912k23373K4623n2915m3191
16233B71056P2706A71540K27884A40125e3692C52699o2541a29090C23776R290
16223C33066j49069K72097F6634i5637B70187j07876F4838P1556a04989A52192
16212A75238K30614A06586K33617j05402N6386J43806A64040a26121C15429J6188
16202C31617k2128j09322J46138M6296l2968r6254J50097I4232L93863A87727
$$ y = [420376, 692068, 62782, 255141, -5720, 405518, 335618, 491948, 417590, 410016, 169216, 146466, 668791, 438435, 213006, 308814, 224069, 384264, 221406, 204197, 532814, 95679, 261677, 117009, 276247, 41601, 49964, -17852, 336078, 249782, 449530, 20434, 235743, 364044, 236042, -41199, 444367, 362457, -119062, 565912, 342539, 367162, 314247, 271056, 343762, 171540, 399424, 140125, -53692, 352699, 290158, -129090, 323776, 333066, 183997, 456094, 66634, -95637, 270187, 162311, 64838, 136394, -104989, 152192, 175238, 405852, 106586, 340203, 234801, 291187, 434993, 164040, -126121, 315429, 331617, 309489, 200167, 346305, 392601, 359633, 263379, 413476, 94232, 488095, 187727]
16191B33100L0712M04214A20193p854O4657a4564I4391A7606N60641B70176A2187
16179a383B13996l3142m9503J2504m4165b0419L617C2554M24662D0087J7501M59834
16167E17422D9162L69531A60947M059K01914h4157C15422A06536D9354b36689
16156B25983F6981d2872C3931a25548A33691l2424a40938A17001J53375M942c1715
16144C27312B9231J21441e7726k9016A52620a1016B06453K5610G0783K30641c2091
16132e7867I2520k9650a14403B57096g3462A37317b3092B99188o6351G6839J44731
16121B21570H0675f5474D76627k20833A15620K98970A63412J41420n962j40579
16111A58291a80069A98578L6754N8203L34940F3725R9908m3002B8610K3228K86018
$$ y = [233100, 263812, 668026, 120193, 112339, 176996, -14564, 94391, 17606, 578247, 270176, 12187, -1383, 213996, 180854, 131351, 143855, 99690, -20419, -16802, 32554, 457216, 40087, 57588, 517422, 49162, 418693, 160947, 165006, 366920, -84157, 315422, 106536, 49354, -236689, 225983, 66981, -42872, 33931, -125548, 133691, 101267, -140938, 117001, 270376, 275318, -31715, 327312, 29231, 150672, -57726, -86742, 152620, -11016, 206453, 232063, 70783, 301424, -32091, -57867, 92520, 62870, -114403, 257096, -73462, 137317, -23092, 299188, 232837, 76839, 221570, 80675, -65474, 476627, 255794, 115620, 414590, 163412, 304832, 298870, 158291, -180069, 198578, 235332, 293535, 628475, 63725, 163633, 120631, 28610, 51838, 337856]
16100C37856j40787A2326K31337b75932b4502k18058M1494A05952i7935B05288
16089e5463I8832c51837a02389D7569j6098f925k6715M722B09086l3817b9784
16077A00841b83514C3158M3171i505C23087A60150a05666j33073R5132A56159
16066A41456J72703A06086J94147A3011a35875c2454B82518B4051e4966G6450
16055b3365A35166Q0931F6225J53964r3238a45988M9137j63062b2040j321A82325
16043b43537A74216B9803L7182M6556E6028d7979B84010j20885D9738K45199J02027
16032C96964j27050B1137a263B6623R1601b5864D96286D7636a7599l47019a52344
16020a27693H539a185C400J02451K9529k7439J68R1208E175J40369F4863R9433
$$ y = [337856, 197069, 12326, 243663, -275932, -24502, -242560, -201066, 105952, -97935, 205288, -55463, 98832, -351837, -102389, 47569, 31471, -6925, -33640, -28918, 209086, 175269, -29784, 100841, -283514, 33158, 76329, -9505, 323087, 160150, -105666, -238739, -143607, 156159, 141456, 314159, 106086, 300233, 13011, -135875, -32454, 282518, 24051, -54966, 76450, -23365, 135166, 216097, 66225, 220189, 126951, -145988, -96851, -259913, -22040, -23361, 182325, -243537, 174216, 29803, 66985, 113541, 56028, -47979, 284010, 163125, 49738, 294937, 396964, 269914, 21137, -1263, 26623, 118224, -25864, 496286, 47636, -17599, -364618, -152344, -127693, 8539, -1185, 3400, 105851, 135380, 107941, 108109, 199317, 5175, 145544, 64863, 164296]
16008A64296J13996G2390a57962A47566a44579r4715P0293j71852G155R4253J40598
15997B42006p8217b03457g6203B25058I0139L03929a24072C9936L5946K33938
15987C09820r3542K72824K68531L75046J70642M7443n77838k55783q813F9451
15976A48294a24859D13215H6820g8587K2605k76518A13071B2331K3000a45455
15965c38605B0260K19917m0555G6099e0455A56044c8228A55044a14905A44819
15954h848m1837A7564a50877B4799J06361o5070a72491f0227J742A39384P7936
15943B17320n4359b9807F7541F694P3197b74959a8506j57280A1833N1483J56616
15932B19932f4534b2522B20577n3801n1291J65075B0166a57182d0403A33317g8641
$$ y = [164296, 278292, 72390, -157962, 147566, -144579, -239294, -169001, -340853, 7155, 101408, 242006, 163789, -203457, -76203, 225058, 90139, 394068, -124072, 39936, 75882, 309820, 216278, 489102, 757633, 1132679, 1303321, 1350764, 772926, 517143, 508330, 69451, 148294, -124859, 413215, 86820, -78587, -55982, -332500, 113071, 22331, 45331, -145455, -338605, 20260, 240177, 199622, 76099, -50455, 156044, -38228, 155044, -114905, 144819, -8848, -50685, 17564, -150877, 24799, 131160, 66090, -172491, -60227, -58485, 139384, 217320, 162961, -29807, 67541, 6694, 79891, -274959, -18506, -175786, 11833, 63316, 219932, -64534, -22522, 220577, 166776, 115485, 280560, 20166, -157182, -40403, 133317, -78641]
15920C22885h1991B44620D6354J66248b54880K6272f9990h570j58135G8841a66468
15908e9845J5156E7255a31001A47287h7525j42129l6376L7509a07643A70169n5078
15897A15091h414B17059J07298l3252e01615b06821B73037A19380m916K2751J32786
15886B70001A24592c77366E204a64464A80265c10475a45501a8787j83402J7086
15876a85103L8504L8839n529H0892J0425K60631a3039j79362o3039B23469C5596
15864a95180k17931c8160A24319K09434b03952K1776F1444b5237A83100E1033
15853G2467b27675B96010j38384m2731b03901k760D49607j28797j58159b80650
15842b87200A86349B3660c8824C9550K61788a05552B46287b13367m201g7391A05884
$$ y = [322885, -81991, 244620, 46354, 212602, -254880, -228608, -69990, -8570, -166705, 78841, -166468, -59845, -44689, 57255, -131001, 147287, -87525, -229654, -266030, -228521, -107643, 170169, 115091, -8414, 217059, 324357, 291105, -501615, -206821, 273037, 119380, 114464, 137215, 270001, 124592, -377366, 5204, -164464, 180265, -310475, -145501, -18787, -202189, -185103, -146599, -107760, -113289, 80892, 91317, 351948, -13039, -192401, -255440, 223469, 35596, -195180, -413111, -38160, 124319, 333753, -203952, -182176, 61444, -25237, 183100, 51033, 72467, -227675, 296010, 157626, 114895, -203901, -206661, 449607, 320810, 162651, -280650, -287200, 186349, 23660, -38824, 39550, 301338, -105552, 246287, -213367, -217568, -77391, 105884]
15830c4951p250a4195j75393m1447a959m08697J22196A55110A8619J16736P9841
15819B15196a79117A06974a97544h3261j40187q740A30811c41436J70068k2437
15809a93805A34601K9678b43681I3884M7190b74260B07996M0620h4377o2541L3191
15798a13727a9443j80381F2341M4798B6599M9842d0142E663R1711i0675G3564
15786b65109f4463C134J12821a26617N2926A00726D8436B3004N0493O640i1348
15774a97006H9629K66541g62C5936c3704k62682a21344A44442K41012a74726L0381
15763a44345A73193p1447l8601b66027d9270K1517A53643a89101G7023b2111j12343
15752a34454B1884M0383b26053o697H4565K78351I2055M4874b36627B91725F1089
$$ y = [-34951, -42201, -14195, -189588, -231035, -1959, -410656, -288460, 155110, 18619, 135355, 215196, -179117, 106974, -197544, -83261, -223448, -232188, 130811, -341436, -171368, -193805, 134601, 164279, -243681, 93884, 141074, -274260, 207996, 248616, -84377, -146918, -113727, -19443, -199824, 62341, 107139, 26599, 76441, -40142, 5663, 97374, -90675, 73564, -265109, -64463, 3134, 115955, -126617, -73691, 100726, 48436, 23004, 73497, 80137, -91348, -197006, 89629, 356170, -762, 35936, -33704, -296386, -121344, 144442, 385454, -174726, -144345, 173193, 101746, 63145, -266027, -49270, -27753, 153643, -189101, 77023, -22111, -134454, 21884, 62267, -226053, -232750, 84565, 362916, 92055, 136929, -236627, 291725, 61089]
15740B2955a99397A58543j9505b7392K625E9790d0595C34567I3752d8067M365
15729d3702j16244j77150B12229C2055K11832h6719k30314d7564A67358a55351
15718g9814A59390E4690O3041A5177M7296a49371B91069a1884E37849b60959R5588
15707a65371B1113e0514k2646B95476a76578m48290B39195g7520a2216N413k30015
15696b36818f5171a2039F3477K17392B4077d37065b6900A51530Q1532h6463A40558
15684e3330q6851O9469D0827e8110k8738b973B15580r1047f9550B6844a27658
15672A01923d0152a4173A11403J01919N5090r3565J20521O3351A46011l2649M97
15661A13859g9740l5780C2736b50009h6186B70733b39760C83855b00878q8101
$$ y = [22955, -199397, 158543, 139038, -27392, -24767, 59790, -40595, 334567, 93752, -48067, -43702, -159946, -337096, 212229, 32055, 243887, -86719, -317033, -47564, 167358, -155351, -79814, 159390, 54690, 117731, 15177, 62473, -149371, 291069, -11884, 537849, -260959, -165371, 21113, -50514, -73160, 295476, -176578, -624868, 239195, -77520, -12216, -6803, -236818, -65171, -12039, 63477, 280869, 24077, -437065, -26900, 151530, 233062, -86463, 140558, -53330, -140181, -70712, 40827, -58110, -86848, -2973, 215580, 124533, -69550, 26844, -127658, 101923, -40152, -14173, 111403, 213322, 268412, 174847, 295368, 358719, 146011, 113362, 113859, -79740, -115520, 32736, -250009, -86186, 270733, -239760, 383855, -200878, -288979]
15651b88979f3021k9350j29334F4854b1820l19499k68407D313f1770A24824C5134
15639a70251o3925K404a05243K0154E1554e57969c4863a6056j05008E3377N1177
15628A04554a5070j08760L3396J3471j36157C0155b3096B46451a90338j61052
15618c51390I288c33057i728r8639B65474d32838A33297L5993R8272g2118B72344
15606a66368C2730h3083j2974C5077Q7661d4130j88591e7755A63018n3284i39
15594g2557A30474N6470c5330B55440f0165A73326c82755A13464d7156m9459j83157
15583b79772A7186J13450M5682a10887c460B07563P040g5389j33455j57462J52206
15572b14100B14197I6440i733o9266A726K41232b48366h1391j02080G0563h9496
$$ y = [-288979, -63021, -92371, -221705, 64854, -21820, -341319, -609726, 4313, -61770, 124824, 35134, -170251, -234176, -231772, -105243, -85089, 51554, -557969, -34863, -16056, -121064, 53377, 104554, -15070, -123830, -90434, -76963, -213120, 30155, -23096, 246451, -190338, -351390, 9288, -333057, -9728, -108367, 265474, -432838, 133297, 169290, 267562, -72118, 272344, -166368, 32730, -83083, -96057, 35077, 122738, -44130, -232721, -57755, 163018, 109734, -939, -72557, 130474, 186944, -35330, 255440, -60165, 173326, -382755, 113464, -47156, -96615, -279772, 17186, 130636, 176318, -110887, -3460, 207563, 214603, -75389, -208844, -366306, -214100, 214197, 96440, -9733, -78999, 1726, 242958, -248366, -81391, -183471, 70563, -89496]
15560d2093G8251J34929p1483c88834J35383h6032I4552d4499l27237A21178i0811
15548C11170b82078J08817n2318A59547a7106j20064J086b6732A83281m9940a54822
15536a1762j93119C29639i4289B0270a7320B13858J03701b12542A0059J17602
15526A27661a88260q3146G4270J70743F6811c1725B00411q3797i9144A41122A4431
15514a80118E8290K85667j51478P3039j0926C6353a44859B21937m9186k0568L2281
15503A84464a4512A30253k6483D3364b3868B15257R6267N9151r1436H3673L00502
15492C84175j63959D6940R4619b52107A41712n8222A9517J45763J08775Q2825
15482C56880B411a38715B54677k9369N3073R344a65511A80085l0850N11474k57999
$$ y = [-42093, 78251, 213180, 141697, -388834, -253451, -86032, 94552, -44499, -371736, 121178, -90811, 311170, -282078, -173261, -225579, 159547, -17106, -137170, -136084, -26732, 183281, 133341, -154822, -11762, -204881, 329639, -94289, 20270, -17320, 213858, 317559, -212542, 10059, 127661, -188260, -271406, 74270, 245013, 66811, -31725, 200411, 116614, -99144, 141122, 14431, -180118, 58290, 343957, 192479, 265518, 254592, 36353, -144859, 221937, 172751, 152183, 184464, -14512, 130253, 103770, 43364, -23868, 215257, 311524, 370675, 279239, 83673, 384175, 220216, 46940, 141559, -252107, 141712, 83490, 19517, 165280, 274055, 356880, 2411, -138715, 254677, 225308, 278381, 287725, -165511, 180085, 149235, 660709, 402710]
15471D02710j7948K00947A18486K6747n120O5744l8473h8485k6141B31965a84951
15459a99508r545l05140a92139k9146A70946C0286a64j84003l4854B10781d4987
15447B93422I6481m0079R4691c1725o1412E33078L78122N14636l13898m03540
15437G08398j67379A36319b27449C95473j03131A05425e6540A05620j9940J50811
15427B36491a5325j73743A35855k5965J4627a03821B23610n3224o695c6679C50524
15415A73797K09703B3482N8849M1106E3976b7918A58970a8400C04119A8898R2934
15404A11832r375E0036J84601H5273a52255B25361a71695P587a845G8679i1167
15392A5450N3594J44338e7055C49455I3882A8898L06865c37827B71175p2303c23546
$$ y = [402710, 384762, 585709, 118486, 145233, 140113, 205857, 167384, -88485, -114626, 231965, -184951, -199508, -209053, -514193, -192139, -221285, 170946, 30286, -164, -184167, -219021, 210781, -44987, 293422, 96481, 56402, 151093, -31725, -93137, 533078, 911200, 1425836, 1111938, 708398, 541019, 136319, -227449, 395473, 292342, 105425, -56540, 105620, 85680, 236491, -15325, -189068, 135855, 109890, 124517, -103821, 223610, 170386, 163691, -36679, 350524, 173797, 383500, 23482, 82331, 123437, 53976, -27918, 158970, -18400, 304119, 18898, 111832, 102457, 50036, 234637, 85273, -152255, 225361, -171695, -164108, -1845, 78679, -91167, 15450, 69044, 213382, -57055, 349455, 93882, 18898, 325763, -337827, 271175, 198872, -323546]
15380E0909a76339B28253d4365C05686A02676J63204H4563K30002M49818l06023
15370D58360l457f5059I7669j0826K73781A11202L8197L48413A25281A3468M395
15359A7863K65044J04026H2711J27179n3135R1763a14478c2214Q028A35151a02295
15347D58211A23038K39618F4051K36561E7415M81449R5150B18854K35220j88388
15337B65686m8370L15906j56455a49584A49210K4427J0398F8357K60040m2279
15327B86118A4098J61752J54068M9311A78644d8722C31670j41556b03162A54987
15316a57551a3030A87054l4087M4499A2304L19622K6794C6916r412i2455B7N8813
15304E8840e4214e209B397L4850K11905J9826J14066e4322B3411L21820j35385
$$ y = [50909, -176339, 228253, -44365, 305686, 102676, 265880, 84563, 314565, 764383, 458360, 454903, -65059, 97669, 86843, 360624, 111202, 149399, 497812, 125281, 13468, 17863, 282907, 386933, 82711, 209890, 156755, 248518, -114478, -32214, -24186, 135151, -102295, 458211, 123038, 362656, 64051, 300612, 57415, 538864, 634014, 218854, 454074, 265686, 217316, 533222, 376767, -149584, 149210, 173637, 184035, 68357, 328397, 286118, 14098, 175850, 329918, 379229, 178644, -48722, 331670, 190114, -203162, 154987, -157551, -13030, 187054, 152967, 197466, 12304, 331926, 358720, 36916, 27504, -92455, 27, 58840, -54214, -5209, 2397, 37247, 249152, 268978, 383044, -54322, 23411, 345231, 209846]
15293B09846H4823O6696J10300b50243A09593b97410a5613B2056b46026d4370
15282e6300A0586J6030p252e0989G0676L40248A5434L79862C7495a30855O1484
15271f9371E0505N1526A0570a36937E6306K52110g2577l9838A3658N5714D986
15259i4331A67497h0933B63316P298I9909P5675n0884d0854P712A63960P3418
15248B37378j07207F4292B0955M19563l9613n6193j59739K72108R29345P89359
15238B175785n96843J85755o33611E23985j09832H8736q657K77242D7701J91105
15228B38806c1477l2276F3994b57555D3493N6336a02649A32430P3338h9061k33837
15217c22898a30157F9845J19876a06796B7802a16048p9017p259A47101E3666L1773
$$ y = [209846, 84823, 151519, 261819, -250243, 109593, -297410, -15613, 22056, -246026, -44370, -56300, 10586, 26616, 19364, -50989, 70676, 410924, 15434, 395296, 37495, -130855, -69371, 50505, 102031, 10570, -136937, 56306, 308416, -72577, -112415, 13658, 69372, 4986, -94331, 167497, -80933, 263316, 270614, 99909, 175584, 124700, -40854, -33142, 163960, 237378, 130171, 64292, 20955, 440518, 400905, 344712, 184973, 457081, 1386426, 2175785, 1578942, 1764697, 1131086, 523985, 414153, 88736, 80079, 357321, 47701, 238806, -31477, -63753, 63994, -257555, 43493, 99829, -102649, 132430, 205768, -89061, -322898, -130157, 69845, 189721, -106796, 27802, -116048, -195065, -202324, 147101, 53666, 85439]
15206H5439p750K44316E4718b8127C6951J96315o5605o753m9994b74221a14417
15194A10221A7926J37544C4564J75510K72690k32080p8195J60133q0241n7981
15184A94400M4992b08572J5969I8328L22999b45126C76928A87642K7853O8402
15174B83897i545j30970a3692A43115l790g4164q9122E4665f1907G2029A9660
15162d0870A59998K3863B4398a9170m9288B5714o406d0748A13540R0588B3579
15150B21762e9619C92995f1525j52460D2147L8040N8743h2138F7347J46923D8339
15138d6476B11362G9754J07345J13045k7628j27834L20551o0537D8095J76243
15128B24338e2081A36871M4071L57318A88481L46844B65580J14287m4072L23542
$$ y = [85439, 77689, 322005, 54718, -28127, 36951, 233266, 167661, 160908, 110914, -274221, -114417, 110221, 17926, 155470, 34564, 210074, 482764, 250684, 172489, 332622, 252381, 194400, 239392, -208572, -192603, 98328, 421327, -245126, 376928, 187642, 215495, 283897, -9545, -140515, -13692, 143115, 139325, -74164, -163286, 54665, -61907, 72029, 19660, -40870, 159998, 183861, 24398, -19170, -68458, 25714, 19308, -40748, 113540, 204128, 23579, 221762, -59619, 392995, -61525, -213985, 42147, 80187, 138930, -82138, 67347, 214270, 48339, -46476, 211362, 79754, 187099, 300144, 272516, 144682, 465233, 404696, 48095, 224338, -52081, 136871, 180942, 538260, 188481, 535325, 265580, 379867, 335795, 659337]
15118F59337k59663l2656M2480a6772A42120K34144n7636o4837A21969J88299
15108C10268A32984a25443B89197m115c3115k9476C33459A32015p542J12329A7517
15096A18115K1965b14007A33262L41351A43304k9556K55322a98957A42430b9210
15085b7609B31188I7628d2517C30702F4572J04753D2342K00630p2562m6329b157
15073d3339n6114A31330J1841C7530M6688B5893M11528a9336A44065p1432J07422
15062A80055M12397B64386j24369K7328J55081F0439J26824O6051l1369B1433
15051C24260J16008J36863E8340J87833L39382j01701j26779j76931L66193j99586
15041C46751n6196J62769q4324J9793A59141K94698A80345L8260M52707k03955
$$ y = [659337, 399674, 367018, 409498, -16772, 142120, 376264, 318628, 253791, 121969, 310268, 132984, -125443, 289197, 285082, -33115, -62591, 333459, 132015, 124473, 236802, 17517, 118115, 140080, -214007, 133262, 474613, 143304, 113748, 369070, -198957, 142430, -29210, -27609, 231188, 97628, -42517, 330702, 64572, 169325, 42342, 242972, 170410, 124081, -2157, -43339, -99453, 131330, 143171, 37530, 84218, 25893, 437421, -19336, 144065, 72633, 180055, 592452, 264386, 140017, 167345, 322426, 60439, 187263, 253314, 221945, 21433, 324260, 440268, 577131, 58340, 246173, 585555, 483854, 357075, 180144, 546337, 346751, 290555, 453324, 369000, 388793, 159141, 453839, 180345, 218605, 671312, 467357]
15031D67357m1860O01999k09451n8196j0925l50434M14679l53322A94965E1101
15020E34140K22075k75416p0766J91630k46560o1590M63740l07272P8514q5804
15010D42691n8212M05602B70295J95694k25796K2920k6977H2917M01820o2200
15000D22537K37725j77087j04306Q9951J70050P141k19263A56550N1472K96387
14990E04409r111q9293K72789n7299n7913J59450k39799L43288j19011N2280J28929
14979H88719j67296j80280j44007J36314Q2852m8924m4469j71298M95251C11701
14968D98287N4284J37905j81235a4934D58107j8673a30945c4806C25340J13834
14958D39174r6260r5910L08728k39107J00138e543D91887B36825I3754N7060N24148
$$ y = [467357, 425497, 1027496, 818045, 759849, 748924, 398490, 813169, 459847, 194965, 51101, 534140, 756215, 480799, 410033, 601663, 355103, 293513, 757253, 449981, 528495, 442691, 384479, 790081, 270295, 465989, 240193, 263113, 236136, 82917, 484737, 422537, 660262, 483175, 378869, 468820, 638870, 646011, 426748, 156550, 208022, 504409, 495298, 406005, 678794, 621495, 563582, 723032, 483233, 826521, 707510, 759790, 888719, 721423, 541143, 397136, 533450, 616302, 567378, 522909, 351611, 846862, 311701, 498287, 552571, 690476, 509241, -14934, 458107, 439434, -130945, -34806, 325340, 439174, 342914, 247004, 555732, 316625, 416763, -5543, 491887, 236825, 93754, 150814, 674962]
14947F74962A39484n9761K96066K46525J80586J35340m43381K38811j72664j00034
14937D60972j33941M11810j32284k68713M94870q4008N38677l67512L65002K37618
14927A522491M166k28944O18898r7219j00982j54510P5436j81522M51381j30378
14917A778817M16555J76756l3967j77331p85263O5579j91377m21778m5249P6861
14907H59603l490j87194r7396B30219K33407A00974L23039K95489K1673q1691
14897F59484k73540q150J92575j9473j99593K94818C12581K41690m3290A84295
14886E22990r4308L72017R988O15956o21131L55364n63059M13588k09273J59544
14876I61676m67873O7996o9996j86375n6062K66710P1147B54580O06252l48333
$$ y = [674962, 139484, 79723, 375789, 622314, 802900, 938240, 494859, 733670, 561006, 460972, 327031, 738841, 606557, 337844, 832714, 748706, 1287383, 919871, 1284873, 1522491, 1526657, 1297713, 1916611, 1819392, 1718410, 1563900, 1639336, 1457814, 1909195, 1778817, 2195372, 2372128, 2338161, 2160830, 1375567, 1441146, 1249769, 827991, 782742, 859603, 856113, 668919, 571523, 230219, 463626, 100974, 424013, 719502, 741175, 659484, 385944, 377794, 570369, 550896, 351303, 646121, 312581, 554271, 510981, 184295, 522990, 428682, 800699, 810687, 1426643, 805512, 1160876, 597817, 1011405, 802132, 961676, 493803, 561799, 491803, 305428, 249366, 516076, 587223, 254580, 860832, 512499]
14866E12499J03635K43216M7340k13465j62272K50987k87189j03159L9102k5852
14856D04842M15373j60833B26783K80810M81639m76484K7433j83904J42357Q4310
14846E82944K44089o797M9927J35656K47109j6789L2297n018k77913j61754L8186
14835H61937m1416J39926C94218K29106B45591N21652j50881p8365j37562J56632
14825E57067J412J96021j74854p5584J37821J25917q2193j6135J71537j5652j40456
14814F84901J97120l5753j61816L9168l09836M98934o1833J0195k50023N12860
14804A123917j78416K13040j42487k76746M9441k29579j99955L62845k03343J47594
14794F66311j08654P552o4473m0540K06662m7160o6210J2585K87229K41018k60475
$$ y = [512499, 616134, 859350, 906690, 693225, 530953, 781940, 494751, 391592, 430694, 404842, 820215, 659382, 226783, 507593, 989232, 512748, 540181, 356277, 498634, 582944, 827033, 820236, 870163, 1005819, 1252928, 1236139, 1268436, 1263418, 985505, 823751, 861937, 820521, 960447, 394218, 623324, 245591, 767243, 616362, 537997, 400435, 557067, 558479, 754500, 579646, 504062, 641883, 767800, 685607, 669472, 841009, 825357, 684901, 882021, 846268, 684452, 723620, 413784, 912718, 850885, 861080, 611057, 1123917, 945501, 1158541, 1016054, 739308, 788749, 559170, 359215, 722060, 518717, 666311, 557657, 565209, 500736, 460196, 666858, 619698, 553488, 566073, 853302, 1094320, 833845]
14783H33845k06342m4372Q6997J25529J8481N3050q6159J08439J72159N69k3310
14772A038886l40502K83584k18437O2579J8387l3199K41171l03921l51135L74465
14762G71878j18195O3039r0819k67383L66429j23534O1201J03752p5460J48406
14752H39314j31514J93861p5913L1657k89837j28665M47760J18028j68433l3829
14742H02429k6761J54703J18189k60224l92639N06757N4174k09164K76704j6941
14732A007227j5539l8337L41313M03704J03461O4576j59026J50973j69798p01803
14722I86751l34954K79029k24563M73325l75066J80864m2418Q8344l8544J4778
14712A007546N3105j84959J45817q0652K5733J18293N7554j34447K92320J65729
$$ y = [833845, 627503, 583131, 670128, 795657, 814138, 867188, 781029, 889468, 1061627, 1062196, 1038886, 698384, 981968, 763531, 826110, 844497, 811298, 1052469, 748548, 397413, 771878, 653683, 716722, 625903, 358520, 724949, 601415, 662616, 766368, 690908, 839314, 707800, 901661, 825748, 857405, 567568, 438903, 886663, 1004691, 836258, 802429, 775668, 930371, 1048560, 788336, 395697, 902454, 956628, 747464, 1024168, 1007227, 991688, 953351, 1294664, 1698368, 1801829, 1866405, 1707379, 1858352, 1688554, 986751, 651797, 930826, 706263, 1179588, 804522, 985386, 942968, 1031312, 992768, 1007546, 1060651, 875692, 1021509, 940857, 966590, 1084883, 1142437, 1007990, 1300310, 1466039]
14702A466039K16785K86230K06765r6377n15325m51083J93519j04778k24920o0374
14692I16481j53041K72540j50642o9647J63734k8778J89049k02773J29210M5174
14682A111307j85161R9747M6613k08261J9439j14010K56613q0539K21330j34298
14672A032780K93714m06532L73078m90962J37776K1631L40187m31557L75990n3111
14662A192994j2820n0068j80517J32973J24676l527j23664J56204J2146J92050
14652A440447j03382J19762l60145N5470K18382m33946J50604L53185m03335L34992
14642A372034j63031N9430R1117q6450m60912N95851k03909m2640R5924P8028
14632A335442J78871j82717m4207j23968J3286j87835R7633L88762j93251J71713
$$ y = [1466039, 1682824, 1969054, 2175819, 2079442, 1564117, 1113034, 1306553, 1201775, 976855, 916481, 763440, 1035980, 885338, 815691, 979425, 950647, 1139696, 936923, 1066133, 1111307, 926146, 1025893, 1072506, 864245, 883684, 769674, 1026287, 945748, 1167078, 1032780, 1326494, 919962, 1293040, 802078, 939854, 961485, 1301672, 870115, 1246105, 1192994, 1180174, 1130106, 949589, 1082562, 1207238, 1203711, 1080047, 1236251, 1248397, 1440447, 1337065, 1456827, 1096682, 1152152, 1370534, 936588, 1087192, 1440377, 1037042, 1372034, 1209003, 1268433, 1359550, 1273100, 812188, 1408039, 1204130, 1161490, 1257414, 1335442, 1514313, 1331596, 1287389, 1163421, 1176707, 988872, 1086505, 1475267, 1282016, 1453729]
14622A453729m3954k14916K40939l6240N4856L7467j04998o9876L38806K09046
14612A864859l15565k05685L83438k48216p3566J24684n4303j5528J22760J7933
14602A600811K9478LL21973m65674K29915j15194P643M0385O9812l24894L19831
14591A714089K12643l96537J40984K79167J37548k33295k43914L56220r117l40336
14581A617452M69535k33185K53019k72427P5866J70862K78123j43126j11365m3838
14571B060916J12913K4046M31156k47582J3166Q9875l7938M07716j89340J12242
14561B777170l65709L97186j23756K97140j00043K85096j12700M06802L93350
14552C854536O7673Q16634P93051J760619L695434P987023J9156880O830203B0151562
$$ y = [1453729, 1409775, 1194859, 1435798, 1399558, 1454414, 1491881, 1386883, 1317007, 1655813, 1864859, 1549294, 1343609, 1727047, 1478831, 1405265, 1529949, 1475646, 1460118, 1582878, 1600811, 1630289, 1630292, 1952265, 1486591, 1716506, 1601312, 1608955, 1649340, 1719152, 1394258, 1714089, 1926732, 1530195, 1671179, 1950346, 2087894, 1854599, 1610685, 1966905, 1957788, 1617452, 2086987, 1853802, 2106821, 1834394, 1910260, 2081122, 2359245, 2216119, 2104754, 2060916, 2173829, 2197875, 2629031, 2381449, 2394615, 2484490, 2446552, 2854268, 2664928, 2777170, 2411461, 2808647, 2684891, 2982031, 2881988, 3167084, 3054384, 3461186, 3854536, 3922209, 4738843, 5531894, 7292513, 10987947, 18974970, 38131850, 44962053, 20151562]
14542I094270l918444j511586p05957j61452l37084P01847N23497K417563k158498
14533C944156j250564m45835J07319J38129n18524K26917L10399l23216M54950
14524B643731l06221N31164l86993r4220J08139L94466k80032j1113k3842M20820
14514B995899j92795j66302K75204K4548j97776J71775K55403k14508q0901K31599
14504C102146K0009M3307K173K47366k73406N4546Q9651r9571L20251k21083k6590
14493C258799L2871l6294Q9790M00406n43913K29709K62639N51639l91276j90773
14483C663597K56608j80612L68858M1252K89267l62875j65673M53748j87760J13012
14473D289422k02699L38297j66016K22954j48114K75709j31993J20858J24836
$$ y = [9094270, 5175826, 3664240, 2958283, 2796831, 2459747, 3161594, 3685091, 6102654, 3944156, 2693592, 2247757, 2355076, 2493205, 1974681, 2201598, 2511997, 2188781, 2643731, 2337510, 2868674, 2481681, 2387461, 2495600, 2890066, 2610034, 2598921, 2575079, 2995899, 2803104, 2636802, 2912006, 2936554, 2738778, 2910553, 3165956, 2951448, 2870547, 3102146, 3122155, 3165462, 3167635, 3415001, 3141595, 3196141, 3285792, 3186221, 3506472, 3285389, 3258799, 3291670, 3255376, 3345166, 3745572, 3201659, 3431368, 3694007, 4245646, 3854370, 3663597, 3920205, 3739593, 4108451, 4149703, 4438970, 4076095, 3910422, 4364170, 4176410, 4289422, 4086723, 4425020, 4259004, 4481958, 4333844, 4609553, 4477560, 4598418, 4723254]
14464D723254L12764j78308o3523K06520O6663j89419J60254k82596M80241k4515
14454E211335Q2021l21837N31469j8915M44260l69677j02724K24306l5131L57324
14444F002431j98399K43140k4205M33294m14917n4621N99497k96303K15166P9220
14434F584303M2674L02259l26872M15097M24538j37124K47236j53806k04249J98549
14424G392605K51251L06575j5413K02162L17101M73432j90528L27117k40990N1997
14414H875309K9925K46063o7193J47684L70333j88659P20447k3220k38716O32173
14404A0504146K33503J36602k00490K19190o2679K72480K33434j0726m3593L74797
14394A1656664L68085n7448N02180K84637j12564J15016O99565J11412K69637
$$ y = [4723254, 5036018, 4857710, 4794187, 5000707, 5067370, 4877951, 5038205, 4755609, 5235850, 5211335, 5293356, 4971519, 5502988, 5484073, 5928333, 5558656, 5455932, 5680238, 5645107, 6002431, 5804032, 6047172, 6022967, 6456261, 6041344, 5986723, 6586220, 6289917, 6505083, 6584303, 6626977, 6929236, 6602364, 7017461, 7441999, 7304875, 7552111, 7398305, 7194056, 7392605, 7643856, 7950431, 7935018, 8137180, 8454281, 8927713, 8737185, 9064302, 8823312, 8875309, 8905234, 9151297, 9084104, 9231788, 9602121, 9413462, 10133909, 10110689, 9871973, 10504146, 10737649, 10874251, 10673761, 10892951, 10830272, 11102752, 11336186, 11325460, 11281867, 11656664, 12024749, 11967301, 12469481, 12754118, 12641554, 12756570, 13456135, 13567547, 13837184]
14385A3837184j05232N21066J37568M00834N60902L87260k039M861O64651j65633
14375A6241422N74735L798N81333J76877J00508P25809K96467Q30211L60012K10544
14365B0101716R04274J16832M22512j78981J169591Q0334N17744O93269L80246
14356B4207537M25194P59979O39601L92694O57319L84971R05499O45112J097866
14347C0115772R424J332523O44802O92887J303126N70395O50196J003075J239540
14338C7561740J298131J073264N56562J487403J215110J192747J543198J237437
14330D7165592J467482J594883J202162J766313J629451J974964J626978K101201
14322F0529026K280669J871022K007176L030885J686708K792814K638950K832156
$$ y = [13837184, 13731952, 14253018, 14390586, 14791420, 15352322, 15739582, 15737543, 15742404, 16407055, 16241422, 16816157, 16819955, 17401288, 17578165, 17678673, 18404482, 18700949, 19531160, 19891172, 20101716, 21005990, 21122822, 21545334, 21366353, 22535944, 22616278, 23134022, 23827291, 24207537, 24632731, 25392710, 26032311, 26425005, 27082324, 27467295, 28372794, 29017906, 30115772, 30125196, 31457719, 32102521, 32795408, 34098534, 34668929, 35319125, 36322200, 37561740, 38859871, 39933135, 40489697, 41977100, 43192210, 44384957, 45928155, 47165592, 48633074, 50227957, 51430119, 53196432, 54825883, 56800847, 58427825, 60529026, 62809695, 64680717, 66687893, 69718778, 71405486, 74198300, 76837250, 79669406]
14314G9669406K829625L235342L254093L540660L768524L696934M016155M473761
14306A08484500M465965N275249N139926N102490O039533O048484O570445O717925
14298A53844517P343479P414532Q345223Q708546Q784336R257767J0427177J0410773
14290B24536350J1001669J2075409J1942482J2818196J3490426J3793254J4043788
14283C13701574J4594626J4428915J4779832J4490139J4356453J4186737J3218298
14276D13756574J2353249J1216958Q881363N799462K896277K115366R82711l62763
14268D57639197m127614m646718o592497p923088q921767j0137174j1490499j3329804
14260C90470036j3708232j4734473j4618570j5256498j5048645j4699426j4825760
$$ y = [79669406, 82499031, 85734373, 88988466, 92529126, 96297650, 99994584, 104010739, 108484500, 112950465, 118225714, 123365640, 128468130, 134507663, 140556147, 147126592, 153844517, 161187996, 168602528, 176947751, 185656297, 194440633, 203698400, 214125577, 224536350, 235538019, 247613428, 259555910, 272374106, 285864532, 299657786, 313701574, 328296200, 342725115, 357504947, 371995086, 386351539, 400538276, 413756574, 426109823, 437326781, 446208144, 452007606, 454903883, 457019249, 458001960, 457639197, 453511583, 448864865, 442272368, 434349280, 425427513, 415290339, 403799840, 390470036, 376761804, 362027331, 347408761, 332152263, 317103618, 302404192, 287578432]
14253B87578432j3919824j3483302j2990870j2266512j1666901j1107469j0803730
14246B01339824q665110q402186q736191q516258q014833p661975o690933o569140
14238A38083198n979112n606350n604317n307433n101366m654586m283144l747304
14230I7799586l867920l801129l502511l343956l218751k783023l082216k407659
14222G1792421k640322k407939k186686k209496k208300j978079j741326k189372
14214E4230901j196631j411966j765980j561676j611098j254089j034385r12590
14206D3482486j440303j449103j370795j029431r80015m14315j122293n46290
14198C5129941j500231q18630p48604q11986n38776q84938q17521r13405m29963
$$ y = [287578432, 273658608, 260175306, 247184436, 234917924, 223251023, 212143554, 201339824, 192674714, 184272528, 175536337, 167020079, 159005246, 151343271, 144652338, 138083198, 132104086, 126497736, 120893419, 115585986, 110484620, 105830034, 101546890, 97799586, 93931666, 90130537, 86628026, 83284070, 80065319, 77282296, 74200080, 71792421, 69152099, 66744160, 64557474, 62347978, 60139678, 58161599, 56420273, 54230901, 53034270, 51622304, 49856324, 48294648, 46683550, 45429461, 44395076, 43482486, 42042183, 40593080, 39222285, 38192854, 37212839, 36798524, 35676231, 35129941, 33629710, 32811080, 32062476, 31250490, 30711714, 29826776, 29009255, 28095850, 27665887]
14189B7665887p98548p03550o03467j89410n79505q61287n63613p74532j8552
14180B2573423k23092p84475k14819n35834l48438m34494n88497l82386l9870
14171A9021518l06325q20185K42107p73141k33494o57602r5971o7504l77873O3068
14161A5994598j080910J76556n90672J26330l48887l60309l96771M4434K6473
14152A3590842m07996m27351j2421j99731m21854l00479K64686m27055n60721
14143A1097920N6937n6202o8308k46647l11116M0169j44350k58968j21546J46536
14133A0134425n93296k3298j25326p5319n2152k2322n01133R5649k14177j07354
14123H515697l0867k67999k42454L31207K8281m19572r1765J19477j87493l08775
$$ y = [27665887, 26867339, 26163789, 25560322, 25370912, 24791407, 23930120, 23366507, 22591975, 22573423, 22350331, 21565856, 21351037, 20815203, 20466765, 20032271, 19443774, 19061388, 19021518, 18715193, 17895008, 18137115, 17363974, 17130480, 16472878, 16376907, 16309403, 15931530, 15994598, 14913688, 15090244, 14499572, 14625902, 14277015, 13916706, 13519935, 13564369, 13590842, 13182846, 12755495, 12743074, 12543343, 12121489, 11821010, 12085696, 11658641, 11097920, 11154857, 11098655, 11030347, 10783700, 10472584, 10512753, 10368403, 10109435, 9987889, 10134425, 9541129, 9517831, 9392505, 9317186, 9265034, 9242712, 8741579, 8837228, 8623051, 8515697, 8484830, 8216831, 7974377, 8305584, 8333865, 7914293, 7822528, 7942005, 7754512, 7445737]
14113G445737j06836j25734j43119O6016J34687k6015j60199l87270K62180l78224
14103F581223M427k7408L33493m62264k12476q529j02412J55617m92060K23479
14093E993090Q9485l10843j11104l90713M78342j77704j82078N3840J00209m11801
14083E130723J75268j5750l01536j3825p0023L89376j47326l34812K40179o31996
14073D420278J28431J02701k7711j2988k69265j27246K78858M372j47815N3172
14063D402787J42840r4299J29754m57445M95462j81212l33848J05202r5034l50339
14053C763868M02413m99917K80324m63011K73146j59472K43517j5638m65702k5263
14043C334265J31868j3194l51679J81819p9388K54138l45511K80988J95892l83439
$$ y = [7445737, 7338901, 7213167, 7070048, 7136064, 7270751, 7244736, 7084537, 6697267, 6959447, 6581223, 6585650, 6558242, 6891735, 6429471, 6216995, 6208466, 6106054, 6261671, 5769611, 5993090, 6082575, 5771732, 5660628, 5269915, 5748257, 5570553, 5388475, 5442315, 5542524, 5130723, 5305991, 5290241, 4988705, 4974880, 4904857, 5294233, 5146907, 4812095, 5052274, 4420278, 4548709, 4651410, 4623699, 4610711, 4341446, 4214200, 4493058, 4497430, 4349615, 4402787, 4545627, 4451328, 4581082, 4123637, 4619099, 4437887, 4104039, 4209241, 4114207, 3763868, 4166281, 3666364, 3946688, 3483677, 3756823, 3597351, 3840868, 3825230, 3359528, 3334265, 3466133, 3452939, 3101260, 3283079, 3203691, 3457829, 3112318, 3393306, 3589198, 3205759]
14033C205759J79822l51637K98512K19932n2795k07492j80001j36759R4312j0097
14023C059556r8438K19293m72372k351L36161l73247P7330k6971j90374k0607
14013B507980j02398l7772K73198j86915j83928J19452K32086j27687j9659j73567
14003B300790k28910K19174K01153k38949k810K5129j32834J80522j25661j56526
13993B041078J19771K13512k00204P02939M29586K625770N756554J7399414J9872663
13984D8961083k1588188j2907301n489825k462608q93016j132057n05017q6826
13976C896245p16426j19733j22422j113k95358K57740k55521J60157j87210n86210
13966B030149M52277k06914J50183k9176J39517o83483J14967K54285j72489o6319
$$ y = [3205759, 3385581, 3033944, 3332456, 3552388, 3499593, 3292101, 3112100, 2975341, 3069653, 3059556, 2961118, 3180411, 2708039, 2705688, 3041849, 2668602, 2745932, 2718961, 2528587, 2507980, 2405582, 2367810, 2641008, 2454093, 2270165, 2389617, 2621703, 2494016, 2474357, 2300790, 2071880, 2291054, 2492207, 2253258, 2250448, 2275577, 2142743, 2323265, 2197604, 2041078, 2160849, 2374361, 2174157, 2877096, 3306682, 5932452, 11689006, 29088420, 48961083, 27372895, 14465594, 8975769, 6513161, 5620145, 4488088, 3983071, 3896245, 3179819, 3060086, 2937664, 2936551, 2641193, 2898933, 2643412, 2803569, 2616359, 2030149, 2482426, 2275512, 2425695, 2396519, 2536036, 1852553, 1967520, 2221805, 2049316, 1982997]
13956A982997R4255K23087m8709m33959J61113l23503L46189J58437J33543N0462
13946B343912k54408n04462K60727k843l4632j44109P0429J65917J53006O2134
13936B115671l27714p3164l1180L06000m24649O77417m76423K6760j42112k29156
13926A421450N60805j96911j17041j1111K22985l48966m1632K75766j30224k29801
13916A405320q5652R6432K6313P9899j5585l47740K40917K68594o2731j6446j89286
13905A400035K13675k31328o6399k5323M17024k15581m80233J31686N05970N1427
13895A700953k25001k269J5666l8508J99383m93169L0473k1100k07992K83654
13885A242090R8310k64758J57700R4229n34086M26260l0124K61811R262P3846
$$ y = [1982997, 2077252, 2300339, 2251630, 1817671, 1978784, 1655281, 2001470, 2159907, 2293450, 2343912, 2089504, 1585042, 1845769, 1842926, 1808294, 1664185, 1734614, 1900531, 2053537, 2115671, 1787957, 1714793, 1683613, 1989613, 1564964, 2242381, 1765958, 1792718, 1650606, 1421450, 1982255, 1785344, 1668303, 1657192, 1880177, 1531211, 1489579, 1765345, 1635121, 1405320, 1319668, 1416100, 1442413, 1522312, 1506727, 1158987, 1399904, 1668498, 1605767, 1589321, 1400035, 1613710, 1382382, 1315983, 1290660, 1707684, 1492103, 1011870, 1143556, 1649526, 1700953, 1475952, 1473683, 1489349, 1450841, 1650224, 1157055, 1187528, 1166428, 958436, 1242090, 1340400, 1075642, 1233342, 1327571, 793485, 1219745, 1189621, 1451432, 1460694, 1534540]
13875A534540n26466L13969O2131J10972k70825M0287K4377k0601J83788P0754
13865A522926l57012K62448l70283M0377J32781k68335O0388J49505Q0877k30783
13855A022889J51365J40379L5178k30827J82266F10561K72132L52200q8903o8493
13845A077497p5415J83267j54888L64561k97717M0673k00329J87562j81565J7347
13835I60993k1678K21062J760J65856k86724r7955j13978J38774m43753K53810
13825G78167j07432J90267j14044P7541M3169P6525n6439j27789j80792J92751
13815G71924n4272K281L29183j97085l02817M42177r5863Q7227j99512Q4204n4584
13804H12863M4622r2209q6872J89188C84926O71826j51308k51637J8599J38817
$$ y = [1534540, 1008074, 1322043, 1384174, 1495146, 1224321, 1264608, 1288985, 1268384, 1452172, 1522926, 1165914, 1428362, 1058079, 1098456, 1231237, 962902, 1023290, 1172795, 1253672, 1022889, 1174254, 1314633, 1349811, 1118984, 1301250, 610561, 882693, 1234893, 1145990, 1077497, 1002082, 1185349, 1030461, 1395022, 1097305, 1137978, 937649, 1125211, 943646, 960993, 939315, 1160377, 1162137, 1327993, 1041269, 943314, 829336, 968110, 524357, 778167, 670735, 861002, 746958, 824499, 867668, 944193, 887754, 759965, 579173, 771924, 717652, 719933, 1049116, 852031, 549214, 991391, 895528, 982755, 783243, 867447, 812863, 857485, 765276, 678404, 867592, 384926, 1056752, 905444, 653807, 672406, 811223]
13794H11223J27880k2106k16185R7733K6985l55364J96047K86667k5933n4777
13784H72170j44644J88005O1024k00606M6227j23318L36224n5918K10912D82322
13773F52258j38002L58355j71211o3578L32297j79759J12219k4560j25338j77602
13763E75079J3110K01507p396n0865J55531k14349n8958p7305K62431o4053j6161
13752G18571j65128R3887J15318C16946M72209l44217O4652N1460K11689l4425
13742G38314k93096P3079j577J34065m9503k26444N0792L10484j0511j05418J64709
13731G84894q9995J9859B51008N39229C70623J14948J51079j42949J28677j32494
13721D89884L4086J38599p8904j53871J34825L46909j52039j77516J88185k01187
$$ y = [811223, 939103, 916997, 700812, 798545, 825530, 470166, 666213, 952880, 926947, 872170, 727526, 915531, 976555, 775949, 822176, 698858, 1035082, 979164, 1190076, 482322, 652258, 514256, 872611, 701400, 637822, 970119, 790360, 902579, 878019, 752681, 575079, 588189, 789696, 782300, 731435, 886966, 672617, 613659, 536354, 798785, 734732, 718571, 553443, 647330, 762648, 316946, 789155, 444938, 509590, 561050, 772739, 738314, 445218, 518297, 516720, 650785, 601282, 374838, 425630, 736114, 725603, 620185, 784894, 694899, 714758, 251008, 790237, 370623, 485571, 636650, 493701, 622378, 489884, 523970, 662569, 583665, 429794, 564619, 911528, 759489, 581973, 770158, 568971]
13711E68971j09086j99013P7268J18213K91563L97k03009L13579l00401k0969
13701E37513j46889j3221N57696j89812l30672j083O586l9853J58158j40291M28600
13690H26732C98854J45467M0609R2716K8589k63764J65421o4570k07317l144R0445
13679D23306J56609J40126j58558j98839M36767k96973j10406N0063J75053B05726
13668C08986J19948j73821L86613n5840o8689j89035n1458j35083F6929M73888
13658E40817J5551l8842j02606K97424j81665m8143j31170J31273r2253P9768
13648D70154m4420J69562n6614A82603J79289J62421k39726K70620J39174B13080
13637C45342L993L53043B58864J66891J47610k22272K67346k48315K5036A89769
$$ y = [568971, 459885, 260872, 338140, 456353, 747916, 748313, 545304, 858883, 558482, 537513, 390624, 377403, 935099, 745287, 414615, 413532, 420118, 380265, 538423, 398132, 826732, 398854, 544321, 584930, 677646, 706235, 442471, 607892, 543322, 336005, 332861, 423306, 579915, 720041, 561483, 362644, 799411, 502438, 392032, 442095, 617148, 205726, 308986, 428934, 255113, 641726, 585886, 517197, 328162, 276704, 141621, 66929, 540817, 556368, 517526, 414920, 712344, 530679, 482536, 351366, 482639, 390386, 470154, 425734, 595296, 538682, 182603, 361892, 524313, 284587, 555207, 694381, 213080, 345342, 349335, 702378, 258864, 425755, 573365, 351093, 618439, 370124, 395160, 189769]
13626C79258J52763r8338R3496B22096J37809A57401N38876A56992L24721p510
13616D74203k2089j4907B02447N07752j02724B20981L29180B30912J93837P77
13606D25526k9911k6537j20928Q9027J81862A11011K95855j18807K2966K72347
13596E83372L973B32428A6065N83346j68972M6098j30462G8387M79634A15239
13585C46563Q4072m4454l6868m850n0665l6744K70987A50107P3476G9372N29798
13574F09170J5052B00898d9049F13982A09695K32159L04179A0188L40661J82r4632
13563B56399K56884k04452Q1527H1361L30978A23284N6603N68864k47593Q4801
13553E85959k28927Q2808B2411K32828p4405J3847L51486A76006J31620p126d906
$$ y = [379258, 532021, 433683, 527179, 222096, 359905, 157401, 696277, 156992, 481713, 474203, 452114, 437207, 202447, 710199, 607475, 220981, 550161, 230912, 424749, 425526, 395615, 369078, 248150, 337177, 519039, 111011, 406866, 288059, 311025, 583372, 587345, 232428, 16065, 599411, 430439, 476537, 346075, 78387, 558021, 115239, 346563, 430635, 386181, 349313, 344463, 293798, 257054, 528041, 150107, 223583, 79372, 609170, 624222, 200898, -49049, 613982, 109695, 341854, 646033, 10188, 350849, 351031, 256399, 513283, 308831, 390358, 81361, 412339, 123284, 179887, 748751, 501158, 585959, 357032, 439840, 22411, 255239, 180834, 194681, 546167, 176006, 307626, 300500, -4906]
13541A59618L35313A62647K24810K898m6155J43398q5629N9225G0354M19630j29879
13530C60105P1366k03666J0080J82510A76700J26514l430j12012J10611A47989
13519A93999J82897K11703B43043j10459L49920a2038A98808J3215J32998K50765
13509E95786o5374A04133q246L30140l2649A44693J17621a81895C59813G0871
13498B36400H5644O8106M4349l5755q624J2959K38335R2081G2629P9843J41175
13487B93647O3803k426q9356l1877a08440A48515N6254R4920P2924O3906I8701
13475I3441J48748P5797m4201j34369R652l1559J96026A28145J3196k1798K3934
13464A43477M5538C7833J42760O8145q8661C8104L20747A34439K71707D3883M34413
$$ y = [159618, 494931, 162647, 387457, 390355, 344200, 487598, 401969, 461194, 70354, 489984, 360105, 431471, 227805, 237885, 420395, 176700, 303214, 299784, 187772, 298383, 147989, 193999, 376896, 588599, 243043, 132584, 482504, -12038, 198808, 212023, 345021, 595786, 530412, 104133, 95887, 426027, 393378, 144693, 262314, -181895, 359813, 70871, 236400, 85644, 153750, 198099, 162344, 153720, 166679, 405014, 497095, 72629, 152472, 293647, 357450, 355024, 265668, 233791, -108440, 148515, 204769, 299689, 372613, 436519, 98701, 93441, 242189, 317986, 273785, 139416, 149068, 117509, 313535, 128145, 141341, 119543, 143477, 189015, 37833, 180593, 248738, 160077, 38104, 358851, 134439, 406146, 43883, 478296]
13453D78296a35969D12160j80642p1551f367A38188K01565C9409Q8871j4511K01631
13442C15400A9513L30076N2648a22271A16203c4785F4004K75208R7562i7141a3955
13430b40978B40433O2833A08131K05812A27465K20513L4313b5472G7529f5683
13419B09734J18580d8045A50904K37823o1827A59270J71460G3887J64378P3576
13409C11841Q052i0802E36274l1107A80866A4267J24260B2003K93535G6496J28944
13398B05440p606J77970A60797f8598B57077I9222e0168D95289k41739N8856O776
13387C19182a0459E05226A94714L79774b47153A41522M51791k82243j31256l4836
13377A44978M2450k0065J00489K07013A11365K77306A38742J30904j632n7530
$$ y = [478296, -135969, 412160, 231518, 159967, -6367, 138188, 339753, 39409, 128280, 113769, 315400, 19513, 349589, 402237, -122271, 116203, -34785, 64004, 339212, 436774, -97141, -13955, -240978, 240433, 303266, 108131, 313943, 127465, 347978, 382291, -25472, 77529, -65683, 209734, 328314, -48045, 150904, 388727, 326900, 159270, 330730, 73887, 238265, 311841, 319893, -90802, 536274, 505167, 180866, 14267, 138527, 22003, 315538, 76496, 205440, 197834, 375804, 160797, -68598, 257077, 99222, -50168, 495289, 253550, 312406, 319182, -10459, 505226, 194714, 574488, -247153, 141522, 593313, 311070, 179814, 144978, 187428, 167363, 267852, 474865, 111365, 388671, 138742, 269646, 268014, 210484]
13367B10484G2442K25360a35350M9790c4269C26609f2361C00561K16522j48934
13357C68149r5568M6431A43356K724B8165K99696m6397O6281o2059A34060n027
13346A29033L11878G2956M02121b79083A26579i8446C79008I4708J01000K86732
13336D82440j27302A70859K42120b88575a0609A67011a69742I1965K51580j70279
13326A73266d0595I0644J08870A8638L53131I6719L35165A46374R2304k0630q7706
13315A30342J59122j12212K01114J58106j95968B7741a47178A96856A647J265
13305B912J89206r3303R8923N001B2781J35192o571m1483M03433A66L13463H5797
13292B16643n6136M4295k3157J31271O5955A24638n769a3927A97009J6500J03439
$$ y = [210484, 72442, 297802, -135350, -85560, -34269, 326609, -62361, 300561, 517083, 368149, 272581, 319012, 143356, 146080, 28165, 327861, 281464, 347745, 285686, 134060, 129033, 440911, 72956, 475077, -279083, 126579, -98446, 379008, 94708, 195708, 482440, 355138, 170859, 412979, -288575, -10609, 167011, -169742, 91965, 343545, 173266, -40595, 90644, 199514, 18638, 371769, 96719, 431884, 146374, 238678, 218048, 130342, 289464, 177252, 378366, 536472, 340504, 27741, -147178, 196856, 1647, 2912, 192118, 98815, 197738, 202739, 22781, 157973, 151402, 109919, 513352, 166, 313629, 85797, 216643, 160507, 204802, 181645, 312916, 378871, 124638, 118869, -13927, 197009, 213509, 316948]
13281C16948J5655l1602j16353K12020N723b8073A41936d37666b381A96909J18516
13270C15425a90791O2087A7258O4089b89368B14951E1737O1130J83321K0392e863
13258D99L09439j49129Q6854a58852A34704h7426B01698K8739D0592R8049F2794
13246D825L80441i3777H2157b781A21651P6572G134c7376j34307B90330J68030
13235D58360k3413A17026J73265j00720n4513R5012j11721f9797k63871E4902
13224A65579F0352d6167q7138B68902C8770J22286a14614l2552C09468b46144
13213A43390b6200B85560c1828k6389D12484A59388o4766J44939J84300a8812
13202e5991B32979H0073a58891C05149g4172l299A06031N8304a46858I3201l4812
$$ y = [316948, 332603, 301001, 184648, 396668, 402391, -28073, 141936, -437666, -2381, 196909, 315425, -190791, -128704, 17258, 81347, -289368, 214951, 51737, 112867, 296188, 316580, -5863, 499, 309938, 160809, 247663, -158852, 134704, -87426, 201698, 230437, 40592, 138641, 62794, 4825, 385266, -93777, 82157, -2781, 121651, 198223, 7134, -37376, -171683, 290330, 458360, 434947, 117026, 290291, 189571, 135058, 230070, 118349, -69797, -333668, 54902, 165579, 60352, -46167, -133305, 268902, 38770, 161056, -114614, -147166, 309468, -246144, 143390, -26200, 285560, -31828, -58217, 412484, 159388, 94622, 239561, 423861, -18812, -55991, 232979, 80073, -158891, 305149, -74172, -77471, 106031, 164335, -146858, 93201, 58389]
13191E8389e564j2122n2452l9151c5172a3052A65273l0947M66444i7575D036P3188
13179G7224J92404a08832C1646J26573L1786J2385i6465C60840G1630r904a55660
13167B55607b42321C4503a96887g041n50A01582L048O8582q932e08770A52094
13155a02817D2928K02056l3442h7089c6012A4844a185k89692A3839J4035J09273
13144A37147N1154m6744A7294f4169n7616L13B8702d6367p1953e3901A49459c19849
13131A24461L53707f5069A94883a06894D42970E1805K60400a4357A67902n2939
13121A14963q368J95131f2760j16703B01243o1176C2482R921L1982e0659E5016
13109A69623D5133c1644I6919J3293l3160Q8839n465n5110A8605a71804c6283
$$ y = [58389, -5564, -17686, -70138, -109289, -35172, -13052, 165273, 134326, 600770, -97575, 4036, 77224, 269628, -108832, 31646, 158219, 190005, 202390, -96465, 360840, 71630, 61726, -155660, 255607, -242321, 34503, -196887, -7041, -7591, 101582, 104630, 173212, 164280, -508770, 152094, -102817, 42928, 244984, 211542, -87089, -36012, 14844, -1185, -290877, 13839, 27874, 137147, 188301, 141557, 17294, -64169, -121785, -121472, 28702, -46367, -118320, -53901, 149459, -319849, 124461, 478168, -65069, 194883, -106894, 442970, 51805, 312205, -14357, 167902, 114963, 106595, 301726, -62760, -179463, 201243, 140067, 32482, 42403, 74385, -50659, 55016, 169623, 45133, -31644, 96919, 110212, 77052, 165891, 160426, 105316, 18605, -171804, -36283]
13097a43717A59038a65011A91342c8714L108I5263D0149k874P9637K74409A55930
13085B1178b04662O5511O7088b6018A69126a12167A5599K37467F2740h6208F7623
13073I7472A2466b02554D6644i1708B26054a19739A61726h1718C3365b34761B56746
13061C10129n1554J63710F1917J75807q2366l3948d2523B49670B4596G726J30256
13050A37982a34432B33675f4386b5307D23916h436m9020E7219J08053O4285J9888
13039B49445a05808D8607P8236B9842J30825a3827A7028J16715Q5227a03292G0866
13027g7538J8277B77584r0962b73430j23039g1314p977A02898J8990a46739B57757
13015a25531B72521J53880C9294a92687B56414G2330K63047F1908C700J89614
$$ y = [-143717, 159038, -165011, 191342, -38714, -35606, 95263, 40149, 37275, 116912, 391321, 155930, 21178, -204662, -139151, -72063, -26018, 169126, -112167, 15599, 253066, 62740, -86208, 67623, 97472, 12466, -202554, 46644, -91708, 226054, -119739, 161726, -81718, 33365, -234761, 256746, 310129, 258575, 422285, 61917, 237724, 155358, 121410, -42523, 249670, 24596, 7726, 137982, -134432, 233675, -64386, -25307, 423916, -8436, -57456, 57219, 165272, 229557, 249445, -105808, 48607, 126843, 29842, 160667, -13827, 17028, 133743, 218970, -103292, 70866, -77538, -59261, 277584, 186622, -273430, -396469, -71314, -79291, 102898, 121888, -146739, 257757, -125531, 272521, 426401, 39294, -192687, 256414, 72330, 335377, 61908, 3700, 193314]
13005A93314a22656A8455a10661A67756J43179A15853a37026j46308D18693j2569
12995D06124g2829A49945G2676c3730o005j82692a973n6074A39284b5591n0254
12984g5845B97070b6478A59788L44829c2262j08246L3032F6001C178M01709b00597
12972a30333N7551m2752A69362a2172J274E1427a54782c3074C11439D5606L8019
12961H3625g4102A89398L3717g586A06081K58851c14245i5303B42207a19108k4404
12950a43512A50757g4031c2063j16533b1762A67149B1332Q9295R9218G0809J52029
12939B22838I4094i2259A10914K09121d5845n5336k1692A47622E5907j7768K56823
12928B94962B9037a09097A71874a09238D3566K54435A44524F567J25154C9498
$$ y = [193314, -122656, 18455, -110661, 167756, 310935, 115853, -137026, -283334, 418693, 406124, -72829, 149945, 72676, -33730, -39735, -222427, -1973, -58047, 139284, -25591, -75845, 297070, -26478, 159788, 504617, -32262, -140508, -107476, 66001, 3178, 404887, -200597, -130333, -72782, -115534, 169362, -12172, -10898, 51427, -154782, -33074, 311439, 45606, 83625, -74102, 189398, 223115, -7586, 106081, 364932, -314245, -95303, 242207, -119108, -143512, 150757, -74031, -32063, -148596, -21762, 167149, 21332, 110627, 209845, 70809, 222838, 94094, -92259, 110914, 320035, -45845, -101181, -122873, 147622, 55907, 38139, 294962, 29037, -109097, 171874, -109238, 43566, 298001, 144524, 6567, 131721, 39498]
12917b47088h8459k19023B29719c5509F425N6925M7947b1512p5976A66219m9366
12906A16853d5557j40164B39856B4694a27521E1515R955J25819c05756B30958
12895g1021B1309f3723B52793a71939C1965A2276a1722j577G7120G496b7849p756
12883c5605A7127o954a75328l2621G1508P1158I76O781a22191A42554a63344H6099
12870b44892c3792j84072B13172q4509j4204k2868a54340j08394J30331j28887
12860b61290B7243J3233A8840a97476A13087E5964N8293d0954A45496f083n7491
12849f3574J8508a8293H9597J99463J20117A52673a55117M4208I02a32678c9566
12837A95284b41813e5400d978j89728C33733I3745b60518C5988a33011D5777K8267
$$ y = [-247088, -88459, -307482, 229719, -35509, 6425, 63350, 111297, -21512, -97488, 166219, 116853, -45557, -185721, 239856, 24694, -127521, 51515, 61470, 187289, -305756, 230958, -71021, 21309, -63723, 252793, -171939, 31965, 12276, -11722, -13299, 77120, 7496, -27849, -35605, 17127, 10173, -175328, -207949, 71508, 142666, 976, 7757, -122191, 142554, -163344, 86099, -244892, -33792, -217864, 213172, 128663, 114459, 91591, -154340, -262734, -132403, -261290, 27243, 40476, 18840, -197476, 113087, 55964, 114257, -40954, 145496, -6083, -63574, -45066, -18293, 89597, 289060, 409177, 152673, -155117, -110909, 902, -132678, -39566, 195284, -241813, -55400, -4978, -194706, 333733, 93745, -260518, 35988, -133011, 45777, 74044]
12826G4044a96250f608A85449P7857a93646Q7909C15951b97842C4904P6073K10032
12815C21009F511f7292B54365h4863k47896A70296G2141K0105P7841b70713b0134
12803E5120K00708c1093a0799G017b11069e0082j80147G4580a53104j14133A09925
12791B39171i7873p020j00215b5845m2478A23935i3668A31444N1910l0316o5304
12780H7734b4928A12105J47748m3647p8111d6132A42431b33412f7952m8345j69546
12769b85843A04849a51082F7521K8243J6746j4539e5947A12396B2674J38334g4530
12757a76683C32519A14822b27946D3384O111K6094K89456a12171c0724k1814j97145
12746b49683A06872e8673I7617f4135a942j59630A55741f514A0352b1262q6262
$$ y = [74044, -196250, -6608, 185449, 263306, -193646, -105737, 315951, -297842, 34904, 110977, 321009, 6511, -67292, 254365, -84863, -332759, 170296, 72141, 92246, 170087, -270713, -20134, 55120, 255828, -31093, -10799, 7017, -211069, -50082, -230229, 74580, -153104, -267237, 109925, 239171, -97873, -104893, -205108, -25845, -68323, 123935, -93668, 131444, 183354, 153038, 87734, -24928, 112105, 259853, 216206, 138095, -46132, 142431, -233412, -67952, -116297, -285843, 104849, -151082, 67521, 95764, 112510, 97971, -55947, 112396, 22674, 161008, -74530, -176683, 332519, 114822, -227946, 43384, 49495, 75589, 365045, -112171, -30724, -52538, -249683, 106872, -58673, 97617, -64135, -1942, -161572, 155741, -6514, 10352, -21262, -107524]
12735a07524M3439B53831q7722f692k9021J5343B0379g151n8140j51004G5818
12723A7363J22695n7516C7408O2666N3349Q8261A3951a00844r709d6832A65225
12711i1125G2436K14140a11081E5507J47837K19404E4242J38855P9637K7564k6418
12700B73880A09679a99693A37069a25420a9555j96416f3790G2815h6033l213G3692
12688D5613g9856l2137N5695j7925A03365D8963d01491a77389C85731o8684j02819
12677B14228H8505K9222J81677a2611l2947A01859c6728A60772K9546a32328J9698
12666a12630C7983J24805E5214J49269h6257k1045k5497A77540J15509g0159B03558
12654e5921C8858a54267B17613J1433b40766A89938a44456A34565K7514c01960
$$ y = [-107524, -64085, 253831, 166109, -6692, -35713, -20370, 20379, -7151, -65291, -216295, 75818, 17363, 140058, 82542, 37408, 100074, 153423, 241684, 13951, -100844, -110553, -46832, 165225, -91125, 72436, 286576, -111081, 55507, 203344, 422748, 54242, 193097, 272734, 300298, 273880, 109679, -199693, 137069, -125420, -19555, -215971, -63790, 72815, -86033, -89246, 73692, 45613, -79856, -111993, -56298, -74223, 103365, 48963, -401491, -177389, 385731, 317047, 214228, 88505, 117727, 299404, -12611, -45558, 101859, -36728, 160772, 190318, -132328, -112630, 37983, 162788, 55214, 204483, -86257, -107302, -132799, 177540, 293049, -70159, 203558, -55921, 38858, -154267, 217613, 229046, -240766, 189938, -144456, 134565, 162079, -301960]
12643h2858j63580B59823c9049k63328D61403A88449i2654E0637Q8984P5456H1965
12631i5471A34122J6034J19045j6790K35084A38110i1268B53723J20646r8827
12621B75542a90196b2772C27517A24088K6535J76830a82266o044o6114B30581
12610I4826b54189d4797n682k402B08024a05797F0442J23876c8725B9J10298Q8928
12598A99255K26963G4142J79935q2541k2056a97156D21812a47928I7193a52514
12587f1141r100B4869N7362l1602f5622i256A18971a30420C85060h879l5216k16088
12575b60183N8813B56581a30519B28424H6484f3309B1742a11772K4391B17741
12564a84939j2060A97797e7218a089j35344A14823d18271J78389A58722c33176
$$ y = [-82858, -246438, 259823, -39049, -302377, 461403, 188449, -92654, 50637, 139621, 215077, 81965, -95471, 134122, 150156, 269201, 252411, 487495, 138110, -91268, 253723, 374369, 275542, -190196, -22772, 327517, 124088, 150623, 327453, -182266, -188310, -254424, 230581, 94826, -254189, -44797, -50479, -52881, 208024, -105797, 60442, 184318, -38725, 29, 110327, 199255, 426218, 74142, 254077, 171536, 149480, -197156, 421812, -147928, 97193, -152514, -61141, -70241, 24869, 82231, 50629, -65622, -9256, 118971, -130420, 385060, -8879, -44095, -260183, -201370, 256581, -130519, 228424, 86484, -63309, 21742, -111772, -87381, 217741, -184939, -196999, 197797, -57218, -1089, -136433, 114823, -418271, -239882, 158722, -333176]
12553e2668j0561A11175M9382a57471J492A90285O3917f5998A6159J14034J36569
12542B66762h5355a2683B49576j21063b96682e0688A2021J95071B0594c7685J5264
12531b2421A86947b7195j14914C9697L04608d10676d6428l36244D4581a81194
12520E1402J14606a0867G9714C8941J9358e05875g3711o9587A44956m2931b5446
12508D1275a11174A13616a33610B67955a3086C25008b25627E360a39532j01469
12498b41001B35119i8950A65333A8505m195i5279j13480B95181A03279b31288
12487b27146g9536P367q8816H5491a72438f7156c0751i259F5594i1500B1224Q4188
12475A05412K20756h0125L5879c798m48935A12172d1584D4947J29709N7655B1030
$$ y = [-52668, -63229, 111175, 160557, -157471, -155979, 190285, 254202, -65998, 16159, 130193, 266762, -85355, -12683, 249576, 128513, -296682, -50688, 12021, 207092, 20594, -37685, -22421, 186947, -27195, -142109, 39697, 344305, -410676, -46428, -382672, 44581, -181194, 51402, 166008, -10867, 79714, 38941, 58299, -505875, -73711, -143298, 144956, 102025, -25446, 41275, -111174, 113616, -133610, 267955, -13086, 325008, -225627, 5360, -139532, -241001, 235119, -98950, 165333, 18505, 14310, -95279, -208759, 295181, 103279, -231288, -227146, -79536, -72169, -160985, 85491, -172438, -67156, -30751, -9259, 65594, -91500, 21224, 105412, 326168, -80125, -44246, -3798, -452733, 112172, -41584, 44947, 174656, 232311, 21030]
12463c4179B2747a95180A11793m1757A0735a61686A76701h7095q1880e3399k35976
12452b89375d3803H365R0475J39694c86942f9938K8120B00784k2562c19910I9185
12440a56970j17881c3748A77112k7617A9941b59439J10830C19103p3791i5432
12429A01935D1393a47125l3865F7191k6111e5403a5764q6914B4104J0352a66277
12417A37690c7625k88903J41500A21036c366C24982A20860b05113g5625n7514
12407a33139B1157e6742B07549C9325c3785m2650I1644J57892b19215G8891Q2894
12396A61785i4898I8468a09102d856B97664Q8177A85420g8770j79058B66317F0615
12384a68937D67088j93096J22101D8021K4281k522K57060j22187I7452m6491K28693
$$ y = [-34179, 22747, -195180, 111793, 70036, 10735, -161686, 176701, -87095, -168975, -53399, -289375, -43803, 8365, 98840, 238534, -386942, -69938, -41818, 200784, 178222, -319910, 99185, -156970, -274851, -33748, 177112, 149495, 19941, -259439, -148609, 319103, 245312, -95432, 101935, 41393, -147125, -180990, 67191, 41080, -55403, -15764, -102678, 24104, 34456, -166277, 137690, -37625, -326528, -185028, 121036, -3366, 324982, 120860, -205113, -75625, -133139, 21157, -56742, 207549, 39325, -33785, -76435, 91644, 249536, -219215, 78891, 161785, -94898, 98468, -109102, -4856, 297664, 385841, 185420, -78770, -257828, 266317, 60615, -168937, 467088, 273992, 396093, 48021, 72302, 69780, 326840, 204653, 97452, 50961, 279654]
12373B79654p0436P0659A05173g1401p3742b7189A73382b58537B99346A11146
12362A38084i2679m3402A07331N1072b129k17299J09162A11924a75326H8373a24258
12350a3319j96458r1891A74700b57576F9885a8669a686D8475a11719d298r535
12339a3833o3708B12551F4121b20792F8085d43970A31121e1527B15950D010M6140
12328E0150J62179Q5995B7579N07628k2042A91262r2189M3209P525n809M2638
12317A86636l05K37641k10544F6183K74289H9448K6590K72231j62492D2322h6851
12305B44564b93536A98772J35589b36381C1361J92605i1553A45868J04622B4937
12294C19474E3474J5849k9131b2623j18996c2504E5618L31219b7847A54299c2378
$$ y = [279654, 209218, 279877, 105173, -71401, -145143, -27189, 173382, -258537, 299346, 111146, 138084, -92679, -136081, 107331, 158403, -2129, -219428, -110266, 111924, -175326, 88373, -124258, -13319, -209777, -301668, 174700, -257576, 69885, -18669, -1686, 48475, -111719, -4298, -13833, -77541, 212551, 64121, -220792, 68085, -443970, 131121, -51527, 215950, 4010, 50150, 212329, 298324, 27579, 535207, 513165, 191262, 99073, 142282, 149807, 143998, 186636, 186331, 423972, 213428, 66183, 340472, 89448, 116038, 388269, 225777, 42322, -86851, 244564, -293536, 198772, 334361, -236381, 31361, 223966, -91553, 145868, 250490, 24937, 319474, 53474, 69323, 40192, -22623, -141619, -32504, 55618, 386837, -27847, 154299, -32378]
12282A0157L08735D0328J78974e9967k542E18855j3855A36032l0298J77550o106
12271B77178f4140H2899A0937J92964L9061f3270C65914k5762h1940B09331k1324
12260A88007F1555L54855c4017l2157B78227J50759j86079m5278b2472D07528
12249C38598j21892F3304Q7684a56010A70305E7718M8714a1024G7462B9821L0565
12238F0386J16712O6057J47431a18082D2893K41077A38169C7193N0984j9270a80463
12226h89C06083d2515B63732E585N21642A08965J52050D3524K13108A11328J50966
12215B62294H6338A4083n875a45101B60428a15914C60043q760a20895D29705j81087
12204B48618R7334g1757C17029C3035J83577b42442A71150A3536c950C44671o7660
$$ y = [10157, 318892, 40328, 219302, -59967, -62509, 518855, 505000, 136032, 105734, 283284, 277178, -64140, 82899, 10937, 203901, 242962, -63270, 365914, 340152, -81940, 209331, 188007, 61555, 416410, -34017, -66174, 278227, 428986, 242907, 197629, -22472, 407528, 338598, 216706, 63304, 150988, -156010, 170305, 57718, 106432, -11024, 77462, 29821, 60386, 177098, 243155, 390586, -118082, 42893, 283970, 138169, 37193, 88177, 68907, -180463, -889, 306083, -42515, 263732, 5585, 527227, 108965, 261015, 43524, 256632, 111328, 262294, 86338, 14083, 8208, -145101, 260428, -115914, 360043, 351283, -120895, 429705, 248618, 345952, -71757, 317029, 33035, 216612, -242442, 171150, 13536, -3950, 344671, 277011]
12193B77011J51486Q3687k47992J38795A74583J9501J23742G3571L39904A47287
12182C29227J45413A60970D6655e8233I9716J36912k1130r9247i0288B46933J81240
12171D28173e4880J6663C10822J00041b07830B07055G5236K53589n0545j37059
12161A41221E9870N53575l2372A75865j9592a62160C00655q0422a0445n5623B40258
12149A78386J20117j40248a19086B05211j01944K1063J37442Q5949b73064I1360
12138A61940D8982K04641I5404a72348I7898E925J93497o9620J97478B472J36646
12127A39118O4517K93699f2178D1309P0256A7460J74017G54J45283c055P11C11203
12114C24872m8985A36822K63355b5410A97499a9957A61104D8951a11062I4188
$$ y = [277011, 428497, 512184, 264192, 402987, 174583, 194084, 317826, 73571, 413475, 147287, 329227, 474640, 160970, 46655, -58233, 99716, 236628, 215498, 116251, -90288, 246933, 428173, -54880, -38217, 310822, 410863, -207830, 207055, 75236, 328825, 278280, 141221, 59870, 613445, 581073, 175865, 156273, -162160, 300655, 220233, -10445, -66068, 240258, 178386, 298503, 158255, -119086, 205211, 103267, 124330, 261772, 347721, -273064, 91360, 161940, 48982, 253623, 95404, -172348, 97898, 5925, 199422, 129802, 327280, 2472, 139118, 203635, 497334, -62178, 41309, 111565, 17460, 191477, 754, 146037, -3055, -2344, 311203, 324872, 275887, 136822, 400177, -25410, 197499, -19957, 161104, 48951, -111062, 94188]
12103B38167e2977B4032f6686p1099B00529B1581K74306q1069J25120a81347A23277
12091e3445K0414A32753J93231M5977C2004K52271E3909K1820R7913K32189b2147
12079D2325M84981a5881I6279J92788p9701N6791A00843O1812J35431I3898i8467
12067I6013J76832J14564e0600C02532c4116B5975J9747Q5491J43662j22966J8207
12056A70116d90409D81262B24847A0638K18057i3259D6932L857d8831F3615a99223
12044e5281j16195A32077a39226M2883J9961B67842E7445A7236K48426e2120o0944
12033a13064A53129o5951J47875i3557B0049J17967a76182c9274k5589A37128
12022C9686p888K6582i327l080k39190J07934M2893C09446o637A26372J5301b35582
$$ y = [238167, -52977, 24032, -66686, -137785, 200529, 21581, 295887, 214818, 339938, -181347, 123277, -53445, -33031, 132753, 325984, 371961, 32004, 284275, 53909, 75729, 173642, 405831, -22147, 42325, 527306, -15881, 96279, 289067, 209366, 266157, 100843, 162655, 298086, 93898, -98467, 96013, 272845, 387409, -50600, 302532, -34116, 25975, 45722, 131213, 274875, 151909, 170116, -490409, 481262, 224847, 10638, 228695, -93259, 46932, 50789, -48831, 63615, -199223, -55281, -171476, 132077, -139226, -96343, -76382, 267842, 57445, 17236, 265662, -52120, -113064, 153129, 87178, 235053, -93557, 20049, 138016, -176182, -39274, -64863, 137128, 39686, 31798, 58380, -9327, -12407, -251597, -143663, -100770, 309446, 302809, 126372, 141673, -235582]
12009A75212M2064l7940p6383J6975P9141m1489c4608B59660K6827H5400K0447
11998A05847M6112c06477A0293L18542b2461A25108J90635b6294A41064b24251
11987d7480C69510j55608a30651A29885l0121J02244b99569g7842j60385P400
11977b30827a3193e320l4057n0737a3735C08912a73008h0770j4946D66238G677
11965h5001j78584g3262J4451F748a21631G7588g7940o8025I9094C3362b8827
11953A6331J85607B3178M2655h1041D3279J01124k5937c8512A47758N5890l6098
11942A67550f6580a921k02714j69631E7838b5234k2425D2408K21234g4992D6671
11930B63497a26316A90342k3750b17047p6731A5421a00818D7703a15135H36a36178
$$ y = [175212, 217276, 179336, 102953, 119928, 199069, 157580, -34608, 259660, 286487, 85400, 105847, 151959, -306477, 10293, 328835, -22461, 125108, 315743, -26294, 141064, -224251, -47480, 369510, 213902, -130651, 129885, 99764, 202008, -299569, -77842, -238227, -230827, -13193, -5320, -39377, -90114, -13735, 308912, -173008, -80770, -95716, 466238, 7677, -85001, -263585, -73262, -58811, 6748, -121631, 77588, -77940, -145965, 99094, 33362, -28827, 16331, 201938, 23178, 65833, -81041, 43279, 144403, 118466, -38512, 147758, 203648, 167550, -66580, -1921, -204635, -374266, 57838, -25234, -47659, 42408, 263642, -74992, 46671, 263497, -126316, 190342, 166592, -217047, -293778, 15421, -100818, 47703, -115135, 836, -136178]
11918b9642I9506a63439e5453A5743b43078b063A41158j9238j054c9212j80649
11907b19861J05393F0760L748B4253e8015A4334J31627j4060n3110c29242J52166
11896a77076b8954A5879b6608F3519b81883J14266k9404B21849p654b04682Q8778
11885a15904P724K8200a517k28097I1552J9871h9325j89948J32152a3578l9597
11874e3175A77994J07728E7219b32091K0891B10990b23679A9384i0222H0244b44543
11862a53981A79727b26490D5420a82998R0417M0225j51449R5777k78445A88917
11851a29034J3435e3617H9476a99940I595a60754l3426M4595j94359C6376Q1614
11840A17990k6746b9188k70031G2749A0033d02867g7628j11681M6949C02838f2509
$$ y = [-29642, 99506, -163439, -55453, 15743, -243078, -2063, 141158, 121920, 120866, -39212, -219861, -114468, 60760, 64508, 24253, -58015, 14334, 145961, 131901, 78791, -329242, -177076, -28954, 15879, -26608, 63519, -281883, -167617, -197021, 221849, 214195, -204682, -115904, -108180, -79980, -1517, -229614, 91552, 111423, -89325, -279273, -147121, -13578, -53175, 177994, 285722, 57219, -232091, -211200, 210990, -223679, 19384, -90222, 80244, -244543, -153981, 179727, -226490, 45420, -182998, -92581, -52356, -203805, -108028, -386473, 188917, -129034, -115599, -53617, 89476, -199940, 9595, -160754, -194180, -149585, -343944, 36376, 117990, 91244, -29188, -299219, 72749, 10033, -402867, -77628, -189309, -142360, 302838, -62509]
11828b47948F7378b97964i0327A9891a7589c095A61183G9168a5942B048d33956
11816h3694l10635e8871A57574a45589d7001B34271J07414a8273p0430A09098
11805e2209j17766A58865F8870f048o4531l6339A69609a35907A02625g0174j4585
11794h4759n4820M4698D4075a52251A62197k2275d3257D3355c4316A51699r101
11783A42598b78774d8322B13017q5145e540C634a75689A7777n988K9691b20495
11771b0125A91871r3985M7235g6964m04735a62483A04190a82623B03071j9690
11761A83381a36425B80599j09422m7691c3523o6754A60807C0434K39772a64683
11750C2595a18631M4293a2136F4401a35731C82702b00027D21557a0618G1891c03049
$$ y = [-247948, 67378, -297964, -90327, 19891, -17589, -3095, 161183, 79168, -15942, 2048, -433956, -83694, -394329, -58871, 157574, -145589, -47001, 234271, 341685, -18273, -88703, 109098, -52209, -169975, 158865, 68870, -6048, -70579, -106918, 169609, -135907, 102625, -70174, -84759, -139579, -94881, 44075, -152251, 162197, 139922, -43257, 43355, -34316, 151699, 142598, -278774, -48322, 213017, 127872, -5540, 3634, -175689, 17777, 11789, 41480, -220495, -20125, 191871, 97886, 145121, -76964, -481699, -162483, 104190, -182623, 203071, 183381, -136425, 280599, 171177, 123486, -33523, -100277, 160807, 30434, 270206, -164683, 32595, -118631, -74338, -12136, 64401, -135731, 382702, -200027, 421557, -10618, 71891, -303049]
11738A23480c32489G098b1561C1433d93315C7652J76868e9839D7303P0765A5716
11726F993a45898N4606p7623d6191A36923a17946b4854j18019B25470a35307B52259
11714c4612A0327J71448j0857J14492R5368i9949E249c45369C34282j57702c06446
11702C098a24063l3400f0983B75836a21503A84414g4054a4128A32992k2887P7510
11691A87615i0128E0757j930a21234A61805K11593a45887I7670d4219G2907P1601
11680A44508K02067b82044A28036L438o1002d4482A74235J49329A0954J63418
11670A74372e6498M540A72846m9571P865b24242d5111A2580L13979d61914c3971
11658a24305R13I8123C2193b6126A22396E6861c25424C69182b7040j11613D4959
$$ y = [123480, -332489, 7098, -21561, 31433, -493315, 37652, 214520, -59839, 47303, 118068, 15716, 6993, -145898, -91292, -168915, -46191, 136923, -117946, -24854, -142873, 225470, -135307, 252259, -34612, 10327, 181775, 170918, 285410, 380778, -99949, 5249, -345369, 334282, 176580, -306446, 3098, -124063, -157463, -60983, 275836, -121503, 184414, -74054, -14128, 132992, 110105, 187615, -90128, 50757, 48827, -121234, 161805, 373398, -145887, 97670, -44219, 72907, 144508, 346575, -282044, 128036, 131474, 70472, -44482, 174235, 323564, 10954, 174372, -56498, -51958, 172846, 123275, 131140, -224242, -45111, 12580, 326559, -461914, -33971, -124305, -123392, 98123, 32193, -26126, 122396, 56861, -325424, 369182, -27040, -138653, 44959]
11646a7143a349j10674j36345j3606G0969J43573K10910f4089F9266a95439a9704
11634A22877b1891k48281A08040O360e7431E0751b534B24206Q5896J66398F492
11622f4618A31385n0864C2325J62998G3510P9060G1876J21562f2943j55182m37
11611b18562G0911d6533j55590A58605n3460C5820a07720D2052M4367c4527D26
11599A7614i4318I2142h153F970K35701j09366a61217b9278j76063k0591j29313
11588c55245B66707b93447j90390a55742A90137H1610J27825a11448A64646R2187
11578B56833a18038L4053l6523A50099j0520m8216Q6077b2695F6490a11962F0140
11566B35489a25306B6875M1063J49353a64287J061D3571a63350D55189C8329l161
$$ y = [-17143, -1349, -112023, -248368, -261974, 70969, 214542, 425452, -64089, 69266, -195439, -19704, 122877, -21891, -270172, 108040, 114400, -57431, 50751, -2534, 224206, 310102, 476500, 6492, -64618, 131385, 80521, 32325, 195323, 73510, 152570, 71876, 193438, -62943, -218125, -218562, 70911, -46533, -202123, 158605, 105145, 35820, -107720, 42052, 86419, -34527, 426, 17614, -94318, 92142, -8153, 6970, 242671, 133305, -161217, -29278, -205341, -225932, -355245, 266707, -293447, -483837, -155742, 190137, 81610, 209435, -111448, 164646, 256833, -118038, -83985, -120508, 150099, 139579, 91363, 177440, -22695, 66490, -111962, 60140, 235489, -125306, 26875, 67938, 217291, -164287, -163226, 43571, -163350, 455189, 38329, 35168]
11555C5168g7693l37856f8600F0508b2455F34J62147b61405b4345B37966b7687
11543H7222M6289b04694F483J3293L8649d6423E32831A44867f3114H0075K5328
11532A05403c30701f820B24598a2351A45879b58226B16923B9878f3975D9461J90512
11521B39973m1901R680b49677A36785k5228j997L2146J98273b02963D003J32857
11510A36860Q44b5429C58096d6734C2473K7290J32672e8459B57759C9455J25249
11499A64704j8932C2856m321K55707a0212A49472b28617E28221H2280j7403P8992
11488A43869b00080B32438p8365d3873C97379F03J15001P7659Q4646K01580a49568
11476a58933A42240d8809B98364f2455p7138A74897K26900j12473A870J49178
$$ y = [35168, -77693, -415549, -68600, 60508, -22455, 634, 162781, -261405, -24345, 237966, -27687, 87222, 133511, -204694, 6483, 19776, 58425, -46423, 532831, 144867, -63114, 80075, 105403, -330701, -6820, 224598, -12351, 145879, -258226, 216923, 29878, -63975, 49461, 239973, 198072, 207752, -249677, 136785, 111557, 109560, 141706, 339979, -202963, 4003, 136860, 137704, -25429, 358096, -46734, 32473, 59763, 192435, -58459, 257759, 39455, 164704, 145772, 32856, 28535, 284242, -10212, 149472, -228617, 528221, 82280, 64877, 143869, -200080, 232438, 154073, -43873, 397379, 603, 115604, 193263, 277909, 479489, -149568, -158933, 142240, -48809, 298364, -62455, -139593, 174897, 401797, 289324, 1870, 151048]
11466A51048a60052j51890B04692O6842J28944a86463C65815I0691R9233n0358
11456A39566L7698F4222M04182c25125J47204r1242C2422d9843A06793J63874
11446B70667f1949A0428a97587B13006b8678E4785K24316A03940B0270O4040g191
11434B81293F9102J79446A057L00641A02497a74493q3315A26200a1723A74957
11423c163m4896A10187a18380p7434A44794b5915E952a09609D1672g8702m575
11412h3277B06517b01651A80397H3036a23526j5272j9586p173A65903g8348k17955
11401b96303F934L12896E2453K86511a47221d7827A42184K4844b01132k25460
11391d26592b11882B07311a86873a8487o04695B2756K33538a66549o681e6363
$$ y = [151048, -160052, -311942, 204692, 271534, 400478, -186463, 365815, 90691, 189924, 139566, 177264, 64222, 468404, -325125, -177921, -269163, 32422, -49843, 106793, 270667, -61949, 10428, -197587, 213006, -28678, 54785, 279101, 103940, 20270, 84310, -7191, 281293, 69102, 248548, 1057, 301698, 102497, -174493, -257808, 126200, -11723, 174957, -3163, -48059, 110187, -118380, -195814, 144794, -25915, 5952, -109609, 41672, -78702, -83277, 206517, -201651, 180397, 83036, -123526, -138798, -158384, -165557, 165903, -78348, -296303, 6934, 319830, 52453, 338964, -147221, -47827, 142184, 167028, -201132, -426592, -211882, 207311, -186873, -18487, -623182, 22756, 256294, -166549, -173230, -56363]
11380A09236m6434j4528g8603m42H9457e0643E18072I2655K26810a20404H8607
11368G8871f2466j65560f9971E1210a55727l0137A1547a61544c5904j10264A3194
11356B21813J23098d53758a29798B07163c93633G9839J22974r8379N4642f9982
11345e1443j07015D2295K05946b85970d9949h643A19116M8292a40603A65354c5103
11333d08363C0159a40078p8154f7623k51827A56836f0390D8134a76203A45134
11322d0035j51404e4670A28361g0233K9697p6388E2332b29540J14258l26978a42794
11310c0381A74505J3526b4142C5657b26926C06510A2213J7454b38935e1609B12103
11298b22517B44023J11486j39188G3639f1383j6506r2962K1858G7799b52103a0100
$$ y = [109236, 62802, 48274, -78603, -79045, 89457, -50643, 518072, 92655, 319465, -120404, 88607, 78871, -62466, -228026, -69971, 51210, -155727, -185864, 11547, -161544, -35904, -146168, 13194, 221813, 344911, -453758, -129798, 207163, -393633, 79839, 202813, 104434, 159076, -69982, -51443, -158458, 42295, 248241, -285970, -49949, -8643, 119116, 167408, -140603, 165354, -35103, -408363, 30159, -140078, -218232, -67623, -319450, 156836, -60390, 48134, -176203, 145134, -40035, -191439, -54670, 128361, -70233, -40536, -116924, 52332, -229540, -115282, -442260, -142794, -30381, 174505, 188031, -24142, 35657, -226926, 306510, 12213, 29667, -238935, -51609, 212103, -222517, 244023, 355509, 216321, 73639, -61383, -77889, -170851, -148993, 77799, -252103, -10100]
11286b21646P9967k3033d8363j04664P2595G4161b21721A25442E0970g9328B8650
11274A41761f8309B1701b9188n802l31639B02639J0295a61265E4412O3349h4943
11262I8440a1455A44340b06584k465p511b9144G3468L9593b63473d6445n3537
11251i9982A77409A909a50726J0404M3066B7351q135b69279A63792b67144A55472
11239c97543A19629b2300k42420A6526L21119a56034B9857h8593j1843j16751
11229b17187A60530E1008P7529a35876B7386D917J74001a16333k9805L4802A05326
11217b40329g2252k7256j2921i824r2721A24529g6384j10864A71918e32861H3510
11205b15062G2298a03604j76716J27245k6740a5107k61738D7810b45398R8443
$$ y = [-221646, -141679, -164712, -48363, -153027, -80432, 74161, -221721, 125442, 50970, -79328, 28650, 141761, -68309, 21701, -29188, -34990, -366629, 202639, 212934, -161265, 54412, 117761, -84943, 98440, -11455, 144340, -206584, -209049, -216560, -29144, 73468, 113061, -263473, -46445, -99982, 177409, 1909, -150726, -140322, -97256, 27351, 19216, -269279, 163792, -267144, 155472, -397543, 119629, -22300, -264720, 16526, 337645, -156034, 29857, -88593, -100436, -217187, 160530, 51008, 128537, -135876, 27386, 4917, 178918, -116333, -146138, -111336, 105326, -240329, -72252, -99508, -112429, -9824, -102545, 124529, -76384, -187248, 171918, -532861, 83510, -215062, 72298, -103604, -280320, -153075, -179815, -15107, -276845, 47810, -245398, -146955]
11195a46955f1349j66017a02295F0562J62746i0705A41315F0744b67307I080M04864
11184D13944b47909A30529a45743o4954i1970C58513c2256j41366A54782J54886
11174C09668a57054H5052b50545A11655q113J92b16782h4137j54130b5691a2137
11162A36967b21344e3382j82367b3298A4928d2938F6927N8462Q5596F4319a37917
11150a71850a016m28854i1428j88956E7044b64641A12914J679a11815j6386L1814
11139i6387C3522J72164b1215A17608a74386r7869A19740f4314k6764c3046j05205
11128a38251A64687e4435F8562n940g1875A07403a95814c7919A04591a60863a06
11116a48315A80966a10368A17298a25694C2368r771J58909a56906a0040j74202
$$ y = [-146955, -61349, -227366, -102295, 60562, 223308, -90705, 141315, 60744, -267307, 9080, 413944, -247909, 130529, -145743, -210697, -91970, 358513, -32256, -173622, 154782, 309668, -157054, 85052, -250545, 111655, 103542, 103734, -216782, -84137, -238267, -25691, -12137, 136967, -221344, -53382, -235749, -23298, 14928, -42938, 66927, 125389, 210985, 64319, -137917, -171850, -1016, -429870, -91428, -280384, 57044, -264641, 112914, 114593, -111815, -128201, -96387, 33522, 205686, -21215, 117608, -174386, -272255, 119740, -64314, -91078, -33046, -138251, 164687, -54435, 68562, 62622, -71875, 107403, -195814, -37919, 104591, -160863, -106, -148315, 180966, -110368, 117298, -125694, 32368, 22597, 181506, -156906, -10040, -184242]
11106a84242A24649K5178c0423A85593A0931J98673M2941i0854B23836N6843b3901
11094B51177G6347C0863a7913C56838j06397J96470A39215Q6795A03498A7116
11083A77133g1570B33737B5548K65325a03152p1433B35064a04915A63232L87100
11073E50332B63679o3992J42519a22120A43127K57632A99736J58859j54902J80102
11063C83795j69690N8956p061J83643j75157J3154N32026k67087J59046k78149
11053D33476L18093l14944K29346j61960K06411j46364M8692j04762O3703K21978
11043G93669j68683K81538m23663K66867l62125J84626L00714k44351J46877l35357
11033D40112M15436j75620P7219r4029j83664K47102C30405K78269L8741R4076
$$ y = [-184242, 124649, 149827, -30423, 185593, 10931, 209604, 252545, -90854, 223836, 280679, -23901, 251177, 76347, 30863, -17913, 356838, 250441, 446911, 139215, 226010, 103498, 17116, 177133, -71570, 233737, 25548, 290873, -103152, -174585, 235064, -104915, 163232, 550332, 263679, 199687, 342206, -122120, 143127, 400759, 199736, 358595, 203693, 383795, 214105, 273061, 266000, 449643, 274486, 287640, 819666, 552579, 711625, 433476, 751569, 436625, 665971, 504011, 710422, 564058, 612750, 507988, 571691, 793669, 624986, 906524, 482861, 749728, 387603, 572229, 872943, 628592, 775469, 440112, 855548, 679928, 757147, 663118, 479454, 726556, 330405, 608674, 647415, 741491]
11023G41491j32711L3462r7043R8152p1098j42991J20589Q5009k18582A89955
11012E14872K21121j17069j6141j44733J4299M4326J97995k29835K3581A78035
11001H60172l37444L005J98462k66214A14061M75487L65500D33248K73868k02056
10991E05060K67666j81703M6068J92815j92875k58378M07640L3222N3933r7066
10981G76382n4659O19290m27750p1225J78862L04117o35280R13127l20172J06541
10971A389233K55312K81226L22205J65822J6205q3105k46951J39355M2451o25511
10961A656242K68036m29465O1566l83747O64350j00704k18156N2395q024K39684
10951A802177K0971m15729L3463m4047m08150l5904k52121k49134Q5782J5183
$$ y = [741491, 608780, 642242, 545199, 643351, 572253, 429262, 549851, 634860, 416278, 189955, 514872, 735993, 618924, 602783, 458050, 472349, 516675, 714670, 484835, 508416, 178035, 860172, 522728, 525733, 724195, 457981, 114061, 589548, 955048, 433248, 707116, 505060, 772726, 591023, 637091, 829906, 637031, 378653, 786293, 819515, 873448, 776382, 721723, 1341013, 913263, 842038, 1020900, 1325017, 689737, 1602864, 1282692, 1389233, 1644545, 1925771, 2247976, 2413798, 2430003, 2346898, 2099947, 2239302, 2281753, 1656242, 1924278, 1494813, 1556379, 1172632, 1836982, 1736278, 1518122, 1570517, 1562493, 1802177, 1823148, 1407419, 1440882, 1396835, 988685, 952781, 700660, 451526, 537308, 552491]
10941E52491k8108q4295j70776B7099H853J83983E5042M8988a95545B21885i3432
10929a2599B36251f3596K1777C93137q7843M4176c47763d9916j64968F6654a77972
10917C79478A66903A0965a45580A63498i8184I7278c41546A74445e7440H3111
10906A17554a18123B5283c26124i4210j6025b6429J089q7660c5199j29874F4979
10894b75229R4638M598A28529b16681A13563H274g7856m1414J5634M1500k23933
10883b86069I4931b09197n4174B24301i1213q1681b7016k692j66559E165c0054
10871b27655B3562a38042l01121A89243A841N7314a67431B06123a39307e7941
10860b29769h3211r5969F902e892A87676d3151k8170B48942c8289A31842J35435
$$ y = [552491, 524383, 440088, 269312, 27099, 8853, 192836, 55042, 104030, -195545, 221885, -93432, -12599, 236251, -63596, -41819, 393137, 305294, 349470, -347763, -49916, -214884, 66654, -177972, 379478, 166903, 10965, -145580, 163498, -98184, 97278, -341546, 174445, -57440, 83111, 117554, -118123, 25283, -326124, -94210, -110235, -26429, -25340, -113000, -35199, -165073, 64979, -275229, -180591, -175993, 128529, -216681, 113563, 8274, -77856, -119270, -103636, -62136, -286069, 94931, -209197, -263371, 224301, -91213, -172894, -27016, -29708, -196267, 5165, -30054, -227655, 23562, -138042, -439163, 189243, 1841, 59155, -167431, 206123, -139307, -57941, -229769, -83211, -179180, 6902, -5892, 187676, -43151, -71321, 248942, -38289, 131842, 267277]
10849B67277f8357B20096a33140K9676G0477M9859O1383a56330e5440C23933A19844
10837a45695n3320P5132B34030a02554j09143i9895j61283B69964d9980l22486
10827c72466I8982B217a81136D8058L26437a91552f5754k1284L2718j02716N2082
10816a04954C01541a92364D2986j7441a85333Q3548d99A92281b73475d934j23250
10805a28184d9672c046C692a9739E1486a53082d4632j24508K1238A33162d54857
10793f2067A24349a66066H3394l3968b70419B72106a6227r3375B6028f8491a2189
10781D88571a11590A61184a72734g2908j39450P6155A98452b79534J11744m4307
10771b12097F4458J09896k8647M3849c01248A16641f4222l0621A05647a38582
$$ y = [267277, -68357, 220096, -133140, -103464, 70477, 120336, 181719, -156330, -55440, 323933, 119844, -145695, -199015, -123883, 234030, -102554, -211697, -99895, -261178, 269964, -49980, -372466, 98982, 2217, -181136, 48058, 374495, -191552, -65754, -87038, -54320, -157036, -104954, 301541, -192364, 42986, 25545, -185333, -101785, -499, 192281, -273475, -4934, -128184, -49672, -3046, 3692, -19739, 51486, -153082, -44632, -169140, -147902, 133162, -454857, -62067, 124349, -166066, 83394, 49426, -270419, 272106, -16227, -109602, 26028, -68491, -12189, 488571, -111590, 161184, -172734, -72908, -212358, -136203, 198452, -279534, -167790, -212097, 64458, 174354, 145707, 189556, -301248, 116641, -64222, -94843, 105647, -138582]
10760A75620a01476A54661J169f3754A89704r1226e697B57985e6506j97427A24026
10748I8088a25025G55Q0162f8433k18597G2418a85284C612Q8502D2022l698b86831
10735g0752l31743f2001p2358b9024C30346a04814k34784D5356a48738q4599B02304
10723A5718i1322j78977A37421f2929A11162a68788M5137k9224A00180a03469
10712a66298B3994b14437j48181J3629d4835k48387g2031E0522d03424e2993n9916
10701a12909j36994j40849A95320i9993E653b98110A92271e9703E8694m098J2627
10690F7223K38947b0040p4976A7501Q2343a94504r2669F2472M469D965J30931
10679A35896E7169b59871a09532D1902a35204A5127a10694B23285b10209Q020
$$ y = [175620, -101476, 154661, 155830, -63754, 189704, 98478, -5697, 257985, -56506, -253933, 124026, 98088, -125025, 755, 80917, -68433, -287030, 72418, -185284, 3612, 92114, 42022, 38324, -286831, -70752, -402495, -62001, -134359, -29024, 330346, -104814, -339598, 45356, -148738, -233337, 202304, 15718, -91322, -270299, 137421, -62929, 111162, -168788, -123651, -152875, 100180, -103469, -166298, 23994, -214437, -362618, -348989, -44835, -293222, -72031, 50522, -403424, -52993, -112909, -249903, -390752, 195320, -99993, 5653, -298110, 192271, -59703, 58694, 54596, 67223, 306170, -20040, -95016, 17501, 99844, -194504, -287173, 62472, 66941, 4965, 135896, 57169, -259871, -109532, 41902, -135204, 15127, -110694, 223285, -210209, -202189]
10669b02189B56240h7619j5535j10562c0570k40848m8921A81651a64624B57019
10658A06736K34462b27403f703A12790K16585c65246a23079j29813j2412h5178
10647C54688c22327J60473h0097k73919A17443b44776N9886J6781p9674J02347
10637a45436l9783P3956G2501k587a89042n8449A37454c42832g7409J8056l03787
10626c63140C38759b31588j1495g287r7421n596e0790A79075b74909O7140j23335
10615c31104b5596D2890a87273A72137c3667j78735B35574a5081I7680a05719
10604F1682a05958l6703A7401J0847h4824H6821M423h3694G882L61823B3485h7385
10591c40558g1207j03470g2646k58544a43622B11471L6431c98488a53283b2693
$$ y = [-202189, 256240, -87619, -103154, -213716, -30570, -271418, -320339, 181651, -164624, 257019, 106736, 341198, -227403, -6703, 112790, 329375, -365246, -123079, -252892, -265304, -85178, 354688, -322327, -161854, -80097, -354016, 117443, -244776, -184890, -168109, -247783, -145436, -185219, -111263, 72501, 69914, -189042, -247491, 137454, -342832, -77409, -59353, -363140, 338759, -231588, -243083, -7287, -104708, -110304, -50790, 179075, -274909, -207769, -331104, -25596, 42890, -187273, 172137, -33667, -212402, 235574, -15081, 97680, -105719, 61682, -105958, -142661, 17401, 28248, -84824, 86821, 91244, -83694, 7882, 369705, 23485, -87385, -340558, -71207, -174677, -72646, -331190, -143622, 211471, 247902, -398488, -153283, -22693]
10580a47883j84907a02491L8311K8317B08097i7453A51716a06966M1976j2672
10570g7662k3625G7075b18743D4144a83124P5452E742i8306A05126P7451R6795
10559B79372b14927B52500a1078j76733m9862A2520b68377b4361C10898d9758
10548a47437k94224G0212D138J8025a0898j16687J1496C29269R3993b29800C7977
10536b41180p5536G1618e8840j74551e1802l94016c6548B9867a01853o4983d0155
10524e9866o6114I8035h1512G47J87253e8807j62505d4953I5954a68033n6250
10513b24283C12512C7608A4639a3217A74657q5256a44224f5245A11677A1301a19940
10501a45409k0505B8718b5024I9256e288H8980b24661P2868D2351a88741A57109
$$ y = [-147883, -332790, -102491, -64180, -35863, 208097, -97453, 151716, -106966, -64990, -77662, -101287, 77075, -218743, 44144, -183124, -107672, 5742, -98306, 105126, 182577, 279372, -214927, 252500, -11078, -187811, -237673, 12520, -268377, -24361, 310898, -49758, -147437, -441661, 70212, 4138, 22163, -10898, -127585, -116089, 329269, 423262, -229800, 37977, -241180, -316716, 71618, -58840, -233391, -51802, -445818, -36548, 29867, -101853, -166836, -40155, -59866, -125980, 98035, -81512, 747, 188000, -58807, -221312, -44953, 95954, -168033, -224283, 312512, 37608, 14639, -13217, 174657, 89401, -144224, -65245, 111677, 11301, -119940, -145409, -165914, 28718, -25024, 99256, -5288, 88980, -224661, -151793, 42351, -188741, 157109]
10489F5400l2013Q6106f16170a24710F4776f3849p3375e4801j42751O2370C24248
10477G1294M4122Q8500L4296M5546L20888K26963G0081O3718P293b12492C28570
10465b11125B01703k2383c12973J38637j10973B55859a35437L3244D1962R5624
10455A37586B5188b2265C84395D5916a43406B07158E7705a78474l7441A08109
10444a43652j79836A06982f3517m8941r6623L2916C61629E07J40050k1022a14856
10432a8694G5595a12403o7024A53311b00445C0073c87242a13953m8248I9322a77132
10420c06793F8322g2573m06267D7024a65742B1943J78491c04092O1304e6843f653
10408A43033a71159h3820r5635B13481N3799a16651k9147C39376b01622f0583
$$ y = [65400, 33387, 119493, -616170, -124710, 64776, -63849, -137224, -54801, -197552, -135182, 324248, 71294, 115416, 203916, 238212, 283758, 604646, 831609, 70081, 133799, 141092, -212492, 328570, -211125, 201703, 179320, -312973, -174336, -285309, 255859, -135437, -102193, 41962, 137586, 25188, -22265, 384395, 45916, -143406, 207158, 57705, -178474, -215915, 108109, -143652, -323488, 106982, -63517, -112458, -209081, -176165, 361629, 507, 140557, 119535, -114856, -18694, 75595, -112403, -179427, 153311, -200445, 30073, -387242, -113953, -162201, 99322, -177132, -306793, 68322, -72573, -478840, 47024, -165742, 21943, 200434, -304092, -242788, -56843, -6653, 143033, -171159, -83820, -179455, 213481, 267280, -116651, -145798, 339376, -201622, -60583]
10397a64358N4773a0575G5644a05529e625K047E3300g577C46586b72289J07424
10386a64865P6445a9202r5600C09194r9521n2428k4595b27405D7284m547o871
10375C5866K18929j09658K96475C0370J09275K25252C0687M54390j41134A58617
10364A92765a09986C15982j10203J02515J51477A84584J44847A39582L1435C547
10353F2346J83426F2198Q6425a45937F76876j61836k52840l6907Q5107A29405
10342C01086F2163M77501r065k57608M4015p2985q2431k8976I395K68948b696
10330b48769B13799A3970b62725q9712B24046G2372a63164A1227L29795a59865
10319A88480l3143p2527J25012J11239e5194a4546C2360a02786b450A87882G6832
$$ y = [-164358, -109585, -10575, 75644, -105529, -5625, -3578, 53300, -7577, 346586, -272289, -164865, -88420, -19202, -114802, 309194, 209673, 157245, 132650, -227405, 47284, 42737, 35866, 254795, 145137, 441612, 30370, 139645, 364897, 30687, 485077, 343943, 158617, 192765, -109986, 315982, 205779, 308294, 459771, 184584, 329431, 139582, 171017, 3547, 62346, 245772, 62198, 148623, -145937, 676876, 515040, 262200, 225293, 310400, 129405, 301086, 62163, 539664, 530599, 272991, 317006, 244021, 161590, 132614, 9395, 278343, -2696, -248769, 213799, 13970, -262725, -352437, 224046, 72372, -163164, 11227, 341022, -159865, 188480, 155337, 82810, 207822, 319061, -55194, -14546, 32360, -102786, -2450, 187882, 76832]
10307A60254Q5447a75656A19911m9163d22847F9183a11350D580g066m68359g0011
10295A28909b40999g2549i171l50827e8025j17589P2087g740F8162b13210O5115
10284a48095k09764B5547C7J2729J31508b2360E2061H261a29108f1498B61588
10272d3360q5900A2591d35039A42107Q8646k7848C5366J18150p5861c73568A5906
10260a42891A53305g6051F9661b81195I9164a9751B08585Q0004L2607n0828N6640
10249C27008a66168B57599J78525H7678Q4836c31238J09564K9878M4822A29185
10238B0530J95709C1575d3135k73069A15856R1003F6825b70178a8148d178j77355
10227a81533g0472k85262J45334A12805i8015J6685L1956p9773I107a14140j00688
$$ y = [160254, 245701, -175656, 119911, 70748, -422847, 69183, -111350, 4580, -7066, -475425, -70011, 128909, -240999, -72549, -9171, -359998, -58025, -175614, -103527, -7740, 68162, -213210, -148095, -357859, 25547, 37, 12766, 144274, -22360, 52061, 8261, -129108, -61498, 261588, -43360, -129260, 12591, -435039, 142107, 230753, 202905, 35366, 153516, 77655, -373568, 15906, -142891, 153305, -76051, 69661, -281195, 99164, -19751, 208585, 288589, 321196, 270368, 327008, -166168, 257599, 436124, 87678, 172514, -331238, -221674, -191796, -146974, 129185, 20530, 216239, 31575, -43135, -316204, 115856, 206859, 66825, -270178, -18148, -4178, -181533, -70472, -355734, -210400, 112805, -98015, -81330, -49374, -129147, 9107, -114140, -214828]
10216b14828b1074q4648E1720B3623a35503B16147r6678d5494m7236o4860k6869
10205a84459j2560f9706A02372c04517J04204E7871d15915D0628a42060d2591
10194b55823f4727l16349b632k33071g8128l3933c5366m6488l29548G5743b35155
10182D16919A48417k980a67690c412o4420j73092k14394a6767r8331M5889j95408
10171b64617A9955i0791k38292A37364g0359A27151C1918a07510C3810e4070n1732
10160a05802A5439K41988q6946d4380a8333k1321l67717a03581A78846N102l6748
10149A47200b20129b658j62017j69041a09936l15224J83930J18717j59305G7541
10138c44113J40462n6788A03073j8132P1842d12005f988D405d4776j57122R5886
$$ y = [-214828, -21074, -105722, 51720, 23623, -135503, 216147, 119469, -45494, -92730, -157590, -184459, -197019, -69706, 102372, -304517, -200313, 57871, -415915, 40628, -142060, -42591, -255823, -64727, -381076, -2632, -235703, -78128, -112061, -35366, -81854, -411402, 75743, -235155, 416919, 148417, 145437, -167690, -3412, -67832, -240924, -455318, -16767, -115098, -69209, -264617, 19955, -90791, -329083, 137364, -70359, 127151, 31918, -107510, 33810, -54070, -105802, 15439, 257427, 170481, -44380, -18333, -39654, -407371, -103581, 178846, 183948, 147200, -220129, -2658, -164675, -333716, -109936, -425160, -241230, -122513, -281818, 77541, -344113, -203651, -260439, 103073, 84941, 156783, -412005, -6988, 4405, -44776, -201898, -106012]
10127a06012k0006A06355c74211E1102a37500a1237j23450A6918K28989b26888
10116e36354A03625D2769P3558k1089J98499A9649J11401k1690B5617a45033A07100
10104b48041c5147B82268m9198b5240B90709c34855a47603P2775A39962b64539
10093b6430B9250N3028c8282n2278a5134j42567A40661c24755A1072K81843d3126
10081b89875a30304A66199k9074b24815F9019b27353b4028k7444B4195g9409K707
10070g6702J0370j08126d7117D02271g4325r973C1388a30309N0245a2192j61895
10059a74087c1195k74187r421J45343C26655E4377a54395A17661a52796H5023
10048a2555k63034A06931i2890F6749d21490C28418A8303b32963c1617A22226
$$ y = [-106012, -126018, 106355, -374211, 51102, -137500, -11237, -134687, 16918, 245907, -226888, -536354, 103625, 42769, 116327, 95238, 293737, 19649, 131050, 109360, 25617, -145033, 107100, -248041, -35147, 282268, 233070, -25240, 290709, -334855, -147603, -74828, 139962, -264539, -26430, 29250, 82278, -38282, -90560, -15134, -157701, 140661, -324755, 11072, 292915, -43126, -289875, -130304, 166199, 137125, -224815, 69019, -227353, -24028, -51472, 24195, -79409, -76702, -66332, -174458, -47117, 402271, -74325, -84298, 31388, -130309, -80064, -12192, -174087, -31195, -305382, -314803, -169460, 326655, 54377, -154395, 117661, -152796, 85023, -12555, -275589, 106931, -92890, 66749, -421490, 328418, 18303, -232963, -31617, 122226]
10037c11856f4350j35356j75969h8730k36376J60243B7968c89143B04662a09361
10026F3159a03434N0989j1591A67586g5310A30798D3951b19291i9840H3455a78381
10014b56584B17298b0518l27737A86164a65129C463d8082f602A35932j3525c99219
10002B5248a78543j12348J33423I7483b26966R3835f4159p3078N7238d912k85054
9991b89966o476c2291k92741P9186f8427B04844d9340j58872G2079a40223j70423
9980c10646K4001p4354J48396O0265j5159C82038a38514j17871g3810D1561h99
9968c69277f25n7781C17949i2291a4693k04014O0013j26499l9833a06684K2697
9957h3987j01809D9807b6797B09632D2720e6008k50190J28637n4477H2153j8014
$$ y = [-311856, -64350, -199706, -375675, -88730, -325106, -164863, 27968, -389143, 204662, -109361, 63159, -103434, -52445, -64036, 167586, -75310, 130798, 43951, -219291, -99840, 83455, -178381, -256584, 217298, -20518, -348255, 186164, -165129, 3463, -48082, -6602, 135932, 122407, -399219, 25248, -178543, -290891, -157468, 97483, -226966, -133131, -64159, -137237, -79999, -4912, -289966, -296442, -32291, -325032, -245846, -68427, 204844, -49340, -208212, 72079, -140223, -310646, -286645, -360999, -212603, -152338, -167497, 382038, -138514, -256385, -73810, 41561, -899, -369277, -625, -58406, 317949, -92291, -14693, -218707, -158694, -285193, -325026, -106684, -83987, -185796, 49807, -26797, 209632, 42720, -56008, -306198, -177561, -232038, 82153, 64139]
9946F4139a54572B2014c48567A46875p2178A0841J38022b52861Q9791N6083j0232
9935a17219j73385A74412c11759e1954A04732K2395l9517b83515A47517g7335
9924a71494A61224E8252a31075j19016j2517J12958b1670k49658c7655A87625
9913A53448a2614l11891A16591l5188e4264k526j82125C6447J79877f0519d55
9901D027a14832A4049J75418a24198k2118c3775H7555a44340M2183K1780J0794
9890f9583l3356B36829D2545A4720Q8106B9839Q0511a8222r4272I5053a47698
9878a64884l3606A54892c8657q9014D7461b17610Q3039K7790m4235O0416A39885
9866H9193K15187I8719a94236j64146H5682c7443m0773C0197M7765a57278M7859
$$ y = [64139, -154572, 22014, -348567, 146875, 74697, 10841, 148863, -252861, -163070, -106987, -117219, -290604, 174412, -311759, -51954, 104732, 127127, 87610, -283515, 147517, -77335, -171494, 161224, 58252, -131075, -250091, -262608, -149650, -21670, -271328, -37655, 187625, 153448, -12614, -324505, 116591, 81403, -54264, -56790, -238915, 36447, 216324, -60519, -455, 4027, -114832, 14049, 189467, -124198, -146316, -33775, 87555, -144340, -102157, -80377, -69583, -102939, 236829, 42545, 14720, 102826, 29839, 110350, -18222, -112494, 95053, -147698, -164884, -198490, 154892, -38657, -127671, 47461, -217610, -134571, -106781, -151016, -90600, 139885, 89193, 304380, 98719, -194236, -358382, 85682, -37443, -78216, 30197, 77962, -157278, -109419]
9855a09419m8349A34314B5577a99263k52004A85737B4095a41447d7814k5911j62307
9844b36032d5667C9872b94881J41615O8104B20927j7493a20817B68618a51792
9833a70944I3547L0950b12974j85764J52199D0701L5885B6363b40939f0451m8307
9822a08758k93362H5048k5371B7032A0024a86009k0167H7947b12262N0555N6665
9811a05042o3977A56977b3966C11168a33791k13136a35253m0336j6054q723A53890
9799B25580c74428f4287r151A37539A891N6836d68843A61292Q878a37507k68997
9788d06504G2517b7425j1555A67215N2719p4037a0046j84412A0922J03153l4595
9777G9480C5761b03144j7906R0146j30522a9520q5540b2080j39074o1534j26972
$$ y = [-109419, -157768, 134314, 25577, -199263, -451267, 185737, 24095, -141447, -47814, -73725, -236032, -45667, 39872, -294881, -153266, -85162, 220927, 203434, -120817, 268618, -151792, -170944, 93547, 124497, -212974, -398738, -246539, 40701, 76586, 26363, -240939, -60451, -108758, -402120, 85048, 59677, 27032, 10024, -186009, -206176, 87947, -212262, -161707, -105042, -169019, 156977, -23966, 311168, -133791, -346927, -135253, -175589, -191643, -200366, 153890, 225580, -374428, -64287, -73438, 137539, 1891, 58727, -468843, 161292, 170170, -137507, -406504, 72517, -27425, -38980, 167215, 219934, 145897, -10046, -194458, 10922, 114075, 79480, 35761, -203144, -221050, -130904, -261426, -19520, -105060, -22080, -161154, -222688, -349660]
9766c49660J48655k775q4611j51760I657L3436h8805p3080j84625f5884k68996
9755c34880C07113c54774G3343a85339a2094j66628F3181b29089B41690b89319
9744a31840J5785o9368g4255A43092a64523j3577B25008a1311j81456N6223I3477
9732b75966a3728j19982f4171k29717I306L6546b43401F2290b36677F0171L32264
9721C92435c2809o3743j5411l0698E7418d6400k19540a16144c7190B43371b54648
9709a69524f4076B8b56310f282j52712M0711r711E8320b08719f0025m54680b14836
9696A35704C6584a05511c3009l45289f4452j75008n3320A16385L06699a36789
9685a86183A95215b17664O4229f4070j27230f4489B6646r192c3862j59852O3156
$$ y = [-349660, -201005, -203780, -288391, -440151, 9657, 43093, -88805, -161885, -346510, -65884, -334880, 307113, -354774, 73343, -185339, -12094, -178722, 63181, -229089, 241690, -289319, -131840, -116055, -185423, -74255, 143092, -164523, -178100, 225008, -11311, -192767, -136544, 93477, -275966, -13728, -133710, -64171, -293888, 9306, 45852, -243401, 62290, -236677, 60171, 392435, -32809, -96552, -111963, -142661, 57418, -46400, -265940, -116144, -37190, 243371, -254648, -169524, -64076, 28, -256310, -6282, -158994, -118283, -127994, 58320, -208719, -60025, -514705, -214836, 135704, 36584, -105511, -33009, -378298, -64452, -239460, -292780, 116385, 423084, -136789, -186183, 195215, -217664, -153435, -64070, -191300, -64489, 26646, 17454, -33862, -193714, -130558]
9674a30558o8975D9052H350C615P888c10745A16244A4229N3208N3763b52312F7838
9661A69401I484a6689r5674k88716J12548g0207j78974R9140B47694B8787c52162
9649a06114A64576j8228a33094k28911a2862n7141j84970G0269b47682m6618A41525
9637A9946J3551h2234l49609g0452o692L1226j74120k15880a71069Q3000A27723
9625a4615f386j39715H2025b16475k66656J90791A9420N0194a9933A72a54078
9613D0323M4287d2571J9474F0805c08511B9965a84973P2252B40115b43611d0133
9601c56671b1258B19114h0245A00184B7495L37762a6260A7312b08508C69854c31786
9589b08450j20367A72052b54991K1560E2082F313a00052b156k59184f8972j34358
$$ y = [-130558, -199533, 49052, 8350, 3615, 11503, -310745, 116244, 14229, 67437, 121200, -252312, 67838, 169401, 9484, -16689, -112363, -401079, -288531, -70207, -249181, -150041, 247694, 28787, -352162, -106114, 164576, 146348, -133094, -362005, -12862, -70003, -254973, 70269, -247682, -294300, 141525, 19946, 33497, -82234, -431843, -70452, -77144, -45918, -220038, -435918, -171069, -88069, 127723, -14615, -6386, -146101, 82025, -216475, -483131, -292340, 19420, 69614, -19933, 172, -154078, 40323, 84610, -42571, -23097, 60805, -308511, 29965, -184973, -112721, 240115, -243611, -40133, -356671, -21258, 219114, -80245, 100184, 27495, 365257, -16260, 17312, -208508, 369854, -331786, -208450, -328817, 172052, -254991, -233431, 52082, 6313, -100052, -2156, -261340, -68972, -203330]
9578b03330G9777a58581j02978E3972K14116H0775b24708c8897j374A5259c64351
9566a73406J7140k9889d0129m4714C55492c78993B60822b64477B2170J88390B1752
9554a97876j10256h5705O074n0703r0595a7042j63477g344o1024l23209B11768
9542c52870C03102D6101c23355J12861B742N5565k5468g0661F5374a82591B22000
9530B16609c48149A01184h3075l39404J79782A66392L1049C4365e342j2728m4594
9519f2664A82314c37742B4684P2335J42929G6782e2814A47874e1610j40774j18423
9508c10807J04267A4107a5547A84756a07174A67982b64324K2097j5630g4051B6395
9496A20261C394M4198a60478C7c28254B03086b09331B67171A06510a22734D5726
$$ y = [-203330, 79777, -158581, -261559, 53972, 268088, 80775, -224708, -38897, -40271, 15259, -364351, -173406, -156266, -186155, -40129, -84843, 355492, -378993, 260822, -264477, 22170, 210560, 21752, -197876, -308132, -85705, -79631, -130334, -220929, -17042, -180519, -7344, -68368, -391577, 211768, -352870, 303102, 46101, -323355, -210494, 2742, 58307, 32839, -70661, 65374, -182591, 222000, 216609, -348149, 101184, -83075, -422479, -242697, 166392, 197441, 34365, -5342, -18070, -62664, 182314, -337742, 24684, 97019, 239948, 76782, -52814, 147874, -51610, -192384, -310807, -206540, 14107, -15547, 184756, -107174, 167982, -264324, -242227, -257857, -74051, 26395, 120261, 3394, 47592, -160478, 37, -328254, 203086, -209331, 267171, 106510, -122734, 45726]
9484b48448I4800a02938n2575G2561c1509n277j34563C53148A26920a1882A10748
9472b50835O6602f2505n6598E571h3264b8205j7561J5644A05498a07683B38678
9460d1836D7830j6829h9156D6475b49412a3362p7936b5806k07448H3004b59212
9448b49273l7737P0208N2463A00990k8789J6409c65934A17077C3432L1058A8933
9436e6697j82589P9260A9368h3835L4137K4435k30076I583R776a68926H3257a29517
9423c9480J2866k72047F6575A5085J11319a77180k09991E2632b69368I760b51591
9411f3457k8125B02457G7954O9716b81384M8637H714a15237k4938d3674n2665
9400i6339j60570L4402c2427A32271a09631r8367B74199h9210K8289k73289J45896
$$ y = [-248448, 94800, -102938, -155513, 72561, -31509, -36786, -171349, 353148, 126920, -11882, 110748, -250835, -184233, -62505, -119103, 5571, -83264, -28205, -45766, -30122, 105498, -107683, 238678, -41836, 47830, 31001, -89156, 46475, -249412, -13362, -91298, -25806, -233254, 83004, -259212, -249273, -287010, -216802, -164339, 100990, 72201, 88610, -365934, 117077, 33432, 64490, 18933, -56697, -239286, -160026, 19368, -83835, -49698, -25263, -255339, 9583, 19359, -168926, 83257, -129517, -39480, -26614, -298661, 66575, 15085, 126404, -177180, -387171, 52632, -269368, 9760, -251591, -63457, -91582, 202457, 77954, 147670, -281384, -232747, 8714, -115237, -140175, -43674, -96339, -256909, -222507, -32427, 132271, -109631, -207998, 274199, -89210, -60921, -334210, -188314]
9389a88314N5969F8919K2434a00167B79934a39817I6025a42222A644d7405l82557
9378d29962J63693B3543b10360A71670a08333c0709p7620r4760j66186A23562
9367a09844r8783a2023r8829j69209B09920r7866b9910k13198j49206i776j58225
9356a68001j9716o1374f156j02280M3556A26264a10188N0138j43418f3817b34
9344D8217M3390l0132b36434c28A71763c4184A75251F2113c05101h584G2788d2658
9331G8955a03391m6272A72272a26073j26495a21656c2362p8710K4393A55414A6864
9319f6287l5192j12740R3723O724j02959B08935G3801a06425p2209O8934M406
9308a05294k76557A76293a28783A14401a99234C21659A32405k4323a51524j5319
$$ y = [-188314, -132345, 68919, 91353, -100167, 279934, -139817, 96025, -142222, 1644, -47405, -429962, -266269, 23543, -210360, 171670, -108333, -30709, -108329, -203089, -369275, 123562, -109844, -208627, -12023, -110852, -280061, 209920, 112054, -29910, -243108, -392314, -9776, -168001, -187717, -249091, -6156, -108436, -64880, 126264, -110188, -60050, -203468, -63817, -234, 48217, 91607, 61475, -236434, -328, 171763, -34184, 175251, 62113, -305101, -8584, 72788, -42658, 78955, -103391, -149663, 172272, -126073, -252568, -121656, -32362, -111072, -86679, 155414, 16864, -66287, -101479, -214219, -120496, -113772, -216731, 208935, 73801, -106425, -178634, -109700, -105294, -381851, 176293, -128783, 114401, -199234, 321659, 132405, 108082, -151524, -166843]
9298a66843J4063D9065h7923c2732H6557P8531d9883K514n525C4226f8155k02756
9286b70911C57881i6424A43291O0337a11655F7027B4017L10921C074J2812N4603
9275G0489f7526C9752a21530e2854l76932D0121a7785k63149B6481a3338j868
9264a5206k48912j9252g2216k4846F085b40990a18483K559m2370l04354F288K9494
9252C5782J27077c7937A03401a24094n2578Q5472l7101k86008L3302I2892J54304
9241B47196c28556B0953b35073P0490I9887K6394g6255a2584m38797C41519C3678
9229h4906A32165a18493j52632E4463a41878A09260j1974a58979L0802a9424A57023
9217B46813b16920j57844G1837B9344i2228M5070m7836j09118f8038o0158r6732
$$ y = [-166843, -152780, 49065, -87923, -32732, 86557, 165088, -49883, -47369, -52894, 34226, -68155, -270911, 357881, -96424, 143291, 203628, -111655, 67027, 24017, 334938, 3074, 15886, 70489, -67526, 39752, -121530, -52854, -429786, 40121, -17785, -280934, 26481, -13338, -15206, -264118, -283370, -72216, -97062, 6085, -240990, -118483, -115924, -158294, -462648, 6288, 35782, 162859, -37937, 103401, -124094, -176672, -91200, -128301, -414309, -381007, 92892, 247196, -328556, 20953, -235073, -164583, 99887, 126281, -76255, -12584, -451381, 341519, 33678, -84906, 132165, -118493, -271125, 54463, -141878, 109260, 97286, -158979, -128177, -19424, 157023, 246813, -216920, -374764, 71837, 29344, -92228, -47158, -94994, -204112, -68038, -128196, -224928]
9206b24928b4388A18237b5263m9775c0647r4004J6554I0305f1563a9648l5881
9195e5529E8549a8535j53234d2603B28354b05483L2367E0516d45262i1022c7982
9183D486N8818B4610a57174f2858j79105g5314o1314j22906D3791g7080j53319
9172b30399a2359m18257B10100i8913B30109A259c1506k44109f3064j34741A46636
9160d7576l08484J64543N6035E2196a11281m0501l12399a10008I3975J05587j9303
9149A80259o716e8807j87295i6685k800D19622c50512a21120b2921E1872A9176
9137i9107B4630b38933g1397H9162a99750D1575a36437A27349f1822A92805j353
9126A91452a64917P1447j3819r6483A87243A9416c37707J12988j13164e151j51291
$$ y = [-224928, -24388, 118237, -25263, -75038, -30647, -124651, -108097, 90305, -61563, -19648, -55529, 58549, -18535, -171769, -42603, 228354, -205483, -173116, 50516, -445262, -91022, -37982, 4486, 63304, 24610, -157174, -62858, -241963, -75314, -136628, -259534, 43791, -77080, -230399, -12359, -430616, 210100, -98913, 230109, 1259, -31506, -275615, -63064, -197805, 146636, -47576, -356060, -191517, -135482, 52196, -111281, -151782, -464181, -110008, 93975, 199562, 180259, 173543, -58807, -246102, -96685, -99485, 419622, -350512, -121120, -22921, 51872, 19176, -99107, 24630, -238933, -71397, 89162, -199750, 41575, -136437, 127349, -61822, 192805, 191452, -164917, -93470, -107289, -203772, 187243, 19416, -337707, -224719, -337883, -5151, -156442]
9115a56442A53138N347h8010B69155a01123A06340J58140d5332j1422G2959J00372
9104A73331N320D6272J39135G577a57888J6285M6781K0740j04208A05797b8049
9092a2744D6534M2029P5304P9942c88327e7943q3854c6478q6022K6626b1762k16204
9080b37966F2702a86682A46209a31832n6322l15104a68407G2188B3112a85763
9069a62411J2801A5309K6095c08509J50477c6635j40014k3646A04320D9666K32936
9058B82602g0654j7120d0838k35456A90867e7862B06455a22411o3038B41546a35226
9046a03664l0276M0232j13581A98838d43462a51301l4909F5414N0388J30421b43608
9034b17220l0644F8242a83610f3240q4040g1695C3827f6438j42662d1216A5575
$$ y = [-156442, 153138, 158485, -88010, 269155, -101123, 106340, 264480, -45332, -56754, 72959, 173331, 178651, 46272, 185407, 7577, -157888, -141603, -94822, -74082, -178290, 105797, -28049, -12744, 46534, 88563, 163867, 243809, -388327, -57943, -141797, -36478, -122500, -95874, -21762, -237966, 62702, -186682, 146209, -131832, -188154, -503258, -168407, 72188, 23112, -185763, -162411, -149610, 15309, 41404, -308509, -158032, -36635, -176649, -200295, 104320, 49666, 282602, -70654, -87774, -40838, -276294, 190867, -57862, 206455, -122411, -185449, 241546, -135226, -103664, -133940, -93708, -207289, 198838, -443462, -151301, -186210, 65414, 115802, 246223, -243608, -217220, -247864, 68242, -183610, -63240, -147280, -71695, 33827, -66438, -209100, -41216, 15575]
9022C2171b44161B6728O94a556A26998a71561r3797e4019k53858C20096E731d5500
9009b12939n4287B43650D0544h7026B99700E2373a29425A46736a89821N9652Q824
8998a21345p1548I2228K65134c022j16357q4900i3455c5739k3151k41355a10288
8986d1949H4866P0022a7230l24644J04457F9329c74321C4053a43630l62279b28049
8974a13932B1147h0996J5892D9012a2510E9541K27733b97745c3461r0609j7703
8963a41773N5976I5007M482M9962M2629d9178p3126M3875a6582B49331b7204q873
8951c6077J1064j5051A78933h3335A04251f3144b020m18776i8025b6841p9520
8940a06361j91111A0723J52072b41396a01485L5652k37981A62763J73813j27086
$$ y = [32171, -244161, 26728, 27422, -1556, 126998, -171561, -265358, -54019, -307877, 320096, 5731, -45500, -212939, -267226, 243650, 40544, -87026, 299700, 52373, -129425, 146736, -189821, -130169, -121345, -192893, 92228, 357362, -3022, -119379, -204279, -93455, -35739, -58890, -300245, -110288, -41949, 84866, 154888, -17230, -341874, -237417, 69329, -374321, 34053, -143630, -505909, -228049, -113932, 21147, -80996, -65104, 49012, -12510, 59541, 287274, -297745, -33461, -124070, -141773, -85797, 95007, 99489, 149451, 192080, -49178, -122304, -78429, -16582, 249331, -27204, -36077, -25013, -40064, 178933, -83335, 104251, -63144, -2020, -420796, -98025, -26841, -106361, -297472, 10723, 162795, -241396, -101485, -65833, -303814, 162763, 336576, 209490]
8930B09490f6959j52363A87874b82031a15362j07026f3203C46041J60841J08449
8920F15331Q43421M658241k472934A682357G64025B20885e3573I2004q91b46893
8909F4476d4314A78550J12836H3072J05637d49921I9665d8514B40286b3268I6810
8897f9491A34713b51749c9070G9846e1302N029l05986H3855b82365Q9399j86068
8886c79034J47903Q4471j73859b0307r0872F0474c1993A23553D7842a18122C6460
$$ y = [209490, -66959, -219322, 187874, -282031, -115362, -222388, -63203, 346041, 506882, 615331, 1458752, 6116993, 3644059, 1682357, 764025, 220885, -53573, 92004, 91113, -246893, 64476, -44314, 178550, 291386, 83072, 188709, -449921, 99665, -48514, 240286, -23268, 96810, -69491, 134713, -251749, -39070, 79846, -51302, -46273, -352259, 83855, -282365, -192966, -379034, -231131, -146660, -320519, -20307, -111179, 60474, -31993, 123553, 47842, -118122, 36460]
$$ [...]
##END NTUPLES=NMR SPECTRUM
##END=
