
##TITLE=AC1302_PERAH12114_6615240_0rTI94FHjm
##JCAMPDX= 6.0         $$ Bruker NMR JCAMP-DX V2.0
##DATA TYPE= NMR SPECTRUM
##DATA CLASS= NTUPLES
##ORIGIN= BRUKER
##OWNER= Administrator
$$ 1.72 TOPSPIN		Version 2.1
$$ 2012-08-02 18:47:26.171 -0500  Administrator@TOPSPIN
$$ Compression mode = diff/dup
##.OBSERVE FREQUENCY= 400.02188249412
##.OBSERVE NUCLEUS= ^1H
##.ACQUISITION MODE= SIMULTANEOUS (DQD)
##.ACQUISITION SCHEME= undefined
##.AVERAGES= 64
##.DIGITISER RES= 22
##SPECTROMETER/DATA SYSTEM= spect
##.PULSE SEQUENCE= noesygpps1d.comp
##.SOLVENT NAME= COFFEE_meoh
##.SHIFT REFERENCE= INTERNAL, COFFEE_meoh, 1, 14.96265
##AUDIT TRAIL= $$ (NUMBER, WHEN, WHO, WHERE, PROCESS, VERSION, WHAT)
$$ ##TITLE= Audit trail, TOPSPIN		Version 2.1
$$ ##JCAMPDX= 5.01
$$ ##ORIGIN= Bruker BioSpin GmbH
$$ ##OWNER= Administrator
$$ $$ C:\Bruker\TOPSPIN/data/COFFEE/nmr/AC1302_PERAH12114_6615240_0rTI94FHjm/12/pdata/1/auditp.txt
$$ ##AUDIT TRAIL=  $$ (NUMBER, WHEN, WHO, WHERE, PROCESS, VERSION, WHAT)
(   1,<2012-08-02 18:47:21.453 -0500>,<Administrator>,<TOPSPIN>,<go>,<TOPSPIN 2.1>,
      <created by zg
	started at 2012-08-02 18:35:51.234 -0500,
	POWCHK enabled, PULCHK disabled,
       configuration hash MD5:
       6B 1B 68 BB D9 2E 58 E2 7F 35 AD 54 07 DF 0E 41
       data hash MD5: 64K
       01 8D 82 E9 15 90 AF 6A 26 0B 93 B1 E0 22 D2 63>)
(   2,<2012-08-02 18:47:24.312 -0500>,<Administrator>,<TOPSPIN>,<proc1d>,<TOPSPIN 2.1>,
      <Start of raw data processing
       efp LB = 0.3 FT_mod = 6 PKNL = 1 PHC0 = 0 PHC1 = 0 SI = 128K 
       data hash MD5: 128K
       98 F4 9D EA AB 02 DA 01 CA AC 13 0C D2 BA 11 A4>)
(   3,<2012-08-02 18:47:25.531 -0500>,<Administrator>,<TOPSPIN>,<proc1d>,<TOPSPIN 2.1>,
      <pk PHC0 = 3.598022 PHC1 = 0 
       data hash MD5: 128K
       50 AF 13 8B 4F 3A 1B BD F4 6A 2F 48 DC F3 75 07>)
(   4,<2012-08-02 18:47:25.796 -0500>,<Administrator>,<TOPSPIN>,<proc1d>,<TOPSPIN 2.1>,
      <abs ABSG = 1 
       data hash MD5: 128K
       A5 84 A3 A7 B0 C8 FE 8D D8 EC 5E 91 36 FD E0 74>)
(   5,<2012-08-02 18:47:25.875 -0500>,<Administrator>,<TOPSPIN>,<proc1d>,<TOPSPIN 2.1>,
      <abs ABSG = 2 
       data hash MD5: 128K
       53 10 1B 03 7D 81 9D 7F EF A2 68 2C D3 BE D7 64>)
(   6,<2012-08-02 18:47:25.921 -0500>,<Administrator>,<TOPSPIN>,<proc1d>,<TOPSPIN 2.1>,
      <abs ABSG = 3 
       data hash MD5: 128K
       32 8E 46 A1 5E 3F 5A 5C BB 90 32 59 0B 30 E6 45>)
(   7,<2012-08-02 18:47:25.984 -0500>,<Administrator>,<TOPSPIN>,<proc1d>,<TOPSPIN 2.1>,
      <abs ABSG = 4 
       data hash MD5: 128K
       38 5C FA 32 A3 62 B1 52 42 AB 74 C6 80 C2 AF DA>)
(   8,<2012-08-02 18:47:26.031 -0500>,<Administrator>,<TOPSPIN>,<proc1d>,<TOPSPIN 2.1>,
      <abs ABSG = 5 
       data hash MD5: 128K
       F1 91 62 E3 F5 E1 1F 89 C5 5A 45 D2 2C D8 57 B0>)
$$ ##END=
$$ 
$$ $$ hash MD5
$$ $$ 02 15 5F D1 D1 AA EB E7 15 43 21 71 E2 CB BC 0B
##$RELAX= 
##$RELAX= 
##$RELAX= 
##$RELAX= 
##$RELAX= 
##$RELAX= 
##$RELAX= 
##$RELAX= 
$$ Bruker specific parameters
$$ [...]
150 150 150 150 150 150 150 150
##$TP07= 0
##$TPNAME0= <>
##$TPNAME1= <>
##$TPNAME2= <>
##$TPNAME3= <>
##$TPNAME4= <>
##$TPNAME5= <>
##$TPNAME6= <>
##$TPNAME7= <>
##$TPOAL= (0..7)
0.5 0.5 0.5 0.5 0.5 0.5 0.5 0.5
##$TPOFFS= (0..7)
0 0 0 0 0 0 0 0
##$TUNHIN= 0
##$TUNHOUT= 0
##$TUNXOUT= 0
##$USERA1= <user>
##$USERA2= <user>
##$USERA3= <user>
##$USERA4= <user>
##$USERA5= <user>
##$V9= 5
##$VALIST= <valist>
##$VCLIST= <CCCCCCCCCCCCCCC>
##$VD= 0
##$VDLIST= <DDDDDDDDDDDDDDD>
##$VPLIST= <PPPPPPPPPPPPPPP>
##$VTLIST= <TTTTTTTTTTTTTTT>
##$WBST= 1024
##$WBSW= 4
##$XGAIN= (0..3)
0 0 0 0
##$XL= 0
##$YL= 0
##$YMAX_a= 17195181
##$YMIN_a= -9516544
##$ZGOPTNS= <>
##$ZL1= 120
##$ZL2= 120
##$ZL3= 120
##$ZL4= 120
##$ABSF1= 14.96265
##$ABSF2= -5.595531
##$ABSG= 5
##$ABSL= 3
##$ALPHA= 0
##$AQORDER= 0
##$ASSFAC= 0
##$ASSFACI= 0
##$ASSFACX= 0
##$ASSWID= 0
##$AUNMP= <proc_prof1d_extract.lims>
##$AXLEFT= 0
##$AXNAME= <>
##$AXNUC= <1H>
##$AXRIGHT= 0
##$AXTYPE= 0
##$AXUNIT= <>
##$AZFE= 0.1
##$AZFW= 0.1
##$BCFW= 0
##$BC_mod= 0
##$BYTORDP= 0
##$COROFFS= 0
##$CY= 15
##$DATMOD= 1
##$DC= 0
##$DFILT= <>
##$DTYPP= 0
##$F1P= 0
##$F2P= 0
##$FCOR= 0.5
##$FTSIZE= 131072
##$FT_mod= 6
##$GAMMA= 0
##$GB= 0
##$INTBC= 1
##$INTSCL= 1
##$ISEN= 128
##$LB= 0.3
##$LEV0= 0
##$LPBIN= 0
##$MAXI= 10000
##$MC2= 0
##$MEAN= 0
##$ME_mod= 0
##$MI= 0
##$NCOEF= 0
##$NC_proc= -2
##$NLEV= 6
##$NOISF1= 0
##$NOISF2= 0
##$NSP= 0
##$NTH_PI= 0
##$NZP= 0
##$OFFSET= 14.96265
##$PC= 1
##$PHC0= 3.598022
##$PHC1= 0
##$PH_mod= 1
##$PKNL= yes
##$PPARMOD= 0
##$PPDIAG= 0
##$PPIPTYP= 0
##$PPMPNUM= 2147483647
##$PPRESOL= 1
##$PSCAL= 4
##$PSIGN= 0
##$PYNMP= <proc.py>
##$REVERSE= no
##$SF= 400.020008977946
##$SI= 131072
##$SIGF1= 0
##$SIGF2= 0
##$SINO= 400
##$SIOLD= 131072
##$SPECTYP= <>
##$SREGLST= <1H.CDCl3>
##$SSB= 0
##$STSI= 131072
##$STSR= 0
##$SW_p= 8223.68421052631
##$SYMM= 0
##$S_DEV= 0
##$TDeff= 65536
##$TDoff= 0
##$TI= <>
##$TILT= no
##$TM1= 0
##$TM2= 0
##$TOPLEV= 0
##$USERP1= <user>
##$USERP2= <user>
##$USERP3= <user>
##$USERP4= <user>
##$USERP5= <user>
##$WDW= 1
##$XDIM= 131072
##$YMAX_p= 404884789
##$YMIN_p= -10667
##$CURPLOT= <Network HP LaserJet P1505>
##$CURPRIN= <$Network HP LaserJet P1505>
##$DFORMAT= <normdp>
##$LAYOUT= <+/1D_H.xwp>
##$LFORMAT= <normlp>
##$PFORMAT= <normpl>
##$SURQMSG= 1
$$ End of Bruker specific parameters
$$ ---------------------------------
##NTUPLES= NMR SPECTRUM
##VAR_NAME=  FREQUENCY,     SPECTRUM/REAL,   SPECTRUM/IMAG
##SYMBOL=    X,             R,               I
##VAR_TYPE=  INDEPENDENT,   DEPENDENT,       DEPENDENT
##VAR_FORM=  AFFN,          ASDF,            ASDF
##VAR_DIM=   131072,        131072,          131072
##UNITS=     HZ,            ARBITRARY UNITS, ARBITRARY UNITS
##FACTOR=    0.0627417313425164, 1,          1
##FIRST=     8223.62146879497, -16,          -53577
##LAST=      0,             226,             -53589
##MIN=       0,             -10667,          0
##MAX=       8223.62146879497, 404884789,    0
$$ Real data points
##PAGE= N=1
##DATA TABLE= (X++(R..R)), XYDATA
$$ [...]
60917A957610j00905q9920q2009p7173p3740p0798o8589o6260o2058n6307n1423
60906A158428m8200m4740l9918l5229l2010k9346k6114k2946k0666j8683j6354
60895H24222j4243j2710j0872q250n932m840m229l110j770p33M72K266L847M251
60881G68369L703K961K274J664J259P10o06k250k927k594k814m369o034o640o730
60866G45976p184p710p896q265r086r374q392o957o015n149l771k555k236k006
60852F59380o92J265K502K801L137M174N785P693R570J0958J1908J3076J4618
60839G46175J5715J5864J5681J5735J5701J5406J5469J5890J5338J3084J0433
60828I10491Q908Q124O933N647N433O207O786O596N850M502K473M47q21j579k335
$$ plain form
60917 1957610 1856705 1766785 1684776 1607603 1533863 1463065 1394476 1328216 1266158 1209851 1158428
60906 1158428 1110228 1065488 1025570 990341 958331 928985 902871 879925 859259 840576 824222
60895 824222 809979 797269 786397 778147 772215 767375 763146 760036 758266 757533 758005 760271 764118 768369
60881 768369 772072 775033 777307 778971 780230 780940 780334 778084 775157 772563 769749 765380 759346 752706 745976
60866 745976 738792 731082 723186 714921 705835 696461 688069 681112 675097 669948 666177 663622 661386 659380
60852 659380 658688 659953 662455 665256 668393 672567 678352 686045 695615 706573 718481 731557 746175
60839 746175 761890 777754 793435 809170 824871 840277 855746 871636 886974 900058 910491
60828 910491 919399 927523 934456 940103 945536 951743 958529 965125 970975 975477 977950 978397 977576 975997 973662
60813I73662k783k697l119n127p973j0000j0969j1943j3249j4195j4585j4918
60801H62104j5165j4819j4112j3752j3496j2364j0334q466p210n918m261k813
60789G39394j913j068J04J299K269L293M571N881P071Q349R795J1138J1985J1951
60775H14119J0830R197Q391R081J0250J0454R730R175R020Q456P266O316O112
60762I28397O103N790N464N405N218M585M000M153M984N736N767N071M165L585
60748I98423L329K943K271J756J798K090K110J800J290L60j163k814l908m350
60734A005935m523m723n194o258p757q855r104r089r306r151p993o643o357o757
60720I04225o280m599l228l371m459n176n080m728m854n792p201q212q301p944
$$ plain form
60813 973662 970879 968182 965063 959936 951963 941963 930994 919051 905802 891607 877022 862104
60801 862104 846939 832120 818008 804256 790760 778396 768062 759596 752386 746468 742207 739394
60789 739394 737481 736413 736517 737816 740085 743378 747949 753830 760901 769250 779045 790183 802168 814119
60775 814119 824949 834146 842537 851618 861868 872322 882052 891227 900247 908703 915969 922285 928397
60762 928397 934500 940290 945754 951159 956377 960962 964962 969115 974099 979835 985602 990673 994838 998423
60748 998423 1001752 1004695 1006966 1008722 1010520 1012610 1014720 1016520 1017810 1018170 1017007 1014193 1010285 1005935
60734 1005935 1001412 996689 991495 985237 977480 968625 959521 950432 941126 931975 923982 917339 910982 904225
60720 904225 897945 893346 890118 886747 882288 877112 872032 867304 862450 856658 849457 841245 832944 825000
60706H25000p876p946p392o112m782l786k865j873r67MJ501L405M883N329M923
60691H01446M100L018J726L80r06k157l521n307p736j0256j1656j1422j0620j0693
60677G36396j1725j2680j2919j2600j1817j0449q811p531o629n477l829k175r94
60664F28760k42L51R40J530J824J393L62l42k3Q58J385J311Q92K11m95m08R17
60647F39224K617L555L898M509N277N230M165K880J965J552K008L550N262N844
60633F91536N444N556O989R105J1059J2590J3514J3715J3805J4643J5961J6673
60621H30590J6554J6400J6408J5836J4491J3127J1914R946O816L465P99j397l508
60608I51441n166o037o564p181p564p319o680n933m924l675k815k762l169l602
$$ plain form
60706 825000 817124 809178 801786 795674 790892 787106 784241 782368 781401 781405 782906 786311 791194 796523 801446
60691 801446 805546 808564 810290 810670 809764 807607 804086 798779 791043 780787 769131 757709 747089 736396
60677 736396 724671 711991 699072 686472 674655 664206 655395 647864 641235 635758 631929 629754 628760
60664 628760 628518 628869 629809 631339 633163 634556 634918 634576 634553 635411 636796 638107 638999 639210 638715 638307 639224
60647 639224 641841 645396 649294 653803 659080 664310 668475 671355 673320 674872 676880 680430 685692 691536
60633 691536 696980 702536 709525 718630 729689 742279 755793 769508 783313 797956 813917 830590
60621 830590 847144 863544 879952 895788 910279 923406 935320 945266 952082 955547 956346 954949 951441
60608 951441 946275 940238 933674 926493 918929 911610 904930 898997 894073 890398 887583 884821 881652 878050
60594H78050m196n137o100o650o685o272n546m911m685m427l371j635j61N65Q07
60579H19646N60n85k271l304l168k581k139j516n32J54J28O2O78J696K473K886
60563H12187K989K560J657Q79N07k7j184k559l625m504n380n774n130l616j904
60548G87076n29K84P30J548L395N880Q038R853J2356J5919J9608K2730K5920L0066
60534I42874L5101M0438M5627M9823N1550M9845M4952L7352K7006J4243N46j2306
60522A327051k3191l1252l5629l6453l5185l2991k9608k4539j8532j2766p396
60511A039509k018L001O822R291J0855J1661J1675J1355J1378J1981J3180J5243
60499A153933J8264K1860K6000L1574L9320M8761N9071P0395Q3355R7763J12925
$$ plain form
60594 878050 873854 868717 862617 855967 849282 843010 837464 832553 827868 823441 820070 818435 818274 818839 819646
60579 819646 820206 819621 817350 814046 810878 808297 806158 804642 804110 804264 804392 804454 805132 806828 809301 812187
60563 812187 815176 817736 819393 820272 820779 820752 819568 817009 813384 808880 803500 797726 792596 788980 787076
60548 787076 786547 786831 787561 789109 792504 798384 806422 816275 828631 844550 864158 886888 912808 942874
60534 942874 977975 1018413 1064040 1113863 1165413 1215258 1260210 1297562 1324568 1338811 1339357 1327051
60522 1327051 1303860 1272608 1236979 1200526 1165341 1132350 1102742 1078203 1059671 1046905 1039509
60511 1039509 1037491 1040492 1047314 1056605 1067460 1079121 1090796 1102151 1113529 1125510 1138690 1153933
60499 1153933 1172197 1194057 1220057 1251631 1290951 1339712 1398783 1469178 1552533 1650296 1763221
60488A763221J28837J45957J64049J82420K01306K21997K45371K70981K97359
60479C621498L21993L40325L45459L30108K89716K24518J39262M1298o0992j58538
60469E434647k42049l04211l42318l58406l56799l41998l18474k90585k61462
60460B618345k32510k04584j78967j56695j37693j21331j07237r5073q4200p4249
60450A225806o5435n7849n1061m4959m0053l6441l3285l0010k7093k4961k2980
60439G91679k0518j8200j7019j6842j6691j6038j4896j3219j1104r134p701o454
60427F23863n126m247m195m208l298j667k96L29L31j42p22o74K21J152J536J974
60411F04831L078M089L942K973K284K011J600J388K284M036N261N310M935M948
$$ plain form
60488 1763221 1892058 2038015 2202064 2384484 2585790 2807787 3053158 3324139 3621498
60479 3621498 3943491 4283816 4629275 4959383 5249099 5473617 5612879 5654177 5593185 5434647
60469 5434647 5192598 4888387 4546069 4187663 3830864 3488866 3170392 2879807 2618345
60460 2618345 2385835 2181251 2002284 1845589 1707896 1586565 1479328 1384255 1300055 1225806
60450 1225806 1160371 1102522 1051461 1006502 966449 930008 896723 866713 839620 814659 791679
60439 791679 771161 752961 735942 719100 702409 686371 671475 658256 647152 638018 630317 623863
60427 623863 618737 614490 610295 606087 602789 601122 600826 601155 601486 601344 600622 599948 600169 601321 602857 604831
60411 604831 607909 611998 615940 618913 621197 623208 624808 626196 628480 632516 637777 643087 648022 652970
60397F52970N284N547N590N365M920M603M700M944M954M858M825M391K982R16
60383G16849r29k088k596k454j843j420j639k128k349k383k343j799o58J57j5
60368F92362l23M05J810K619K539K237J988J689J727K408K929K443J796K531M410
60353G23570N582N274M658M845N542O023O132N992N806O123P182Q074P762O790
60339H09355O571P023O657N101L754L425L071J752K78j21M05Q76J022J251J746
60324H52166K415L304M424N534O340O577N814L848J349o70k116l734n637o874
60310H72740o750n701m549l675l231l349l819m166m317m468m375l582k390j617
60296H16751j286n25J002K597L671M392M924N011M706M545M580M181L098J880
$$ plain form
60397 652970 658254 663801 669391 674756 679676 684279 688979 693923 698877 703735 708560 712951 715933 716849
60383 716849 715920 713832 711236 708782 706939 705519 703880 701752 699403 697020 694677 692878 692220 692377 692362
60368 692362 692039 692444 694254 696873 699412 701649 703637 705326 707053 709461 712390 714833 716629 719160 723570
60353 723570 729152 734426 739084 743929 749471 755494 761626 767618 773424 779547 786729 794803 802565 809355
60339 809355 815926 822949 829606 834707 838461 841886 844957 846709 846987 846866 847271 848147 849169 850420 852166
60324 852166 854581 857885 862309 867843 874183 880760 886574 890422 891771 891101 888985 885251 879614 872740
60310 872740 865990 860289 855740 852065 848834 845485 841666 837500 833183 828715 824340 820758 818368 816751
60296 816751 815465 814940 815942 818539 822210 826602 831526 836537 841243 845788 850368 854549 857647 859527
60282H59527R31O4p25r54n14J43Q65J950L174L765L714L977N011O226P334Q958
60266I03446J1268J3241J4144J4699J5868J7430J8754K0118K2211K4920K7674
60255A103773L0507L3980L8282M3108M8152N3202N8158O3270O8994P5247Q1510
60244A698183Q7831R4955J02969J10689J16968J21817J25605J27868J27729J24834
60234B839448J19277J11180J00977Q9524P7202O3537M8352L2648J7635L449j0334
60223C492895k3359l4469m2808m8268n1122n1698n0137m6125l9277l0137k0118
60212C055377j0043N95J2371K4773L7064M9515O2793P6590Q9781J01691J12285
60201C612792J21294J27959J31602J31877J28576J21673J11394R7988Q1655O3083
$$ plain form
60282 859527 860458 860522 859797 858843 858329 858472 859337 861287 864461 868226 871940 875917 880928 887154 894488 903446
60266 903446 914714 927955 942099 956798 972666 990096 1008850 1028968 1051179 1076099 1103773
60255 1103773 1134280 1168260 1206542 1249650 1297802 1351004 1409162 1472432 1541426 1616673 1698183
60244 1698183 1786014 1880969 1983938 2094627 2211595 2333412 2459017 2586885 2714614 2839448
60234 2839448 2958725 3069905 3170882 3260406 3337608 3401145 3449497 3482145 3499780 3503229 3492895
60223 3492895 3469536 3435067 3392259 3343991 3292869 3241171 3191034 3144909 3105632 3075495 3055377
60212 3055377 3045334 3045929 3058300 3083073 3120137 3169652 3232445 3309035 3398816 3500507 3612792
60201 3612792 3734086 3862045 3993647 4125524 4254100 4375773 4487167 4585155 4666810 4729893
60191D729893M3476K3573L181j7731l8087n6529p2618q6411r7236j04016j06563
60180D220932j05648j01826r5059q5538p4044o1239m7164l1749j5367J262J7523
60169C622083L3172M8253O2572P5090Q4204Q9080R0315Q8803Q4258P5683O3217
60158D416730M8731L4352K0901Q032m600j6644k7297l5759m1388m3635m2087l6694
60146D280642k7845j6094j778J4866L3334N2839P2825R3275J14505J36791J60274
60135D913634J84971K10845K37908K66113K94923L23195L49814L74232L95924
60126G551559M13545M25205M29497M25785M13646L92840L63763L27309K84225
60117A1027374K35220J81544J24540O4659J969o2175j24965j83922k37773k85186
$$ plain form
60191 4729893 4773369 4796942 4800123 4782392 4744305 4687776 4615158 4528747 4431511 4327495 4220932
60180 4220932 4115284 4013458 3918399 3832861 3758817 3697578 3650414 3618665 3603298 3604560 3622083
60169 3622083 3655255 3703508 3766080 3841170 3925374 4014454 4104769 4193572 4277830 4353513 4416730
60158 4416730 4465461 4499813 4520714 4528746 4524146 4507502 4480205 4444446 4403058 4359423 4317336 4280642
60146 4280642 4252797 4236703 4234925 4249791 4283125 4335964 4408789 4502064 4616569 4753360 4913634
60135 4913634 5098605 5309450 5547358 5813471 6108394 6431589 6781403 7155635 7551559
60126 7551559 7965104 8390309 8819806 9245591 9659237 10052077 10415840 10743149 11027374
60117 11027374 11262594 11444138 11568678 11633337 11635306 11573131 11448166 11264244 11026471 10741285
60107A0741285l23858l51801l68724l75411l72418l60228l40093l13776k82788
60098G652188k48518k12588j76255j39716j02697o5578k9367N104L7228O6085
60088F785886R0479J09399J22013J27405J24962J15104R9215P8853N5187K9092
60078G737595J578k5804n1127p3133r2297j10273j27910j44228j57715j68071
60068F788615j76089j82164j85692j85802j82277j75640j66719j56178j44275
60059E233779j30998j16331j00333q3067o4782m6013k7073p636J2670L3307N3128
60048D756651P1599Q9008J05328J19604J30709J38054J41269J39843J33395J21920
60038E947380J05663Q5265O2046L7413J1883j4626m1513o7377r1202j12630j30839
$$ plain form
60107 10741285 10417427 10065626 9696902 9321491 8949073 8588845 8248752 7934976 7652188
60098 7652188 7403670 7191082 7014827 6875111 6772414 6706836 6677469 6682573 6719801 6785886
60088 6785886 6876365 6985764 7107777 7235182 7360144 7475248 7574463 7653316 7708503 7737595
60078 7737595 7739173 7713369 7662242 7589109 7496812 7386539 7258629 7114401 6956686 6788615
60068 6788615 6612526 6430362 6244670 6058868 5876591 5700951 5534232 5378054 5233779
60059 5233779 5102781 4986450 4886117 4803050 4738268 4692255 4665182 4657546 4670216 4703523 4756651
60048 4756651 4828250 4917258 5022586 5142190 5272899 5410953 5552222 5692065 5825460 5947380
60038 5947380 6053043 6138308 6200354 6237767 6249650 6235024 6193511 6126134 6034932 5922302 5791463
60027E791463j44377j52615j56370j56525j52999j45712j35623j23887j10747
60018D512608r6012q0036o3481m6589k9331j1752O339K5391M5295O5175Q4545
60007D412152J03973J23966J43862J62304J78116J90110J96847J97522J92499
59998E901351J82362J67022J46411J21419R3404O3384L2214R19k9834n9939q8743
59987F529970j14456j35281j50536j60099j63693j61567j55062j45493j33110
59978E210673j17868j00524q2080o2921m3340k4046n212J4017L3890N2815O9056
59967D944460Q2881R5539J06823J15175J19829J21253J19763J15230J08079R9153
59957F028185Q8545P5973O2278M9200L7455K6378J5851P389K762K471O112J3564
$$ plain form
60027 5791463 5647086 5494471 5338101 5181576 5028577 4882865 4747242 4623355 4512608
60018 4512608 4416596 4336560 4273079 4226490 4197159 4185407 4191746 4217137 4262432 4327607 4412152
60007 4412152 4516125 4640091 4783953 4946257 5124373 5314483 5511330 5708852 5901351
59998 5901351 6083713 6250735 6397146 6518565 6611969 6675353 6707567 6708486 6678652 6618713 6529970
59987 6529970 6415514 6280233 6129697 5969598 5805905 5644338 5489276 5343783 5210673
59978 5210673 5092805 4992281 4910201 4847280 4803940 4779894 4774682 4788699 4822589 4875404 4944460
59967 4944460 5027341 5122880 5229703 5344878 5464707 5585960 5705723 5820953 5929032 6028185
59957 6028185 6116730 6192703 6254981 6304181 6341636 6368014 6383865 6391254 6394016 6396487 6402599 6416163
59945F416163K5301M1859O3347Q9268J18809J51448J87009K24960K64155L03768
59935G886087L43717L83311M19968M50126M71048M80742M76596M55453M15241
59926A1782289L55908K79090J87910Q7278j6625j17622k10405k90789l56109m05340
59916A1295585m38330m55167m56825m45888m25708l98927l67261l32184k94914
59907G680381k56145k16570j77318j39132j01670o4450k7898P419M1906P6060
59897F822583J08975J39015J65409J87835K04693K13365K12138K00551J78084
59888H432648J44116R9583M7393r219o7767j25801j80331k28526k68381k98562
59878G545153l18473l28724l30793l26101l15780l01150k83565k63872k42687
$$ plain form
59945 6416163 6441464 6483323 6546670 6635938 6754747 6906195 7093204 7318164 7582319 7886087
59935 7886087 8229804 8613115 9033083 9483209 9954257 10434999 10911595 11367048 11782289
59926 11782289 12138197 12417287 12605197 12692475 12675850 12558228 12347823 12057034 11700925 11295585
59916 11295585 10857255 10402088 9945263 9499375 9073667 8674740 8307479 7975295 7680381
59907 7680381 7424236 7207666 7030348 6891216 6789546 6725096 6697198 6704617 6746523 6822583
59897 6822583 6931558 7070573 7235982 7423817 7628510 7841875 8054013 8254564 8432648
59888 8432648 8576764 8676347 8723740 8714521 8646754 8520953 8340622 8112096 7843715 7545153
59878 7545153 7226680 6897956 6567163 6241062 5925282 5624132 5340567 5076695 4834008
59869D834008k20936j99347j77784j55997j34764j15265r7762q1959o8271n7404
59859C524519m8926m1702l5784l2442l2160l3858l6156l8177l9022l7885l4978
59848C113429l1254k6941k1476j5046q933m142r46L6k298q027j5800k4267l2886
59835B921449m0951m7224n1179n3394n4048n2195m7380m0923l4638k8936k3036
59824B447545j6465r540k743L726R980J6406K3420L1105L9273M7799N6452O4531
59812B711489P1274P6415P9718Q0305P7453P1947O5570N9201N2366M4580L6044
59801C426362K6918J7053O856k526j0005j4900j6594j4863j0556m806K428J2080
59789C417447K4297L8302N3753P0896Q9370J08530J29141J53075J80905K11421
$$ plain form
59869 4834008 4613072 4413725 4235941 4079944 3945180 3829915 3732153 3650194 3581923 3524519
59859 3524519 3475593 3433891 3398107 3365665 3333505 3299647 3263491 3225314 3186292 3148407 3113429
59848 3113429 3082175 3055234 3033758 3018712 3009779 3005637 3004691 3004727 3002429 2994402 2978602 2954335 2921449
59835 2921449 2880498 2833274 2782095 2728701 2674653 2622458 2575078 2534155 2499517 2470581 2447545
59824 2447545 2431080 2421540 2418797 2422523 2432503 2448909 2472329 2503434 2542707 2590506 2646958 2711489
59812 2711489 2782763 2859178 2938896 3019201 3096654 3168601 3234171 3293372 3345738 3390318 3426362
59801 3426362 3453280 3470333 3477189 3474663 3464658 3449758 3433164 3418301 3407745 3402939 3405367 3417447
59789 3417447 3441744 3480046 3533799 3604695 3694065 3802595 3931736 4084811 4265716 4477137
59779D477137K44004K79711L18972L59526L97479M28732M48015M47701M19624
59770G820901L58841K66459J50631K5570r2468j90899k64048l11669l35963l40461
59760G086894l29915l09187k82006k51106k18830j86820j55771j26188r8886p4234
59750E053951n1682l0623j1090O858K3773M0349N6952P4008R1972J10540J28796
59739E493804J46650J65259J85560K07462K30935K56711K85159L15634L47776
59730G634950L82421M20187M60145N00900N42090N83636O24078O60684O90622
59721A2499713P11202P19761P14611O96024O65802O26572N82325N38821N02041
59712A8256872M76091M63021M63883M78841N06350N43079N84643O26003O61662
$$ plain form
59779 4477137 4721141 5000852 5319824 5679350 6076829 6505561 6953576 7401277 7820901
59770 7820901 8179742 8446201 8596832 8622402 8529934 8339035 8074987 7763318 7427355 7086894
59760 7086894 6756979 6447792 6165786 5914680 5695850 5509030 5353259 5227071 5128185 5053951
59750 5053951 5002269 4971646 4960556 4967414 4991187 5031536 5088488 5162496 5254468 5365008 5493804
59739 5493804 5640454 5805713 5991273 6198735 6429670 6686381 6971540 7287174 7634950
59730 7634950 8017371 8437558 8897703 9398603 9940693 10524329 11148407 11809091 12499713
59721 12499713 13210915 13930676 14645287 15341311 16007113 16633685 17216010 17754831 18256872
59712 18256872 18732963 19195984 19659867 20138708 20645058 21188137 21772780 22398783 23060445
59703B3060445O86219O94844O83154O47489N86245N00961L95967K77406J52695
59694B7685425K9914q3393j81163k58897l13757l44934l53275l40184l07380k57629
59684B5274727j94482j20696l7605N3743J51942K56133L66314M81899O00721P19927
59674B7552623Q36615R46491J042592J116054J157558J157598J106833R98034
59666C5914398Q28595O02058L28996K6994k81915n76028q37318j051935j210592
59657C3743253j310395j355154j352351j310025j236755j142625j038282r33693
59649B4063973q38975p65170p21973p13981p39005p88534q48870r04111r41589
59640A6801765r55992r48339r22009q80735q28961p71358p11349o50909n91739
$$ plain form
59703 23060445 23746664 24441508 25124662 25772151 26358396 26859357 27255324 27532730 27685425
59694 27685425 27715339 27631946 27450783 27191886 26878129 26533195 26179920 25839736 25532356 25274727
59684 25274727 25080245 24959549 24921944 24975687 25127629 25383762 25750076 26231975 26832696 27552623
59674 27552623 28389238 29335729 30378321 31494375 32651933 33809531 34916364 35914398
59666 35914398 36742993 37345051 37674047 37701041 37419126 36843098 36005780 34953845 33743253
59657 33743253 32432858 31077704 29725353 28415328 27178573 26035948 24997666 24063973
59649 24063973 23224998 22459828 21737855 21023874 20284869 19496335 18647465 17743354 16801765
59640 16801765 15845773 14897434 13975425 13094690 12265729 11494371 10783022 10132113 9540374
59631I540374n35558m83402m35558l92083l52717l16784k83930k54459k28210
59622F257673k03886j80502j58687j39428j22347j06531r2286q0583p1315o3721
59612E038387n8139n5725n6599n9669o4235p0323p7462q4516r0814r6280j00510
59601D224115j02824j03283j02521j00509r6648r1107q4934p8618p1599o3402
59591C328670n4452m5607l7504l0355k3761j6846r278j890M382R754J4980J9937
59579C158030K3885K6674K8592K9377K8707K7365K6744K7105K7661K8357L0288
59568C462785L4138L9395M5385N2120N9739O8073P7044Q6917R7812J09560J22088
59557D255056J35478J49699J64839J81377J99603K18936K38412K57544K76042
$$ plain form
59631 9540374 9004816 8521414 8085856 7693773 7341056 7024272 6740342 6485883 6257673
59622 6257673 6053787 5873285 5714598 5575170 5452823 5346292 5254006 5173423 5102108 5038387
59612 5038387 4980248 4924523 4867924 4808255 4744020 4673697 4596235 4511719 4420905 4324625 4224115
59601 4224115 4121291 4018008 3915487 3814978 3718330 3627223 3542289 3463671 3392072 3328670
59591 3328670 3274218 3228611 3191107 3160752 3136991 3120145 3110867 3108977 3113359 3123113 3138093 3158030
59579 3158030 3181915 3208589 3237181 3266558 3295265 3322630 3349374 3376479 3404140 3432497 3462785
59568 3462785 3496923 3536318 3581703 3633823 3693562 3761635 3838679 3925596 4023408 4132968 4255056
59557 4255056 4390534 4540233 4705072 4886449 5086052 5304988 5543400 5800944 6076986
59548F076986K93105L07859L20067L29543L35227L35863L31245L21997L08627
59539H960519K91875K73466K55097K37073K19233K02590J88225J74731J59030
59530A0961839J40482J22603J09924J04337J05091J10659J19179J27877J33423
59521A2035414J32979J24388J05867P6239L5553j4804p2521j34817j98789k61489
59511A1828020l19771l70536m11665m42564m63429m74186m74781m66249m50785
59502G954054m30655m07337l81515l53446l23597k93238k64090k36909k10991
59493E052276j85652j61552j39817j20402j02278q4841o8147n2135l6569k1524
59483D079359p012P575K2892L8807N4958P1614Q9193J07404J25893J45154J65681
$$ plain form
59548 6076986 6370091 6677950 6998017 7327560 7662787 7998650 8329895 8651892 8960519
59539 8960519 9252394 9525860 9780957 10018030 10237263 10439853 10628078 10802809 10961839
59530 10961839 11102321 11224924 11334848 11439185 11544276 11654935 11774114 11901991 12035414
59521 12035414 12168393 12292781 12398648 12474887 12510440 12495636 12423115 12288298 12089509 11828020
59511 11828020 11508249 11137713 10726048 10283484 9820055 9345869 8871088 8404839 7954054
59502 7954054 7523399 7116062 6734547 6381101 6057504 5764266 5500176 5263267 5052276
59493 5052276 4866624 4705072 4565255 4444853 4342575 4257734 4189587 4137452 4100883 4079359
59483 4079359 4072347 4079922 4102814 4141621 4196579 4268193 4357386 4464790 4590683 4735837 4901518
59472D901518J86721K07060K26538K45460K62928K77116K86827K91315K88831
59463G174314K77038K54962K23224J82466J33066P6612J6243m4821j04033j58913
59453H030158k06992k46700k77320k98286l09711l13377l11699l05618k94891
59444E465564k80392k64415k48359k31694k13714j95022j76742j59576j44051
59435C551599j30548j18549j06943r5436q4670p4777o5038n5252m6181l8260l1020
59424B704925k4121j7797j1926n909O8M944Q385J1387J4816J8493K2091K5735
59412B751091K9312L2549L6201M1687M8631N4077N5197N2067M7204M3456M3095
59401C234567M7618N6932O9167Q2413R6573J12931J31953J51867J69523J83068
$$ plain form
59472 4901518 5088239 5295299 5521837 5767297 6030225 6307341 6594168 6885483 7174314
59463 7174314 7451352 7706314 7929538 8112004 8245070 8321682 8337925 8293104 8189071 8030158
59453 8030158 7823166 7576466 7299146 7000860 6691149 6377772 6066073 5760455 5465564
59444 5465564 5185172 4920757 4672398 4440704 4226990 4031968 3855226 3695650 3551599
59435 3551599 3421051 3302502 3195559 3100123 3015453 2940676 2875638 2820386 2774205 2735945 2704925
59424 2704925 2680804 2663007 2651081 2645172 2645240 2650184 2658569 2669956 2684772 2703265 2725356 2751091
59412 2751091 2780403 2812952 2849153 2890840 2939471 2993548 3048745 3100812 3148016 3191472 3234567
59401 3234567 3282185 3339117 3408284 3490697 3587270 3700201 3832154 3984021 4153544 4336612
59391D336612J94397K08667K30314K59523K93274L29375L68054M09749M53316
59382G083281M96781N38322N75581O05287O24389O30932O23603O01917N67466
59373A2347559N23869M74663M22129L68470L16612K68842K25509J85806J48858
59364A5282317J13382P7233L8219n044n3268j06241j61980k17042k68256l13237
59354A4386083l49126l72551l81992l79145l67342l49755l29855l11905k99347
59345A1245065k93248k93294k99419l11302l27031l43604l58447l69793l76241
59336H272686l77062l72671l63974l51502l35563l16677k95430k72446k48913
59327E338448k26297k05038j84391j64026j44860j27673j11856r6449q1591o8032
$$ plain form
59391 4336612 4531009 4739676 4969990 5229513 5522787 5852162 6220216 6629965 7083281
59382 7083281 7580062 8118384 8693965 9299252 9923641 10554573 11178176 11780093 12347559
59373 12347559 12871428 13346091 13768220 14136690 14453302 14722144 14947653 15133459 15282317
59364 15282317 15395699 15472932 15511151 15506107 15452839 15346598 15184618 14967576 14699320 14386083
59354 14386083 14036957 13664406 13282414 12903269 12535927 12186172 11856317 11544412 11245065
59345 11245065 10951817 10658523 10359104 10047802 9720771 9377167 9018720 8648927 8272686
59336 8272686 7895624 7522953 7158979 6807477 6471914 6155237 5859807 5587361 5338448
59327 5338448 5112151 4907113 4722722 4558696 4413836 4286163 4174307 4077858 3996267 3928235
59317C928235n5863m4600l3907k3518j2986k337P698J6719K5472L4891M4862N4564
59305C939230O3487P1598P9008Q6041R2976R9336J04008J06519J07446J07141
59295D856790J04917J00062R2873Q4066P3932O2739N1324M0698L1673K5174K2068
59284E546316K2252K4785K9328L6456M6182N7354O9066Q1355R3754J04504J12138
59273F223490J16622J17940J14750J05775R1466P3061N0981K5717n60k4921m5975
59262F848346o3855p8273q8196r3611r6303r8252r9691r8923r3825q3612o9429
59251E884376n3244l6326j9138k451J2551K5364L6336M5523N2354N6750N9484
59240F061579O1162O2156O3899O8631P7081Q7866J00123J15342J35437J60354
$$ plain form
59317 3928235 3872372 3827772 3793865 3770347 3757361 3755024 3762722 3779441 3804913 3839804 3884666 3939230
59305 3939230 4002717 4074315 4153323 4239364 4332340 4431676 4535684 4642203 4749649 4856790
59295 4856790 4961707 5061769 5154642 5238708 5312640 5375379 5426703 5467401 5499074 5524248 5546316
59284 5546316 5568568 5593353 5622681 5659137 5705319 5762673 5831739 5913094 6006848 6111352 6223490
59273 6223490 6340112 6458052 6572802 6678577 6770043 6843104 6894085 6919802 6919242 6894321 6848346
59262 6848346 6784491 6706218 6618022 6524411 6428108 6329856 6230165 6131242 6037417 5953805 5884376
59251 5884376 5831132 5794806 5775668 5773217 5785768 5811132 5847468 5892991 5945345 6002095 6061579
59240 6061579 6122741 6184897 6248796 6317427 6394508 6482374 6582497 6697839 6833276 6993630
59230F993630J88803K20055K53502K87404L19479L47885L70188L82306L80127
59221I743379L61855L27667K77846K12755J34340M6267m7197j41557k31921l13823
59211A0369611l84113m40434m80624n03737n11242n06086m90974m68160m40131
59202F144110m09175l76703l43832l12009k82237k54436k28521k05297j85237
59193C546663j67281j50153j34162j20331j08469r7581q7580p9104p2005o5512
59183B464485n9577n4736n0761m6764m2490l8382l4480l0370k6058k1870j7677
59172B041320j3126q418l990K36M486Q494J2101J5932K0416K4754K8017L0702
59160B160924L3974L7788M1175M4078M7565N2241N7606O2988O8141P3011P7741
$$ plain form
59230 6993630 7182433 7402488 7655990 7943394 8262873 8610758 8980946 9363252 9743379
59221 9743379 10105234 10432901 10710747 10923502 11057842 11104109 11056912 10915355 10683434 10369611
59211 10369611 9985498 9545064 9064440 8560703 8049461 7543375 7052401 6584241 6144110
59202 6144110 5734935 5358232 5014400 4702391 4420154 4165718 3937197 3731900 3546663
59193 3546663 3379382 3229229 3095067 2974736 2866267 2768686 2681106 2602002 2529997 2464485
59183 2464485 2404908 2350172 2299411 2252647 2210157 2171775 2137295 2106925 2080867 2058997 2041320
59172 2041320 2028194 2019776 2015786 2016022 2020508 2029002 2041103 2057035 2077451 2102205 2130222 2160924
59160 2160924 2194898 2232686 2273861 2317939 2365504 2417745 2475351 2538339 2606480 2679491 2757232
59149B757232Q2851Q8612R4467R9723J04365J08537J11733J13307J13236J11624
59139C785687J08167J02853R6271Q8377P8076O5200N1746L9668K8545J7169O548
59128D468307q97m499n610m832j170N957J5796K7748M2099N8799P6909R5723J15292
59115D889622J35496J55739J75799J95724K14621K30517K41706K47226K45754
59106F732204K35197K13861J81517J39292Q9454L5587j7927o7168j09350j42635
59096G290032j66091j79925j85237j83486j76398j65984j54048j42005j31412
59087E805446j23926j20020j18560j18457j20125j24346j30480j36900j42692
59078D669940j47891j52516j56356j59247j60629j59562j56002j51405j46957
$$ plain form
59149 2757232 2840083 2928695 3023162 3122885 3227250 3335787 3447520 3560827 3674063 3785687
59139 3785687 3893854 3996707 4092978 4181355 4259431 4324631 4376377 4416045 4444590 4461759 4468307
59128 4468307 4467410 4462911 4457301 4452469 4451299 4457256 4473052 4500800 4542899 4601698 4678607 4774330 4889622
59115 4889622 5025118 5180857 5356656 5552380 5767001 5997518 6239224 6486450 6732204
59106 6732204 6967401 7181262 7362779 7502071 7591525 7627112 7609185 7542017 7432667 7290032
59096 7290032 7123941 6944016 6758779 6575293 6398895 6232911 6078863 5936858 5805446
59087 5805446 5681520 5561500 5442940 5324483 5204358 5080012 4949532 4812632 4669940
59078 4669940 4522049 4369533 4213177 4053930 3893301 3733739 3577737 3426332 3279375
59069C279375j42095j35864j28747j21784j14820j07203r9455r2556q6193p9434
59059B171224p2665o7060o2530n7960n3202m9113m5833m2677l9686l7648l6540
59048A606310l5467l4103l2862l1742l0406k9167k8460k7473k4900k0920j7008
59037A293802j3890j1149q683o926n615l893j711J62J563L154N172P193Q956J0299
59023A278434J0593R520P978O911N712L347M82j254j672j889k111j460J50J858
59009A316599L503N623P840R055R256R407R633R241Q433Q072P835O574M552L261
58995A418884K880K070N85m5J056K885M385N760P386Q955J0316J1731J2916J3237
58981A503001J3093J3606J4771J5468J5460J5782J6919J8204J9269K0510K1977
$$ plain form
59069 3279375 3137280 3001416 2872669 2750885 2636065 2528862 2429407 2336851 2250658 2171224
59059 2171224 2098559 2031499 1968969 1911009 1857807 1808694 1762861 1720184 1680498 1642850 1606310
59048 1606310 1570843 1536740 1503878 1472136 1441730 1412563 1384103 1356630 1331730 1310810 1293802
59037 1293802 1279912 1268763 1260080 1253154 1247539 1243646 1241935 1242097 1243660 1246814 1251986 1259179 1268135 1278434
59023 1278434 1289027 1298547 1306525 1313436 1319148 1322495 1322977 1321723 1320051 1318162 1316051 1314591 1314741 1316599
59009 1316599 1320102 1325725 1333565 1342620 1351876 1361283 1370916 1380157 1388590 1396662 1404497 1411071 1415623 1418884
58995 1418884 1421764 1423834 1424419 1424374 1425430 1428315 1432700 1438460 1445846 1454801 1465117 1476848 1489764 1503001
58981 1503001 1516094 1529700 1544471 1559939 1575399 1591181 1608100 1626304 1645573 1666083 1688060
58970A688060K3310K4841K7185K9753L1443L2719L5067L8365M0815M1653M1815
58959B055026M1807M1067L9865L9617M0847M2660M4681M7571N1307N4983N8691
58948B558122O3547O9542P5467Q1311Q8418R6896J05246J13087J21881J32297
58938C505814J43331J54699J67666J82557J98023K13731K31403K52011K74398
58929E323633K97897L23899L53424L85470M19347M56456M97976N42683N88708
58920I189493O35686O83529P30598P74541Q13351Q44102Q62114Q62671Q42351
58911A6238436P97972P26381O26874N02425L57600J97195K8075j40041k97643
58902A9037274m38312n57782o52572p21450p66560p91214p97727p88500p67355
$$ plain form
58970 1688060 1711370 1736211 1763396 1793149 1824592 1857311 1892378 1930743 1971558 2013211 2055026
58959 2055026 2096833 2137900 2177765 2217382 2258229 2300889 2345570 2393141 2444448 2499431 2558122
58948 2558122 2621669 2691211 2766678 2847989 2936407 3033303 3138549 3251636 3373517 3505814
58938 3505814 3649145 3803844 3971510 4154067 4352090 4565821 4797224 5049235 5323633
58929 5323633 5621530 5945429 6298853 6684323 7103670 7560126 8058102 8600785 9189493
58920 9189493 9825179 10508708 11239306 12013847 12827198 13671300 14533414 15396085 16238436
58911 16238436 17036408 17762789 18389663 18892088 19249688 19446883 19474958 19334917 19037274
58902 19037274 18598962 18041180 17388608 16667158 15900598 15109384 14311657 13523157 12755802
58893A2755802p37986p02464o62561o20899n79251n37375m95126m54189m16231
58884G549720l81064l48191l18573k93014k70461k49621k30883k14848k00581
58875E042484j87104j75049j64885j55022j43886j32432j22414j13344j03570
58866C744778r3361q4465p7121o9892o2272n5422n0198m5936m1436l6029k9794
58855C098852k3374j7431j1825o013k65M661R292J5251K2715K9894L5857M1952
58843C199566M9361N7275O4818P2752Q1704R0549R8467J06878J17394J29357J41322
58832D209443J53550J67074J81661J96751K13214K32240K53442K75920L00163
58823F183458L27235L57147L89698M25672M65541N08123N52197N98073O45765
$$ plain form
58893 12755802 12017816 11315352 10652791 10031892 9452641 8915266 8420140 7965951 7549720
58884 7549720 7168656 6820465 6501892 6208878 5938417 5688796 5457913 5243065 5042484
58875 5042484 4855380 4680331 4515446 4360424 4216538 4084106 3961692 3848348 3744778
58866 3744778 3651417 3566952 3489831 3419939 3357667 3302245 3252047 3206111 3164675 3128646 3098852
58855 3098852 3075478 3058047 3046222 3040209 3039944 3044605 3053897 3069148 3091863 3121757 3157614 3199566
58843 3199566 3248927 3306202 3371020 3443772 3525476 3616025 3714492 3821370 3938764 4068121 4209443
58832 4209443 4362993 4530067 4711728 4908479 5121693 5353933 5607375 5883295 6183458
58823 6183458 6510693 6867840 7257538 7683210 8148751 8656874 9209071 9807144 10452909
58814A0452909O92931P36475P74805Q06285Q26620Q30023Q12207P70509P02421
58805A7405185O06607M85052L42542J84784J8572j47422l04353m45548n66159
58796A7579260o62223p32086p77795q03007q10185q01279p79799p49873p14073
58787A0748940o73941o31731n89683n48468n08168m69857m34530m01519l69843
58778F121200l40069l13081k88327k65156k44509k27156k11658j96416j82456
58769C852372j71615j63106j54524j45283j36410j27828j18604j09287j01209
58760B624506r3911q5810p7120o9521o3297n7158n0764m5055m0235l5588l1237
58749A974810k8019k5783k3625k1517j9902j8191j5635j3048j1755j1421j0891
$$ plain form
58814 10452909 11145840 11882315 12657120 13463405 14290025 15120048 15932255 16702764 17405185
58805 17405185 18011792 18496844 18839386 19024170 19042742 18895320 18590967 18145419 17579260
58796 17579260 16917037 16184951 15407156 14604149 13793964 12992685 12212886 11463013 10748940
58787 10748940 10074999 9443268 8853585 8305117 7796949 7327092 6892562 6491043 6121200
58778 6121200 5781131 5468050 5179723 4914567 4670058 4442902 4231244 4034828 3852372
58769 3852372 3680757 3517651 3363127 3217844 3081434 2953606 2835002 2725715 2624506
58760 2624506 2530595 2444785 2367665 2298144 2234847 2177689 2126925 2081870 2041635 2006047 1974810
58749 1974810 1946791 1921008 1897383 1875866 1855964 1837773 1822138 1809090 1797335 1785914 1775023
58738A775023j0486j1307j2864j3680j3775j4383j5626j6575j7144j7914j8642
58727A612627j8927j9719k1977k4677k6264k7271k9093l1079l1501l0655l0246
58716A321218l0229k9125k7083k5756k5278k4161k2146k0423j9062j6942j4351
58705A066662j2976j3013j2775j1495j0149r245q153o989o884p900q640q299p429
58692I42715o538n706n458o188o954o642o008o546p881q431q214q553r373r300
58678H40923q261p466o881n247k698q63k25L13J143J463J204J237J627J748K090
58663H20107L722N991O998O394N531M913L733J912M22m12r27o69R93L109M179
58648H65996M622N996Q289J0249J1885J4174J6804J8747K0499K3202K6162K8061
$$ plain form
58738 1775023 1764537 1753230 1740366 1726686 1712911 1698528 1682902 1666327 1649183 1631269 1612627
58727 1612627 1593700 1573981 1552004 1527327 1501063 1473792 1444699 1413620 1382119 1351464 1321218
58716 1321218 1290989 1261864 1234781 1209025 1183747 1159586 1137440 1117017 1097955 1081013 1066662
58705 1066662 1053686 1040673 1027898 1016403 1006254 997009 988856 981867 974983 967083 958443 950144 942715
58692 942715 936177 930471 925013 918825 911871 905229 899221 892675 884794 876363 868149 859596 850223 840923
58678 840923 832662 825196 818315 813068 810370 809507 809282 809595 810738 812201 813405 814642 816269 818017 820107
58663 820107 823829 829820 836818 843212 848743 853656 857389 859301 859723 859311 858384 857715 858708 861817 865996
58648 865996 870618 876614 884903 895152 907037 921211 938015 956762 977261 1000463 1026625 1054686
58636A054686K9936L3839L9110M3268M6214N0223N5876O1527O6886P3665Q2398
58625A637628R1899J02244J15018J30123J45530J60737J77477J96381K15759K34089
58615C206885K50769K64089K71167K70205K60168K38648K03397J56121J01569
58606E223018M3034j7775p6718j27563j67218j96923k17670k28442k29836k25399
58596C778508k17788k06983j93468j79628j66687j53543j39930j27460j16445
58587B276576j04986r2633q1636p3214o5649n7459m9459m2500l6108l0514k6915
58576A615503k4851k2409j9878j9751k2248k4494k5181k6152k8066k8579k6558
58565A347336k4229k3137k1758j9147j7341j7797j8799j8747j8850k0220k1306
$$ plain form
58636 1054686 1084622 1118461 1157571 1200839 1247053 1297276 1353152 1414679 1481565 1555230 1637628
58625 1637628 1729527 1831771 1946789 2076912 2222442 2383179 2560656 2757037 2972796 3206885
58615 3206885 3457654 3721743 3992910 4263115 4523283 4761931 4965328 5121449 5223018
58606 5223018 5266052 5248277 5171559 5043996 4876778 4679855 4462185 4233743 4003907 3778508
58596 3778508 3560720 3353737 3160269 2980641 2813954 2660411 2520481 2393021 2276576
58587 2276576 2171590 2078957 1997321 1924107 1858458 1800999 1751540 1709040 1672932 1642418 1615503
58576 1615503 1590652 1568243 1548365 1528614 1506366 1481872 1456691 1430539 1402473 1373894 1347336
58565 1347336 1323107 1299970 1278212 1259065 1241724 1223927 1205128 1186381 1167531 1147311 1126005
58554A126005k0612j9211j8322j7081j4731j2405j0837q927o376m983n572o408
58542I80540o322o512p651q270p754p801r144r956r354r180j0426j1256j0583
58529H66331j0254j1458j2350j1548j0679j1140j1508j0703j0384j1609j2275
58518G42423j0607q245p273o978o070n257n081m186k151j087j940k325o43R13
58504F81493K24j019m69R88J517J668K445K806K017J856L518N003M403L139L127
58489G12716L550L298L676N546O698N272L203L015L786L514K872L266L645K593
58475G66650J331J432J746N89j258k593m362p210r107q482p280p756q728q182
58461G06790p038p029p225o057m592m562n186n001m676n197n489m582l780m017
$$ plain form
58554 1126005 1105393 1086182 1067860 1050779 1036048 1023643 1012806 1003879 997503 992520 986948 980540
58542 980540 974218 967706 960055 951785 944031 936230 927086 917130 907776 898596 888170 876914 866331
58529 866331 856077 844619 832269 820721 810042 798902 787394 776691 766307 754698 742423
58518 742423 731816 723571 716298 709320 703250 697993 692912 688726 686575 685488 683548 681223 680580 681493
58504 681493 681717 680698 680229 681217 682734 684402 686847 689653 691670 693526 697044 702047 706450 709589 712716
58489 712716 716266 719564 723240 728786 735484 740756 743959 746974 750760 754274 757146 760412 764057 766650
58475 766650 767981 769413 771159 771748 770490 767897 763535 756325 747218 738736 731456 723700 714972 706790
58461 706790 699752 692723 685498 679441 674849 670287 665101 660100 655424 650227 644738 640156 636376 632359
58447F32359l722j929o53j278j693J1K051K338K130L009L419J833K93J060K678
58432F41906K911K647L264L267J361j28J078L051L080K389L473N476O239O248
58418F86262O807O911N598M617N205N332L557K173K958L583K150J165K729M011
58404G43058K280K66J362L433K925J249J422K048N16j225j52J856J580P83K780
58389G64181N795O062M644M756N144K790m20n49J138N07j947k618j778k399l686
58374G81620k459N93K339L269N969R242R912Q863R142R990Q820P057P725R299
58360H71381Q409O470P047Q817P967N503N191O277N356L490M213O316N891L881
58346I56209M199O029N420L034K811M405M372L344M631P169P401O535Q353J1486
$$ plain form
58447 632359 628637 626708 626055 624777 623084 623095 625146 627484 629614 632623 636042 637875 638168 639228 641906
58432 641906 644817 647464 650728 653995 655356 655228 656306 659357 662437 664826 668299 673775 680014 686262
58418 686262 693069 699980 705578 710195 715400 720732 724289 726462 729420 733003 735153 736318 739047 743058
58404 743058 745338 745604 746966 750399 753324 754573 755995 758043 758559 757334 757182 759038 760618 761401 764181
58389 764181 769976 776038 780682 785438 790582 793372 792952 792403 793541 794048 792101 789483 787705 785306 781620
58374 781620 779161 779754 782093 785362 791331 800573 810485 819348 828490 838480 847300 854357 862082 871381
58360 871381 879790 886260 893307 902124 910091 915594 920785 927062 932418 935908 940121 946437 952328 956209
58346 956209 960408 966437 971857 974891 977702 982107 986479 989823 994454 1001623 1009024 1015559 1023912 1035398
58332A035398J1657R881J0473J2555J1830R202R220J1372J1300R402R692J1470
58320A163452J0756Q660R636J2636J2854J0959J1676J4481J4865J3477J4630J7073
58308A315155J5896J2393J2203J4748J4595J2243J3184J7054J8198J6453J6879
58297A479001J9437J9402J7421J8469K1574K1437J9403K1488K6380K7124K4090
58286A715226K4152K7508K7817K5173K6053L0302L1156K8668K9897L5202L7553
58275B038707L6167L7503M1901M2892M0546M1645M5771M5402M0777M0035M3657
58264B495003M3781M0178M1275M7804N1278N0565N3683O1167O4263O2055O3554
58253C074606P0259P3690P2786P6174Q4465Q8381Q7262R0954J00306J05071J04209
$$ plain form
58332 1035398 1047055 1056936 1067409 1079964 1091794 1100996 1110216 1121588 1132888 1142290 1151982 1163452
58320 1163452 1174208 1182868 1192504 1205140 1217994 1228953 1240629 1255110 1269975 1283452 1298082 1315155
58308 1315155 1331051 1343444 1355647 1370395 1384990 1397233 1410417 1427471 1445669 1462122 1479001
58297 1479001 1498438 1517840 1535261 1553730 1575304 1596741 1616144 1637632 1664012 1691136 1715226
58286 1715226 1739378 1766886 1794703 1819876 1845929 1876231 1907387 1936055 1965952 2001154 2038707
58275 2038707 2074874 2112377 2154278 2197170 2237716 2279361 2325132 2370534 2411311 2451346 2495003
58264 2495003 2538784 2578962 2620237 2668041 2719319 2769884 2823567 2884734 2948997 3011052 3074606
58253 3074606 3144865 3218555 3291341 3367515 3451980 3540361 3627623 3718577 3818883 3923954 4028163
58242D028163J08402J19046J25403J26198J32606J45831J54006J55647J63205
58233E258507J78632J89378J93676K04799K24753K39802K48058K64242K90604
58224G292451L11563L24463L45868L79623M09799M33735M69185N19529N66463
58215A1052679O07221O62506P36867Q10200Q80228R71984J092525J220959J357185
58206A9392354J532245J755676K005962K290597K657705L129074L685554M338757
58198D0787924N143090O112568P213432Q475911J0024391J1966921J4371560J7388400
58190A21484197K1227612K5911655L1163250L6513914M1105227M3100214L9817660
58183C60323729K9464359J3221104m731624j9733011k9352317l3890964l4916983
$$ plain form
58242 4028163 4136565 4255611 4381014 4507212 4639818 4785649 4939655 5095302 5258507
58233 5258507 5437139 5626517 5820193 6024992 6249745 6489547 6737605 7001847 7292451
58224 7292451 7604014 7928477 8274345 8653968 9063767 9497502 9966687 10486216 11052679
58215 11052679 11659900 12322406 13059273 13869473 14749701 15721685 16814210 18035169 19392354
58206 19392354 20924599 22680275 24686237 26976834 29634539 32763613 36449167 40787924
58198 40787924 45931014 52043582 59257014 67732925 77757316 89724237 104095797 121484197
58190 121484197 142711809 168623464 199786714 236300628 277405855 320506069 360323729
58183 360323729 389788088 403009192 398277568 378544557 349192240 315301276 280384293
58176B80384293l3825041l1493754k8504620k5239399k1906144j8673533j5738907
58169A05002895j3220974j1097228r311244p854476o700121n756182m945942m263513
58161D1853215l704902l216640k758108k347102j997743j673963j346703j037162
58153B3770892p59438m76372j55115J90178N56230R93454J539898K165844K828944
58144C0654515L499346M030385M067925L256357J604716m13681k176755l316990
58136D1205818l838153l939725l808195l546790l208568k833554k454822k094091
58128A5481920j765166j479647j243995j053178q94838p61294o51731n63097m88090
58119F580884m24224l75294l40541l11826k85137k64845k52084k39163k20930
$$ plain form
58176 280384293 246559252 215065498 186560878 161321479 139415335 120741802 105002895
58169 105002895 91781921 80684693 71373449 63518973 56818852 51062670 46116728 41853215
58161 41853215 38148313 34931673 32173565 29826463 27828720 26154757 24808054 23770892
58153 23770892 23011454 22535082 22379967 22570145 23126375 24119829 25659727 27825571 30654515
58144 30654515 34153861 38184246 42252171 45508528 47113244 46699563 44522808 41205818
58136 41205818 37367665 33427940 29619745 26072955 22864387 20030833 17576011 15481920
58128 15481920 13716754 12237107 10993112 9939934 9045096 8283802 7632071 7068974 6580884
58119 6580884 6156660 5781366 5440825 5128999 4843862 4579017 4326933 4087770 3866840
58110C866840k01825j85868j69400j49840j32069j19479j07634r3451q2104p8229
58100B546941p8357p8257p9517q2738q2668p6715p0363o7916o5552n9744n4354
58089A750760n2962n1898m7560m3291m2439m1822l8427l5518l5798l5577l2001
58078A293467k9045k9961l0745k7541k3809k3553k3966k1432j8548j8550j8734
58067A027583j5930j2861j2754j3193j1294r486j0192j0447p697n326o556q396
58055I03451p621p044r760j2604j1691r258q875q928o999n547p072q513o720m604
58041G88215n593o879m654j402j282k565j305J326J985J721L166M628L293J102
58027G81756J360K605J755K31J023K636J901J6N0R89o1k162k430j383j345j843
$$ plain form
58110 3866840 3665015 3479147 3309747 3159907 3027838 2908359 2800725 2707274 2625170 2546941
58100 2546941 2468584 2390327 2310810 2228072 2145404 2068689 1998326 1930410 1864858 1805114 1750760
58089 1750760 1697798 1645900 1598340 1555049 1512610 1470788 1432361 1396843 1361045 1325468 1293467
58078 1293467 1264422 1234461 1203716 1176175 1152366 1128813 1104847 1083415 1064867 1046317 1027583
58067 1027583 1011653 998792 986038 972845 961551 952065 941873 931426 923729 918403 911847 903451
58055 903451 895830 888786 879026 866422 854731 845473 836598 827670 820671 815124 808052 799539 792819 788215
58041 788215 782622 775743 771089 769687 768405 765840 764535 765861 767846 769567 772733 777361 780654 781756
58027 781756 783116 785721 787476 787707 788730 791366 793267 793283 793333 794322 794261 792099 789669 788286 786941 785098
58011G85098j358j230l120n086m803l979n117o651n973m383m403m988m105l187
57997G26715m312n815n427m881o632q906q823p578p590p469m921j803j071j396
57983F50091J5J887J561N49J948M514M932L921M555O310O238M512L603L304J616
57968F99556p85j737j825k872l924l275k641m407o649n900l240k427l547l717
57954F52610k835l210m553m453l172l037l726k922r26k5L3J387L624M468M140
57939F37403M641N449M441K313J591J913P25j925l707m541o390r022j0279j0149
57925F12463j0442j0905r804p801p087p180n772l212j855j481K56L169M699M503
57911E59551M702N712O018N857O999Q908R268Q123P558P504O056L720L111M321
$$ plain form
58011 785098 783740 782510 779390 774304 769501 765522 760405 753754 747781 743398 738995 734007 729902 726715
57997 726715 722403 716588 711161 706280 699648 690742 681919 674341 666751 659282 654361 652558 651487 650091
57983 650091 650106 651993 653554 654103 656051 660565 665497 669418 673973 680283 686521 691033 694636 697940 699556
57968 699556 698771 697034 695209 692337 688413 685138 682497 678090 671441 665541 662301 659874 656327 652610
57954 652610 649775 646565 642012 637559 634387 631350 627624 624702 623776 623751 623784 625171 628795 633263 637403
57939 637403 642044 647493 651934 654247 655838 657751 658476 656551 652844 648303 641913 632891 622612 612463
57925 612463 602021 591116 581312 573511 566424 559244 553472 550260 548405 546924 547180 550349 555048 559551
57911 559551 564253 569965 575983 581840 588839 597747 607015 615138 622696 630200 636256 639976 643087 647408
57897F47408M806L969L739M399M020K322J149P45n50k628l545l395m330o402p292
57882F44415o538o153o644o303n007m695n446m917k595q54q68j024k49N13J047
57867E94682K709N515P554Q151Q706R646R672Q595P900P879P209N815N061M731
57853F93825L073K73j384j389j735l208m291m367m731n649n664m590m047m388
57839F51728m197l410l598m587m217k255j029j409j673j283k087m514o154n715
57825F05600n085n850o868o866o606o820o789o388o915q477r176q168o891o158
57811E08543m834k681j526k134k658j816q90j053j324p56j71r7N28K104L146K846
57795D97227K624L642N068O150P656R814J1204J1223J1448J2939J4319J3967J2143
$$ plain form
57897 647408 652214 656183 659922 664321 668341 670663 671812 672557 672007 669379 665834 662439 658109 651707 644415
57882 644415 637877 631724 625080 618777 613770 609075 603629 598712 596117 595263 594395 593371 593122 593635 594682
57867 594682 597391 602906 610460 618611 627317 636963 646635 655230 663130 671009 678218 684033 689094 693825
57853 693825 696898 697171 695787 694398 692663 689455 685164 680797 676066 670417 664753 660163 656116 651728
57839 651728 647531 644121 640523 635936 631719 629464 628435 627026 625353 624070 621983 617469 611315 605600
57825 605600 600515 594665 587797 580931 574325 567505 560716 554328 547413 538936 529760 521592 514701 508543
57811 508543 503709 501028 499502 497368 494710 492894 492004 490951 489627 488871 488700 488603 489131 491235 494381 497227
57795 497227 499851 503493 508561 514711 522367 532181 543385 554608 566056 578995 593314 607281 619424
57782F19424R589O179K336l35j283j893l045l821l726l844m566m567l426k886
57768F04136l968n163m992m190l711k860j100L40M97L83J039J747J759J946L134
57753E88997M509N189N646O213N984M642L600L879M593M770M828N033M531L210
57739F55624K508K932K918J611O92J750L854N407O444P425P729P181P155Q370
57725G21600R350Q892Q240R026J0704J1918J2756J3809J4525J4443J4588J5912
57713H65763J7633J8717J9611K1037K2545K3807K5707K8598L1163L2628L4423
57702A141632L8007M2696M7383N2656N9309O6459P3187Q0611R0313J01919J14156
57691A908328J27020J41181J56488J72756J90602K09740K27791K42437K53269
$$ plain form
57782 619424 629013 635192 637528 637193 635910 634017 630972 627151 623425 619581 615015 610448 607022 604136
57768 604136 600168 595005 590013 585823 582112 579252 578152 578492 578989 579372 580411 582158 583917 585863 588997
57753 588997 593506 598695 604341 610554 616538 621180 624780 628659 633252 638022 642850 647883 652414 655624
57739 655624 658132 661064 663982 665593 666285 668035 671889 677296 683740 691165 698894 706075 713230 721600
57725 721600 730950 739842 748082 757108 767812 779730 792486 806295 820820 835263 849851 865763
57713 865763 883396 902113 921724 942761 965306 989113 1014820 1043418 1074581 1107209 1141632
57702 1141632 1179639 1222335 1269718 1322374 1381683 1448142 1521329 1601940 1692253 1794172 1908328
57691 1908328 2035348 2176529 2333017 2505773 2696375 2906115 3133906 3376343 3629612
57682C629612K59672K58552K46372K22352J87921J44552R4310M1461q766n2416
57672E023622q6608j08722j17909j16296j06805r0951p0899n2636m4683n3299
57662D174814p9113j16489j54854j83105j96009j96293j89435j77916j61876j42937
57652B576787j24111j06859r0841p6042o2937n1181m0159l0328k2224j4883p010
57641A950212J150Q789J6377K4731L3310M1368M9801N9877P1067Q2192R3777J07162
57629B539813J22191J37760J53796J70503J86423J99395K08821K14801K15710
57620D149213K08681J92041J65593J29403Q4542L4414j6633o5526j09845j46392
57610D625491j72890j90288k01041k05789k04047j97248j88275j78314j66742
$$ plain form
57682 3629612 3889284 4147836 4394208 4616560 4804481 4949033 5043343 5084804 5076038 5023622
57672 5023622 4937014 4828292 4710383 4594087 4487282 4396331 4325432 4272796 4228113 4174814
57662 4174814 4095701 3979212 3824358 3641253 3445244 3248951 3059516 2881600 2719724 2576787
57652 2576787 2452676 2345817 2254976 2178934 2115997 2064816 2024657 1994329 1972105 1957222 1950212
57641 1950212 1951362 1960151 1976528 2001259 2034569 2075937 2125738 2185615 2256682 2338874 2432651 2539813
57629 2539813 2662004 2799764 2953560 3124063 3310486 3509881 3718702 3933503 4149213
57620 4149213 4357894 4549935 4715528 4844931 4929473 4963887 4947254 4881728 4771883 4625491
57610 4625491 4452601 4262313 4061272 3855483 3651436 3454188 3265913 3087599 2920857
57601B920857j53911j41397j29621j17666j05653r4987q6061p7896p0175o3618
57591A879872n8191n2953m7850m3718m0433l6907l3045k9830k7268k4223k0521
57580A464933j7471j5904j5181j4451j3416j1791r386o904n314m462l447k156
57568A345050j101r8J389K926L630L755M348N641P207R179J1777J4113J5198J5679
57554A438693J6855J8497J9494K0112K1692K4386K7193K9912L3162L6727L9955
57543A726678M3452M8429N4558O0482O6261P3291Q1977R1516J01770J13191J25095
57532B586700J36213J46840J58110J69100J76922J79756J77531J69512J53781
57523D054465J29611R8315O1444K0461k1437n9696r1549j16993j36227j48364
$$ plain form
57601 2920857 2766946 2625549 2495928 2378262 2272609 2177622 2091561 2013665 1943490 1879872
57591 1879872 1821681 1768728 1720878 1677160 1636727 1599820 1566775 1536945 1509677 1485454 1464933
57580 1464933 1447462 1431558 1416377 1401926 1388510 1376719 1367333 1360429 1355115 1350653 1347206 1345050
57568 1345050 1343949 1343851 1345240 1348166 1351796 1355551 1359899 1365540 1372747 1381926 1393703 1407816 1423014 1438693
57554 1438693 1455548 1474045 1493539 1513651 1535343 1559729 1586922 1616834 1649996 1686723 1726678
57543 1726678 1770130 1818559 1873117 1933599 1999860 2073151 2155128 2246644 2348414 2461605 2586700
57532 2586700 2722913 2869753 3027863 3196963 3373885 3553641 3731172 3900684 4054465
57523 4054465 4184076 4282391 4343835 4364296 4342859 4283163 4191614 4074621 3938394 3790030
57513C790030j53392j53278j49981j43956j35393j25291j14534j03338r2194q1977
57503B536696p2735o3810n5370m8247m2091l5607k8812k3190j9175j5458j1249
57492B120952p307m049n82L684Q131J2323J6616K0924K4552K7825L2192L8180
57480B293441M4839N1640N9142O7421P5775Q4477R4830J06862J18945J30315J41839
57469C269526J53575J63569J69992J72370J69802J60054J41712J15549Q2842M4325
57459D643316K028l9814p7198j08444j33004j50060j59606j63289j62713j58182
57449C493034j50112j40169j29793j19038j07953r7625q8620p9926p0810o2339
57439B446649n5674n0113m4221l7957l2404k8223k5375k3453k1539j8684j5224
$$ plain form
57513 3790030 3636638 3483360 3333379 3189423 3054030 2928739 2814205 2710867 2618673 2536696
57503 2536696 2463961 2400151 2344781 2296534 2254443 2218836 2190024 2166834 2147659 2132201 2120952
57492 2120952 2113645 2109596 2109014 2112698 2120829 2133152 2149768 2170692 2195244 2223069 2255261 2293441
57480 2293441 2338280 2389920 2449062 2516483 2592258 2676735 2771565 2878427 2997372 3127687 3269526
57469 3269526 3423101 3586670 3756662 3929032 4098834 4258888 4400600 4516149 4598991 4643316
57459 4643316 4645344 4605530 4528332 4419888 4286884 4136824 3977218 3813929 3651216 3493034
57449 3493034 3342922 3202753 3072960 2953922 2845969 2748344 2659724 2579798 2508988 2446649
57439 2446649 2390975 2340862 2296641 2258684 2226280 2198057 2172682 2149229 2127690 2109006 2093782
57428B093782j2508j0881r298p336n916n326m455k842j615j318o71J218L169L848
57414B039851L743L838L973L938M589O221P383O958O105O486P861R014R824J0702
57400B130486J1190J0811J0387J0887J1893J2532J2903J3322J3323J2804J2784
57389B263322J3636J4036J3226J2764J4100J5909J5967J4471J3243J2713J2062
57378B415449J1528J2089J3316J3878J3873J4538J5734J5960J4855J3782J3726
57367B568728J4276J4905J5689J6517J6923J6911J6948J7040J6856J6573J6658
57356B748024J7026J7281J7486J7761J7642J6860J6209J6584J7618J8326J8554
57345B939371J8747J8894J8845J8976J9465J9571J8875J8348J8973K0080K0497
$$ plain form
57428 2093782 2081274 2070393 2061095 2053759 2047843 2042517 2038062 2035220 2033605 2032287 2031616 2032834 2036003 2039851
57414 2039851 2043594 2047432 2051405 2055343 2059932 2066153 2073536 2080494 2086599 2093085 2100946 2109960 2119784 2130486
57400 2130486 2141676 2152487 2162874 2173761 2185654 2198186 2211089 2224411 2237734 2250538 2263322
57389 2263322 2276958 2290994 2304220 2316984 2331084 2346993 2362960 2377431 2390674 2403387 2415449
57378 2415449 2426977 2439066 2452382 2466260 2480133 2494671 2510405 2526365 2541220 2555002 2568728
57367 2568728 2583004 2597909 2613598 2630115 2647038 2663949 2680897 2697937 2714793 2731366 2748024
57356 2748024 2765050 2782331 2799817 2817578 2835220 2852080 2868289 2884873 2902491 2920817 2939371
57345 2939371 2958118 2977012 2995857 3014833 3034298 3053869 3072744 3091092 3110065 3130145 3150642
57334C150642K0465K0811K1101K0387J9165J8731J8968J8666J7721J7239J7539
57323C361435J7845J7920J8404J9444K0359K0788K0914K0724K0285K0467K1988
57312C580573K3958K4831K4538K4275K4456K4523K4604K5566K7236K8266K8091
57301C860917K7602K7603K7873K8104K8552K9363L0288L1314L2699L4274L5574
57290D194163L6548L7368L7783L7651L7753L8920M0661M1809M2266M2788M3391
57279D631101M3356M2641M1816M0705L8436L4870L0603K5688J9755J3307P508
57268D969786K675j677n434p971r553j1000j2066j1764j0354r238q652p279m618
57255D872855j977m54N65K078L942N502O593P257P424P389P753Q455Q819Q821
$$ plain form
57334 3150642 3171107 3191918 3213019 3233406 3252571 3271302 3290270 3308936 3326657 3343896 3361435
57323 3361435 3379280 3397200 3415604 3435048 3455407 3476195 3497109 3517833 3538118 3558585 3580573
57312 3580573 3604531 3629362 3653900 3678175 3702631 3727154 3751758 3777324 3804560 3832826 3860917
57301 3860917 3888519 3916122 3943995 3972099 4000651 4030014 4060302 4091616 4124315 4158589 4194163
57290 4194163 4230711 4268079 4305862 4343513 4381266 4420186 4460847 4502656 4544922 4587710 4631101
57279 4631101 4674457 4717098 4758914 4799619 4838055 4872925 4903528 4929216 4948971 4962278 4969786
57268 4969786 4972461 4970784 4965350 4957379 4947826 4936826 4924760 4912996 4902642 4893404 4884752 4877473 4872855
57255 4872855 4870878 4870424 4870989 4873067 4877009 4882511 4889104 4896361 4903785 4911174 4918927 4927382 4936201 4945022
57241D945022R304J0652J2223J3404J4117J4154J3204J1805J1087J1179J1088
57230E077239J0409R930J0130J0313R794Q798P705O557N746N926O735O754N494
57217E181530M282M519O051P848R270J0062J0104R924J0527J1978J3080J3047
57205E292222J2680J3113J4293J5430J6228J6846J7265J7444J7667J8141J8617
57194E469946J8831J8846J8783J8706J8869J9427J9764J8983J7162J5243J3599
57183E668159J1826J0073R252R440R429Q547P717P876Q449Q331P424O247M897
57170E777667L329J944R04m83k686m915o109o478p035q063q976r514j0156j1407
57156E708022j3384j5997j8989k1857k4245k6318k8425l0568l2432l3717l4271
$$ plain form
57241 4945022 4954326 4964978 4977201 4990605 5004722 5018876 5032080 5043885 5054972 5066151 5077239
57230 5077239 5087648 5097578 5107708 5118021 5127815 5136613 5144318 5150875 5156621 5162547 5169282 5176036 5181530
57217 5181530 5185812 5190331 5196382 5204230 5213500 5223562 5233666 5243590 5254117 5266095 5279175 5292222
57205 5292222 5304902 5318015 5332308 5347738 5363966 5380812 5398077 5415521 5433188 5451329 5469946
57194 5469946 5488777 5507623 5526406 5545112 5563981 5583408 5603172 5622155 5639317 5654560 5668159
57183 5668159 5679985 5690058 5699310 5708750 5718179 5726726 5734443 5742319 5750768 5759099 5766523 5772770 5777667
57170 5777667 5780996 5782940 5783844 5783361 5780675 5775760 5769651 5763173 5756138 5748075 5739099 5729585 5719429 5708022
57156 5708022 5694638 5678641 5659652 5637795 5613550 5587232 5558807 5528239 5495807 5462090 5427819
57145E427819l4162l3756l3257l2106k9504k5693k2026j9426j7480j5414j3152
57134E151843j0942q773o796n715n990p170q551j0032j1688j3090j3756j3706
57122E035634j2899j0650o529j333L736Q531J3737J9585K5806L2654M0855N0446
57110E199573O0759P1776Q4654J00643J20311J44014J72283K05596K44945K93232
57100F697786L55087M34564N33845O54812Q00659R74870J179862J418101J693115
57091A4742701K006600K354514K727454L113514L497259L856089M160888M379736
57083D0838755M476929M412562M159865L736991L216093K682466K172879J654242
57075F7350782J063199L63976m26367j251384k041491k735281l293462l702156
$$ plain form
57145 5427819 5393657 5359901 5326644 5294538 5265034 5239341 5217315 5197889 5180409 5164995 5151843
57134 5151843 5140901 5132128 5125332 5119617 5113627 5106457 5097906 5087874 5076186 5063096 5049340 5035634
57122 5035634 5022735 5012085 5005556 5004223 5007959 5016490 5030227 5049812 5075618 5108272 5149127 5199573
57110 5199573 5260332 5332108 5416762 5517405 5637716 5781730 5954013 6159609 6404554 6697786
57100 6697786 7052873 7487437 8021282 8676094 9476753 10451623 11631485 13049586 14742701
57091 14742701 16749301 19103815 21831269 24944783 28442042 32298131 36459019 40838755
57083 40838755 45315684 49728246 53888111 57625102 60841195 63523661 65696540 67350782
57075 67350782 68413981 68777957 68351590 67100206 65058715 62323434 59029972 55327816
57067E5327816l963457m083696m072117l946634l733946l462745l159321k847342
57059B6058558k545461k263429k003893j768689j560434j378594j218896j078184
57051A2240978r56566q53692p66265o90590o24717n66838n14464m66615m24377
57042F376854l88085l56257l28120l04475k84999k67392k50506k35653k23451
57033C737916k12069k00228j89345j80777j73228j64868j56018j47839j39996
57024B173548j31533j22526j13368j03817r4142q5550p8303p1062o3319n6455
57014A253473n1221m6244m0537l5312l1654k8493k4697k1127j8677j6228j2511
57003I26772q200m132O91P332J5009K2984L2557M5107O0229P8082J01220J31442
$$ plain form
57067 55327816 51364359 47280663 43208546 39261912 35527966 32065221 28905900 26058558
57059 26058558 23513097 21249668 19245775 17477086 15916652 14538058 13319162 12240978
57051 12240978 11284412 10430720 9664455 8973865 8349148 7782310 7267846 6801231 6376854
57042 6376854 5988769 5632512 5304392 4999917 4714918 4447526 4197020 3961367 3737916
57033 3737916 3525847 3325619 3136274 2955497 2782269 2617401 2461383 2313544 2173548
57024 2173548 2042015 1919489 1806121 1702304 1608162 1522612 1444309 1373247 1309928 1253473
57014 1253473 1202252 1156008 1115471 1080159 1048505 1020012 995315 974188 955511 939283 926772
57003 926772 918572 914440 915131 922463 937472 960456 993013 1038120 1098349 1176431 1277651 1409093
56991A409093J66877K04571K42091K71407K74040K31003J41560K9265p3266j45062
56981B751579j84320k01025k05822k04068j96468j83088j65933j47764j29786
56972A133305j11849r4373p8508o4770n2825m2448l3538k5622j8469j2635q190
56961E90078l713K045Q316J3593J7867K1594K3249K0177J1849O02j0650j9853
56949F75154k5551k7347k6658k5390k3768k0907j7145j3960j1741r380o172k534
56937D64601J231N330R654J3957J8802K4934L1586L6613L8042L4445K4720R459
56925G13374p664k1832l0743l5153l6403l5270l2952l0877k9028k6207k2235j8431
56913C86579j5602j3238j1029r604r247r182q707p994p398o940o658o591o285
$$ plain form
56991 1409093 1575970 1780541 2022632 2294039 2568079 2799082 2940642 2969907 2896641 2751579
56981 2751579 2567259 2366234 2160412 1956344 1759876 1576788 1410855 1263091 1133305
56972 1133305 1021456 927083 848575 783805 730980 688532 654994 629372 610903 598268 590078
56961 590078 586365 588410 596726 610319 628186 649780 673029 693206 705055 705657 695007 675154
56949 675154 649603 622256 595598 570208 546440 525533 508388 494428 482687 473307 467135 464601
56937 464601 465832 471162 480816 494773 513575 538509 570095 606708 644750 679195 703915 713374
56925 713374 705710 683878 653135 617982 581579 546309 513357 482480 453452 427245 405010 386579
56913 386579 370977 357739 346710 337106 327859 318677 309970 301976 294578 287638 280980 274389 268104
56900B68104n182l496j910n92O51J677K468L800O289R278J1948J4887J9167K4335
56886C51424K8740L1361L1787K9098K2617J3579M348l751j0338j4500j5435j4231
56874D54699j2840j1394q559m399o20K155N175R216J3606J8039K3458L0464L8426
56861E57426M6715N5242O3003O7253O4727N3254L2921P266j7155l4551m3738m7186
56849H05177m6969m3573l7967l2018k6324j9814j2034l856M374J3382K3302L3531
56837F57211M4540N7725P2856Q7665J00014J07899J06897R1069N8863J6748k4610
56826A376877n6983p7318q6527q7696q4276p8234o9864n9543m8557l7910k7559
56815F62410j7429p881J255J0867K1375L2483M4170N6476O8027P5906P6972O8303
$$ plain form
56900 268104 262922 259426 257516 256924 257575 259252 261720 265520 271809 281087 293035 307922 327089 351424
56886 351424 380164 411525 443312 472410 495027 508606 512954 509203 498865 484365 468930 454699
56874 454699 441859 430465 421906 417507 416887 419042 424217 433433 447039 465078 488536 519000 557426
56861 557426 604141 659383 722386 789639 854366 907620 940541 947807 930652 896101 852363 805177
56849 805177 758208 714635 676668 644650 618326 598512 586478 582622 586996 600378 623680 657211
56837 657211 701751 759476 832332 919997 1020011 1127910 1234807 1325876 1384739 1401487 1376877
56826 1376877 1319894 1242576 1156049 1068353 984077 905843 835979 776436 727879 689969 662410
56815 662410 644981 637100 638355 649222 670597 703080 747250 803726 871753 947659 1024631 1092934
56803A092934M7662J6472j7799m5429o1715o8843p0672o8702o3670n7473n1435
56792F51330m4881l7189k9378k2233j4933p006K96O190J2022J9142K6699L3029
56780E93088L7496L9285L6103K6139J0569p141k3427l5375m1248m1891m0343l8714
56768E14541l6570l3125k9304k6257k3634k0791j8212j6293j4217j1454q972p554
56756B68158o443n024m226m704n211m444l089k345j875r56l04q48j903k267k146
56741B22373k341k600k346j998k068k075j683j735k627l063k061q20q71j720k063
56726A92302k068k476k704j889q25p95j398j421j025j177j663j562r66m93J14
56711A71954J190J785R19n99j305j233j221j001R1J323J372M02m37q86j265j167
$$ plain form
56803 1092934 1140596 1157068 1139269 1093840 1032125 963282 892610 823908 760238 702765 651330
56792 651330 606449 569260 539882 517649 502716 495710 496006 502196 514218 533360 560059 593088
56780 593088 630584 669869 705972 732111 742680 735539 712112 676737 635489 593598 553255 514541
56768 514541 477971 444846 415542 389285 365651 344860 326648 310355 296138 284684 275712 268158
56756 268158 261715 256691 252465 247761 242550 238106 235017 232672 230797 229841 229537 228689 226786 224519 222373
56741 222373 220032 217432 215086 213088 211020 208945 207262 205527 202900 199837 197776 196956 196085 194365 192302
56726 192302 190234 187758 185054 183165 182340 181545 180147 178726 177701 176524 174861 173299 172333 171840 171954
56711 171954 173144 174929 175848 175249 173944 172711 171490 170489 170580 171903 173275 173677 173240 172354 171089 169922
56695A69922k28N54J41o64m99J70p7j048j342o87Q8Q74K031K842K229O88l65p28
56677A73901j017q09O64K430K666J530Q42J100R97j0q56r03q33j076j102p07m33
56660A76384l03L48J436J848J081j1m14%P62J317J252P58O20J017R89n4j081q94
56642A85055k4J98k58m85m29o81j023q59o56j289k359k776k614k803l297l211
56626A62489k496j839j202n4J224J721J550J518J616J355J135J584J995J259Q2
56611A71937K45J787K888K594J890J767J973J997J846J502P91L3k01PJ67K84N62
56594A92069O22J89n8N24J242J078L82J73L97L11j2k2J31J90P28K004K781K078
56576B04807J118J573K840L175K689K847L668L934L786M606O522Q323R720J1379
$$ plain form
56695 169922 169694 170248 170389 169725 169226 169396 169319 168271 166929 166242 166330 167204 169235 172077 174306 174994 174629 173901
56677 173901 172884 172075 172739 175169 177835 179365 180207 181307 182304 182294 181438 180535 179702 178626 177524 176817 176384
56660 176384 176081 176429 177865 179713 180794 180783 180369 180369 181131 182448 183700 184458 185078 186095 187084 187030 185949 185055
56642 185055 185031 185229 184971 184486 184057 183376 182353 181494 180838 179549 177190 174414 171800 168997 165700 162489
56626 162489 159993 158154 156952 156898 158122 159843 161393 162911 164527 165882 167017 168601 170596 171855 171937
56611 171937 172182 173969 176857 179451 181341 183108 185081 187078 188924 190426 191217 191250 191049 191056 191223 191507 192069
56594 192069 192691 192880 192822 193346 194588 195666 196048 196221 196618 196929 196917 196895 197026 197216 197944 199948 202729 204807
56576 204807 205925 207498 210338 213513 216202 219049 222717 226651 230437 235043 241565 249888 259608 270987
56562B70987J2934J3282J2849J3223J4534J5398J5364J5248J5107J4184J2893
56551D26003J2473J2605J1634R319P043N163K602o22k958l944n019p075r188j0382
56537D47654j0830j0846j0434j0164j0831j2012j2590j2647j3011j3215j2075
56526C18999j0123r186r435r244q020o880o340n731n054n053n184m019j925q59
56512B31946j191j286n63l08r20j088l66J4k69N9J173J385P3j094j003p07j075
56495B24780j218n31r4o77j339j253j007j045o46L75R07M99L19J074J803J705
56479B23652J465J699J871J611J606K218K860L275L889M433M041L149L292M502
56465B63563N062M339L688L870L864L024K265K270K518K768L457M101L512K044
$$ plain form
56562 270987 283921 297203 310052 323275 337809 353207 368571 383819 398926 413110 426003
56551 426003 438476 451081 462715 472034 479077 484240 486842 486220 483262 479318 474299 467224 458036 447654
56537 447654 436824 425978 415544 405380 394549 382537 369947 357300 344289 331074 318999
56526 318999 308876 299690 290255 281011 272991 266111 259771 254040 248986 243933 238749 234730 232805 231946
56512 231946 230755 229469 228906 228598 227678 226590 226224 226238 225969 226028 227201 228586 228659 227565 226562 225855 224780
56495 224780 223562 223031 222937 222260 220921 219668 218661 217616 216970 217345 218252 218751 219070 220144 221947 223652
56479 223652 225117 226816 228687 230298 231904 234122 236982 240257 244146 248579 252620 255769 259061 263563
56465 263563 268625 272964 276652 280522 284386 287410 289675 291945 294463 297231 300688 304789 308301 310345
56451C10345J266J088r6j979k086J22J982J678O59O35J062J075J309K066K134
56436C21260J047J64J41l54j909k976k659k427l383m340m249m148m822n056m012
56421B82277l104l590m448m422m057l959l273j756j059k108l281l075k374k306
56407B39465k140j258r53k114l182k586j232n65j17R60J880J776J541K096K629
56392B36200K283J737J432L13j808k877j552N59J601K171L299M044L475K936L801
56377B57614M955M829M163M363M890M609M015L889L498K222J213J280J072m37
56363C02175j687j077J87K92j34L49J149J079Q77J641K390J808Q84J213K053J693
56347C14892M77N7P08J524K189K621K281J475J750L376M365L736L401M888O567
$$ plain form
56451 310345 311611 312699 312603 310624 308538 308660 310642 312320 312979 313614 314676 315751 317060 319126 321260
56436 321260 322307 322471 322612 322258 320349 317373 314714 312287 308904 304564 300315 296167 291345 286289 282277
56421 282277 279173 275583 271135 266713 262656 258697 255424 253668 252609 250501 247220 244145 241771 239465
56407 239465 237325 236067 235114 233000 229818 227232 226000 225435 225318 226278 228158 229934 231475 233571 236200
56392 236200 238483 240220 241652 241965 240157 237280 235728 236287 237888 240059 243358 247402 250877 253813 257614
56377 257614 262569 267398 271561 275924 280814 285423 289438 293327 296825 299047 300260 301540 302612 302175
56363 302175 300488 299411 299598 299890 299756 300105 301254 302333 303210 304851 307241 309049 309933 311146 313199 314892
56347 314892 315369 315426 316134 317658 319847 322468 324749 326224 327974 331350 335715 339451 342852 347740 354307
56332C54307O499N582N420N411M675M501O000P535P362O765P648R018Q940P959
56318D47622P588P260N896M624M825N249M107K273J443R74m18j716j541j066j799
56303D85321k443j301J18m34j772j253O20J387J024J402K586L193L427M413N565
56288E01853N785O041P592R100Q750P775Q580J0733J2154J2866J4247J5970J7010
56275F38456J8170K0449K2548K3237K4313K7736L1916L4552L7048M2001M8334
56264I68760N3340N7800O4399P2635P9915Q6534R4881J04704J13830J22612J33036
56253A952446J44123J52770J58644J63817J68110J69079J66136J60449J51319
56244C386893J36883J18067R7738P6467N3071K8843P100j1125k7031m0398m9880
$$ plain form
56332 354307 360806 366388 371808 377219 381894 386395 392395 399930 407292 414057 421705 430723 439663 447622
56318 447622 455210 462470 468366 472990 477815 483064 487171 489444 490887 491861 491443 489727 488186 487120 485321
56303 485321 482878 481577 481695 481261 479489 478236 478856 480243 481267 482669 485255 488448 491875 496288 501853
56288 501853 507638 513679 521271 530371 539121 546896 555476 566209 578363 591229 605476 621446 638456
56275 638456 656626 677075 699623 722860 747173 774909 806825 841377 878425 920426 968760
56264 968760 1022100 1079900 1144299 1216934 1296849 1383383 1478264 1582968 1696798 1819410 1952446
56253 1952446 2096569 2249339 2407983 2571800 2739910 2908989 3075125 3235574 3386893
56244 3386893 3523776 3641843 3739581 3816048 3869119 3897962 3905062 3893937 3866906 3826508 3776628
56233C776628n6311o1800o6066o7502o7081o7407o8789p0013p1804p5671q0430
56222C023754q3993q7195r1870r6709r9456j01385j04796j07840j07135j03955
56212B039420j02238j01725r8780r3132q7911q3621p7865p0676o4539n9392n3136
56201A146405m6631m2685m0440l6472l1066k7651k6331k3870j9998j7643j6896
56190H16722j4751j1114r089q895p456m456k989l592l362j534l36J34K169N248
56176G56699O309N576O342Q696R313P832P397Q566Q707P767Q341R774Q697N756
56162H65772N121O858O696M066L117M823N279L304K491M135N164M848O454J0409
56148I38537J2761J2487J3437J7057K0045K1426K4871L1659L8136M2754M9003
$$ plain form
56233 3776628 3720317 3658517 3592451 3524949 3457868 3390461 3321672 3251659 3179855 3104184 3023754
56222 3023754 2939761 2852566 2760696 2663987 2564531 2463146 2358350 2250510 2143375 2039420
56212 2039420 1937182 1835457 1736677 1643545 1555634 1472013 1394148 1323472 1258933 1199541 1146405
56201 1146405 1099774 1057089 1016649 980177 949111 921460 895129 871259 851261 833618 816722
56190 816722 801971 790857 781768 772873 765417 760961 757972 754380 751018 749484 749148 749282 751451 756699
56176 756699 763008 768584 774926 783622 792935 800767 808164 816730 825437 833204 841545 851319 860016 865772
56162 865772 870893 877751 884447 888513 891630 896453 901732 905036 907527 911662 916826 921674 928128 938537
56148 938537 951298 963785 977222 994279 1014324 1035750 1060621 1092280 1130416 1173170 1222173
56137A222173N8826O9696Q0708R4923J12935J30398J44417J56145J64756J65531
56127B400508J56666J42082J25439J07559R1217Q1136P6820P1974O3219N2595
56117C369215M0280K3025K311j4195k2735k7729l3492l9525m6809o0216q0513
56106C109617j01360j17922j31323j41664j44657j39153j30419j21972j11415
56097A969732r7796q5421p6516o7749n7646m9950m6028m1737l5373l0743k8964
56086A351809k5548j9253j5147j4999j3550q404m573m808m590j360N87p27l13
56073A239124M162P427O545O409R920J2269J0626R891J2908J4676J2369J1346
56061A357672J4826J7400J5366J3737J6235J8136J5912J4224J6414J7954J6146
$$ plain form
56137 1222173 1280999 1350695 1431403 1526326 1639261 1769659 1914076 2070221 2234977 2400508
56127 2400508 2557174 2699256 2824695 2932254 3023471 3104607 3181427 3253401 3316620 3369215
56117 3369215 3409495 3432520 3434831 3420636 3397901 3370172 3336680 3297155 3250346 3190130 3109617
56106 3109617 3008257 2890335 2759012 2617348 2472691 2333538 2203119 2081147 1969732
56097 1969732 1871936 1786515 1709999 1642250 1584604 1534654 1488626 1446889 1411516 1380773 1351809
56086 1351809 1326261 1307008 1291861 1276862 1263312 1254908 1250335 1245527 1240937 1239577 1240164 1239437 1239124
56073 1239124 1243286 1250713 1257258 1263667 1273587 1285856 1296482 1306373 1319281 1333957 1346326 1357672
56061 1357672 1372498 1389898 1405264 1419001 1435236 1453372 1469284 1483508 1499922 1517876 1534022
56050A534022J6214K0746K3516K1045J9560K3120K5860K3753K2716K6804K9898
56039A787254K7730K6565L0964L4673L2987L2219L7179M1312L9411L8041M2809
56028B171144M7470M6461M5952N1245N5713N3784N2301N7089O1116N8301N6065
56017B756641O1257O6819O5717O4780P0920P6999P5717P4187Q0099Q6933Q7655
56006C567724Q9182R8070J06253J06613J07864J17804J27308J27887J29204J41083
55996D718992J54497J59075J63079J76400J90748J96899K04258K22283K40403
55987F426634K48227K56946K78036L00455L12902L27869L58140L91354M14808
55978I315371M42662M89669N41785N83736O30671O99672P76351Q45207R25285
$$ plain form
56050 1534022 1550236 1570982 1594498 1615543 1635103 1658223 1684083 1707836 1730552 1757356 1787254
56039 1787254 1814984 1841549 1872513 1907186 1940173 1972392 2009571 2050883 2090294 2128335 2171144
56028 2171144 2218614 2265075 2311027 2362272 2417985 2471769 2524070 2581159 2642275 2700576 2756641
56017 2756641 2817898 2884717 2950434 3015214 3086134 3163133 3238850 3313037 3393136 3480069 3567724
56006 3567724 3656906 3754976 3861229 3967842 4075706 4193510 4320818 4448705 4577909 4718992
55996 4718992 4873489 5032564 5195643 5372043 5562791 5759690 5963948 6186231 6426634
55987 6426634 6674861 6931807 7209843 7510298 7823200 8151069 8509209 8900563 9315371
55978 9315371 9758033 10247702 10789487 11373223 12003894 12703566 13479917 14325124 15250409
55969A5250409J037709J167389J298057J453777J661437J906583K175850K506651
55961B8457862K941070L470449M084459M828785N746023O812085Q014809R446169
55953G3801711J1232690J3444623J6180073J9644008K3974223K9030492L4439809
55946B21747629L9565767M2995615M2235692L4844446K0658419K837221j3804547
55939C91080242k5767174l2353250l4794296l4611150l2848957l0175500k7051126
55932A73478789k3749481k0448963j7349488j4623838j2311097j0361306q747864
55925F5886752p457490o420952n546907m801434m187473l675820l221101k819710
55917B7755865k490639k219138j972102j748810j566677j415014j269004j132433
$$ plain form
55969 15250409 16288118 17455507 18753564 20207341 21868778 23775361 25951211 28457862
55961 28457862 31398932 34869381 38953840 43782625 49528648 56340733 64355542 73801711
55953 73801711 85034401 98479024 114659097 134303105 158277328 187307820 221747629
55946 221747629 261313396 304309011 346544703 381389149 402047568 404884789 391080242
55939 391080242 365313068 332959818 298165522 263554372 230705415 200529915 173478789
55932 173478789 149729308 129280345 111930857 97307019 84995922 74634616 65886752
55925 65886752 58429262 52008310 46461403 41659969 37472496 33796676 30575575 27755865
55917 27755865 25265226 23046088 21073986 19325176 17758499 16343485 15074481 13942048
55909A3942048j023416r33719q42562p55448o90487o40355n84784n27602m85920
55900G457755m54752m16687l75663l48145l30451l06262k77785k59395k48320
55891D440295k30386k07738j93469j85374j71155j53347j43921j40024j29307
55882B885574j13915j05864j03800r6859q6653q3459q5043q0423p0691o5960o5556
55871A927351o0696n2835n0360n0996m5943l7675l5642l8112l6029l0969l1555
55860A456539l5722l4211k8450k7506l0180k7345j9616j5815j5840j1685l831
55849A206338m69j451J357Q404J1888R963P470L748o094j8702k5273k6024k8729
55836A142426l3978l5387l3269l4203l7569l6094k9851k6513k7443k6233k1519
$$ plain form
55909 13942048 12918632 11984913 11142351 10386903 9696416 9056061 8471277 7943675 7457755
55900 7457755 7003003 6586316 6210653 5862508 5532057 5225795 4948010 4688615 4440295
55891 4440295 4209909 4002171 3808702 3623328 3452173 3298826 3154905 3014881 2885574
55882 2885574 2771659 2665795 2561995 2465136 2378483 2295024 2209981 2129558 2058867 1992907 1927351
55871 1927351 1866655 1813820 1763460 1712464 1666521 1628846 1593204 1555092 1519063 1488094 1456539
55860 1456539 1420817 1386606 1358156 1330650 1300470 1273125 1253509 1237694 1221854 1210169 1206338
55849 1206338 1205869 1204418 1205775 1214179 1226067 1236030 1243500 1247248 1241154 1222452 1197179 1171155 1142426
55836 1142426 1108448 1073061 1039792 1005589 968020 931926 902075 875562 848119 821886 800367
55825H00367j8832j9087j7251j3321j3011j6546j7790j5411j4221j4861j2748
55814F27288p994n984p181o413k946j517k700j934J272K519J391J902L846K866
55800F04415o33j818p28k098n861p179o096p707j2237j4335j2947j2713j4742
55787E05321j4955j2554j1333j1734j0135o867o353q408q021m640l063m170l411
55774C99677J45J807k57k546l644o196j0110j1567j0243r950j1003r570n649l775
55760C17119m593l703l33Q57j645l596k979l071n497p383p539q521j0592j0428
55746B48096p761o511p622p415m799l309m195m314k682k442m290m642k401j030
55732A84683j902j975l2J073L60N35J931J133k382m581l852l362m452m228j888
$$ plain form
55825 800367 781535 762448 745197 731876 718865 702319 684529 669118 654897 640036 627288
55814 627288 619294 613310 606129 599716 596770 595253 592553 590619 591891 594410 595801 597703 601549 604415
55800 604415 603782 601964 601236 599138 593277 586098 580002 572295 560058 545723 532776 520063 505321
55787 505321 490366 477812 466479 454745 444610 437743 431390 422982 414961 410321 407258 403088 399677
55774 399677 399822 401629 401372 398826 395182 388986 378876 367309 357066 347116 336113 326543 320894 317119
55760 317119 312526 308823 308490 309347 307702 304106 301127 298056 292559 285176 277637 269116 258524 248096
55746 248096 240335 233824 226202 218787 213988 210679 206484 202170 199488 197046 192756 188114 185713 184683
55732 184683 182781 180806 180774 181847 182207 182742 184673 185806 183424 178843 174991 171629 167177 162949 161061
55717A61061q41k169k337m6J116m95j342O56K397J632R31K441M174M604N596P784
55701A85162Q213N714L551L832M180K804J827K708L296K315J935L127L271J137
55687B33072n51k87n41k591l614k020p34j835k620m98K534L730L826M194L698
55672B35763J696L66R50J296p8j197o12k84j589k345p99R81P54l01m27l45p92
55655B33037l84J378K283J099j65k8j37j813l532m164n167p125p828o341n333
55640A95780o712q423q302p609p976q255p229o267o568o716n559m485m483m021
55626A03175k205q72j273j827j408j498k820l299j784m31q66j328j98R87N45l82
55610H4516m34m69j107j040k0j74k137l342k465j832k987l748k384q89j108j367
$$ plain form
55717 161061 160220 158051 155714 155668 156784 156289 154947 155603 158000 159632 160563 163004 167178 171782 177378 185162
55701 185162 193375 199089 202640 206472 210652 213456 215283 217991 221287 223602 225537 228664 231935 233072
55687 233072 232521 232234 231693 229102 225488 223468 222734 220899 218279 217781 220315 224045 227871 232065 235763
55672 235763 237459 237825 238775 240071 239993 238796 238184 237900 236311 233966 233167 234148 234902 234601 234174 233829 233037
55655 233037 232653 234031 236314 237413 237248 237220 237083 235270 231738 227574 222407 215282 207454 201113 195780
55640 195780 189068 180645 172343 164734 156758 148503 141274 135007 128439 121723 116164 111679 107196 103175
55626 103175 100970 100098 98825 96998 95590 94092 91272 87973 86189 85758 84892 83564 83366 84353 84898 84516
55610 84516 84082 83613 82506 81466 81446 81272 79135 75793 73328 71496 68509 64761 62377 61488 60380 59013
55594E9013q7R53K00m04Q21J770L91j258n80R70O83p36j089p56j195j706j120
55577E5870n88j418k279j660q07j244j709o62N54J96n97j02P19L53k17L71R63
55560D7743K23m74M26J510R37j68M9Q07O60N27J528K136P97p39j25J636K247K082
55542F1802K747L638L422L043L917M921M437L574M030M648L553J957K237L716
55528A11642L882K501J212K63j111k314k420k402l476m509l939k778k877l688
55514H9986l635l162l476l804k913j809k011k670k301j686k137k547j426j04o85
55499E5620k305k764k292k407k581j484j07k17r81n45L91K4r14n84J27r77l199
55482C4805l879k786j990j980j431l13R8j29j8q7j262k238j224N39M06j283j900
$$ plain form
55594 59013 58926 59879 60079 59675 60496 62266 62657 61399 60819 61789 62472 61736 60647 59891 58696 56990 55870
55577 55870 55282 53864 51585 49925 49118 47874 46165 45503 46057 46253 45656 45554 46273 46626 46409 46780 47743
55560 47743 47966 47492 47918 49428 50365 50197 50246 51053 51713 52240 53768 55904 56701 55962 55837 57473 59720 61802
55542 61802 64549 68187 71609 74652 78569 83490 87927 91501 95531 100179 103732 105689 107926 111642
55528 111642 115524 118025 119237 119500 118389 116075 113655 111253 107777 103268 99329 96551 93674 89986
55514 89986 86351 83189 79713 75909 72996 71187 69176 66506 64205 62519 60382 57835 56409 56305 55620
55499 55620 53315 50551 48259 45852 43271 41787 41680 41463 40482 39937 40328 40352 39438 38854 38981 38004 34805
55482 34805 30926 28140 26150 24170 22739 22426 22524 22395 22377 22290 21028 18790 17566 18105 18511 17228 15328
55465A5328r66l21l95Q0Q36J58j642k282j223k84l50l26L26Q03R17J321J672R87
55447A4639j84k84O87J293J158J098J144P05K43N58R45K44r06j084n63n27o78
55430A8488j14M87Q8l91K93Q75n17k713k948j258o5j0M15J429J583P05J48J06
55412A6601m29j132o77N38Q26J73N6O07P25O41J417K309J719M01N29J800J772
55395B7876J02r68m66R0k59p27j027j865k788k374r04k29o52n91M04J017Q00Q34
55377A8273J429J633J282J125R26n8q99j2J848K301J034r9m35r56j563j060Mk56
55359B4517j643j962q37j83o17p18k02m92j508j310K45Q48l44j334q96l78p20
55342A2466p83O7M67l82j250j194q74n86M39J781J564l11j357k13J347J459P79
$$ plain form
55465 15328 14362 14041 13646 13726 14562 14720 13078 10796 9573 9289 8939 8613 8939 9742 10659 11980 13652 14639
55447 14639 14455 14171 14858 16151 17309 18407 19551 20256 20499 21057 22002 22246 21340 20256 19693 19166 18488
55430 18488 18374 18861 18949 18558 18851 19726 19209 16496 13548 12290 12225 12215 12630 14059 15642 16347 16495 16601
55412 16601 16172 15040 14363 14901 15727 15900 15956 16563 17288 17929 19346 21655 23374 23775 24304 26104 27876
55395 27876 27978 27010 26544 26634 26375 25648 24621 22756 19968 17594 16690 16461 15809 15218 15622 16639 17439 18273
55377 18273 19702 21335 22617 23742 24668 24610 23711 23699 25547 27848 28882 28783 28348 27392 25829 24769 24773 24517
55359 24517 22874 20912 20075 19892 19275 18557 18355 17863 16355 15045 15290 16138 15794 14460 13564 13186 12466
55342 12466 11683 11750 12217 11835 10585 9391 8517 7931 8370 10151 11715 11404 10047 9834 11181 12640 13419
55325A3419N76N86K73J72N52N25k34p15m98n97j395j673p32L29M60N1l41q97j444
55306H417j227m37k05n74l59O60J330J291J382J620J081M0j22M54J99q38q19M99
55288A2392J102J84o23l50r8l41J91J668K153Q41l74j25L38k28q78n72k4J55Q32
55269A6243K226K743J596L78M23P73L98J61Q45J378Q43K30M34M82m48j199o17
55252B6889L55L61k39n49p28q96k34J307K072J085l76r12r48j111p03N36J143
55235B7052J57j099j230r62j381j781j152k11ml5M24O34j69j029p95j32k33p85
55217A7269q09l90j4N69J446J764J223R56J613K047J259R7l57m81q16o82K69Q61
55199B5824L08k44K26P04L5r22q43j67M5P1N04P37J94k38J52L13p26j840j549
$$ plain form
55325 13419 13995 14581 14854 15026 15578 16103 15869 15154 14656 14059 12664 10991 10259 10588 11048 11099 10758 9861 8417
55306 8417 7190 6753 6548 5974 5615 6275 7605 8896 10278 11898 12979 13019 12897 13351 13550 12712 11893 12392
55288 12392 13494 13678 13055 12705 12607 12266 12457 14125 16278 17119 16745 16620 16958 16730 15852 15280 15256 15411 16243
55269 16243 18469 21212 22808 23186 23609 24382 24780 24941 25786 27164 28007 28237 28671 29153 28705 27506 26889
55252 26889 27244 27605 27366 26817 26089 25193 24959 26266 28338 29423 29047 28135 27187 26076 25373 25909 27052
55235 27052 27209 26110 24880 23918 22537 20756 19604 19393 19389 19354 19778 20412 20243 19214 18419 18287 18054 17269
55217 17269 16460 16070 16056 16625 18071 19835 21058 22014 23627 25674 26933 27030 26673 26192 25376 24694 24963 25824
55199 25824 26132 25888 26114 26818 26853 25931 25088 24921 24966 25037 25541 26278 26472 26234 26386 26699 25973 24133 22584
55180B2584m94j50l73j17N06Q42J228K079K488J596K19m78p84j244j073L81J787
55163B8997J522J07q98j338j921k371k082j577j472j023L79J513J135K45M24R98
55147B2638K67j349j865q86J69N65Q45J124Q92M19O08J464K109K176J976J665
55131C2817J409J747K696L256K912K621L122L513K834J815J408R41m92j981k142
55116E6476j419j113j109o25k54j109k622l269k906k471k047j151k51j14k12L47
55100C6151J022P68Q0J29O39N11n8r4K00j5l63J01R81J251J192J604J833Q48m12
55081D6368j42J296J870J109N32Q94J317J208R79P60K41j88J17O20L63j44L21
55064E7521J371J514P29M50J067J523J444J603K133K190J608J141R18L38m51o87
$$ plain form
55180 22584 22090 21940 21567 21450 21956 22798 24026 26105 28593 30189 30408 29930 29146 27902 26829 27210 28997
55163 28997 30519 30626 29728 28390 26469 24098 22016 20439 18967 17944 18323 19836 20971 21216 21640 22638
55147 22638 22905 21556 19691 18805 18974 19539 20384 21508 22400 22819 23427 24891 27000 29176 31152 32817
55131 32817 34226 35973 38669 41925 44837 47458 50580 54093 56927 58742 60150 61091 60599 58618 56476
55116 56476 55057 53944 52835 52210 51956 50847 48225 44956 42050 39579 37532 36381 36130 36016 35804 36151
55100 36151 37173 37941 38021 38150 38789 39300 39242 39148 39348 39333 38970 39071 40052 41303 42495 44099 45932 46780 46368
55081 46368 46226 47522 49392 50501 51033 51927 53244 54452 55431 56191 56432 56244 56361 56981 57344 57200 57521
55064 57521 58892 60406 61135 61585 62652 64175 65619 67222 69355 71545 73153 74294 75212 75550 75099 74412
55048G4412n61r12j407r63J79O52L54O39J839K648K296J582J211P32l20j566k494
55031G8321k908k604j641q65q80q82P0J155Q58m36r56m01j72p35r16j49N44L60
55013F7763k17o20r07r22k92M64L24m98p52k47j25p80j227r21n69p39j082j334
54995E7319j738k101j838j165r17r74l70R20J788J818J813K198K376J954J261
54980F2344M64m48q47j42P99N67l68j61J414K519K212J757K287L056L079K767
54964H1299K881L225L404L736M452N069N245N357N701O014O234O663P132P048
54950A53460O658P022Q429R949J0846J1180J0746Q834N538J988j173m395p896
54937B21186j0960j2948j3871j3672j2205j0241r142r085q926q147p550p504p002
$$ plain form
55048 74412 73851 72939 71532 70569 70748 71400 71754 72393 74232 76880 79176 80758 81969 82701 82381 80815 78321
55031 78321 75413 72809 71168 70303 69423 68541 68611 69766 70624 70188 69232 68831 68659 67924 67008 66859 67403 67763
55013 67763 67546 66926 66019 65097 64805 65269 65593 65095 64343 64096 63971 63191 61964 61043 60474 59735 58653 57319
54995 57319 55581 53480 51642 50477 49560 48586 48216 49136 50924 52742 54555 56753 59129 61083 62344
54980 62344 62808 62360 61513 61371 62170 62737 62369 62208 63622 66141 68353 70110 72397 75453 78532 81299
54964 81299 84180 87405 90809 94545 98997 104066 109311 114668 120369 126383 132617 139280 146412 153460
54950 153460 160118 167140 175569 185518 196364 207544 218290 227124 232662 234650 233477 229082 221186
54937 221186 210226 197278 183407 169735 157530 147289 138147 129062 120136 111989 104439 96935 89933
54924H9933n262l026j481q73p96r24q10P7J504K461K469K185K403L152M102N067
54908A00181O015P152Q970J1411J3266J3426J2379J1350J0288Q139M774J120k394
54895B06077n874q678r914j0203j1029j2236j2158j0501q937q357p649o015m483
54882I0043m059m043l385k313j533j049o73o86j115j362j149q29m49L81J182O99
54866F9660j153k731k750j694o66rK62K6m11m16j70n22j338j441o02k8l55o68
54848E4994k94Rm68j097j098p83p57r35j110j509k072k125j407m56L38J165J918
54831D4313K114J819J621J471R20M10Q13J667J657R43R61J740J656L58m26K22
54815F2259J006Q83O88J117J292O46K40Q04J338J181J497L080M522M355L459L584
$$ plain form
54924 89933 84671 81645 80164 79291 78495 77571 76761 76838 78342 80803 83272 85457 87860 91012 95114 100181
54908 100181 106196 113348 122318 133729 146995 160421 172800 184150 194438 202577 207351 208471 206077
54895 206077 200203 191525 181611 171408 160379 148143 135985 125484 116547 108190 100541 94526 90043
54882 90043 85984 81941 78556 76243 74710 73661 72988 72302 71187 69825 68676 67847 67398 67779 68961 69660
54866 69660 68507 65776 63026 61332 60666 60657 60919 60945 60534 60118 59948 59426 58088 56647 56045 56017 55662 54994
54848 54994 54700 54709 54241 53144 52046 51263 50506 49571 48461 46952 44880 42755 41348 40892 41230 42395 44313
54831 44313 46427 48246 49867 51338 52258 52668 53481 55148 56805 57748 58709 60449 62105 62463 62037 62259
54815 62259 63265 64148 64836 65953 67245 67891 68131 68935 70273 71454 72951 76031 80553 84908 88367 91951
54799I1951M862O511Q577J1132J3022J3249J2607J2345J2230J1505J0539R845
54787B18375Q513N467J438j985m485o686q451r188r110q807q131o884n873n838
54773A58355o079n481m283l434k909k068j082n70l33K95J217J838K224K931M110
54758A44731N582P307R092J0520J1752J3577J6046J8098J9195K0034K0895K0660
54746C17489J8513J5141J1233O259N3n929j0409j3972j7453j9998k0427j9326
54734B61174j8059j6786j5140j3643j2714j1412r059p009o764p436p129n930n260
54721A24833n087m202k752k091k243j874p66k15p47j323j132o24l81m18p41j372
54705I8865j763j309l93J69M35R96J678J868J744J872J984J391L16m17o98r05
$$ plain form
54799 91951 96813 103324 111901 123033 136055 149304 161911 174256 186486 197991 208530 218375
54787 218375 226888 232355 233793 231808 227323 220637 212186 202998 193888 185081 176950 170066 164193 158355
54773 158355 152276 146795 142512 139078 136169 134101 133019 132449 132116 132411 133628 135466 137690 140621 144731
54758 144731 150313 157620 166712 177232 188984 202561 218607 236705 255900 275934 296829 317489
54746 317489 336002 351143 362376 368635 368688 362759 352350 338378 320925 300927 280500 261174
54734 261174 243115 226329 211189 197546 184832 173420 164361 157352 150588 143152 136023 130093 124833
54721 124833 119746 115544 112792 110701 108458 106584 105818 105603 104856 103533 102401 101777 101396 100978 100237 98865
54705 98865 97102 95793 95400 95569 96004 97000 98678 100546 102290 104162 106146 107537 107853 107436 106738 105833
54689A05833q63k88K23K1l52p7L85J00n53n02J06K47j24j53L60R61J695K686L147
54670A12852K467J719K271L457L564K666K406L219L995M348M963N609N125L716
54656A62377L085L851M766N031N325N990O202N774N973P504R328J0424J1338J2900
54642B59868J4788J6382J7932J9799K1294K1290J9387J5879J1091N345r41p367
54630D14747j3379j7998k0494k1260k1295k0918j9924j8715j7955j7218j5361
54619B10230j2429r786q189p025n792m903m535m028l032k186j944j786j160l74
54605A43061Q7K90L98K50j86n50p34j143j992k940l588l788l406k546j931k221
54589A19061k970l146k712k593l023l153k587k130k474l137l266k731j868q39
$$ plain form
54689 105833 104970 104682 104905 104926 104574 104497 104882 104982 104429 103927 104033 104280 104156 104003 104363 105324 107019 109705 112852
54670 112852 115319 117038 119309 122766 126330 128996 131402 134621 138616 142964 147927 153536 158661 162377
54656 162377 165462 169313 174079 179110 184435 190425 196627 202401 208374 215878 225206 235630 246968 259868
54642 259868 274656 291038 308970 328769 350063 371353 390740 406619 417710 423055 422114 414747
54630 414747 401368 383370 362876 341616 320321 299403 279479 260764 242809 225591 210230
54619 210230 197801 188015 179826 172801 167009 162106 157571 153543 150511 148325 146381 144595 143435 143061
54605 143061 143148 143438 143836 144086 143900 143350 142616 141473 139481 136541 132953 129165 125759 123213 121282 119061
54589 119061 116091 112945 110233 107640 104617 101464 98877 96747 94273 91136 87870 85139 83271 82432
54575H2432K20Q80P81L8q69j399j245p26n80r35r33m1Q31N27n62j013m39L09P56
54556G8032J206J550J074j77j116j045l95K61R31J689K330K786L151L229K875
54541I6381K657L209M098M405M324M932O402P780Q620R442J0345J0581R903R069
54527A92148Q503P569N687L191O04j989m443o347p677q807r692r904r647r661
54513A49535r891r330p533n349l822l152l021l094l006k657k520k906l067k149
54499H8038p53l21r95j494j192p87q03q44o60n78n42o9O10P32N05R11J760J694
54481H5212N53r5N86J418J293Q04Q20R42O21L81P82J253J103O50K89l66j392j722
54463I3132o16R09J367O96j80q43j357j487j102p53q81r90n71j30m17j193j703
$$ plain form
54575 82432 82652 83532 84313 84351 83482 82083 80838 80112 79532 78597 77664 77623 78454 78981 78419 77406 76967 77276 78032
54556 78032 79238 80788 81862 81685 80569 79524 79129 79390 80321 82010 84340 87126 90277 93506 96381
54541 96381 99038 102247 106345 110750 115074 120006 126408 134188 142808 152250 162595 173176 183079 192148
54527 192148 200651 208220 213907 217098 217702 215713 211270 204923 197246 188439 178747 168843 159196 149535
54513 149535 139644 130314 122781 117432 113610 110458 107437 104343 101337 98680 96160 93254 90187 88038
54499 88038 87285 86964 85969 84475 83283 82496 81693 80849 80189 79611 79069 79000 79610 80342 80847 81758 83518 85212
54481 85212 85765 85670 86256 87674 88967 89771 90591 91533 92154 92535 93317 94570 95673 96323 96612 96246 94854 93132
54463 93132 92516 93425 94792 95488 95308 94465 93108 91621 90519 89766 88885 87895 87324 87194 86777 85584 83881
54446H3881j848j954j929j539j130j196j572j695j390q35j91K95K96p8k59q1k2
54429F8753k87m62m27o26j044r16m4O53N76L90P37J059O93J63K95Q59J134J183
54411G2689J458J747J573J176J117J313J377J461J915K463K614K503K552K659
54397I8617K526K403K707L175L223K869K634K724K892K913K710K210J479P80J98
54382A34060l85q14p68m90p20j567k273k456k604k917k698j692r46j339k129k068
54366A08194j304j007j520k016j869j346r80r55j214j611j948k098j948j250M8
54351H7176J214J224Q2r92j028k35P60J701K353K338J927K073L049L897L878L516
54335A12933L415L095J968O65K47O16P95L66l26j032j798k484k845k878k743k522
$$ plain form
54446 83881 82033 80079 78150 76611 75481 74285 72713 71018 69628 68793 68602 68897 69193 69115 68856 68775 68753
54429 68753 68466 68004 67577 66951 65907 64991 64947 65600 66176 66566 67303 68362 69055 69218 69513 70372 71506 72689
54411 72689 74147 75894 77467 78643 79760 81073 82450 83911 85826 88289 90903 93406 95958 98617
54397 98617 101143 103546 106253 109428 112651 115520 118154 120878 123770 126683 129393 131603 133082 133862 134060
54382 134060 133675 132861 132093 131603 130883 129316 127043 124587 121983 119066 116368 114676 113730 112391 110262 108194
54366 108194 106890 105883 104363 102347 100478 99132 98152 97197 95983 94372 92424 90326 88378 87128 87176
54351 87176 88390 89614 89696 88704 87676 87441 88201 89902 92255 94593 96520 98593 101642 105539 109417 112933
54335 112933 116348 119443 121411 122076 122323 122939 123734 124100 123774 122742 120944 118460 115615 112737 109994 107472
54319A07472k374k416k266j414l32k36j358k474k695k603k888l064k519j796j659
54304G7378j759j415r85j251k038k578k708k618j996n86Q37J190N22k27n43n87
54288F0636m81l43o26j511k245j945p69M14J116J317R83L29M0M02P36M37J0K22
54270E8722P90Q99N06K21K48L73N76Q74R70P57O67R31J104R64R65J116N35r02
54252G0316j695p91N40M84o16r89k89J97j98p98j027j030q52l69ok53o08j86P70
54233F2600J222R78O95M74j19p98p86k82l20j068j608j548j482j634j362l74P09
54216E5297J335J595J555J033K63j03O1K27J37Oj68n95r89p97j96N9k02m34m05
54197E7679l75l17O8N45N48K14J66L15jo30o15J63O53K91q3L69J185J343O57j64
$$ plain form
54319 107472 105098 102682 100416 99002 98670 98434 97076 94602 91907 89304 86416 83352 80833 79037 77378
54304 77378 75619 74204 73219 71968 69930 67352 64644 62026 60030 59444 60281 61471 61993 61766 61223 60636
54288 60636 60155 59812 59186 57675 55430 53485 52716 53130 54246 55563 56546 56875 56915 57317 58053 58490 58500 58722
54270 58722 59512 60411 60917 61138 61386 61759 62335 63209 64179 64936 65603 66534 67638 68602 69567 70683 71218 70316
54252 70316 68621 67830 68370 68854 68238 67249 66960 67157 66959 66161 65134 64104 63252 62883 62877 62624 62016 61830 62600
54233 62600 63822 64800 65495 65969 65850 65052 64266 63984 63664 62596 60988 59440 57958 56324 54962 54588 55297
54216 55297 56632 58227 59782 60815 61078 60975 61036 61263 61400 61406 61238 60643 59654 58857 58661 58720 58518 58084 57679
54197 57679 57304 56987 57055 57600 58148 58362 58528 58843 58842 58212 57597 57760 58413 58704 58621 58990 60175 61518 62175 62011
54177F2011m18M2Q04J175Q39K88K56P39J108J026P02L38o3m14o62j053j684k043
54159F2991j633p95j96J63N93Q77O48K97M07O27K24m30k28R20J873J874J275N91
54141G0078j1k50J51O78M21n71j262j059l75K93P81P85O5p67p09K01R11Q97N65
54122G0822J57n60j240j003R3Q00L68n46j126j400j529j198m05J9m71j184j111
54105F0486k15P24J137R99N47P1j71r8K48Q30J355J246L59n60q14p58j060j374
54087F2952q15M48J256J068M21j78o91r04n13M6J4m05l31K10K57l77p66n23l64
54068F0805o50p30l23j70n93p05J26J095J194O84M46O21P89R31J252J542J375
54051F7689P69J11k83l10l8K62M16O19J083J531J630J669K069K537K574K507K886
$$ plain form
54177 62011 61593 61635 62439 63614 64453 64741 64997 65736 66844 67870 68572 68910 68847 68433 67771 66718 65034 62991
54159 62991 61358 60563 60367 60530 61123 62000 62648 62945 63352 63979 64203 63773 63545 64465 66338 68212 69487 70078
54141 70078 70067 69817 69968 70646 71067 70496 69234 68175 67800 68093 68874 69659 69724 68957 68248 68449 69360 70257 70822
54122 70822 70979 70419 69179 68176 68269 69069 69437 68891 67765 66365 64836 63638 63233 63252 62781 61597 60486
54105 60486 60271 60995 62132 63131 63678 63749 63578 63480 63728 64558 65913 67159 67518 66958 66144 65386 64326 62952
54087 62952 62137 62585 63841 64909 65330 65152 64461 63557 63044 63090 63104 62699 62368 62578 62835 62458 61692 61169 60805
54068 60805 60155 59425 59102 58932 58339 57634 57760 58855 60049 60733 61179 61800 62589 63520 64772 66314 67689
54051 67689 68458 68569 68286 67976 67938 68200 68616 69235 70318 71849 73479 75148 77217 79754 82328 84835 87721
54034H7721L184K520J475J573K898L879L827L878M844N796N712N079M821M838
54020A42045M622M298M075L596K770K361K882L650L779L337K827K265J621J277
54006A85405J356J213L88o49j395k135l190m073m204l844l622l648l692l638l296
53991A50976k455j549j484k311k939k668k064j794j624j251j062j229j007O1J100
53976A28700J095L73r1j56l19o04o40n22o82j158j626j841j605p99J32L58k03
53959A20412o33l37J45J68PJ88N84R10J310J826K011J771J773K342K774K505K065
53942A39821K177K697L294M197N387O048N816N609O143O507N512L650K312J609
53928B00779M53j464l151l756l442k808k257j938j669j052r2O29Q90J347K484
$$ plain form
54034 87721 90905 93425 94900 96473 99371 103250 107077 110955 115799 121595 127307 132386 137207 142045
54020 142045 146667 150965 155040 158636 161406 163767 166649 170299 174078 177415 180242 182507 184128 185405
54006 185405 186761 187974 188362 187713 186318 184183 180993 176920 172716 168872 165250 161602 157910 154272 150976
53991 150976 148521 146972 145488 143177 140238 137570 135506 133712 132088 130837 129775 128546 127539 127600 128700
53976 128700 129795 130168 130077 129921 129602 128998 128358 127836 127154 125996 124370 122529 120924 120125 120257 120615 120412
53959 120412 119779 119442 119587 119755 119762 119950 120534 121444 122754 124580 126591 128362 130135 132477 135251 137756 139821
53942 139821 141998 144695 147989 152186 157573 163621 169437 175046 181189 187696 193208 196858 199170 200779
53928 200779 201232 199768 196617 192861 189419 186611 184354 182416 180747 179695 179603 180232 181122 182469 184953
53913A84953L698M182M161M398M959N338N389N448N764O350P028P210O336M874
53899B60088M007L940L584K424J434J197O52j100k971l454k897k579k440j652
53885B60233p81j334l280m941n437n606o234o900o962o537o057n704n538n495
53871A89427n207m511l916l874l899l300k467k348k948l363l226l007l004l026
53857A41331l084l441l916m018l708l309k810k012j175p04n02l48n85j479k321
53842A07919k151j195n35o28j066j495j739j355j97Q17N86o22j507j431p93l2
53826I4576O23O77j32r95q84m2N23O46R00J097M52p89j438j104n67k16L85J202
53808I4914J488J195J200J735J885J288R01J447K222K312K015K234L136M136M714
$$ plain form
53913 184953 188651 192833 196994 201392 206351 211689 217078 222526 228290 234640 241668 248878 255214 260088
53899 260088 264095 268035 271619 274043 275477 276674 277326 276226 273255 269801 266904 264325 261885 260233
53885 260233 259452 258118 254838 249897 244460 238854 232620 225720 218758 212221 206164 200460 194922 189427
53871 189427 184220 179709 175793 171919 168020 164720 162253 159905 156957 153594 150368 147361 144357 141331
53857 141331 138247 134806 130890 126872 123164 119855 117045 115033 113858 113154 112652 112304 111719 110240 107919
53842 107919 105768 104573 104038 103410 102344 100849 99110 97755 97558 98375 98961 98339 96832 95401 94608 94576
53826 94576 95199 95876 95744 94749 93865 93823 94346 94992 95892 96989 97441 96652 95214 94110 93543 93327 93712 94914
53808 94914 96402 97597 98797 100532 102417 103705 104606 106053 108275 110587 112602 114836 117972 122108 126822
53793A26822M697M247L905M135M620M564L845L178L018L086L128L281L457L210
53779A79193K547K044J862J468O29q4j25K79N19J67r66k577l664l393k341j921
53763A73637k498k982k592j845j419j142p42o35j112j530j157l09Q7k98j041j720
53747A52702k121k060j584j219j555k484l140k727j357q5P8p18j290q54K9L65
53731A31980O8j65l4J11l0m37j021j493j282l34M34L01n2M28J318J236M3r11p88
53712A29372j34M26R48J293Q89m9l18N84J617J773J402J281J303J001N98O37J081
53695A43704J590K157K889L538L848L929L846L263K012O39j15k1O64J579K325
53680A75847K569K406K277K393K593K817L157L443L271K605J748Q40o7n48k84
$$ plain form
53793 126822 131519 135766 139671 143806 148426 152990 156835 160013 163031 166117 169245 172526 175983 179193
53779 179193 181740 183784 185646 187114 187743 187659 187534 187813 188332 188499 187533 184956 181292 177899 175558 173637
53763 173637 171139 168157 165565 163720 162301 161159 160417 159782 158670 157140 155983 155674 155761 155463 154422 152702
53747 152702 150581 148521 146937 145718 144163 141679 138539 135812 134455 134370 134448 133730 132440 131586 131615 131980
53731 131980 132048 131883 131849 131960 131930 131493 130472 128979 127697 127363 127797 128098 128046 128474 129792 131028 131071 130160 129372
53712 129372 129238 129664 130612 131905 132794 132745 132427 133011 134628 136401 137803 139084 140387 141388 141986 142623 143704
53695 143704 145294 147451 150340 153878 157726 161655 165501 168764 170776 171415 171300 171279 171943 173522 175847
53680 175847 178416 180822 183099 185492 188085 190902 194059 197502 200773 203378 205126 205966 205899 205351 205067
53665B05067J66k0o37q14o18j009k030k482j823j084j223j747j737j205o57k08
53649A87939R7j14q42j347j120n15O0P15J280J078J61k29N73J469J184J44m31
53632A90102m31n26n83J24J418K262K216J814J548J475J696K254K579K058J191
53617B09197J200K334L375L203K132J299J243J505J452J095J050J730K742L313
53603B36870L268L226L688M433M998N267N267M856M044L319L177L538L972M140
53589B94063L872L168K496K607L640M737M926M133L066K392K349K718K926K577
53575C39670K081K199K808K866J992J233J548K340K408J775J481J831J968J274
53561C67474K97m2M42J148J438J164O86M70O44R88J319J646J881J806J487J319
$$ plain form
53665 205067 205233 205213 204576 203762 203144 202135 200105 197623 195800 194716 193493 191746 190009 188804 188147 187939
53649 187939 188036 187922 187080 185733 184613 184098 184158 184873 186153 187231 187392 187163 187736 189205 190389 190533 190102
53632 190102 189671 189145 188562 188686 190104 192366 194582 196396 197944 199419 201115 203369 205948 208006 209197
53617 209197 210397 212731 216106 219309 221441 222740 223983 225488 226940 228035 229085 230815 233557 236870
53603 236870 240138 243364 247052 251485 256483 261750 267017 271873 275917 279236 282413 285951 289923 294063
53589 294063 297935 301103 303599 306206 309846 314583 319509 323642 326708 329100 331449 334167 337093 339670
53575 339670 341751 343950 346758 349624 351616 352849 354397 356737 359145 360920 362401 364232 366200 367474
53561 367474 367771 367729 368171 369319 370757 371921 372607 373077 373721 374709 376028 377674 379555 381361 382848 384167
53545C84167J456J544J292Q92P03Q64J433K408L310L372K558J862K159L153M005
53530D15178M503M995N537N810N741N654N746N897N970N957N930O009O365P071
53516D96363Q089R376J0749J1653J1616J1057J1069J2100J3353J3884J3817J3953
53504F37079J4568J5170J5336J5305J5706J6880J8512J9933K0812K1404K1930
53493H32635K2088K1605K1019K1127K1849K2328K2129K1526K0772K0004J9866
53482A066948K0954K2491K2733K1168J9211J8252J8132J8066J7954J7990J7989
53471A281888J7930J8306J9070J9194J8087J6583J5582J4606J2850J0857R839
53460A454792R772R418Q003N863L714K041J007K27j093l150n188o742q475j0878
$$ plain form
53545 384167 385623 387167 388459 389351 390054 390918 392351 394759 398069 401441 403999 405861 408020 411173 415178
53530 415178 419681 424676 430213 436023 441764 447418 453164 459061 465031 470988 476918 482927 489292 496363
53516 496363 504452 513828 524577 536230 547846 558903 569972 582072 595425 609309 623126 637079
53504 637079 651647 666817 682153 697458 713164 730044 748556 768489 789301 810705 832635
53493 832635 854723 876328 897347 918474 940323 962651 984780 1006306 1027078 1047082 1066948
53482 1066948 1087902 1110393 1133126 1154294 1173505 1191757 1209889 1227955 1245909 1263899 1281888
53471 1281888 1299818 1318124 1337194 1356388 1374475 1391058 1406640 1421246 1434096 1444953 1454792
53460 1454792 1464564 1473982 1481985 1487848 1491562 1493603 1494610 1494837 1493744 1490594 1485406 1478664 1470189 1459311
53446A459311j3001j3680j3488j4041j5652j7063j7440j7406j7850j8845j9943
53435A280902k0773k1066k0784k0325k0132k0173k0275k0601k1076k0728j8652
53424A056317j5442j2724j1221j0195q858p391o290n566m910m150l259k319j515
53411I62477q10L03K190M265N513N875O485Q277J0856J3053J4342J5345J6943
53398A065114J9046K0576K0870K0772K1763K4104K6661K8653L0532L2813L5023
53387A345927L6583L7857L9433M1097M2360M3447M4832M6337M7572M8743N0109
53376A824297N1185N1469N1456N1878N2331N1828N0335M8687M7172M5405M3389
53365B369432M1581L9829L7349L3835K9750K5496K1152J6961J3220R701N839J535
$$ plain form
53446 1459311 1446310 1432630 1419142 1405101 1389449 1372386 1354946 1337540 1319690 1300845 1280902
53435 1280902 1260129 1239063 1218279 1197954 1177822 1157649 1137374 1116773 1095697 1074969 1056317
53424 1056317 1040875 1028151 1016930 1006735 997877 990486 984196 978630 973720 969570 966311 963992 962477
53411 962477 961667 961970 964160 968425 973938 979813 986298 994575 1005431 1018484 1032826 1048171 1065114
53398 1065114 1084160 1104736 1125606 1146378 1168141 1192245 1218906 1247559 1278091 1310904 1345927
53387 1345927 1382510 1420367 1459800 1500897 1543257 1586704 1631536 1677873 1725445 1774188 1824297
53376 1824297 1875482 1926951 1978407 2030285 2082616 2134444 2184779 2233466 2280638 2326043 2369432
53365 2369432 2411013 2450842 2488191 2522026 2551776 2577272 2598424 2615385 2628605 2638306 2644145 2645680
53353B645680k954p596j2382j6864k0702k4253k7756l0479l1807l2685l4598l7450
53341B366154l9815m1123m2051m2897m3101m2674m2455m2591m2182m0857l9504
53330A906904l8861l8595l8273l8047l7811l6887l5171l3560l2525l1299k9191
53319A516684k6821k5127k4021k2782k1149j9228j6980j4550j2706j2137j2608
53308A308575j3333j3866j4149j4101j3603j2694j1415r773q041o687n796m957
53296A180160l898k683j279M49K154L167L529M192N802P886R604J0784J1749J2749
53282A244365J3908J5323J6851J8236J9612K1356K3270K4499K4594K4049K3568
53271A469631K3342K3281K3230K2673K0992J8461J6292J5164J4336J2718J0213
$$ plain form
53353 2645680 2642726 2635130 2622748 2605884 2585182 2560929 2533173 2502694 2470887 2438202 2403604 2366154
53341 2366154 2326339 2285216 2243165 2200268 2157167 2114493 2072038 2029447 1987265 1946408 1906904
53330 1906904 1868043 1829448 1791175 1753128 1715317 1678430 1643259 1609699 1577174 1545875 1516684
53319 1516684 1489863 1464736 1440715 1417933 1396784 1377556 1360576 1346026 1333320 1321183 1308575
53308 1308575 1295242 1281376 1267227 1253126 1239523 1226829 1215414 1205641 1197600 1190913 1185117 1180160
53296 1180160 1176262 1173579 1172300 1172749 1174903 1178070 1181599 1185791 1191593 1199479 1209083 1219867 1231616 1244365
53282 1244365 1258273 1273596 1290447 1308683 1328295 1349651 1372921 1397420 1422014 1446063 1469631
53271 1469631 1492973 1516254 1539484 1562157 1583149 1601610 1617902 1633066 1647402 1660120 1670333
53260A670333P493M986K776R78m08j750l331m953o354p712r345j1189j3025j4819
53246A613680j6492j7745j8596j9611k1152k2686k3458k3493k3447k3638k3760
53235A379602k3492k2904k2257k1733k1396k1174k0902k0560k0375k0553k0944
53224A143312k1132k0725j9652j8278j7275j7072j7398j7559j7206j6574j5967
53213I44474j5332j4467j3431j2633j2564j3343j4473j5227j5462j5680j6067
53202G85795j6026j5197j4361j4477j5183j5293j4578j3960j3893j3746j3095
53191F25986j2514j2566j2818j2541j1763j1078j0903j1380j2419j3450j3653
53180D90901j2975j2412j2755j3479j3419j2260j0788r853r600r623r508r168
$$ plain form
53260 1670333 1677826 1682812 1685588 1686566 1686158 1684408 1681077 1676124 1669770 1662058 1652713 1641524 1628499 1613680
53246 1613680 1597188 1579443 1560847 1541236 1520084 1497398 1473940 1450447 1427000 1403362 1379602
53235 1379602 1356110 1333206 1310949 1289216 1267820 1246646 1225744 1205184 1184809 1164256 1143312
53224 1143312 1122180 1101455 1081803 1063525 1046250 1029178 1011780 994221 977015 960441 944474
53213 944474 929142 914675 901244 888611 876047 862704 848231 833004 817542 801862 785795
53202 785795 769769 754572 740211 725734 710551 695258 680680 666720 652827 639081 625986
53191 625986 613472 600906 588088 575547 563784 552706 541803 530423 518004 504554 490901
53180 490901 477926 465514 452759 439280 425861 413601 402813 392960 383360 373737 364229 355061
53168C55061q740q232p363o013m732m361n037n958o238n700m799m116l969m222
53154B75581m458m535m767n285n501m857l735k906k337j457m44j71p57j229r36
53139B32206l57j36k18l24m97o81n38j33q1n27o03M03J911K708K381J548R31O91
53121B38684N67L11J9l9m2p55k503m274m621l508k344k145k586l035l479l958
53105B06292m049l553l052l122l467l407k848k273k110k406k858l014k717k370
53091A65046k332k242j558n85j25k19k33j37n52j401j712j151n48n17o27m93n89
53074A50025j278k042k288k140j842j262n13j61l24m21k61l69p61o23J37L41o33
53057A35585j724j856j522j582j592p31N21J000O12J38j68n80q79n35L04R29R44
$$ plain form
53168 355061 346321 338089 330726 324713 319981 315620 310583 304625 298387 292687 287888 283772 279803 275581
53154 275581 271123 266588 261821 256536 251035 246178 242443 239537 237200 235743 235299 235128 234371 233142 232206
53139 232206 231849 231713 231495 231171 230674 229993 229455 229322 229241 228714 228111 228514 230425 233133 235514 237062 237993 238684
53121 238684 239251 239562 239581 239542 239500 238745 236242 231968 227347 223839 221495 219350 216764 213729 210250 206292
53105 206292 202243 198690 195638 192516 189049 185642 182794 180521 178411 176005 173147 170133 167416 165046
53091 165046 162714 160472 158914 158329 158204 157985 157752 157615 157063 155662 153950 152799 152251 151734 151107 150614 150025
53074 150025 148747 146705 144417 142277 140435 139173 138660 138499 138175 137754 137493 137124 136363 135740 135877 136218 135585
53057 135585 133861 132005 130483 128901 127309 126578 127099 128099 128711 128849 128681 128101 127222 126687 126991 127920 128864
53040A28864M11m58j114q30K51R72P65M91Q69J149M85m48n05O9K93K01M05N43
53022A32413j20r81p68K96O81m4o43k93K99K63j64k83O4N56Q23O41K01R8N09O82
53002A34230Q6m73N0J166J453O98J30M64J056J189R48N72J9m63l40L59R87J311
52984A43442J692K151K235K032K291L179L870L804L490L539L680L271K266J121
52970A82063K15l06m01k08n5j85o30j229j642j513r79o88r34j153p72j09K14J92
52952A71880Q1k93r82j188l18O99N03n25p10L65J235Q60p6n87q32j244j380o24
52934A66864O25J351J136M28o4P6O98J058N40m28o83K13J392J762J257O77O71
52917A77573J138J398R18L9k50L84J017P73K31N37J480J695P41k77l88R9M87O07
$$ plain form
53040 128864 129275 128817 127703 126873 127124 128096 128861 129352 130221 131370 131855 131407 130902 130971 131264 131465 131870 132413
53022 132413 132293 131312 130544 130840 131521 131477 130834 130541 130840 131103 130939 130656 130720 131276 132099 132740 132941 133039 133548 134230
53002 134230 134316 133843 133893 135059 136512 137210 137340 137804 138860 140049 140997 141569 141588 141125 140785 141144 142131 143442
52984 143442 145134 147285 149520 151552 153843 157022 160892 164696 168186 171725 175405 178676 180942 182063
52970 182063 182278 181972 181571 181363 181308 181123 180493 179264 177622 176109 175130 174442 173508 172355 171583 171474 171688 171880
52952 171880 171961 171668 170686 169498 169180 169879 170382 169857 169147 169512 170747 171607 171531 170944 170112 168868 167488 166864
52934 166864 167489 168840 169976 170404 170340 170416 171114 172172 172712 172284 171601 171814 173206 174968 176225 176902 177573
52917 177573 178711 180109 181027 181066 180816 181200 182217 182990 183221 183758 185238 186933 187674 187397 187009 187108 187595 188202
52899A88202M55j16q20r19l04K26K47L99J186J953J805R15J78j3J03L60Q08J303
52881A95968J504J263P28J83l5K83R88J686K106K144J617M74p96j482j375p77
52865B04479J22J249K166K337K005J978K431K707K515K482L079L813L937L445
52851B38745K829K296J699R46K23q9L03J123J464P56l56p55l57j26o06j380k026
52834B44689k661l274l468l228l043k990k565j796j486j834j882j026j94n94j963
52819B12685l064l344l238l105k846k428k030j654j147o14l79n40r12j299j558
52804A84527j548j208p03k59kK9j61m59p43r48r91q21p22j202k133k535j864j043
52786A67214j285k274k660k159j823k164k365j822j094p35l65L69Q47M42m05q18
$$ plain form
52899 188202 188657 188541 187721 186802 186498 186724 186971 187370 188556 190509 192314 193229 193407 193394 193497 193857 194665 195968
52881 195968 197472 198735 199463 199646 199611 199894 200882 202568 204674 206818 208435 208909 208113 206631 205256 204479
52865 204479 204601 205850 208016 210353 212358 214336 216767 219474 221989 224471 227550 231363 235300 238745
52851 238745 241574 243870 245569 246515 246738 246649 246952 248075 249539 250295 249939 249184 248827 248701 248095 246715 244689
52834 244689 242028 238754 235286 232058 229015 226025 223460 221664 220178 218344 216462 215436 215242 214648 212685
52819 212685 209621 206277 203039 199934 197088 194660 192630 190976 189829 189215 188836 188296 187384 186085 184527
52804 184527 182979 181771 181068 180809 180807 180836 180675 180216 179473 178525 177534 176713 175991 174789 172656 170121 168257 167214
52786 167214 165929 163655 160995 158836 157013 154849 152484 150662 149568 148833 148468 148837 149684 150126 149721 148903
52770A48903o74m43m23p02j306j901j921j480j406j933k220j704j008q19p93m77
52754A29693l68r98j710j627j253j772l090l819l282k258j619j245o52M1K23m65
52738A05799j681k552k392j416n83m74p45q45q03p44l00P67J760J759R00J95J41
52721I8786L49M85O76Q58N24m58j325j272m76J50J76J72Q57J979K486J891J009
52704A06867R63J786K514K491J846Q13n97k047k806k607k031j690j589j511j496
52689A00906j501j263r04j018j715k181j779r95p29j034j242r42k76M62R65R09
52673H7663K53o06j254j645j827j709j316q91n13j28Mm53j077r19N5P69O32L73
52655G7411O05O80o2q69o42K59N55k9o02p28q87j323j521j076k88L79P88R25P74
$$ plain form
52770 148903 148229 147786 147363 146661 145355 143454 141533 140053 138647 136714 134494 132790 131782 130963 130170 129693
52754 129693 129325 128327 126617 124990 123737 121965 118875 115056 111774 109516 107897 106652 106000 106041 106264 105799
52738 105799 104118 101566 99174 97758 97175 96701 95956 95111 94308 93564 93264 94031 95791 97550 98450 98645 98786
52721 98786 99135 99620 100296 101154 101678 101220 99895 98623 98147 98297 98473 98645 99502 101481 103967 105858 106867
52704 106867 107830 109616 112130 114621 116467 117280 116683 114636 111830 109223 107192 105502 103913 102402 100906
52689 100906 99405 98142 97238 96220 94505 92324 90545 89550 88821 87787 86545 85603 85327 85789 86754 87663
52673 87663 87916 87310 86056 84411 82584 80875 79559 78668 78155 78027 78031 77578 76501 75582 75637 76406 77038 77411
52655 77411 78016 78696 78634 77765 77123 77382 77937 77908 77306 76578 75691 74368 72847 71771 71483 71862 72650 73575 74349
52636G4349N28N31Q08J044R92P21N09O21J051J344R98J01p75j377j876k126j650
52619G5793o39o5k67l90J58O32K20n15n04K06Q06J086J340J396Q95K11LJ41J23
52600H0630J85Q68J760J855J108L86Q1j70l72l7O91R45M66K7K13O16O66M68N02
52581I0888R46J572J915J549O20o4J7L13P2l50N0J305K331K471K167K011J966
52564A09779J811J595J407J283J446K051K645K545J784J074Q23R14J271J879K241
52549A34548J746O35j49k63k29l39j84M52J086J258J108R27P33N56N58O73N85
52532A43701K78O5N4Q5J98N47Q36N42j99o33m05L3J52j20o13j037r37j91N47N81
52512A43484K25K90O61M27n69j388j360q06j69M96R50P39O5k23R7L27P9j82j97
$$ plain form
52636 74349 74877 75408 76216 77260 78252 78973 79482 80103 81154 82498 83496 83597 82822 81445 79569 77443 75793
52619 75793 75154 75089 74822 74432 74590 75222 75442 74927 74423 74629 75435 76521 77861 79257 80152 80363 80366 80507 80630
52600 80630 80815 81683 83443 85298 86406 86792 86873 86703 86331 86294 86985 87930 88396 88423 88636 89252 89918 90386 90888
52581 90888 91834 93406 95321 96870 97490 97426 97443 97756 97828 97478 97528 98833 101164 103635 105802 107813 109779
52564 109779 111590 113185 114592 115875 117321 119372 122017 124562 126346 127420 128243 129157 130428 132307 134548
52549 134548 136294 136929 136780 136517 136288 135949 135765 136217 137303 138561 139669 140596 141329 141885 142443 143116 143701
52532 143701 143979 144044 144098 144183 144381 144928 145764 146306 146107 145474 145069 145102 145254 145134 144521 143484 142547 142356 142903 143484
52512 143484 143709 143999 144660 145087 144518 143130 141770 140964 140795 141291 142241 142980 143045 142822 142919 143246 143325 143143 142946
52493A42946m19r40j023l25L54L01l9L3L23L92N30J194K017K300K026J632J145
52476A52447L52n33j054j126r30m84J54O31P71Q86J193J366J175J026J293J603
52460A58770J420R09N15J89k56m71j12L05O4m69j94J078K248K394J810J322J231
52443A70753J301J234Q16q8j228j960j922j565j593j931j840j141p47j463k588
52428A56038k657j494n83r77j807j714r10o57j182j423q45j61o2l52p12j230j731
52411A37541j568o70Q4N8k99l94l77n11m78o9J86j37m54l5Q03J212J065Q76Q12
52392A37645O46M29M53P09J025J445J866J691O28m57l83Q32K057K444K012J061
52376A54103j01q48o27K91J095J527J927K255J964J092N47Q99J581J784J599J646
$$ plain form
52493 142946 142527 141587 140564 140239 140593 140894 140855 140888 141211 141603 142133 143327 145344 147644 149670 151302 152447
52476 152447 152799 152266 151212 150086 149156 148672 148826 149457 150228 151114 152307 153673 154848 155874 157167 158770
52460 158770 160190 161099 161614 161803 161547 161076 160964 161269 161333 160864 160670 161748 163996 166390 168200 169522 170753
52443 170753 172054 173288 174104 174016 172788 170828 168906 167341 165748 163817 161977 160836 160089 158626 156038
52428 156038 153381 151887 151304 150327 148520 146806 145896 145239 144057 142634 141789 141628 141566 141214 140502 139272 137541
52411 137541 135973 135303 135387 135445 135146 134752 134375 133864 133386 133317 133503 133366 132912 132877 133680 134892 135957 136833 137645
52392 137645 138291 138720 139173 139882 140907 142352 144218 145909 146537 146080 145697 146529 148586 151030 153042 154103
52376 154103 154002 153154 152527 152818 153913 155440 157367 159622 161586 162678 163225 164124 165705 167489 169088 170734
52360A70734K057K386K344K115J991K046K192K278K180J955J893K236K838L286
52346B02531L308L022K755K669K636K429K013J577J285J101Q32L45k38n20r8R69
52330B26616K050K487K315K157K410K831L058L152L351L534L372K920K669K884
52316B65806L161K937K299J956K354L134L645L765L841M058M417N237O866Q765
52302C22241R680R218Q422Q232Q261P903P825R010J0879J1926J2018J2512J3915
52289D52042J5099J5304J5396J6300J7432J7724J7240J6739J6417J6122J6190
52278F32005J6975J7933J8153J7521J6609J5754J4994J4547J4469J4146J2975
52267H06081J1368J0265R840R498Q970Q544Q257P652O549N304M260L441K889K681
$$ plain form
52360 170734 172791 175177 177521 179636 181627 183673 185865 188143 190323 192278 194171 196407 199245 202531
52346 202531 205839 208861 211616 214285 216921 219350 221363 222940 224225 225326 226158 226503 226265 225745 225647 226616
52330 226616 228666 231153 233468 235625 238035 240866 243924 247076 250427 253961 257333 260253 262922 265806
52316 265806 268967 271904 274203 276159 278513 281647 285292 289057 292898 296956 301373 306610 313476 322241
52302 322241 331921 341139 349561 357793 366054 373957 381782 390792 401671 413597 425615 438127 452042
52289 452042 467141 482445 497841 514141 531573 549297 566537 583276 599693 615815 632005
52278 632005 648980 666913 685066 702587 719196 734950 749944 764491 778960 793106 806081
52267 806081 817449 827714 837554 847052 856022 864566 872823 880475 887024 892328 896588 900029 902918 905599
52253I05599K542J995J043J81l85r86j783k288j993j133m61l47l48K27J400K378
52237I05641K480K065K249L566N362O672P311P889Q968J0564J2212J3268J3436
52224A001683J3058J2698J2395J1828J1227J1312J2037J2212J1068R403Q431Q051
52212A135403P251N746M187K903J533o7j447k369l238m453n848o989p728q278
52198A116606r024j0165j1297j1613j0910j0062r959j0308j0171r410q679q174
52186I96834p385o204n323n129n054m459l570l043l028l133l017k643k207k030
52172I40609k295k752k984l014l259l766m058l861l563l574l724l676l505l491
52158H93087l621l762m090m823n672o009n647m972m301l565k739k166k129k391
$$ plain form
52253 905599 908141 910136 911179 911360 910975 909989 908206 905918 903925 902792 902331 901984 901636 901863 903263 905641
52237 905641 908121 910186 912435 916001 921363 928035 935346 943235 952203 962767 974979 988247 1001683
52224 1001683 1014741 1027439 1039834 1051662 1062889 1074201 1086238 1098450 1109518 1118921 1127352 1135403
52212 1135403 1142654 1148400 1152587 1155490 1157023 1156956 1155509 1153140 1149902 1145449 1139601 1132612 1124884 1116606
52198 1116606 1107582 1097417 1086120 1074507 1063597 1053535 1043576 1033268 1023097 1013687 1005008 996834
52186 996834 989449 983245 977922 972793 967739 963280 959710 956667 953639 950506 947489 944846 942639 940609
52172 940609 938314 935562 932578 929564 926305 922539 918481 914620 911057 907483 903759 900083 896578 893087
52158 893087 889466 885704 881614 876791 871119 865110 859463 854491 850190 846625 843886 841720 839591 837200
52144H37200k548k627k937l428l713l788m108m745m963m205k997k266j989j451
52130G91435o46n08j530l019m104m682m900m550l634k981l355m287m579l852k861
52115G41947k400k543k957l368l545l255k416j147K96J486K017K007K082K632
52101G30836L345L881M496N519O634P363P939Q907J0101J0856J1206J1995J3718
52088H36796J5926J7952J9578K0806K1553K1886K2106K2321K2333K2115K2006
52077A065378K2197K2349K1933K0708J8872J6898J5298J4266J3476J2464J1091
52066A254930R417P376N063L095K071J633P50j035l152m934o338p460q039p911
52052A245466p585p792q552r138q928q064p202o783o619o227n470m738m392m297
$$ plain form
52144 837200 834652 832025 829088 825660 821947 818159 814051 809306 804343 800138 797141 794875 792886 791435
52130 791435 790789 790281 788751 785732 781628 776946 772046 767496 763862 760881 757526 753239 748660 744808 741947
52115 741947 739547 737004 734047 730679 727134 723879 721463 720316 720612 722098 724115 726122 728204 730836
52101 730836 734181 738062 742558 748077 754711 762074 770013 778920 789021 799877 811083 823078 836796
52088 836796 852722 870674 890252 911058 932611 954497 976603 998924 1021257 1043372 1065378
52077 1065378 1087575 1109924 1131857 1152565 1171437 1188335 1203633 1217899 1231375 1243839 1254930
52066 1254930 1264347 1271723 1276786 1279881 1281952 1283585 1284335 1283300 1280148 1275214 1268876 1261416 1253377 1245466
52052 1245466 1237881 1230089 1221537 1212399 1203471 1195407 1188205 1181422 1174803 1168576 1163106 1158368 1153976 1149679
52038A149679m088l688l249k719j861o84M81J398K179L053M083N108N889O320
52024A161901O586O937P191O788N574M278L798M254N033N557N551M837L376J500
52010A233161k69j627k475k774k832l443n206p733j0070j1728j2933j4045j5278
51997A142748j6860j8830k0740k2078k2953k3777k4500k4743k4647k4800k5268
51986H93552k5486k5253k5129k5571k6273k6701k6722k6375k5554k4293k3052
51975F13143k2235k1631k0629j8926j6899j5332j4803j5166j5606j5364j4374
51964D22178j3058j1753j0579r607q809q002p203o767o798o745o144n383n087
51951C16243n064m671l987l634l553k981j843j134j510k372k818k807k847l028
$$ plain form
52038 1149679 1145591 1141903 1138654 1135935 1134074 1133390 1133871 1135269 1137448 1140501 1144584 1149692 1155581 1161901
52024 1161901 1168487 1175424 1182615 1189403 1194977 1199255 1203053 1207307 1212340 1217897 1223448 1228285 1231661 1233161
52010 1233161 1232892 1231265 1228790 1226016 1223184 1219741 1214535 1206802 1196732 1185004 1172071 1158026 1142748
51997 1142748 1125888 1107058 1086318 1064240 1041287 1017510 993010 968267 943620 918820 893552
51986 893552 868066 842813 817684 792113 765840 739139 712417 686042 660488 636195 613143
51975 613143 590908 569277 548648 529722 512823 497491 482688 467522 451916 436552 422178
51964 422178 409120 397367 386788 377181 368372 360370 353167 346400 339602 332857 326713 321330 316243
51951 316243 311179 306508 302521 298887 295334 292353 290510 289376 287866 285494 282676 279869 277022 273994
51937B73994l005k597j992j459j147j047j003r24q66q12n82l31p44k087l390l419
51921B48589k297j199o18K4R42J416J007K87k38r04k020k991l076k427j676j087
51905B33732o95p18j157j497j405j283j525j743j406p74m60m48k89rl5l97p07
51888B19184q22q95q29l68K54L51l26j176j435r94m19k30l33j86M48J088J130
51871B14442P26N70Q61J014O51K24L29Q22J113R56N56J88J12N15J138J250M60
51854B25927o86j265r70j54Q31J794K459K573K283K019J924J745J289Q32Q62J488
51838B42951K127J926O53q23j315n84M53Q43N74K65L19O18Q36Q02O28O42R94J402
51820B53311J507J422J518J713J564J044P03Q62J232J456J477J184L47p68j394
$$ plain form
51937 273994 270989 268392 266400 264941 263794 262747 261744 260820 259954 259142 258560 258229 257485 255398 252008 248589
51921 248589 246292 245093 244475 244499 245441 246857 247864 248151 247913 247009 244989 241998 238922 236495 234819 233732
51905 233732 233037 232319 231162 229665 228260 226977 225452 223709 222303 221529 221069 220621 220332 220323 220288 219891 219184
51888 219184 218362 217467 216638 216270 216524 216875 216549 215373 213938 212944 212525 212295 211962 211776 212224 213312 214442
51871 214442 215168 215738 216599 217613 218264 218488 218817 219639 220752 221708 222264 222452 222564 223079 224217 225467 225927
51854 225927 225241 223976 223006 222852 223683 225477 227936 230509 232792 234811 236735 238480 239769 240601 241463 242951
51838 242951 245078 247004 247657 246834 245519 244935 245388 246231 246805 247070 247389 248007 248843 249645 250273 250915 251909 253311
51820 253311 254818 256240 257758 259471 261035 262079 262782 263644 264876 266332 267809 268993 269340 268572 267178
51805B67178j204o91k77L13J240J862J534O59J56K41M39M85N11M69J49k73l15
51788B72476R8M57L67J1j45P4M72P75R53J117J180Q18K5n61l58K59M00n2l05Q2
51768B78143N82O34L84J24k27o28o56k93k85j001j606j197j51M97N97Q30J387
51751B77134J706J495J157J114J360J728K065K081J650J208J327J829J898J105
51737B98857m7p30o64k48j06m48q16n78J78N96J48o37r12o29l23j55K49J010J647
51718B96392J575O14q90k201k580j948j052p01r81j508k077k685l088k997k572
51703B73301k309k376k451k209j663j083p64q63j288j774k163k411k361j915j411
51688B46260j372j725j813j322o01J79J431L306N161O406P187P588O898M523J193
$$ plain form
51805 267178 265974 265283 265006 265319 266559 268421 269955 270614 270770 271011 271450 271935 272446 272915 273064 272791 272476
51788 272476 272574 273031 273398 273409 273264 273338 273810 274585 275538 276655 277835 278653 278678 278117 277759 278018 278418 278366 278061 278143
51768 278143 278725 279359 279743 279867 279640 279012 278356 278063 277778 276777 275171 273974 273823 274320 274917 275747 277134
51751 277134 278840 280335 281492 282606 283966 285694 287759 289840 291490 292698 294025 295854 297752 298857
51737 298857 298810 298080 297416 297168 297062 296614 295798 295220 295398 295994 296142 295505 294593 293964 293641 293486 293735 294745 296392
51718 296392 297967 298581 297691 295490 292910 290962 289910 289209 288228 286720 284643 281958 278870 275873 273301
51703 273301 270992 268616 266165 263956 262293 261210 260446 259583 258295 256521 254358 251947 249586 247671 246260
51688 246260 244888 243163 241350 240028 239427 239606 241037 244343 249504 255910 263097 270685 277583 282106 283299
51673B83299j627l212l774l622k950k211j775j420q36l89o45j284j285j89J443
51658B59523K713L017K277J136N94Q64R10j91j850k730k593k398k824l643m390
51643B50415m776m479l495k649k813l600l784l082k460k570k845k560j899j436
51629B07967j249j035p23n27o25r66j205r09j55L02j10r21j218q59m24j65J91
51612A97369O53P96N11K11J66K56M45Q46J209J089N44J00j9k8L8L61P35O89K40
51593B06211j61l55m84k90O53K031K962L234L481M020M384M225L852L564L299
51578B40626L139L368L810L899L601L430L379K825J680O21m1o72j175q25K09M87
51562B68361o74j930j722m86J36l56r70q25m0R34J830K452K640K508K359K419
$$ plain form
51673 283299 281672 278460 274686 271064 268114 265903 264128 262708 261872 261483 260838 259554 258269 258080 259523
51658 259523 262236 265253 267530 268666 269260 270124 271034 270843 268993 266263 263670 261272 258448 254805 250415
51643 250415 245639 241160 237665 235016 232203 228603 224819 221737 219277 216707 213862 211302 209403 207967
51629 207967 206718 205683 204960 204433 203808 202842 201637 200728 200573 200875 200765 199844 198626 197767 197343 197178 197369
51612 197369 198022 198818 199329 199540 199706 199962 200407 201253 202462 203551 204095 204195 204176 204148 204186 204547 205282 205971 206211
51593 206211 206050 205695 205211 204921 205574 207605 210567 213801 217282 221302 225686 229911 233763 237327 240626
51578 240626 243765 247133 250943 254842 258443 261873 265252 268077 269757 270378 270337 269665 268490 267665 267874 268361
51562 268361 267687 265757 264035 263549 263685 263329 262359 261534 261494 262428 264258 266710 269350 271858 274217 276636
51546B76636K870L764M706N075M847M628M561L914K303N83k71n23j013j627j486
51531C08967m81M78Q08R45J441K065K164J570Q09N59R59J441J334P17L60O45R75
51514C25756O11k73q88r52r33j300k025k780l336l632l793l993m143l863k989
51499B91467j930j257j095j208j460j850k233k425k468k517k484k216j897j903
51485B64524k184k147j360j52O84P41L51R5O9j06o02r92p25K00J301K185K699
51468B64581K725K241J620J451J950K754L277L141K383J542J384K125L156L820
51454B98150M138M280L795K282N45p4M60P12j68j296j394m85M00N64Q9n92j040
51437C10366j064r22r99j167r97o41p82j466j927j868k004k788l524l553l431
$$ plain form
51546 276636 279506 283270 287976 293051 297898 302526 307087 311001 313304 313887 313616 313093 312080 310453 308967
51531 308967 308486 308964 309772 310717 312158 314223 316387 317957 318766 319325 320284 321725 323059 323776 324136 324781 325756
51514 325756 326367 326094 325206 324254 323321 322021 319996 317216 313880 310248 306455 302462 298319 294456 291467
51499 291467 289537 288280 287185 285977 284517 282667 280434 278009 275541 273024 270540 268324 266427 264524
51485 264524 262340 260193 258833 258681 259365 260106 260457 260552 260621 260515 259913 258921 258196 258396 259697 261882 264581
51468 264581 267306 269547 271167 272618 274568 277322 280599 283740 286123 287665 289049 291174 294330 298150
51454 298150 302288 306568 310363 312645 313190 313116 313576 314288 314120 312824 311430 310945 311345 311909 311998 311406 310366
51437 310366 309302 308380 307381 306214 305217 304576 303794 302328 300401 298533 296529 293741 290217 286664 283233
51422B83233m011m934n181m698m388m638m879m611m016l388k683j910j451j586
51408B30859j940j726n47J076K119K070J343O20K1n47o60J36J257J575J081R44
51392B37681J525J589K17j597k366k202k373l318m344m913n115n017m547l993
51378B01227l784l850l839l807l944l867l066j865j103r55r48j012j579k554l093
51363A61961k725j981j632j896k545l293l741l495k580j512q04n69n70m15J35
51348A34338P48P25m2o83m88ok46j065j326n67M29Q47O99K78l09p27l43Q53J894
51329A35009J964J366R51R92J144J194J246J353J460J645K044K529K803K802K829
51314A61331L120L487L426K635J408M80L73Q74J219P86l98j768k725l014k757
$$ plain form
51422 283233 279222 274288 269107 264409 260021 255383 250504 245893 241877 238489 235806 233896 232445 230859
51408 230859 228919 227193 226646 227722 229841 231911 233254 233874 233895 233348 232688 232824 234081 235656 236737 237681
51392 237681 239206 240795 241012 239415 237049 234847 232474 229156 224812 219899 214784 209767 205220 201227
51378 201227 197443 193593 189754 185947 182003 178136 175070 173205 172102 171147 170199 169187 167608 165054 161961
51363 161961 159236 157255 155623 153727 151182 147889 144148 140653 138073 136561 135757 135188 134618 134203 134338
51348 134338 135086 135811 135769 135086 134598 134592 134346 133281 131955 131388 131817 132664 133363 133641 133332 132605 132262 133115 135009
51329 135009 136973 138339 139290 140282 141426 142620 143866 145219 146679 148324 150368 152897 155700 158502 161331
51314 161331 164451 167938 171364 173999 175407 175887 176260 177134 178353 179139 178741 176973 174248 171234 168477
51299A68477k255j825j741k129k783l280l432l442l452l196k498j764j479j418
51285A33783j071o10n92p82l39O42R52Q5r02r98o76q29j185r81m31l47o81o86
51267A24352k54O1K03O38J275J383P14k05r40j461j516o95O32J320Q08k19p65
51250A25331n84n7L70L60j53p95j051q88o24l24K00P78R23N96K80K43K88K64J49
51231A25306l19j312k095j538K43J619J332mq82q17n41o81r39o08N41J933K636
51214A23874K182J031J22n6K35N39O71O49N65O21R21J171R72M24R2K00L52J80
51196A34745j43k07J00N94R98J047O82K27J51M94Q32Q78P78P60Q04P99P74Q25
51178A45138R16Q94N77o5p34r86p59m63l69k74l7L0k97o08n24l52m66m81R0P24
$$ plain form
51299 168477 166222 164397 162656 160527 157744 154464 151032 147590 144138 140942 138444 136680 135201 133783
51285 133783 132712 132102 131510 130728 130389 131031 131983 132068 131166 130168 129492 128663 127478 126497 126066 125719 125038 124352
51267 124352 124098 124159 124362 125000 126275 127658 128372 128167 127227 125766 124250 123555 124187 125507 126315 126096 125331
51250 125331 124747 124690 125060 125420 125267 124472 123421 122533 121909 121585 121785 122563 123486 124082 124362 124605 124893 125157 125306
51231 125306 124987 123675 121580 120042 120285 121904 123236 123232 122350 121533 120992 120311 119372 118764 119305 121238 123874
51214 123874 126056 127087 127209 127153 127388 127927 128598 129247 129812 130433 131354 132525 133497 133921 134013 134213 134565 134745
51196 134745 134602 134395 134495 135089 136087 137134 137816 138043 138194 138688 139520 140398 141176 141936 142740 143539 144313 145138
51178 145138 146054 146948 147525 147460 146726 145740 144981 144518 144149 143875 143838 143868 143571 142963 142439 142087 141621 141140 141230 141954
51158A41954N43k27n94n08r05j919k451j937j276j283j391p20L31O18j39j115
51142A28981j438q74K22J099J075K65m33m15n0P4L8K24O01R22J216J528J533R94
51124A35562K96j0O9J63J22l9m74j165j588j307o78l62l57j92Q3j15q92j530j348
51105A26238m40O50J494J818J423M57m01m41L59J270J519J041M98M87Q88J080
51089A37940Q28O39J068J925K428K087J208M82K94M36M52Q5n14r69r84n65l3K14
51071A47021J44K23R22J954K434J929J051O54P50O72P9n92o92j0J031J625J258
51054A60453L84J12Q49J667J533P24L19O08R86J134J355J664J557R71N85Q22J256
51037A76979J339J107Q65P88J032J633K082J658M99l89m62k32k92m18j53M27R83
$$ plain form
51158 141954 142497 142270 141676 141168 140263 138344 135893 133956 132680 131397 130006 129286 129617 130235 130096 128981
51142 128981 127543 126669 126891 127990 129065 129330 128897 128482 128432 128506 128544 128768 129369 130291 131507 133035 134568 135562
51124 135562 135858 135848 135917 136080 136202 136163 135689 134524 132936 131629 130951 130589 130232 130040 130123 130008 129116 127586 126238
51105 126238 125798 126448 127942 129760 131183 131640 131239 130798 131157 132427 133946 134987 135485 135972 136860 137940
51089 137940 138768 139407 140475 142400 144828 146915 148123 148605 148899 149335 149787 149872 149358 148389 147405 146840 146807 147021
51071 147021 147165 147388 148310 150264 152698 154627 155678 156332 157082 157754 157833 157241 156549 156539 157570 159195 160453
51054 160453 160837 160949 161798 163465 164998 165722 166041 166649 167635 168769 170124 171788 173345 174316 174901 175723 176979
51037 176979 178318 179425 180290 181078 182110 183743 185825 187483 187982 187593 187131 186899 186607 186189 186036 186463 187446
51020A87446J379J458R42M3m94l49n6J3K69R81J435R39K5j79N90J690K607L228
51002B01967L372K916K264J944J877J677J495J868K812L802M599N424O296O859
50988B49172P024P187P661Q321Q965R583J0174J0601J0899J1357J2199J3321J4468
50975C80932J5551J6797J8665K1445K4769K7705K9678L1267L3647L7359M1842
50964F79657M6249N0311N4227N8027O1355O3887O5671O6875O7430O7062O5618
50953A346369O2967N8771N2835M5854L9113L3119K7147K0630J4292R026M388o09
50941A713902n546q888j0082j0103r716q678p095o081o332p242q239r871j2686
50928A603343j6113j9522k3478k8675l4416l9388m3401m7117n0515n2978n4632
$$ plain form
51020 187446 188825 190283 191225 191268 190774 190425 190369 190382 190651 191632 193067 194006 194031 193852 194442 196132 198739 201967
51002 201967 205339 208255 210519 212463 214340 216017 217512 219380 222192 225994 230593 236017 242313 249172
50988 249172 256196 263383 271044 279365 288330 297913 308087 318688 329587 340944 353143 366464 380932
50975 380932 396483 413280 431945 453390 478159 505864 535542 566809 600456 637815 679657
50964 679657 725906 776217 830444 888471 949826 1013713 1079384 1146259 1213689 1280751 1346369
50953 1346369 1409336 1468107 1520942 1566796 1605909 1639028 1666175 1686805 1701097 1710123 1714511 1713902
50941 1713902 1708356 1699468 1689386 1679283 1669567 1660889 1653794 1647713 1641381 1634139 1625900 1616029 1603343
50928 1603343 1587230 1567708 1544230 1515555 1481139 1441751 1398350 1351233 1300718 1247740 1193108
50917A193108n6209n7583n7636n5811n2826m9654m6534m3230l9604l5707l1887
50906F66427k8725k6437k4407k1902j9098j6710j4809j2801j0519q437o746n114
50894D70722l546k615k485k455j948j372j450k037k185j243M90K181L271L770
50880D59098L936L934L905M173N031O265P283P917Q608R664J0779J1587J2318
50867E54498J3415J4833J6127J7081J7914J9066K0982K3772K6965L0024L3181
50856G87858L7118M1709M6071N0228N5608O3097P1593P9558Q7161R5644J05141
50845A520786J14476J22887J30593J37742J43975J49023J52731J54312J52569
50836B779094J46925J37554J24658J08499R0056P0645N1011L1603J3492k097j5043
$$ plain form
50917 1193108 1136899 1079316 1021680 965869 913043 863389 816855 773625 734021 698314 666427
50906 666427 637702 611265 586858 564956 545858 529148 514339 501538 491019 482582 475836 470722
50894 470722 467176 464561 462076 459621 457673 456301 454851 452814 450629 449386 449876 452057 455328 459098
50880 459098 463034 466968 470873 475046 480077 486342 493625 501542 510150 519814 530593 542180 554498
50867 554498 567913 582746 598873 615954 633868 652934 673916 697688 724653 754677 787858
50856 787858 824976 866685 912756 962984 1018592 1081689 1153282 1232840 1320001 1415645 1520786
50845 1520786 1635262 1758149 1888742 2026484 2170459 2319482 2472213 2626525 2779094
50836 2779094 2926019 3063573 3188231 3296730 3386786 3457431 3508442 3540045 3553537 3551440 3536397
50825C536397k5881l4200l8721l9095l6288l1114k3754j5187p575k551k37o12
50813C281182m563j2708k4091l7120n0989o5385p9485r2353j03833j14201j23139
50802B573315j29814j33698j34728j32963j28720j22769j15881j08275r9900r0970
50792A375597q1872p2892o4381n6817n0319m4436l8760l3355k8241k3089j7885
50781H63550j3473j0685r259q189o956n853n301n342n710n927n502m405l352l146
50767G70450l824m713n224n296n095m693m185l841l874m032l612k172k06J258
50753G20941J982K972N188Q240J1023J3301J5663J8070J9647K0122K0393K1190
50741H78732K2111K2644K3243K4678K6977K9748L2982L6804M0947M5286N0402
$$ plain form
50825 3536397 3510516 3476316 3437595 3398500 3362212 3331098 3307344 3292157 3284582 3282031 3281794 3281182
50813 3281182 3276619 3263911 3239820 3202700 3151711 3086326 3006841 2914488 2810655 2696454 2573315
50802 2573315 2443501 2309803 2175075 2042112 1913392 1790623 1674742 1566467 1466567 1375597
50792 1375597 1293725 1220833 1156452 1099635 1049316 1004880 966120 932765 904524 881435 863550
50781 863550 850077 839392 830133 821944 814988 809135 803834 798492 792782 786855 781353 776948 773596 770450
50767 770450 766626 761913 756689 751393 746298 741605 737420 733579 729705 725673 722061 719889 719683 720941
50753 720941 722923 725895 731083 739323 750346 763647 779310 797380 817027 837149 857542 878732
50741 878732 900843 923487 946730 971408 998385 1028133 1061115 1097919 1138866 1184152 1234554
50730A234554N6748O3644O9941P5438Q0742Q5818Q9711R1660R1718R0038Q6334
50719B116346Q0357P2304O2427N0645L6926K1756O063r099k2640l3502m0978m4978
50707B295627m5934m4429m0916l5719k9281k2367j5818j0093n359k019p83k092
50695B040817n823j1822k0268l1073m3213n5100o5389p3156p7775p9278p8645
50684A499275p6994p4540p0876o6095o0949n5830n0396m4392l8256l2567k7428
50673I00952k2776j8734j5284j1890q048l935j20L233O385R420J2133J4486J6650
50660H82472J8458J9342J9109J8434J8247J8791J9586K0183K0605K1137K2025
50649A098389K3436K5332K7310K8860K9950L1120L2789L4731L6406L7590L8464
$$ plain form
50730 1234554 1291302 1354946 1424887 1500325 1581067 1666885 1756596 1848256 1939974 2030012 2116346
50719 2116346 2196703 2269007 2331434 2382079 2419005 2440761 2446824 2437725 2415085 2381583 2340605 2295627
50707 2295627 2249693 2205264 2164348 2128629 2099348 2076981 2061163 2051070 2045711 2043692 2042909 2040817
50695 2040817 2034994 2023172 2002904 1971831 1928618 1873518 1808129 1734973 1657198 1577920 1499275
50684 1499275 1422281 1347741 1276865 1210770 1149821 1093991 1043595 999203 960947 928380 900952
50673 900952 878176 859442 844158 832268 824220 820285 820165 823398 829783 839203 851336 865822 882472
50660 882472 900930 920272 939381 957815 976062 994853 1014439 1034622 1055227 1076364 1098389
50649 1098389 1121825 1147157 1174467 1203327 1233277 1264397 1297186 1331917 1368323 1405913 1444377
50638A444377L9238M0019M0923M2033M3202M4083M4390M4030M2990M1279L8861
50627A905425L5531L0977K5225J8920J2881P356J945l676r202j3903j7118j8437
50615A975924j7714j5290j2050q929o107k900J273N928R811J2110J2979J2845
50603A967880J1730R690P293M960K040k677r565j7898k6842l5882m4350n1479
50591A814900n7140o1661o4776o5789o5046o4058o3506o2337n9492n5492n1377
50580A144226m7249m3028l9551l7440l5556l2284k7866k3901k0870j7762j4094
50569H04625j0605p855n566l594k093o15J582M101N785O757Q502J1388J3807J4590
50555H40809J4859J6309J8887K1316K3040K4459K5911K7523K9603L2280L4996
$$ plain form
50638 1444377 1483615 1523634 1564557 1606590 1649792 1693875 1738265 1782295 1825285 1866564 1905425
50627 1905425 1940956 1971933 1997158 2016078 2028959 2036315 2038260 2034584 2025382 2011479 1994361 1975924
50615 1975924 1958210 1942920 1930870 1921941 1915834 1912934 1914207 1920135 1929946 1942056 1955035 1967880
50603 1967880 1979610 1989300 1996593 2001553 2003593 2000916 1991351 1973453 1946611 1910729 1866379 1814900
50591 1814900 1757760 1696099 1631323 1565534 1500488 1436430 1372924 1310587 1251095 1195603 1144226
50580 1144226 1096977 1053949 1014398 976958 941402 909118 881252 857351 836481 818719 804625
50569 804625 794020 786165 780599 777005 774912 774297 775879 779980 785765 792522 801024 812412 826219 840809
50555 840809 855668 871977 890864 912180 935220 959679 985590 1013113 1042716 1074996 1109992
50544A109992L7067L8399L9186L9481L9524L9812M0361M0544M0262M0470M1881
50533A546979M3902M5714M7615N0384N3809N6890N9189O1171O3359O5962O9113
50522B164087P2900P7204Q1880Q6741R1068R3768R4476R3936R2708R0102Q4966
50511C123836P6991O6521N3814L9209K3613P885p881k3830l9487n4085o7251p8629
50499C120706q7301r2391r3887r2193q7301p9207o8644n6620m3583k9779j5923
50488B373877k766R491K0430K8751L3358L4545L2915K7718J7685L264j3426l0702
50476B535140m7989o4379p8180q8397r5458r9977j01880j01182r8672r5141r0783
50465A573102q5726q0376p4778o8416o1235n4171m8130m2956l7977l3057k8543
$$ plain form
50544 1109992 1147059 1185458 1224644 1264125 1303649 1343461 1383822 1424366 1464628 1505098 1546979
50533 1546979 1590881 1636595 1684210 1734594 1788403 1845293 1904482 1965653 2029012 2094974 2164087
50522 2164087 2236987 2314191 2396071 2482812 2573880 2667648 2762124 2856060 2948768 3038870 3123836
50511 3123836 3200827 3267348 3321162 3360371 3383984 3391869 3383988 3360158 3320671 3266586 3199335 3120706
50499 3120706 3033405 2941014 2847127 2754934 2667633 2588426 2519782 2463162 2419579 2389800 2373877
50488 2373877 2371111 2380602 2401032 2429783 2463141 2497686 2530601 2558319 2576004 2579268 2565842 2535140
50476 2535140 2487151 2422772 2344592 2256195 2160737 2060760 1958880 1857698 1759026 1663885 1573102
50465 1573102 1487376 1407000 1332222 1263806 1202571 1148400 1100270 1057314 1019337 986280 957737
50454I57737k4557k0942j7667j4788j2135r402o422l259n3K954N506P527R176
50441H73675J0667J2130J3614J5038J6245J7266J8414J9952K1782K3596K5111
50430A067490K6015K6137K5969K6405K7510K8080K7180K5582K4792K4983K4957
50419A355100K3983K2569K1355K0281J9239J8659J9010K0297K2298K4821K7560
50408A595172L0212L2863L5703L8426M0541M2191M3877M5301M5441M3983M1728
50397B035438L9138L5470K9966K3139J6064Q903R20q406j8864k9899m0852n0929
50385B040088n9441o6113p0957p3939p4897p3652p0083o4339n7093m9303m1506
50374A338765l3635k5577j7576r855k355M855J1167J5760J8220J8610J7125J3833
$$ plain form
50454 957737 933180 912238 894571 879783 867648 858246 851824 848565 848512 851466 856972 864499 873675
50441 873675 884342 896472 910086 925124 941369 958635 977049 997001 1018783 1042379 1067490
50430 1067490 1093505 1119642 1145611 1172016 1199526 1227606 1254786 1280368 1305160 1330143 1355100
50419 1355100 1379083 1401652 1423007 1443288 1462527 1481186 1500196 1520493 1542791 1567612 1595172
50408 1595172 1625384 1658247 1693950 1732376 1772917 1815108 1858985 1904286 1949727 1993710 2035438
50397 2035438 2074576 2110046 2140012 2163151 2179215 2188118 2189038 2180632 2161768 2131869 2091017 2040088
50385 2040088 1980647 1914534 1843577 1769638 1694741 1621089 1551006 1486667 1429574 1380271 1338765
50374 1338765 1305130 1279553 1261977 1252122 1249767 1254622 1265789 1281549 1299769 1318379 1335504 1349337
50362A349337Q638J471p250j6314k4221l0151l4273l7127l9045m0172m0562m0107
50350A050224l8754l6878l5079l3483l1719k9634k7472k5205k2416j9266j6833
50339G33485j5794j5242j3650j0825q129o707o168n289l440r87J389L257M538
50326F56438N444O409P716R144J0159J0621J0991J1680J2487J3009J3369J4035
50314G81502J5034J5920J6532J7209J8132J8979J9476J9710J9757J9463J8855
50303I80569J8108J6936J4804J2122J0251R644Q884O514L058J56j742l487n476
50290A070341p138q118q734r163r266r387j0254j1866j3370j4231j4640j4747
50278I39427j4440j4030j4158j4706j4773j4048j3319j3290j3834j4653j5679
$$ plain form
50362 1349337 1357975 1359446 1352196 1335882 1311661 1281510 1247237 1210110 1171065 1130893 1090331 1050224
50350 1050224 1011470 974592 939513 906030 874311 844677 817205 792000 769584 750318 733485
50339 733485 717691 702449 688799 677974 669845 663138 656970 651681 648241 647254 648643 651900 656438
50326 656438 661882 668291 676007 685151 695310 705931 716922 728602 741089 754098 767467 781502
50314 781502 796536 812456 828988 846197 864329 883308 902784 922494 942251 961714 980569
50303 980569 998677 1015613 1030417 1042539 1052790 1062434 1071318 1077832 1080890 1081046 1079304 1075817 1070341
50290 1070341 1063203 1055085 1046351 1037188 1027922 1018535 1008281 996415 983045 968814 954174 939427
50278 939427 924987 910957 896799 882093 867320 853272 839953 826663 812829 798176 782497
50267G82497j6387j5860j4140j2525j1842j1344j0085q509p624p335o734n605
50255F54507m556l794k825j430q3Q30J565K496L453L971M010M106M706N463N590
50240F78009M882M039L674L510L007K310J866J501P63n4l01l35j200k917m247
50225F94507m563m679n308n926n912n721n974o288n977n244m618l872k487p86
50211F27152M26J082J673K159K041J484J480K601M231N211M956L875K897K615
50197F63883K749K680K363K279K407K066J003j38q46j468k321k935k926k969l903
50182F61924n414o537p024p370p796q154q554r136r484r180q707q841r227q632
50168E47868o687m449l016k345j661m56J140K424K545J350k07j046j357k243l993
$$ plain form
50267 782497 766110 750250 736110 723585 711743 700399 690314 681805 674181 666846 660112 654507
50255 654507 649951 646157 643332 641902 641819 642649 644214 646710 650163 654134 658144 662250 666956 672419 678009
50240 678009 682891 686930 690604 694114 697121 699431 701297 702798 703561 703507 703206 702871 701671 698754 694507
50225 694507 689944 685265 679957 674031 668119 662398 656424 650136 644159 638915 634297 630425 627938 627152
50211 627152 627578 628660 630333 632492 634533 636017 637497 640098 644329 649540 654496 658371 661268 663883
50197 663883 666632 669312 671675 673954 676361 678427 679430 679292 678446 676978 674657 671722 668796 665827 661924
50182 661924 656510 649973 642949 635579 627783 619629 611075 601939 592455 583275 574568 565727 556500 547868
50168 547868 541181 536732 533716 531371 529710 529254 530394 532818 535363 536713 536506 535460 534103 531860 527867
50153E27867n566o016n610n156m920m747m701m929n141m846m065l358l086l001
50139D62725k654k018j521j498j831k230k570k753k383j070Q43K310K582J954
50125D49886J328J334K045L225M503N441N766N490M811M046L586L631L926M100
50111E03118M170M288M154L337K161J457J367J232Q45Q02J244J356O76r8k94l00
50095E29515n92o62O3J036J442J594K335L617M809N803O703O992O376N934O959
50080E81924Q913J0077J0098J0301J1411J2545J2913J2934J3120J3152J2842J2899
50068G23129J3865J5047J5379J4777J3929J3188J2344J1228J0079R288Q918Q479
50056H69650P409O031N507O278P059O373M640L584L716L928L601L490M037M354
$$ plain form
50153 527867 522301 516285 510675 505519 500599 495852 491151 486222 481081 476235 472170 468812 465726 462725
50139 462725 460071 458053 456532 455034 453203 450973 448403 445650 443267 442197 443040 445350 447932 449886
50125 449886 451214 452548 454593 457818 462321 467762 473528 479018 483829 487875 491461 495092 499018 503118
50111 503118 507288 511576 515730 519067 521228 522685 524052 525284 526129 526931 528175 529531 530207 530109 529815 529515
50095 529515 528923 528261 528324 529360 530802 532396 534731 538348 543157 548960 555663 562655 569031 574965 581924
50080 581924 590837 600914 611012 621313 632724 645269 658182 671116 684236 697388 710230 723129
50068 723129 736994 752041 767420 782197 796126 809314 821658 832886 842965 852253 861171 869650
50056 869650 877059 883090 888597 894875 901934 908307 912947 916531 920247 924175 927776 931266 935303 939657
50042I39657L718K852K653K700K109J102N58N81N27J86o1J5L14Q08J443J884J935
50025I62981K006K663L981N856Q431J1567J4296J5708J6182J6917J8224J9060
50013A097872J8324J6041J3084J0281P961O109M759M285N143P125R166J0296J0571
50000A221017J0599J0311Q784N273o6o574j3612k0488k6307l0386l2820l4328
49988A091403l5489l6214l6087l5096l3769l2493l0962k8738k6195k4336k3480
49977G48544k2704k1020j8746j7018j6233j5584j4276j2561j1219j0364r387p966
49965E71466o581n750n188m323l349l141l929m845n112n040n186n140m178k760
49951E06944k275l137m253m635m591m697m556l485j916j196k066l990n835o668
$$ plain form
50042 939657 943375 946227 948880 951580 953689 954791 955349 955930 956457 956643 956582 956597 956911 957719 959162 961046 962981
50025 962981 964987 967650 971631 977487 985918 997485 1011781 1027489 1043671 1060588 1078812 1097872
50013 1097872 1116196 1132237 1145321 1155602 1163563 1169672 1174431 1178716 1183859 1190984 1200150 1210446 1221017
50000 1221017 1231616 1241927 1250711 1255984 1255918 1249344 1235732 1215244 1188937 1158551 1125731 1091403
49988 1091403 1055914 1019700 983613 948517 914748 882255 851293 822555 796360 772024 748544
49977 748544 725840 704820 686074 669056 652823 637239 622963 610402 599183 588819 579432 571466
49965 571466 564885 559135 553947 549624 546275 543134 539205 534360 529248 524208 519022 513882 509704 506944
49951 506944 504669 501532 497279 492644 488053 483356 478800 475315 473399 472203 470137 466147 460312 453644
49937D53644o069m356k524j464j088n64N89J990K948L176K850K334K031K270L095
49922D58862M256N425O381O961P057O787O558O810P581Q496R270J0172J1735J3983
49908E70334J6270J8099J9775K1916K4610K7493L0399L3302L5708L6945L7094
49897H71945L6887L6449L4938L1944K8470K5797K3991K2348K0967K0830K2229
49886A176795K4007K4630K3398K0383J5755R741K854m335j1561j8686k5167l0218
49874A207596l3583l5854l7740l9215l9766l9383l8826l8650l8372l7061l4594
49863G94552l1839k9590k7857k6299k4805k3361k1750j9838j7923j6393j5114
49852E39783j3539j1435r142p171n791n056m911n065m992m415l721l665m523n691
$$ plain form
49937 453644 447575 443219 440695 439231 438143 437579 438168 440158 443106 446282 449132 451466 453497 455767 458862
49922 458862 463118 468543 474924 481885 488942 495729 502287 509097 516678 525174 534444 544616 556351 570334
49908 570334 586604 604703 624478 646394 671004 698497 728896 762198 797906 834851 871945
49897 871945 908832 945281 980219 1012163 1040633 1066430 1090421 1112769 1133736 1154566 1176795
49886 1176795 1200802 1225432 1248830 1269213 1284968 1294709 1297563 1293228 1281667 1262981 1237814 1207596
49874 1207596 1174013 1138159 1100419 1061204 1021438 982055 943229 904579 866207 829146 794552
49863 794552 762713 733123 705266 678967 654162 630801 609051 589213 571290 554897 539783
49852 539783 526244 514809 505667 498496 492705 487649 482738 477673 472681 468266 464545 460880 456357 450666
49838D50666o308o166n763n543n414n148m833m673m586m319l905l597l468l301
49824C83642k976k593k237j744r12K49J432K225K438K276K048J768J284Q13R25
49809C88638J730K583K913K859K765K567K299K608L911N410N897N318M561L940
49795D37999L077K251K530M155N935O832P192P787Q560R134R815J1150J2949J4638
49781E44004J6324J8739K2197K6119K9441L1196L0941K9024K6174K2728J8646
49770H15533J4409J1120R252Q070O935O426P276Q899J0012J0330J0429J0014P614
49757I36319K287n177j3024j9926k5283k8939l1027l1874l1771l0922k9521k7600
49745F63542k4949k1665j8528j6309j4812j3220j1303r565q188o728n076l852
$$ plain form
49838 450666 444358 438192 432429 426886 421472 416324 411491 406818 402232 397913 394008 390411 386943 383642
49824 383642 380666 378073 375836 374092 373180 373429 374861 377086 379524 381800 383848 385616 386900 387713 388638
49809 388638 390368 392951 395864 398723 401488 404055 406354 408962 412873 418283 424180 429498 434059 437999
49795 437999 441076 443327 445857 450012 455947 462779 469971 477758 486318 495452 505267 516417 529366 544004
49781 544004 560328 579067 601264 627383 656824 688020 718961 747985 774159 796887 815533
49770 815533 829942 841062 850314 858384 865319 871745 879021 887920 897932 908262 918691 928705 936319
49757 936319 938606 933429 920405 900479 875196 846257 815230 783356 751585 720663 691142 663542
49745 663542 638593 616928 598400 582091 567279 554059 542756 533191 525003 518275 513199 509347
49733E09347l372k903j659j9R10P39J40j10J07N15Q89J072R06L96j55m19l68k32
49715E05784j80j26J30O37J180J456J311Q84M33R7j96m69n21j12N73R21O08Q2
49697E12492P4P23J482J905K057K171K312K523K865L086K759J987J540J877K418
49682E42271K294J577J148J556K484L296L612L343K659J993J613J169J18j326
49668E67807k191j944j159o67n17k76J1q6m40l25M16Q62J81j047j399l34J294
49651E60186K434K853K784K248J273L11j91l70o30r46j008q26o05k97J14J58m45
49634E67043q41J72K294L775L658K927K855L170K792J658Q04R02J624K343K711
49619E97887K649K344K241K583L049L262L398L819M354M552M466M569M955N300
$$ plain form
49733 509347 505975 503072 501413 501394 502304 503043 503183 503073 503180 503695 504584 505656 506562 506958 506803 506384 506016 505784
49715 505784 505604 505478 505608 506245 507425 508881 510192 511076 511509 511606 511410 510941 510420 510308 510881 511802 512410 512492
49697 512492 512566 513289 514771 516676 518733 520904 523216 525739 528604 531690 534449 536436 537976 539853 542271
49682 542271 544565 546142 547290 548846 551330 554626 558238 561581 564240 566233 567846 569015 569133 567807
49668 567807 565616 563672 562513 561846 561329 561053 561064 560978 560538 560213 560629 561491 561672 560625 559226 558892 560186
49651 560186 562620 565473 568257 570505 571778 572089 571898 571528 570898 569952 568944 568118 567513 567216 567330 567488 567043
49634 567043 566202 566374 568668 572443 576101 579028 581883 585053 587845 589503 590307 591209 592833 595176 597887
49619 597887 600536 602880 605121 607704 610753 614015 617413 621232 625586 630138 634604 639173 644128 649428
49605F49428N618O412P863R369J0220J0395J0461J0858J1507J2044J2377J2870
49593G69422J3859J5143J6263J7269J8597K0062K0781K0530K0517K1976K4551
$$ plain form
49605 649428 655046 661458 669321 678690 688910 699305 709766 720624 732131 744175 756552 769422
49593 769422 783281 798424 814687 831956 850553 870615 891396 911926 932443 954419 978970
$$ [...]
##END NTUPLES=NMR SPECTRUM
##END=
