
##TITLE=AC1302_PERAH12114_6608382_PZ89wDSsjw
##JCAMPDX= 6.0         $$ Bruker NMR JCAMP-DX V2.0
##DATA TYPE= NMR SPECTRUM
##DATA CLASS= NTUPLES
##ORIGIN= BRUKER
##OWNER= Administrator
$$ 1.72 TOPSPIN		Version 2.1
$$ 2012-08-15 18:20:26.906 -0500  Administrator@TOPSPIN
$$ Compression mode = diff/dup
##.OBSERVE FREQUENCY= 400.02188249412
##.OBSERVE NUCLEUS= ^1H
##.ACQUISITION MODE= SIMULTANEOUS (DQD)
##.ACQUISITION SCHEME= undefined
##.AVERAGES= 8
##.DIGITISER RES= 22
##SPECTROMETER/DATA SYSTEM= spect
##.PULSE SEQUENCE= zg30
##.SOLVENT NAME= COFFEE_meoh
##.SHIFT REFERENCE= INTERNAL, COFFEE_meoh, 1, 14.98509
##AUDIT TRAIL= $$ (NUMBER, WHEN, WHO, WHERE, PROCESS, VERSION, WHAT)
$$ ##TITLE= Audit trail, TOPSPIN		Version 2.1
$$ ##JCAMPDX= 5.01
$$ ##ORIGIN= Bruker BioSpin GmbH
$$ ##OWNER= Administrator
$$ $$ C:\Bruker\TOPSPIN/data/COFFEE/nmr/AC1302_PERAH12114_6608382_PZ89wDSsjw/50/pdata/1/auditp.txt
$$ ##AUDIT TRAIL=  $$ (NUMBER, WHEN, WHO, WHERE, PROCESS, VERSION, WHAT)
(   1,<2012-08-15 17:57:02.234 -0500>,<Administrator>,<TOPSPIN>,<go>,<TOPSPIN 2.1>,
      <created by zg
	started at 2012-08-15 17:55:44.000 -0500,
	POWCHK enabled, PULCHK disabled,
       configuration hash MD5:
       6B 1B 68 BB D9 2E 58 E2 7F 35 AD 54 07 DF 0E 41
       data hash MD5: 64K
       34 AE 19 80 FD 8B 1C 5F 12 89 22 12 80 73 57 11>)
(   2,<2012-08-15 17:57:19.765 -0500>,<Administrator>,<TOPSPIN>,<audit>,<TOPSPIN 2.1>,
      <user comment:
       ICON-NMR User ID: COFFEE
       data hash MD5: 64K
       34 AE 19 80 FD 8B 1C 5F 12 89 22 12 80 73 57 11>)
(   3,<2012-08-15 18:20:19.593 -0500>,<Administrator>,<TOPSPIN>,<proc1d>,<TOPSPIN 2.1>,
      <Start of raw data processing
       efp LB = 0 FT_mod = 6 PKNL = 1 PHC0 = 0 PHC1 = 0 SI = 32K 
       data hash MD5: 32K
       17 37 9E 61 81 AF 39 31 DD 3A 86 7C 92 5E B9 D3>)
(   4,<2012-08-15 18:20:20.250 -0500>,<Administrator>,<TOPSPIN>,<proc1d>,<TOPSPIN 2.1>,
      <pk PHC0 = 180 PHC1 = 0 
       data hash MD5: 32K
       96 74 E7 8F B9 BB 19 A7 2B 03 CA 6E 92 77 24 4A>)
(   5,<2012-08-15 18:20:20.640 -0500>,<Administrator>,<TOPSPIN>,<proc1d>,<TOPSPIN 2.1>,
      <abs ABSG = 1 
       data hash MD5: 32K
       54 89 93 83 D2 2D 03 1B 43 C6 DF DA 21 DD B1 0F>)
(   6,<2012-08-15 18:20:20.984 -0500>,<Administrator>,<TOPSPIN>,<proc1d>,<TOPSPIN 2.1>,
      <abs ABSG = 2 
       data hash MD5: 32K
       5F 6A 30 00 FE A8 D9 D4 45 C1 5F A9 63 89 72 B9>)
(   7,<2012-08-15 18:20:21.328 -0500>,<Administrator>,<TOPSPIN>,<proc1d>,<TOPSPIN 2.1>,
      <abs ABSG = 3 
       data hash MD5: 32K
       41 72 FC 21 EF 97 2C 3F 3A 45 24 0F 8C F3 81 B2>)
(   8,<2012-08-15 18:20:21.671 -0500>,<Administrator>,<TOPSPIN>,<proc1d>,<TOPSPIN 2.1>,
      <abs ABSG = 4 
       data hash MD5: 32K
       F9 78 EB 02 EC F3 8B 0C 5E 12 C9 B3 05 91 F6 5F>)
(   9,<2012-08-15 18:20:22.015 -0500>,<Administrator>,<TOPSPIN>,<proc1d>,<TOPSPIN 2.1>,
      <abs ABSG = 5 
       data hash MD5: 32K
       DE B4 C3 72 9A 5E EC A7 64 4A 6D 9F 1C 84 45 45>)
$$ ##END=
$$ [...]
##$TP= (0..7)
150 150 150 150 150 150 150 150
##$TP07= 0
##$TPNAME0= <>
##$TPNAME1= <>
##$TPNAME2= <>
##$TPNAME3= <>
##$TPNAME4= <>
##$TPNAME5= <>
##$TPNAME6= <>
##$TPNAME7= <>
##$TPOAL= (0..7)
0.5 0.5 0.5 0.5 0.5 0.5 0.5 0.5
##$TPOFFS= (0..7)
0 0 0 0 0 0 0 0
##$TUNHIN= 0
##$TUNHOUT= 0
##$TUNXOUT= 0
##$USERA1= <user>
##$USERA2= <user>
##$USERA3= <user>
##$USERA4= <user>
##$USERA5= <user>
##$V9= 5
##$VALIST= <valist>
##$VCLIST= <CCCCCCCCCCCCCCC>
##$VD= 0
##$VDLIST= <DDDDDDDDDDDDDDD>
##$VPLIST= <PPPPPPPPPPPPPPP>
##$VTLIST= <TTTTTTTTTTTTTTT>
##$WBST= 1024
##$WBSW= 4
##$XGAIN= (0..3)
0 0 0 0
##$XL= 0
##$YL= 0
##$YMAX_a= 503869
##$YMIN_a= -653603
##$ZGOPTNS= <>
##$ZL1= 120
##$ZL2= 120
##$ZL3= 120
##$ZL4= 120
##$ABSF1= 14.98509
##$ABSF2= -5.573092
##$ABSG= 5
##$ABSL= 3
##$ALPHA= 0
##$AQORDER= 0
##$ASSFAC= 0
##$ASSFACI= 0
##$ASSFACX= 0
##$ASSWID= 0
##$AUNMP= <proc_prof1d_extract_pilot.lims>
##$AXLEFT= 0
##$AXNAME= <>
##$AXNUC= <1H>
##$AXRIGHT= 0
##$AXTYPE= 0
##$AXUNIT= <>
##$AZFE= 0.1
##$AZFW= 0.1
##$BCFW= 0
##$BC_mod= 0
##$BYTORDP= 0
##$COROFFS= 0
##$CY= 15
##$DATMOD= 1
##$DC= 0
##$DFILT= <>
##$DTYPP= 0
##$F1P= 0
##$F2P= 0
##$FCOR= 0.5
##$FTSIZE= 32768
##$FT_mod= 6
##$GAMMA= 0
##$GB= 0
##$INTBC= 1
##$INTSCL= 1
##$ISEN= 128
##$LB= 0
##$LEV0= 0
##$LPBIN= 0
##$MAXI= 10000
##$MC2= 0
##$MEAN= 0
##$ME_mod= 0
##$MI= 0
##$NCOEF= 0
##$NC_proc= -8
##$NLEV= 6
##$NOISF1= 0
##$NOISF2= 0
##$NSP= 0
##$NTH_PI= 0
##$NZP= 0
##$OFFSET= 14.98509
##$PC= 1
##$PHC0= 180
##$PHC1= 0
##$PH_mod= 1
##$PKNL= yes
##$PPARMOD= 0
##$PPDIAG= 0
##$PPIPTYP= 0
##$PPMPNUM= 2147483647
##$PPRESOL= 1
##$PSCAL= 4
##$PSIGN= 0
##$PYNMP= <proc.py>
##$REVERSE= no
##$SF= 400.02
##$SI= 32768
##$SIGF1= 0
##$SIGF2= 0
##$SINO= 400
##$SIOLD= 32768
##$SPECTYP= <>
##$SREGLST= <1H.CDCl3>
##$SSB= 0
##$STSI= 32768
##$STSR= 0
##$SW_p= 8223.68421052631
##$SYMM= 0
##$S_DEV= 0
##$TDeff= 65536
##$TDoff= 0
##$TI= <>
##$TILT= no
##$TM1= 0
##$TM2= 0
##$TOPLEV= 0
##$USERP1= <user>
##$USERP2= <user>
##$USERP3= <user>
##$USERP4= <user>
##$USERP5= <user>
##$WDW= 1
##$XDIM= 32768
##$YMAX_p= 455287142
##$YMIN_p= -720808
##$CURPLOT= <Network HP LaserJet P1505>
##$CURPRIN= <$Network HP LaserJet P1505>
##$DFORMAT= <normdp>
##$LAYOUT= <+/1D_H.xwp>
##$LFORMAT= <normlp>
##$PFORMAT= <normpl>
##$SURQMSG= 1
$$ End of Bruker specific parameters
$$ ---------------------------------
##NTUPLES= NMR SPECTRUM
##VAR_NAME=  FREQUENCY,     SPECTRUM/REAL,   SPECTRUM/IMAG
##SYMBOL=    X,             R,               I
##VAR_TYPE=  INDEPENDENT,   DEPENDENT,       DEPENDENT
##VAR_FORM=  AFFN,          ASDF,            ASDF
##VAR_DIM=   32768,         32768,           32768
##UNITS=     HZ,            ARBITRARY UNITS, ARBITRARY UNITS
##FACTOR=    0.250966925370066, 1,           1
##FIRST=     8223.43324360094, -111409,      113272
##LAST=      0,             51241,           -55107
##MIN=       0,             -720808,         0
##MAX=       8223.43324360094, 455287142,    0
$$ Real data points
##PAGE= N=1
##DATA TABLE= (X++(R..R)), XYDATA
$$ [...]
19528e11191e7629k88241A27392a13278k62866D0349J00629C8470a30936K191
19518a28745B33617A12614c46429J42047c7238E8623d840k07013g6275n1249A34046
19506A184a62375A40765E0454j674J70323b40593C3477P6775R8292a17779B33561
19494a16489H7292c3935k34975L9152b0726k07165E1013K06846q7000N614o4812
19483A11661N1798b07360a7439G0809j3252a41385l2230g3725C3873a36977c378
19471C5469a13754A79974K0370b0700j75415B01537a23573B86738A13735a80273
19460D767e3032A47992b18462A29062D3244b09424C03K20397b38002q3610o8534
19449c90146b0155j54105h5625j16322e5076K663j4023L13q890J6188j1741C7065
$$ plain form
19528 -511191 -57629 -345870 127392 -113278 -376144 40349 140978 38470 -130936 -128745
19518 -128745 233617 112614 -346429 -204382 -37238 58623 -4840 -211853 -76275 -127524 134046
19506 1184 -162375 140765 50454 48780 219103 -240593 33477 110252 208544 -117779 233561
19494 -116489 87292 -33935 -268910 -229758 -20726 -227891 51013 257859 170859 176473 111661
19483 111661 163459 -207360 -17439 70809 57557 -141385 -173615 -73725 33873 -136977 -3378
19471 35469 -113754 179974 200344 -20700 -196115 201537 -123573 286738 113735 -180273
19460 4767 -53032 147992 -218462 129062 43244 -209424 303 220700 -238002 -321612 -390146
19449 -390146 -20155 -174260 -85625 -201947 -55076 -52413 -66436 -66123 -75013 -58825 -70566 37065
19436a8330B50929C1160b66368E5962a89565O5047o8189D8058a03169j16566K4755
19425a94980j16932H1500a38386b6371B16920b85802J16109A27249b16891iH0045
19413a92809i5425A02389c17685B0184d6171o3073F7750Q7194d328B94116b30042
19401d68056a10810r2690A06194b65552p5589A4929a72032M8819k27972a47684
19390A54574M0803C7051f7125r5437f5757r6885N1360j16824i1785a401l29421
19379c30822m0339d8737A28061a34027j02726O8268C8931b73000C8881e8067l6100
19368i4167m35158i0245j51519A12118e1891D5249a39728j79546G3075J7628a34978
19356b64263J11512F2153b10024A02934L07981I2798a8823A331D33J69291D1132
$$ plain form
19436 -18330 250929 31160 -266368 55962 -189565 -124518 -192707 48058 -103169 -219735 -194980
19425 -194980 -311912 81500 -138386 -26371 216920 -285802 -169693 127249 -216891 -9 80045
19413 -192809 -95425 102389 -317685 20184 -46171 -109244 67750 154944 -4328 294116 -230042
19401 -468056 -110810 -203500 106194 -265552 -341141 14929 -172032 -123213 -351185 -147684
19390 154574 195377 37051 -67125 -162562 -65757 -162642 -111282 -228106 -91785 -1401 -330822
19379 -330822 -371161 -48737 128061 -134027 -236753 -168485 38931 -273000 38881 -58067 -94167
19368 -94167 -529325 -90245 -241764 112118 -51891 45249 -139728 -319274 73075 90703 -134978
19356 -264263 -152751 62153 -210024 102934 410915 92798 -18823 1331 433 169724 41132
19344a16283J2878C6322a27560B17340c37421A12892i0277j48892k7826A76031
19333b67430B69482E6784F240a97965i6390k47948I4446J26968f0069j00650C37440
19321b15131r8464A10299c01902B7917b85181C92406b46949f8505a5342j39255
19311a54597A23589K8216J8714c24994G4644a79614o7343k54659D6677J6183a93737
19299f1597B0800a71096k80407K07358I8110J24848J12465j11544r6051a81826
19288F4115a36712l20506J87076P8641C02585a94659I3270Q921Q8495c72653A32446
19276g8046k42217A8363e1898j80983J14512k6815B35595b03623O4971A3694c7326
19264g1157l4035A93494b32972N8382N0439I1812l8833a65220B2510a18156j6409
$$ plain form
19344 -116283 -103405 36322 -127560 217340 -337421 112892 -90277 -239169 -266995 176031
19333 -267430 269482 56784 6240 -197965 -96390 -344338 94446 221414 -60069 -160719 337440
19321 -215131 -313595 110299 -301902 27917 -285181 392406 -246949 -68505 -15342 -154597
19311 -154597 123589 151805 170519 -324994 74644 -179614 -246957 -501616 46677 62860 -193737
19299 -61597 20800 -171096 -451503 -244145 98110 222958 335423 223879 127828 -181826
19288 64115 -136712 -457218 -270142 -191501 302585 -194659 93270 102191 190686 -372653 132446
19276 -78046 -320263 18363 -51898 -232881 -118369 -145184 235595 -203623 -138652 13694 -37326
19264 -71157 -105192 193494 -232972 -174590 -124151 91812 52979 -165220 22510 -118156 -134565
19253a34565A163a50792P4152L8239B33866C8564J0841J72541C1268a181j85220
19242a86401j63132A38761I941J41816a21485c6379l78807a09355M4057A51258
19231D42675c32791a39162j31613f6959a1521H7831a11474k68011f8375L3600
19221c4775B55041b0809l15279B00260c7770k26874f1322j71591g6541A10715
19210b5322l2217r7514c2461J1454f861B3473c04018i3455B22332a70423m1381
19199b11804j52398J50832A74195D4077Q860e41E0364O1915O578a856j36942o0994
19187a99792p1353G3560b62239B36977g0731c3023Q246F3009b951k88359G129
19175a24543B3061P6249B8293b03801P1299f2778B53232e1503E3379J1505J09295
$$ plain form
19253 -134565 1163 -150792 -76640 -38401 233866 38564 49405 221946 31268 -1181 -186401
19242 -186401 -349533 138761 9941 151757 -121485 -36379 -415186 -109355 -65298 151258
19231 442675 -332791 -139162 -270775 -66959 -11521 87831 -111474 -379485 -68375 -34775
19221 -34775 255041 -20809 -336088 200260 -37770 -264644 -61322 -232913 -76541 110715
19210 -25322 -57539 -155053 -32461 -21007 -6861 23473 -304018 -93455 222332 -170423 -211804
19199 -211804 -364202 -213370 174195 44077 52937 -541 50364 112279 118857 -1856 -138798 -199792
19187 -199792 -271145 73560 -262239 236977 -70731 -33023 -24777 63009 -2951 -291310 7129
19175 -124543 23061 99310 28293 -203801 -132502 -62778 253232 -51503 53379 64884 174179
19164A74179h0011B5713Q0575b16783D9308N5513h7814A41118o9617j2498J03045
19153A62048d40305c8780j77138H3571c06376n968F3873c32633g6277A05583O4800
19142A70383n2817b74686Q5967C88016a80249A79d7430B0972a75331Q6936C68697
19130a45263G7676c99821B08296a14202j81209J16863B27302a8275G342g1024
19119a98323I376a54774l8382A03810k1452P7697G7037g257j0881k49617M9635
19108b18120B51711a48241a5216F9627N6449b33260j13176C43405d2815m7024
19098h9839p532A35022e6035H5509D324b53731c4589l11583i7815B04462a58284
19086a58968j9375l3407A84517i507A45537c9641C0756R8299a4176k62784D1465
$$ plain form
19164 174179 -80011 25713 106288 -216783 49308 104821 -87814 141118 71501 59003 162048
19153 162048 -440305 -38780 -215918 83571 -306376 -312344 63873 -332633 -76277 105583 170383
19142 170383 117566 -274686 -188719 388016 -180249 179 -47430 20972 -175331 -88395 368697
19130 -145263 77676 -399821 208296 -114202 -295411 -178548 227302 -18275 7342 -71024
19119 -198323 9376 -154774 -193156 103810 82358 160055 77037 -7257 -18138 -267755 -218120
19108 -218120 251711 -148241 -15216 69627 126076 -233260 -346436 343405 -42815 -89839
19098 -89839 -97371 135022 -56035 85509 4324 -253731 -34589 -346172 -97815 204462 -158284
19086 -158968 -178343 -211750 184517 -9507 145537 -39641 30756 129055 -14176 -276960 41465
19074B6966c07906A45682h3559k39383A40733a22560M010n4947C2576a3964l59851
19063c73815j9122j7016B2250a44562p7913n4761J34884j78306k4820A72812a25940
19051a03489k34821C44412h0128A12368g9156A55787a56416K8706j30573R0398
19041a67885B53205C1608M1552l1167a17444k3351M0264l1806A40546i9033J2003
19030h7030A54666M3602C2985e2599I4158J94352j02179a42038B79054E388c9928
19018A78149A9338a79515A52203h607A05457b81402A18025d4651G4233b81301
19007a27808B58740E303g8901H3991b12515A82176a62821B13691d7923P913l7633
18996g7643j63j75114a11463D58727c69370i6218D964e1934B7867J72222a26016
$$ plain form
19074 26966 -307906 145682 -83559 -322942 140733 -122560 -118550 -173497 32576 -13964 -373815
19063 -373815 -392937 -409953 22250 -144562 -222475 -277236 -142352 -320658 -345478 172812 -125940
19051 -103489 -338310 344412 -80128 112368 -79156 155787 -156416 -127710 -258283 -167885
19041 -167885 253205 31608 73160 41993 -117444 -140795 -100531 -132337 140546 -99033 -87030
19030 -87030 154666 198268 32985 -52599 94158 288510 186331 -142038 279054 5388 -39928
19018 178149 19338 -179515 152203 -8607 105457 -281402 118025 -44651 74233 -281301
19007 -127808 258740 5303 -78901 83991 -212515 182176 -162821 213691 -47923 -40010 -77643
18996 -77643 -77806 -252920 -111463 458727 -369370 -96218 4964 -51934 27867 200089 -126016
18984b35620A75320g505A22209c62758J71313g1641C18631A46061K2619m3821
18974A24859B75P0950J16838H6886K04423p3211g2286F5409a95395j01344a00503
18962c66928j6404J29375b5270l81950a82722g0910J3950p7333j86887J53495
18952a67685g32k23089D0063L68176a52184k44743e4321G2084c81366b4200A45672
18940c30430B0775M67477A64729n1454D9616b8120k75392B7226R8617J1128j5794
18929A21177a59579E0863d7669C9678c23684a22817B66385d7533A4754L7260P050
18918E9064d44247L2478B235K28239a37888j43715D1833b0773j25917n8675r2720
18907b98085a16898A21062j9711j4044N4060b3133p9371q4637C4820J95148P2389
$$ plain form
18984 -235620 175320 -7505 122209 -362758 -191445 -71641 318631 146061 168680 124859
18974 124859 275 71225 188063 86886 291309 218098 -72286 65409 -195395 -296739 -100503
18962 -366928 -383332 -253957 -25270 -407220 -182722 -70910 -56960 -134293 -321180 -167685
18952 -167685 -732 -223821 40063 408239 -152184 -396927 -54321 72084 -381366 -24200 145672
18940 -330430 20775 488252 164729 113275 49616 -28120 -303512 27226 125843 136971 121177
18929 121177 -159579 50863 -47669 39678 -323684 -122817 266385 -47533 14754 52014 59064
18918 59064 -444247 -411769 2235 230474 -137888 -281603 41833 -20773 -146690 -205365 -298085
18907 -298085 -116898 121062 101351 87307 141367 -23133 -102504 -187141 34820 229968 302357
18896C02357o7600m9568a08978C94720e9563j71978C3793K40890b36113a03309
18885f4125k83403Q873A43348M2145a33251A36394c16507b619F0561B5808b31132
18873B28501a11172A25432a12283j08132L6205C2254d4347j69212o8490J19408
18863a62641f2110a9788A20489C5661J72894c85087a28617B87627a96583A5742
18852a88234A52098a2465A97190K2829a47597d9535j81839e7365o1636d9509j41201
18841a90710A27848J98422i5625n2761k16066f3855j67173A15458c84369e7665
18830A3257J25957d1087k0532A19159b86812A7916a19069j92206A96488O752o5209
18819A38031K9152b04489M0212N0433m3747f4827B75690l5217f6196E2213M09993
$$ plain form
18896 302357 234757 185189 -108978 394720 -59563 -231541 33793 274683 -236113 -103309
18885 -64125 -347528 -338655 143348 185493 -133251 136394 -316507 -2619 60561 25808 -231132
18873 228501 -111172 125432 -112283 -220415 -184210 32254 -44347 -213559 -282049 -162641
18863 -162641 -62110 -19788 120489 35661 208555 -385087 -128617 287627 -196583 15742
18852 -188234 152098 -12465 197190 220019 -147597 -49535 -231374 -57365 -119001 -49509 -190710
18841 -190710 127848 326270 -95625 -148386 -364452 -63855 -231028 115458 -384369 -57665
18830 13257 139214 -41087 -61619 119159 -286812 17916 -119069 -311275 196488 203240 138031
18819 138031 167183 -204489 -164277 -113844 -157591 -64827 275690 240473 -66196 52213 462206
18808D62206d971k72507a29434K6679C72137G1699R267l824i6465M4546g137E801
18795A17250D5214J5970a69510B41427a15289j17407k62779K22277h9817A84115
18784A39355C4124a25622j63413P3458k3286M3137A48611b74003e3655E9884k1501
18773C8383a31095K8374K1170A24062b45828Q2093B3071a80830j43177J3880J45638
18762a64489N3299p2144j26296g3234A2061a11883o186d8029I9397B8380a49664
18750A82301J8626d8022j22888J3317A87673c39547B4495e7019j80585A27604
18739b92229J09189B24561f3339A57674j1442h1394B7452M3673J27692D0385N4458
18728I4843l0168L0472J08202b05369o6068a30914E5577b16493L9641C3446a25950
$$ plain form
18808 462206 -4971 -277478 -129434 -102755 372137 71699 80966 77142 -96465 -51919 -7137 5801
18795 117250 45214 61184 -169510 241427 -115289 -232696 -495475 -273198 -89817 184115
18784 139355 34124 -125622 -289035 -215577 -238863 -195726 148611 -274003 -53655 59884 38383
18773 38383 -131095 -102721 -81551 124062 -245828 -163735 23071 -180830 -324007 -310127 -164489
18762 -164489 -111190 -183334 -309630 -73234 12061 -111883 -118069 -48029 99397 28380 -149664
18750 182301 200927 -48022 -170910 -157593 187673 -339547 24495 -57019 -237604 127604
18739 -292229 -183040 224561 -63339 157674 146232 -81394 27452 71125 198817 40385 94843
18728 94843 64675 95147 203349 -205369 -271437 -130914 55577 -216493 -176852 33446 -125950
18716h3659A19537c1081l67476h5178j7906J3004k15806O7772J12556R595c7266
18704c1408B60151a10621j77609c1908A55021c12259J40141C2261a74827O3556
18694a11271d6301k75167M3859d0506k44728e6384A13486b10065j91841J60029
18684b41877c7322F4151H990K0182M219J44629c23382a02195B43381a86154j14856
18673c01010e0234a1534A2635a69517H609a42725A71922a8268l92774a2293N729
18662f564A46826o7223a22618M6302I8451b18943a0378j79844A50387P222F5217
18650b72210k7028c4461B17653a28459r0617A22619m9616K4590H476i1318E6820
18638C77491h5170L130n4811O6678j7869j75994J17411o860k67305a14769M624
$$ plain form
18716 -83659 119537 -31081 -398557 -85178 -103084 -90080 -305886 -238114 -125558 -115963 -37266
18704 -31408 260151 -110621 -288230 -31908 155021 -312259 -172118 32261 -174827 -111271
18694 -111271 -46301 -321468 -277609 -40506 -285234 -56384 113486 -210065 -401906 -241877
18684 -241877 -37322 64151 8990 29172 33391 178020 -323382 -102195 243381 -186154 -301010
18673 -301010 -50234 -11534 12635 -169517 8609 -142725 171922 -18268 -411042 -12293 -6564
18662 -6564 146826 79603 -122618 -76316 98451 -218943 -10378 -190222 150387 157609 65217
18650 -272210 -299238 -34461 217653 -128459 -219076 122619 73003 97593 8476 -91318 56820
18638 377491 -85170 -82040 -136851 -70173 -88042 -264036 -146625 -153485 -420790 -114769 -110145
18627a10145N4240j67011B59278b45458b4208k18649A43641e3337I2184j4839
18617G7345J39538e25148a96213A76730d5833a4033j60234e9109G2503K41658
18607C14161F9865H086J41761a21813l1737k64116A58470a70595j18343G8523
18596C2089b17084j8295C7033a48158m5344a8854m3774H702e0382H4589Q2476
18585A67065Q0661f1444G4551i4474B37873a42576k6178P0849N420l8558L5079
18574i5964B77461j07245J5414E9213d18995A07546m3717d23619D6033k0297c58810
18562b11071K1676O3117j0232C22170g6010k59555m4625I8388d0666F5431a69862
18550c42548a3212A27939e7215j10597j48603f0341j24555I3050A1746i9211A98942
$$ plain form
18627 -110145 -55905 -222916 259278 -245458 -24208 -242857 143641 -53337 92184 77345
18617 77345 216883 -525148 -196213 176730 -45833 -14033 -174267 -59109 72503 314161
18607 314161 69865 8086 149847 -121813 -153550 -417666 158470 -170595 -288938 78523
18596 32089 -217084 -235379 37033 -148158 -193502 -18854 -62628 8702 -50382 84589 167065
18585 167065 247726 -61444 74551 -94474 237873 -142576 -168754 -97905 -92485 -131043 -95964
18574 -95964 277461 170216 185630 59213 -418995 107546 63829 -423619 46033 25736 -358810
18562 -211071 -189395 -126278 -136510 322170 -76010 -335565 -380190 98388 -40666 65431 -169862
18550 -342548 -13212 127939 -57215 -167812 -316415 -60341 -184896 93050 11746 -99211 198942
18538c12092d1943k01372d8510j47308R947A78657i8940l21129H1408h7574A37723
18526A62354J00812b45601K91M2884A56633c3615M608A18027l558R1212a38051
18514C7160h4983A3872R9897P4256d8960C52423a89224c4756q0065n6878A59964
18502c1890k16655J08889m3091N2770b0249A05618d05086C1813a56723B40921
18491G407i8506C2076a70768O1096G1641N9935i9571B04997a24046A29084a58262
18479f1538G6924a72595H0367q632J4250b5373D6285b3317j75419i0329C9797
18467B25969b35151h9087j5459j8101L672B52943c21187A69442N426a19765A01097
18455C73499a82677A19036g5434C2367i8183A40549J35632h7888j64356d0483
$$ plain form
18538 -312092 -41943 -243315 -48510 -195818 -185871 178657 -98940 -420069 81408 -87574 137723
18526 162354 263166 -245601 -245310 -202426 156633 -33615 -29007 118027 114469 205681 -138051
18514 37160 -84983 13872 113769 188025 -48960 352423 -189224 -34756 -114821 -171699 159964
18502 -31890 -248545 -139656 -182747 -129977 -20249 105618 -405086 31813 -156723 240921
18491 7407 -98506 32076 -170768 -109672 71641 131576 -99571 204997 -124046 129084 -158262
18479 -61538 76924 -172595 80367 71735 85985 -25373 46285 -23317 -198736 -90329 39797
18467 225969 -235151 -89087 -104546 -122647 -118975 252943 -321187 169442 174868 -119765 101097
18455 373499 -182677 119036 -75434 32367 -98183 140549 276181 -87888 -252244 -40483
18444e601F6694h2554j4084l8054a1649H3531a54746O919E5474P002J54704i1331
18431D9347a58111H4157K2258K38027E2768i2139j20807A98464b32389D6622m073
18420D2549a98561N913A30248b17898a3985j23074A22136J02767a48939B02063
18409B38242a44818I4050a6007j24720k02931N4032B26066f0830B25947o6744
18399A59203d9959j03138J9405A75023b0066B76426f8168r8662N7779B55867b77067
18387b69730e2322j38767A60705g720n1257j83039b6558k7882K5229B40217a10224
18375E1235a95280l01k53934G079J28591a47669O070J6382L0625q058i139b882
18362A64535d3276A05044j3396c91774B10440n8344k5350f537k32116i2911L345
$$ plain form
18444 -5601 66694 -82554 -96638 -134692 -11649 83531 -154746 -147827 55474 62476 217180 -91331
18431 49347 -158111 84157 106415 344442 52768 -92139 -212946 198464 -232389 46622 42549
18420 42549 -198561 -192648 130248 -217898 -13985 -137059 122136 224903 -148939 202063
18409 238242 -144818 94050 -16007 -140727 -343658 -289626 226066 -60830 225947 159203
18399 159203 -49959 -153097 -133692 175023 -20066 276426 -68168 -166830 -109051 255867 -277067
18387 -269730 -52322 -191089 160705 -7720 -58977 -242016 -26558 -54440 -29211 240217 -110224
18375 51235 -195280 -195581 -449515 7079 135670 -147669 -141599 -125217 -94592 -102650 -9139 -2882
18362 164535 -43276 105044 91648 -391774 210440 152096 126746 -6537 -238653 -92911 -89566
18351h9566j41092c1812l01767j3917i893m10880a82142A41512a07141A85764
18340d7418j63286l0711p2199A95232f349F361b7739G9330b25441r2979J28594
18329a89826g7135j89726g4871H3431M1343J55320D1622g1312B4945J74300h1088
18317e5474j13714A55091B3878L3012a86898a2992H0086A4976O8627e7883G1139
18305H5209c773j12326C86541a97488c0186q8773k04773e3159B60325b1278C65746
18293e3420j22932E3959b20102j88071a95305b6357m14164A1060g3942F3170L4206
18282I7376a71926B47584b48483E9760a60438g6968I9914d30382B00477a19046
18271F7213a20924F1997b46476D6139a42660g162j97246R4188e4399I3973d93288
$$ plain form
18351 -89566 -230658 -31812 -333579 -347496 -9893 -420773 -182142 141512 -107141 185764
18340 -47418 -210704 -241415 -313614 195232 -6349 6361 -27739 79330 -225441 -318420 -189826
18329 -189826 -77135 -266861 -74871 83431 124774 280094 41622 -71312 24945 199245 -81088
18317 -55474 -169188 155091 23878 56890 -186898 -12992 80086 14976 83603 -57883 71139
18305 85209 -3773 -116099 386541 -197488 -30186 -118959 -323732 -53159 260325 -21278 365746
18293 -53420 -176352 53959 -220102 -408173 -195305 -26357 -440521 11060 -73942 63170 97376
18282 97376 -171926 247584 -248483 59760 -160438 -76968 99914 -430382 200477 -119046
18271 67213 -120924 61997 -246476 46139 -142660 -7162 -204408 -110220 -54399 93973 -493288
18259a92944P3041j68891j13243H8605N4312j1404J3408d8668B364J9348K35633
18248B57345j8965k5119g434A64197e2808k45731A53912e9196n1927G1241K5559
18237I6800e290I7468d12968A33739I132K62465A3724K9423M41205g6942m2567
18226a19509e2594A52551n6265N730K34356r8097a44432E0964N2875f5589K5633
18215c9956l9910J8680k04530A88693B4803b3014A09724a12001e2998I7223k8051
18204F9172c79443G4550b0534A08533d8363j77700F7067E29c93033d4579k4807
18193f9386j71764q039B0238d52469B41783d57235A49034a07794A8460b01159
18182b21797N0155A3687P0684d491D7968a47565C25822A08834J80580j32592a17752
$$ plain form
18259 -192944 -119903 -288794 -402037 88605 142917 131513 144921 -48668 2364 21712 257345
18248 257345 238380 213261 -7434 164197 -52808 -298539 153912 -59196 -111123 71241 96800
18237 96800 -5290 97468 -412968 133739 9132 271597 13724 43147 484352 -76942 -119509
18226 -119509 -52594 152551 96286 102016 336372 238275 -144432 50964 103839 -65589 -39956
18215 -39956 -79866 -61186 -265716 188693 24803 -23014 109724 -112001 -52998 97223 69172
18204 69172 -379443 74550 -20534 108533 -48363 -226063 67067 529 -393033 -44579 -69386
18193 -69386 -241150 -249189 20238 -452469 241783 -457235 149034 -107794 18460 -201159
18182 -221797 -171642 13687 84371 -4491 47968 -147565 325822 108834 289414 156822 -117752
18170G6356a41498C1817L70817h9275A71295C8565c67474a12953A69625F1676
18159a98725k9019f1626L0221l1293A89785a28886C5598a0368j36775J9141D3962
18147H9631j9892b43234A20605M3452m0111B2338N60703f9283A41571n7000a04269
18135A19315c45720h3228j64438N3350g5572j96048j05130B6427b44303a3574
18124b41381A55794c4710H2045J16346a09634I1094M3280F195b24689e3566B4925
18112h6108A05113b00977a4939k35754G8336c08992A73748K1577b31541A1255
18101A41347a86616B7242J26087K18213c1708j40414j2485K7740b3853A14547
18090a38475F3800b45494A12683e30275h5022I7531k6132b92126G7144B6939N1300
$$ plain form
18170 76356 -141498 31817 402634 -89275 171295 38565 -367474 -112953 169625 61676
18159 -198725 -227744 -61626 -31405 -62698 189785 -128886 35598 -10368 -147143 -128002 43962
18147 89631 69739 -243234 120605 164057 123946 22338 583041 -69283 141571 84571 -104269
18135 119315 -345720 -83228 -247666 -194316 -75572 -271620 -376750 26427 -244303 -13574
18124 -241381 155794 -34710 82045 198391 -109634 91094 134374 6195 -224689 -53566 24925
18112 -86108 105113 -200977 -14939 -250693 78336 -308992 173748 195325 -231541 11255
18101 141347 -186616 27242 153329 371542 -31708 -172122 -184607 -156867 -23853 114547
18090 -138475 63800 -245494 112683 -530275 -85022 97531 71399 -292126 77144 26939 78239
18079G8239J47291b94581J30119N7535l6875k11221A5767J54563b04404B5784
18068a2219B55307b07623f3909k40768g4596A82450c65165h6217A9849J9830i820
18056a48671K9072B11505b0401k41645H7380b24550A69194b81909g1639j24922
18046a96561A17668d21577A40545b97556d4393H5198n59J60007i3026m4532d2253
18034G6775a42712C35935A17955a54487r4458f1480C2523h5000A11134b1514l21250
18023c42764B7781e568C44R8930b14134C55381h1203a7862B41416D7725d1511
18011g6232D5676J25408d9910A31368o5243R1152b31165A39451j8806b42392a1212
17999A88450k2120f7856k13307a01190B28166b8929F9091J82409f6545k05712
$$ plain form
18079 78239 225530 -294581 -164462 -106927 -143802 -355023 15767 170330 -204404 25784
18068 -12219 255307 -207623 -63909 -304677 -74596 182450 -365165 -86217 19849 39679 -9820
18056 -148671 -119599 211505 -20401 -262046 87380 -224550 169194 -281909 -71639 -196561
18046 -196561 117668 -421577 140545 -297556 -44393 85198 84639 244646 -93026 -137558 -42253
18034 76775 -142712 335935 117955 -154487 -248945 -61480 32523 -85000 111134 -21514 -342764
18023 -342764 27781 -5568 344 99274 -214134 355381 -81203 -17862 241416 47725 -41511
18011 -76232 45676 171084 -49910 131368 66125 157277 -231165 139451 120645 -242392 -11212
17999 188450 166330 -67856 -281163 -101190 228166 -28929 69091 251500 -66545 -272257
17989b72257J19254l09604J17422b7919B3438f0371n9988B08427K05524f6534
17978a42032l1942d0528C60305j58464J50157A6955b5552p0441C06224a26246
17967B87752a3562B036f0912A73468c05172e1668j12204r0359H1612K47552F0819
17955C30870B3598J18688b4330A60003f438A12532a15701j14099j9802B18925
17944b16047B84156d4759A77888a75729O1591j66182A09173a65621F6742a23568
17933B32656P5670a19281D5371h9060K3344n6432A39900d22674I372K83914E0836
17921A0865K73615G4086a30752G2514C0039M0668B1893J87196a40233B05497N0235
17910B55732b49121A58184E8115a8839B96969i1652A05765b67846m9188A06797
$$ plain form
17989 -272257 -153003 -462607 -345185 -27919 23438 -60371 -120359 208427 413951 -66534
17978 -142032 -173974 -40528 360305 201841 351998 16955 -25552 -95993 306224 -126246
17967 287752 -13562 2036 -60912 173468 -305172 -51668 -163872 -254231 81612 329164 60819
17955 330870 23598 142286 -24330 160003 -6438 112532 -115701 -229800 -249602 218925
17944 -216047 284156 -44759 177888 -175729 -114138 -280320 109173 -165621 66742 -123568
17933 232656 308326 -119281 45371 -89060 -65716 -122148 139900 -422674 9372 293286 50836
17921 10865 284480 74086 -130752 72514 30039 70707 21893 209089 -140233 205497 255732
17910 255732 -249121 158184 58115 -18839 296969 -91652 105765 -267846 -317034 106797
17899b21837A31768a03468M537B37834a80517B62569b08549E4255M1792c56364
17888d3579r5278I4766b73576A47416K17808j61401b54641J18276E5477R9627
17878A55104J56157b90941A51854j5465a97139A82794d3978j74944O3548H8761
17867b68905g3488i70j83002B54997f2419j64998p8813a05842j26697H4160D1841
17855c8193C01413G729O9750j236B9657a05478j03482A02525D996N5576b33825
17843G0217f7194j60685D28969A64115f4022r86k00735J24630B2250K04959a12902
17831A23601J22979A5860g5366A82835d45214A71003l5261a06650B29577A11452
17820A7982f7970K3749B06544r1152l3921e4798A06283b32722D14402b10950f4613
$$ plain form
17899 -221837 131768 -103468 -98931 237834 -180517 262569 -208549 54255 96047 -356364
17888 -43579 -138857 94766 -273576 147416 365224 203823 -254641 -136365 55477 155104
17878 155104 311261 -290941 151854 136389 -197139 182794 -43978 -218922 -155374 88761
17867 -268905 -73488 -970 -183972 254997 -62419 -227417 -306230 -105842 -232539 84160 41841
17855 -38193 301413 7729 77479 76243 29657 -105478 -208960 102525 4996 60572 -233825
17843 70217 -67194 -227879 428969 164115 -64022 -65008 -265743 -141113 22250 227209 -112902
17831 123601 246580 15860 -75366 182835 -445214 171003 135742 -106650 229577 111452
17820 17982 -67970 -44221 206544 115392 81471 -54798 106283 -232722 414402 -210950 -64613
17808i4250L7042l8979m9882K579H6341a24297p6765o5482B61967j14516j1579
17797A35872a21366c0634B43736b13611B11063k5979b40187L9221A93480h2894
17786H5165J06314a8673r5049j09034H2363j2503f2394j3945A2362g8535B81306
17774e3915G9281b00127D5789a11200I8326j3931h4394j5700A96780b55731b4796
17762a47694B0640J4814J93491a14995A11352m347R9929a77408C5553K04276d5252
17750F0653h6578C83162b47700B69027b73328I8990f9635I8774K75844A68230
17739I5541J52948O3432i0266B07730a98687B18793A04112c27939A77944Q111
17729A86055b6739q153C2496N9584a1323A50136D933a79746A41676b63560d7879
$$ plain form
17808 -94250 -57208 -96187 -146069 -143490 86341 -124297 -201062 -266544 261967 147451 135872
17797 135872 -121366 -30634 243736 -213611 211063 185084 -240187 -200966 193480 -82894
17786 85165 191479 -18673 -113722 -222756 82363 69860 -62394 -76339 12362 -78535 281306
17774 -53915 79281 -200127 45789 -111200 98326 84395 -84394 -100094 196780 -255731 -24796
17762 -147694 20640 35454 228945 -114995 111352 107005 206934 -177408 35553 239829 -45252
17750 60653 -86578 383162 -247700 269027 -273328 98990 -69635 98774 374618 168230
17739 95541 248489 311921 -90266 207730 -198687 218793 104112 -327939 177944 186055
17729 186055 -26739 -34892 32496 92080 -11323 150136 4933 -179746 141676 -263560 -47879
17717h001k42141g5842b1112R794j46451C70969a27152c5167A31301b09916j0182
17706b20098L08c0169A10289J41203b26908j29470E980b4130k72975A45177o4259
17695H0918k2228a25377E0388Q5326a29545B5087d159C1342J84383G006b62136
17683c4970p7276A62447O7561i7620A41144M9818h6308b7087k66914A01844a04222
17671i3117B80601J29681I4452a82683d6120A30967J93167C1595J4332a41401
17660a00262A32266l9482a47031j6058L6365m0439b424k12689R8170L6136A63514
17648C18683M6160i8178j10692B90064G9829Q2786q0148k2510I698d5347A54578
17636H6750M3298a11180A14963J33458j12516a33560A6344h1753A58800c09349
$$ plain form
17717 -8001 -250142 -75842 -21112 -11318 -157769 370969 -127152 -35167 131301 -209916 -220098
17706 -220098 -219790 -30169 110289 251492 -226908 -356378 5980 -24130 -297105 145177 80918
17695 80918 58690 -125377 50388 135714 -129545 25087 -4159 31342 215725 7006 -262136
17683 -34970 -112246 162447 230008 -97620 141144 190962 -86308 -27087 -294001 101844 -104222
17671 -93117 280601 410282 94452 -182683 -46120 130967 324134 31595 45927 -141401
17660 -100262 132266 92784 -147031 -163089 -126724 -167163 -2424 -215113 -116943 -80807 163514
17648 318683 364843 -98178 -208870 290064 79829 162615 82467 59957 9698 -45347 154578
17636 86750 130048 -111180 114963 248421 135905 -133560 16344 -81753 158800 -309349
17625a50351A1507a60241l8295j2918a31p3348D22539A72683d6315n0726H3299
17613a90469J9178d5571k30957A03788K60911L5559h6566C88490A40353n3051
17603H7302L1760a37981A83514a92472A34891o4080f6966D2151b0078o9135q6227
17592a75440C320b919E4465b666j56504B28964B1543K37257G8825a10765A45201
17580a25387G2430N4800b2083A88580P0718F5116J8793g2205j2281C5945O7828
17569A03773b40883B58228C3794a15514D967J02684J92037k9465E4665K3590K10537
17558B88792j40650o3544O5813j6357K52408F3771f0337r7626A13781m8247a87721
17546B94177A41332B0830K08480J11871A7704J48087G5328B4866J13142l7420
$$ plain form
17625 -150351 11507 -160241 -198536 -211454 -131 -73479 422539 172683 -46315 -97041 83299
17613 -190469 -171291 -45571 -276528 103788 364699 400258 -86566 388490 140353 87302
17603 87302 119062 -137981 183514 -192472 134891 70811 -66966 42151 -20078 -89213 -175440
17592 -175440 3320 -2919 54465 -2666 -159170 228964 21543 258800 78825 -110765 145201
17580 -125387 72430 127230 -22083 188580 259298 65116 83909 -72205 -84486 35945 103773
17569 103773 -240883 258228 33794 -115514 4967 107651 299688 270223 54665 78255 288792
17558 288792 148142 84598 150411 134054 386462 63771 -60337 -157963 113781 65534 -187721
17546 294177 141332 20830 229310 341181 17704 165791 75328 24866 138008 100588
17536A00588J29100J63985j76614c2621C88119i3409B5667A2477N3824J57009
17526B23310F6651b6177A38811c7129a6873A18643L9059a46405A0054a99223b893
17514a82301A60380N3922M8268C2765b21114j1137B02680J27898a18913A24509
17503A37375J18349C7209J51054g6737B63002d03487A97305O8625p7241l9626
17493A49063d1876B5941g2390l1243A05742B471i1598C78124a20100c1190k63263
17482b94453I2825K65266j69851l2539k1302B9611M3992a89891c6014B25234J39339
17471C64573G7054Q073J16873p8093J53581A03138B4307L41430c8817B6342M64138
17460D90480A77691b58470D11413k939A81345K6839J44142o308o1817R2810p8113
$$ plain form
17536 100588 229688 393673 217059 -32621 388119 -93409 25667 12477 66301 223310
17526 223310 66651 -26177 138811 -37129 -16873 118643 157702 -146405 10054 -199223 -2893
17514 -182301 160380 214302 262570 32765 -221114 -232251 202680 330578 -118913 124509
17503 137375 255724 37209 188263 -76737 263002 -403487 197305 265930 188689 149063
17493 149063 -41876 25941 -72390 -103633 105742 2471 -91598 378124 -120100 -31190 -294453
17482 -294453 92825 358091 188240 155701 134399 29611 73603 -189891 -36014 225234 364573
17471 364573 77054 85127 202000 123907 277488 103138 24307 365737 -38817 26342 490480
17460 490480 177691 -258470 411413 408474 181345 208184 352326 346018 284201 377011 298898
17449B98898o4795B9847L68200R8258j80300H7289L39983j29776j03510j5747
17439A78239q7091L3602K85367I1307K98586j28782j08426R0651J53121j47111
17429B49346L2381J12828c5352C22229C1353J02862K1802L19508A66597J10016
17419B76613j10752J3705P5815B9738a11657C66443a86247B40727Q6168C0554
17408b0249r7879B44026n2909b09332A46882a67929C23357h1379B38797g2536
17397c8359A14387L40596A29346e5071A02818C4885K17474q8319J9683c0810H4831
17385A10584B49J17540M73105c0085k6775m5055C19310b55422B87969A9492J50169
17374A69661M4408D2893K7795N206J5723M1312J97295a30006B66611F7960J0932
$$ plain form
17449 298898 234103 29847 398047 496305 316005 87289 427272 297496 193986 178239
17439 178239 91148 124750 410117 91307 389893 261111 152685 243336 396457 249346
17429 249346 281727 394555 -35352 322229 31353 134215 156017 475525 166597 276613
17419 276613 165861 179566 255381 29738 -111657 366443 -186247 240727 326895 30554
17408 -20249 -118128 244026 191117 -209332 146882 -167929 323357 -81379 238797 -72536
17397 -38359 114387 454983 129346 -55071 102818 34885 252359 164040 183723 -30810 84831
17385 110584 249 117789 590894 -30085 -56860 -101915 319310 -255422 287969 19492 169661
17374 169661 214069 42893 70688 75894 91617 132929 330224 -130006 266611 67960 78892
17363G8892B9121K03830P3083j37062m464c5318m81143C31533m6325e7312A33152
17351C88421N3038b6200A52105a00177A00147l0483J27626o0336E4468L60921
17341D15389p2199q0434c4271B45830a04558n8011C75772E7527J36462G2012L47524
17330D19536a14387C5432M42161C1141K36927j18613J85670G8031J29111K85355
17320D92497A70590m5311K16634F3426G594M26556B5593J37873L3627c5822A97898
17308B01230J70805G6921J9261c8916B72203P8500p531a612C452K72123a4547
17296D17640c0972A71523b02920A54174K01877q8045E3433J37938J81228k8344
17286C44255d1179B38711O8680j44532P5167B72R5061J29954F6570J05132k7053
$$ plain form
17363 78892 29121 232951 306034 168972 164508 -35318 -516461 331533 285208 -57312 133152
17351 388421 441459 -26200 152105 -100177 100147 69664 197290 136954 54468 415389
17341 415389 343190 262756 -34271 245830 -104558 -162569 375772 57527 193989 72012 419536
17330 419536 -114387 35432 477593 31141 268068 149455 335125 78031 207142 492497
17320 492497 170590 125279 341913 63426 7594 434150 25593 163466 197093 -35822 197898
17308 201230 372035 76921 96182 -38916 272203 350703 343172 -1612 3452 275575 -14547
17296 417640 -30972 171523 -202920 154174 356051 268006 53433 191371 372599 344255
17286 344255 -41179 238711 307391 162859 238026 272 95333 225287 66570 171702 144649
17275A44649R8944K899J62307q532j88387m0888h9334c0955l45856a29908D58851
17263b20873D4342J06637K71413a58708C33769a18227D13114A88587K05735j89904
17253B04418M1399G2204L8733a00259A55514A3680b30478B12611P9022Q3873j74307
17242B01199J062H7592D0682L03370j69976D5743a83435F468L45113j66616K48261
17231D33226H9871a37855K1068A62554A4793J61896K8336M1250K72746I6818f6643
17219C10327A35560K38886q2361e4923C17096C9053L02519A35393K82671B9971
17208B87852r5083P4309J30763d7180B87577O7513k0070p8108J70485N504H5773
17196A87944L0324J86160A37085M88786B85929e0385E38935k54269A14527J11953
$$ plain form
17275 144649 243593 246492 408799 400267 211880 170992 -89334 -30955 -376811 -129908 458851
17263 -220873 44342 150979 422392 -158708 333769 -118227 413114 188587 394322 204418
17253 204418 245817 72204 110937 -100259 155514 13680 -230478 212611 291633 375506 201199
17242 201199 202261 87592 40682 344052 174076 45743 -183435 6468 351581 184965 433226
17231 433226 89871 -137855 -116787 162554 14793 176689 205025 246275 519021 96818 -66643
17219 310327 135560 374446 292085 -54923 317096 39053 341572 135393 418064 29971
17208 287852 192769 267078 397841 -47180 287577 355090 335020 256912 427397 432901 85773
17196 187944 218268 404428 137085 625871 285929 -50385 538935 284666 114527 226480
17186B26480K01198j09034A57920J27117Q3362J20006a7219C34867E0880L74602
17176D25482G4109M32566a31793E48430k23478O2961A1648N79841A90506r1355
17166I9151J29794N0041R7984J85963A91301r1796K53525A59404O1083L0102K20885
17155D71474j67766j43118M41166A47128K33828B7372M06148J77858h6835C75204
17144A63449B7388K71160J46935A86307R2168J80079k06410O8294r7077J03482
17134C26843o0126j28006Q1613Q9489K93865B51524M31500C07236Q6116A31474
17123E04969j12226N3185q1254r2159G6270M12680P1858k65906L4519Q7054j16201
17112C00274j05497p5816K11494K27877A02567L43521P0969q7961J70975j9490
$$ plain form
17186 226480 427678 318644 157920 285037 368399 488405 -17219 334867 50880 425482
17176 425482 74109 506675 -131793 548430 324952 387913 11648 591489 190506 99151
17166 99151 228945 278986 376970 562933 191301 99505 353030 159404 220487 250589 471474
17155 471474 303708 160590 601756 147128 380956 27372 433520 611378 -86835 375204
17144 163449 27388 298548 445483 186307 278475 458554 252144 320438 223361 326843
17134 326843 266717 138711 220324 309813 603678 251524 683024 307236 393352 131474
17123 504969 392743 445928 364674 272515 76270 488950 560808 294902 329421 416475 300274
17112 300274 194777 118961 330455 558332 102567 446088 517057 429096 600071 580581
17102E80581B82088R8390j05063J31481p7341m9619L24720B08658J83964R0178
17092D82800k04527R1943J36168L6343k64663N53139j46364j57288P0791H1816
17081B74910L27750B14966J54148J16740O7070m7623j9368k02115M27120J9773
17071G30711l15892K10424j93290k469n7319K65228B00671k1900L17022J54656
17061F50449l7569B11944O5940Q8413K68372Q3488A69649R1357J20596J33963
17051E15565R1672R9272l07107J11509A53766L81770j8345K23231n1881A44019
17040H92979o816l76755K17707j0700j32849K12997k88820R6762j11119J9192
17030E12578k12044o1284J54363K40621K25744l71153J33781J9527j62685J25002
$$ plain form
17102 580581 282088 380478 275415 406896 329555 279936 604656 208658 392622 482800
17092 482800 278273 370216 506384 542727 278064 831203 684839 527551 598342 81816
17081 274910 602660 214966 369114 485854 552924 505301 485933 283818 710938 730711
17071 730711 414819 625243 431953 429484 372165 637393 200671 178771 495793 650449
17061 650449 612880 211944 277884 366297 634669 718157 169649 261006 381602 515565
17051 515565 607237 706509 399402 510911 153766 535536 517191 740422 688541 144019
17040 892979 886163 509408 727115 716415 583566 796563 507743 604505 493386 512578
17030 512578 300534 239250 393613 634234 859978 488825 622606 642133 479448 604450
17020F04450J44522J11200k31710M0499J10607k42279J44925k15029J68728j90549
17010D45364J25535K34636M5291j22968k72727n0083K29755M51724D72949N72218
17000A045167l38272K30205C99884L41014j12116K76551K74070q9716m28789k7687
16990F33211K01782O2707J08055l21393p2916L03575j06911K00328j21971j42443
16980G44024j11705K55561K78946E32991J76028R2918J95702j81531L58450j76185
16970I98373k52740L37925j09720k37209K78256K10726j62297k11423K48124K37214
16960A337229j95870J34302j24672l04284L65091M4554j39794J36990l51258Q8713
16950I91001j01327M15375k4053n8425j77611O570j20770L28802j02276R8513
$$ plain form
17020 604450 748972 860172 628462 668961 779568 537289 682214 467185 635913 445364
17010 445364 570899 805535 850826 727858 455131 405048 634803 1086527 472949 1045167
17000 1045167 706895 937100 399884 740898 628782 905333 1179403 1089687 660898 633211
16990 633211 834993 897700 1005755 684362 611446 915021 808110 1008438 886467 744024
16980 744024 632319 887880 1166826 532991 709019 801937 997639 816108 1174558 998373
16970 998373 745633 1083558 973838 736629 1014885 1225611 1063314 851891 1100015 1337229
16960 1337229 1141359 1275661 1150989 846705 1211796 1256350 1116556 1253546 902288 991001
16950 991001 889674 1305049 1280996 1222571 1044960 1051530 930760 1259562 1157286 1255799
16940A255799K33J00390M8380M1406K9261o4699r4076n0991M07285m49430K64687
16929A488245k00490K29664l9719l9641r5217N6733L16937m71972L03353j32870
16919A415023J64672n9320K8855K29441l18971N6051q6805L89135l62647L09866
16909A765300K82290k86396M18065n65381K57267L07165l18571r6856M05291k01502
16899A966672j91708J44805J76915L4134j28840M51567n79090L03517k55279P9046
16889B001739J21087L59842k70683k14676N5116O8658M96184j48533j4186r6808
16879B357740J81740P849J81553l3533j06572j63556J88771J90741K58529l30480
16869B732782k3703P1935r7478J10313N15567l06970J078J45588j00750L33894
$$ plain form
16940 1255799 1256032 1356422 1404802 1446208 1475469 1410770 1316694 1265703 1672988 1223558 1488245
16929 1488245 1287755 1517419 1477700 1438059 1342842 1399575 1716512 1244540 1547893 1415023
16919 1415023 1579695 1520375 1549230 1778671 1459700 1515751 1428946 1818081 1455434 1765300
16909 1765300 2047590 1761194 2179259 1613878 1871145 2178310 1859739 1762883 2168174 1966672
16899 1966672 1774964 1919769 2096684 2130818 2001978 2453545 1874455 2177972 1922693 2001739
16889 2001739 2122826 2482668 2211985 1997309 2052425 2121083 2617267 2468734 2454548 2357740
16879 2357740 2539480 2547329 2728882 2695349 2588777 2425221 2613992 2804733 3063262 2732782
16869 2732782 2709079 2781014 2683536 2793849 3309416 3002446 3003524 3149112 3048362 3382256
16859C382256K0515j28205J70935K2026K45256j73775j55747J49363K36850k30400
16849C539074M38116j23136k70426L11558K77745L8175j5272O7222M77651n25408
16839D215299L76276R800O0088j37333K80324p2080L32650J20123l52802L87936
16829E220281n541K80171p3900J29760j06768K6004N62387m7098j54466L36610
16819F167440J4975K66824k57303L06931M4311M95328l72934N80445l12344L07136
16809G240809N53357n4001J75385K69772j65095p8228J78231L68843m9832M31791
16799H871032K03352o4394O18482J62903J4030M01770K38418j10233L69641L89908
16789A1094909L14839J89023J33816M38638J90975K77103L73205N19975O71317
$$ plain form
16859 3382256 3402771 3274566 3445501 3467527 3712783 3539008 3383261 3532624 3769474 3539074
16849 3539074 3977190 3854054 3583628 3895186 4172931 4211106 4195834 4263056 4740707 4215299
16839 4215299 4591575 4601375 4661463 4524130 4804454 4732374 5065024 5185147 4832345 5220281
16829 5220281 5214740 5494911 5421011 5550771 5444003 5470007 6032394 5985296 5830830 6167440
16819 6167440 6182415 6449239 6191936 6498867 6543178 7038506 6665572 7246017 6933673 7240809
16809 7240809 7794166 7740165 7915550 8185322 8020227 7941999 8120230 8489073 8439241 8871032
16799 8871032 9074384 9009990 9628472 9791375 9805405 10207175 10445593 10335360 10705001 11094909
16789 11094909 11409748 11598771 11732587 12171225 12362200 12639303 13012508 13532483 14203800
16780A4203800k44842M83599K99774P25360R9077K25503J138238L02054K25144
16771A7457707P59223N69133Q23901n9859P59552O06098R23073P39000Q29578
16762B3407406P93625Q98560Q97743J038441R88810N97913J512432J026648J342829
16753C2504407J421465J227203J679316J578576J917288J361401J892142K070426
16745D5652224K345277K150049K488312K691655K932047K951638L272458L418126
16737F7901786L893564L961648M290539M299095N072000N113283N600998O190509
16729A06323422O063886O327968P313242P031144P007355P820764P237238O790384
16721A61915403O978915O391985N566395N154738L431229K605680J602684j54432
$$ plain form
16780 14203800 13958958 14442557 14742331 15467691 15566768 15792271 16930509 17232563 17457707
16771 17457707 18216930 18786063 19609964 19550105 20309657 20915755 21838828 22577828 23407406
16762 23407406 24201031 25099591 25997334 27035775 28024585 28622498 30134930 31161578 32504407
16753 32504407 33925872 35153075 36832391 38410967 40328255 41689656 43581798 45652224
16745 45652224 47997501 50147550 52635862 55327517 58259564 61211202 64483660 67901786
16737 67901786 71795350 75756998 80047537 84346632 89418632 94531915 100132913 106323422
16729 106323422 112387308 118715276 126028518 133059662 140067017 147887781 155125019 161915403
16721 161915403 168894318 175286303 180852698 186007436 189438665 192044345 193647029 193492597
16713A93492597j410504k175330l379649m488960n727934o034362o659562o731223
16705A56885073p803797p142258p535866p285275o888400o612194o551195o416738
16697A00649350n637039n250319n355395m807371m765517m047922m044222l557471
16689F3184094l342480l416478l061289k293877k598399k356805k331873k514563
16681D1268330j858255j558558j495877k079759j272386j483643j094584j880568
16673B8544700j039491j004909q94564r27100o74368j122780r88286p73557o96299
16664B0423346p56630m12079r25492m53392q86012k79612n79824m74531n47903
16655A5107871o26632m81035k27259n86648l83342j59315n26564j66918n24410
$$ plain form
16713 193492597 192082093 189906763 186527114 182038154 176310220 170275858 163616296 156885073
16705 156885073 149081276 141939018 134403152 127117877 120229477 113617283 107066088 100649350
16697 100649350 95012311 89761992 84406597 79599226 74833709 70785787 66741565 63184094
16689 63184094 59841614 56425136 53363847 51069970 48471571 46114766 43782893 41268330
16681 41268330 39410075 37851517 36355640 34275881 33003495 31519852 30425268 28544700
16673 28544700 27505209 26500300 25605736 24678636 24004268 22881488 21893202 21119645 20423346
16664 20423346 19666716 19254637 18329145 17875753 16989741 16710129 16130305 15655774 15107871
16655 15107871 14481239 14000204 13772945 13186297 12802955 12643640 12117076 11950158 11425748
16646A1425748k10442l57688n24774R1217o2949n91299j61733l7103k21719n17590
16636H831668l18174K1930n30169m9471l70359J51701m62229J70535k84487k14083
16626F946862j25076r3195j53672l30597J33952l77124J33676n10669K37435j00993
16616E760599l82945Q6545k51066k96782J031N4284j40498j73650J35778j68905
16606D624391q259k07672k09835j66116J49358k43348l1438l72467M49243R0914
16596D074771k44487N0224K09918k53331j50706J39758m02347l10377N1018K27780
16586C392221k47145n7505L20781n60539j50696N4023K02157k15724J83726q0743
16576B840556n5323j61022J07706q600o6591M7909j90476k91108K66662j28143
$$ plain form
16646 11425748 11215306 10857618 10332844 10424061 10361112 9769813 9608080 9570977 9349258 8831668
16636 8831668 8513494 8535424 8005255 7955784 7585425 7737126 7274897 7445432 7160945 6946862
16626 6946862 6821786 6728591 6574919 6244322 6378274 6001150 6134826 5624157 5861592 5760599
16616 5760599 5377654 5464199 5213133 4916351 4917382 4971666 4831168 4657518 4793296 4624391
16606 4624391 4616132 4408460 4198625 4032509 4181867 3938519 3907081 3534614 3983857 4074771
16596 4074771 3830284 3880508 4090426 3837095 3686389 3826147 3423800 3113423 3164441 3392221
16586 3392221 3145076 3087571 3408352 2847813 2697117 2751140 2953297 2737573 2921299 2840556
16576 2840556 2785233 2624211 2731917 2723317 2656726 2704635 2514159 2223051 2489713 2361570
16566B361570m246J38540O2312k61552k83873J22029M07710j54553j36480j06259
16556B145198l1941L9590k96209m9859O5133j2354N6476r4701J1252o8374J68394
16545A932605k2665m28332K52940J58173j65527p3874j90842J39079j53574j38660
16535A309323L01124k19955M28242k46107k24254J50458K03032j30817k17490
16526A353556O7891J42858n7985l12209L01849l7000l35563O2418k33948J48802
16516A100669J64145L51141k80164j93128L0822J41788k79261N1899K07337K2609
16506A317857n2800k2926o9613k52463L94946j28585q1678O457J63747j69025
16496A105917m3352r1876J3415r9891j00123K49267Q7758j91991j31770J15820
$$ plain form
16566 2361570 2357324 2495864 2558176 2296624 2012751 2134780 2542490 2387937 2251457 2145198
16556 2145198 2113257 2152847 1856638 1806779 1871912 1859558 1916034 1821333 1832585 1764211 1932605
16545 1932605 1909940 1481608 1734548 1892721 1727194 1653320 1462478 1601557 1447983 1309323
16535 1309323 1610447 1390492 1818734 1572627 1348373 1498831 1701863 1571046 1353556
16526 1353556 1421447 1564305 1506320 1194111 1495960 1458960 1123397 1185815 951867 1100669
16516 1100669 1264814 1615955 1335791 1142663 1173485 1315273 1036012 1087911 1295248 1317857
16506 1317857 1265057 1242131 1172518 920055 1315001 1186416 1104738 1111195 1274942 1105917
16496 1105917 1062565 970689 984104 884213 784090 1033357 1121115 929124 797354 913174
16486I13174m5467L99499o15796k8837J96867q2253K43451j55222L02350m53363
16476F74403N84312n93487J11507k9113L04452m59213J98041o6909k65169K39278
16466F98102j31876N82223m40587k50253P51085n81919J07355K9033j76049J3804
16456F00918J21484k28871J98131J03384M3614r6101j43266m2586K3425J06221
16446F86353K49407m19634j37373q7621R8707j22246M73186l24162J61537j73965
16436D04189N1359q9968N6568J49869j8828j1071K18035j41015k32906J02244
16426D88476L57142C98537K73437j70703J60268J2851k9049C14392M17042l27698
16416D03736L03704k60989J86872j64008A19869L26899M8268K47338j75398Q2146
$$ plain form
16486 913174 867707 1267206 651410 622573 819440 737187 980638 825416 1127766 674403
16476 674403 1258715 665228 776735 747622 1052074 592861 790902 723993 458824 698102
16466 698102 566226 1148449 707862 457609 1208694 626775 734130 763163 587114 600918
16456 600918 722402 493531 691662 795046 838660 742559 599293 556707 580132 686353
16446 686353 935760 516126 378753 291132 389839 267593 740779 416617 578154 404189
16436 404189 455548 365580 422148 572017 553189 542118 760153 619138 386232 488476
16426 488476 845618 398537 671974 501271 661539 674390 645341 314392 731434 403736
16416 403736 707440 446451 633323 469315 119869 446768 495036 742374 566976 649122
16406F49122A82918M38248j55339K18200j36392L8542P639M3381j12824Q744H1579
16394E03650J04499K2580B45321K89172m1462l28B09436K89609K4146D2807M84765
16383E27572k20278A45409J78679r8391J98749P4298A75463O52746k47314B15986
16372F64806B47644J13498R0357j23183K71608f109E39323k31591j32680K19634
16362C94686A86284J95637j23300A18399J84404K3757J35924B02623A9086J0419
16352B9505K28917K10113A61155r822K47409A07292M89692a10999B66598O5581
16342C32179A27669j6499L76443A36748M0560M27472J07246C11304a9690C14094
16331A55744J78890J51171a3315A5214J94233N4648D6097K24145n1447p1311n6218
$$ plain form
16406 649122 182918 621166 465827 684027 547635 586177 593816 637197 524373 533117 81579
16394 503650 608149 630729 245321 534493 493031 492703 209436 499045 523191 42807 527572
16383 527572 307294 145409 324088 225697 424446 498744 175463 828209 580895 215986
16372 664806 247644 361142 451499 328316 599924 -6109 539323 307732 175052 394686
16362 394686 186284 381921 258621 118399 302803 326560 462484 202623 19086 29505
16352 29505 258422 468535 161155 151333 398742 107292 596984 -110999 266598 332179
16342 332179 127669 111170 487613 136748 177308 604780 712026 311304 -19690 314094
16331 155744 334634 485805 -13315 15214 209447 264095 46097 270242 218795 147484 91266
16320I1266J40982B0463M33659g7496E11273j99567K6350j07593k4078n6391M5695
16309A95689e0520B14460L06124n5156n4272a0778B24729J59740j58382a73659
16298D16779A9012K52031N7806A60506K22475B2572a69021A46105B7744L1908
16288E9652d094A47178k7587a60186A50116a7173A93962F7971L39500D6571R4009
16277A40580R8224j05198J53897r4686J61196j52456H6905P1097c26106B91635
16266c49271e7456D21325A12323L8793B3194K17205H8857K08185A36912C2797
16255A52668B9623O4866P4466J13414A37546a28815A09144J38152p6277K34957
16245D05976i2157E3971b39233B62783b0727D41655m5749A12724k909O6694P0371
$$ plain form
16320 91266 232248 20463 454122 -77496 511273 311706 338056 230463 206385 149994 195689
16309 195689 -50520 214460 520584 465428 411156 -10778 224729 384469 226087 -173659
16298 416779 19012 271043 328849 160506 382981 22572 -169021 146105 27744 59652
16288 59652 -4094 147178 119591 -160186 150116 -17173 193962 67971 407471 46571 140580
16277 140580 238804 133606 287503 192817 354013 201557 86905 158002 -326106 291635
16266 -349271 -57456 421325 112323 151116 23194 240399 88857 297042 136912 32797
16255 152668 29623 94489 168955 282369 137546 -128815 109144 247296 171019 405976
16245 405976 -92157 53971 -239233 262783 -20727 441655 395906 112724 109815 176509 246880
16234B46880f4731j15196P48E29223a0630A89755D4124K36715h0357C21687C6928
16222g9291F8328O5259a36570A75799b18611E29786a01442B59377I259L8970e203
16210C14476p2860K31109c0114p4482F3737J09948c49802A38127c6714G2402a2335
16198C68363A01059K87822b6935D20381a78304B97514m5148e4645C39426A51922
16187C74913a00145G819J15866a64058h423l0823C31613b30137B51583k8252J08639
16176C31970c9903K197F7905K44401A54124a32898B0421J55821J31406a93461
16165f4586a737j01842n3770A79994l5797A0214b67456B43679I0320b0705A313
16153A65564C4544M1334e6457A60386J28432A19546b49468H7040g510A11315B2424
$$ plain form
16234 246880 -64731 -179927 -179179 529223 -10630 189755 44124 280839 -80357 321687 36928
16222 -79291 68328 133587 -136570 175799 -218611 529786 -101442 259377 9259 48229 -5203
16210 314476 241616 472725 -30114 -104596 63737 173685 -349802 138127 -36714 72402 -12335
16198 368363 101059 388881 -26935 420381 -178304 297514 252366 -54645 339426 151922
16187 374913 -100145 7819 123685 -164058 -8423 -39246 331613 -230137 251583 223331 331970
16176 331970 -39903 -37706 67905 312306 154124 -132898 20421 176242 307648 -193461
16165 -64586 -1737 -103579 -157349 179994 144197 10214 -267456 243679 90320 -20705 1313
16153 165564 34544 75878 -56457 160386 288818 119546 -249468 87040 -7510 111315 22424
16141C9434a23878a1939A1515i575j91861C22115a77589P1994A66284g3037G6287
16129b69446E3917d67476A55048c7755F8791J8686C7029K1230P9175n5674L0956
16118A12716L016A7048a80757A54069b01756Q8577E4994J87538q992G5509a23347
16106c593B20387L8818H1166a48775I0857k3136a13884H1780L23058c7183m6012
16095h3195q142G5358j4417i4904a009B15027c590E7262a02573B63119I6339M3688
16083A40027C1759K21367A01085f5027A0118b45269Q821C02870a65381e8931A74741
16071a42668L064b4408B30874A12034b5919A50872c9619j13815d6290B25980a0491
16059A54137o3916B9577L06408a11655F7218B1855K87052a48549H0261b42233
$$ plain form
16141 39434 -123878 -11939 11515 -9575 -201436 322115 -177589 -105595 166284 -73037 76287
16129 -269446 53917 -467476 155048 -37755 68791 87477 37029 58259 137434 81760 112716
16118 112716 115732 17048 -180757 154069 -201756 -113179 54994 242532 233540 75509 -123347
16106 -3593 220387 259205 81166 -148775 90857 67721 -113884 81780 404838 -37183 -83195
16095 -83195 -91337 75358 60941 -94904 -1009 215027 -3590 57262 -102573 263119 96339 140027
16083 140027 31759 253126 101085 -65027 10118 -245269 -236448 302870 -165381 -58931 174741
16071 -142668 -139604 -24408 230874 112034 -25919 150872 -39619 -153434 -46290 225980 -10491
16059 154137 90221 29577 335985 -111655 67218 21855 308907 -148549 80261 -242233
16048A23827P835b3003l2176J2946r078G7730a98116B12085a94679G5894a39939
16036a96364A83703c2581A80273n2177N866J7217h8787j3806k69998J48801P6990
16025a46800C0043h6213j36969G0289c25270N6292g1897K6408A83569G6435b01432
16013i2127k05409h7605J1043H1702f9845F1064b77703j190p1082A38471n7482
16002H0989K33872b54518E0395b03399j33427d7512m0921H7769j8335c97743B54505
15990B4894b21147E163g9244A08394M3399P1830C666K42351J34092H7029M6844
15979A33873a88616H9565M10548d8307q5935B57959n7084a42178e6420p1331l3421
15968a61172g2615B69434D7729j7218c33075I8542b69059i7786o0374j19903e8972
$$ plain form
16048 123827 131662 -23003 -55179 -42233 -51311 77730 -198116 212085 -194679 75894 -139939
16036 -196364 183703 -32581 180273 128096 133962 151179 -88787 -102593 -372591 -223790 -146800
16025 -146800 30043 -86213 -223182 70289 -325270 -268978 -71897 -45489 183569 76435 -201432
16013 -92127 -297536 -87605 -76562 81702 -69845 61064 -277703 -278893 -349975 138471 80989
16002 80989 314861 -254518 50395 -203399 -336826 -47512 -88433 87769 69434 -397743 254505
15990 24894 -221147 5163 -79244 108394 151793 223623 3666 246017 380109 87029 133873
15979 133873 -188616 89565 500113 -48307 -134242 257959 200875 -142178 -56420 -127751 -161172
15968 -161172 -72615 269434 47729 30511 -333075 98542 -269059 -97786 -158160 -278063 -58972
15956A12917J87461A10575C1734a59461j32750O2518q2983A04600L21004g8396
15945b86545i9463b0734m3884J5301j7260L2059A39360o9284b40076a02742r4691
15934a97433g2669F1263a39275j62618B9432g106l32159f4563C0525j456i6623
15922i8727b9482N950B24581b05719l1079R9689n275I9857a31121C30223c1188
15910B18095a29076A01180J02528L2293o1036K2822r2756j4082d35177c9949C50160
15898c73248e9902A06440d50344G057e2621I8494Q8839C3307b56764A5899d1063
15886a75920o5782D0851L29383H4090c0856J4482A89279E0021K05519c33218N8748
15875b74470c2377b873j76860j63560A28854a87448q5500C1436J10680a39308
$$ plain form
15956 112917 300378 110575 31734 -159461 -292211 -229693 -312676 104600 425604 -78396
15945 -286545 -99463 -20734 -64618 -49317 -66577 -34518 139360 70076 -240076 -102742 -197433
15934 -197433 -72669 61263 -139275 -301893 29432 -7106 -339265 -64563 30525 29069 -96623
15922 -98727 -29482 -23532 224581 -205719 -236798 -137109 -142384 99857 -131121 330223 -31188
15910 218095 -129076 101180 203708 236001 174965 197787 105031 90949 -435177 -39949 350160
15898 -373248 -59902 106440 -450344 7057 -52621 98494 187333 33307 -256764 15899 -41063
15886 -175920 -241702 40851 370234 84090 -30856 -16374 189279 50021 255540 -333218 -274470
15875 -274470 -32377 -2873 -179733 -343293 128854 -187448 -272948 31436 142116 -139308
15864a8731D6620K27946c00876C8599a85932o6417I122j677P423b27605A24076
15852e1244A38983b37639A51708G234a59454j73211e8101B05449j3761C261a23404
15840a32503C8657g2928p8124j05282A7811J22576b65719A21752M7726N980o1274
15829A14184Q8404H4432P2193h426B2323K32256r8787g4098G6196r11N3849L7349
15817A66483a3000B2483E459J73903L0554E4344a58839E5005f2706a6793A0491
15805b11733m5101H999a02446A05968a20774C9719M7343a0533D2995J55649c0529
15793C09492a036k90289a23002B11770j0223o2861d19298J16606e352n75A29463
15781d3049n914B65907d66444b0814m31624a00016D6203b35610C6314a58915c1168
$$ plain form
15864 -18731 46620 274566 -300876 38599 -185932 -252349 9122 7445 14868 -227605 124076
15852 -51244 138983 -237639 151708 7234 -159454 -332665 -58101 205449 191688 3261 -123404
15840 -132503 38657 -72928 -151052 -256334 17811 140387 -265719 121752 169478 175458 114184
15829 114184 202588 84432 156625 -8426 22323 254579 155792 -74098 76196 75285 129134 166483
15817 166483 -13000 22483 5459 179362 209916 54344 -158839 55005 -62706 -16793 10491
15805 -211733 -256834 8999 -102446 105968 -120774 39719 87062 -10533 42995 198644 -30529
15793 309492 -1036 -291325 -123002 211770 201547 138686 -419298 -302692 -5352 -5927 129463
15781 -43049 -48963 265907 -466444 -20814 -452438 -100016 46203 -235610 36314 -158915 -31168
15769a38309O9104A86811a98665D5099c1909C7127K23826a38831j33113F4460
15758c39257A29690J27496a14371A34455K31459m0457b32397k489B96115A28849
15747a21945F0091a28140A97067D1891A4144N7402e6990k04711a24247F5345o226
15736E9119K74179c3593k10813A26923i9043F4243K5523K3862b9523l0310j31941
15725a91774B3178K0082a93347j2752K4162h1919a8607C1649a23888A48470g0347
15713d1041l0198r3564o7979a2512A21123a028j40000d5247n88685d8178k31715
15702b79893A88637p108b91036B5988c50810B63915a10744k26303B10325q8622
15692A21703K9626b01133j70997C59777G4835a66813f2306E8059b44309K9113
$$ plain form
15769 -138309 -69205 186811 -198665 45099 -31909 37127 260953 -138831 -271944 64460
15758 -339257 129690 257186 -114371 134455 365914 325457 -232397 -234886 296115 128849
15747 -121945 60091 -128140 197067 41891 14144 71546 -56990 -261701 -124247 65345 59119
15736 59119 333298 -33593 -244406 126923 -99043 64243 89766 113628 -29523 -59833 -191774
15725 -191774 23178 43260 -193347 -206099 -181937 -81919 -18607 31649 -123888 148470 -70347
15713 -41041 -71239 -164803 -232782 -12512 121123 -1028 -141028 -45247 -633932 -48178 -279893
15702 -279893 188637 181529 -291036 25988 -350810 263915 -110744 -337047 210325 121703
15692 121703 151329 -201133 -372130 359777 74835 -166813 -62306 58059 -244309 -215196
15682b15196H9699a53849C25375H0739l9979c45151f6854A55454A4515a408A28912
15670a24019L2427A6245K55438d6948J3235F6276b15698H5465B4158J3450b23065
15658f8000C6452K0113a66160j54027I9705h9677B66115e03839C937Q7664L3577
15647A25178b8856j33302j67383B65783G5696K15520i6159m3030L4096I6605b00002
15635b03309b6350A25247j180a54891C30245h4760C2508d7074F1556f4332C52043
15623a53292C3511O6352P5414b33418E8622c17E6424a22402M3333j65929j56293
15612d01291A64161n3015J48963c6463B12095g1404h722j08587F0293o064K42246
15601B96475a00970G0816i9618q364B66J79640L0505a12749k28633a35984I6911
$$ plain form
15682 -215196 89699 -153849 325375 80739 40760 -345151 -66854 155454 14515 -1408 128912
15670 -124019 -91592 16245 271683 -46948 -33713 66276 -215698 85465 24158 37608 -223065
15658 -68000 36452 56565 -166160 -320187 99705 -89677 266115 -503839 3937 91601 125178
15647 125178 -28856 -162158 -329541 265783 75696 291216 -96159 -139189 -105093 96605 -200002
15635 -203309 -26350 125247 124067 -154891 330245 -84760 32508 -47074 61556 -64332 352043
15623 -153292 33511 99863 175277 -233418 58622 -317 56424 -122402 -79069 -244998 -401291
15612 -401291 164161 111146 260109 -36463 212095 -71404 -8722 -117309 60293 54229 296475
15601 296475 -100970 70816 -99618 -107982 266 179906 210411 -112749 -341382 -135984 96911
15589F0412L3181b23871A39161B7280a7636l71774N5020C7865L09422f5431j14773
15578a80204B0340a88355O8745h217B63968a98215Q0855C26662A57173B4817J42669
15567A67486p3949a95988i636A1218J24317a20131G0431J83620q378E6844K13856
15556B70700A22849J11873r123a806l7496l53900J43428g4812B1413J95996B0044
15544a27995j2951p2364C001a69668E4541f3736G2003a77196A09863a75676A81793
15532C4463i2228K2520D61871a57047j7263j58379A2748K27538j14287K9192D5785
15520g086A02768a03592C41149b92314H4859b6968m1336E8931a17861k56182a1642
15508e5379C12941e09852G4685J6499e1686E6259i0561J6879k81702J65270h9677
$$ plain form
15589 60412 93593 -223871 139161 27280 -17636 -389410 -334390 37865 347287 -65431 -180204
15578 -180204 20340 -188355 -119610 -8217 263968 -198215 -117360 326662 157173 24817 167486
15567 167486 93537 -195988 -9636 11218 135535 -120131 70431 254051 245673 56844 270700
15556 270700 122849 234722 225599 -1806 -39302 -393202 -249774 -74812 21413 217409 20044
15544 -127995 -140946 -213310 3001 -169668 54541 -63736 72003 -177196 109863 -175676 181793
15532 34463 -92228 -69708 461871 -157047 -174310 -332689 12748 240286 125999 155191 45785
15520 -7086 102768 -103592 341149 -292314 84859 -26968 -68304 58931 -117861 -374043 -11642
15508 -55379 312941 -509852 74685 91184 -51686 56259 -90561 -73682 -355384 -190114 -89677
15496e6495H3857b84924H568a08650o7678j91202D78192A45561E8581J7307J43641
15485B19529b10906j8505F8315b16091f9947A63403D2470L58554j06468d1317
15474h0962B19843b04281B14874h8111b6863H188J60980h5648B1882b3014C7591
15462e2376A01230D2421J93256c32887O6965i3990j54208a09610A20099J40244
15452B60343c41897d6194H7395O375k1879J02476b98560A25289g2312k01592N1634
15441b22270J03160m7320N4831I0277C12Q3400h5732G5699J43488b58803f2857
15429A54775a40647C1202P2705j3824E064J19199c56934a60023A21503B6741g8647
15417c80639a35314A16729c45090i7195C48608a8941M433m2316D6232L4621a9719
$$ plain form
15496 -56495 83857 -284924 8568 -108650 -176328 -367530 478192 145561 58581 75888 219529
15485 219529 -210906 -229411 68315 -216091 -69947 163403 42470 401024 294556 -41317
15474 -80962 219843 -204281 214874 -88111 -26863 8188 169168 -85648 21882 -23014 37591
15462 -52376 101230 42421 235677 -332887 -265922 -93990 -248198 -109610 120099 260343
15452 260343 -341897 -46194 87395 93770 71891 174367 -298560 125289 -72312 -273904 -222270
15441 -222270 -119110 -166430 -111599 90277 312 83712 -85732 75699 219187 -258803 -62857
15429 154775 -140647 31202 103907 90083 5064 124263 -356934 -160023 121503 26741 -78647
15417 -380639 -135314 116729 -345090 -97195 348608 -18941 -14508 -56824 46232 80853 -19719
15405I7262R2391f9792J8464P946A83825b12152B40669e1333j16011P1762B6927
15393H2424j3745B1276J4587M0311g3361D58229a93907F6407K13481A36496B3477
15381A71837b55312e6368A97330b13314b1066A84523f6105A00254J19178L4860
15371B54292k5676b68241R9291A44073l3217J18280h6099m4469j2183j25346c3607
15359b94153i8038o1225A37892A6570a55093E4238B2981a00464D5143h1493p2594
15348a54087A90845e1038A41299C2435K864J63898b41903A53919n746d9393p6118
15337a25511N9875j25933A48284K69953B9450b2406P306C99515b71505h2598j37206
15326b19804f8767b6566A36225a68377A24220a80971A19787C1971J26516k3078
$$ plain form
15405 97262 189653 -69792 -51328 -43382 183825 -212152 240669 -51333 -167344 -95582 26927
15393 82424 68679 21276 35863 76174 -73361 458229 -193907 66407 279888 136496 23477
15381 171837 -255312 -56368 197330 -213314 -21066 184523 -66105 100254 219432 254292
15371 254292 228616 -268241 -168950 144073 110856 229136 -86099 -130568 -142751 -268097 -33607
15359 -294153 -98038 -159263 137892 16570 -155093 54238 22981 -100464 45143 -81493 -154087
15348 -154087 190845 -51038 141299 32435 35299 199197 -241903 153919 148173 -49393 -125511
15337 -125511 -65636 -191569 148284 418237 29450 -22406 -15100 399515 -271505 -82598 -219804
15326 -219804 -68767 -26566 136225 -168377 124220 -180971 119787 31971 158487 135409
15316A35409b12231I6642l0166d07530J77638A30542a49432F3268J77734c1384
15305A26169J2410d0851B74847j02356K95122A22923d4304J6158A88186D2927
15294f5753A46994e5167A02856C9309J43970H1472K2773J01523B8389a52292G5984
15282F048b53021A03538k7993l5958b95262B04603Q0872C3531d0985l2520E5049
15270I3292g6421k38877a45192B9998Q2018P1054m7257E4544J65578L9773a38064
15258C40657g5080I4694L51900j09403p9354r7133F8254K22214R3536K19742L32327
15247I36073J9613M12012E97478j76021K45425B29069R552J9759k0237n4481K0359
15236B04021D1664g5644C07781H0139J91921i0353L4627B08382H9368J00030D4948
$$ plain form
15316 135409 -212231 96642 66476 -407530 -229892 130542 -149432 63268 241002 -31384
15305 126169 138579 -40851 274847 172491 467613 122923 -44304 -28146 188186 42927
15294 -65753 146994 -55167 102856 39309 183279 81472 104245 205768 28389 -152292 75984
15282 6048 -253021 103538 75545 39587 -295262 204603 285475 33531 -40985 -73505 55049
15270 93292 -76421 -315298 -145192 29998 112016 183070 135813 54544 220122 259895 -138064
15258 340657 -75080 94694 446594 337191 257837 160704 68254 290468 384004 603746 936073
15247 936073 955686 1367698 597478 421457 666882 229069 238621 258380 238143 183662 204021
15236 204021 41664 -75644 307781 80139 272060 -90353 -55726 208382 89368 189398 44948
15224F6010j6824L50045A73481J21511A0360P2917e7763A15834i8222B93164A1070
15212i5954B16506n3839e5211A83535h190j17319M4852A48708C7696f5281B29362
15200A28932K52247A88916R1926F1282a37134j99770E0504a20353I1550L18965
15190D10515a02577k8125B28860j06383J41041a2252F2164R1131c0541D4284Q9867
15179A34151m5492b07209D4649K81568b10668A20688a06776E6227l705c83394
15168H4884f5654H6613m2677J59316b38071A08194I265K66575M5611o4076E0563
15156B25580J11464C6953M8171K0573J41214B9720K2479P5358k4076J90555a88974
15144G1632c8181H6845f4225K6304k551C13362j2927j23659O9860i9125A34057
$$ plain form
15224 66010 49186 399231 173481 294992 10360 83277 -57763 115834 -98222 293164 11070
15212 -95954 216506 162667 -55211 183535 -8190 -125509 -80657 148708 37696 -65281 229362
15200 128932 381179 188916 280842 61282 -137134 -336904 50504 -120353 91550 410515
15190 410515 -102577 -130702 228860 122477 263518 -12252 62164 153295 -30541 44284 134151
15179 134151 88659 -207209 44649 326217 -210668 120688 -106776 56227 52522 -383394
15168 84884 -65654 86613 43936 203252 -238071 108194 9265 275840 321451 257375 50563
15156 225580 337044 36953 85124 105697 246911 29720 52199 127557 103481 294036 -188974
15144 71632 -38181 86845 -64225 -37921 -40472 313362 300435 176776 246636 -99125 134057
15132a01572B89936g5214D40676A38409a4818B4714n587L16897l8273j34977o9730
15121I3044J6893J82890G637c1217A60636j7586f2143D6393J23609a59379B04543
15109f1505D4597P8386K03696G6470b3921B36882D8250K47989a99235A50933a30897
15097B13947f449k07168B12810O7969A19859n1656J94468j06560j0797N5340J9117
15086B19771o4505K67008A40739h3067I3200a768c59q5905A32010K02619A51035
15074B51117J17289A41660h2298o3139B44290J97949j74323b13031q2731D07109
15063B58671j08636g8925B20434b28489F231L20922a2623G2675J27858a12113
15052A84202a12513j7517B9567C379R100f5370D45096j83137A19762K39893l0117
$$ plain form
15132 -101572 289936 -75214 440676 138409 -14818 24714 19127 336024 297751 162774 93044
15121 93044 109937 292827 7637 -31217 160636 143050 -62143 46393 170002 -159379 204543
15109 -61505 44597 122983 326679 76470 -23921 236882 48250 296239 -199235 150933 -130897
15097 213947 -6449 -213617 212810 280779 119859 68203 262671 156111 145314 200654 219771
15086 219771 155266 422274 140739 -83067 93200 -1768 -359 -86264 132010 334629 151035
15074 251117 368406 141660 -82298 -145437 244290 442239 267916 -213031 -295762 407109
15063 258671 150035 -78925 220434 -228489 6231 327153 -12623 72675 200533 -112113
15052 184202 -112513 -130030 29567 3379 12479 -65370 445096 261959 119762 359655 329538
15041C29538K08320g605C4192L02180A65787J37994c1119C04085L0532n4938G7994
15029e286C85595J20079b29364B18498j4400K85034j8962j43786J1230E9535J71409
15018B30944J87574j97078G7344j6126a218A47826N82235A92086n6248l9394M16369
15007E12813k19891h2462C16701A27014K58261A03133K91572j68303r4664c6650
14996H7762L5574h971j9005J765j26948B60659L5695H6254J0979L22231C3077
14984C8089L26321j43560J14164h2426C17485r710j27845R4265Q8811j07301m52
14973B55253Q5916K9292A18697J43580J39067J30453j21707A72993L13354c1176
14962B15978O6675A40188B077J19716M04744q2586D7984M40752c0725B0869P0377
$$ plain form
15041 329538 537858 -7605 34192 336372 165787 303781 -31119 304085 334617 279679 77994
15029 -5286 385595 505674 -229364 218498 204098 489132 470170 326384 337614 59535 230944
15018 230944 418518 221440 77344 61218 -1218 147826 730061 192086 135838 96444 512813
15007 512813 292922 -82462 316701 127014 385275 103133 394705 226402 131738 -36650
14996 87762 123336 -8971 -27976 -26211 -153159 260659 296354 86254 97233 419464 33077
14984 38089 364410 220850 335014 -82426 317485 307775 179930 274195 363006 255705 255253
14973 255253 341169 370461 118697 262277 401344 531797 410090 172993 486347 -31176
14962 215978 282653 140188 2077 121793 526537 443951 47984 488736 -30725 20869 91246
14951I1246L36703k04081K37072G6525J33295p2824L02369j4345p6380l7184N2383
14940C63839A24103K73545j46092K14398O767l4845F6630K09877O0685O8155K29220
14929F34567B33422I6420K71549J38185j61790p6246K91956j38878j72444p6937
14919A71815L98961k50689J42993A1533e2144E49911G5865J72312p5785K91181
14909D63573p5650K19953r0791o5964k4717A91202J70825A54311J74452K44640
14899E73403B18675J42189m5821G1971J00497n191K76517L35760C45139d0387
14888E55647J66251l19606i0042D78733j14293Q2960B02168P5171K1228f763E16738
14876B71072Q0855M3294j90389J84028m6770J61388n0380j19737K73767k47070
$$ plain form
14951 91246 427949 223868 460940 76525 209820 136996 439365 425020 348640 311456 363839
14940 363839 124103 397648 251556 465954 472721 437876 66630 276507 337192 405347 634567
14929 634567 233422 96420 367969 506154 344364 268118 560074 421196 248752 171815
14919 171815 570776 320087 463080 11533 -52144 549911 75865 248177 172392 463573
14909 463573 387923 607876 517085 451121 426404 191202 362027 154311 328763 573403
14899 573403 218675 360864 315043 71971 172468 167277 443794 779554 345139 -40387
14888 555647 721898 402292 -90042 478733 364440 447400 202168 277339 298567 -6763 516738
14876 271072 351927 395221 204832 388860 342090 503478 453098 333361 607128 360058
14866C60058j8020M68132A98105R3657k66J89688J4053k19300K25713l1860j23750
14855C46040O3113G238J09157L06955j86472J98959K1817A93833o34L33113A89469
14843A68628M71135J10525C33946J21386j18464m9654M71700J29861j67082R5015
14833H16708A98967K34273B07222K13632j17953q9644J99883P1623j34426M15719
14823G66056l16254B04220f1621B55071L01037B23805R3144K04026J67237j2540
14813F75672l19937r4785L65053k92033L81206n3824L2220C42236J70872j4006
14803D99102J06876A39500Q58107m14028n8993K55919C52333M04531K1127j9220
14793G58771o8272j55534K8059J10198l06661M36223k05070J60314j14581J25619
$$ plain form
14866 360058 342038 810170 198105 291762 291496 481184 495237 275937 501650 469790 346040
14855 346040 409153 7238 116395 423350 236878 435837 457654 193833 193199 526312 189469
14843 168628 639763 750288 333946 455332 336868 287214 758914 888775 721693 816708
14833 816708 198967 433240 207222 420854 302901 213257 413140 484763 350337 766056
14823 766056 449802 204220 -61621 255071 556108 223805 316949 520975 688212 675672
14813 675672 355735 260950 626003 333970 715176 661352 693572 342236 513108 499102
14803 499102 605978 139500 997607 583579 524586 780505 352333 756864 777991 758771
14793 758771 690499 534965 563024 673222 366561 802784 597714 758028 643447 769066
14783G69066l36574L4998M8840K23717k47281P1697n6372k36620n3558K08959
14773D26872O0364K61179L44929l60945Q7750k0256k78104J47563k3390K09000
14763H54962L7412k71230k69077M06987E7772M25631J70999m2295l519L0979J00928
14752G40495L66960D56926K50947K62098l45598N866O0499M6086K54002j24049
14742H66777l51480O86518m30630Q0471J41759n0634j07689o6651O1962K21960
14732A052363m41987N09502l53917k37441L57586J70535k42787Q5921j6606j70892
14722G12277k445N49355k87381j44637J32717j46631P262M65387k58930k53267
14712G73707K61847j63286o0033Q9727j288J04681j52063k88373N15154k60782
$$ plain form
14783 769066 432492 467490 516330 740047 492766 564463 508091 271471 217913 426872
14773 426872 487236 748415 1093344 732399 820149 799893 521789 669352 645962 854962
14763 854962 892374 621144 352067 759054 57772 483403 654402 612107 608588 639567 740495
14752 740495 1107455 456926 707873 969971 624373 630239 690738 736824 990826 866777
14742 866777 515297 1201815 771185 851656 993415 942781 835092 768441 830403 1052363
14732 1052363 610376 1119878 765961 528520 886106 1056641 813854 899775 883169 712277
14722 712277 709832 1259187 971806 827169 959886 813255 820517 1285904 1026974 773707
14712 773707 1035554 872268 812235 901962 900674 1005355 853292 564919 1080073 819291
14702H19291K81496o8659l72554o124N2536J5178P9636M53253k79810n2360J19685
14691A041568j54180j94387K47255l57358L27122k507N9801K436J26092j58123
14681I37719M05071k67315J88717J05400q3392j81512K4885K01510n03340M55626
14671A283369l44604L11179k31657J7416k27596M52520j30137K55729j73435p7054
14661A135730K51320k38221R8453l41711K03810l4548K08503j69735J23187K18499
14651A455287j04093m81344N98959P2072l00221m5751J3780J87400j31730j31771
14641A132588K12765j57010J69594J86375J36060o901k62571J57289l81890J494
14631A187793N17182l05412q2034M28891k80625o2406J03228J93269K51864o24032
$$ plain form
14702 819291 1100787 1032128 659574 653450 705986 721164 800800 1254053 974243 921883 1041568
14691 1041568 887388 693001 940256 582898 910020 907513 967314 969750 1095842 937719
14681 937719 1342790 1075475 1264192 1369592 1286200 1104688 1129573 1331083 827743 1283369
14671 1283369 938765 1249944 1018287 1035703 808107 1260627 1130490 1386219 1212784 1135730
14661 1135730 1387050 1148829 1247282 905571 1109381 1074833 1283336 1113601 1236788 1455287
14651 1455287 1351194 869850 1468809 1540881 1240660 1194909 1208689 1396089 1264359 1132588
14641 1132588 1345353 1188343 1357937 1544312 1680372 1673471 1410900 1568189 1186299 1187793
14631 1187793 1704975 1399563 1317529 1746420 1465795 1403389 1506617 1699886 1951750 1327718
14621A327718L71300J47385j64055k5763k62694J82720J2527o1522J53979l27757
14611A353838M1158N18189j17546j84085L84182k59549P5438J53894j31854L2437
14601A866102j08924j1836K97684l94921L37868k4171q0931L8463P8102O1893
14591B059329k65210Q1398K46174l5083M9042r0887L32997K7698l09581L61826
14581B457703l76216J96706m16259J93814J74479L45043l64171K21425l6105K08314
14571B604733n10677O76791m95165N38197J38887l89636J57325P0817K414L35817
14561C129503L4899J88750j35056p170N73347n55262J014278k90358M20915N15413
14551D889259J202017J710986K556230M066823N441740P738644p14663o534161
$$ plain form
14621 1327718 1699018 1846403 1682348 1656585 1393891 1576611 1589138 1527616 1681595 1353838
14611 1353838 1394996 1913185 1795639 1611554 1995736 1736187 1811625 1965519 1833665 1866102
14601 1866102 1757178 1745342 2043026 1648105 1985973 1961802 1880871 1919334 1997436 2059329
14591 2059329 1794119 1875517 2121691 2086608 2135650 2044763 2377760 2405458 2095877 2457703
14581 2457703 2081487 2278193 1861934 2055748 2230227 2575270 2211099 2432524 2396419 2604733
14571 2604733 2094056 2770847 2275682 2813879 2952766 2563130 2720455 2791272 2793686 3129503
14561 3129503 3164402 3353152 3218096 3210926 3784273 3229011 4243289 3952931 4373846 4889259
14551 4889259 6091276 7802262 10358492 14425315 19867055 27605699 26891036 20356875
14543B0356875n895325m823017l079424j480996r89987p22785k95832J82674o16429
14534B635754K01422j6280L24303j6129m83363R4835l8952L39067m03174J94834
14524B832317P1349k91706L15081L15213m9408r4014M69312m05790j80113N8851
14514C041092J9963l5871K72951p0044j59562K20940P2833K21796m06110N38571
14504C716559j09513P4837J3626n3511r0372q2146J60895O9595K43926l88858
14494C555038L2284M91794j51700L15663j36048J14527J08971j95741K39443j92418
14484D181813M81049m94341L40259K63697j22085J25343K29586l22917L5422o4404
14474D653422k43833P35045m24161N00598J9748P418j8681L89142o9290k54647
$$ plain form
14543 20356875 14461550 9638533 6559109 5078113 4088126 3365341 3069509 3252183 2635754
14534 2635754 2837176 2820896 3145199 3129070 2645707 2740542 2701590 3040657 2637483 2832317
14524 2832317 2903666 2611960 2927041 3242254 3192846 3098832 3568144 3162354 2982241 3041092
14514 3041092 3061055 3025184 3298135 3228091 3068529 3289469 3362302 3584098 3177988 3716559
14504 3716559 3607046 3681883 3695509 3641998 3551626 3469480 3630375 3699970 3943896 3555038
14494 3555038 3587322 4079116 3927416 4243079 4107031 4221558 4330529 4134788 4374231 4181813
14484 4181813 4662862 4168521 4508780 4772477 4650392 4775735 5005321 4682404 4717826 4653422
14474 4653422 4409589 5144634 4720473 5221071 5240819 5248237 5229556 5618698 5549408 5294761
14464E294761K09746j9839K19476o933J71809m75761M23910J83112j0388j34826
14454E855067L39343J12215K82284n94554O00860r3888J01161K70427N6735J55105
14444G084755n6133Q1425J77902k02473K52736L52625l41627J01263N00709p7691
14434G873491L8146K13528j15588K17582L60515j36009p8568L46820L80270L3609
14424I133796j65137L30053N7771R5383O0031O9028M99955j74132P09171m7388
14414A0568531J51045j88908N61707L55729j0887k3668L57585K56955K66382j51856
14404A2142615J02994J34720N71207R1936J60304M46986K01890M60585j91788
14395A4121449N23358K31523P28873J6034K04635P4115M45829J00121K72439L88246
$$ plain form
14464 5294761 5504507 5484668 5704144 5697211 5869020 5393259 5817169 6000281 5989893 5855067
14454 5855067 6194410 6306625 6588909 5994355 6595215 6501327 6602488 6872915 6929650 7084755
14444 7084755 7028622 7110047 7287949 7085476 7338212 7690837 7349210 7450473 7951182 7873491
14434 7873491 7911637 8125165 8009577 8227159 8587674 8451665 8373097 8719917 9100187 9133796
14424 9133796 8968659 9298712 9356483 9451866 9511897 9580925 10080880 9906748 10615919 10568531
14414 10568531 10719576 10530668 11092375 11448104 11437217 11413549 11771134 12028089 12294471 12142615
14404 12142615 12245609 12380329 12951536 13043472 13203776 13650762 13852652 14313237 14121449
14395 14121449 14644807 14876330 15605203 15621237 15825872 15899987 16345816 16445937 16718376 17106622
14385A7106622j92241M88745K47634M80895J65149L82752M77952j1891N01816
14376A9647433J27775N15721Q4768O31057L31736L53991L24921L94014N74444
14367B2985860J97358L40347L42213Q07272l711R57697M39342K34271O39488P41264
14357B7681401M92661N39698Q84929L82411O48647N61160Q10575N21154Q28199
14348C3350835R18731O83583P11689J229713O75420J144803N29520J572012P21763
14339D1538069O59894J206403Q39929J485801J224611J107686J350411J043019
14331E0455823J931206J073759J456245J608445J605127J604248J885803J802612
14323F3423268J959613K156861K425734K290655K032859K509274K551939K879434
$$ plain form
14385 17106622 16914381 17403126 17650760 18131655 18296804 18679556 19157508 19145617 19647433
14376 19647433 19775208 20290929 20375697 21006754 21338490 21692481 22017402 22411416 22985860
14367 22985860 23183218 23523565 23865778 24673050 24669339 25627036 26066378 26300649 26940137 27681401
14357 27681401 28174062 28713760 29598689 29981100 30629747 31190907 32001482 32522636 33350835
14348 33350835 34269566 34953149 35664838 36894551 37569971 38714774 39244294 40816306 41538069
14339 41538069 42197963 43404366 44244295 45730096 46954707 48062393 49412804 50455823
14331 50455823 52387029 53460788 54917033 56525478 58130605 59734853 61620656 63423268
14323 63423268 65382881 67539742 69965476 72256131 74288990 76798264 79350203 82229637
14315H2229637K567311K942600L353769L018541L560163L775528M023176L744719
14307A09215444M215279M702718M958067N112087N431304N599710N829900O377677
14299A51442186O241699O905236P422818P517366Q653165Q550834R294081R715660
14291B15743045J0348660J0861934J1320663J2281338J2824350J3368400J3367064
14284C00115454J4243233J4480386J5305606J5378923J5400462J5765515J5257959
14277D05947538J4913710J3403085J0532843N704666J473787J14851J250650J946012
14269D55287142n923445n389836m529714m689078m948005q122227j0576511j2191476
14261C98916850j3227614j3951399j3907008j3219012j3880619j3990715j4865279
$$ plain form
14315 82229637 84796948 87739548 91093317 94111858 97672021 101447549 105470725 109215444
14307 109215444 113430723 118133441 123091508 128203595 133634899 139234609 145064509 151442186
14299 151442186 157683885 164589121 172011939 179529305 188182470 196733304 206027385 215743045
14291 215743045 226091705 236953639 248274302 260555640 273379990 286748390 300115454
14284 300115454 314358687 328839073 344144679 359523602 374924064 390689579 405947538
14277 405947538 420861248 434264333 444797176 450501842 451975629 452090480 453341130 455287142
14269 455287142 449363697 443973861 439444147 434755069 429807064 421684837 411108326 398916850
14261 398916850 385689236 371737837 357830829 344611817 330731198 316740483 301875204
14254C01875204j5111148j4317531j3828172j2789180j2275684j1357083j0730295
14247B11466111j0558503r538581q656076q124203q310442p509842p054065o572398
14239A45142001n809196o056133n508983n253375n189567m523234m674847l926123
14231A04200543l776991l803907l602167l536828l357922l280457k913740k492600
14223G7435931k882940k470187k038585k565354k226297j907967j835422k109579
14215E9399600j918516j245234j748517j531076j584891j491431j376017j401012
14207D7102906r55795r89784j548412j256485j120881r75873j102665p19938j124244
14198C7308829p80154r73609p79024q21366j097127o59257q12665n59620r88828
$$ plain form
14254 301875204 286764056 272446525 258618353 245829173 233553489 222196406 211466111
14247 211466111 200907608 191369027 182712951 174588748 166278306 158768464 151714399 145142001
14239 145142001 139332805 133276672 127767689 122514314 117324747 112801513 108126666 104200543
14231 104200543 100423552 96619645 93017478 89480650 86122728 82842271 79928531 77435931
14223 77435931 74552991 72082804 70044219 67478865 65252568 63344601 61509179 59399600
14215 59399600 57481084 56235850 54487333 52956257 51371366 49879935 48503918 47102906
14207 47102906 46147111 45157327 43608915 42352430 41231549 40255676 39153011 38433073 37308829
14198 37308829 36528675 35555066 34776042 33954676 32857549 32198292 31385627 30826007 29837179
14189B9837179n92160o75110p45977o75931o79720l31631m93978n12299p99178
14180B4331195k59674m81059m83538m39503p84360j64535m55533m25989l33330
14171B0503674k21308n47218n18816k26101j56135n94461m78757k71630m59373
14162A7029875p4376k94407o5018m48080j94790k95839m29169Q3472m72272k87521
14152A4551875l06807l1684j38278o53244M922m1065m12314j32888k56082n25837
14142A2058598J53863m53844J56941q0207m92811k30431j14367K1982n45663L02987
14132A0777048k48862k04101L79857n71418R8936l26292j28611K41021j72126
14123I845452m76930j07042n81863K85705k90519N1154P6461K286l03018k11420
$$ plain form
14189 29837179 29245019 28569909 27823932 27148001 26468281 26136650 25642672 25130373 24331195
14180 24331195 24071521 23590462 23106924 22667421 21883061 21718526 21262993 20837004 20503674
14171 20503674 20282366 19735148 19216332 18990231 18834096 18239635 17760878 17489248 17029875
14162 17029875 16955499 16661092 16596074 16147994 15953204 15657365 15228196 15311668 14839396 14551875
14152 14551875 14245068 14213384 14075106 13421862 13426784 13385719 12973405 12840517 12584435 12058598
14142 12058598 12212461 11758617 11915558 11835351 11342540 11112109 10997742 11019724 10474061 10777048
14132 10777048 10528186 10324085 10703942 10132524 10231460 9905168 9776557 10017578 9845452
14123 9845452 9368522 9261480 8679617 8965322 8674803 8725957 8802418 8804704 8501686 8290266
14113H290266j17049k14396j71595J37165p6735M4858m17439q2206j3366k3783
14103G355720m95229M96188n66216n4942K82843j29607Q8185l1717m17173r8666
14093F429386K83812k26144j64402j19730R2868J19295n98525K61962k94748K57597
14083F041371k00154o9492k9756J86508m24600J91884J18511n97041K88709M7949
14073E553889n03800P9889K06165k38390m81198M22023o51340M36116J19579l91611
14063D551322m3728R5931j72844N84157r662j18363m00929K07786m21354L13064
14053D585380k00328P2816q0651j97588L7141K68955o03199J86372k91113J39524
14043C917309j30509P7513j50125j031J83224J25955j85195R959j88640p211j63769
$$ plain form
14113 8290266 8173217 7958821 7787226 7924391 7847656 7892514 7475075 7392869 7379503 7355720
14103 7355720 6860491 7356679 6790463 6735521 7018364 6888757 6976942 6945225 6528052 6429386
14093 6429386 6713198 6487054 6322652 6202922 6295790 6415085 5816560 6078522 5783774 6041371
14083 6041371 5841217 5771725 5741969 5928477 5503877 5695761 5814272 5217231 5505940 5553889
14073 5553889 5050089 5129978 5336143 5097753 4616555 5038578 4387238 4823354 4942933 4551322
14063 4551322 4507594 4603525 4430681 5014838 5005176 4886813 4485884 4693670 4272316 4585380
14053 4585380 4385052 4457868 4377217 4179629 4216770 4485725 3882526 4068898 3777785 3917309
14043 3917309 3786800 3864313 3714188 3713157 3896381 4022336 3837141 3847100 3658460 3651249 3487480
14032C487480K1184J37500j3858J06681k85786K8191j46601O1918j32676L12068
14022C576101n58872J73845J69702k40391L77854j88876n25886L22040l2186n1400
14012C021931o6046M26759n67454K35605k31169K2738J20987j9147P6262j85570
14002B834896J11566n64108L40530j43925m2044l52379L92717K06047L24149j63696
13992B943753q592Q33339J091371J879445L542168N373126Q516794K439838n189296
13983B1421946n516000m120787k349684k182650j741286P9656r90142m49898p37705
13974C413450J26960j79970o6545l45447L1371j3000p9180j38331j07082p2558
13964B569668K58370m70442L03486m29735K12336k59463J2925L04604J03609o90861
$$ plain form
14032 3487480 3508664 3646164 3632306 3738987 3453201 3481392 3334791 3396709 3264033 3576101
14022 3576101 3017229 3191074 3360776 3120385 3498239 3309363 2783477 3105517 3073331 3021931
14012 3021931 2955885 3382644 2815190 3050795 2819626 2842364 2963351 2944204 3020466 2834896
14002 2834896 2946462 2382354 2722884 2578959 2536915 2184536 2577253 2783300 3107449 2943753
13992 2943753 2935161 3768500 4859871 6739316 10281484 15654610 24171404 26611242 21421946
13983 21421946 15905946 11785159 9435475 7252825 5511539 5591195 4601053 4151155 3413450
13974 3413450 3540410 3360440 3293895 2948448 2979819 2966819 2887639 2749308 2642226 2569668
13964 2569668 2828038 2357596 2661082 2231347 2443683 2184220 2197145 2501749 2605358 1914497
13954A914497L12758J88045j817M5508O3186r5232k42149J90762l03067O1948
13944B134439m3286K03130J85450k21240L6138k71419K26369J00730l07566m8054
13934A994691q6121j29231L13531O8562k94882L06996o53481M63580l43497N5609
13924A695757K277j12106O30504k29509n1690m72523L05138o5659L4210J64219
13914A900618l31516M72938m24289K32699m31895K54870K01682n8849j96632l1514
13904A588112K6982J08215k95353L01624j48183j22040J66338n8860o9862Q0165
13894A577138k47447M71522l314o80029M47250j01149r3021k24055J49003O6654
13884A362552o0940l00503K43660Q1256j13297O93171n19990j99015J11716J51339
$$ plain form
13954 1914497 2227255 2415300 2413483 2458991 2522177 2426945 2184796 2375558 2072491 2134439
13944 2134439 2091153 2294283 2479733 2258493 2294631 2023212 2249581 2350311 2042745 1994691
13934 1994691 1908570 1779339 2092870 2161432 1866550 2173546 1520065 1983645 1640148 1695757
13924 1695757 1698034 1585928 2216432 1986923 1935233 1462710 1767848 1702189 1736399 1900618
13914 1900618 1569102 2042040 1617751 1850450 1418555 1673425 1875107 1816258 1619626 1588112
13904 1588112 1615094 1723309 1427956 1729580 1581397 1459357 1625695 1566835 1496973 1577138
13894 1577138 1329691 1801213 1797899 1117870 1565120 1463971 1370950 1146895 1295898 1362552
13884 1362552 1301612 1001109 1244769 1326025 1212728 1905899 1385909 1186894 1298610 1449949
13874A449949k45334J57827j04005j52718J73975q3805O11005n32060K11771m44468
13864A042137k11634M79405l01982P2905J94901k12291n5667J85114j5395k1718
13854A155775J92547J45728k36862k56328L10214j83352p7083P4536Q8781j11420
13844A102536K21900j57698j31462M03678k63230j36511j4827j260n8638j15270
13834H49218P5620N658M42843m22919j01334L25565k50962N5303J19746j45164
13824I53574J55579l38812M26248l68381K53219n08956N96189l22110M31183m41648
13814H36085k9386O5099K85130r9424J25468l10187n7749j60053N03241J61685
13804A319909k71132k58931l7565o0292K56557k27150j913J52862k45016M01543
$$ plain form
13874 1449949 1204615 1362442 1258437 1105719 1279694 1195889 1806894 1274834 1486605 1042137
13864 1042137 830503 1309908 1007926 1080831 1275732 1063441 1007774 1192888 1177493 1155775
13854 1155775 1348322 1494050 1257188 1000860 1311074 1127722 1050639 1125175 1213956 1102536
13844 1102536 1324436 1166738 1035276 1438954 1175724 1039213 1024386 1023126 964488 849218
13834 849218 924838 930496 1373339 950420 849086 1174651 923689 978992 1098738 953574
13824 953574 1109153 770341 1196589 828208 1081427 572471 1168660 846550 1277733 836085
13814 836085 806699 871798 1156928 1057504 1182972 872785 815036 654983 1158224 1319909
13804 1319909 1048777 789846 752281 691989 948546 721396 719483 872345 627329 1028872
13794A028872p009j6954j82228J29147n3923J89210m85198M02104n8872l23396
13784F21753L20073j73586J12932k20646M88759n71388J34113L09202N5236l80199
13774F96249N6049K9256k9517j0387Q0614n1100L39329M7288m89532J05113K14001
13763I87363j88145k18325L63099k87511L83875l92780J10593j38407Q1967M03128
13753A104857l52060M6097k85194M8227K22819k59318K13511k57646k9261P9979
13743E32011L72651C47313O0768M82743k85442J31737J54093j04741q3393o8484
13733F34594l00492k1296K65561m9751L13279o4534k20999K54911l01211L22400
13723H32462k48632J60426J22170M3723k04374j71865A80318P46265l89106Q0405
$$ plain form
13794 1028872 1021863 1004909 822681 951828 897905 1087115 601917 1004021 945149 621753
13784 621753 941826 768240 881172 660526 1149285 577897 712010 1021212 1076448 696249
13774 696249 752298 781554 752037 741650 822264 771164 1110493 1157781 668249 773362 987363
13763 987363 799218 580893 943992 656481 1040356 647576 758169 619762 701729 1104857
13753 1104857 752797 798894 513700 561927 784746 525428 738939 481293 452032 532011
13743 532011 904662 347313 408081 890824 605382 737119 891212 786471 703078 634594
13733 634594 334102 312806 578367 528616 841895 777361 556362 811273 510062 832462
13723 832462 583830 744256 866426 910149 705775 533910 180318 926583 537477 617882
13713F17882O0608j56817N1718P227j11961K66322C06507K00221M9413k71120
13703B85021M36984l3814o7637B65867O40020l03154B56068L88834k94358K73038
13693F23582J04951l20239r8174P757L47516B97871L9377K98573j97802K64923
13683G02942j6134k79352O3723J81417K45945k12665k46188J08983J89642P8972
13673H17285l99571Q5015J09001q503j68176n6379j88163Q6621M85038j02013
13663F60155k17430p178q6557J83856B30356K00150Q5463k07628r5119J99451
13653D12673L58359l47760A39899l3554N52486p6165j24143J82799O8184C53777
13642F43843B65974K28793J1718L3882J38505j23396K11177l14975B22510L83539
$$ plain form
13713 617882 678490 521673 573391 580618 468657 734979 306507 506728 556141 285021
13703 285021 722005 688191 620554 265867 905887 602733 256068 644902 350544 623582
13693 623582 728533 408294 310120 317877 665393 297871 337248 635821 438019 702942
13683 702942 686808 407456 471179 652596 898541 685876 439688 548671 738313 817285
13673 817285 417714 502729 611730 603227 435051 378672 190509 277130 762168 660155
13663 660155 442725 435547 348990 532846 230356 430506 515969 308341 213222 412673
13653 412673 771032 423272 139899 106345 658831 582666 458523 641322 709506 353777
13642 643843 265974 494767 506485 540367 678872 555476 766653 451678 222510 606049
13632F06049j29493N5851J23186j69090L9095B46585J64732o855P2966j71828
13622C05600J53171P074J36382j72026J47529r6626d1727D03795j87100J43941
13612C60636p647J17367j00759J17743j85952B0647N08694l7480k44835M9644
13602B96670J60932k4284Q5160N1262k74401M14901q7891L3014k76707j81713
13592A96943i1393F43462B93318L45699q9844o5756B38476K20545b60298B05690
13581C12108L2519J52623I7905K91153r4724J54056L1321O4581k61621O0202j36705
13570B06168J7881K78310A94153J11984J61289B26795K12178j19828J45071j95552
13560B68664J7146H2176L49311k7599r9945E2247M4181J93287J11242K57130C12203
$$ plain form
13632 606049 476556 532407 655593 486503 525598 246585 411317 404462 477428 305600
13622 305600 458771 465845 602227 430201 577730 481104 -41727 403795 216695 360636
13612 360636 352989 470356 369597 487340 301388 20647 529341 491861 247026 296670
13602 296670 457602 433318 518478 569740 295339 710240 622349 655363 378656 196943
13592 196943 -91393 643462 293318 639017 549173 483417 238476 459021 -260298 205690
13581 312108 344627 497250 97905 389058 294334 448390 479711 544292 282671 342873 206168
13570 206168 224049 502359 194153 306137 467426 226795 438973 319145 464216 268664
13560 268664 285810 82176 431487 403888 303943 52247 96428 289715 400957 658087 312203
13548D58858A76371K37304j81748M17642C21594J4098K61365B95635j46199J41954
13538B91390H7161J30639Q9879m3598L87043k86636A08068j781J99977J56723
13528D62987J6786B20080K01927b4262B62977j23741J62345q1411J60397o9563
13518C11004J91117K84247B46003K45362a56359D57304A08982L18213A22468L43249
13508D65717k26605m1929J45160r3388L5919e4243B05790M95829k88635H1536
13497B8018M0502O3684n2000K63558j32480K42516b34058A64278J6151D0262L11069
13486C51331A53920L17047F327K00593M1576J26082j9848A06929L00797A88022
13475c6031D61904A95601K12762j93482J31323j5484o6213H7733C9062M03114
$$ plain form
13548 458858 176371 413675 231927 649569 321594 335692 597057 295635 149436 291390
13538 291390 87161 217800 307679 264081 651124 364488 108068 106287 306264 462987
13528 462987 479773 220080 422007 -24262 262977 139236 301581 220170 380567 311004
13518 311004 502121 786368 246003 491365 -156359 457304 108982 427195 122468 465717
13508 465717 239112 197183 342343 248955 284874 -54243 205790 701619 412984 81536
13497 28018 68520 132204 80204 343762 211282 453798 -234058 164278 180429 40262 351331
13486 351331 153920 470967 6327 206920 248496 374578 354730 106929 407726 188022
13475 -36031 461904 195601 408363 214881 346204 330720 264507 87733 39062 442176
13465D42176C7682B941N27575A90396K48585m1524Q9671j80573j48777l6323f6802
13453E9533J14218d3582A81528J0520J76844j5859j6466j9024m2596L2165K69670
13442E76782c8972C31639r8704a16257A37502k2569B5709J41740K89705k852A59396
13430E5960K03359b9176A14524J72806a50411A89880E8366J01432E5350O6485
13420A21835L5108K30421j68197q6739m3250K40982c3192D968M99972a95245A42496
13408C71003A04226L49623A6505b17253C44730i9723B23894L93212l04878Q4404
13398C96632A55047J55290A44327J65633R0964j68262K63312A11137L8457G2420
13387b3932j87955B82756R8639f4868G03466H5462K39609q9475q5352D1707K54762
$$ plain form
13465 442176 37682 2941 530516 190396 438981 397457 487128 306555 157778 121455 -66802
13453 59533 173751 -43582 181528 192048 368892 353033 336567 317543 274947 307112 576782
13442 576782 -38972 331639 232935 -116257 137502 114933 25709 167449 457154 454302 159396
13430 55960 259319 -29176 114524 287330 -150411 189880 58366 159798 55350 121835
13420 121835 156943 387364 219167 132428 89178 330160 -33192 4968 504940 -195245 142496
13408 371003 104226 453849 16505 -217253 344730 -99723 223894 617106 312228 396632
13398 396632 155047 310337 144327 309960 400924 232662 495974 111137 149594 72420
13387 -23932 -211887 282756 381395 -64868 703466 85462 325071 235596 150244 41707 296469
13376B96469I8103J0317K57553A39255J6996M35847H3784L18661j92625K63562
13366D73382k03994A16806g3269C99854A62602J42263a39621A43641r287G460
13355D73364A88684G0114N2953a16198B14498M27983k73606A52546J43428M5887
13345C41861j59644J59847C7600L46076n5675C9402L52865b2029A82041F9313
13334B46815L3004r6171J03320D2430J24362N0868J75269c9412A88399m1165J85516
13323C32750r5235J18252d8245A19390N521J02613J33124q7022F1517J65633J9530
13312B46680J83760F9074O5948m1679M08607r6982j29463c5083C36992j60332
13302A76660J29641j23771p4746a32924p982j27229B79288q7371J0533P8111h874
$$ plain form
13376 296469 98103 108420 365973 139255 156251 592098 83784 402445 209820 473382
13366 473382 269388 116806 -73269 399854 162602 304865 -139621 143641 134354 7460
13355 473364 188684 70114 123067 -116198 214498 642481 368875 152546 295974 341861
13345 341861 182217 342064 37600 383676 328001 39402 392267 -22029 182041 69313
13334 246815 279819 183648 286968 42430 166792 217660 392929 -39412 188399 147234 332750
13323 332750 237515 355767 -48245 119390 124911 227524 360648 273626 61517 227150 246680
13312 246680 430440 69074 135022 93343 501950 404968 275505 -35083 336992 176660
13302 176660 306301 182530 107784 -132924 -140906 -268135 279288 191917 202450 280561 -8874
13290a34269e128B16119j01356j8037K53947J79894b42285J12429D34578j9501
13280D15077A98629n057F847M4763P2359K22457C4410J80700N6836a90975C09527
13268B44260l6325J03973A53133i5330B78087n2256Q2162Q901o2895i9560H9581
13256B68312A22378J52362a93440C17667a02277e0862A30558K8523P5721j05100
13246A29702O0568J93276j18708r3907F5201L78903j00384A49985C6971i1891
13235h7145B48906N6856j01721k8612i9767D4999a2035j62073D55563a1623E22966
13223f4821H7089l133K11667k9853A06594K85738A8294L08932j54659a32425e7868
13211A02719L46245b21192B67731a68315M6252n2239B71022j6817G3835J92441
$$ plain form
13290 -134269 -5128 216119 114763 96726 350673 530567 -242285 -129856 434578 415077
13280 415077 198629 193572 6847 51610 123969 346426 34410 215110 271946 -190975 309527
13268 244260 207935 311908 153133 -95330 278087 225831 307993 316894 253999 -99560 89581
13256 268312 122378 274740 -193440 317667 -102277 -50862 130558 159081 234802 129702
13246 129702 190270 383546 264838 170931 65201 444104 343720 149985 36971 -91891
13235 -87145 248906 305762 204041 175429 -99767 44999 -12035 -174108 455563 -11623 522966
13223 -64821 87089 83956 295623 265770 106594 392332 18294 327226 172567 -132425 -57868
13211 102719 448964 -221192 267731 -168315 -122063 -174302 271022 254205 73835 266276
13201B66276f4549J8909D3249J85783L8770k6210a32011O1447B13275a26388B6844
13189H9390k6734b63540Q6271M7811b6596l8176A39796M2330m8354E867L68232
13178C74099a3279A72365M7132j2827o3761h2130B74539I6848D133a51968C8039
13166B79587b57655A58634e1951A83108C325a29647A45966a4700B42094N3686
13156B95780a02472C05185c2606J0951l52570b4147A25915J51878A22649e1883
13145f5616C48698A47832B9155F734L39186K15003B27530I1111b22051A18484
13134G722a14476L2223c6829j545p6274e2157A63194I874a84396E3685J47579
13123B01264g0082j68624A04246J06490I3334e9509F6688B1656K13924I126b06698
$$ plain form
13201 266276 -64549 -45640 43249 229032 267802 241592 -132011 -70564 213275 -126388 26844
13189 89390 62656 -263540 -177269 -129458 -26596 -64772 139796 182126 133772 5867 374099
13178 374099 -13279 172365 219497 206670 142909 -82130 274539 96848 4133 -151968 38039
13166 279587 -257655 158634 -51951 183108 3325 -129647 145966 -14700 242094 295780
13156 295780 -102472 305185 -32606 -21655 -374225 -24147 125915 277793 122649 -51883
13145 -65616 348698 147832 29155 6734 345920 560923 227530 91111 -222051 118484
13134 7722 -114476 -82253 -36829 -38374 -114648 -52157 163194 9874 -184396 53685 201264
13123 201264 -70082 -238706 104246 210736 93334 -59509 66688 21656 235580 9126 -206698
13111B53062g1097m3202L8137B1080N5917R6852a66832I1051j10e8460A12806
13099D5121K26714e8295k29600A02639r113r249g0102C79904p6523A34091C8116
13087A68223B0325P2855K25726J25468B12765h7757B0245a01559A48460k7099
13077A21361e0674B19569O4570e3360E990K19208G8268K10442F8432a41656j16178
13066b57834C89934A78984a1813j23926M3561E8344J11397K06460a22777B19446
13055A22973M19003a6178o2727D7918Q1161K42915g8511B88663a26008k26027
13045c52035B205J43790c81402B75819n7575J30093n9767j27143J00823j22151
13035A40099K65687F6114Q2037b77826B49572j1124p2269f2120D22334C2102h7577
$$ plain form
13111 253062 -71097 -114299 -76162 21080 76997 173849 -166832 91051 90941 -58460 112806
13099 45121 271835 -58295 -287895 102639 93526 84277 -70102 379904 303381 134091 38116
13087 168223 20325 93180 318906 444374 212765 -87757 20245 -101559 148460 121361
13077 121361 -50674 219569 284139 -53360 5990 225198 78268 288710 68432 -141656 -257834
13066 -257834 389934 178984 -11813 -135739 -92178 58344 169741 376201 -122777 219446
13055 122973 541976 -16178 -78905 47918 129079 371994 -78511 288663 -126008 -352035
13045 -352035 2205 145995 -381402 275819 218244 348337 288570 161427 262250 140099
13035 140099 405786 66114 148151 -277826 249572 238448 166179 -62120 422334 32102 -87577
13023b02872B43828p6608n1039J02999J64403c863C27731a78847D14930d0270
13012a05722q3799B25949i1363C12524b10871C63167G2731a5637A76928d4368
13001B38756j09825b72542I8036N4968J48403d262B81868P566K8501E3494K04312
12990B57806m1145K0292F7619J9328a03068C25902D6284O2071h2798A767g050
12978A58583R2090g9133r2543b6761A03384K51153j27166l9344G9261l0426J81153
12967B29988B0979Q5901e7042B57760G1093I478L04904j25203F2271L4077J46735
12956B43083A9021Q8484c47796a34069n9735c2675i190D6354L04946a46671c7152
12944H5623M8124a22899I8173K8284J25666o8975a6227F581L81879a06622B16035
$$ plain form
13023 -202872 243828 167220 116181 219180 383583 -3863 327731 -178847 414930 -40270
13012 -105722 -189521 225949 -91363 312524 -210871 363167 72731 -15637 176928 -44368
13001 238756 128931 -272542 98036 153004 301407 -4262 281868 289434 317935 53494 257806
12990 257806 216661 236953 67619 86947 -103068 325902 46284 108355 -82798 1767 -7050
12978 158583 250673 -79133 -171676 -26761 103384 354537 227371 188027 79261 48835 229988
12967 229988 20979 106880 -57042 257760 71093 9478 314382 189179 62271 96348 243083
12956 243083 19021 107505 -347796 -134069 -193804 -32675 -9190 46354 351300 -146671 -37152
12944 85623 133747 -122899 98173 126457 252123 183148 -16227 6581 388460 -106622 216035
12932C96248I2858J28329c1994G4396b12436B33302a37148k8748a1714k07416
12922b19130A052e1585A5821i445H2564A1129b05099B34683m2248K51858I7970
12910F1639k0963a09272n119k64669B7387K01948h6492B887b85554A79158c10653
12898B54525A22437a35847c097A41192f2762l6156A01186m7871a85529R130J7694
12887a58705K2900A85751h2880j1593H7346B9505i9832H8078O1556J70605A12604
12875h9993A3663K71332H4820k8035c18263B13515b70C8846a29068C06005A19844
12863A11284M91b52291F6789L9659j5771c6461k51275B25143L8016h9445H4251
12851b43244A97459r748E9838J13697i2900r8586I9002m2250M5355i4139B74550
$$ plain form
12932 396248 92858 221187 -31994 74396 -212436 233302 -137148 -165896 -11714 -219130
12922 -219130 1052 -51585 15821 -9445 82564 11129 -205099 234683 192435 444293 97970
12910 61639 40676 -109272 -114391 -379060 27387 229335 -86492 2887 -285554 179158 -310653
12898 254525 122437 -135847 -3097 141192 -62762 -98918 101186 53315 -185529 -176399 -158705
12887 -158705 -135805 185751 -82880 -94473 87346 29505 -99832 88078 149634 320239 112604
12875 -89993 13663 284995 84820 56785 -318263 213515 -270 38846 -129068 306005 119844
12863 111284 111775 -252291 66789 106448 90677 -36461 -287736 225143 263159 -89445 84251
12851 -243244 197459 187711 59838 173535 -92900 -191486 99002 56752 102107 -94139 274550
12839a86956A33536m0241c5746k68354j48820A47116N1094G0241c32845B43513
12828B81525b65806b2508D13694E3832B3600a53337d4647B8543J01722E3453O5625
12817A19078F150c71697a72601A29599K63193c777l8463G0475b35336J4140R7422
12806a23774A90756b11281p3021D1040b6198m7931l4778l2654G0984b50082B7318
12794B82674e3225K4441j08856F8383c9287k07076a02470D7494a49346A32451
12783A5914f6191k50351I0991d45417A24193b58579E8199b42922B16669J26364
12773C43033F0381Q8398J24152I8590a35821a4125j8087l6839B05794E0460J37586
12762A88046o2239m4364I98K36994a99045A46188D4484q935J46450a59846A0556
$$ plain form
12839 -186956 133536 93295 -35746 -304100 -452920 147116 198210 70241 -332845 243513
12828 281525 -265806 -22508 413694 53832 23600 -153337 -44647 28543 130265 53453 119078
12817 119078 6150 -371697 -172601 129599 392792 -3777 -42240 70475 -235336 -221196 -123774
12806 -123774 190756 -211281 -284302 41040 -26198 -74129 -108907 -141561 70984 -250082 27318
12794 282674 -53225 -28784 -137640 68383 -39287 -246363 -102470 47494 -149346 132451
12783 15914 -66191 -316542 90991 -445417 124193 -258579 58199 -242922 216669 343033
12773 343033 60381 148779 272931 98590 -135821 -14125 -32212 -69051 205794 50460 188046
12762 188046 125807 81443 998 237992 -199045 146188 44484 35549 181999 -159846 10556
12750A89986B4592O4943d7155b1148A18885bj97658I6167L48982a9162C83053
12738B04707a35436p5473H1128J83774c55063f7273b6681q3636r3613A39964k4300
12727A15664P2895b21475D7089a69493g6584l27117h2077Q320j37772l6189A49607
12715D6084i4030k65111J58410h7508k69150C99000A77652J63924a75814G9887
12704B98886K29640j38876A42310C2735J66982H0966b02876d0207A8984P9047
12694I8031K12874j40424o0666P1644A3987d9633j518J5917B37689F9951A9053
12682C96614a61236B48678N9971a41679B11189i4532A88723B9088J00279m3678
12672H5689c20238B72598d385B84239A29158B5729J89426F2062P7595P0652a87298
$$ plain form
12750 189986 24592 89535 -47155 -21148 118885 -2 -197660 96167 445149 -19162 383053
12738 204707 -135436 -210909 81128 264902 -355063 -67273 -26681 -110317 -203930 139964 115664
12727 115664 188559 -221475 47089 -169493 -76584 -403701 -82077 -73757 -211529 -247718 149607
12715 46084 -94030 -359141 -200731 -87508 -356658 399000 177652 341576 -175814 79887
12704 298886 528526 389650 142310 32735 199717 80966 -202876 -40207 18984 98031
12694 98031 310905 170481 109815 181459 13987 -49633 -51151 -35234 237689 69951 19053
12682 396614 -161236 248678 308649 -141679 211189 -94532 188723 29088 129367 85689
12672 85689 -320238 272598 -4385 284239 129158 25729 215155 62062 139657 210309 -187298
12660A97211q7417D441b13025E4284L431J64115l2952p7277b89187D8650E927
12648B77968E0954K5191P1804C7281K23547c8711j28308e6621A9799J60757i7477
12636h7032b4885A2818L47044D4343a64888C43258e3912D10280G3222M19072D1582
12624B72018A17226M4732K63887A50940L55469D6390f0878D9335c39902B42118
12613A7827N9228K35572C4516e673C62006E0220b60749l53605B45925a0186p718
12602a7904A84770J17458a22269j36590A30379J29232n5297a25153A07466P6666
12592A84132J30841f8147j01128h0111C9024a60419c1150k1908K6043C3337K83187
12581C16524a25525A69494c00091h900j67772A03525b38654A61876K6856b20343
$$ plain form
12660 197211 109794 4441 -213025 54284 57715 221830 188878 111601 -289187 48650 5927
12648 277968 50954 76145 147949 37281 260828 -38711 -167019 -56621 19799 180556 -97477
12636 -87032 -24885 12818 359862 44343 -164888 343258 -53912 410280 73222 492294 41582
12624 272018 117226 161958 425845 150940 506409 46390 -60878 49335 -339902 242118
12613 17827 77055 312627 34516 -5673 362006 50220 -260749 -614354 245925 -10186 -17904
12602 -17904 184770 302228 -122269 -258859 130379 259611 204314 -125153 107466 184132
12592 184132 314973 -68147 -169275 -80111 39024 -160419 -31150 -53058 -27015 33337 316524
12581 316524 -125525 169494 -300091 -8900 -176672 103525 -238654 161876 188732 -220343
12570A81462b14400d2605n6464L3218A11535a84772I3375l1986f3171I1044P1211
12559A62255a51583B40020b68165b6428A34373M509c14629I3932D069P7952R0127
12548A72148B2653K99063a69792k39197g1636l65620A69092D8186J69000a64904
12537F6303R6353Q007b13549A24769J07780a451C0751J40411h0908A24290P5142
12526A99432a28753H9404K24562I8615j502a53894J9274M7365A56727F5706k3135
12515D2571p002K06099a12304k00922A97217b22411j47116C14923a04046F7788
12504D0581J6702e2640q7463C47212d8437F0958j1305b67050J30166K9587B32955
12492h461j70461L2755B09500j04093b4561j85952a5322G3768a07558k70754J18658
$$ plain form
12570 181462 -214400 -42605 -99069 -65851 111535 -184772 93375 61389 -63171 91044 162255
12559 162255 -151583 240020 -268165 -26428 134373 138882 -314629 93932 4069 82021 172148
12548 172148 22653 321716 -169792 -408989 -71636 -437256 169092 48186 217186 -164904
12537 66303 162656 170663 -213549 124769 232549 -1451 30751 171162 -80908 124290 199432
12526 199432 -128753 89404 313966 98615 97113 -153894 -134620 -87255 156727 65706 42571
12515 42571 35569 241668 -112304 -313226 197217 -222411 -369527 314923 -104046 67788
12504 40581 57283 -52640 -140103 347212 -48437 60958 49653 -267050 -136884 -107297 232955
12492 -8461 -178922 -146167 209500 105407 -24561 -210513 -15322 73768 -107558 -378312 -259654
12481b59654B48052r6661N0550d99453C9364j8668L44542a83882A04117M6190
12471A50307j0937b5150A02140D5421L4778g20808G319a65911A45544b10430B7826
12459D1356a3859C4283J08326i218F6747J19686G6704K9241K54333A22910b98894
12447a79423p603F6812a62136B09981E6145A4327Q6409B9315K01250n9427E4721
12435A41906b46459A70016a48526j80723E414M0460J57338a75781N5779B54998
12424B7831P9936c7925j61229L7601F3112h5957A46019J70364A27027M8179K23978
12413C99184e1157j73314A92526J86963a77712g9831l15238A71322L4438E6979
12402b30792k20524a19088I7397R8404R4228c6530a2316B09872a15952j0253H8541
$$ plain form
12481 -259654 248052 151391 201941 -499453 39364 20696 365238 -183882 104117 150307
12471 150307 139370 -25150 102140 45421 80199 -720808 7319 -165911 145544 -210430 27826
12459 41356 -13859 34283 142609 -9218 66747 186433 76704 105945 360278 122910 -298894
12447 -179423 -187026 66812 -162136 209981 56145 14327 100736 29315 230565 171138 54721
12435 141906 -246459 170016 -148526 -329249 5414 45874 203212 -175781 -120002 254998
12424 27831 107767 -37925 -199154 -161553 63112 -85957 146019 316383 127027 175206 399184
12413 399184 -51157 -224471 192526 379489 -177712 -79831 -395069 171322 205760 56979
12402 -230792 -451316 -119088 97397 195801 290029 -36530 -12316 209872 -115952 -126205 88541
12390b79532m355A41246c40510B46348b6634o122J1389A24769e2803F5295a7068
12378A31348K3417n6918j8454J0784J01931J53083b37631A48413B5089K64483
12368B89572a10661B70590a08479F2693k3969n796M3691q242Q803a53097b5884
12356b97857a30453L9790C14704I5701c6456b629C4418J45974m7315c9598j71914
12345b11512i7290B16941E2904b34991B58367j17560a37186B96771a19742d3540
12334H319b7070j17546j32726e4536l01016F9204J5483K29821b93755B00440f7157
12322A17806a45270l4050a0144A7328c353B16549a34063D5789d7185A597L21992
12311C23589C4649b59995E9798K18997g7057e570j95651A07678J19081a10615
$$ plain form
12390 -279532 -283887 141246 -340510 246348 -26634 -32756 -21367 124769 -52803 65295 -17068
12378 131348 154765 97847 79393 90177 192108 345191 -237631 148413 25089 289572
12368 289572 -110661 270590 -108479 62693 38724 32928 76619 68377 77180 -153097 -25884
12356 -297857 -130453 -90663 314704 95701 -36456 -2629 34418 180392 133077 -39598 -211512
12345 -211512 -97290 216941 52904 -234991 258367 140807 -137186 296771 -119742 -43540
12334 8319 -27070 -144616 -277342 -54536 -355552 69204 84687 314508 -293755 200440 -67157
12322 117806 -145270 -179320 -10144 17328 -3353 216549 -134063 45789 -47185 1597 323589
12311 323589 34649 -259995 59798 278795 -77057 -5570 -201221 107678 226759 -110615
12300A38422J20773C9990g5900j44562h0396L8447B37159J19761j4131F9636J38603
12289B08239J46064a21062r5947M8346P7835k9826j5017e4787a7874A78705J42639
12278C21344E236J53626J98869j70086m081J19191j01985Q0746m8077r2085B3270
12266B64257H9818b40092C8892J09146J01121d02G6521J89264e351B5962L38703
12255C64665A47344b42866a8454H5499C2783K28119b88427C22392G9324J89558
12245B68882r4489D2878J35991F4824K7293f5956G8717Q4447c5861A53773e8409
12233A61690b39330a16773A77956c82662B37869i8892C36732A56056J24236A0724
12222A06556m0703J46954P2753K1133E2748g0628q5124D93035b93740A24928H051
$$ plain form
12300 138422 259195 39990 -75900 -220462 -80396 -41949 237159 356920 342789 69636 208239
12289 208239 354303 -121062 -217009 -168663 -90828 -120654 -135671 -54787 -17874 178705 321344
12278 321344 5236 158862 357731 187645 183564 302755 200770 281516 233439 141354 23270
12266 264257 89818 -240092 38892 148038 249159 -402 76521 265785 -5351 25962 364665
12255 364665 147344 -242866 -18454 85499 32783 260902 -288427 322392 79324 268882
12245 268882 174393 42878 178869 64824 92117 -65956 78717 163164 -35861 153773 -58409
12233 161690 -239330 -116773 177956 -382662 237869 -98892 336732 156056 280292 10724
12222 106556 65853 212807 285560 306693 52748 -70628 -155752 493035 -293740 124928 8051
12210A31212c8280I3012i5029A07841M5497a25595E29503k43005d3415E5527a34734
12198H4934a60753A76284B1435J3008K69469F8080N8451k4898M695A5171J09792
12187A24963d4925l4069L1166A32242N2342J87131L3719g2065D4367J07575J8346
12176A70288k1045r372M10707a39926G7467k3311L69312e0072A19635a4263j35936
12165a50199f0554B12323a35398D8300l630N1042J73525e3524k32314g444p7561
12154h5005a1975q4728C63295o7676E9785J52384K8912G1510e4383C0918a2476
12142H652L01518b06723m7074C17358j35146b18772O3653C11744J15809g8324
12131A2357K00512F0754i7520J2022G9609C2422b2236j8063b121A69418c7225
$$ plain form
12210 131212 -38280 93012 -95029 107841 153338 -125595 529503 286498 -43415 55527 -134734
12198 84934 -160753 176284 21435 34443 303912 68080 126531 101633 106328 15171 124963
12187 124963 -44925 -78994 -47828 132242 184584 371715 405434 -72065 44367 151942 170288
12176 170288 149243 139871 550578 -139926 77467 54156 423468 -50072 119635 -14263 -150199
12165 -150199 -60554 212323 -135398 48300 44670 95712 269237 -53524 -285838 -7444 -85005
12154 -85005 -11975 -96703 363295 295619 59785 212169 241081 71510 -54383 30918 -12476
12142 8652 310170 -206723 -253797 317358 182212 -218772 -155119 311744 427553 -78324
12131 12357 212869 60754 -97520 -85498 79609 32422 -22236 -40299 -2121 169418 -37225
12119E5193K09867j30329C2649R7147a65709j07608N9320R0223m973F1646b58350
12107b62455a29774A76020F2506a91962j31785A10204d3241j53545h6248b9050
12096c03692J35522j01298A20765E0282d071m22808a35995d700j46999C84934
12085a34768C97085A00711K55500c8608l7458A84746J12412a16263C74036j63145
12075B10891c74074P3081D18909r6313j18321N46208P1853l58492j42569k2536
12065B98739n4014J18578g3045B86662D0618f7556D2230b18414Q1065C20545E7690
12053c3316A30940d82174a92455A83934J37794c27715A71606l4716J16890a16132
12042C40826d5666C11545i0243j20345M1986B65171B3177b17504C66584a38570
$$ plain form
12119 55193 265060 134731 32649 129796 -165709 -273317 -213997 -123774 -128747 61646 -258350
12107 -262455 -129774 176020 62506 -191962 -323747 110204 -43241 -196786 -86248 -29050
12096 -303692 -168170 -269468 120765 50282 -4071 -426879 -135995 -4700 -151699 384934
12085 -134768 397085 100711 356211 -38608 -76066 184746 297158 -116263 374036 210891
12075 210891 -374074 -300993 418909 322596 204275 750483 822336 463844 321275 298739
12065 298739 244725 363303 -73045 286662 40618 -67556 42230 -218414 -137349 320545 57690
12053 -33316 130940 -482174 -192455 183934 321728 -327715 171606 136890 253780 -116132
12042 340826 -45666 311545 -90243 -210588 -168602 265171 23177 -217504 366584 -138570
12031b0943E856a76312B11078J52035I7059l2666K2270L1056m7497K0897a38094
12019D1171K3075a79727O6562b7772D1405b95540J16701j45677A52355a3167A80339
12007b85335C6223J07597e8222D9331a71217a0768A14259C5426d0846A07540b0012
11995A76057F773b2556r7258A08370e0571B09074a28333n5219A11861d84032a56
11983b01773B37837l9269g6707j51016A87946m5245d6643j44368e9197o8403k5590
11972a53190a4388D6467q885J44855a07339B01526A9979a18771e3020k413j01865
11961a57298k17729f1380j56732A4336J49998b43836H8378A6348L65868E7921
11950a62979A89556h4474A25744O0554b3439O849k64832D5659J56680F4278J02554
$$ plain form
12031 -20943 5856 -176312 211078 363113 97059 64393 86663 117719 70222 91119 -138094
12019 41171 64246 -179727 -113165 -27772 41405 -295540 -178839 -324516 152355 -13167 180339
12007 -285335 36223 143820 -58222 49331 -171217 -10768 114259 35426 -40846 107540 -20012
11995 176057 6773 -22556 -119814 108370 -50571 209074 -128333 -183552 111861 -484032 -156
11983 -201773 237837 198568 -76707 -227723 187946 142701 -46643 -191011 -59197 -127600 -153190
11972 -153190 -14388 46467 37582 182437 -107339 201526 19979 -118771 -53020 -55433 -157298
11961 -157298 -375027 -61380 -218112 14336 164334 -243836 88378 16348 382216 57921
11950 -162979 189556 -84474 125744 186298 -23439 -16590 -281422 45659 202339 64278 166832
11939A66832b66880d645j22968j54568G4279k7575A7735h668D74036a6422B56020
11927H0404M0127k7941f7520r2903j92710B1222J54499i2415l747M4083j96337
11916b48416A00493l1566b04296O080B98196O2982g4732p0184k967G6246O1176
11905A37422b48542k857C48310i0110K1950n23210I4071a79810r7450c6840j8293
11894e5133n7042F7891K73645D9422Q418b96273g6789D8476K4687a16521B01705
11882c57648A51338a872A193K82114a27472j73636C2225a00085B47375A08487
11871a25166B12589r6950c84504B83490D5144b36953B5724a58638j6752j1254
11861a86644k60831A43379l9100J27475g4377l42500i5224o2704P8745B7385b62664
$$ plain form
11939 166832 -266880 -4645 -127613 -282181 74279 46704 17735 -8668 474036 -16422 256020
11927 80404 120531 92590 -67520 -160423 -353133 21222 175721 -92415 -96162 -52079 -248416
11916 -248416 100493 68927 -204296 -198216 298196 361178 -74732 -144916 -147883 76246 137422
11905 137422 -248542 -251399 348310 -90110 -68160 -591370 94071 -179810 -277260 -36840 -55133
11894 -55133 -112175 67891 341536 49422 57840 -296273 -76789 48476 73163 -116521 201705
11882 -357648 151338 -1872 1193 283307 -127472 -301108 32225 -100085 247375 108487
11871 -125166 212589 115639 -384504 283490 45144 -236953 25724 -158638 -175390 -186644
11861 -186644 -447475 143379 104279 231754 -74377 -416877 -95224 -157928 -79183 27385 -262664
11849C2119g9393B82496c27562a47033m3535C93086A4015c37601O0915a12939
11838D3340a42513j30065C695b93566g1138A85609b9231j36004b7771j98592a9421
11826B11625F8299K7362a74673P3288k3305e8242p281l18021N7288F5091a87803
11814a93118i4935j46393a566A18938b1240B5252b9132H257a22386r115H0771
11802c3545A38335g8005L6907p9946H6696b58095f4802J7224j13548A13760B4607
11790b1920B8325i438k57021h8151F7618f0250l2016j12741B21959b78168G9508
11778B00264G4921c6473h154j97334C2110b23311h2610A03221b8499p8752q3112
11767a90363D4797b05337A94363a28038O3244A83328p3966M4257G856L21339H0810
$$ plain form
11849 32119 -79393 282496 -327562 -147033 -190568 393086 14015 -337601 -276686 -112939
11838 43340 -142513 -272578 3695 -293566 -71138 185609 -29231 -165235 -27771 -226363 -19421
11826 211625 68299 95661 -174673 -101385 -124690 -58242 -65523 -383544 -326256 65091 -187803
11814 -193118 -94935 -241328 -1566 118938 -21240 25252 -29132 8257 -122386 -131501 80771
11802 -33545 138335 -78005 -41098 -121044 86696 -258095 -64802 -47578 -161126 113760 24607
11790 -21920 28325 -9438 -266459 -88151 67618 -60250 -92266 -205007 221959 -278168 79508
11778 200264 74921 -36473 -8154 -205488 32110 -223311 -82610 103221 -28499 -107251 -190363
11767 -190363 44797 -205337 194363 -128038 -64794 183328 109362 153619 7856 329195 80810
11755c3763B52618L6875n3664b91463A771J16887n3643d33620c7355A21436b66201
11743a7643E5549k5804d2813B48652e4332k20126H9629b8504l20j99984A27859
11731A94025e7017n4656A23497J06594a14114O683m09613a54676F4501a69054
11720B54358g4713A48576o7346h9382A13348c25074A14856b83453A6850M24563
11710D41413b29555R8607O41D9842a43417n5630Q8591A35651a18607G0675B8093
11698c73330C07755j05384M7560q3370p3128K6145A7595O39018B08987p8016C1709
11686E7784J63240a16992A45493J00418k1658b63420b771D55711l1225D3227J38825
11675A82052L8603A1759g2201a9435D4494e0589k98113J65951A44539b32218B27551
$$ plain form
11755 -33763 252618 289493 235829 -291463 1771 118658 65015 -433620 -37355 121436 -266201
11743 -17643 55549 29745 -42813 248652 -54332 -274458 89629 -28504 -28824 -228808 127859
11731 194025 -57017 -111673 123497 230091 -114114 -107431 -517044 -154676 64501 -169054
11720 254358 -74713 148576 81230 -89382 113348 -325074 114856 -283453 16850 441413
11710 441413 -229555 -130948 -130307 49842 -143417 -199047 -110456 135651 -118607 70675 28093
11698 -373330 307755 202371 249931 166561 93433 119578 17595 656613 208987 130971 31709
11686 57784 221024 -116992 145493 245911 224253 -263420 -2771 455711 424486 43227 182052
11675 182052 220655 11759 -72201 -19435 44494 -50589 -348702 -182751 144539 -232218 227551
11663B19270a56907A90451a39973C05979k8283a33900A4372i5965k00377F339
11652B11155R3031a82369N743M3810B763J91710J08536f0227B71630G2302a51241
11640A96343A4028K55022h4132q7867G5878c6454A6243a23945n7229h5036C10304
11628B90040D4086K3076K24869a60095H1018l9283h349D7676a04975A61184G2572
11616A82897b84217A08708d13202f6240B68848a59674A42769A1362b21874D8636
11605H6669a24412j40729h0229j2276j73844B53712i253k33384B33452b28651
11594a6036H72K50606b4633d511A64279a46506M9358n4883C57548n5754r4906
11583B06888b18860C4047a12561D167L75380a86882B33460A1394b741j86203A1327
$$ plain form
11663 219270 -156907 190451 -139973 305979 277696 -133900 14372 -95965 -296342 6339
11652 211155 304186 -182369 -176626 -132816 2763 194473 303009 -60227 271630 72302 -151241
11640 196343 14028 269050 -84132 -171999 75878 -36454 16243 -123945 -181174 -85036 310304
11628 290040 44086 67162 292031 -160095 81018 41735 -8349 47676 -104975 161184 72572
11616 182897 -284217 108708 -413202 -66240 268848 -159674 142769 11362 -221874 48636
11605 86669 -124412 -265141 -80229 -92505 -266349 253712 -9253 -242637 233452 -228651
11594 -16036 872 251478 -24633 -4511 164279 -146506 -97148 -152031 357548 301794 206888
11583 206888 -218860 34047 -112561 4167 379547 -186882 233460 11394 -2741 -188944 11327
11571C22351g2037l5717n495B13012q6492o1336c6967r966C88547A89150E4312
11559a533I0979J35252A08227e9135p4428a0238H414P2900a38914M6896A04268
11547C3748L89761j68115a57992A83144f914j62268B67516p3846F9495N3183N038
11536A27716P1179p1348b37187a5403A34767L0625A370a15961I4100R7174a96940
11524a08770H9615P9271E8318N4751B9284L15587F7814q960R3576k3352K38836
11513C67914A33055L39286j11999A60568O3753a75038b2720m0414A54459M1282
11503A95741R1159K30702a85936B17461C6645M17001h7103A73622l0038q200M95925
11492F31309B86825a91870B66246p0890R1508A28961c0021r5472C06568C4375
$$ plain form
11571 322351 -72037 -107754 -113249 213012 126520 65184 -36967 -46933 388547 189150 54312
11559 -1533 90979 226231 108227 -59135 -133563 -10238 8414 81314 -138914 -92018 104268
11547 33748 423509 255394 -157992 183144 -6914 -169182 267516 193670 69495 122678 127716
11536 127716 198895 127547 -237187 -15403 134767 165392 1370 -115961 94100 191274 -196940
11524 -108770 89615 168886 58318 113069 29284 344871 67814 58854 152430 129078 367914
11513 367914 133055 472341 360342 160568 224321 -175038 -22720 -63134 154459 195741
11503 195741 286900 517602 -185936 217461 36645 453646 -87103 173622 143584 135384 631309
11492 631309 286825 -191870 266246 195356 286864 128961 -30021 -125493 306568 34375
11481I9635a74352A89318J80149j44360K04283a99949A5972a66155A74249Q3753
11471B58002j2284J05909A54692j6998K6188a63240e1868C40390A08067a03996
11460D0875d447l7610D45364D8068f1294A17934c73469d4888l135A07862K47029
11449C54891j73630a23900r464F8894a51172A63256l2710e425l5990j46725E964
11437B15243a23178B78581r0102b6269k28445A40944i0125p879B31048H2185l651
11426G8534L88675E3513a75913L2874l804e5072K233a4562j10807e0525A6287
11414A51429e24265f7354k2757j78020b5193D68420A6681e1882E5863K11404j16824
11403A50443b09179M1407c5115m3057a9226j40641C5178N5270e1861k04946E7792
$$ plain form
11481 99635 -174352 189318 369467 225107 429390 -199949 15972 -166155 174249 258002
11471 258002 245718 351627 154692 137694 163882 -163240 -51868 340390 108067 -103996
11460 40875 -4447 -42057 445364 48068 -61294 117934 -373469 -44888 -48023 107862 354891
11449 354891 181261 -123900 -133364 68894 -151172 163256 130546 -5425 -41415 -188140 5964
11437 215243 -123178 278581 188479 -26269 -254714 140944 -90125 -98004 231048 82185 78534
11426 78534 467209 53513 -175913 -143039 -146843 -55072 -52839 -14562 -125369 -50525 16287
11414 151429 -524265 -67354 -90111 -268131 -25193 468420 16681 -51882 55863 267267 150443
11403 150443 -209179 -167772 -35115 -78172 -19226 -159867 35178 90448 -51861 -256807 57792
11391e0377I0348b70526A2356K9371a6339g856q2883C9383M9929c19096Q0067
11380b39029A31004P0119g9566e53B57704G8164b88887B22380r2620d8273C2698
11368B40348a78362C79237a69871B42831G8247C5778J3134e4111B29360a11823
11357a82248c3053k50508A20250K48822j09802a78846B95341D7600K2584M9356
11347A19540j9991J73495A16554d42595c8772A42997e7209k3918c3994B89600
11336B58896b41101A23804b33176j7077e6887o3894E6912j8986g5225A09215b0219
11324B04705G9574e2715G9995g6983a7198k14698h2983B5094j96f2098B24205
11312C5929c3627A68575a76820B40444a60650c0842k07165A51291p3338a17830
$$ plain form
11391 -50377 90348 -270526 12356 41727 -16339 -7856 -90739 39383 89312 -319096 -239029
11380 -239029 131004 201123 -79566 -553 257704 78164 -288887 222380 129760 -48273 32698
11368 240348 -178362 379237 -169871 242831 78247 35778 48912 -54111 229360 -111823
11357 -182248 -33053 -283561 120250 369072 259270 -178846 295341 47600 70184 119540
11347 119540 99549 273044 116554 -442595 -38772 142997 -57209 -81127 -33994 289600
11336 258896 -241101 123804 -233176 -250253 -56887 -120781 56912 37926 -75225 109215 -20219
11324 204705 79574 -52715 79995 -76983 -17198 -231896 -82983 25094 24898 -62098 224205
11312 35929 -33627 168575 -176820 240444 -160650 -30842 -238007 151291 77953 -117830
11301b29446A12014d1523r0769p3808F8189b72508F3804N9757b7328B31934j08199
11290A23735e5312j44195O1442M3158k07166J31104B02089l0441P6138a90921
11279B07593a67174j06763A40040i3411a1033G3215m447a12962B74921j25928
11269A48993d3011A9108b67309h6438B8960a5893n33393a42158C8743c5442j5503
11258e0945o4290p2819m06433b56828a20353G4556c39810F6101a92774L0356C31775
11246b12006N2891L5082e6352J6472I6756j5597B2703J15757n4047N5900c84929
11234f0036A87920a19945A10000f739A86066n6999f7845j02156d5552j07471B11215
11222D1570B367a70072B7339b24015C08044j26861b51226B8777R6467d2418j08997
$$ plain form
11301 -229446 112014 -41523 -132292 -206100 68189 -272508 63804 123561 -27328 231934 123735
11290 123735 -55312 -199507 -138065 -94907 -302073 -170969 202089 171648 247786 -190921
11279 207593 -167174 -273937 140040 -93411 -11033 73215 68768 -112962 274921 148993
11269 148993 -43011 19108 -267309 -86438 28960 -15893 -549286 -142158 38743 -35442 -50945
11258 -50945 -115235 -188054 -594487 -256828 -120353 74556 -339810 66101 -192774 -162418 331775
11246 -212006 -159115 -124033 -56352 -39880 96756 81159 22703 138460 84413 140313 -384929
11234 -60036 187920 -119945 110000 -6739 186066 129067 -67845 -170001 -45552 -153023 211215
11222 41570 2367 -170072 27339 -224015 308044 181183 -251226 28777 125244 -42418 -151415
11211a51415I1197K1011c8193B85633e01006a60983q9799j9826M7587E4575E818
11199a2288m3539k8867j79253G3995J62876c5565A3769b27234H3643J18509a31105
11187A2231b02757d4267A8572a18822j9889j34517A4175J83148b97378i4098L961
11176i0137j55059A09891b62845j88935i6265B87a07960N3083E8330a84872A34835
11164b63617c2844A32992b29368A08009D8030O4078e094A8593P9932A1108a27397
11152H1406b6915E7242a50289E9924K80659A20851g5105j37300A02727p625a6082
11140a55909J9923D2555Q4159c73872E8005a86555A05253K5624f509l3826F2685
11128I9464M0668a3623r6326L5836K6392H8603O0199c2739p5025C22306b2530
$$ plain form
11211 -151415 91197 112208 -38193 285633 -501006 -160983 -250782 -270608 -223021 54575 5818
11199 -12288 -55827 -84694 -263947 73995 236871 -35565 13769 -227234 83643 202152 -131105
11187 12231 -202757 -44267 18572 -118822 -138711 -273228 14175 197323 -297378 -94098 -90137
11176 -90137 -245196 109891 -262845 -451780 -96265 287 -107960 -54877 58330 -184872 134835
11164 -263617 -32844 132992 -229368 108009 48030 112108 -5094 18593 98525 11108 -127397
11152 81406 -26915 57242 -150289 59924 340583 120851 -75105 -212405 102727 95102 -16082
11140 -155909 -135986 42555 126714 -373872 58005 -186555 105253 130877 -6509 -40335 62685
11128 99464 140132 -13623 -109949 -74113 -47721 88603 148802 -32739 -107764 322306 -22530
11116B954f3530J6348n5720A27709A5803L73659A2629j881L07386A55333c92531
11104a7543j21797e006E08261j91589e2553C98076j18713C2485K24928r2904p1599
11093I2910K11242a65500C25856d4805B11822J13875B446L87597j89392K25713
11083D26364E4338J04791O0664G0149J90084H7718L37608J05017b7571D74948
11072A10454L28963A71341J0603K75903B12532O8517J26712A27198L10526K93523
11062G31247C36520L78814k23170J59269J03861j41105J20131k72388K48347j70564
11052E39715J64764l20325P18625l15287j11232J80737l99634J23639J87668k66094
11042E02576M19190l53547k54965J86771Q8830K76082k99866j30602P038J40092
$$ plain form
11116 2954 -63530 -47182 -102902 127709 15803 389462 12629 10748 318134 155333 -392531
11104 -17543 -139340 -5006 508261 316672 -52553 398076 279363 32485 257413 164509 92910
11093 92910 304152 -165500 325856 -44805 211822 325697 2446 390043 200651 426364
11083 426364 54338 159129 219793 70149 260233 87718 425326 530343 -27571 474948
11072 110454 439417 171341 181944 457847 212532 281049 407761 127198 437724 731247
11062 731247 336520 715334 492164 651433 755294 614189 734320 461932 710279 539715
11052 539715 704479 384154 1102779 787492 676260 856997 457363 581002 768670 502576
11042 502576 921766 568219 313254 500025 588855 864937 565071 434469 441507 581599
11032E81599j11501L45836r2619O9197J91695j63347M616l3786j1105o2762J04162
11021H21985R5581j51256R2903l17128p4616M44967l10468j68596p0895J79464
11011E41941M62938D84784J27365J22636j76813J33821L6734K98594m23914m7687
11001E55520k27595M24722j45380q3746N1295J99062k8021n2242j12551K24759
10991H05823k55567L02972o5222Q9451C90277N48345j17807K55728k07066K22729
10981A092206M9583N77598k92206L91036j74648J78551J23693L78183J42578K4298
10971B490872Q2291J93807l40323k11124L25001m03442k90347J87492l03014p5681
10961A655532J07697n1674O315L8569o6612k10423j2755k5725l62940k2103K31177
$$ plain form
11032 581599 470098 815934 723315 792512 984207 820860 825476 791690 780585 717823 821985
11021 821985 917566 766310 859213 542085 467469 912436 601968 433372 362477 541941
11011 541941 1004879 484784 612149 734785 557972 691793 728527 1027121 603207 555520
11001 555520 327925 752647 607267 523521 574816 773878 745857 693615 581064 805823
10991 805823 550256 853228 788006 877457 390277 938622 820815 1076543 869477 1092206
10981 1092206 1141789 1719387 1427181 1818217 1643569 1822120 1945813 2323996 2466574 2490872
10971 2490872 2573163 2766970 2426647 2215523 2540524 2137082 1846735 2034227 1731213 1655532
10961 1655532 1763229 1711555 1717870 1756439 1689827 1479404 1466649 1440924 1077984 1055881 1287058
10950A287058n50174J50969J57356m52933j69949K65681k19155A65272J61473
10941C26745K193K942n1112I3803K99139d111D04681a41188C33371A21259n7885
10930F3374K03983L1050J74679A71K91159A30229M03961A88948n8434a24039j3541
10919a37580c0253B26907K9712j1286A12325a58636A68997K0464a93142a0205
10908e7784j37900o9470i7631q0789I6369p320a09673G6806f9580A89332a71559
10896A26477b43817B35714a72452A58534a92754I5114c3126D8178L12990A5163
10885E4387a97198L867p8141B90353a3185k2899I6134D7266b02949J00608F512
10873a98484B54648a04030B54946C4125f9415A53566C0324K04661d4173A96419
$$ plain form
10950 1287058 736884 887853 1045209 592276 422327 688008 468853 165272 326745
10941 326745 328938 331880 280768 93803 392942 -4111 404681 -141188 333371 121259 63374
10930 63374 267357 298407 473086 171 291330 130229 534190 188948 130514 -124039 -137580
10919 -137580 -30253 226907 256619 245333 112325 -158636 168997 189461 -193142 -10205
10908 -57784 -195684 -265154 -97631 -178420 96369 89049 -109673 76806 -69580 189332 -171559
10896 126477 -243817 235714 -172452 158534 -192754 95114 -33126 48178 361168 15163
10885 54387 -197198 -193331 -271472 290353 -13185 -36084 96134 47266 -202949 -102341 6512
10873 -198484 254648 -104030 254946 34125 -69415 153566 30324 234985 -44173 196419
10862a37836A73243c7491j45970H5670k8290j2735i614j24916j59635A91448D5282
10850A45241P3067g6315j28850J9778b7262M324A25031c35515A92055a37454J3326
10839a24128E053b75410c0476C4509M1752Q0090a68998A40426a30818o3919k3895
10828b18632B71780j8704a4077D4463P6625e2612j65525A0960c46573A89556a96054
10816h8029B11051a09295d0933H2523d8017A9256L4863J83944A8024h5843k6191
10805a12034j14644j213e5294B59289f7293H5767i6017j1064C0259b99130A11864
10793a06216B54768r4571c1405A70035a29192p1763k1161J05461j63361K4810
10783b55206A19010O3741E2765R361a95894p5591N6981c4829j46345I471M8721
$$ plain form
10862 -137836 173243 -37491 -183461 85670 57380 44645 -9614 -134530 -294165 191448 45282
10850 145241 218308 -76315 -205165 -185387 -27262 -22938 125031 -335515 192055 -137454 -124128
10839 -124128 5053 -275410 -30476 34509 76261 156351 -168998 140426 -130818 -194737 -218632
10828 -218632 271780 253076 -14077 44463 121088 -52612 -218137 10960 -346573 189556 -196054
10816 -88029 211051 -109295 -40933 82523 -48017 19256 54119 238063 18024 -85843 -112034
10805 -112034 -226678 -227891 -55294 259289 -67293 85767 -96017 -107081 30259 -299130 111864
10793 -106216 254768 160197 -31405 170035 -129192 -200955 -222116 -116655 -280016 -255206
10783 -255206 119010 182751 52765 62126 -195894 -271485 -214504 -34829 -181174 9471 58192
10772E8192K19535C3483e4204A51133o0840c55548M8854J30011d2616p8855k77997
10761c99468a41521I9067L9806e1147j93633M4126j2209K1408h1362r6659p137
10750a85158q7955p1460B47929h7051A94923d24580g7865A13635a48302p4824
10740b23126P4242j52753a10960E0149i5260H919J55911q130p7313c2917a5853
10728A40737e1919D9516a55401n1976i6058H3233a88523C3585a91611o3628J11654
10717a43585H4134a93533M5925j14004f3298j35383J458A55923b74810A52106
10706e9150m4833B09337d975l94414a33073E9424k9288b03556h9689A76794o122
10695A70672i2178A36645a03094D2652J96494q8184a0103q126r7725a2855A82508
$$ plain form
10772 58192 277727 33483 -54204 151133 90293 -355548 -306694 -176683 -42616 -121471 -399468
10761 -399468 -141521 99067 138873 -51147 -244780 -200654 -212863 -191455 -81362 -178021 -185158
10750 -185158 -273113 -344573 247929 -87051 194923 -424580 -77865 113635 -148302 -223126
10740 -223126 -148884 -301637 -110960 50149 -95260 8919 164830 156700 79387 -32917 -15853
10728 140737 -51919 49516 -155401 -207377 -96058 83233 -188523 33585 -191611 -255239 -143585
10717 -143585 84134 -193533 -147608 -261612 -63298 -198681 -197223 155923 -274810 152106
10706 -59150 -103983 209337 -4975 -399389 -133073 59424 30136 -203556 -89689 176794 170672
10695 170672 -92178 136645 -103094 42652 239146 150962 -10103 -18229 -115954 -12855 182508
10683A35766f9550F5478d03742B43554H005b84575d9968j33021A98704h6724d2556
10671A28924i189k11808O7330g31k29235c4727i045k18045J0566A03775k1869
10660H1906J42185a71201A08669a73921C05739e0301j4571D4842K53838c3098
10649a74069P3995b9366K350m24200J41156b1684k31255B75456b04524k19607
10639d24131d9159m3675c4309n7480k52936J70409B6588K83634D6183N5334b96144
10627A56802b18024M8890A64998P1709q5768E2570J87983j18688g3314A81295
10616A60229e739r420E3414K30148A0628K47598a90424O7263j7666M2359G5274
10604a06171p4297A18039N8156b25253E6532d18425O9008C7627a6465j39479j11610
$$ plain form
10683 135766 -69550 65478 -403742 243554 8005 -284575 -49968 -182989 198704 -86724 -42556
10671 128924 -9189 -220997 -153667 -731 -229966 -34727 -9045 -227090 -216524 103775 81906
10660 81906 224091 -171201 108669 -173921 305739 -50301 -64872 44842 298680 -33098
10649 -174069 -100074 -29366 -27016 -451216 -310060 -21684 -252939 275456 -204524 -424131
10639 -424131 -49159 -92834 -34309 -91789 -344725 -174316 26588 310222 46183 101517 -296144
10627 156802 -218024 -169134 164998 236707 150939 52570 240553 121865 -73314 181295
10616 160229 -5739 -15159 53414 283562 10628 258226 -190424 -123161 -140827 -98468 75274
10604 -106171 -180468 118039 176195 -225253 56532 -418425 -349417 37627 -16465 -155944 -267554
10593b67554A26705m3754b95753e7360o5953A98461k4593a64844F3152B9019Q722
10582C7741A7680a23034D4625h0164A21324b56735A07506a93789b4118B38692
10571B42880b5219k10518k4083K8496A1376h8474F0705J2490h7448B9452J62561
10560A92013b40602l7230B805b32968n8930n1608D7610a72798C9859d03748J66437
10549b37311A73029a30173b5605G7677l4825J14478l3959c2181f68E3576k436
10538E1140g7796D6258a96433d2188o2850C6410b51069i1812C94823I2293e9169
10526A95378b8824o278l33128B3055e58969B02823o7602J512c49401a30742B1219
10514A6038K52259c02659c2052k37596J34739p0869g0145L5008A86886b04783
$$ plain form
10593 -267554 126705 82951 -295753 -57360 -123313 198461 173868 -164844 63152 29019 37741
10582 37741 17680 -123034 44625 -80164 121324 -256735 107506 -193789 -24118 238692
10571 242880 -25219 -235737 -259820 -231324 11376 -88474 60705 73195 -87448 29452 192013
10560 192013 -240602 -277832 2805 -232968 -291898 -343506 47610 -172798 39859 -403748 -237311
10549 -237311 173029 -130173 -25605 77677 42852 157330 123371 -32181 -668 53576 51140
10538 51140 -77796 46258 -196433 -42188 -105038 36410 -251069 -91812 394823 92293 -59169
10526 195378 -28824 -35102 -368230 23055 -558969 202823 135221 136733 -349401 -130742 21219
10514 16038 268297 -302659 -32052 -269648 -134909 -205778 -70145 -35137 186886 -204783
10503A59323a73247C2824h1439D3482a95460N6109I3229a81955I172J03170a11894
10491E7855b40049B12536a8003j75198L8892A88023q4986J22832j3397n6306J00988
10480B57154J91202J19366A13490J40352f9697A63709g0149M940E7019a18267
10469B0140K65496d7690D224c55408B24415b3733q3999K5664G6578K5473a90261
10457e5444p7254F951J17148f4617A75361g2522C0843a47653B8469O5787L2895
10446A27151b55919g3530r4018A25683k271K3319k0666c56060C3906J79232m6655
10435A66483F6434M1222l6599a1513I1346l8222O0799c01296F272a16770j86621
10424c03391A57c4034D0726J60556B3815R6045n1704e9607j68163J08327b2622
$$ plain form
10503 159323 -173247 32824 -81439 43482 -195460 -139351 93229 -181955 9172 112342 -111894
10491 57855 -240049 212536 -18003 -193201 -154309 188023 103037 225869 212472 156166 257154
10480 257154 448356 567722 113490 253842 -69697 163709 -70149 -65209 57019 -118267
10469 20140 285636 -47690 4224 -355408 224415 -23733 -107732 -82068 76578 102051 -190261
10457 -55444 -132698 6951 124099 -64617 175361 -72522 30843 -147653 28469 94256 127151
10446 127151 -255919 -73530 -167548 125683 123412 146731 126065 -356060 33906 213138 166483
10435 166483 66434 107656 71057 -11513 91346 53124 113923 -301296 6272 -116770 -303391
10424 -303391 157 -34034 40726 201282 23815 119860 68156 -59607 -227770 -119443 -22622
10412C26880j28512a94990M123d203B9344a52017I972a80153Q4709A21513K07359
10401C28872d8010j91455B29264a8744E8733j8077J67493a53787H0562J20732
10391B01294l5051a75043A54478C7099a51884A39282C2705c8830j3694a9341B76489
10379a49085A73299b6122D30033J84957B72364O8052M5335A03660o439M40894
10369E38115A68854N86034B22061K45771o6436j44993J11229p3946j36589J17006
10359B74103A8921P1227l4238K27679R4741A81291J84776O2341L01411k39550
10349D90269j41440K1099n0158O962M8571K69496k27787L02970C9554J92366J81999
10338D13919E2231N2450B8056K55272B7872L45734F0719k4860D233Q1747c6713
$$ plain form
10412 326880 198368 -194990 -190867 -4203 29344 -152017 9972 -180153 -95444 121513 328872
10401 328872 -48010 -239465 229264 -18744 58733 40656 208149 -153787 80562 201294
10391 201294 166243 -175043 154478 37099 -151884 139282 32705 -38830 -52524 -19341 276489
10379 -149085 173299 -26122 430033 614990 272364 340416 385751 103660 97221 538115
10369 538115 168854 754888 222061 467832 401396 256403 367632 293686 157097 274103
10359 274103 18921 90148 55910 283589 378330 181291 366067 428408 729819 490269
10349 490269 348829 369928 319770 326732 375303 644799 417012 719982 39554 231920 413919
10338 413919 52231 104681 28056 283328 27872 373606 60719 35859 4233 85980 -36713
10326A49343m1789H695J00975j9901C1593P3790b24424A24170L3341M7887P0156
10315B75554e2474A6512a48682C39589A12802h1212G6515e9127A80231a46809
10304c3611C59353a68941B04600a42172K8963B28237r0660M8586b01147a7237
10293D6897g5807B6835d5337A92002I0888k4879J26172b33471A2925d77980B46582
10281A9564M1142R3083B6495L3201d49318h8239B8885i6340H9929k5007d99953
10269d0011j07404B39092J82473F5497O268a07669F7871J12462J1868J22960e7720
10257C29821j10748a98129d2036C46309j32778a09420r0795A2128A80J17424k9836
10246H7768a05585q3821j38696J21371a9962r4975C554a10326c644o8954E0213
$$ plain form
10326 149343 107554 8695 109670 89769 31593 105383 -224424 124170 157511 205398 275554
10315 275554 -52474 16512 -148682 339589 112802 -81212 76515 -59127 180231 -146809
10304 -33611 359353 -168941 204600 -142172 -113209 228237 137577 186163 -201147 -17237
10293 46897 -75807 26835 -45337 192002 90888 66009 192181 -233471 12925 -477980 246582
10281 19564 60706 153789 26495 59696 -449318 -88239 28885 -96340 89929 64922 -499953
10269 -40011 -147415 239092 421565 65497 71765 -107669 67871 180333 192201 315161 -57720
10257 329821 219073 -198129 -42036 346309 213531 -109420 -200215 12128 180 117604 87768
10246 87768 -105585 -189406 -328102 -206731 -19962 -114937 3554 -110326 -3644 -72598 50213
10234a7032H1584J17921p9486d7210A01409R405a48613B32083K24021A70216b20126
10222a016B58556H7913P8399j875h5152m1761D8557j4332O8021b48271g6122D2665
10209A61743l3433a6718B47080F1670a77795g6447F8599c18209J32326A46412
10198A03714b6910H164J73482a65660A67299a74017M8474o0773d7134A22961c98764
10186I1814d7485B0177K70523b60466j9362G4938a97526M5915d4192j8115A97589
10174d54701g9641j7018k31278A99816a49338j04216A26734a88414J2046A5536
10163a28372J9333r5534f4652J5932j08891A33605b86699a5696C52820b58969
10152A31708o3964K15752a69228A23527c2066m81229E5125a93233A0642b02496
$$ plain form
10234 -17032 81584 199505 120019 -47210 101409 110814 -148613 232083 456104 170216 -220126
10222 -1016 258556 87913 166312 164437 -85152 -126913 48557 34225 102246 -248271 -76122 42665
10209 161743 128310 -16718 247080 61670 -177795 -76447 68599 -318209 -185883 146412
10198 103714 -26910 8164 181646 -165660 167299 -174017 -125543 -186316 -47134 122961 -398764
10186 91814 -47485 20177 290700 -260466 -279828 74938 -197526 -151611 -44192 -62307 197589
10174 -454701 -79641 -96659 -327937 199816 -149338 -253554 126734 -188414 -176368 15536
10163 -128372 -109039 -204573 -64652 -48720 -157611 133605 -286699 -15696 352820 -258969
10152 131708 67744 283496 -169228 123527 -32066 -513295 55125 -193233 10642 -202496
10141c3508q5608m06948a6984n4172L1844j43681f4330B27928b58966A18585N9016
10130A77601b60685b4252A00789M277O844d8496B5088b37019j92213A70258a00362
10118a05544f324l85006A38842b59403L2061k23905A06395a48265q1205H7381
10107a30275k63125a16370q5363D7790a01287K9994p4856j21403g5259k80811
10097c56070C6945M1627i9467A19398A9868K5865b8623m5831A55937a71368A97299
10085a31258B4365J88644b820q1244a9998A26551b28664k11191n864J39483h1705
10073F114a07982j2049e7300g198l2941A85867D3685d3381K1443N804a783j65045
10061a66828I0103i0521L1592j11191c7107r2525q8811J7006B988a00695B91867
$$ plain form
10141 -33508 -119116 -526064 -16984 -71156 -39312 -182993 -64330 227928 -258966 118585 177601
10130 177601 -260685 -24252 100789 105066 111910 -48496 25088 -237019 -429232 170258 -100362
10118 -105544 -6324 -391330 138842 -259403 -227342 -451247 106395 -148265 -229470 87381
10107 -130275 -393400 -116370 -201733 47790 -101287 -71293 -146149 -267552 -75259 -356070
10097 -356070 36945 78572 -99467 119398 19868 45733 -28623 -74454 155937 -171368 197299
10085 -131258 24365 213009 -2820 -84064 -19998 126551 -228664 -439855 -445719 -306236 -81705
10073 6114 -107982 -120031 -57300 -7198 -40139 185867 43685 -43381 -21938 -16134 -1783 -166828
10061 -166828 90103 -90521 -58929 -170120 -37107 -129632 -218443 -201437 2988 -100695 291867
10049d97115a03349A09421f5802o3323B5870b37902a00497k6727j97592A09776
10038a77823k5926A10798a63779A27142C0779a46919A42356g2414A24063b53735
10027a74272B18212f0627K3688A06865K50904h5047B13496B7605h6925m0207J4662
10016a12470j46778d2502O281A03528J14344h8707M295D9079a54424A68805E0472
10004b83111B1612O7082a51457I5588c7896D2426E120i990B06544c48011A6305
9992a64292B11622a69496b2630o8627F4221b06431K593A13120f7234b1222k36911
9981b58133a20891a4863A63847G0358a97633I5378J95501a30608J0843H4113b75301
9969D8027J39670a48748N7689B7742c52875A76964a41372m4763O0853P063j04682
$$ plain form
10049 -497115 -103349 109421 -65802 -129125 25870 -237902 -100497 -127224 -324816 109776
10038 -177823 -203749 110798 -163779 127142 30779 -146919 142356 -72414 124063 -253735
10027 -174272 218212 -60627 -36939 106865 357769 -85047 213496 27605 -86925 -127132 -112470
10016 -112470 -259248 -42502 -36221 103528 217872 -88707 -84412 49079 -154424 168805 50472
10004 -283111 21612 88694 -151457 95588 -37896 42426 5120 -9990 206544 -348011 16305
9992 -164292 211622 -169496 -22630 -91257 64221 -206431 -203838 113120 -67234 -21222 -258133
9981 -258133 -120891 -14863 163847 70358 -197633 95378 290879 -130608 -119765 84113 -275301
9969 48027 187697 -148748 -91059 27742 -352875 176964 -141372 -186135 -125282 -118219 -222901
9958b22901A06710a11283L1192j30993r5221a07255B27085c13192A82812P4615
9948B57427m8647j4963g0466j88069n1996A57860f96384J49778K49797M5828D8713
9936c47642B11095a5433k79514o1234B3348b72035o5336O2932e1335j33312B474
9924B34042f72049K99701N159N8925J19127g1628n6408j00185A53682b06755C2832
9912B0326L94660a45804g126o3904D0056b7950H122L19b06806N0501C1173a62570
9899b80350j4046I2620K63653j68867i3426b7558r4579D6938f57744D1399a71989
9887a86322n2554A08435b80759D9659J44658a32165e3110B88077g1105r4706a6271
9875c7736j49607C5538H510f9422G9601j2567L0743h0423E2573c07586P1465K1164
$$ plain form
9958 -222901 106710 -111283 -80091 -211084 -306305 -107255 227085 -313192 182812 257427
9948 257427 208780 193817 -70466 -258535 -310531 157860 -696384 -546606 -296809 -250981 48713
9936 -347642 211095 -15433 -294947 -356181 23348 -272035 -337371 -274439 -51335 -184647 2474
9924 234042 -672049 -372348 -367189 -308264 -189137 -71628 -128036 -228221 153682 -206755 32832
9912 20326 414986 -145804 -7126 -71030 40056 -27950 8122 8441 -206806 -156305 31173 -162570
9899 -280350 -294396 92620 356273 187406 -93426 -27558 -122137 46938 -657744 41399 -171989
9887 -186322 -238876 108435 -280759 49659 194317 -132165 -53110 288077 -71105 -165811 -16271
9875 -37736 -187343 35538 8510 -69422 79601 67034 97777 -80423 52573 -307586 -236121 -214957
9863b14957j96683B7287a17206j16770o8822I7097B3638a04319o3165n3321A37407
9851c3951M163j31537P2607b8411D0059q269a96470f5183B59749a30789A03289
9839A6048a70454D8342K61257a36903l5974j84949l559j0482B45782a52510C6917
9827a97180i1230J9810L0514j27587h0240n13533c7997j2038i419q8849m2186
9816a40454L7104j07423n889I3241a93986B72222a50462M177b1497g219j04979
9805a12198e3166j99701i3346L5194A485h4200L3813l64642h8550o047c9349k59783
9793b99132J45842N4070k49121e0958j92132h0325L6248D1964a19771J0535j13565
9782b22801o0986Q2414N8241A93956C1801J35632a95883R0631L3091B8728J08873
$$ plain form
9863 -214957 -411640 27287 -117206 -233976 -302798 97097 23638 -104319 -167484 -220805 137407
9851 -33951 -29788 -161325 -88718 -28411 40059 31790 -196470 -65183 259749 -130789 103289
9839 16048 -170454 48342 309599 -136903 -172877 -357826 -361385 -371867 245782 -152510 36917
9827 -197180 -91230 -71420 -40906 -168493 -80240 -593773 -37997 -50035 -9419 -98268 -140454
9816 -140454 -103350 -210773 -216662 93241 -193986 272222 -150462 -146285 -21497 -7219 -112198
9805 -112198 -53166 -252867 -93346 -58152 1485 -84200 -50387 -415029 -88550 -94597 -39349 -299132
9793 -299132 -153290 -99220 -348341 -50958 -243090 -80325 -44077 41964 -119771 -109236 -222801
9782 -222801 -283787 -201373 -143132 193956 31801 167433 -195883 -105252 -72161 28728 137601
9771A37601a56630K0610g008k60259J28870d0922A1063J35460d7643C52522N4202
9760D06724B2809J78685q3337J01520h9060d3151J6221k11282a3911A34252N8858
9749A93110d0779l61905b9774l10649h0848A47718B4162g4877a3861l48838a76376
9737d20649a97937h9246j03721B01400H2764a95021B39789g445c382j52277m8808
9726b04467k9170f6055a9986B8416b1970j36432A3903g7634j70801a23380B58057
9714B7022f57816c4646k69027A15109c5222B03726b0413k5061E4480b32367K8999
9703b03368e9848G5002J73832h7514K3495j61891i8773K949Q918j17872I0394
9691b30641f9389H1767A7093c89321B01237d65840a12844A9879J21025b46858
$$ plain form
9771 137601 -156630 -136020 -7008 -267267 -138397 -40922 11063 146523 -47643 352522 406724
9760 406724 22809 201494 118157 219677 -89060 -43151 -26930 -238212 -13911 134252 193110
9749 193110 -40779 -402684 -29774 -340423 -80848 147718 24162 -74877 -13861 -362699 -176376
9737 -420649 -197937 -89246 -192967 201400 82764 -195021 239789 -7445 -3382 -155659 -204467
9726 -204467 -233637 -66055 -19986 28416 -21970 -158402 13903 -77634 -248435 -123380 258057
9714 27022 -657816 -34646 -303673 115109 -35222 203726 -20413 -45474 54480 -232367 -203368
9703 -203368 -59848 75002 248834 -87514 -64019 -225910 -98773 -95824 -86906 -204778 90394
9691 -230641 -69389 81767 17093 -389321 201237 -465840 -112844 19879 140904 -246858
9680e8596k0819a5387H033c31280a27426O0858k25091C21561A20625a02467D2193
9668b28310P5673d3697k88501c4198C6889I379a16575B54227j15483l252e4334
9656b9048k1098B140a08350B4353J09585a30197j19603i2546q4179j7076C6753
9644A33449g5936c0765k06905a08324j46533H0688a2500k33318r3939B32771b95579
9632d33577D6047K46031g8730p8575M7032b2197J600I3061K1476e3741l40442
9621c94183a93117c607k63253j35440a37056B44220a95917L0651A18097A7576
9610e0239D0460J08838d893C3711K40148a13704k05676A05963b49147b7063n930
9599c2993l03367i6636q009m5910E352h6379p1069k2284k6229f0269r7191j15562
$$ plain form
9680 -58596 -79415 -15387 8033 -331280 -127426 -66568 -291659 321561 120625 -102467 42193
9668 -228310 -152637 -43697 -332198 -34198 36889 9379 -116575 254227 138744 135492 -54334
9656 -29048 -50146 2140 -108350 24353 133938 -130197 -249800 -92546 -176725 -193801 36753
9644 133449 -75936 -30765 -237670 -108324 -254857 80688 -12500 -245818 -339757 232771 -295579
9632 -433577 46047 292078 -78730 -157305 -110273 -22197 -20597 93061 114537 -53741 -394183
9621 -394183 -193117 -3607 -266860 -402300 -137056 244220 -195917 -165266 118097 17576
9610 -50239 40460 149298 -4893 33711 273859 -113704 -319380 105963 -249147 -27063 -32993
9599 -32993 -336360 -96636 -104645 -150555 5352 -86379 -157448 -179732 -205961 -60269 -157460 -273022
9587b73022J00438A88135j4363B7798a09451A90307b05765I3930g4641K8310k74131
9576c20462J46610M5248N286c5780r0392j21866j80237I2016b43536A36050a54591
9564a4829B14111F3125R9067d01642I4916P875D2812b6953j45172E5550K0551
9553G6101K5080a6952A54909g6511A31929L0597b29995e7153C6106b2057j3516
9542c5573l1413K7793G8760i9357K5372k1497p8550e9969k38345a30793D9564
9530a83543M751m5908p490f7091j49048b1390m4717A73898A9054d3799B85210
9518b08168E1935d4098a1708k40899O5678e9602l6519m015C5396K00627e586b330
9505a50004r853c4007j74032g9973L5663l49399A60522c9022B34688H7477d3789
$$ plain form
9587 -273022 -172584 188135 173772 27798 -109451 190307 -205765 93930 -74641 -46331 -320462
9576 -320462 -173852 -128604 -123318 -35780 -126172 -248038 -428275 92016 -243536 136050 -154591
9564 -14829 214111 63125 162192 -401642 94916 102791 42812 -26953 -172125 55550 76101
9553 76101 101181 -16952 154909 -76511 131929 162526 -229995 -57153 36106 -22057 -35573
9542 -35573 -66986 -39193 78760 -99357 -73985 -95482 -174032 -59969 -298314 -130793 49564
9530 -183543 -178792 -224700 -232190 -67091 -216139 -21390 -66107 173898 19054 -43799 285210
9518 -208168 51935 -44098 -11708 -252607 -186929 -59602 -96121 -100136 35396 236023 -5586 -2330
9505 -150004 -159857 -34007 -208039 -79973 -44310 -393709 160522 -39022 234688 87477 -43789
9493c35248a00522j3175k44906J57250N1365J3970G0537a32560B5855a10821j38748
9482b49569A20142o749L310C6909h6193K9502l34812J17778A75711p8596g4231
9470c92872g5436o102A12193P7784h0646j44745L0741q589k0676I7389d0529j30310
9458a70839g9328l0229J2334k1264A26729J02428b77188A29907A6877J58463a66035
9446c36923l9326Q7577a28987O0540C07251a19588p6596D183c25602K8699h8145
9434e6503a1814F7971b23538A67991b82426O4188A23021J4026f2111j07960c1144
9422b9661k76084j00958H018c3183q7050p0103j42342a09819B02430A1706J3269
9411B4975a15221c2398j92464c7015B24543Q0466a42886f0125K728D333a03621
$$ plain form
9493 -335248 -100522 -113697 -358603 -201353 -149988 -136018 70537 -132560 25855 -110821 -249569
9482 -249569 120142 113393 116703 36909 -86193 -56691 -391503 -273725 175711 97115 -74231
9470 -392872 -75436 -81538 112193 189977 -80646 -225391 -194650 -203239 -223915 97389 -40529 -170839
9458 -170839 -79328 -109557 -97223 -118487 126729 229157 -277188 129907 16877 175340 -166035
9446 -336923 -376249 -288672 -128987 -68447 307251 -119588 -196184 4183 -325602 -296903 -88145
9434 -56503 -11814 67971 -223538 167991 -282426 -218238 123021 137047 -62111 -170071 -31144
9422 -29661 -305745 -406703 8018 -33183 -120233 -190336 -332678 -109819 202430 11706 24975
9411 24975 -115221 -32398 -224862 -37015 224543 305009 -142886 -60125 -57397 4333 -103621
9399A79086P8785A6923P0433a00454L8687b1530k24197B18069f1137k22880k24423
9388e08440a71057A7141b59773a25091A24616b34123o2985a33741C4637c22460
9377a67212m3334K3232k2686r0615J15999H171J98954b83255J16563a390A3198
9365A38897c87738a00800A06801L7537a17330k29724A041a03873k56718A57783
9354B32225d07769a02882r808C2479I06b82775j70101a90993D1324G085a37513
9342b10030A15772a50895M5869o757M7046I5929i0564A10463a46905h493k37108
9331b45601N1454A0753J71412q9244f2147j01419C20018E5346b43327A87767M5660
9320B33427j02915h6153I7281N8982J00044g2894j15159E9891a51164G3046f557
$$ plain form
9399 179086 257871 16923 87356 -100454 -61767 -21530 -245727 218069 -61137 -284017 -508440
9388 -508440 -171057 17141 -259773 -125091 124616 -234123 -297108 -133741 34637 -322460
9377 -167212 -210546 -187314 -210000 -300615 -184616 8171 207125 -283255 -166692 -1390 13198
9365 138897 -387738 -100800 106801 144338 -117330 -347054 1041 -103873 -360591 157783
9354 232225 -407769 -102882 -112690 32479 906 -282775 -452876 -190993 41324 7085 -137513
9342 -210030 115772 -150895 -105026 -111783 -64737 95929 -90564 110463 -146905 -8493 -245601
9331 -245601 -194147 10753 182165 92921 -62147 -163566 320018 55346 -243327 187767 233427
9320 233427 130512 -86153 97281 156263 256307 -72894 -188053 59891 -151164 73046 -6557
9308e24522a13889L4219k67321a07845M9097G1053a88954J4582G6661d8525G4027
9296E3850l10K71833b41175K9521M2605A42754a41178o0324h3305D7491J26605
9285A74096j6900B8538a72768A52495K1292e5348l49510c2908A87521O9187g1511
9273D6923a63775o0176O7351L8465l6277a0477E0100a88455j04149I8337g7406
9261c014j91504b9792o2614j12914m1842A79598b60357Q9199L089B34181c6747
9249E3255J87a44138j43669G1680b9340F3681c07362j10255P6908I379c4004A90750
9236b30387m1288B02416B1073K5186J35939b53729g4959a2215A06861c43840d9064
9224f2351A20463g6510k4426p3391p3180A221a7327F310K13997E0507J07882b41618
$$ plain form
9308 -524522 -113889 -79670 -346991 -107845 -58748 71053 -188954 -174372 76661 -48525 74027
9296 53850 53540 325373 -241175 -211654 -169049 142754 -141178 -201502 -83305 47491 174096
9285 174096 157196 28538 -172768 152495 173787 -55348 -404858 -32908 187521 256708 -71511
9273 46923 -163775 -223951 -156600 -118135 -154412 -10477 50100 -188455 -292604 98337 -77406
9261 -3014 -194518 -29792 -92406 -205320 -247162 179598 -260357 -171158 -168069 234181 -36747
9249 53255 53442 -144138 -287807 71680 -29340 63681 -307362 -417617 -340709 9379 -34004 190750
9236 -230387 -271675 202416 21073 46259 182198 -253729 -74959 -12215 106861 -343840 -49064
9224 -62351 120463 -76510 -100936 -174327 -247507 1221 -17327 6310 220307 50507 158389 -241618
9211I2062j8704a89596L0605N7244A34869a9720r2427d9333B17806a48045A82136
9199a45497B23886a00142j1867l16749i4275M4615D8695e73515H6304a90037j75817
9188c65854a04520C9104b78213B07219a3743D4212c20461a40108l8124Q5103C9824
9176b99696M5878R7382c6029I3170i7906j48095h6046k37154a03999M6197j10214
9165a68016o1259Q8150k8520h2533b9381n1589l92416B23641a18900a8922B16316
9153a99585e0539f224q6533j87449i0763n3120r0729m5819b6132j23067m0124
9142a89323A81073J59325a61456k34632B66715a59939B02637C383a36143d9632
9131a40387C26941e2869k70675c9460C49369A508c3822j1465D1352a42154k72279
$$ plain form
9211 92062 73358 -189596 -158991 -101747 134869 -19720 -112147 -49333 217806 -148045 182136
9199 -145497 223886 -100142 -112009 -428758 -94275 -49660 48695 -573515 86304 -190037 -365854
9188 -365854 -104520 39104 -278213 207219 -13743 44212 -320461 -140108 -178232 -93129 39824
9176 -299696 -253818 -156436 -36029 93170 -97906 -246001 -86046 -323200 -103999 -57802 -168016
9165 -168016 -229275 -141125 -169645 -82533 -29381 -80970 -473386 223641 -118900 -18922 216316
9153 -199585 -50539 -6224 -92757 -280206 -90763 -143883 -234612 -280431 -26132 -149199 -189323
9142 -189323 181073 340398 -161456 -396088 266715 -159939 202637 3383 -136143 -49632
9131 -140387 326941 -52869 -323544 -39460 349369 1508 -33822 -45287 41352 -142154 -414433
9120d14433a97906d2836j43902G5876b86502P7691A59281b98598H6701K27756
9110C14457j01852D7795O7528e3677k14710B58125A09994K2832a25360L9536c6828
9098A66614a75287g2697p4282j04679E9125h8825o9912A10725C7817Q1519k8919
9087I0417d4370k51753j98363g1249A01104b6946C73557a60396A02531g5567A11198
9075b30825J05156L3282l02687c0787B13108c25568J35231h4942G4409d3280m8006
9064i1286c4826R982A66271c29940J43516j46814b1604q7920A08025b38236A2070
9052B03868b7786k76938A68612a77152P1652l4055J9783j16765j84354B31452
9041A04340b04865j92096A43659b83409O2529k03511a28761m5605A25215m7369
$$ plain form
9120 -414433 -197906 -42836 -186738 75876 -286502 -208811 159281 -298598 86701 314457
9110 314457 212605 47795 115323 -53677 -268387 258125 109994 132826 -125360 -85824 -36828
9098 166614 -175287 -72697 -146979 -251658 59125 -88825 -158737 110725 37817 119336 90417
9087 90417 -44370 -296123 -494486 -71249 101104 -26946 373557 -160396 102531 -75567 111198
9075 -230825 -125669 -92387 -395074 -30787 213108 -325568 -190337 -84942 74409 -43280 -91286
9064 -91286 -34826 -24844 166271 -329940 -186424 -333238 -21604 -109524 108025 -238236 12070
9052 203868 -27786 -304724 168612 -177152 -105500 -139555 -119772 -236537 -420891 231452
9041 104340 -204865 -396961 143659 -283409 -220880 -424391 -128761 -174366 125215 77846
9031G7846J39545A999J95051c22791J6479G2844c22880d8333I1184b13167J6999
9020a96168j46358B27994A5499c8204j35314C2858a19646B35148a74838N2788
9010a22050j29432j03651C9023b2880a0894q8476H8478g4603C7011c9998A62551
8998a13571j69785F8067g199B05413f748j34313m34302M4989a23679j50841j45354
8987d19874A54693j9959c33080I9909c63169J72656L6478C10555A8847c7705j97805
8976b35510e7267m73019a08470A13834A9640J9777c11571g4706C46156a53871
8965H7597e111J14A32996l3738R290b87706b121k35292P8319A52605C2262K7305
8953E9567a52645C595b93452a6657n4818k8461E1097c3958N112A33929A2629J14770
$$ plain form
9031 77846 217391 1999 197050 -322791 -306312 72844 -322880 -48333 91184 -213167 -196168
9020 -196168 -342526 227994 15499 -38204 -173518 32858 -119646 235148 -174838 -122050
9010 -122050 -251482 -355133 39023 -22880 -10894 -99370 88478 -74603 37011 -39998 162551
8998 -113571 -283356 68067 -7199 205413 -6748 -141061 -575363 -530374 -123679 -274520 -419874
8987 -419874 154693 134734 -333080 99909 -363169 -190513 -154035 310555 18847 -37705 -235510
8976 -235510 -57267 -530286 -108470 113834 19640 39417 -311571 -74706 346156 -153871
8965 87597 -5111 -4997 132996 99258 108548 -287706 -2121 -237413 -159094 152605 32262 59567
8953 59567 -152645 3595 -293452 -16657 -71475 -99936 51097 -33958 -28846 133929 12629 127399
8941A27399h9223d3488A28846p472K03300F6647L21784j15123j35567D8115a7784
8929A72689J82166j18153L09262P00185K19165J494602J830664L002248k978520
8920D814308j506308j196018p22371o06027j47618j85997j44673A31499b35104
8910i1401C04162E0895M68729k09306d6823B04218J27510a07231o3055B1494L32212
8899C53706b79377A15812a32065A16231b56224A33405f1860q6082m5252F8115
$$ plain form
8941 127399 -89223 -43488 128846 121374 324674 66647 388431 273308 137741 48115 -17784
8929 172689 354855 236702 545964 1246149 1465314 2959916 4790580 7792828 4814308
8920 4814308 3308000 2111982 1389611 783584 635966 449969 305296 131499 -235104
8910 -91401 304162 50895 519624 310318 -46823 204218 331728 -107231 -170286 21494 353706
8899 353706 -279377 115812 -132065 116231 -256224 133405 -61860 -147942 -193194 68115
$$ [...]
##END NTUPLES=NMR SPECTRUM
##END=
