
##TITLE=AC1302_PERAH12114_7525498_Bu7zzF2CVs
##JCAMPDX= 6.0         $$ Bruker NMR JCAMP-DX V2.0
##DATA TYPE= NMR SPECTRUM
##DATA CLASS= NTUPLES
##ORIGIN= BRUKER
##OWNER= Administrator
$$ 1.72 TOPSPIN		Version 2.1
$$ 2013-02-19 21:54:16.200 -0500  Administrator@X
$$ Compression mode = diff/dup
##.OBSERVE FREQUENCY= 400.02188249412
##.OBSERVE NUCLEUS= ^1H
##.ACQUISITION MODE= SIMULTANEOUS (DQD)
##.ACQUISITION SCHEME= undefined
##.AVERAGES= 64
##.DIGITISER RES= 22
##SPECTROMETER/DATA SYSTEM= spect
##.PULSE SEQUENCE= noesygpps1d.comp
##.SOLVENT NAME= COFFEE_meoh
##.SHIFT REFERENCE= INTERNAL, COFFEE_meoh, 1, 14.9612
##AUDIT TRAIL= $$ (NUMBER, WHEN, WHO, WHERE, PROCESS, VERSION, WHAT)
$$ ##TITLE= Audit trail, TOPSPIN		Version 2.1
$$ ##JCAMPDX= 5.01
$$ ##ORIGIN= Bruker BioSpin GmbH
$$ ##OWNER= Administrator
$$ $$ E:\/data/COFFEE/nmr/AC1302_PERAH12114_7525498_Bu7zzF2CVs/12/pdata/1/auditp.txt
$$ ##AUDIT TRAIL=  $$ (NUMBER, WHEN, WHO, WHERE, PROCESS, VERSION, WHAT)
(   1,<2013-02-19 21:54:10.798 -0500>,<Administrator>,<X>,<go>,<TOPSPIN 2.1>,
      <created by zg
	started at 2013-02-19 21:42:39.849 -0500,
	POWCHK enabled, PULCHK disabled,
       configuration hash MD5:
       86 BA 57 50 F2 9D 5C 9B 26 00 A9 28 5F 66 2E 89
       data hash MD5: 64K
       6E 80 EF 29 7D E3 7A 71 FA 02 DA 84 C7 41 90 1C>)
(   2,<2013-02-19 21:54:13.610 -0500>,<Administrator>,<X>,<proc1d>,<TOPSPIN 2.1>,
      <Start of raw data processing
       efp LB = 0.3 FT_mod = 6 PKNL = 1 PHC0 = 0 PHC1 = 0 SI = 128K 
       data hash MD5: 128K
       69 C0 1B 44 B8 7F 66 73 25 05 24 20 EA 60 B2 C9>)
(   3,<2013-02-19 21:54:14.585 -0500>,<Administrator>,<X>,<proc1d>,<TOPSPIN 2.1>,
      <pk PHC0 = 252.4164 PHC1 = 0 
       data hash MD5: 128K
       50 BE BD D3 E0 35 36 F9 3E 46 68 BA 3E 31 A3 D7>)
(   4,<2013-02-19 21:54:15.253 -0500>,<Administrator>,<X>,<proc1d>,<TOPSPIN 2.1>,
      <abs ABSG = 1 
       data hash MD5: 128K
       5B C9 83 D1 1E 23 F1 95 4F 5C B0 D2 A0 BC 86 0D>)
(   5,<2013-02-19 21:54:15.406 -0500>,<Administrator>,<X>,<proc1d>,<TOPSPIN 2.1>,
      <abs ABSG = 2 
       data hash MD5: 128K
       CB E4 3A 0D C2 DE 71 9D 27 AB 02 FD 74 D4 D1 02>)
(   6,<2013-02-19 21:54:15.559 -0500>,<Administrator>,<X>,<proc1d>,<TOPSPIN 2.1>,
      <abs ABSG = 3 
       data hash MD5: 128K
       EF CF 07 22 BA 66 C1 2F 35 F4 4F F3 F6 68 F0 E6>)
(   7,<2013-02-19 21:54:15.726 -0500>,<Administrator>,<X>,<proc1d>,<TOPSPIN 2.1>,
      <abs ABSG = 4 
       data hash MD5: 128K
       D0 D3 A0 5D 2B 79 E9 A8 B7 7B 86 84 B9 73 2B 31>)
(   8,<2013-02-19 21:54:15.880 -0500>,<Administrator>,<X>,<proc1d>,<TOPSPIN 2.1>,
      <abs ABSG = 5 
       data hash MD5: 128K
       13 01 22 29 BC DC 88 B2 A7 70 84 99 05 CF 58 BC>)
$$ ##END=
$$ 
$$ $$ hash MD5
$$ $$ 7D 04 FE F1 06 24 48 94 0E 54 B1 3C E0 79 9F E2
##$RELAX= 
##$RELAX= 
##$RELAX= 
##$RELAX= 
##$RELAX= 
##$RELAX= 
##$RELAX= 
##$RELAX= 
$$ Bruker specific parameters
$$ --------------------------
##$DU= <E:\>
##$EXPNO= 12
$$ [...]
150 150 150 150 150 150 150 150
##$TP07= 0
##$TPNAME0= <>
##$TPNAME1= <>
##$TPNAME2= <>
##$TPNAME3= <>
##$TPNAME4= <>
##$TPNAME5= <>
##$TPNAME6= <>
##$TPNAME7= <>
##$TPOAL= (0..7)
0.5 0.5 0.5 0.5 0.5 0.5 0.5 0.5
##$TPOFFS= (0..7)
0 0 0 0 0 0 0 0
##$TUNHIN= 0
##$TUNHOUT= 0
##$TUNXOUT= 0
##$USERA1= <user>
##$USERA2= <user>
##$USERA3= <user>
##$USERA4= <user>
##$USERA5= <user>
##$V9= 5
##$VALIST= <valist>
##$VCLIST= <CCCCCCCCCCCCCCC>
##$VD= 0
##$VDLIST= <DDDDDDDDDDDDDDD>
##$VPLIST= <PPPPPPPPPPPPPPP>
##$VTLIST= <TTTTTTTTTTTTTTT>
##$WBST= 1024
##$WBSW= 4
##$XGAIN= (0..3)
0 0 0 0
##$XL= 0
##$YL= 0
##$YMAX_a= 6180435
##$YMIN_a= -10429629
##$ZGOPTNS= <>
##$ZL1= 120
##$ZL2= 120
##$ZL3= 120
##$ZL4= 120
##$ABSF1= 14.9612
##$ABSF2= -5.596982
##$ABSG= 5
##$ABSL= 3
##$ALPHA= 0
##$AQORDER= 0
##$ASSFAC= 0
##$ASSFACI= 0
##$ASSFACX= 0
##$ASSWID= 0
##$AUNMP= <proc_prof1d_extract.lims>
##$AXLEFT= 0
##$AXNAME= <>
##$AXNUC= <1H>
##$AXRIGHT= 0
##$AXTYPE= 0
##$AXUNIT= <>
##$AZFE= 0.1
##$AZFW= 0.1
##$BCFW= 0
##$BC_mod= 0
##$BYTORDP= 0
##$COROFFS= 0
##$CY= 15
##$DATMOD= 1
##$DC= 0
##$DFILT= <>
##$DTYPP= 0
##$F1P= 0
##$F2P= 0
##$FCOR= 0.5
##$FTSIZE= 131072
##$FT_mod= 6
##$GAMMA= 0
##$GB= 0
##$INTBC= 1
##$INTSCL= 1
##$ISEN= 128
##$LB= 0.3
##$LEV0= 0
##$LPBIN= 0
##$MAXI= 10000
##$MC2= 0
##$MEAN= 0
##$ME_mod= 0
##$MI= 0
##$NCOEF= 0
##$NC_proc= -2
##$NLEV= 6
##$NOISF1= 0
##$NOISF2= 0
##$NSP= 0
##$NTH_PI= 0
##$NZP= 0
##$OFFSET= 14.9612
##$PC= 1
##$PHC0= 252.4164
##$PHC1= 0
##$PH_mod= 1
##$PKNL= yes
##$PPARMOD= 0
##$PPDIAG= 0
##$PPIPTYP= 0
##$PPMPNUM= 2147483647
##$PPRESOL= 1
##$PSCAL= 4
##$PSIGN= 0
##$PYNMP= <proc.py>
##$REVERSE= no
##$SF= 400.020009558307
##$SI= 131072
##$SIGF1= 0
##$SIGF2= 0
##$SINO= 400
##$SIOLD= 131072
##$SPECTYP= <>
##$SREGLST= <1H.CDCl3>
##$SSB= 0
##$STSI= 131072
##$STSR= 0
##$SW_p= 8223.68421052631
##$SYMM= 0
##$S_DEV= 0
##$TDeff= 65536
##$TDoff= 0
##$TI= <>
##$TILT= no
##$TM1= 0
##$TM2= 0
##$TOPLEV= 0
##$USERP1= <user>
##$USERP2= <user>
##$USERP3= <user>
##$USERP4= <user>
##$USERP5= <user>
##$WDW= 1
##$XDIM= 131072
##$YMAX_p= 416983508
##$YMIN_p= -12094
##$CURPLOT= <Network HP LaserJet P1505>
##$CURPRIN= <$Network HP LaserJet P1505>
##$DFORMAT= <normdp>
##$LAYOUT= <+/1D_H.xwp>
##$LFORMAT= <normlp>
##$PFORMAT= <normpl>
##$SURQMSG= 1
$$ End of Bruker specific parameters
$$ ---------------------------------
##NTUPLES= NMR SPECTRUM
##VAR_NAME=  FREQUENCY,     SPECTRUM/REAL,   SPECTRUM/IMAG
##SYMBOL=    X,             R,               I
##VAR_TYPE=  INDEPENDENT,   DEPENDENT,       DEPENDENT
##VAR_FORM=  AFFN,          ASDF,            ASDF
##VAR_DIM=   131072,        131072,          131072
##UNITS=     HZ,            ARBITRARY UNITS, ARBITRARY UNITS
##FACTOR=    0.0627417313425164, 1,          1
##FIRST=     8223.62146879497, -2438,        -61740
##LAST=      0,             -287,            -62957
##MIN=       0,             -12094,          0
##MAX=       8223.62146879497, 416983508,    0
$$ Real data points
##PAGE= N=1
##DATA TABLE= (X++(R..R)), XYDATA
$$ [...]
67959 88520 87048 86620 86654 86224 84964 83368 82062 81084 80094 79027 78207 77913 78013 78019 77488 76486 75661 75623
67941 75623 76206 76649 76541 76201 76000 75782 75279 74669 74269 74003 73720 73864 75177 77634 80171 81644 81849 81528
67923 81528 81625 82574 84058 85407 86349 87232 88313 89071 88749 87441 86073 85199 84431 83272 81925 80917 80378
67906 80378 80134 80189 80578 80975 80916 80389 79813 79474 79328 79338 79601 80089 80521 80615 80334 79832 79309 78940 78803 78855 78993
67885 78993 79091 78955 78445 77768 77395 77437 77297 76308 74622 73156 72685 73359 74944 76999 78741 79325 78664 77637
67867 77637 77182 77365 77660 77871 78320 79185 80049 80252 79473 77941 76246 74996 74429 74235 73818 72803 71272
67850 71272 69585 68135 67270 67210 67840 68626 68934 68542 67833 67495 67936 68910 69724 69920 69763 69909 70527 71011 70792
67831 70792 70293 70624 72252 74328 75633 75885 75742 75693 75496 74850 74155 74247 75546 77726 80084 82020 83257
67814 83257 83865 84105 84093 83662 82614 80992 78931 76484 73924 72088 71915 73444 75571 76950 76988 75911
67798 75911 74221 72407 70953 70216 70140 70206 69774 68544 66789 65166 64149 63641 63207 62733 62627 63277 64492
67781 64492 65631 66198 66201 66033 66063 66291 66371 66086 65748 65918 66712 67742 68718 69667 70371 70231 69224 68532 69462
67762 69462 71845 74226 75640 76498 77545 78717 79485 79793 80002 80127 79718 78532 76926 75491 74584 74308
67746 74308 74705 75712 76972 77903 78128 77837 77577 77619 77674 77307 76436 75226 73688 71731 69536 67485 65735
67729 65735 64218 63044 62489 62502 62674 62802 62999 63068 62393 60935 59834 60366 62467 64884 66595 67507 67816
67712 67816 67367 65963 63928 62053 61056 61108 61758 62311 62460 62556 63119 64206 65438 66446 66979 66787 65845 64664
67694 64664 63933 63803 63854 63753 63552 63379 63339 63763 64992 66688 67876 68002 67557 67397 67834 68652 69553 70137 69846
67675 69846 68501 66759 65465 64697 63928 63053 62680 63261 64445 65512 66155 66576 67063 67767 68751 69998 71292
67658 71292 72266 72684 72703 72803 73353 74171 74549 73827 72014 69852 68235 67475 67097 66431 65456 64893 65286 66197
67640 66197 66686 66497 66295 66655 67349 67907 68350 68942 69575 69955 70192 70684 71506 72403 73276 74168 74772 74556 73497
67621 73497 72237 71354 70860 70581 70542 70763 71079 71510 72428 73990 75652 76707 77102 77315 77516 77331 76487 75249
67603 75249 74058 73037 72064 71108 70254 69511 68865 68461 68496 68868 69173 69186 69194 69606 70315 70747 70594 70169 69843 69388
67583 69388 68248 66371 64407 63044 62473 62557 63151 64032 64800 65195 65457 66067 67150 68321 69161 69641 70015
67566 70015 70425 70764 70894 70883 70901 70931 70639 69648 67932 65922 64233 63329 63285 63786 64382 64916 65634 66727 67841
67547 67841 68324 67996 67361 66984 66912 66921 67003 67237 67334 66742 65312 63569 62207 61522 61418 61731 62268 62675 62551 61816
67527 61816 60820 60001 59483 59057 58555 58152 58294 59289 61001 62909 64522 65678 66407 66566 65829 64153 62119
67510 62119 60576 59933 60032 60631 61689 62965 63728 63286 61797 60212 59331 59126 59076 58926 58907 59280 59871 60205
67492 60205 60061 59757 59709 59838 59735 59460 59756 61107 62903 64028 64135 63860 63831 64019 64168 64306 64578 64985 65567
67473 65567 66483 67653 68638 69163 69439 69684 69670 69128 68304 67681 67364 67188 67179 67468 67873 68099 68254 68626 69048 69056
67453 69056 68679 68466 68614 68691 68416 68147 68192 68196 67650 66711 66023 65941 66311 66855 67402 67812 68020 68044 67757 66864 65430
67432 65430 64218 64018 64683 65242 65014 64239 63563 63331 63546 64125 64887 65494 65722 65746 65966 66493 66943 66789 65892
67413 65892 64717 64017 64231 65173 66265 67000 67247 67295 67692 68743 69946 70179 68872 66842 65482 65198 65217
67396 65217 64994 65008 65790 66817 67156 66818 66694 67209 67805 67882 67602 67419 67369 67235 67041 66906 66633 65944 65061 64589
67376 64589 64794 65354 65894 66403 66974 67462 67764 68234 69393 71134 72592 73026 72650 72326 72536 72971 73078 72683
67358 72683 71980 71238 70768 70878 71596 72514 73181 73520 73663 73592 73359 73463 74429 75939 76889 76601 75674 75381 76414
67339 76414 78368 80168 80828 80145 78934 78402 79030 80240 81289 82118 83045 84004 84608 84741 84600 84254 83676
67322 83676 83195 83328 84011 84477 84150 83379 82950 83079 83219 82815 81997 81388 81320 81460 81344 81085 81256 82040 82921
67303 82921 83408 83657 84090 84784 85628 86713 88017 89037 89440 89815 90935 92318 92478 90863 88702 87483
67287 87483 87326 87370 87180 87010 87065 87170 87077 86612 85621 84180 82773 81933 81859 82554 84005 85893 87477 88300 88798
67268 88798 89714 91131 92576 93850 95097 96173 96654 96549 96388 96440 96430 96211 96154 96501 96805 96483 95661 95052
67250 95052 95133 95737 96378 96704 96766 97068 98272 100556 103214 105118 105720 105494 105346 105645 105934 105521 104260 102606
67232 102606 101108 100036 99501 99611 100269 101034 101453 101468 101354 101338 101497 101934 102757 103898 105169 106447 107625
67215 107625 108473 108839 108957 109236 109693 109917 109716 109529 109998 111270 112876 114173 114814 114899 114787 114706 114562 114111
67197 114111 113286 112284 111433 111054 111258 111714 111835 111503 111472 112639 114972 117539 119517 120761 121403 121533 121468
67180 121468 121770 122577 123297 123330 122841 122469 122545 122968 123668 124739 126145 127681 129189 130530 131403 131571 131329 131444
67162 131444 132415 133943 135206 135569 134994 133965 133155 133061 133739 134771 135580 135933 136193 137005 138645 140772 142888
67145 142888 144852 146726 148272 149034 148991 148708 148688 148872 149015 149238 149856 150844 151869 152785 153768 154962 156289
67128 156289 157658 159079 160458 161509 161988 161911 161469 160855 160249 159859 159822 160142 160846 162108 164057 166405 168485
67111 168485 169788 170393 170731 171049 171353 171759 172487 173410 174060 174374 175054 176746 179077 180993 181908 182082 182054 182302
67093 182302 183388 185648 188553 191003 192559 193829 195373 196880 197868 198603 199681 201060 202192 202966 203866
67078 203866 205286 207132 209121 211050 212789 214343 215903 217588 219291 221020 223108 225700 228306 230320
67064 230320 231807 233289 234933 236474 237815 239127 240437 241698 243222 245396 247943 250096 251616 253100
67050 253100 255139 257719 260521 263224 265406 266837 268068 270012 272750 275463 277866 280773 284638 288426
67036 288426 290864 292242 293918 296345 298683 300330 301804 303866 306588 309634 312845 316078 318929 321123
67022 321123 322999 325289 328471 332448 336725 340751 344226 347209 349919 352477 355002 357816 361292 365436
67008 365436 369894 374416 379061 383896 388781 393608 398507 403630 408886 414058 419074 423975 428691 433004
66994 433004 436810 440432 444618 450050 456627 463273 468747 472723 476018 479748 484484 490187 496619 503561
66980 503561 510772 517966 524878 531344 537353 543066 548654 554128 559455 564858 570802 577605 585205 593313
66966 593313 601641 609941 618089 626311 635096 644677 654745 664859 674980 685327 695789 705830 715132
66953 715132 724222 734261 746100 759482 773253 786485 799317 812484 826151 839730 852955 866586
66941 866586 881522 897522 913417 928535 943276 958174 973019 987363 1001579 1016811 1033844
66930 1033844 1052310 1071208 1090023 1109161 1129226 1150118 1171081 1191630 1212082 1233016 1254506
66919 1254506 1276231 1298070 1320140 1342382 1364715 1387597 1411847 1437647 1464271 1491073 1518216
66908 1518216 1545923 1573520 1599973 1625241 1650503 1676964 1704889 1733735 1762701 1791048 1818420
66897 1818420 1845122 1871811 1898741 1925626 1952313 1979084 2006083 2032894 2059083 2084789 2110322
66886 2110322 2135404 2159401 2182220 2204415 2226341 2247667 2267921 2287027 2305014 2321520 2336047
66875 2336047 2348581 2359547 2369189 2377380 2384081 2389560 2393863 2396384 2396372 2393827 2389524 2384140 2377688 2369892
66861 2369892 2360755 2350425 2338747 2325347 2310083 2293111 2274474 2254023 2231877 2208683 2185220
66850 2185220 2161849 2138477 2114831 2090512 2064961 2037741 2009012 1979555 1950146 1920934 1891555
66839 1891555 1861845 1832217 1803154 1774486 1745586 1716338 1687478 1659612 1632292 1604625 1576585
66828 1576585 1548968 1521985 1494748 1466632 1438485 1411766 1386772 1362460 1337850 1312916 1288073
66817 1288073 1263529 1239446 1216192 1193998 1172591 1151475 1130343 1109051 1087485 1065864 1044948
66806 1044948 1025509 1007572 990447 973510 956623 939784 922780 905448 888055 871103 854805
66795 854805 839018 823726 809260 795825 782997 769970 756330 742410 728875 716208 704596
66784 704596 693999 684016 673866 662829 650803 638301 625948 614119 602944 592432 582540 573296
66772 573296 564842 557199 550013 542719 534991 526876 518543 510166 502009 494307 486992 479844 472984 466836
66758 466836 461405 455976 449869 443237 436741 430672 424852 419278 414289 409975 405886 401542 396937 392301
66744 392301 387610 382592 377165 371684 366769 362907 360028 357407 354194 350201 345934 341805 337629 333153
66730 333153 328648 324470 320324 315686 310966 307455 305717 304589 302353 298631 294546 291207 288607 286036
66716 286036 283039 279708 276360 273205 270192 267061 263678 260326 257472 255149 252811 249899 246391 242686
66702 242686 239219 236324 234211 232757 231433 229677 227332 224613 221794 219120 216881 215281 214227 213414
66688 213414 212587 211633 210495 209226 208053 207126 206179 204664 202304 199373 196412 193805 191694 190114 189060
66673 189060 188351 187512 185933 183355 180240 177463 175499 174032 172488 170738 169130 168010 167500 167496 167605 167193
66657 167193 165932 164172 162416 160538 158064 155269 153317 152994 153731 154313 154259 154064 154268 154746 154931 154447 153390
66640 153390 152171 151118 150128 148757 146718 144317 142290 141175 140852 140669 140053 139040 138183 137833 137626 136867
66624 136867 135350 133544 132010 130938 130288 130016 129988 129954 129786 129486 128849 127544 125756 124313 123729 123440 122579
66607 122579 121330 120922 122181 124581 126814 127914 127677 126483 125017 123927 123362 122855 121811 120039 117750
66592 117750 115212 112618 110192 108201 106807 105998 105690 105787 106177 106716 107271 107711 107892 107752 107462 107336 107420 107255
66574 107255 106280 104580 103015 102448 102921 103734 104138 103771 102645 101132 99929 99569 99800 99780 98990 97717 96556
66557 96556 95807 95529 95743 96273 96721 96888 96918 96760 95926 94233 92402 91371 91242 91504 92000 92871 93681 93561
66539 93561 92530 91776 92129 92819 92427 90723 88960 88424 89182 90274 90743 90331 89422 88518 87870 87576 87840 88809
66521 88809 90153 91160 91426 91255 91199 91385 91460 91017 89876 88174 86351 84908 83976 83279 82630 82243 82366 82830
66503 82830 83210 83260 83019 82666 82552 83087 84207 85072 84722 83074 80960 79243 78223 77826 77894 78122 78099 77707
66485 77707 77320 77367 77838 78312 78404 78040 77444 76937 76711 76694 76722 76820 77141 77627 77939 77896 77781 78022 78622 79127 79100
66464 79100 78484 77565 76802 76677 77438 78816 80144 80931 81297 81692 82267 82745 82932 83072 83502 84117 84526 84667
66446 84667 84926 85479 85861 85439 84193 82697 81392 80202 79003 78110 78002 78638 79345 79485 79058 78513 78103
66429 78103 77723 77310 77126 77413 77997 78476 78686 78696 78502 78109 77888 78352 79404 80223 80206 79706 79521 79955 80725
66410 80725 81489 81951 81682 80489 78930 77831 77194 76142 74198 72116 71092 71477 72580 73458 73590 73017
66394 73017 72248 71939 72359 73153 73702 73578 72626 70983 69261 68336 68523 69130 69245 68794 68447 68624 69155 69875
66376 69875 70953 72450 73982 75076 75580 75581 75192 74605 74081 73679 73194 72550 72006 71788 71704 71325 70433 69133
66358 69133 67702 66492 65859 65957 66629 67588 68571 69292 69487 69155 68575 67973 67403 67047 67250 67956 68520 68522 68461 69078
66338 69078 70155 70667 70202 69563 69701 70548 71277 71334 70837 70191 69720 69572 69671 69738 69605 69415 69332 69173 68583 67567
66318 67567 66633 66299 66567 66943 66948 66619 66440 66698 67028 66936 66729 67413 69310 71194 71391 69593 67087 65242
66300 65242 64399 64265 64655 65439 66265 66903 67579 68541 69454 69709 69176 68243 67236 66310 65841 66229 67171 67725 67442
66281 67442 66919 66825 66877 66367 65391 64824 65163 66077 67171 68466 69804 70420 69688 68009 66402 65390 64805 64584
66263 64584 65099 66446 67896 68528 68235 67737 67612 67702 67600 67388 67596 68493 69764 70925 71745 72107 71784 70764
66245 70764 69598 68989 69014 69195 69345 69814 70657 71100 70331 68580 66908 66091 66162 66882 68108 69591 70903 71754
66227 71754 72116 71959 71214 70112 69232 68986 69256 69690 70125 70572 70972 71198 71209 71127 71252 71951 73293 74709 75281
66208 75281 74556 73028 71759 71633 72878 74933 76674 77108 76145 74613 73485 73219 73752 74650 75181 74724 73468
66191 73468 72422 72359 72986 73413 73157 72412 71627 71182 71273 71662 71773 71401 71153 71698 72780 73509 73588 73651 74266 75124
66171 75124 75421 74714 73189 71368 69764 68672 68150 68256 69181 70886 72687 73627 73354 72387 71488 71099 71392
66154 71392 72348 73530 74138 73685 72436 71026 69868 69109 68872 69120 69441 69345 68886 68752 69615 71429 73428
66137 73428 74762 75193 75144 75122 75175 75045 74723 74607 75068 76079 77329 78504 79445 80187 80888 81544 81777 81175 79953
66118 79953 78965 78888 79626 80658 81648 82449 82794 82456 81734 81374 81828 82737 83275 82902 81755 80430 79531 79402
66100 79402 80077 81257 82343 82781 82583 82340 82532 82948 83114 83118 83530 84474 85329 85590 85563 85777 86053 85722 84701
66081 84701 83794 83803 84685 85773 86524 86870 87029 87248 87701 88377 88967 88999 88240 86951 85717 85009 84989 85615 86692
66062 86692 87759 88219 87862 87148 86751 86910 87419 88068 88767 89327 89551 89618 90007 90886 91868 92491 92669 92579 92444
66043 92444 92540 93060 93718 93870 93344 92860 93255 94498 95887 97010 98052 99189 100200 100868 101378 102013 102649
66026 102649 102873 102603 102331 102620 103455 104316 104825 105018 104956 104463 103565 102859 102907 103426 103695 103726 104386 106178 108510
66007 108510 110464 111758 112611 113231 113936 115323 117724 120675 123405 125682 127788 129905 131942 133760 135177
65992 135177 136013 136517 137440 139167 141062 142232 142622 142689 142304 140869 138501 136184 134558 133257 131647 129512
65976 129512 126793 123419 119830 117029 115562 114839 113892 112448 110911 109721 109218 109712 111008 112049 111704
65961 111704 110029 108291 107649 108091 108758 109013 108993 109194 109714 110137 110271 110794 112717 116104 119716 122213 123451
65944 123451 124316 125515 126976 128329 129464 130443 131130 131259 130840 130342 130322 130931 131890 132984 134277 135733 136907
65927 136907 137447 137787 138873 141144 144230 147680 151440 155406 159095 162221 165145 168186 170841 172347 172938
65912 172938 173803 175635 177777 179104 179397 179493 180249 181649 182900 183158 182146 180226 178052 176195 174945 174240
65896 174240 173661 172641 170875 168505 165830 162914 159629 155986 152273 148837 145880 143454 141470 139619
65882 139619 137393 134399 130765 127170 124320 122309 120674 119125 117978 117560 117413 116638 115113 113845 113820
65867 113820 114858 115903 116091 115211 113479 111432 109943 109730 110683 111969 112829 113047 112733 112082 111390 110944 110810
65850 110810 110998 111797 113551 116016 118385 120106 121269 122014 122106 121459 120614 120144 119856 119206 118358 118192 119184
65833 119184 120862 122516 123924 125169 126272 127410 129171 132035 135704 139339 142451 145277 148323 151821
65819 151821 155575 159010 161366 162206 161841 161018 160110 158890 157153 155171 153279 151344 148962 146051 142978
65804 142978 140252 138287 137322 137210 137351 137124 136409 135528 134744 133997 133027 131496 129147 126239 123833 123132 124297
65787 124297 126169 127424 127875 128500 130324 133455 137169 140731 144031 147446 151193 154983 158342 161014 162899
65772 162899 163837 163787 163075 162093 160799 158911 156512 154066 151792 149485 147072 144909 143319 142273 141753 142090
65756 142090 143626 146332 149984 154378 159119 163651 167969 172993 179706 188010 196870 205428 213463 220792
65742 220792 226825 231010 233437 234756 235531 235711 234619 231464 225998 218697 210304 201356 192246 183474 175505
65727 175505 168490 162365 157083 152466 148041 143421 138830 134833 131555 128558 125522 122609 120062 117848
65713 117848 115877 114242 112991 111959 111040 110336 109765 108843 107251 105480 104434 104388 104734 104872 105014 105796 107254
65696 107254 108578 108970 108610 108563 109741 112040 114541 116465 117815 119082 120490 121721 122421 122747 123206 124061
65680 124061 125251 126991 129973 134640 140516 146751 153184 160330 168329 176580 184645 192920 201990 211724
65666 211724 221478 230792 239385 246803 252763 257717 262408 266848 270274 272166 272747 272428 271422 270116 269225
65651 269225 269123 269425 269669 270070 271127 272707 274003 274299 273353 271111 267569 262999 257897 252371 245833 237595
65635 237595 227706 216945 206041 195190 184386 173953 164456 156202 149111 143040 137932 133560 129496
65622 129496 125582 122221 119884 118462 117412 116416 115542 114758 113713 112118 110107 108047 106230 104910 104438
65607 104438 105065 106640 108583 110213 111083 111155 110735 110265 110074 110230 110564 110823 110929 111159 111942 113371 114984
65590 114984 116142 116595 116600 116644 117162 118405 120430 123228 126858 131271 136014 140538 145021 150509 157840 166730
65574 166730 176277 186031 195998 205902 215133 223387 230656 236628 240781 243166 244371 244509 242939 239266
65560 239266 233987 227763 220664 212595 203916 195118 186335 177659 169505 162164 155385 148972 143382 139070
65546 139070 135617 132294 129240 127195 126110 124927 123007 120974 119829 119788 120428 121447 122794 124378 126079
65531 126079 127825 129276 129701 128653 126725 125135 124447 124010 122801 120584 118073 116186 115374 115507 116084 116441
65515 116441 116057 114906 113433 112077 110963 110181 110099 110972 112276 112954 112498 111496 110959 111352 112424 113617
65499 113617 114354 114244 113400 112398 111649 110953 109990 109061 108937 110092 112440 115738 119758 124017 127800 130704
65483 130704 132887 134652 136035 136939 137374 137378 136837 135636 133879 131839 129763 127902 126571 125964 125844 125584
65467 125584 124699 123342 122153 121535 121149 120233 118432 116176 114270 113271 113226 113713 114032 113705 113027 112842 113486
65450 113486 114218 114116 113340 112993 113768 115219 116487 117278 117851 118447 119139 120078 121486 123280 124938 125964 126416
65433 126416 126830 127517 128120 128061 127342 126570 126170 125975 125726 125579 125748 126002 125979 125762 125670 125629 125306 124783 124550 124760
65413 124760 125035 125096 125128 125349 125665 125906 126043 126008 125711 125379 125453 126000 126678 127437 128728 130723 132876 134655 136232
65394 136232 137950 139574 140665 141332 141904 142127 141436 139977 138609 137774 137091 136261 135709 135890 136429 136543 136093
65377 136093 135779 136317 137759 139647 141560 143356 145040 146615 148079 149473 150803 151919 152658 153175 153983
65362 153983 155501 157702 160368 163534 167383 171811 176460 181275 186679 193060 200279 207796 215004 221290
65348 221290 225995 228631 229147 227880 225340 222103 218703 215352 211841 207846 203287 198277 192868 187093
65334 187093 181154 175339 169798 164636 160192 156853 154511 152498 150275 147947 145906 144192 142510 140745
65320 140745 139113 137794 136758 135995 135623 135612 135625 135286 134487 133307 131807 130081 128390 127017 126058 125432 125063
65303 125063 124914 124987 125379 126235 127492 128847 130170 131752 133845 136151 138123 139660 141060 142308 142967 142879
65287 142879 142468 142086 141499 140415 139146 138274 137836 137357 136688 136354 136953 138404 139934 140693 140400 139442 138365
65270 138365 137306 136095 134918 134421 134899 135713 135910 135203 133906 132212 130210 128503 127977 128697 129650 129947
65254 129947 129792 129856 130232 130564 130846 131383 132029 132127 131303 129841 128176 126466 124804 123415 122352 121306 120058
65237 120058 118889 118239 118104 118130 118256 118878 120248 122005 123485 124317 124464 123869 122419 120363 118470 117451
65221 117451 117306 117446 117456 117452 117623 117724 117307 116327 115213 114358 113842 113757 114505 116430 119210 121873 123577 124353
65203 124353 124922 125819 126768 127052 126421 125379 124477 123618 122418 121080 120386 120673 121338 121717 122057 123095 124892
65186 124892 126759 128316 129920 131793 133366 134040 134178 134716 135924 137147 137767 137857 137763 137560 137171 136636 135958
65169 135958 134995 133936 133627 134935 137760 140980 143446 144821 145538 146282 147606 149704 152307 154890 157053
65154 157053 158656 159640 160063 160425 161586 164030 167445 171311 175709 181068 187262 193607 199887 206744 214612
65139 214612 222760 229997 236122 242001 248304 254817 261134 267279 273255 278478 282238 284411 285229 284605 282281
65124 282281 278591 274470 270586 266930 263277 259563 255612 251041 245748 240136 234544 228777 222538 215973
65110 215973 209363 202572 195295 187738 180524 173971 167957 162498 157955 154529 151934 149757 147805 145990
65096 145990 144229 142662 141611 141101 140702 140119 139639 139685 140161 140613 140813 140844 140737 140525 140553 141290 142717 144264
65078 144264 145462 146345 147128 147831 148364 148693 148692 148163 147264 146688 147006 147947 148683 148787 148594 148564 148644 148448 147830 147075
65058 147075 146568 146470 146700 147107 147588 148048 148272 147904 146697 144864 143125 142228 142356 143009 143565 143907 144364 145027
65040 145027 145349 144741 143417 142216 141446 140360 138202 135397 133116 131762 130640 129226 128020 127633 127634 127078
65024 127078 125863 124817 124446 124390 124309 124498 125190 125824 125743 125284 125456 126559 127792 128373 128465 128691 129248 129990 131031
65005 131031 132639 134556 136053 136925 137977 140124 143244 146308 148586 150263 151808 153219 154183 154712 155145
64990 155145 155600 155826 155672 155391 155288 155343 155404 155602 156273 157527 159119 160771 162349 163684 164424 164299 163439 162275
64972 162275 161120 160007 158922 157986 157223 156261 154551 151952 148954 146205 144008 142434 141691 141948 142821 143422
64956 143422 143139 142198 141304 140971 141298 142072 142738 142527 141070 138902 136999 135828 135147 134677 134499 134681 134977
64939 134977 135212 135655 136615 137811 138507 138252 137276 136161 135337 134905 134765 134830 135124 135651 136203 136457 136298 135818
64921 135818 134949 133452 131498 129919 129412 129737 130179 130676 131899 134210 137083 139716 141696 142864 143144 142946
64905 142946 143264 144823 147358 150157 153050 156291 159748 162908 165776 169051 173117 177350 180799 183250
64891 183250 185276 187404 189671 191956 194343 196982 199684 201861 202962 202945 202221 201102 199498 197331 195027
64876 195027 193193 191771 189916 186988 183424 180350 178411 177204 175886 174141 172474 171553 171378 171223 170434
64861 170434 169084 167658 166286 164637 162526 160136 157579 154691 151541 148745 146880 145821 145033 144334 143923
64846 143923 143772 143473 142821 142191 142126 142678 143311 143398 142767 141801 141000 140468 139893 139016 137912 136800 135850 135295 135431
64827 135431 136233 137273 138287 139529 141190 142782 143719 144358 145796 148533 151909 155029 157714 160308 163053
64812 163053 166044 169476 173530 178167 183242 188659 194190 199336 203556 206487 207826 207341 205222 202125
64798 202125 198560 194431 189566 184437 179976 176773 174788 173768 173451 173382 172969 171961 170648 169466 168590
64783 168590 168042 167926 168353 169196 170153 171091 172204 173769 175783 177956 180072 182259 184779 187623 190469 193045
64767 193045 195395 197768 200404 203438 206840 210440 214147 218112 222404 226528 229669 231619 233128 235107
64753 235107 237741 240654 243612 246621 249458 251511 252115 250858 247672 242900 237238 231327 225434 219662
64739 219662 214262 209463 205180 201202 197515 194153 190956 187955 185787 185125 185722 186604 187270 188076 189323
64724 189323 190645 191646 192578 193882 195421 196683 197513 198284 199510 201580 204554 207839 210336 211427 211725
64709 211725 212343 213489 214235 213691 211882 209383 206542 203378 199974 196667 193898 191979 190856 190016 188814
64694 188814 187071 185226 183801 182816 181874 180707 179402 178157 177048 176189 175945 176736 178511 180583 182224
64679 182224 183432 184919 187235 190127 192983 195771 199164 203667 208878 213779 217636 220442 222624 224447
64665 224447 225655 225574 223628 219907 215215 210476 206136 202174 198545 195359 192690 190492 188803 187836 187669
64650 187669 188008 188466 189014 189995 191674 193908 196280 198475 200533 202871 206032 210306 215558 221465 227869
64635 227869 234722 241699 248112 253358 257378 260607 263509 266165 268188 269006 268343 266440 263692 260144 255633
64620 255633 250443 245364 240850 236495 231719 226668 221977 217862 214088 210832 208886 208719 209825 211313
64606 211313 212765 214210 215605 216814 217879 218856 219530 219670 219495 219386 219173 218206 216270 213991 212077 210542
64590 210542 208989 207406 206214 205618 205330 205096 205178 206140 208238 211162 214312 217237 219864 222363 224815 227027
64574 227027 228710 229849 230738 231559 232051 231687 230190 227734 224662 221114 217002 212368 207714 203849 201227
64559 201227 199374 197247 194278 190938 188082 186023 184553 183620 183349 183412 183058 182089 181272 181372 182177 182988 183676
64542 183676 184618 185772 186595 186921 187242 187877 188434 188391 187760 186809 185558 183986 182421 181206 180147 178778 177173
64525 177173 175988 175641 175818 175935 175782 175553 175573 176172 177559 179466 181090 181799 181886 182310 183564 185091 186067
64508 186067 186461 187069 188638 191354 195095 199692 204798 209929 214939 220166 225800 231332 235975 239389 241596
64493 241596 242409 241534 239259 236489 233875 231309 228476 225540 223024 221258 220170 219430 218602 217378 215924
64478 215924 214815 214472 214745 215129 215121 214279 212333 209581 206913 205041 203803 202551 201095 199929 199591 200147
64462 200147 201322 202836 204578 206598 208891 211049 212259 211988 210602 209007 207742 206803 206293 206718 208352
64447 208352 210697 212874 214409 215449 216430 217830 220112 223547 227985 232917 237877 242758 247825 253488
64433 253488 260046 267576 276149 286121 298024 312030 327742 344863 364003 386439 413027 443721
64421 443721 478379 517683 562863 614715 673241 737989 807998 881315 955263 1027631 1097176
64410 1097176 1162695 1222280 1274270 1318508 1355642 1385030 1404183 1410646 1403936 1385425 1356933 1319802
64398 1319802 1274755 1222041 1161885 1095144 1023362 948159 871098 794531 721816 655807 597272
64387 597272 545425 499727 460401 427300 399287 375092 354150 336255 320932 307595 296017
64376 296017 286214 278029 271102 265108 259844 255210 251194 247647 244004 239603 234514 229706 226007 223116
64362 223116 220002 216145 212007 208324 205400 203221 201886 201587 202236 203392 204641 205982 207816 210569 214340
64347 214340 218750 223058 226537 228862 230156 230580 230032 228488 226480 224739 223244 221025 217280 212363 207438
64332 207438 203473 200958 200165 200974 202535 203833 204780 206219 208714 211783 214498 216385 217480 217964 218098
64317 218098 218218 218422 218438 218066 217546 217239 217131 216883 216206 214967 213108 210694 207881 204673 200890 196574 192242
64300 192242 188547 185909 184555 184493 185108 185204 184083 182435 181585 181907 182573 182916 183360 184616 186502 188200 189525
64283 189525 191279 194177 197856 201347 204272 207144 210470 214036 217324 220296 223318 226495 229531 232228
64269 232228 234657 236711 237916 237937 237059 236009 235505 235997 237469 239338 240879 241917 242766 243401 243229 242012
64253 242012 240430 239144 237685 234904 230365 224624 218334 211788 205421 200032 196177 193648 191733 189777
64239 189777 187527 185324 183989 184085 185209 186377 187166 188000 189274 190749 192053 193206 194250 194799 194476 193598
64223 193598 192944 192878 193054 192972 192504 191827 191043 190040 188701 187168 185758 184513 183066 181219 179526 178793 179012
64206 179012 179339 179320 179572 180817 182752 184472 185730 187089 188837 190415 191195 191486 192487 195281 199947 205588
64190 205588 211215 216680 222629 229556 237209 245075 253059 261180 268832 274908 278671 280017 278903 275180
64176 275180 269221 262129 254882 247624 240220 233154 227274 222706 218582 214034 209154 204791 201598 199461
64162 199461 197770 196072 194412 193079 192112 191196 190064 188892 188130 188042 188535 189391 190468 191722 193232 195191
64146 195191 197712 200557 203256 205581 207698 209753 211509 212658 213361 214099 214957 215396 215008 214252 214050 214631
64130 214631 215168 214781 213667 212874 213088 213978 214860 215611 216690 218499 221104 224443 228439 232844 237308 241716
64114 241716 246189 250740 255278 260039 265476 271398 276655 280317 282893 285676 288954 291666 293032 293779
64100 293779 295283 298064 301702 305841 310490 315493 320342 324615 328164 330864 332621 333581 333842 332992 330559
64085 330559 326993 323515 320607 317295 312422 306159 299666 293687 288191 283207 279127 276062 273514 270928
64071 270928 268112 265018 261628 258367 256089 255184 254971 254376 253046 251501 250414 250187 251051 252973 255311
64056 255311 257104 258020 258843 260682 263811 267524 271140 274855 279507 285615 292871 300578 308454 316874 326290
64041 326290 336592 347148 357455 367551 377690 387730 397066 405220 412186 417932 421740 422562 420195
64028 420195 415703 410364 404516 397881 390733 384133 378917 375016 371882 369034 365890 361676 356011 349372
64014 349372 342546 335891 329496 323730 318994 315051 311213 307223 303496 300527 298507 297478 297236 297053 296176
63999 296176 294808 293967 294077 294355 294072 293791 294676 296934 299697 302296 304955 308152 311890 315811 319707 323727
63983 323727 328243 333558 339587 345881 352101 358349 364914 371853 379120 386819 394977 403322 411764 420923
63969 420923 431627 443872 456825 469951 483675 498883 516197 535740 557104 579534 602757
63958 602757 627881 656856 690798 729391 772235 820164 874797 937437 1009123 1091336 1185762
63947 1185762 1293364 1414306 1548699 1696719 1857853 2030554 2212842 2402869 2598824
63938 2598824 2798649 3000023 3200190 3395550 3581583 3753365 3906204 4036006 4139528
63929 4139528 4214593 4259948 4274904 4259242 4213396 4138396 4035560 3906636 3754483 3583396
63919 3583396 3398418 3204367 3005466 2805569 2608254 2416594 2232965 2059151 1896630
63910 1896630 1746652 1609976 1486495 1375365 1275798 1187701 1111203 1045511 988606 938335
63900 938335 893608 854331 820437 791365 766315 744517 725153 707413 690892 675660 661630
63889 661630 648073 634184 620099 606914 595528 585785 577034 569282 563350 560050 559545 561544 565682
63876 565682 571605 579066 588217 599561 613406 629557 647671 667649 689418 712593 736687 761489
63864 761489 786932 812706 838347 863568 888159 911620 933230 952459 968961 982184 991402 996222
63852 996222 996794 993511 986884 977701 966785 954229 939135 920477 898171 873162 846558 818820
63840 818820 789746 759122 727413 695736 665057 635454 606367 577503 549289 522520 497918
63829 497918 475996 456856 439906 424084 408601 393300 378270 363587 349621 337173 326778
63818 326778 318049 310084 302463 295592 290123 286279 283666 281550 279332 276859 274245 271389 268005 264205
63804 264205 260665 257889 255605 253287 250958 248983 247247 245128 242377 239506 237135 235266 233440 231352
63790 231352 229169 227378 226429 226351 226616 226492 225581 223966 221913 219648 217395 215360 213637 212296 211548 211583
63774 211583 212216 212948 213449 213763 213973 213939 213549 213010 212717 212942 213730 214885 215960 216421 216092 215335 214668 214270
63756 214270 213954 213556 213162 212973 213022 213066 212800 212294 212099 212727 214054 215549 217111 219228 222088 224993 227119
63739 227119 228560 230053 231814 233335 234464 235949 238441 241411 243659 244774 245568 247048 249382 252033
63725 252033 254532 256886 259438 262560 266390 270664 274921 278959 282998 287231 291336 294616 296540 296949
63711 296949 295904 293640 290668 287561 284500 281231 277610 273956 270722 268058 265890 264265 263388 263418 264353
63696 264353 266049 268208 270524 273048 276224 280309 284868 289156 292914 296432 299887 303013 305532 307466
63682 307466 308808 309234 308544 307230 306232 306050 306296 306147 305165 303716 302722 302965 304462 306423 307922 308669 309135
63665 309135 309947 311217 312528 313498 314199 314843 315132 314228 311581 307631 303383 299320 295106 290390 285513 281217
63649 281217 277924 275594 274085 273288 273044 273260 274080 275552 277150 277976 277648 276769 276410 277335 279778 283588
63633 283588 288298 293217 297788 301929 305938 310220 315176 321144 328145 335866 344151 353361 363895 375521
63619 375521 387679 400508 415010 431964 451071 471442 492613 514702 537928 562414 588266
63608 588266 615253 642373 668199 691798 713009 731777 747494 759167 766039 768092 766198 761798
63596 761798 756129 749669 742535 735255 728613 722594 715981 707253 695528 680547 662369 641631 619687
63583 619687 597816 576396 555308 534947 516278 499938 485838 473718 463645 455853 450370 446945
63571 446945 445147 444617 445488 448365 453526 460223 467270 474230 481479 489210 497138 505380 514794 525945
63557 525945 538292 550961 563990 578307 594808 613934 635824 660198 686313 713672 742723
63546 742723 774144 807184 839098 866417 886542 898314 901827 898236 889453 877499 863966 850064
63534 850064 836913 825517 816385 809226 803019 796483 788691 779243 767723 753159 734453 711491 685494
63521 685494 658077 630198 602222 574648 548267 523663 500945 480072 461178 444440 429805
63510 429805 416909 405185 394113 383595 374135 366351 360150 354575 348723 342667 337233 332952 329514
63497 329514 326323 323315 321062 320190 320805 322391 324125 325346 325870 325928 325818 325677 325573 325690 326303 327584 329462
63480 329462 331646 333838 336097 339000 343191 348556 353991 358219 360793 362123 362694 362594 361727 360075 357565
63465 357565 354036 349622 344999 340981 337852 335235 332633 330014 327882 326841 327045 328034 329146 330142 331405
63450 331405 333577 337086 341980 348050 355055 362924 371838 382083 393826 407114 422022 438661 457073
63437 457073 477316 499638 524254 550733 577610 602710 623970 640229 651588 659080 663885 666884
63425 666884 669078 672102 677757 686976 699690 715750 735509 759303 786854 817388 849815 882401
63413 882401 912758 938720 959171 973784 982373 984963 982193 975211 965345 954151 943230 933271 923535
63400 923535 912842 900757 887180 871170 851299 827241 800099 771061 740631 709427 678724
63389 678724 649648 622492 597383 574955 555756 539450 525250 512787 502042 492856 485118 479141
63377 479141 475224 473056 472193 472919 475938 481290 488219 496226 505648 517001 530182 544582 559788 576003
63363 576003 593964 614475 637836 663636 691165 719917 749648 780158 811192 842291 872394
63352 872394 899839 923179 941802 955472 963638 965876 962868 956219 947261 936708 925414 914520
63340 914520 904384 893980 881917 867593 850985 831812 809608 784453 757108 728559 699880
63329 699880 672388 647304 625130 605713 588944 575053 564170 556014 550185 546325 543582 540059
63317 540059 533423 522423 507775 491388 474766 458352 442273 427099 413498 401500 390697 381067
63305 381067 372987 366400 360614 355194 350441 346609 343191 339543 335822 332623 329975 327433 325040 323382
63291 323382 322548 321714 320089 317725 315120 312529 310116 308413 308010 308846 310141 311048 311202 310748 310138 309854
63275 309854 310026 310256 309951 308924 307581 306540 306133 306268 306685 307274 308118 309204 310269 311117 311969 313189 314680
63258 314680 315961 316994 318496 321053 324307 327455 330410 333924 338567 344072 349764 355220 360375 365397
63244 365397 370767 377179 385068 394299 404449 415214 426513 438462 451426 465739 481202 497255
63232 497255 514002 532601 554010 577510 601194 623970 646368 669231 692348 714864 736442
63221 736442 757360 777730 797390 816542 835883 855907 876474 897213 917922 938191 956830
63210 956830 972032 982270 987045 986790 982034 972699 958375 939328 916888 892456 866385 838361
63198 838361 808856 779559 752176 727412 705399 686496 671054 658848 649413 642774 639234 638634
63186 638634 640516 644965 652532 663148 675828 689795 705267 722694 741718 761418 781262 801222
63174 801222 821167 840760 859987 879222 898590 917579 935415 951535 965564 977072 985612 990952
63162 990952 993104 992046 987358 978205 963875 944479 921030 894712 866161 835617 803562 770942
63150 770942 738839 708196 679767 653934 630479 608862 588874 570852 555146 541616 529816
63139 529816 519485 510649 503279 497028 491325 485721 480193 475167 471182 468497 467019 466498 466662 467260 468172
63124 468172 469443 471098 472958 474874 477019 479658 482583 485198 487319 489580 492810 497130 501799 505805
63110 505805 508526 510071 511136 512402 513972 515498 516769 517811 518434 518267 517471 516877 516959 517143 516646 515661
63094 515661 515091 515353 516137 517170 518453 519730 520547 521036 521918 523378 524620 525062 525417 526932 529823 533141
63078 533141 536112 539030 542695 547434 552900 558656 564710 571446 579149 587676 596651 605882 615491 625726
63064 625726 636904 649453 663655 679320 696032 713871 733568 755847 780989 809130 840427
63053 840427 874633 911024 949248 989848 1033444 1079758 1128030 1178015 1229730 1282434 1334876
63042 1334876 1386728 1438888 1491928 1544925 1596330 1645535 1693131 1740063 1787025 1834309 1881535
63031 1881535 1927516 1970730 2009954 2044216 2072366 2093029 2104897 2106794 2097697 2077159 2045698 2004451
63019 2004451 1954509 1897001 1833735 1767200 1699750 1633095 1568729 1508328 1453342 1404373 1361373
63008 1361373 1324458 1294223 1271249 1255513 1246451 1243501 1246418 1255043 1268866 1286998 1308650 1333520
62996 1333520 1361626 1392751 1426170 1460823 1495653 1529926 1563556 1597177 1631520 1666375 1700283
62985 1700283 1731507 1759331 1784093 1805875 1823472 1834891 1838694 1834507 1822292 1801622 1771950 1733377
62973 1733377 1686847 1633730 1575503 1513744 1450019 1385681 1322043 1260714 1203240 1150089 1100337
62962 1100337 1052802 1007459 965481 928015 895152 865879 838715 812515 787113 763243 741548
62951 741548 721682 702700 684263 666918 651032 636003 620907 605552 590501 576325 563329
62940 563329 551871 542300 534389 527262 520171 513197 506890 501385 496197 490924 485828 481513 478157 475351
62926 475351 472703 470293 468332 466683 465054 463513 462386 461554 460307 458136 455402 452976 451362 450342
62912 450342 449266 447434 444503 440853 437403 434726 432434 429791 426832 424406 423060 422314 421243 419508
62898 419508 417599 416276 415944 416390 417000 417295 417330 417351 417160 416195 414397 412573 411624 411692 412395 413555 415238 417218
62880 417218 418910 419916 420283 420304 420387 421020 422366 423831 424550 424432 424217 424305 424091 422879 420935 419106 417766
62863 417766 416828 416497 417153 418407 419152 418941 418670 419380 420798 421687 421452 420860 421147 422813 425369 427896 429739
62846 429739 430887 431812 432822 433579 433425 432223 430647 429494 428816 427884 426044 423556 421522 420937 421776 423111
62830 423111 424063 424463 424556 424474 424356 424665 425826 427524 428872 429401 429497 429740 430267 431095 432595 435158 438581 442315
62812 442315 446233 450698 455851 461333 466853 472630 478993 485824 492747 499676 506809 514123 521325 528471
62798 528471 536299 545610 556449 568271 580866 594686 610105 626857 644676 664272 687027 713631
62786 713631 743552 776106 811628 851231 895717 945171 999514 1058931 1123629 1193427 1267711
62775 1267711 1345650 1426338 1508787 1591822 1673905 1753102 1827198 1893782 1950328 1994615 2025375
62764 2025375 2042430 2045935 2035686 2011500 1974132 1925410 1867403 1801774 1729961 1653596 1574533
62753 1574533 1494659 1415688 1338896 1264943 1194186 1127244 1064977 1007779 955231 906673 861929
62742 861929 821246 784713 751980 722451 695626 671366 649971 631819 616760 604028 592858
62731 592858 582979 574337 566682 559808 553979 549691 547030 545642 545206 545506 546091 546488 546993 548739 552595
62716 552595 558302 565102 572905 582300 593556 606283 620296 636241 654924 676300 699678 724857
62704 724857 752586 783760 818601 856978 899279 946419 998862 1056006 1116816 1180906 1248619
62693 1248619 1319983 1393785 1467801 1539724 1607653 1669799 1724218 1769199 1803771 1827430 1839362
62682 1839362 1838302 1823412 1795114 1754809 1704085 1644585 1578495 1508522 1436960 1364987 1293035
62671 1293035 1221683 1152004 1085247 1022485 964524 911817 864346 821673 783206 748410 716871
62660 716871 688309 662563 639472 618756 600057 583056 567474 553073 539790 527800 517248
62649 517248 507867 499105 490679 482819 475818 469550 463678 458176 453336 449274 445842 443127 441628 441530 442033
62634 442033 441801 440154 437523 434760 432374 430508 429209 428361 427564 426438 425051 423828 423092 422880 423107 423699
62618 423699 424603 425826 427485 429749 432749 436569 441120 445973 450605 455023 459842 465496 471706 478150
62604 478150 485346 494273 505246 517806 531749 547599 565921 586753 610010 635878 664510 695743
62592 695743 729471 765881 804821 845174 885230 923582 959424 992230 1021426 1046180 1065317
62581 1065317 1077662 1082684 1080582 1071582 1055606 1032965 1004925 973085 938414 901388 862786 823830
62569 823830 785589 748683 713447 679998 648328 618771 592181 569143 549176 531244 514929
62558 514929 500460 487681 475834 464601 454667 446874 441196 436864 433170 429845 426978 424834 423568
62545 423568 422954 422559 422196 421938 421712 421304 420864 420880 421452 422050 422332 422769 424003 425879 427583 428659 429547 431223
62527 431223 434580 440040 447390 455946 465141 475115 486714 500894 518102 538105 560360 584599 611079
62514 611079 640175 671819 705512 740845 777700 815922 855076 894583 933723 971396 1006144
62503 1006144 1036620 1061859 1081064 1093462 1098587 1096495 1087603 1072512 1052075 1027391 999693 970476
62491 970476 941590 914600 889906 867107 846390 828875 815253 804867 796805 791274 789029 789817
62479 789817 792351 795666 799583 803724 806925 807968 806363 802118 795210 785540 773034 757510 738769
62466 738769 717153 693828 670236 647233 624823 602685 581010 560831 543341 528692 515750
62455 515750 503305 491289 480495 471485 464365 459308 456390 454892 453589 452051 450996 451148 452432 454647
62441 454647 458133 463089 468713 473791 477983 481920 486127 490327 493740 495702 495982 494804 492511 489021
62427 489021 483813 476622 467948 458641 449349 440658 433197 426998 421059 414407 407467 401613 397330 393641
62413 393641 389563 385346 381854 379408 377765 376737 376157 375518 374318 372744 371591 371435 372137 373083 373647 373613
62397 373613 373499 374320 376650 379934 383094 385703 388151 390729 393160 395226 397322 399979 403169 406458 409747
62382 409747 413511 418324 424278 430840 437193 442901 448413 454769 462647 471794 481507 491423 501671 512544
62368 512544 524411 537768 552931 569694 587745 607450 629816 655571 684656 716785 752049
62357 752049 790660 832445 877052 924378 974204 1025342 1075593 1122793 1165662 1203496 1235342
62346 1235342 1259835 1275898 1283418 1283234 1276620 1264729 1248235 1227233 1201462 1170883 1136242 1099083
62334 1099083 1061133 1023616 987112 951930 918446 887137 858427 832546 809377 788390 768894
62323 768894 750457 732950 716106 699268 681816 663780 645733 628068 610644 593299 576438
62312 576438 560788 546612 533537 521201 509801 499733 490974 483154 476177 470328 465680 461762 458035
62299 458035 454388 451012 448046 445725 444528 444696 445668 446538 447140 448269 450692 454357 458701 463299 467946
62284 467946 472448 476782 481304 486450 492302 498735 505902 514198 523724 534093 544976 556662 569794
62271 569794 584535 600197 615892 631523 647868 665677 684982 705500 727335 750838 775986
62260 775986 802546 830868 861958 896513 934326 974793 1017511 1062062 1107668 1153411 1198400
62249 1198400 1241296 1279990 1312269 1336670 1352520 1359680 1358797 1351398 1338879 1321305 1297715 1267499
62237 1267499 1231016 1189034 1142382 1092341 1040739 989287 939082 890864 845314 802833 763422
62226 763422 727068 694094 664964 639914 618757 600810 584980 570339 556788 544837 534655
62215 534655 525674 517333 509819 503730 499242 495884 492992 490178 487433 484996 483079 481635 480451 479480
62201 479480 478963 479218 480502 482988 486609 490941 495572 500663 506756 513901 521384 528496 535268 542188 549532
62186 549532 557318 565666 574830 584873 595517 606254 616519 625923 634428 642226 649429 656174 663019
62173 663019 670801 679914 690161 701640 715393 732741 754229 779558 808325 840328 875296 912673
62161 912673 951642 990986 1029022 1064057 1094950 1120999 1141494 1155759 1163645 1165621 1162335 1154335
62149 1154335 1142105 1126004 1106124 1082513 1055644 1026494 996182 965747 936115 907939 881473
62138 881473 856915 834864 816056 800576 787676 776444 766385 757336 749306 742636 737948 735502
62126 735502 734687 734373 733785 733022 732893 734366 737997 743688 750936 759244 768117 776801 784398 790285 794147
62111 794147 795595 794350 791075 787437 784687 782308 778591 772400 763887 753649 742060 729702 717803
62098 717803 707590 699465 693230 688845 686518 686188 687537 690474 695077 700962 707335 713910 721215 729547
62084 729547 738170 746204 753984 762708 772818 783573 794455 806181 819843 835644 853095 871979
62072 871979 892383 913979 936044 958217 980641 1003350 1026175 1049424 1073940 1100069 1127053
62061 1127053 1153866 1180173 1205838 1229809 1250249 1265834 1276369 1282079 1283012 1279420 1272071 1261567
62049 1261567 1247643 1229710 1207893 1182936 1155092 1123767 1088586 1050409 1010931 971596 933162
62038 933162 895998 860255 825793 792402 760229 729820 701719 676194 653288 632848 614546
62027 614546 598083 583389 570402 558752 548015 538216 529657 522212 515184 508005 500674 493397 486222
62014 486222 479258 472806 466989 461642 456917 453464 451581 450569 449585 448878 449491 451823 455184 458777 462492
61999 462492 466538 470865 475191 479157 482227 483880 484148 483642 482797 481435 479286 476492 473240 469288 464337
61984 464337 458637 452686 446429 439329 431290 423094 415745 409698 404854 400966 397731 394664 391268 387551
61970 387551 384238 382305 382092 382830 383173 382346 380767 379499 379185 379719 380824 382538 384957 387820 390708 393555
61954 393555 396644 400061 403506 406847 410624 415705 422434 430322 438631 447107 456141 466377 478261 491844
61940 491844 506836 522819 539488 556732 574537 592862 611643 630809 650136 669076 686882
61929 686882 703069 717810 731720 745070 757221 766986 773577 777037 777724 775763 771256 764785 757282
61916 757282 749465 741812 735036 730134 727798 728151 731154 736858 745051 755122 766598 779456 793468
61903 793468 807471 819756 829098 835159 838060 837960 834888 828649 818980 806103 790974 774577 757172
61890 757172 738682 719655 701194 683908 667537 651796 636929 623150 610056 597032 583968
61879 583968 571220 559093 547740 537353 528093 519884 512566 506130 500549 495530 490791 486620 483859
61866 483859 483154 484349 486749 489945 494247 500254 508101 517359 527767 539807 554212 571059 589781
61853 589781 610150 632773 658313 686533 716512 747644 780026 813721 847918 881106 912090
61842 912090 940647 966909 990078 1008143 1019289 1023505 1022416 1017594 1009543 998468 985469 972474
61830 972474 961171 952381 946354 943353 943835 948149 956008 966306 977682 989257 1000495 1010272 1016628
61817 1016628 1017838 1013467 1003972 989621 970270 946052 917756 886544 853699 820587 788308 757269
61805 757269 727372 698673 671552 646298 622992 601892 583434 567690 554187 542478 532566 524497
61793 524497 517847 511921 506235 500629 495192 490353 486716 484334 482321 479672 476428 473594 471869 470895
61779 470895 469908 468706 467677 467129 466964 466936 466918 466892 466840 466720 466406 465713 464617 463462 462776 462815 463417 464347 465598
61760 465598 467204 468940 470466 471823 473588 476441 480551 485292 489484 492014 492526 491609 490199 488686 486693
61745 486693 483756 479986 475935 472037 468477 465543 463719 463229 463627 464061 463964 463440 462957 462773 462755 462737 462865
61728 462865 463392 464222 465024 465894 467584 470665 474672 478473 481469 483905 485905 486857 486333 485247 485328 487311
61712 487311 490185 492456 493672 494367 494861 494713 493298 490501 486753 482677 478821 475475 472609 470056 467741
61697 467741 465569 463213 460413 457521 455289 453870 452414 450070 447079 444431 442599 441067 439044 436184
61683 436184 432573 428515 424533 421216 418782 416937 415303 413693 411847 409284 405789 401921 398680 396611
61669 396611 395390 394240 392659 390807 389300 388527 388134 387366 386032 384871 384726 385586 386794 388011 389470
61654 389470 391299 393099 394393 395149 395645 396119 396751 397770 399286 401275 403957 407858 413027 418456 422878
61639 422878 426184 429370 432945 436043 437566 437622 437129 436333 434543 431317 427105 422514 417628 412496 407708
61624 407708 403876 400801 397780 394664 392103 390669 390095 389576 388539 387011 385324 383638 381763 379460 376827
61609 376827 374222 371819 369485 367102 364640 361772 357908 352978 347821 343312 339367 335315 330985 326813
61595 326813 322992 319246 315553 312468 310504 309582 309231 308877 307879 305846 303114 300523 298565 297137 296157
61580 296157 295771 295756 295392 294356 293199 292508 292100 291548 291025 290925 291027 290738 290046 289554 289575 289800 289927 290150 290872
61561 290872 292223 293937 295470 296311 296460 296573 297370 298880 300496 301656 302242 302456 302706 303539 305210 307227
61545 307227 308654 309048 308866 308903 309510 310490 311559 312762 314437 316779 319487 321922 323586 324337 324214 323460
61529 323460 322728 322799 323740 324691 324807 324117 323208 322427 321836 321518 321414 321096 320322 319556 319365 319505 319273 318600 318028
61510 318028 317671 317035 316012 315233 315156 315480 315792 316166 316717 317075 316822 316098 315368 314886 314681 314777 315080 315345 315564
61491 315564 316082 317066 318180 319034 319582 319742 319098 317550 315920 315269 315726 316601 317578 319126 321586 324441 326851
61474 326851 328538 329733 330542 330871 330973 331556 333003 334695 335490 334925 333639 332560 332040 331945 332182 332691 333218
61457 333218 333684 334651 336745 339547 341680 342294 341934 341624 341601 341390 340735 339924 339391 339414 340068 341127 342145 342963
61439 342963 344000 345771 348282 351173 354185 357070 359306 360505 361090 362054 363919 366284 368446 370108 371392
61424 371392 372529 373658 374687 375302 375386 375472 376366 378193 380178 381594 382595 383827 385444 386902 387612 387462
61408 387462 386696 385566 384159 382405 380132 377293 374224 371564 369761 368649 367645 366440 365391 365077 365481
61393 365481 365867 365632 365115 365224 366282 367525 367956 367486 367004 367418 368893 370984 373125 374821 375662 375601 375249
61376 375249 375564 376972 378938 380598 381748 382974 384864 387317 389724 391624 393031 394276 395711 397545
61362 397545 399808 402386 405209 408420 412299 416942 422033 427042 431688 436204 441110 446825 453531 461269
61348 461269 469859 478693 486896 493904 499764 504667 508437 510803 512076 513103 514515 516376 518607 521268
61334 521268 524098 526164 526485 524943 522292 519324 516320 513241 510027 506557 502633 498282 493940 490142
61320 490142 487047 484441 482192 480509 479676 479643 480060 480783 482222 485075 489651 495539 501962 508452 515166
61305 515166 522600 531057 540381 550136 559901 569319 577930 585133 590409 593555 594685 594075 592056 588985
61291 588985 585296 581548 578287 575571 572610 568278 562332 555907 550466 546342 542685 538827 535242 532961
61277 532961 532386 532971 533952 535031 536355 538065 540079 542299 544833 547801 550980 553901 556389 558821 561689
61262 561689 565124 569107 573941 580125 587758 596312 604973 612964 619654 624722 628353 631024 633074 634632
61248 634632 635817 636583 636340 634211 629871 623913 617261 610497 603770 597018 590076 582898 575855 569601 564482
61233 564482 560336 556952 554374 552590 551290 550279 549869 550518 552256 554726 557636 560842 564138 567280 570295
61218 570295 573555 577470 582160 587397 592902 598730 605240 612400 619218 624287 627042 628252 629231 630909
61204 630909 633679 637590 642328 647373 652615 658645 666150 675252 685676 697303 710187 724172 738765
61191 738765 753277 766918 779013 789343 798052 805008 809633 811729 812124 812010 811771 810869 808722 805263
61177 805263 800696 795137 788524 780711 771727 762127 752829 744263 735861 726738 716685 706163 695531
61164 695531 684728 673616 662185 650491 638772 627526 617134 607481 598319 589842 582517 576516
61152 576516 571766 568366 566417 565575 565367 565806 567001 568182 567921 565576 561834 557508 552441 546042 538467
61137 538467 530777 524207 519581 517149 516578 517250 518809 521217 524263 527497 531032 535888 542964 551915 561665
61122 561665 571909 583433 596918 612145 628645 646557 666188 687041 707948 728234 748212
61111 748212 768346 788407 807856 826622 844871 862172 877634 890989 902853 913505 922005 927060
61099 927060 928474 927105 923560 917578 908677 896875 882608 866425 848938 830773 812323 793766
61087 793766 775406 757739 741076 725301 710185 695832 682700 671262 661683 653711 646892 640910
61075 640910 635742 631468 628114 625745 624509 624352 624890 625784 627128 629265 632427 636786 642584 649790 657819
61060 657819 666068 674669 684303 695275 707186 719569 732505 746554 762336 780175 799890 820976
61048 820976 843195 866828 892083 918531 945551 973122 1001708 1031534 1062585 1095148 1129669
61037 1129669 1166017 1203601 1242322 1282745 1325129 1368941 1413687 1459778 1508223 1559845 1614935
61026 1614935 1673221 1733906 1796179 1860109 1926880 1998025 2074734 2158023 2249179 2349773 2461443
61015 2461443 2585689 2723737 2876912 3048005 3242629 3469122 3737396 4058488 4444918
61006 4444918 4910083 5466552 6125290 6896816 7793211 8830310 10029697 11415871 13001079
60997 13001079 14758022 16595567 18358721 19862523 20949288 21544791 21688053 21519931
60989 21519931 21233317 21004960 20935667 21018769 21144024 21134537 20807255 20038623 18809593 17208956
60979 17208956 15394342 13533897 11759744 10150772 8740091 7530920 6509556 5654196
60971 5654196 4941551 4350730 3863427 3462463 3131548 2856312 2624933 2427959 2258051
60962 2258051 2109647 1978286 1860336 1753562 1657326 1571451 1494999 1426581 1365436 1311447
60952 1311447 1264175 1222430 1184643 1149173 1114560 1080138 1046342 1013925 983085 953726 926089
60941 926089 900300 875661 851388 827859 806118 786086 766371 746117 726125 707712 691213
60930 691213 676071 661781 648257 635695 624471 614828 606432 598654 591470 585547 581115 577357 573359
60917 573359 569202 565603 562824 560448 558067 555746 553918 553070 553397 554519 555712 556628 557573 558907 560467
60902 560467 561883 563116 564280 565106 565046 563950 562324 560774 559318 557293 553967 549315 544174 539498 535428
60887 535428 531304 526501 520947 514843 508314 501552 494838 488156 481110 473557 465942 458672 451480 444002
60873 444002 436793 431139 427722 425908 424501 422819 420911 419091 417626 416725 416528 417058 418308 420361 423287
60858 423287 426914 430768 434298 437127 439142 440521 441773 443608 446493 450277 454321 458059 461333 464200
60844 464200 466659 468685 470302 471439 471854 471447 470498 469391 468166 466604 464602 462169 459148 455399 451248
60829 451248 447333 443846 440352 436551 432868 429927 427777 426024 424518 423449 422747 421873 420373 418328 416006
60814 416006 413332 409995 406019 401863 397858 393849 389635 385576 382357 380102 378031 375207 371485 367509
60800 367509 363905 360683 357478 354171 351167 349018 347802 346945 345721 343881 341696 339564 337861 337078 337577
60785 337577 339012 340417 341184 341667 342517 343766 345003 346180 347687 349741 352195 354918 357885 360860 363465
60770 363465 365703 368034 370722 373410 375473 376621 377097 377543 378660 380629 382718 383779 383341 382010 380671
60755 380671 379532 378171 376287 374138 372231 370812 369748 368872 368227 367829 367340 366356 365086 364286 364188 363866
60739 363866 362094 358612 354168 349582 345299 341527 338090 334229 329348 324016 319577 316648 314665 313026
60725 313026 311872 311404 311208 310778 310174 309649 309184 308910 309459 311154 313250 314695 315454 316360 317806 319305 320343
60708 320343 320969 321442 321895 322558 323782 325630 327829 330347 333491 337190 340672 343323 345487 347856 350350
60693 350350 352349 353984 356364 360146 364501 368026 370273 371756 372793 373151 372766 372009 371061 369804 368635
60678 368635 368547 369827 371328 371792 371386 371145 371322 371225 370461 369384 368273 367007 365609 364253 362549 359711
60662 359711 355756 351720 348310 345139 341796 338910 337454 337507 338387 339619 341131 342809 344547 346629 349495
60647 349495 353088 356773 359820 361775 362495 362097 360781 358617 355770 352946 351103 350377 349726 348009 345097
60632 345097 341674 338384 335576 333482 332223 331847 332600 334665 337374 339344 339949 340067 340776 341896 342589 342804
60616 342804 343121 343535 343481 342979 342712 342918 343062 342716 341924 340628 338689 336720 335985 336985 338762 340042 340561
60599 340561 340944 341818 343456 345804 348377 350462 351897 353419 355906 359398 363083 366067 368036 369411 370961
60584 370961 373006 374913 375701 375223 374334 373778 373414 372794 372059 371842 372592 374336 376905 380113 383874 388368
60568 388368 393913 400531 407890 415782 424264 433183 441987 450290 458143 465350 471007 474301 475483 475421 474455
60553 474455 472342 469232 465959 463224 461089 459538 458992 459930 462364 466043 470908 476974 483959 491517 499844
60538 499844 509672 521491 534968 549315 564056 579170 594392 608570 619984 627394 630744 630820 628357
60525 628357 623620 616793 608529 599946 592080 585438 579995 575462 571498 567827 564435 561700 560191 560117 561021
60510 561021 562146 563183 564547 566937 570762 576094 583049 591923 602933 616105 631652 650306 672970
60497 672970 699994 731046 765601 803110 842558 882420 921525 959627 996492 1030610 1059454
60486 1059454 1080955 1094011 1097599 1090501 1072573 1045585 1011995 973262 930083 883924 837262 792151
60474 792151 749283 708772 671234 637623 608294 582694 559937 539482 521293 505503 491994
60463 491994 480333 470095 461079 453148 446126 440058 435326 432108 429808 427423 424476 421358 418757 416992
60449 416992 415805 414487 412262 408927 405098 401591 398643 396041 393820 392246 391189 390127 388911 387982
60435 387982 387589 387333 386725 385785 384753 383652 382535 381831 381994 382969 384353 385873 387361 388440 388705 388262
60419 388262 387780 387935 388893 390252 391385 391913 391998 392079 392299 392415 392378 392636 393548 394722 395400 395434 395500 396257 397643
60400 397643 399173 400654 402354 404505 406895 409049 410730 412161 413767 415855 418544 421804 425342 428561
60386 428561 430934 432472 433670 434968 436454 438055 439756 441541 443370 445356 447769 450731 454014 457206
60372 457206 459916 461825 462825 463289 463977 465410 467418 469433 471129 472636 474298 476429 479210 482638 486537
60357 486537 490701 495001 499352 503736 508343 513600 519896 527294 535489 543953 552068 559241 564943 568630
60343 568630 569765 568141 564193 558785 552630 546049 539201 532254 525312 518496 512196 506946 502834 499322
60329 499322 495819 492306 489196 486696 484508 482060 478987 475461 472117 469544 467842 466806 466443 467034 468725
60314 468725 471383 474938 479493 485120 491900 500227 510562 522683 535535 548028 559616 569999 578834
60301 578834 586083 592211 597541 601735 604229 604814 603380 599511 592864 583691 572552 559827 546030 532300
60287 532300 519939 509547 501070 494377 489186 484605 479613 474080 468758 464227 460453 457345 454975 453107
60273 453107 451164 449010 447174 445969 444954 443602 442030 440599 439196 437462 435442 433484 431667 429869
60259 429869 428340 427699 428221 429442 430613 431357 431721 431818 431638 431192 430665 430282 430085 429991 430056 430506 431378 432278 432724
60240 432724 432646 432410 432406 432795 433529 434341 434781 434584 434051 433834 434318 435341 436487 437432 438067 438618 439619 441452
60222 441452 443891 446457 449180 452539 456540 460460 463855 467363 472011 477936 484291 490295 495931 501588
60208 501588 507433 513301 518896 523890 527964 530998 533267 535275 537339 539399 541377 543592 546547 550172
60194 550172 553608 556028 557480 558569 559444 559564 558490 556415 553821 551015 548190 545523 542974 540320 537618
60179 537618 535299 533560 531978 530001 527540 524840 522170 519920 518604 518205 517851 516663 514755 512905 511443
60164 511443 510045 508514 507102 506022 505265 504996 505579 506953 508414 509263 509375 509069 508762 508869 509548 510342 510499
60147 510499 509896 509274 509303 509840 510421 511081 512219 513921 515926 518154 520864 524300 528424 532929 537299 541026
60131 541026 544017 546683 549421 552174 554659 556782 558525 559707 560247 560486 560846 561374 561974 562884 564349 565957
60115 565957 566971 567314 567665 568396 569012 568912 568206 567467 566983 566572 565858 564493 562330 559635 556979 554709 552716
60098 552716 550784 548956 547446 546464 546157 546494 547182 548097 549800 553057 557701 562566 566799 570597 574245
60083 574245 577129 578394 578127 577140 575906 574371 572489 570119 566589 561267 554576 547684 541102 534344 527057
60068 527057 519705 512887 506696 501113 496349 492331 488422 484164 479894 476143 472810 469439 466018 462997
60054 462997 460676 459020 457936 457330 456965 456708 456875 458016 460324 463483 467006 470461 473437 475637 477106
60039 477106 478204 479343 480851 482989 485835 489062 491943 493713 493994 492960 491122 488823 485927 482126
60025 482126 477548 472858 468621 464754 460711 456121 451116 446166 441708 437787 433949 429532 424231 418384
60011 418384 412733 407943 404246 401427 399197 397680 397345 398211 399338 399538 398512 396849 395107 393482 392346
59996 392346 392245 393084 394018 394568 395270 396771 398878 401022 403151 405512 407996 410346 412684 415091 416938
59981 416938 417441 416800 416088 415978 416186 416207 415988 415706 415386 414935 414257 413292 412214 411505 411471 411757 411749 411343 410888 410528
59961 410528 410174 409978 410168 410445 410295 409974 410383 411733 413089 413583 413435 413314 413313 413147 412882 412859 413097 413283 413167
59942 413167 412606 411500 410084 409002 408628 408512 407974 407074 406473 406468 406698 406828 407002 407482 408254 409313 411003 413809
59924 413809 417834 422644 427562 432024 435774 438817 441254 443143 444502 445336 445599 445261 444577 444217 444891 446721
59908 446721 449098 451251 452893 454281 455732 457241 458538 459388 459787 460010 460550 461841 463832 465860 467270
59893 467270 468164 469267 471036 473276 475850 479282 484128 490021 495959 501523 507216 513470 519900 525894
59879 525894 531552 537561 544252 551127 557329 562340 566186 569117 571207 572280 572243 571404 570308 569208 567852
59864 567852 565903 563482 561179 559487 558284 556894 554771 552089 549604 547961 547319 547634 548929 551182 554299
59849 554299 558477 564168 571222 578407 584400 589056 593014 596161 597397 596172 593529 591153 589902 589710
59835 589710 590318 591349 591878 590687 587251 582252 577039 572653 569290 566569 564214 562397 561235 560180 558364
59820 558364 555614 552628 549917 547064 543322 538528 533060 527289 521595 516577 512644 509502 506540 503612
59806 503612 500917 498258 495026 491084 487120 483846 481186 478543 475680 473108 471601 471395 471825 471840 470974
59791 470974 469710 468767 468254 467842 467517 467614 468126 468533 468538 468530 469029 470043 471220 472361 473383 473987 473801 472903 471925
59772 471925 471628 472513 474700 477910 481537 484993 488056 490754 493009 494737 496256 498222 500955 504071 507011
59757 507011 509659 512260 515037 518212 522069 526484 530602 533593 535748 538215 541584 545333 548850 552295
59743 552295 556074 560063 563960 567921 572144 576158 579241 581446 583535 585905 588223 590054 591305 592041
59729 592041 592488 593279 595030 597512 599763 601202 602132 603046 604015 604914 605622 605787 605044 603688 602478 601472
59713 601472 599847 597336 595002 593841 593337 592368 591031 590449 590916 591386 590989 590161 589890 590509 591614 592707
59697 592707 593543 594145 594835 596033 597809 599760 601414 602555 603029 602537 600859 598168 595021 592041 589587
59682 589587 587560 585474 582837 579590 576133 572949 570175 567476 564268 560232 555675 551255 547260 543374
59668 543374 539294 535263 531716 528629 525620 522616 520077 518581 518416 519471 521205 522800 523777 524496 525740
59653 525740 527778 530129 532240 534021 535604 536873 537428 536895 535224 532819 530278 527803 524876 520885 516066
59638 516066 511470 507869 505082 502552 500219 498465 497384 496525 495372 493802 491982 490041 487954 485608
59624 485608 482835 479415 475329 471034 467298 464518 462292 459900 457142 454416 451986 449569 446886 444288
59610 444288 442532 442083 442832 444354 446181 447969 449625 451235 452720 453726 454095 454231 454674 455409 455988 456303
59594 456303 456917 458466 460951 463733 466098 467716 468699 469360 470003 470856 471949 472880 472894 471584 469484 467530
59578 467530 465985 464355 462460 460827 459734 458571 456782 454821 453378 452102 450051 447304 445124 444340
59564 444340 444366 444107 443163 441803 440315 438875 437694 436840 436057 435130 434376 434574 436342 439538 443242 446471
59548 446471 449096 451969 455988 461243 467294 473986 481507 489898 499122 509600 522079 536790 553063
59535 553063 569719 585348 598226 606605 609459 606876 599948 590730 581955 575728 572124 569672 567412
59522 567412 565848 565691 566503 567165 567069 566224 564619 562087 558561 553958 548038 540839 533083 525708 519119 513119
59506 513119 507340 501461 495334 489233 483733 479018 474626 470216 466184 463062 460675 458517 456652 455564
59492 455564 455222 455038 454770 454803 455351 455989 456303 456607 457601 459493 461682 463282 463964 464423 465968 469350 473943
59475 473943 478282 481500 483997 486706 489978 493363 496148 497859 498404 498076 497452 497083 497121 497375 497794 498770
59459 498770 500838 504135 508316 513070 518464 524645 531369 538145 544754 551317 557828 563884 568975 572790
59445 572790 575204 576201 575941 574580 571931 567579 561594 554873 548586 543423 539519 536726 534682 532879 531125
59430 531125 529854 529612 530356 531597 533214 535720 539648 545064 551829 560091 570216 582344 596219 611455
59416 611455 627840 645372 664139 684317 706183 729751 753949 776100 792561 800342 798516 788530
59404 788530 773541 757307 743030 732612 726799 725791 729320 736052 743370 748223 748160 741662 728205
59391 728205 708777 686162 663940 644670 628991 616281 605817 597282 590640 585820 582517 580247
59379 580247 578720 578124 578851 580917 583835 587087 590432 593683 596479 598576 600255 602129 604469 606876 608707
59364 608707 609722 610248 610795 611633 612752 614112 615899 618590 622749 628607 635783 643575 651642 660291 670005
59349 670005 680879 692640 705041 717932 731095 744298 757461 770449 782802 793975 803763 812078
59337 812078 818328 821564 821466 818783 814526 809004 801887 792949 782442 770899 758791 746369 733770
59324 733770 721337 709735 699513 690595 682482 674868 667708 660781 653757 646657 639670 632491 624625
59311 624625 616538 609659 604823 601550 599378 598970 600961 604467 608006 611629 616911 624807 634459 644125
59297 644125 652159 656841 656397 650103 638989 624998 609728 594258 579640 566903 556606 548670 542646
59284 542646 538105 534887 533037 532343 532166 532117 532810 535376 540184 546578 553931 562219 571329 580568 589465
59269 589465 598488 608268 618450 628003 636475 644201 651326 657283 661333 663097 662464 659576 655181 650493
59255 650493 646232 642053 637236 631716 626067 620716 615693 611159 607691 605782 605310 605688 606423 607440 609083
59240 609083 611941 616411 622157 628140 633478 638209 643013 648261 653647 658592 662577 665093 665800 664913 663036
59225 663036 660362 656419 650926 644477 637922 631317 624070 616042 607939 600519 593835 587497 581315 575427
59211 575427 570007 565144 560918 557345 554182 550986 547471 543806 540509 538047 536557 535873 535703 535762 535961
59196 535961 536557 537931 540019 542135 543676 544882 546514 548871 551589 554424 557648 561447 565462 569323
59182 569323 573266 577793 582972 588425 593722 598468 602349 605569 609042 613601 619099 624699 629934 635000
59168 635000 640059 644784 648733 651790 654157 656093 657735 658975 659478 658992 657551 655215 651783 647011 641018
59153 641018 634186 626799 618986 610819 602201 592940 583359 574583 567631 562293 557377 551996 546172 540291
59139 540291 534574 529160 524185 519622 515400 511661 508563 505932 503628 502097 501840 502313 502219 501160 500267
59124 500267 500760 502583 505019 508046 512262 517724 523626 529235 534702 540871 548577 558142 569190 580846
59110 580846 592250 603010 613169 622869 632108 640767 648723 655976 662635 668709 673925 677829 680097
59097 680097 680629 679525 677151 674137 671028 668041 665389 663608 663044 663139 662816 661704 660431 659568 658841 657588
59081 657588 655439 652163 647428 641252 634377 627626 621111 614494 607869 601847 596754 592213 587616 582802
59067 582802 578221 574558 572102 570318 568153 564935 560958 557017 553540 550358 547126 543663 539893 535802
59053 535802 531572 527655 524561 522534 521353 520427 519207 517588 515938 514752 514324 514640 515381 516032 516243 516046
59037 516046 515651 515116 514493 514108 514252 514661 514848 515059 516353 519517 524400 530543 537883 546433 555809 565643
59021 565643 576080 587219 598361 608555 617766 626742 635661 643557 649351 652894 654664 654893 653529
59008 653529 650883 647839 645241 643286 641666 640300 639727 640622 642975 645992 648930 651792 654966 658342 661142
58993 661142 662634 662773 662089 661209 660586 660423 660500 660106 658414 655254 651512 648567 647116 646563 645754 644317 643103
58976 643103 643323 645551 649732 655846 664047 674071 684915 695402 705044 714158 723199 732206 740980 749522
58962 749522 757949 766009 773066 778744 783340 787336 790637 792528 792255 789438 784101 776646 767731 757803
58948 757803 746702 734056 720068 705622 691572 678293 666013 655181 646240 639198 633651 629108
58936 629108 625257 622066 619689 618123 616971 615784 614596 613802 613447 613008 612036 610681 609401 608392 607467
58921 607467 606300 604630 602465 600207 598362 597014 595832 594638 593637 593012 592664 592624 593342 595212 598086
58906 598086 601607 605843 611230 618001 625989 634982 645006 656206 668573 681741 694991 707570 719128
58893 719128 729882 740359 751080 762387 774320 786704 799560 813355 828450 844304 859616
58882 859616 873330 885060 894480 900912 903917 903891 901644 897629 891842 884187 874625 863249 850633 837920
58868 837920 826244 816124 807569 800451 794452 788921 783204 777094 770723 764183 757486 750696 743807 736598
58854 736598 728836 720518 711778 702771 693832 685439 677743 670324 662700 654893 647275 640084 633300 626751
58840 626751 620087 612905 605274 597929 591629 586483 582121 578248 574691 571192 567604 564179 561300 559047
58826 559047 557390 556609 557085 558687 560801 563077 565805 569403 573674 577754 580880 583221 585817 589439 593604
58811 593604 597001 598871 599616 600052 600564 601076 601287 600722 599042 596607 594210 591979 589135 585227 580982 577278
58795 577278 573839 569670 564506 559083 554142 549836 546035 542667 539707 537237 535507 534641 534500 535065 536666
58780 536666 539474 543130 547297 552119 557584 562797 566626 568865 570087 570539 569837 567645 563960 558774 552141
58765 552141 544596 536975 529735 522854 516313 510237 504731 500118 497146 496365 497320 498979 500872 503161 505691
58750 505691 507749 508950 509723 510705 512126 513938 516115 518632 521465 524693 528379 532409 536728 541512 546731
58735 546731 551826 556352 560688 565504 570732 575828 580871 586589 593263 600386 607417 614041 619592 623181
58721 623181 624845 625900 627740 630726 634473 638616 642972 647506 652531 658489 665101 671138 675388 677617
58707 677617 678334 677933 676380 673415 668730 662029 653151 642130 629214 614971 600272 585832 571811
58694 571811 558088 544825 532445 521257 511465 503331 496830 491282 485875 480462 475387 470750 466500
58681 466500 463032 460864 459722 458697 457407 456269 455608 455302 455432 456399 458141 460089 462283 465790 471488
58666 471488 479042 487584 496887 507376 519283 532168 544958 556187 564538 569445 571061 569707 565789
58653 565789 560222 554277 548718 543381 537708 531293 524034 516387 509475 504299 500741 497969 495809 494885
58639 494885 495371 496529 497790 499379 501499 503663 505298 506307 506649 506117 504922 503708 502509 500471 497179
58624 497179 493548 490779 489103 488174 488017 488782 490079 491396 492942 495399 499078 503863 509693 516503 523760
58609 523760 530516 535915 539595 541867 543575 545353 546918 547560 547254 546616 545763 544246 542251 540701 539673
58594 539673 537961 534968 531962 530509 530626 531553 533413 536747 541052 545252 549341 554271 560369 567088 574289
58579 574289 582513 591816 601267 609866 617192 623167 628062 632840 638603 645458 652653 660050 668658 679455
58565 679455 692425 707178 723803 742513 762861 783912 805005 825842 845877 864031 879227
58554 879227 891059 899863 906218 910475 912714 912920 911070 907202 901629 894978 887748 879971 871584 862825
58540 862825 853738 843508 831042 816243 800022 783051 765376 747476 730719 716248 704090 693833
58528 693833 685480 679101 674312 670686 668183 666656 665530 664445 663588 662905 661662 659403 656673 654149 651745
58513 651745 649276 647240 646069 645192 643771 641774 639437 636389 632487 628972 627329 627176 626573 624484 621749
58498 621749 619542 618050 616988 616357 616169 616137 616125 616480 617594 619556 622361 626060 630538 635509 640881 646901
58482 646901 653955 662414 672458 683763 695522 707155 718787 730644 742173 752196 759829 764897
58470 764897 767595 768029 766000 761203 753978 745871 738729 732972 727519 721785 716859 714108 713587 714684 717445
58455 717445 722134 728160 734649 741645 749536 757606 764324 768929 771691 772770 771943 769399 765792 761460
58441 761460 756460 751318 746841 743257 740402 738631 738541 739794 741191 742090 742934 744338 746442 749270 752941
58426 752941 757359 762325 768018 774778 782440 790319 797667 803596 807041 807621 806244 803976 800607 795287
58412 795287 788351 781340 775187 769390 763065 756036 748811 742314 737584 734959 733544 732171 730738 729902
58398 729902 729819 730144 731042 733170 736731 741465 747374 754404 761597 767656 772353 776394 780076 783186 786070
58383 786070 789553 793688 797710 801328 805037 809150 813581 818594 824604 831161 837291 842977 849148 856105
58369 856105 863122 869853 876975 885042 893681 902208 910255 917665 924604 931837 940022 948800 957384 965828
58355 965828 974612 983257 990628 996530 1001737 1006496 1010391 1013727 1017601 1022432 1027648 1033009 1038981 1045684
58341 1045684 1052785 1060533 1069639 1080030 1091021 1102751 1116056 1130860 1146137 1161514 1177410 1193519
58329 1193519 1208763 1222852 1236265 1248547 1258413 1265835 1272257 1278414 1283692 1288051 1292717 1298420 1304678
58316 1304678 1311386 1319307 1328391 1337371 1345760 1354601 1364673 1375670 1387703 1401644 1417234 1432751
58304 1432751 1447461 1462565 1478890 1495592 1512208 1529995 1549851 1570496 1590121 1608520 1626571
58293 1626571 1644961 1664392 1685621 1708309 1731179 1754063 1778270 1804282 1830927 1857660 1885768
58282 1885768 1916279 1948555 1982031 2017403 2054846 2092880 2130370 2168082 2207059 2247128 2288032
58271 2288032 2330294 2373839 2417682 2462121 2509346 2560661 2614998 2671320 2730361 2792786 2857800
58260 2857800 2924980 2995331 3069036 3144331 3220061 3297198 3376349 3456202 3536067 3617632 3702450
58249 3702450 3790102 3880612 3976185 4078576 4187062 4300912 4421435 4549670 4684622 4825839
58239 4825839 4975121 5133656 5300206 5474281 5658184 5853681 6059696 6275765 6504607
58230 6504607 6748624 7007114 7279840 7570103 7881237 8213373 8566816 8945281 9352687
58221 9352687 9790406 10261041 10771071 11326199 11928270 12580752 13292933 14074631 14931723
58212 14931723 15871888 16909968 18062408 19341797 20763283 22351877 24137775 26150998
58204 26150998 28429203 31027236 34014247 37471691 41508145 46275259 51964117 58795620
58196 58795620 67025163 76943819 88850985 103019844 119693351 139102249 161476029
58189 161476029 187053414 216078186 248658477 284364757 321678523 357672673 388279862
58182 388279862 409178071 416983508 410291940 390139065 359645664 322987898 284204058
58175 284204058 246388804 211476108 180421746 153499495 130565128 111260444 95146008
58168 95146008 81763560 70666008 61448313 53769336 47347751 41947963 37377258 33485924
58160 33485924 30155643 27286085 24794152 22617209 20706846 19020318 17521326 16183594
58152 16183594 14986847 13911425 12940533 12063555 11272033 10555044 9902257 9307991 8768032
58143 8768032 8275574 7824148 7411163 7034201 6686534 6360397 6052319 5761651 5486610
58134 5486610 5225700 4980520 4752910 4541042 4341798 4155061 3982083 3821502 3670683
58125 3670683 3529472 3399042 3278192 3164123 3055865 2953915 2857525 2765321 2677650 2595549
58115 2595549 2518150 2443683 2372250 2305142 2242208 2182213 2125020 2071149 2019914 1970086 1921659
58104 1921659 1875025 1829275 1783283 1737590 1693316 1650156 1607346 1565637 1526263 1488781 1451903
58093 1451903 1415601 1380555 1346451 1312855 1280979 1252517 1227382 1204430 1183645 1165669 1149795
58082 1149795 1134428 1118992 1103584 1087333 1069006 1048899 1028403 1008069 987616 967368 947994
58071 947994 929293 910760 892949 876779 861969 847630 833874 821396 810015 799155 789164 780660
58059 780660 773101 765501 757959 750926 743618 734867 725007 715222 705560 695368 685157 676118 668079 659834
58045 659834 651349 643818 637582 631722 625764 620141 614904 609517 604014 598859 593646 587453 580545 574217
58031 574217 568776 563121 556507 549335 541948 533984 525284 516320 507500 499024 491470 485371 480217 475010
58017 475010 469849 465743 462843 460194 457394 455142 453845 452935 451995 451400 451376 451422 451147 450792 450513 449960 448987
58000 448987 448076 447697 447796 448112 448474 448747 449028 449825 451427 453250 454425 454741 454282 452576 449241 445191 441981
57983 441981 439936 438049 435670 433061 430205 426374 421325 415877 410880 406400 402243 398485 395201 392336
57969 392336 390022 388360 386925 385225 383572 382604 382018 380842 378991 377509 377080 377344 377840 378546 379202 379162
57953 379162 378308 377215 376123 374584 372394 369924 367254 363964 360216 357157 355730 355831 356949 358914 361668
57938 361668 365114 369549 375481 382724 390439 398307 406760 415755 424233 431232 436604 440218 441441 440008
57924 440008 436596 431890 425824 418340 410094 401711 392999 383639 374094 365230 357473 350884 345575 341504
57910 341504 338333 335965 334764 334842 335688 336946 338940 341865 345007 347378 348743 349501 349996 350446 351145 352247
57894 352247 353723 355807 358959 362979 366843 369930 372768 375978 379139 381481 383093 384567 385830 386257
57880 386257 385701 384536 382808 380120 376388 372024 367353 362380 357109 351588 345728 339612 333912 329419
57866 329419 326154 323489 321219 319926 320170 321826 324413 327640 331318 335072 338518 341644 344798 348340
57852 348340 352409 356943 361719 366350 370444 373919 377111 380388 383563 385907 386895 386795 386257 385431 383844
57837 383844 381191 377957 375095 373170 371966 370900 369796 369098 369120 369213 368234 366000 363717 362554 362282 361867
57821 361867 360934 359884 358956 358075 357463 357477 357801 357606 356524 354657 351587 346395 338925 330185 321189 312200
57805 312200 303360 295153 287766 280848 274421 269257 265777 263275 260907 258835 257670 257323 257203 257172 257567
57790 257567 258467 259551 260496 261062 261042 260628 260623 261815 264315 267783 271995 276813 281964 287342 293216 299717
57774 299717 306376 312620 318499 324402 330255 335386 339056 340884 341031 340249 339439 338777 337570 335276 332301
57759 332301 329433 326851 324143 320983 317351 313372 309330 305635 302355 299050 295416 291750 288473 285599
57745 285599 283068 281158 280055 279364 278627 277930 277442 276688 274940 272151 268910 265696 262767 260586 259667 260011
57729 260011 261207 263045 265539 268477 271441 274310 277322 280647 284148 287462 290108 291808 293013 294716
57715 294716 297317 299995 301727 302544 303192 303934 304409 304455 304261 303699 302210 299468 295737 291554 287464 283930
57699 283930 281080 278633 276396 274628 273479 272442 270938 269097 267282 265157 262107 258412 255102 252614
57685 252614 250486 248452 246980 246482 246719 247370 248659 251117 255211 261367 269897 280762 293819 309454
57671 309454 328491 351432 378281 409080 443972 482504 523291 564272 602440 633273 651552
57660 651552 653754 639696 611958 574473 531859 488875 449107 413905 383019 356095 333274 314680
57648 314680 300000 288656 279983 273097 266939 260745 254614 249539 246626 245993 246448 246476 245506 244062 242878
57633 242878 242288 242296 242600 242449 241048 238469 235784 234029 233279 232984 232844 232986 233412 233622 232941 231168 228917
57616 228917 227185 226444 226312 226253 226306 226781 227509 227993 228178 228443 228756 228507 227338 225613 223819 222050 220319
57599 220319 218864 217751 216586 215055 213420 212102 211065 209932 208518 206883 205028 202930 200836 199234
57585 199234 198414 198168 197945 197340 196455 195679 195071 194221 192902 191519 190486 189462 187819 185692 183806 182345
57569 182345 180823 179171 178001 177413 176451 174362 171763 169853 168926 168345 167577 166517 165095 163284 161439
57554 161439 159967 158694 157134 155434 154480 154900 156282 157524 157779 157052 156114 155817 156318 156998 157308 157543 158510
57537 158510 160503 162922 164885 165947 166157 165693 164614 162881 160530 157784 155032 152650 150814 149382 147950
57522 147950 146111 143820 141423 139255 137418 136153 136084 137598 140135 142684 144951 147477 150630 154243 158384
57507 158384 163650 170195 177180 183790 190338 197676 205866 214084 221603 228255 234048 238949 243041 246416
57493 246416 248908 250306 250735 250534 249890 248994 248293 248049 247772 246689 244756 242666 240804 238845 236533 234252
57477 234252 232444 230941 229350 227826 226874 226443 225727 224117 222076 220740 220733 221597 222477 223033 223554 224421 225811
57460 225811 227763 230039 231899 232542 232036 231453 231839 233296 235240 237159 238795 239978 240827 241921 243828
57445 243828 246393 248862 250660 251782 252509 253094 253761 254715 256024 257606 259320 260954 262220 262953 263306 263672
57429 263672 264460 265940 268117 270620 272932 274911 276892 279165 281550 283667 285345 286599 287505 288361 289689
57414 289689 291803 294560 297733 301225 304674 307326 308856 310005 311832 314552 317611 320596 323432 325878
57400 325878 327669 329172 331159 333721 336048 337487 338289 339051 339982 341043 342401 344300 346679 349265 351907
57385 351907 354676 357765 361368 365414 369392 372737 375505 378339 381624 385042 388158 391088 394243 397711
57371 397711 401305 405052 409226 413900 418804 423675 428497 433316 438010 442409 446592 450921 455689 460754
57357 460754 465653 470160 474628 479595 485053 490334 494855 498784 502832 507446 512412 517232 521698 526012
57343 526012 530481 535274 540433 545961 551842 558133 565028 572600 580328 587221 592786 597732 603268 609749
57329 609749 616475 622821 629014 635580 642580 649792 657287 665352 674037 683069 692033 700405 707758 714279
57315 714279 720857 728287 736628 745663 755554 766470 777806 788455 797864 806328 814338 822262 830658
57302 830658 840219 851101 862692 874270 885601 896830 908174 919884 932202 945110 958311 971549
57290 971549 984845 998405 1012496 1027335 1042815 1058379 1073466 1088024 1102298 1116270 1129744
57279 1129744 1142908 1156249 1169863 1183392 1196769 1210471 1224793 1239378 1253802 1268246 1283245
57268 1283245 1299096 1315875 1333741 1352754 1372525 1392423 1412140 1431842 1451829 1472297 1493362
57257 1493362 1515029 1537083 1559174 1581151 1603314 1626301 1650591 1675994 1701640 1726650 1750887
57246 1750887 1775005 1799765 1825408 1851692 1878428 1905869 1934520 1964495 1995123 2025460 2055278
57235 2055278 2085299 2116292 2148211 2180554 2213276 2246880 2281697 2317493 2353799 2390295 2426911
57224 2426911 2463884 2501670 2540477 2579939 2619597 2659632 2700695 2743050 2786281 2829839 2873381
57213 2873381 2916575 2959198 3001693 3045137 3090208 3136308 3181922 3225635 3266746 3305247 3341592
57202 3341592 3376468 3410560 3444378 3478156 3511771 3544895 3577369 3609308 3640702 3671236 3700866
57191 3700866 3730336 3760639 3792097 3824494 3857990 3893334 3931121 3971325 4013600 4057428 4101926
57180 4101926 4145984 4188860 4230343 4270367 4308916 4346216 4382467 4417428 4450949 4483934 4517890
57169 4517890 4553193 4588446 4622005 4653609 4684148 4714437 4744742 4775005 4804847 4833575 4860728
57158 4860728 4886655 4912252 4938176 4964448 4990662 5016466 5041982 5067817 5094476 5121828 5149446
57147 5149446 5177314 5205707 5234375 5262468 5289406 5315232 5339884 5362612 5382345 5398241 5409830
57136 5409830 5417138 5420874 5421978 5420850 5417505 5412566 5407498 5403716 5402146 5403744 5409524 5419632 5433158
57123 5433158 5449396 5468702 5491681 5518107 5547059 5577624 5609154 5641689 5676778 5717485 5767102
57112 5767102 5828180 5902834 5993147 6100807 6227127 6374049 6544738 6743159 6974153 7244584
57102 7244584 7563839 7943160 8395889 8939229 9594919 10387608 11343718 12492319 13865068
57093 13865068 15492810 17401431 19610250 22132171 24973989 28137911 31623458 35424549
57085 35424549 39520056 43865189 48390217 53001454 57576033 61954606 65945988 69349534
57077 69349534 71986403 73727745 74512684 74350167 73301142 71449695 68882394 65687032
57069 65687032 61962463 57824345 53402106 48832000 44249111 39777345 35519206 31549905
57061 31549905 27917045 24643190 21729712 19162302 16917115 14965146 13274633 11813206
57053 11813206 10550161 9457641 8510751 7687870 6971128 6345903 5799491 5320394 4898576
57044 4898576 4525769 4195323 3901929 3641219 3409294 3202714 3019062 2856892 2714620
57035 2714620 2589797 2480018 2384147 2302098 2233849 2179537 2140195 2117130 2109626 2113062 2119002
57024 2119002 2117006 2097290 2053609 1985249 1896831 1795988 1690491 1586407 1487720 1396920 1315550
57013 1315550 1244098 1181709 1126707 1077830 1034760 997351 964877 936359 911205 889048 869289
57002 869289 851276 834694 819308 804582 790082 776030 762899 750617 738739 727363 717267
56991 717267 709020 702432 696999 692513 689086 686957 686490 688121 692030 697726 703785 707945 707822 702066 690875
56976 690875 675274 656164 634403 611482 589288 569002 550680 534096 519525 507456 497993 490960
56964 490960 486396 484641 486086 491064 499809 512191 527610 545348 564815 584995 603729 618055
56952 618055 625542 625110 616674 600744 578860 553835 528648 504998 483456 464842 450469 440783
56940 440783 434654 430738 429075 430735 436408 446090 459807 477764 499812 525487 554343 585211 614957
56927 614957 638921 653142 655860 647019 627473 599261 565804 530742 496616 464903 436723 412780
56915 412780 392842 376001 361498 348994 338238 328944 320956 314162 308366 303523 299928 297752 296472
56902 296472 295218 293746 292749 293138 295203 298571 302773 307714 313651 320806 329123 338501 349191 361718
56888 361718 376444 393340 412126 432276 452821 472392 489418 502034 508095 506087 496396 481245
56876 481245 463208 444193 425902 410297 398861 391813 388685 389469 394689 404730 419718 439922
56864 439922 465623 496665 532714 574010 621302 674643 732167 789699 841204 880001 900662
56853 900662 900736 881279 846163 800998 751985 704620 662621 627844 601088 582918 573846 574093 583374
56840 583374 601103 627073 661984 707083 763141 829961 906813 992588 1084690 1177451 1261767
56829 1261767 1326632 1362079 1362490 1328645 1267028 1186799 1096983 1005527 919144 842478 777371 723780
56817 723780 681594 651187 632482 624456 625973 636666 656700 686070 724471 771558 826736 888251
56805 888251 952186 1012184 1060397 1089335 1093776 1072088 1026792 964112 892126 818210 747480 683035
56793 683035 626739 579347 540512 509623 486658 471841 464676 464050 469259 480343 497293 519558
56781 519558 546522 577722 611821 645335 672860 688982 690393 676753 650114 613778 571413 526560
56769 526560 482209 440494 402811 370025 342265 318704 298217 280494 266034 254852 245831 237793
56757 237793 230653 224910 220426 216418 212419 208537 204829 201095 197312 193720 190432 187438 184963 183291
56743 183291 182223 181229 180195 179435 178870 177883 176333 175146 175285 176363 176881 175915 174155 173021 172977 173129 172509
56726 172509 171310 170451 170227 170054 169526 168973 168673 168227 167262 166287 166219 167374 169493 172385 175770 178763 180355
56709 180355 180544 180322 180486 181018 181734 182784 184218 185590 186366 186472 186172 185697 185206 184875 184784 184828 184936 185266
56691 185266 186061 187314 188604 189273 188940 187948 187193 187383 188577 190521 193170 196679 201058 206044 211173 215921
56675 215921 220062 224011 228412 233199 237504 240779 243449 246084 248501 250340 251978 254044 256326 257977
56661 257977 258751 259272 260081 261051 261834 262340 262662 262924 263186 263209 262448 260639 258153 255391 252176 248281 244163
56644 244163 240475 237133 233611 229875 226242 222539 218295 213684 209400 205649 202126 198917 196420 194338
56630 194338 191793 188706 186094 184675 184042 183613 183491 183858 184232 183965 183028 181849 180793 180128 180062 180403 180521
56613 180521 179938 178762 177418 176346 175965 176410 177206 177666 177692 177719 177913 178047 178160 178603 179325 179841 180054 180380
56595 180380 180892 181139 181055 181227 181918 182564 182600 182117 181408 180600 180090 180576 182165 184076 185614 186813 187801 188358
56577 188358 188582 189228 190704 192360 193363 193753 194087 194621 195442 196839 198943 201456 204264 207838 212487 217777
56561 217777 223233 229094 235736 242857 249921 256954 264234 271569 278518 284979 290928 295987 299956 303457
56547 303457 307377 311852 316275 319986 322442 323189 322411 321210 320574 320205 319013 316533 313212 309507 305498
56532 305498 301355 297465 293882 290146 285770 280556 274438 267411 259790 252240 245492 239987 235675 232078
56518 232078 228777 225896 223819 222413 221050 219569 218592 218517 218717 218244 216942 215416 214231 213635 213721 214428
56502 214428 215528 216893 218458 219737 219937 218978 217902 217769 218511 219298 219566 219254 218508 217704 217366 217550 217670
56485 217670 217359 217049 217279 217949 218754 219743 220847 221490 221493 221770 223205 225194 226199 225567 223985 222363 221083
56468 221083 220190 219535 218794 217970 217697 218420 219555 220186 220306 220517 220764 220372 219342 218593 218675 219100 219315 219657
56450 219657 220876 223001 225054 225831 224961 223305 222204 222187 222657 222983 223383 224361 225788 227178 228501 230061
56434 230061 231796 233286 234271 234660 234382 233788 233795 234920 236438 237203 237042 236617 236266 235907 235832 236533 237697 238333
56416 238333 238121 237878 238437 239732 241191 242487 243655 244887 246330 247791 248610 248265 247094 246103 246116 247370
56400 247370 249601 252116 254087 255318 256522 258343 260439 262134 263544 265277 267221 268471 268444 267424 266125
56385 266125 265269 265437 266660 268243 269536 270657 271927 273009 273397 273405 273751 274373 274533 273942 272921 271715 270601
56368 270601 270400 271750 273920 275449 275955 276216 276483 276067 274868 273980 274176 274833 275044 274937 275199 275975 276952
56351 276952 278048 279366 280752 281928 282944 284208 286098 288615 291234 293158 293995 294073 293879 293522 293159 293454
56335 293454 294901 296980 298785 300240 301857 303589 304921 306022 307699 310115 312511 314357 315899 317387
56321 317387 318654 319688 320874 322417 324211 326291 328681 330848 332214 333249 335074 337863 340629 342775
56307 342775 344816 347295 350008 352693 355511 358424 361014 363371 366327 370305 374690 378766 382475 385880
56293 385880 388760 391297 394402 398721 403858 409053 414048 418906 423635 428480 434022 440512 447528 454596
56279 454596 461704 468941 476225 483753 492156 501837 512526 523692 535033 546503 558339 571118 585276
56266 585276 600659 617130 635357 656113 678965 702797 727710 755273 786703 821930 860822
56255 860822 904199 953121 1008118 1069596 1138105 1213764 1296283 1385895 1483367 1588627 1700343
56244 1700343 1817196 1938510 2063098 2188596 2312568 2433218 2548171 2653595 2745495 2821278
56234 2821278 2879270 2917581 2934602 2930240 2905772 2862685 2802400 2726924 2639079 2541960 2438283
56223 2438283 2330054 2218796 2106348 1995215 1887569 1784085 1684617 1589811 1501033 1418739
56213 1418739 1342124 1270601 1204444 1143686 1087706 1036308 989967 948459 910474 875212 843161
56202 843161 814583 788520 764154 742065 723141 707092 692992 680434 669268 658999 649355 640786
56190 640786 633617 627337 621438 616254 612252 609207 606766 605104 604381 604181 604071 604052 604006 603566 603025 603398 605005
56173 605005 606981 608713 610687 613205 615466 616840 618063 620208 623368 627162 631626 636732 642011 647567
56159 647567 654475 663242 672811 682137 691753 702742 715029 727900 741495 756719 774273 794718
56147 794718 818816 846900 878553 913769 953736 999779 1052348 1111800 1179144 1254985 1338454
56136 1338454 1427858 1521333 1615998 1707538 1791843 1866452 1930043 1982065 2024051 2059861 2092880
56125 2092880 2123417 2149594 2169580 2181849 2184761 2177762 2162483 2141381 2115866 2086464 2053356 2015247
56113 2015247 1968841 1911249 1842615 1765447 1682572 1597115 1513220 1434768 1363610 1300202 1245104
56102 1245104 1198552 1159488 1126593 1099687 1078811 1062766 1049948 1039925 1032828 1027980 1024486 1022417
56090 1022417 1022172 1023478 1026206 1031159 1038642 1047262 1055524 1063674 1072590 1082011 1091339 1101069 1111791 1122777
56076 1122777 1133151 1143472 1154685 1166617 1178970 1192509 1207648 1223203 1238294 1254073 1271674
56065 1271674 1289886 1307009 1323619 1341261 1359648 1377480 1394925 1412904 1430963 1448227 1465479
56054 1465479 1483950 1502926 1520876 1538044 1555718 1574002 1592583 1612591 1635212 1659508 1684027
56043 1684027 1709406 1736947 1765898 1794922 1824949 1857615 1891997 1925921 1959474 1994178 2029727
56032 2029727 2064797 2100249 2138238 2178810 2220578 2263962 2310514 2359748 2409932 2461354 2515531
56021 2515531 2571924 2628881 2687173 2749167 2815076 2883425 2954491 3029695 3108285 3188362 3270684
56010 3270684 3357814 3450013 3545577 3644642 3749011 3858906 3973515 4093882 4221497 4355171
56000 4355171 4493360 4638351 4793695 4958709 5130140 5308081 5495328 5692181 5897278
55991 5897278 6112577 6341957 6585835 6842715 7114991 7407231 7719908 8051364 8405039
55982 8405039 8787833 9202022 9646005 10122576 10639050 11199747 11806279 12465172 13187175
55973 13187175 13979295 14846074 15798674 16853936 18024955 19322666 20767270 22388854
55965 22388854 24218100 26289010 28652378 31376580 34538267 38230304 42584277 47774803
55957 47774803 54004386 61502009 70534333 81389420 94333613 109594087 127382432
55950 127382432 147916921 171430896 198182480 228376311 261821609 297345273 332341767
55943 332341767 362924633 384781560 394385927 390060871 372497244 344513760 310124076
55936 310124076 273333653 237248178 203802711 173957732 148015873 125872156 107199383
55929 107199383 91585603 78604543 67836676 58891355 51436339 45202356 39963944
55922 39963944 35530828 31754074 28520803 25736472 23319539 21209133 19362333 17740242
55914 17740242 16304935 15028456 13892952 12880193 11969722 11147402 10406101 9736476 9125303
55905 9125303 8563896 8050146 7580757 7148709 6749482 6382652 6045716 5732655 5440106
55896 5440106 5169138 4919605 4688058 4472338 4272980 4089079 3917640 3757877 3611393
55887 3611393 3477408 3352538 3235914 3129601 3033040 2941630 2851782 2763135 2675104 2585788
55877 2585788 2495504 2407346 2323021 2241639 2163247 2089630 2020780 1954312 1889394 1827707 1769730
55866 1769730 1713661 1659028 1607845 1561098 1517201 1474941 1434821 1396608 1358586 1320314 1283305
55855 1283305 1248156 1213786 1180208 1149144 1121015 1094091 1067454 1042094 1018299 994746 971098
55844 971098 948903 928902 909858 890896 872648 855293 837833 820080 803182 787481 771989
55833 771989 756512 742061 728738 715557 702792 692027 683385 675142 666630 658953 652227 644739 635642
55820 635642 625968 616177 605281 593383 582488 573593 565254 556181 547068 538746 530789 523205 517427
55807 517427 514237 512507 511169 510702 511656 513529 516173 520494 526638 533192 539157 545002 550775 554957 556292
55792 556292 555082 551740 545859 537754 529120 520965 512564 503557 495258 488531 481974 473688 463618 452990
55778 452990 442824 434194 428472 425950 425291 425533 427573 432697 440693 450262 459922 467545 470435 467173
55764 467173 458557 446042 430559 413560 397455 383637 371325 359542 348985 340776 334605 329425
55752 329425 324912 320984 316866 311884 306341 300636 294478 287927 282092 277717 274154 270786 268271 267179
55738 267179 266549 265191 263387 261928 260376 257784 254492 251751 250072 249075 248415 247756 246432 244204 241693
55723 241693 239086 235216 229198 222263 216667 213269 211367 210366 210231 210721 211529 213112 216237 220753 225694
55708 225694 230418 234766 238339 240520 241162 240516 238704 235927 232864 230033 226914 222468 216473 209848 203782
55693 203782 198953 195287 192058 188526 184811 181812 180078 179372 179550 180936 183376 185917 188221 191351 196181
55678 196181 201693 205987 208498 210207 211935 213433 214014 213346 211615 209478 207707 206472 205221 203601 201967
55663 201967 200623 199223 197520 196112 195764 196454 197692 199297 201206 203085 204847 207110 210387 214170 217410
55648 217410 219498 220218 219304 216838 213697 210857 208456 206016 203170 199633 194937 188869 181894 174660 167504
55633 167504 160836 155367 151355 148182 145262 142803 141091 139735 138356 137362 137185 137337 137114 136677 136484 136133
55617 136133 134842 132759 130778 129236 127732 126044 124344 122613 120730 119072 118196 117877 117205 115733 113981
55602 113981 112713 112197 112180 112143 111601 110438 108978 107581 106390 105491 104926 104388 103532 102818 103340 105390 107877
55585 107877 109618 110464 110660 109971 108294 106414 105243 104747 104452 104464 105181 106468 107983 109878 112322 114771
55569 114771 116583 117956 119429 120881 121879 122600 123475 124206 124064 122863 120906 118416 115851 114208 113895 113716
55553 113716 112116 109156 106188 103941 102171 100970 100968 102099 103350 104006 104217 104262 104231 104532 105685 107374 108560
55536 108560 108764 108448 108052 107507 106868 106573 106793 107193 107516 107728 107508 106346 104316 102150 100411 99176 98435
55519 98435 98079 97537 96270 94690 93741 93489 93004 91817 90605 90097 90067 89803 88952 87591 86003 84669 83972
55502 83972 83697 83281 82654 82259 82157 81695 80286 78111 75947 74673 74824 76036 77118 77302 77293 78300 80245
55485 80245 81910 82824 83825 85503 87207 88085 88156 87761 86755 84949 82793 81040 80091 80017 80736 81862 82881
55468 82881 83793 85028 86423 86966 85985 84024 82112 80742 80009 80076 80824 81529 81614 81444 81743 82507 83132 83414
55450 83414 83708 84129 84258 83851 83324 83202 83347 83062 81947 80368 78961 77926 77098 76597 76881 77951 79022
55433 79022 79411 79402 79746 80610 81599 82579 83817 85328 86699 87603 88026 88051 87949 88343 89672 91520 93095 94252
55415 94252 95398 96524 97218 97647 98599 100248 101744 102260 101722 100268 97868 94910 92291 90389 88672 86817
55399 86817 85453 85121 85261 84984 84279 83631 82986 82059 81334 81696 83104 84569 85550 86550 88062 89649 90524
55382 90524 90540 90134 89574 88803 87943 87499 87856 88819 89892 90842 91754 92588 93023 92813 91964 90469 88294 85842
55364 85842 83940 82904 82005 80456 78631 77619 77752 78299 78563 78512 78318 78080 78178 79103 80572 81523 81394 80846
55346 80846 80767 81133 81358 81289 81235 81312 81374 81526 82165 83459 85060 86427 87275 87678 87830 87734 87212 86304 85490 85237
55326 85237 85451 85693 85792 85908 86064 86110 86119 86429 87246 88500 89927 90874 90359 88078 85220 83520 83404 83827 83928
55307 83928 83912 84117 84220 83892 83401 82987 82306 81094 79822 79112 78902 78727 78414 78081 77811 77783 78263 79085 79585
55288 79585 79471 79317 79760 80685 81602 82276 82467 81642 79694 77557 76415 76577 77657 79420 81702 83768 84612
55271 84612 83924 82266 80403 78940 78371 78859 79956 80993 81718 82217 82489 82524 82617 83081 83799 84517 85349 86477
55253 86477 87549 88019 87966 88004 88383 88762 88944 89234 89887 90602 90796 90214 89149 88220 87852 87812 87366 86086 84418
55234 84418 83287 83269 84299 85860 87150 87447 86731 85805 85434 85529 85521 85235 84934 84745 84541 84303 84154 84137 84356
55215 84356 85123 86469 87703 88025 87519 86967 86746 86485 85892 85304 85165 85394 85576 85562 85623 86086 86871 87423 87247
55196 87247 86553 86165 86599 87602 88737 89959 91191 91832 91400 90414 89868 89934 89913 89439 88947 88794 88688 88330
55178 88330 88070 88505 89756 91419 92913 93685 93432 92472 91688 91807 92785 93927 94465 93988 92621 90970 89803
55161 89803 89625 90489 92053 93698 94863 95550 96340 97556 98637 98751 97852 96631 95573 94635 93787 93198 92831
55144 92831 92533 92650 93786 95627 96771 96282 94873 93968 94016 94394 94605 94757 94929 94869 94535 94374 94721 95253
55126 95253 95405 95094 94756 94746 95004 95320 95626 95893 95888 95349 94424 93718 93705 94193 94516 94195 93288 92184 91298 90985
55106 90985 91477 92719 94302 95694 96540 96763 96510 96079 95805 95879 96203 96463 96451 96388 96818 98061 99774 101202
55088 101202 101892 101991 101872 101726 101613 101625 101792 101988 102128 102282 102434 102393 102153 102136 102685 103469 103766 103312 102511 101782
55068 101782 101101 100347 99839 100187 101591 103396 104443 104051 102688 101570 101466 102019 102348 102095 101660 101573 101939
55051 101939 102443 102668 102403 101851 101496 101556 101606 100984 99588 98072 97217 97241 97745 98184 98336 98347 98416 98550 98756 99355
55031 99355 100757 102875 105053 106666 107500 107511 106721 105620 105141 105721 106713 107182 106979 106494 105730 104395 102814
55014 102814 101876 101874 102059 101705 101134 101324 102780 105093 107348 108662 108553 107163 105196 103462 102405 101973 101912
54997 101912 102094 102585 103385 104224 104806 105207 105698 106162 106151 105741 105720 106482 107204 106795 105438 104400 104379 104766 104732
54978 104732 104380 104479 105485 107172 108938 110175 110498 109914 108865 108072 108214 109451 111119 112183 112257 111980 112091
54961 112091 112536 112851 113002 113267 113547 113514 113301 113347 113618 113685 113536 113622 114044 114438 114743 115314 116092 116445 116121 115656
54941 115656 115505 115398 114946 114270 113668 113161 112804 112912 113564 114313 114761 114991 115169 115262 115515 116611 118903 121980
54923 121980 125472 129642 134659 139877 144534 148697 152831 156858 160377 163327 165561 166173 164336 160718
54909 160718 157018 153998 150946 147268 143611 140877 138924 136896 134453 132108 130528 129884 129735 129299 128024
54894 128024 126099 124245 122900 121856 120852 120151 120187 120876 121713 122480 123488 125070 127130 129383 131881 135101
54878 135101 139467 144853 150566 155819 160204 163761 166661 168920 170377 170869 170328 168727 166052 162441 158310
54863 158310 154181 150290 146497 142725 139297 136602 134463 132134 128993 125120 121204 118058 116184 115470
54849 115470 115154 114331 112684 110678 108989 107935 107453 107330 107305 107142 106813 106485 106262 106094 106005 106181 106707 107390
54831 107390 107950 108216 108131 107825 107699 108100 108786 109128 109016 109155 110203 111969 113760 115131 115955 116151 115819 115412
54813 115412 115291 115295 115133 114960 115036 115035 114308 112829 111333 110444 110169 110299 110821 111702 112666 113391 113729 113667 113341 113136
54793 113136 113383 113832 113775 112872 111676 111182 112053 114228 117009 119474 121131 122303 123642 125200 126373 126818
54777 126818 126959 127334 127877 128280 128724 129800 131847 134779 138443 142767 147591 152712 158040 163424 168368
54762 168368 172346 175346 177708 179395 179926 179158 177630 175764 173158 169180 164034 158724 154054 150150 146911
54747 146911 144335 142199 139877 136929 133682 130970 129376 128900 129142 129569 129731 129505 129176 129176 129797 131123 132994
54730 132994 134972 136669 138334 140749 144203 147881 150753 152884 155295 158627 162529 166329 169644 172130
54716 172130 173265 172800 171058 168483 165217 161393 157504 154073 151131 148356 145547 142709 139868 137164
54702 137164 134978 133620 132882 132153 131003 129541 128302 127915 128685 130297 131955 132944 132967 131980 130070 127742
54686 127742 125945 125328 125596 125986 126304 127022 128290 129287 128844 126603 123390 120564 119083 119063 120003 121262 122352
54669 122352 123023 123287 123421 123708 124123 124351 124130 123455 122477 121450 120776 120785 121321 121839 121991 121880 121682 121370 121008
54650 121008 120890 121138 121505 121854 122424 123263 123831 123779 123786 124910 127188 129523 130968 131476 131304 130370 128639 126683
54632 126683 125312 124779 124658 124457 124102 123854 123933 124276 124588 124582 124183 123522 122844 122482 122758 123736 125077 126259 126900
54613 126900 126843 126132 125068 124171 123818 123954 124315 124757 125162 125180 124515 123474 122871 123200 124079 124684 124562 123939 123328
54594 123328 123025 122940 122854 122751 122813 123132 123541 123813 123920 124012 124204 124419 124392 123856 122943 122296 122505 123367 124077 124227
54574 124227 124176 124270 124262 123924 123761 124486 126054 127763 129107 130038 130597 130817 130873 130712 129742 127589 125107 123838
54556 123838 124286 125510 126618 127912 130012 132513 134253 134702 134510 134677 135595 136924 138155 139149 140177 141423
54540 141423 142642 143505 144150 144977 145848 145993 144934 143146 141532 140571 140235 140391 140875 141287 141180 140471 139430
54523 139430 138273 136976 135527 134174 133317 133136 133329 133297 132713 131867 131297 131136 131070 130969 131160 131927 133039 133993
54505 133993 134512 134516 133835 132374 130549 129273 129304 130702 132847 134916 136347 137026 137166 137053 136843 136579 136314
54488 136314 136204 136448 137044 137604 137601 136924 136085 135733 136063 136832 137780 138715 139313 139292 138879 138840 139803 141623 143509
54469 143509 144701 145087 145276 145997 147283 148351 148515 148044 147771 147942 147960 147388 146744 146980 148445 150578 152459
54452 152459 153440 153426 152840 152305 152146 152103 151599 150364 148784 147587 147102 146939 146611 146282 146433 146849 146665 145774
54434 145774 145400 146531 148343 149124 148447 147389 146786 146449 146238 146680 147974 149414 150378 151106 151879 152244 151841
54417 151841 151322 151572 152462 153183 153465 153638 153802 153793 153809 154220 154849 155190 155321 155828 156806 157623 157835 157654 157408 157128
54397 157128 156877 156916 157286 157691 157998 158422 158972 159178 158646 157517 156141 154697 153413 152767 152995 153663 154161 154490
54379 154490 155164 156370 157653 158527 159090 159844 161038 162374 163332 163729 163906 164437 165691 167648 170012 172429
54363 172429 174669 176719 178748 180970 183488 186242 189021 191527 193513 194861 195476 195136 193659 191228 188320
54348 188320 185242 181978 178628 175670 173528 172076 170854 169627 168377 166877 164701 161787 158702 156193
54334 156193 154630 153957 153937 154272 154555 154344 153434 152059 150736 149825 149278 148923 148874 149503 151011 153229 155743
54317 155743 157967 159231 159241 158536 157992 157743 157086 155667 154175 153433 153353 153367 153383 153592 153653 153006 151936 151443 151871
54298 151871 152366 151976 150718 149280 148203 147697 147821 148447 149250 150019 150783 151529 152072 152403 152805 153438 154072 154491
54280 154491 154830 155287 155741 155999 156169 156494 156927 157213 157353 157677 158406 159287 159731 159346 158398 157749 158159 159571
54262 159571 161173 162148 162209 161515 160455 159614 159524 160187 161059 161688 162174 162816 163591 164297 164966 165789 166707 167363 167394
54243 167394 166661 165330 163925 163075 162935 162973 162629 162035 161741 161877 161967 161598 160876 160161 159728 159767 160373 161257 161751
54224 161751 161411 160533 159816 159558 159391 158780 157593 156147 154906 154205 154099 154270 154187 153565 152694 152101 151860 151498
54206 151498 150755 150093 150092 150551 150723 150436 150350 150873 151407 151157 150305 149793 150128 150980 151898 152785 153560 153948 153908 153855
54186 153855 154131 154531 154694 154675 154769 154949 154889 154484 154011 153773 153893 154421 155351 156500 157651 158833 160149 161288
54168 161288 161640 161149 160684 161173 162543 163928 164832 165557 166405 166935 166389 164643 162362 160245 158468 156962
54152 156962 155907 155693 156416 157664 158830 159564 159914 160135 160449 160884 161295 161599 161943 162492 163007 162976 162411 162212
54134 162212 163258 165210 166732 166975 166356 165666 165021 164116 163056 162283 161891 161688 161856 162867 164613 166232
54118 166232 167054 167290 167524 167920 168190 168030 167338 166283 165424 165458 166520 167953 169078 169978 171265 173266 175794
54101 175794 178503 181141 183534 185726 188082 190977 194461 198469 203227 209032 215604 221890 226568 228626
54087 228626 227631 223869 218224 211669 204791 197961 191751 186805 183315 181024 179742 179474 180033 181058 182574
54072 182574 185061 188626 192497 195744 198287 200761 203555 206411 208987 211251 213127 214063 213397 211087 207805
54057 207805 204236 200534 196584 192596 189167 186808 185645 185602 186544 188136 189850 191381 192877 194591 196482
54042 196482 198413 200568 203308 206745 210761 215425 220979 227291 233629 239123 243344 246463 249076 251861
54028 251861 255047 258081 260088 260810 260900 261222 262121 263469 265077 266717 267968 268411 267995 266985 265566 263729
54012 263729 261494 258980 256126 252569 248033 242874 238087 234624 232612 231235 229377 226485 222928 219595
53998 219595 217076 215194 213340 211258 209316 207899 206770 205376 203672 202150 201030 199902 198428 196934
53984 196934 195932 195436 195106 194766 194323 193485 192151 190886 190413 190746 191428 192522 194567 197411 199862 200894
53968 200894 200714 200283 200263 200801 201920 203621 205886 208968 213459 219655 227077 235059 243691 253774 265809
53953 265809 279375 293324 306118 315899 320830 319994 314112 305224 295496 286290 278194 271581 266730 263428
53939 263428 260909 258607 256844 256491 258024 261137 265106 269124 272432 274661 276204 277854 279944 282183
53925 282183 284337 286600 289137 291752 294315 297131 300555 304475 308465 312232 315735 319170 323044 327899
53911 327899 333684 339642 345038 349700 353602 356403 357761 357805 356935 355458 353739 352268 351028 349121 345684
53896 345684 341036 336405 332547 329136 325384 320844 315628 310286 305401 300938 296133 290426 284292 278627
53882 278627 273522 268337 262878 257738 253314 249265 245191 241261 237818 234909 232542 230906 229894 228825
53868 228825 227206 225486 224514 224307 223792 221812 218161 213682 209589 206708 205081 204176 203438 202600 201537 200069
53852 200069 198148 196152 194784 194558 195314 196257 196590 196265 195997 196399 197236 197824 197927 197803 197486 196679 195531
53835 195531 194833 194998 195364 195109 194500 194572 195722 197310 198677 199930 201478 203259 204782 205702 206113 206381 206836
53818 206836 207514 208163 208638 209285 210642 212642 214436 215261 215294 215423 216365 218268 220986 224332 228069 231968
53802 231968 235986 240158 244283 247986 251160 254107 257167 260466 264126 268327 272883 277010 279942 281684
53788 281684 282876 283980 284921 285482 285665 285610 285353 284749 283489 281246 278047 274396 270717 266786 262119 256885
53772 256885 251955 247873 244284 240602 236827 233348 230295 227493 224883 222677 221180 220704 221366 222683 223607
53757 223607 223293 221756 219535 217040 214552 212559 211449 210925 210219 208972 207536 206435 205889 205919 206478 207283
53741 207283 207859 207927 207668 207467 207526 207725 207733 207329 206725 206491 206933 207764 208580 209463 210738 212363 214010 215623 217324
53722 217324 218812 219527 219515 219607 220505 222119 224010 225956 227782 229082 229584 229606 229848 230907 233073 236237 239764
53705 239764 242854 245391 248125 251627 255343 258187 259906 261346 263344 265829 268201 270233 272324 274926
53691 274926 277985 281001 283533 285475 286802 287323 287010 286412 286265 286642 286909 286621 286059 285627 285230 284617 283978
53674 283978 283709 283833 284130 284602 285277 285692 285191 283852 282536 281839 281422 280744 280063 280242 281532 283004 283425
53657 283425 282569 281368 280734 280536 280029 279039 278180 277867 277735 277399 277297 278178 279984 281879 283305 284406 285339
53640 285339 285866 285923 286147 287309 289459 292021 294532 296874 298831 299957 300221 300484 301905 304805 308416 311874
53624 311874 315237 319260 324310 329894 335296 340302 345107 349819 354378 358757 362941 366703 369699 371764
53610 371764 372964 373477 373606 373813 374478 375654 377287 379508 382444 385848 389322 392863 396732 400693 403847
53595 403847 405542 406124 406488 407050 407472 407308 406603 405779 405081 404255 402856 400854 398861 397550 396935 396403 395443
53578 395443 394095 392650 391207 389689 388015 386086 383833 381496 379644 378589 377904 376810 375040 373083
53564 373083 371609 370898 370816 371065 371316 371301 371003 370746 370996 371958 373345 374523 375035 375033 375113 375637 376316 376601 376423
53545 376423 376338 376980 378513 380620 382839 384871 386738 388760 391312 394565 398489 403083 408425 414477 421017
53530 421017 427930 435369 443458 451901 460144 468016 476042 485044 495486 507259 519940 533045 546100
53517 546100 558773 571196 584064 598216 614008 631214 649538 669038 689928 712091 734996
53506 734996 758081 781108 804145 827348 850807 874418 897823 920534 942194 962805 982730
53495 982730 1002532 1022639 1042974 1062942 1082015 1100391 1118809 1137609 1156201 1173747 1190247
53484 1190247 1206597 1223616 1241225 1258662 1275283 1291079 1306537 1322111 1337780 1353061 1367488
53473 1367488 1380928 1393273 1403914 1411914 1416833 1419145 1419628 1418518 1415441 1410007 1402136 1391896 1379446
53460 1379446 1365340 1350653 1336479 1323185 1310198 1296569 1281763 1265953 1249607 1232826 1215147
53449 1215147 1196031 1175476 1154129 1132778 1111840 1091365 1071476 1052644 1035433 1020047 1006255
53438 1006255 993856 983041 974164 967205 961702 957197 953577 950930 949297 948713 949341 951347 954659 958999
53424 958999 964156 970227 977596 986618 997211 1008824 1021052 1034221 1049059 1065731 1083645 1102416
53412 1102416 1122550 1144733 1168775 1193806 1219387 1245836 1273502 1302290 1332082 1363119 1395697
53401 1395697 1429905 1465980 1504608 1546429 1591332 1638506 1687129 1736806 1787479 1839165 1891827
53390 1891827 1945318 1999378 2053725 2108110 2162241 2215672 2267874 2318425 2367127 2414009 2459213
53379 2459213 2502794 2544570 2584126 2620917 2654289 2683580 2708394 2728725 2744709 2756331 2763558
53368 2763558 2766546 2765327 2759234 2747025 2727692 2701017 2667440 2627820 2583391 2535578 2485553 2434162
53356 2434162 2382207 2330364 2278712 2226862 2174856 2123539 2073775 2025742 1979296 1934572 1891722
53345 1891722 1850497 1810587 1771965 1734273 1696348 1657285 1617854 1579936 1544492 1510912 1478528
53334 1478528 1447766 1419338 1393147 1368778 1346590 1327471 1311649 1298355 1286573 1275579 1264732
53323 1264732 1253385 1241231 1228457 1215338 1201913 1188250 1174804 1162279 1151170 1141569 1133415 1126726
53311 1126726 1121458 1117215 1113386 1109781 1107000 1105968 1107070 1109941 1114037 1119131 1125205 1132235 1140325 1149832
53297 1149832 1161133 1174382 1189678 1207207 1226909 1248151 1270113 1292494 1315531 1339326 1363438
53286 1363438 1387253 1410478 1433138 1455266 1476752 1497399 1517024 1535492 1552630 1567989 1580748
53275 1580748 1590079 1595673 1597773 1596719 1592682 1585867 1576667 1565413 1552069 1536347 1518050 1497303 1474575
53262 1474575 1450556 1425706 1399874 1372603 1343999 1314938 1286126 1257295 1227782 1197716 1168099
53251 1168099 1139791 1112919 1087282 1062736 1039006 1015625 992354 969281 946280 922825 898697
53240 898697 874493 850987 828229 805769 783576 762233 742255 723666 706325 690309 675882
53229 675882 663249 652372 642856 634114 625825 618110 611065 604254 596942 588648 579173 568414 556609
53216 556609 544593 533114 521921 510133 497580 485121 473468 462415 451587 441356 432395 424719
53204 424719 417719 411028 404855 399469 394687 389919 384563 378395 371632 364570 357148 349143 340811 332963
53190 332963 326244 320663 315888 311583 307277 302489 297384 292837 289363 286374 283020 279423 276392 274151
53176 274151 272072 269689 267325 265541 264449 263774 263242 262715 262171 261677 261276 260883 260428 259971 259508 258778 257546
53159 257546 255931 254177 252271 250108 247859 245855 244187 242771 241649 240867 240202 239460 238936 239126 240071 241350
53143 241350 242591 243559 243940 243611 243037 242771 242628 241970 240826 240064 240384 241769 243991 246916 250068 252645
53127 252645 254354 255673 256938 257729 257532 256468 255033 253623 252673 252708 253724 254927 255525 255471 255131 254777 254768
53110 254768 255596 257132 258355 258526 258141 257993 257783 256637 254730 253280 252837 252610 251788 250693 250050 249778 249146
53093 249146 247859 246391 245279 244484 243648 242803 242541 243313 244682 245609 245561 244966 244405 243814 242805 241386 239807
53076 239807 238061 236168 234729 234416 234953 235347 235264 235453 236535 237997 238773 238373 237069 235398 233950 233342
53060 233342 233839 235003 236012 236389 236337 236385 236818 237387 237611 237393 237240 237654 238464 239135 239603 240242 240930 240814 239383
53041 239383 237319 235772 235076 234661 234028 233311 232870 232777 232860 233006 233277 233839 234768 235839 236564 236563 235927 235178 234932
53022 234932 235583 237102 239021 240748 242048 243075 243846 243981 243266 242245 241839 242351 243168 243547 243503 243737 244765
53005 244765 246227 247124 246785 245580 244524 244129 243907 243139 241863 240798 240430 240586 240883 241239 241786 242565 243410
52988 243410 244014 244096 243748 243689 244816 247273 250128 252160 252862 252552 251804 251068 250722 251051 252061 253532 255323
52971 255323 257369 259351 260652 260946 260639 260472 260745 261191 261534 261843 262215 262476 262409 262073 261614 260896 259671 258076
52953 258076 256604 255480 254403 253113 251973 251696 252550 254028 255184 255171 253638 251006 248429 247173 247728
52938 247728 249531 251534 252946 253496 253283 252592 251761 250960 250066 248874 247473 246350 245997 246379 246824 246559 245429
52921 245429 244094 243444 243839 244969 246315 247546 248484 248956 248880 248426 247980 247989 248725 249979 250945 250744 249316 247609
52903 247609 246622 246425 246362 245970 245243 244178 242721 241351 241092 242475 244790 246733 247622 247666 247350 247051 247130 247816
52885 247816 248865 249738 250244 250635 250970 250824 249962 248971 248759 249526 250608 251344 251746 252208 252913 253772 254762 256005
52867 256005 257542 259282 261237 263524 265899 267480 267324 265396 262778 260778 259903 259710 259399 258365 256392
52852 256392 253670 250645 247647 244646 241470 238198 235095 232250 229570 227150 225361 224425 224063 223710 223032
52837 223032 222222 221912 222661 224269 225659 225815 224913 224151 224302 224858 224882 224290 223850 224146 225044 226105 227021 227636
52819 227636 227894 227977 228183 228578 229006 229577 230833 233190 236316 239273 241278 242264 242700 242935 242736 241563 239268
52802 239268 236403 233696 231395 229336 227536 226276 225564 224892 223803 222454 221370 220823 220714 220933 221444 222009
52786 222009 222169 221709 220960 220453 220340 220330 220107 219672 219314 219379 220083 221354 222793 223906 224501 224795 225062 225259
52768 225259 225141 224642 223956 223227 222362 221284 220216 219591 219676 220351 221204 221767 221793 221470 221375 222075 223580 225247
52750 225247 226334 226715 226975 227722 228940 230207 231432 233002 235136 237468 239573 241579 243766 245745 246700
52735 246700 246597 246594 247876 250357 252833 254280 254700 254805 255171 255724 255900 255265 253914 252198 250173 247680 245035
52718 245035 243182 242803 243505 244202 244196 243625 242988 242613 242507 242434 242082 241377 240638 240214 240040 239791 239469 239551 240478 242127
52698 242127 243909 245226 245804 245711 245219 244717 244622 245129 245923 246333 246066 245620 245582 245614 244751 242863 241091 240414 240369
52679 240369 239829 238584 237399 236800 236667 236937 237820 239102 239974 239965 239540 239417 239741 240275 241042 242242 243700 244855
52661 244855 245436 245944 247217 249455 251786 253113 253402 253761 254985 256478 257109 256746 256239 256075 255890 255347 254676
52644 254676 254054 253175 251822 250312 248983 247760 246652 246197 246868 248319 249684 250496 250969 251643 252986 255170
52628 255170 257882 260526 262747 264523 265707 265970 265413 264662 263992 262906 261079 259140 257837 256857 255348
52613 255348 253436 252339 252851 254390 255728 256163 255756 254852 253677 252273 250727 249467 249129 249870 251046 251931
52597 251931 252583 253600 255169 256797 257920 258335 258129 257644 257468 257908 258512 258622 258435 258861 260216 261632 262072
52580 262072 261505 260753 260582 261219 262397 263514 263921 263372 262162 260747 259450 258559 258351 258798 259476 259947 260043
52563 260043 259760 259189 258672 258605 258874 258825 258087 257117 256611 256665 256867 257008 257247 257671 258083 258306 258436 258729 259302 259932
52543 259932 260101 259391 257970 256515 255580 255169 255041 255131 255497 256121 257006 258212 259487 260159 259792 258789 257945
52526 257945 257511 257130 256595 256151 256015 256067 256146 256278 256437 256438 256251 256151 256394 256961 257778 258959 260655 262887 265652
52507 265652 268904 272229 274818 276119 276369 276194 275790 274791 272863 270148 267213 264789 263458 263197 263262 262864
52491 262864 261983 261221 260844 260492 259964 259755 260360 261386 261953 261825 261602 261722 261828 261390 260605 260237 260698 261651
52473 261651 262575 263422 264501 265919 267403 268706 269901 271145 272416 273688 275236 277375 279927 282344 284339
52458 284339 285966 286997 286871 285625 284290 283703 283305 281843 279091 276084 273716 271870 270000 267843 265319
52443 265319 262526 260119 258948 258897 258777 257827 256684 256300 256629 257086 257635 258432 258903 258330 257176 256702 257251
52426 257251 257994 258505 259494 261500 263850 265540 266538 267547 268980 270724 272617 274599 276646 278924 281782
52411 281782 285317 289263 293611 298910 305549 313121 320965 328991 337372 345622 352548 357015 358339 356159
52397 356159 350632 342808 334281 326234 319029 312628 307004 302177 298262 295520 294002 293184 292427 291783 291803
52382 291803 292464 292904 292500 291719 291490 292142 293427 295248 297798 301054 304653 308291 311888 315365 318653 321996
52366 321996 325806 330076 334249 337808 340684 342783 343557 342547 340283 338165 337343 338007 339743 342068 344366
52351 344366 345811 345956 345303 344869 345182 346090 347495 349703 352794 356074 358680 360607 362693 365584 369143
52336 369143 373066 377693 383744 391295 399460 407324 414918 422994 432008 441817 452381 464204 477758
52323 477758 492828 508845 525582 543021 560746 578066 594817 611459 628210 644609 660247
52312 660247 675544 691438 708506 726613 745166 763424 780806 797201 812882 827980 842321
52301 842321 855932 869297 882693 895557 907008 916832 925435 932884 938572 941952 943172 942746 940913
52288 940913 937542 932587 926467 920028 914111 908980 904229 899325 894185 889133 884531 880764 878447 878165
52274 878165 879925 883163 887319 892212 897871 904396 912007 920811 930371 939894 949022 958105 967564 977412
52260 977412 987776 999391 1012931 1027952 1043072 1057300 1070723 1083733 1096071 1107083 1116642 1125312
52248 1125312 1133440 1140447 1145217 1147035 1145988 1142667 1137777 1132030 1125922 1119456 1112270 1104232 1095746 1087252
52234 1087252 1078604 1069210 1058735 1047529 1036473 1026576 1018484 1012051 1006403 1000674 994645 988603 982838
52221 982838 977597 973255 970031 967637 965679 964328 964052 964733 965680 966694 968477 971718 976268 981486 986868
52206 986868 991974 996244 999440 1001966 1004394 1006991 1010044 1014113 1019321 1024765 1029389 1033341 1037771 1043307
52192 1043307 1049326 1054766 1059056 1062161 1064330 1066008 1067501 1068407 1067789 1065165 1061065 1056400 1051598 1046515
52178 1046515 1040808 1034131 1026329 1017855 1009797 1003099 997820 993419 989639 986712 984695 983002 980914 978464
52164 978464 976567 976122 977098 978715 980480 982635 985323 987776 988995 989186 989828 991994 995110 997715 999043
52149 999043 999475 999760 1000313 1001159 1002070 1002690 1002774 1002294 1001290 999828 998357 997709 998262 999294 999750 999591 999863 1001445
52131 1001445 1004361 1008472 1014212 1022219 1032646 1045238 1059851 1076485 1095078 1115582 1138040 1162170
52119 1162170 1187035 1211607 1235628 1259572 1283713 1307646 1330759 1352790 1373723 1393467 1411894
52108 1411894 1429041 1444995 1459616 1472587 1483759 1493366 1501882 1509666 1516690 1522545 1526763 1529126 1529633
52095 1529633 1528210 1524585 1518431 1509504 1497735 1483424 1467396 1450727 1434152 1417926 1402296 1387801
52083 1387801 1374899 1363555 1353503 1344702 1337235 1330904 1325337 1320493 1316762 1314601 1314354 1316351 1320716
52070 1320716 1327081 1334908 1344200 1355370 1368251 1381807 1395249 1408917 1423439 1438374 1452468 1465193
52058 1465193 1477279 1489525 1501692 1512952 1522926 1531767 1539405 1545200 1548432 1548826 1546507 1541590 1534018
52045 1534018 1523862 1511631 1498058 1483459 1467573 1450291 1432367 1414949 1398391 1381991 1365065
52034 1365065 1347823 1330937 1314648 1298686 1282782 1266845 1250801 1234709 1218892 1203566 1188396
52023 1188396 1172859 1156980 1141350 1126390 1112099 1098590 1086290 1075288 1064864 1054135 1042986
52012 1042986 1032054 1021840 1012143 1002295 991754 980423 968561 956369 943632 929878 914943 899192
52000 899192 883059 866618 849898 833534 818802 806814 797657 790163 782491 773213 762199 750456
51988 750456 738922 727512 715544 702837 689901 677050 663892 650020 635763 621845 608464
51977 608464 595202 581838 568909 557318 547602 539766 533739 529775 528196 528686 530019 530836 530864 531110
51963 531110 532683 535638 539191 542816 546526 550038 552251 552020 549335 545369 541405 537926 534684 531364
51949 531364 528029 525100 523131 522649 524097 527722 533365 540456 548390 557027 566751 578062 591283 606582
51935 606582 623866 642435 661079 678930 696095 713076 729756 745456 759824 772797 783269
51924 783269 788423 785205 772563 751986 726140 697415 667564 637880 609256 582311 557709 536177
51912 536177 518009 502784 489874 479189 471163 465993 463113 461556 460753 460786 461853 463640 465405 466549
51898 466549 466826 465966 463476 459092 453173 446358 438996 431229 423450 416172 409549 403553 398659 395720 394925
51883 394925 395455 396568 398559 402135 407240 413169 419649 427046 435401 443853 451295 457176 461418 463953
51869 463953 464752 464131 462655 460656 458042 454599 450421 445989 441857 438266 435138 432511 430792 430373 431065
51854 431065 432210 433313 434240 434729 434180 432230 429207 425656 421615 416798 411364 406026 401305 397123 393294
51839 393294 390033 387626 385875 384300 382867 382126 382489 383660 384928 385872 386542 387100 387525 387705 387592 387212
51823 387212 386578 385647 384365 382815 381405 380762 381169 382109 382706 382730 382896 383955 385754 387500 388747 389660 390393
51806 390393 390681 390275 389433 388624 387887 386736 384705 381869 378919 376825 376300 377293 378912 379943 379661 378264
51790 378264 376587 375429 375053 375212 375549 375906 376241 376465 376494 376463 376692 377401 378566 380056 381749 383567 385592
51773 385592 388234 392027 397074 402840 408688 414464 420324 426131 431371 435646 438955 441382 442721 442522
51759 442522 440348 435910 429265 421062 412416 404208 396604 389424 382817 377219 372695 368833 365413 362745
51745 362745 361062 359909 358664 357477 357232 358518 361055 364235 367781 371661 375655 379421 382817 385889
51731 385889 388602 390782 392257 392873 392513 391379 390185 389791 390492 391800 392901 393201 392500 390926 388860 386792
51715 386792 385091 383887 383118 382661 382447 382572 383264 384656 386656 389113 392079 395699 399855 404027 407509
51700 407509 409687 410258 409425 407930 406716 406419 407156 408700 410701 412750 414390 415140 414538 412370 408916 404794
51684 404794 400385 395619 390528 385755 382075 379572 377732 376350 375825 376413 377622 378588 378839 378575 378461 379232
51668 379232 381191 383944 386824 389652 392798 396484 400390 404061 407188 409353 410023 409198 407698 406379 405423
51653 405423 404809 405170 407515 412189 418531 425534 432270 437660 440388 439490 434934 427559 418578 409158 400193
51638 400193 392173 385279 379656 375590 373365 372910 373627 374690 375626 376575 377807 379107 379915 380062 379959 379920
51622 379920 379609 378412 376124 373049 369630 366218 363027 360073 357206 354371 351684 349212 346885 344714
51608 344714 342787 340979 339075 337419 337025 338703 342316 347208 352978 359513 366677 374413 382840 391756
51594 391756 400391 408100 414929 420875 424985 426001 423754 419258 413595 407566 402304 399183 398757 400476
51580 400476 403704 408438 414843 422792 432214 443308 456010 469625 483351 496807 509942 522828
51568 522828 535665 548385 560010 569070 575149 579676 584972 592928 604751 621091 641684 665242
51556 665242 690352 716153 741716 765225 784578 798634 807309 810675 808653 801546 790132 775035
51544 775035 756473 734785 710784 685406 659261 632749 606497 581564 559234 540489 525514
51533 525514 513723 504302 496668 490390 485037 480328 476222 472615 469125 465422 461550 457640 453460 448562
51519 448562 442780 436385 429885 423856 418711 414357 410243 406036 402037 398621 395545 392196 388358 384288
51505 384288 380270 376477 373103 370145 367200 364000 361056 359212 358588 358508 358470 358562 358803 358776 358236 357594 357447
51488 357447 357947 358951 360458 362510 364887 367179 369033 370158 370349 369766 368930 368142 367070 365250 362872
51473 362872 360662 358960 357322 355239 353023 351601 351409 351720 351272 349465 346732 343848 341263 339194 337856
51458 337856 337169 336473 335137 333391 332222 332427 334178 337434 342132 347748 353285 358229 363263 369671 378174
51443 378174 388625 400512 413205 425725 436814 445478 451375 454677 455818 455459 454372 452994 451123
51430 451123 448206 443982 438668 432554 425631 417905 409938 402649 396444 390885 385505 380665 377180 375183
51416 375183 373905 372552 370924 369117 367211 365567 364906 365524 366730 367550 367854 368276 369160 370207 371198 372443
51400 372443 374259 376484 378828 381320 384016 386586 388727 390814 393624 397380 401613 406061 411246 417892
51386 417892 426189 435974 447447 461271 478020 497838 520633 546326 574875 606216 640132 676045
51374 676045 712945 749618 784816 817055 844589 866064 881123 889919 892170 887176 874779 855712
51362 855712 830900 801076 767312 731280 694455 657572 621253 586675 554962 526323 500462
51351 500462 477580 458226 442343 429158 417974 408445 400162 392708 386190 380986 376822 372769 368361
51338 368361 364081 360524 357760 355823 355100 355627 356525 356772 356306 355870 356014 356672 357557 358515 359553 360785 362206
51321 362206 363354 363501 362447 360824 359334 358039 356740 355576 354714 353865 352753 351810 351633 351863 351429 349945
51305 349945 348124 346668 345464 344223 343199 342754 342644 342285 341484 340477 339453 338482 337736 337376 337193 336726
51289 336726 335815 334870 334598 335560 337868 341138 344739 348215 351466 354523 357403 360268 363417 366782 369635
51274 369635 371193 371444 371038 370445 369676 368856 368523 369036 370100 371266 372597 374371 376236 377227 376807 375521
51258 375521 374378 373794 373338 372400 370851 369073 367518 366301 365127 363567 361467 359091 356906 355229 354062
51243 354062 353207 352487 351874 351440 351201 351038 350815 350523 350256 350088 350101 350478 351417 352876 354560 356197 357681 358919
51225 358919 359778 360372 361203 362708 364692 366429 367324 367310 366674 365758 364863 364181 363674 363180 362780 362940 364067 365971
51207 365971 367927 369353 370348 371467 373073 375046 377115 379215 381280 382885 383565 383552 383782 384865 386309
51192 386309 387157 387195 387161 387777 388940 389948 390205 389624 388555 387468 386570 385690 384628 383598 383111 383364 383927
51175 383927 384131 383675 382867 382329 382371 382577 382188 381094 380234 380649 382278 384109 385434 386430 387417 388153 388164 387382
51157 387382 386110 384597 382931 381158 379249 377119 374807 372484 370220 368018 366173 365194 365170 365568 365926
51142 365926 366372 367133 367890 368053 367446 366364 365254 364704 365423 367623 370541 373090 374919 376422 377845 379048
51126 379048 380099 381505 383640 386359 389284 392038 394141 395215 395531 395961 397084 398717 400487 402430 404656
51111 404656 406815 408407 409448 410414 411593 412837 413904 414722 415342 415879 416480 417128 417562 417665 417796 418378 419194
51094 419194 419551 419267 419027 419493 420399 420968 420963 420881 421170 421783 422615 423847 425511 427031 427645 427163 426084 425082
51076 425082 424738 425565 427768 430860 433972 436765 439712 443238 446929 449932 452012 453911 456676 460875 466378
51061 466378 472773 480004 488643 499349 511905 525027 537324 548258 558002 566701 574368 581342 588275
51048 588275 595526 602832 609580 615038 618334 618737 616197 611380 605019 597517 589325 581280 574192 568271
51034 568271 563275 559085 555731 552891 549764 545661 540588 535108 529744 524643 519818 515581 512609 511539
51020 511539 512486 514960 518249 521920 526054 531067 537262 544517 552417 560675 569321 578457 588024 597940
51006 597940 608301 619233 630666 642429 654416 666308 677201 686006 692422 697197 701228 704641
50994 704641 706972 708030 708196 707982 707571 706835 705618 704114 703203 704382 708939 716954 727272 738653 750837
50979 750837 764345 779364 795160 810702 825725 841047 857927 877231 899208 924001 952247
50968 952247 985021 1023108 1066341 1113792 1164588 1218356 1274871 1333651 1394158 1456113 1519154
50957 1519154 1582259 1643914 1702923 1758606 1810119 1856084 1895274 1927534 1953739 1975025 1992194
50946 1992194 2005581 2015171 2021047 2024049 2025853 2027979 2030626 2032641 2032510 2029206 2022368 2012198 1999280
50933 1999280 1984140 1966776 1946702 1923482 1897077 1867731 1835716 1801056 1763250 1721388 1674935
50922 1674935 1624553 1571830 1518116 1463856 1409155 1354691 1301808 1251787 1205222 1162060 1122174
50911 1122174 1085785 1053255 1024505 998838 975460 953976 934265 916189 899711 885010 872062
50900 872062 860314 849161 838591 828925 820194 812420 806279 802546 800765 799359 797498 796123 796530 798502
50886 798502 800566 801772 802565 804048 806951 811339 816830 822897 829162 835516 841987 848740 856244 865160
50872 865160 875855 888296 902488 918618 936507 955436 974968 995574 1018037 1042638 1069459
50861 1069459 1099085 1132206 1168713 1208047 1250511 1297504 1350348 1409540 1475367 1548512 1629607
50850 1629607 1718730 1815832 1921237 2035099 2156562 2284053 2416378 2553050 2693378 2835519
50840 2835519 2976651 3113907 3244946 3367592 3479134 3576267 3656036 3716953 3759189 3783823
50830 3783823 3792200 3786108 3768214 3741837 3710195 3676054 3642076 3611106 3585653 3567013 3555075 3548941
50818 3548941 3547343 3548210 3548197 3543271 3529960 3505850 3469039 3417837 3351376 3270174 3175673 3069492
50806 3069492 2953435 2829874 2701493 2570758 2440115 2312551 2191229 2078251 1974199
50797 1974199 1879023 1792982 1716565 1649990 1593143 1545728 1507136 1476363 1452363 1434382 1421837
50786 1421837 1414047 1410212 1409351 1410099 1410915 1410805 1409587 1407196 1403145 1397067 1389373 1380723 1371003 1359544 1346292
50771 1346292 1332015 1317154 1301162 1283409 1264212 1244469 1224592 1204284 1183162 1161191 1138706
50760 1138706 1116454 1095542 1076844 1060422 1045852 1033077 1022523 1014422 1008556 1004884 1003915 1006189
50748 1006189 1011675 1020100 1031557 1046394 1064616 1085887 1110163 1137993 1170081 1206735 1247776 1292745
50736 1292745 1341120 1392600 1447351 1505852 1568303 1634224 1702678 1772840 1844265 1916699 1989713
50725 1989713 2062475 2133787 2202374 2267180 2327374 2382007 2429692 2468731 2497618 2515350 2521273
50714 2521273 2514880 2496286 2467174 2431054 2392130 2353693 2317716 2285700 2259248 2239513 2226527
50703 2226527 2219579 2217957 2220778 2226225 2231579 2234241 2232398 2224580 2209017 2183859 2148040 2101858 2046831
50690 2046831 1985046 1918473 1848794 1777828 1707941 1641726 1581229 1527596 1481330 1442572 1411177
50679 1411177 1386909 1369690 1359521 1356272 1359861 1370528 1388372 1412525 1441325 1473471 1508437 1545488
50667 1545488 1582899 1618651 1651597 1681423 1707856 1730593 1749931 1766835 1782153 1796050 1808260
50656 1808260 1818653 1827529 1835499 1843086 1850315 1856842 1862631 1868404 1875240 1883876 1894597 1907550 1922923
50643 1922923 1940989 1962264 1987404 2016596 2049102 2083737 2119720 2156841 2194939 2233536 2271861
50632 2271861 2308940 2343788 2375882 2405415 2432974 2459115 2484310 2508542 2530102 2544974 2548305
50621 2548305 2536851 2510020 2469359 2418367 2362759 2309270 2262768 2224581 2193856 2169948 2152934
50610 2152934 2142534 2137656 2137097 2139854 2144509 2148850 2150504 2147740 2139527 2125022 2103255 2073277 2034597
50597 2034597 1987601 1933626 1874594 1812483 1749055 1685788 1623714 1563321 1504848 1448847 1396249
50586 1396249 1347748 1303274 1262248 1224248 1189200 1157097 1127998 1102327 1080680 1063103 1048992
50575 1048992 1038072 1030948 1028010 1028165 1029605 1031868 1036203 1043688 1053927 1066064 1080140 1096558 1114943
50562 1114943 1134545 1155495 1178658 1204342 1232051 1261480 1292882 1326287 1361095 1396655 1432634
50551 1432634 1468658 1504244 1539321 1574187 1608687 1641963 1673346 1703121 1732186 1761446 1791766
50540 1791766 1824004 1858698 1896048 1936438 1980620 2029167 2082142 2139494 2201426 2268162 2339853
50529 2339853 2416916 2499991 2589227 2684062 2783915 2888588 2997508 3109046 3220956 3331086
50519 3331086 3437238 3536798 3627061 3705682 3770464 3819145 3849965 3862201 3855814 3830917 3788092
50508 3788092 3728831 3655093 3568774 3472183 3368681 3262113 3155806 3052838 2957000 2872441
50498 2872441 2802027 2746641 2706226 2680914 2670884 2675674 2694041 2724154 2763485 2808535 2854833
50487 2854833 2897313 2930912 2951131 2954247 2937266 2898284 2837349 2756787 2660356 2552150 2436390
50476 2436390 2317548 2199742 2085889 1977827 1876934 1784005 1698733 1620260 1548364 1483493
50466 1483493 1425524 1373268 1325505 1281924 1242697 1207701 1176587 1149238 1125727 1106025 1090060
50455 1090060 1077859 1069405 1064531 1063025 1064579 1068532 1074020 1080600 1088422 1097673 1108244 1120095 1133520
50442 1133520 1148671 1165072 1181869 1198337 1213936 1228215 1240927 1252061 1261540 1269161 1275081 1280020
50430 1280020 1284685 1289252 1293748 1298579 1304228 1310611 1317268 1324223 1332288 1342462 1355341 1371188 1390295
50417 1390295 1413113 1440042 1471166 1506268 1545254 1588560 1636846 1690108 1747333 1807226 1869055
50406 1869055 1932377 1996088 2058178 2116571 2170040 2218257 2261094 2297899 2327343 2347854 2358214
50395 2358214 2357719 2345885 2322301 2286940 2240522 2184540 2121120 2052857 1982428 1912027 1843306 1777971
50383 1777971 1718144 1665814 1622143 1587555 1562265 1546239 1538814 1538841 1545260 1557140 1573181 1591601
50371 1591601 1610603 1628499 1643204 1652041 1652478 1643047 1623494 1594384 1556898 1512878 1464698 1414774
50359 1414774 1365034 1316629 1270118 1226078 1185527 1149482 1118038 1090240 1065182 1043021 1024615
50348 1024615 1010292 999253 989974 980714 969693 955480 937750 917548 896625 876486 858037 841730
50336 841730 827767 816286 807521 801658 798361 796778 796301 797045 799250 802517 806204 810315 815230 820601
50322 820601 825438 829598 834364 840895 848720 856444 863429 869962 876051 881065 884639 887199 889464 891975
50308 891975 895176 899247 903637 907443 910525 913703 917470 921159 923867 925721 927574 929785 931975 933920
50294 933920 936003 938658 941777 944863 947556 949924 952405 955477 959254 963372 967319 970816 973797 976224
50280 976224 978117 979670 981163 982864 985138 988447 992950 998189 1003478 1008626 1014120 1020550 1027945 1035643
50266 1035643 1042753 1048899 1054678 1061283 1069544 1079414 1090567 1103297 1118498 1136766 1157757 1180520
50254 1180520 1204344 1229135 1254940 1281162 1306461 1329681 1350802 1370684 1389952 1408573 1426485
50243 1426485 1443848 1460181 1473746 1482504 1485526 1482984 1474999 1461239 1441671 1417142 1389071 1359060
50231 1359060 1328943 1300665 1275623 1254106 1235346 1217893 1199969 1179929 1156731 1129994 1099727
50220 1099727 1066359 1031099 995878 962597 932368 905396 881343 859771 840446 823350 808383
50209 808383 795188 783484 773450 765399 759078 753613 748212 742674 737247 732296 728115 724668 721434
50196 721434 717874 714122 710833 708277 705895 702893 698912 694088 688938 684318 680905 678385 675613 671955
50182 671955 668058 664853 662302 659778 657355 655905 655898 656779 657768 658818 660438 662834 665524 667791 669440
50167 669440 671071 673576 677300 681746 686168 690312 694485 699068 704189 709832 716131 723564 732844 744387
50153 744387 757754 771900 786216 801157 817610 835843 855366 875639 896625 918812 943193
50142 943193 971156 1003945 1041947 1084599 1130968 1180307 1232177 1286311 1342245 1398827 1454158
50131 1454158 1506470 1555188 1600971 1644752 1686925 1727178 1764400 1796481 1820617 1834202 1835498
50120 1835498 1823676 1798737 1761682 1714439 1659365 1598889 1535567 1471893 1409630 1349524 1292062
50109 1292062 1238291 1189527 1146359 1108349 1074658 1044536 1017109 991263 966220 942129 919673
50098 919673 899114 880111 862573 847221 834879 825388 817706 811115 805878 802647 801720 803051 806444
50085 806444 811242 816293 820813 825084 829765 834728 839216 843054 846904 851238 855727 859928 863930 867974
50071 867974 871936 875533 878643 881105 882626 883212 883254 882873 881628 879267 876256 873069 869444 864908 859619
50056 859619 853989 847916 841318 835189 831067 829339 828994 829225 830371 832940 836598 840746 845442 851124 857931
50041 857931 865945 875680 887496 900729 914196 927600 941755 957284 973699 990015 1005788 1021120
50029 1021120 1035960 1049923 1062818 1075036 1087222 1099710 1112526 1126024 1141323 1159692 1181336
50018 1181336 1205018 1229088 1252732 1275971 1298677 1320164 1339811 1357605 1373819 1388566 1401999
50007 1401999 1414525 1426233 1436141 1442542 1444137 1440393 1430749 1414133 1389794 1358357 1321548 1280994
49995 1280994 1237753 1192901 1147932 1104274 1062785 1024039 988763 957521 930042 905243 882012
49984 882012 859840 838693 818557 799306 780923 763761 748410 735155 723486 712359 701184
49973 701184 690444 681154 673713 667560 661937 656738 652432 649350 647217 645413 643538 641669 640058 638813
49959 638813 638038 638209 640005 643615 648482 654001 660178 667238 674830 682170 688933 695483 702041 708034 712494
49944 712494 714868 715326 714543 713229 711570 708968 704614 698409 690993 682777 673410 662485 650307 637595
49930 637595 624804 612251 600618 590707 582737 576316 571093 567077 564351 562881 562643 563553 565262 567322
49916 567322 569604 572278 575346 578567 581863 585400 589147 592763 596209 600181 605621 612847 621377 630478
49902 630478 639692 648871 657942 666734 674963 682303 688400 692909 695659 696821 696710 695243 691792 685847
49888 685847 677759 668544 659040 649495 639904 630344 620884 611487 602137 592844 583551 574318 565644 558177
49874 558177 552027 546700 541870 537736 534442 531680 529331 528045 528586 530790 533795 537251 541695 547663
49860 547663 554993 563251 572374 582541 593610 605034 616177 626495 635549 643166 649608 655315 660353
49847 660353 664274 666590 667300 666764 665157 662194 657504 651090 643306 634546 625203 615902 607432 600282 594422
49832 594422 589746 586470 584804 584298 583908 582928 581728 581411 582750 585537 588986 592693 597077 602888 610415
49817 610415 619324 629073 639175 649029 657932 665503 671864 677204 681413 684490 686987 689505 691726 692458
49803 692458 690786 686809 681159 674266 666454 658369 650760 643852 637272 630676 624177 618156 612904 608510
49789 608510 604841 601471 597900 594114 590855 589017 588728 589227 589724 590107 590623 591195 591504 591686 592415 594117
49773 594117 596538 599400 603068 608020 613800 619176 623423 626941 630358 633532 635796 636849 636887 636051 634185
49758 634185 631212 627317 622627 617001 610308 602731 594729 586833 579482 572842 566644 560479 554409 549139
49744 549139 545294 542686 540584 538641 537158 536354 535836 535139 534548 534846 536259 538098 539649 541038 542832
49729 542832 545102 547417 549788 553032 557933 564362 571582 579169 587189 595559 603720 611067 617349 622466
49715 622466 626178 628352 629311 629602 629421 628514 626604 623695 619921 615398 610350 605161 600074 594960 589625
49700 589625 584329 579773 576489 574375 572988 572185 572306 573709 576318 579802 584072 589300 595353 601514 607075
49685 607075 612109 617339 623245 629634 636189 643045 650483 658350 666244 674217 682856 692498 702662 712391
49671 712391 720855 727428 731491 732665 731337 728648 725808 723474 721734 720442 719331 717968 715893 712945
49657 712945 709230 704645 698587 690433 680376 669552 659225 649984 641788 634528 628217 622759 617936
49644 617936 613738 610475 608414 607507 607578 608509 610014 611388 611874 611354 610494 610097 610325 610536 609773 607426 603631
49627 603631 599170 594902 591148 587565 583702 579730 576481 574664 574078 573797 573176 572477 572370 573075 574253 575570
49611 575570 576929 578137 578806 578895 579019 579838 581245 582515 583294 584154 585991 589036 592544 595423 597050 597563
49595 597563 597577 597745 598457 599645 600779 601327 601441 602010 603675 605894 607335 607238 606045 604680 603669 603129 603098
49578 603098 603426 603690 603680 603886 605068 607411 610473 613903 617808 622408 627651 633289 639059 644782 650606
49563 650606 657160 664997 673684 681752 687924 692280 695947 699698 703097 705005 704678 702261 698460 694073
49549 694073 689878 686580 684407 682809 681020 679122 678157 678905 680780 682327 682677 682191 681787 682071 683116 684705
49533 684705 686688 689317 693275 699148 706887 716028 726360 738099 751493 766643 783623 802233 821497
49520 821497 839799 855650 868012 875966 878776 876722 871445 865017 858810 853399 849079 845972 843830
49507 843830 842174 840570 838507 835235 830100 823018 814410 804882 795153 785991 777792 770327 763223 756539
49493 756539 750578 745274 740220 735244 730585 726520 723156 720590 719006 718596 719570 722044 725627 729338 732356
49478 732356 734734 736925 738801 739756 739751 739539 739692 740028 740330 741029 742723 745361 748321 751010 753070 754295
49462 754295 754759 754819 754689 754165 753090 751730 750314 748512 745942 743011 740560 738640 736311 732864 728750
49447 728750 724999 722081 719713 717447 715102 712787 710909 710085 710696 712492 714893 717691 721245 725940 731663
49432 731663 737916 744305 750784 757502 764537 771742 778890 785953 793292 801431 810583 820369 829931 838201
49418 838201 844038 846411 844798 839596 832155 824323 817753 813349 811149 810709 811671 814003 817792 823082 830043
49403 830043 839029 850143 862830 876214 889785 903471 917073 930149 942602 954878 967184 978824
49391 978824 988841 997160 1004589 1011623 1017725 1021977 1024102 1024505 1023532 1021054 1016834 1011066 1004356 997228
49377 997228 989882 982538 975808 970381 966302 962967 960080 958333 958760 961456 965314 968991 971903 974305
49363 974305 976706 979247 981401 982310 981591 979706 977240 973988 969322 963401 957387 952255 948031 944435 941574
49348 941574 939499 937676 935701 934212 934252 935831 937800 939208 940008 940400 940231 939482 938745 938641 939045 939353 939325
49331 939325 939289 939596 940232 940988 941720 942431 943284 944684 947317 951988 959302 969325 981563 995288 1009756
49316 1009756 1023909 1036081 1044494 1048261 1047756 1043962 1037841 1030277 1022070 1013526 1004345 994303 983822
49303 983822 973540 963551 953519 943431 933835 925439 918817 914341 911869 910492 909090 907239 905237
49290 905237 903285 901181 898866 896576 894104 890561 885456 879645 874561 870600 866915 862852 858990 856502
49276 856502 855861 856593 858169 860779 865037 871043 877907 884312 889465 893445 896724 899580 902003 903860 904985
49261 904985 905324 905199 905272 906095 907827 910591 914810 920809 928204 936095 943842 951223 957776 962488 964397
49246 964397 963202 959035 952031 942552 931687 921003 911662 903950 897649 892529 888378 884903 881965 879907
49232 879907 879422 881005 884591 889700 895806 902556 909685 916859 923722 930263 937108 945194 954818 965107
49218 965107 974734 983260 991399 999824 1008111 1015280 1021126 1026415 1031821 1037242 1042406 1047633 1053666 1061039
49204 1061039 1069991 1080745 1093446 1107810 1123179 1139035 1155326 1172232 1189668 1206963 1223119
49193 1223119 1237590 1250818 1263740 1276687 1289110 1300492 1311002 1320928 1330038 1338096 1345675 1353753
49181 1353753 1362697 1372423 1383477 1397065 1413725 1432702 1453058 1474921 1499249 1526739 1557261 1589869
49169 1589869 1622808 1653677 1680083 1700320 1713671 1720646 1723205 1724167 1725700 1728339 1731623 1735265 1739238
49156 1739238 1743123 1746191 1748264 1749995 1752193 1755282 1759501 1765146 1772290 1780496 1789146 1798059 1807691 1818740
49142 1818740 1831516 1845594 1860082 1874387 1888747 1903928 1920409 1937988 1956115 1974391 1992663
49131 1992663 2010778 2028454 2045427 2061684 2077441 2092865 2107839 2122137 2135783 2149130 2162587
49120 2162587 2176472 2191098 2206700 2223133 2239963 2257150 2275408 2295635 2318169 2343011 2370799
49109 2370799 2403132 2441695 2486995 2537767 2591306 2644436 2694648 2740904 2783598 2823562 2860525
49098 2860525 2891862 2912738 2918209 2906206 2879094 2842443 2801921 2760631 2718473 2673674 2625347
49087 2625347 2575237 2527134 2484459 2448457 2418578 2393952 2373976 2357938 2344972 2334573 2326605
49076 2326605 2320621 2315588 2310511 2305020 2299160 2292915 2286240 2279428 2273184 2268240 2264884 2262714 2260822 2258364
49062 2258364 2255003 2250864 2246279 2241708 2237705 2234559 2231974 2229344 2226359 2223164 2220063 2217430 2215856 2215957
49048 2215957 2217847 2221071 2225196 2230234 2236461 2244009 2252645 2261585 2269412 2274514 2275942 2273817 2269010 2262683
49034 2262683 2256180 2250865 2247628 2246540 2247124 2248806 2251048 2253299 2255175 2256717 2258300 2260168 2262107 2263634
49020 2263634 2264591 2265537 2267367 2270465 2274387 2278509 2282776 2287578 2293173 2299628 2307149 2315958 2325852 2336334
49006 2336334 2347229 2358729 2370733 2382594 2393806 2404534 2415199 2425721 2435458 2443760 2450474 2456027
48994 2456027 2460999 2465471 2468811 2470325 2470029 2468459 2465881 2462219 2457747 2453198 2448933 2444565 2439709 2434651
48980 2434651 2429903 2425454 2420841 2415680 2409799 2403129 2395810 2388226 2380603 2372794 2364656 2356423 2348428 2340774
48966 2340774 2333543 2327037 2321505 2316936 2313465 2311716 2312292 2315110 2319607 2325445 2332611 2340920 2349864 2358959
48952 2358959 2368097 2377651 2388402 2401060 2415559 2430989 2446535 2462250 2478650 2495911 2513989 2533291
48940 2533291 2554589 2578213 2603863 2631347 2661127 2693942 2730072 2769097 2810242 2852974 2897330
48929 2897330 2943625 2991885 3041828 3093476 3147330 3203695 3262203 3322286 3383704 3446152 3508802
48918 3508802 3570896 3632485 3693839 3754317 3812604 3868121 3921506 3973571 4024432 4073868 4121881
48907 4121881 4168557 4213767 4257343 4299302 4339690 4378487 4415824 4451979 4487033 4520720 4552690
48896 4552690 4582581 4609742 4633305 4652762 4668258 4680187 4688755 4694086 4696479 4696341 4694003 4689697 4683568
48883 4683568 4675611 4665703 4653688 4639241 4621813 4601056 4577273 4551022 4522164 4489666 4452529 4410650
48871 4410650 4364702 4315492 4263633 4209607 4153867 4096939 4039470 3982081 3925235 3869396 3815232
48860 3815232 3763326 3713716 3666019 3620023 3575837 3533447 3492511 3452775 3414573 3378850 3346722
48849 3346722 3318777 3294606 3273348 3254946 3240379 3230123 3222940 3217195 3213049 3212077 3214740 3219585 3225414
48836 3225414 3232914 3243278 3256312 3270962 3286937 3304553 3323351 3342121 3360215 3377918 3395549
48825 3395549 3413128 3431016 3449953 3470114 3490714 3510861 3530370 3549622 3569062 3589005 3609455
48814 3609455 3629896 3649650 3668655 3687593 3707102 3727174 3747438 3767705 3788027 3808488 3829150
48803 3829150 3850097 3871460 3893540 3916849 3941689 3967658 3993888 4019807 4045283 4069985 4093141
48792 4093141 4114296 4133847 4152374 4169691 4185130 4198662 4211118 4223097 4234044 4242735 4248426 4251218
48780 4251218 4251327 4248368 4241533 4230405 4215462 4197666 4177509 4154495 4127747 4097170 4063793 4028787
48768 4028787 3992330 3953813 3913025 3870553 3826855 3781565 3734293 3685774 3637536 3590435 3544100
48757 3544100 3497976 3452384 3408287 3366347 3326558 3288645 3252503 3218215 3185724 3154566 3124080
$$ [...]
##END NTUPLES=NMR SPECTRUM
##END=
