
##TITLE=AC1302_PERAH12114_7525498_Bu7zzF2CVs
##JCAMPDX= 6.0         $$ Bruker NMR JCAMP-DX V2.0
##DATA TYPE= NMR SPECTRUM
##DATA CLASS= NTUPLES
##ORIGIN= BRUKER
##OWNER= Administrator
$$ 1.72 TOPSPIN		Version 2.1
$$ 2013-02-20 03:07:29.756 -0500  Administrator@X
$$ Compression mode = diff/dup
##.OBSERVE FREQUENCY= 400.02188249412
##.OBSERVE NUCLEUS= ^1H
##.ACQUISITION MODE= SIMULTANEOUS (DQD)
##.ACQUISITION SCHEME= undefined
##.AVERAGES= 8
##.DIGITISER RES= 22
##SPECTROMETER/DATA SYSTEM= spect
##.PULSE SEQUENCE= zg30
##.SOLVENT NAME= COFFEE_meoh
##.SHIFT REFERENCE= INTERNAL, COFFEE_meoh, 1, 14.98509
##AUDIT TRAIL= $$ (NUMBER, WHEN, WHO, WHERE, PROCESS, VERSION, WHAT)
$$ ##TITLE= Audit trail, TOPSPIN		Version 2.1
$$ ##JCAMPDX= 5.01
$$ ##ORIGIN= Bruker BioSpin GmbH
$$ ##OWNER= Administrator
$$ $$ E:\/data/COFFEE/nmr/AC1302_PERAH12114_7525498_Bu7zzF2CVs/20/pdata/1/auditp.txt
$$ ##AUDIT TRAIL=  $$ (NUMBER, WHEN, WHO, WHERE, PROCESS, VERSION, WHAT)
(   1,<2013-02-20 03:07:21.381 -0500>,<Administrator>,<X>,<go>,<TOPSPIN 2.1>,
      <created by zg
	started at 2013-02-20 03:06:15.147 -0500,
	POWCHK enabled, PULCHK disabled,
       configuration hash MD5:
       86 BA 57 50 F2 9D 5C 9B 26 00 A9 28 5F 66 2E 89
       data hash MD5: 64K
       64 91 8C ED B5 58 29 1D FB 85 73 ED 76 8B DA 6A>)
(   2,<2013-02-20 03:07:24.444 -0500>,<Administrator>,<X>,<proc1d>,<TOPSPIN 2.1>,
      <Start of raw data processing
       efp LB = 0 FT_mod = 6 PKNL = 1 PHC0 = 0 PHC1 = 0 SI = 32K 
       data hash MD5: 32K
       43 2A CC 8E 74 9B 33 B9 1F A7 90 EF F8 02 03 8C>)
(   3,<2013-02-20 03:07:24.912 -0500>,<Administrator>,<X>,<proc1d>,<TOPSPIN 2.1>,
      <pk PHC0 = 72.65259 PHC1 = 0 
       data hash MD5: 32K
       D0 6A 90 A7 F2 F6 4D E2 D7 D0 B5 92 4C FD 95 08>)
(   4,<2013-02-20 03:07:25.162 -0500>,<Administrator>,<X>,<proc1d>,<TOPSPIN 2.1>,
      <abs ABSG = 1 
       data hash MD5: 32K
       05 65 9C 8E E6 D9 C5 27 81 60 30 7A 49 18 A3 52>)
(   5,<2013-02-20 03:07:25.303 -0500>,<Administrator>,<X>,<proc1d>,<TOPSPIN 2.1>,
      <abs ABSG = 2 
       data hash MD5: 32K
       11 74 1B DD 5C 2D E7 61 E1 72 C1 DA A4 AE 07 AE>)
(   6,<2013-02-20 03:07:25.584 -0500>,<Administrator>,<X>,<proc1d>,<TOPSPIN 2.1>,
      <abs ABSG = 3 
       data hash MD5: 32K
       1C 27 05 1C 6E 99 74 FA CC 32 5B 35 53 F8 66 E5>)
(   7,<2013-02-20 03:07:25.741 -0500>,<Administrator>,<X>,<proc1d>,<TOPSPIN 2.1>,
      <abs ABSG = 4 
       data hash MD5: 32K
       BF 99 3E F4 5A 42 45 34 79 C6 2B D2 76 40 90 B4>)
(   8,<2013-02-20 03:07:25.881 -0500>,<Administrator>,<X>,<proc1d>,<TOPSPIN 2.1>,
      <abs ABSG = 5 
       data hash MD5: 32K
       AF 41 75 5E CE 97 FF 3F F7 70 24 19 14 95 30 CA>)
$$ ##END=
$$ 
$$ $$ hash MD5
$$ $$ CD 18 68 5D 55 85 29 F4 E1 56 6C A4 7F 30 C8 67
##$RELAX= 
##$RELAX= 
##$RELAX= 
##$RELAX= 
##$RELAX= 
##$RELAX= 
##$RELAX= 
$$ Bruker specific parameters
$$ --------------------------
##$DU= <E:\>
##$EXPNO= 20
##$NAME= <AC1302_PERAH12114_7525498_Bu7zzF2CVs>
$$ [...]
150 150 150 150 150 150 150 150
##$TP07= 0
##$TPNAME0= <>
##$TPNAME1= <>
##$TPNAME2= <>
##$TPNAME3= <>
##$TPNAME4= <>
##$TPNAME5= <>
##$TPNAME6= <>
##$TPNAME7= <>
##$TPOAL= (0..7)
0.5 0.5 0.5 0.5 0.5 0.5 0.5 0.5
##$TPOFFS= (0..7)
0 0 0 0 0 0 0 0
##$TUNHIN= 0
##$TUNHOUT= 0
##$TUNXOUT= 0
##$USERA1= <user>
##$USERA2= <user>
##$USERA3= <user>
##$USERA4= <user>
##$USERA5= <user>
##$V9= 5
##$VALIST= <valist>
##$VCLIST= <CCCCCCCCCCCCCCC>
##$VD= 0
##$VDLIST= <DDDDDDDDDDDDDDD>
##$VPLIST= <PPPPPPPPPPPPPPP>
##$VTLIST= <TTTTTTTTTTTTTTT>
##$WBST= 1024
##$WBSW= 4
##$XGAIN= (0..3)
0 0 0 0
##$XL= 0
##$YL= 0
##$YMAX_a= 559274
##$YMIN_a= -546830
##$ZGOPTNS= <>
##$ZL1= 120
##$ZL2= 120
##$ZL3= 120
##$ZL4= 120
##$ABSF1= 14.98509
##$ABSF2= -5.573092
##$ABSG= 5
##$ABSL= 3
##$ALPHA= 0
##$AQORDER= 0
##$ASSFAC= 0
##$ASSFACI= 0
##$ASSFACX= 0
##$ASSWID= 0
##$AUNMP= <proc_prof1d_extract_pilot.lims>
##$AXLEFT= 0
##$AXNAME= <>
##$AXNUC= <1H>
##$AXRIGHT= 0
##$AXTYPE= 0
##$AXUNIT= <>
##$AZFE= 0.1
##$AZFW= 0.1
##$BCFW= 0
##$BC_mod= 0
##$BYTORDP= 0
##$COROFFS= 0
##$CY= 15
##$DATMOD= 1
##$DC= 0
##$DFILT= <>
##$DTYPP= 0
##$F1P= 0
##$F2P= 0
##$FCOR= 0.5
##$FTSIZE= 32768
##$FT_mod= 6
##$GAMMA= 0
##$GB= 0
##$INTBC= 1
##$INTSCL= 1
##$ISEN= 128
##$LB= 0
##$LEV0= 0
##$LPBIN= 0
##$MAXI= 10000
##$MC2= 0
##$MEAN= 0
##$ME_mod= 0
##$MI= 0
##$NCOEF= 0
##$NC_proc= -8
##$NLEV= 6
##$NOISF1= 0
##$NOISF2= 0
##$NSP= 0
##$NTH_PI= 0
##$NZP= 0
##$OFFSET= 14.98509
##$PC= 1
##$PHC0= 72.65259
##$PHC1= 0
##$PH_mod= 1
##$PKNL= yes
##$PPARMOD= 0
##$PPDIAG= 0
##$PPIPTYP= 0
##$PPMPNUM= 2147483647
##$PPRESOL= 1
##$PSCAL= 4
##$PSIGN= 0
##$PYNMP= <proc.py>
##$REVERSE= no
##$SF= 400.02
##$SI= 32768
##$SIGF1= 0
##$SIGF2= 0
##$SINO= 400
##$SIOLD= 32768
##$SPECTYP= <>
##$SREGLST= <1H.CDCl3>
##$SSB= 0
##$STSI= 32768
##$STSR= 0
##$SW_p= 8223.68421052631
##$SYMM= 0
##$S_DEV= 0
##$TDeff= 65536
##$TDoff= 0
##$TI= <>
##$TILT= no
##$TM1= 0
##$TM2= 0
##$TOPLEV= 0
##$USERP1= <user>
##$USERP2= <user>
##$USERP3= <user>
##$USERP4= <user>
##$USERP5= <user>
##$WDW= 1
##$XDIM= 32768
##$YMAX_p= 452329436
##$YMIN_p= -728208
##$CURPLOT= <Network HP LaserJet P1505>
##$CURPRIN= <$Network HP LaserJet P1505>
##$DFORMAT= <normdp>
##$LAYOUT= <+/1D_H.xwp>
##$LFORMAT= <normlp>
##$PFORMAT= <normpl>
##$SURQMSG= 1
$$ End of Bruker specific parameters
$$ ---------------------------------
##NTUPLES= NMR SPECTRUM
##VAR_NAME=  FREQUENCY,     SPECTRUM/REAL,   SPECTRUM/IMAG
##SYMBOL=    X,             R,               I
##VAR_TYPE=  INDEPENDENT,   DEPENDENT,       DEPENDENT
##VAR_FORM=  AFFN,          ASDF,            ASDF
##VAR_DIM=   32768,         32768,           32768
##UNITS=     HZ,            ARBITRARY UNITS, ARBITRARY UNITS
##FACTOR=    0.250966925370066, 1,           1
##FIRST=     8223.43324360094, -139082,      -90834
##LAST=      0,             15565,           -214150
##MIN=       0,             -728208,         0
##MAX=       8223.43324360094, 452329436,    0
$$ Real data points
##PAGE= N=1
##DATA TABLE= (X++(R..R)), XYDATA
$$ [...]
19569a60777B1069a53199j4137k32994G3880j7042J6152N4952i9667b1667C4646
19557b32385g6753E9200b21849j91648h0779I3376a64500B01814b01626k36794
19547d38420d5879k83455I9335f600k14328C2576a09084a3911b72j15447C5596
19535A73413g5072a5134r9869A74039l7825A3557J67461b77090B71886a99166
19524E1592J34138N9545E278b34855I7884a70841K9859G0046a49810a899j88825
19513a90724a1176A40067O4296c32136a7962k2797A26058c31010A7608a28588
19502d2308j11522r1697F0223B8124d3274A4425b72605H7543c67646I6897d68311
19490g4585o758k32708J05122F8177J85690b52356a01243k3618e9266B9265a96395
$$ y = [-160777, 21069, -153199, -167336, -400330, 73880, 56838, 72990, 127942, -99667, -21667, 34646, -232385, -76753, 59200, -221849, -413497, -80779, 93376, -164500, 201814, -201626, -438420, -45879, -329334, 99335, -6600, -220928, 32576, -109084, -13911, -272, -115719, 35596, 173413, -75072, -15134, -115003, 174039, 136214, 13557, 181018, -277090, 271886, -199166, 51592, 185730, 245275, 5278, -234855, 97884, -170841, -140982, 70046, -149810, -1899, -190724, -11176, 140067, 204363, -332136, -17962, -40759, 126058, -331010, 17608, -128588, -42308, -153830, -245527, 60223, 28124, -43274, 14425, -272605, 87543, -367646, 96897, -468311, -74585, -81343, -314051, -208929, 68177, 253867, -252356, -101243, -124861, -59266, 29265, -196395]
19478a44774A49162b09909C87783d83038D4308A9298c4539j20892A57730a49440
19467a64900k8323m7112D491h6479A27306b58125j78493g4697j7938k70374J66319
19456a96690r1051a02186B06566h1241M557o3078O6268B13480A0498a70155j53806
19445c23961E5241c04620B9829l72J628c5678j54809C5583b89504A89692b16253
19433e49040H1468A2963f0542l17797F1716B6744e3798j09931P8174I023O2990
19422G2013j1118a64790G1913b03177K1290B807a36342O3912I7865C8768f0333
19410b916D0879J0381g1325B6595b28447i0281j63021d8987F0458b78207B17002
19398D11121I2614d2703k83193a8209o6732a7262C8821J48957b29086L7819e632
$$ y = [-144774, 149162, -209909, 387783, -483038, 44308, 19298, -34539, -155431, 157730, -149440, -164900, -193223, -240335, 4491, -86479, 127306, -258125, -436618, -74697, -92635, -363009, -196690, -287741, -102186, 206566, -81241, -76684, -139762, -73494, 213480, 10498, -170155, -323961, 55241, -304620, 29829, 29457, 31085, -35678, -190487, 35583, -289504, 189692, -216253, -549040, 81468, 12963, -60542, -378339, 61716, 26744, -53798, -163729, -85555, 9023, 72013, 60895, -164790, 71913, -203177, -181887, 2807, -136342, -72430, 97865, 38768, -60333, -2916, 40879, 51260, -71325, 26595, -228447, -90281, -253302, -48987, 60458, -278207, 217002, 411121, 92614, -42703, -325896, -18209, -84941, -17262, 38821, 187778, -229086, -191267, -5632]
19386i2349l28366f7596c3020m9023A15646J84928B1175b1780j53152P3397p9703
19375a81238d3724A2832a69439P8536I7715m7194c9610o9859j15259A49128a84453
19363d3284A0856J9494a63569q0518m4040A41600b05621b1530I3081d3547o8131
19352a11678D42208c07344A3267a57491b8234q7782k7774P771j34714A33387g6906
19340g4654b2631E300a33891j25338m4787A35839F7715b9266k6175G2936a32967
19328b80551F5694c04535B59347b1930o5907E0555c7906F9070A0230a52089q6755
19317b38844i7870K0852C4398A052b87972j83770D6436J50612d24454a32560A11571
19305A05409a8232j74533A10893K1663c41972E4161R0244a2244D3386i3213A83136
$$ y = [-92349, -420715, -67596, -33020, -82043, 115646, 300574, 21175, -21780, -174932, -101535, -181238, -43724, 12832, -169439, -90903, 97715, 50521, -39610, -109469, -224728, 149128, -184453, -43284, 10856, 30350, -163569, -244087, -288127, 141600, -205621, -21530, 93081, -43547, -111678, 442208, -307344, 13267, -157491, -28234, -116016, -143790, -136019, -270733, 133387, -76906, -74654, -22631, 5300, -133891, -259229, -304016, 135839, 67715, -29266, -55441, 72936, -132967, -280551, 65694, -304535, 259347, -21930, -87837, 50555, -37906, 69070, 10230, -152089, -238844, -97870, -77018, 34398, 1052, -287972, -471742, 46436, 197048, -424454, -132560, 111571, 105409, -18232, -192765, 110893, 132556, -341972, 54161, 144405, -12244, 43386, -93213, 183136]
19293a92798j10045b3514B3081a01139A28746a15664k13534g7599p5913A76244
19282d17158b00486m8677A6151J5942C974a34914R18J0746j49107f2733B6785
19270a72192r193b1643k03705R9852L8159J7483I9240J2102Q5573D8031b48892
19258B77777K8179I848B734L2412a63225j79668b6808n3376k45955P1677J04920
19247a49542e0009m501B44919B3436J19202e16178C3706R766b66212c5369B4616
19235e3982l56529J32294C58897a38327O8263J5636l07992J21285A00367A6794
19224G7548L5022j0204P659A0470J8824J46722j3944B023P1505b9917G1662a0294
19211b9432A31420k7786a43257A99951l7235a28464A39764a92622p8280a3094
$$ y = [-192798, -302843, -23514, 23081, -101139, 128746, -115664, -329198, -77599, -153512, 176244, -417158, -200486, -249163, 16151, 32093, 3974, -134914, -133996, -123250, -272357, -62733, 26785, -172192, -181385, -21643, -225348, -125496, -87337, -69854, 99240, 111342, 196915, 48031, -248892, 277777, 305956, 9848, 2734, 35146, -163225, -342893, -26808, -80184, -326139, -254462, -149542, -50009, -54510, 244919, 23436, 142638, -516178, 33706, 43472, -266212, -35369, 24616, -53982, -410511, -278217, 358897, -138327, -70064, -54428, -362420, -241135, 100367, 16794, 77548, 112570, 102366, 110025, 10470, 29294, 176016, 162072, 2023, 73528, -29917, 71662, -10294, -29432, 131420, 103634, -143257, 199951, 162716, -128464, 139764, -192622, -270902, -13094]
19200c62412C56024I2868P0934K21644A36731B0196a48227o1733j63117G0273
19189f1917Q4I5034a21012j00207B05305b74607J36672c5989j94438A2909J88517
19178B01426b1154A21550m2655C7399a28355c9761A48832E7172A820K9270b96431
19166d8542A23898f0114j05396b8955n7711M3026o7655D4979c53224n3035B75651
19154i7504C78299a14947A6372J25972o597K39470B2659b5125o0158A10198L29426
19143D39624A3464M9082d39824a63618R184j45520E8251b06951M3238l42503a23729
19131g0330A0746b04592M532B9396K22682f6601k82247J52184M918D6283J25768
19120A72051n0293f4928k80492q2025a64871Q0841j49071A62734o2141m5466i4112
$$ y = [-362412, 356024, 92868, 163802, 385446, 136731, 20196, -148227, -209960, -373077, 70273, -61917, -61833, 95034, -121012, -221219, 205305, -274607, -137935, -35989, -230427, 12909, 201426, -21154, 121550, 78895, 37399, -128355, -39761, 148832, 57172, 1820, 31090, -296431, -48542, 123898, -60114, -165510, -28955, -86666, -43640, -111295, 44979, -353224, -406259, 275651, -97504, 378299, -114947, 16372, 142344, 135747, 375217, 22659, -25125, -85283, 110198, 439624, 13464, 62546, -439824, -163618, -154434, -299954, 58251, -206951, -163713, -506216, -123729, -70330, 10746, -204592, -200060, 29396, 252078, -66601, -348848, -196664, -191746, 46283, 172051, 121758, -64928, -345420, -427445, -164871, -84030, -233101, 162734, 100593, 55127, -94112]
19108a12594B0354J52917L4113j9967A48J23290c22622a42656B83045I4649a87618
19096a25861j9589j06892I9023l2916K61257A22620l1458H690J48317F7016p294
19085E9722L05596a6218A41241a37805f4560C9286a56194b1479m8937A48299C9534
19073e6635A3873b73687h0886c1124C11236a56908k52854e3376j90238d1408n7726
19062i9134A77069b01519Q8501j44888C84144A067c54015f6455A22795a75044
19051A54979b11799A61945d2503a6081l3581l98257b2864N083k6305A04083c3282
19039b8351k54359A98129m414f217C14543j00563E9875M03614a28689m3404h202
19027h1682A47099J69239D2810a08507A23838B1771b05915G2487C3563b74038
$$ y = [-112594, 20354, 173271, 207384, 187417, 148, 123438, -322622, -142656, 283045, 94649, -187618, -125861, -145450, -252342, 99023, 66107, 327364, 122620, 91162, 8690, 157007, 67016, 59722, 365318, -16218, 141241, -137805, -64560, 39286, -156194, -21479, -70416, 148299, 39534, -56635, 13873, -273687, -80886, -31124, 311236, -156908, -409762, -53376, -243614, -41408, -99134, 177069, -201519, -113018, -257906, 384144, 1067, -354015, -66455, 122795, -175044, 154979, -211799, 161945, -42503, -16081, -49662, -447919, -22864, -17781, -44086, 104083, -33282, -28351, -282710, 198129, 193715, -6217, 314543, 213980, 59875, 463489, -128689, -172093, -8202, -81682, 147099, 316338, 42810, -108507, 123838, 21771, -205915, 72487, 33563, -274038]
19016b15571l1874e5651j14755j88517A6375c2702H2306c5613A96710b34796Q3230
19005a51566j55352a14756k01764A89911a48014M2685J1355B5284c74144b7756
18994a40415N7393C8783a10425k32100K8513a34954n9977o9369d827B4161N4189
18983G8350l4130a66831O2087j00255j60067A46371g1751m7258A9576F049c28637
18971G9712J20909B2190O3395l64A7876c13186L5503O6145h9132c2074n2857C3527
18958G8551J83346a69299A20877c06183A5673L38283D5703d95883A1241a39806
18947A50913b11612J1456H6820i6356E5476a9106l37231a15469c668m2355q5410
18936a31433d1316J8491l59829A58876b52126f2255H9449B5345P7276a00829A36957
$$ y = [-215571, -247445, -55651, -170406, -358923, 16375, -32702, 82306, -35613, 196710, -234796, -151566, -306918, -114756, -316520, 189911, -148014, -105329, -93974, 25284, -374144, -27756, -140415, -83022, 38783, -110425, -342525, -314012, -134954, -194931, -264300, -4827, 24161, 78350, 44220, -166831, -104744, -204999, -365066, 146371, -71751, -119009, 19576, 6049, -328637, 79712, 200621, 22190, 85585, 85221, 17876, -313186, -277683, -211538, -89132, -32074, -84931, 33527, 78551, 261897, -169299, 120877, -306183, 15673, 353956, 45703, -495883, 11241, -139806, 150913, -211612, -200156, 86820, -96356, 55476, -19106, -356337, -115469, -3668, -46023, -131433, -41316, -22825, -382654, 158876, -252126, -62255, 89449, 25345, 102621, -100829, 136957]
18924d3471C4122b8106j19047A40577Q0969a55765A88176G7728c37582H5422b93553
18912A17364d6889j81959r280A30615e4087j27517P1401j42712h9767c2683j60023
18901a92706e8881j30918k30163B0194J59591n7945e4874k43855a35852b0748
18890B01267a35009A37586b25960d6981j36011h7719A66139b22448j80766C4574
18879a47949P2189n9380N4063k58460d1994F840K6522K1737a8734A42433O568
18868A49001d17199J51348i8849D7656a21414b0588r06A36683E337O0420b52063
18856a00489A45875a99018B18655i3367A5397b6169A1526b0299E3211a78525C12970
18844H450L8982K07867b74553C89756A41847b05749k43332J87078a17311a2124
$$ y = [-43471, 34122, -28106, -147153, 140577, 221546, -155765, 188176, 77728, -337582, 85422, -293553, 117364, -46889, -228848, -238128, 130615, -54087, -181604, -110203, -252915, -89767, -32683, -192706, -58881, -189799, -419962, 20194, 179785, 121840, -54874, -298729, -135852, -20748, 201267, -135009, 137586, -225960, -46981, -182992, -87719, 166139, -222448, -403214, 34574, -147949, -75760, -135140, -81077, -339537, -41994, 6840, 33362, 55099, -18734, 142433, 149001, -417199, -265851, -98849, 47656, -121414, -20588, -21494, 136683, 5337, 65757, -252063, -100489, 145875, -199018, 218655, -93367, 15397, -26169, 11526, -20299, 53211, -178525, 312970, 8450, 47432, 255299, -274553, 389756, 141847, -205749, -449081, -262003, -117311, -12124]
18833a87052O0639j26536a22488B9574i842A20184L0964J66099E1215a1701A55888
18821G3714b78902c299q8208F2721d8091j79337B40477b09715B82718b5450l5056
18810f0506C62412a32265d7494K0710j23620L4811A05036b72930A66676h2182
18799a94614a622q3690B26261C6090d3966A69260g6716C7547a84101b8036o561
18788c4597C4636J67250B2898P5578e8020J4164n2104C76250d14324e1061m3312
18777i4373o8388N2136l2714j37838B67586A09399l5112d0902j3769o3898e3506
18765b21582P3146I7122b33714h7882A98338b77502G7297k2540b28890I8077a26347
18753b7780F2545a74917C2276c32529F2455b19217g302l15264B41146f9327E4959
$$ y = [-187052, -126413, -252949, -122488, 29574, -9842, 120184, 151148, 317247, 51215, -11701, 155888, 73714, -278902, -3299, -91507, 62721, -48091, -227428, 240477, -209715, 282718, -25450, -60506, 362412, -132265, -47494, -26784, -150404, -115593, 105036, -272930, 166676, -82182, -194614, -1622, -85312, 226261, 36090, -43966, 169260, -76716, 37547, -184101, -28036, -34597, 34636, 201886, 22898, 98476, -58020, -43856, -95960, 376250, -414324, -51061, -94373, -162761, -110625, -143339, -281177, 267586, 109399, 74287, -40902, -54671, -118569, -53506, -221582, -148436, 97122, -233714, -87882, 198338, -277502, 77297, 54757, -228890, 98077, -126347, -27780, 62545, -174917, 32276, -332529, 62455, -219217, -7302, -322566, 241146, -69327, 54959]
18741B79146a61729A39825b01715q408C9065a76802E5859b45309o4417A08495
18730a62579f922A16694a10647q2240P0249G5573e4571q9252A54774a37035A47748
18718a98552l5615A5594i9114K0370c0964j688l3665A14015b48280A76529j9195
18707A57334h561H6541b93166C0813K49572a17490q9979f292n8035I2235l7698
18696E4537a20483k2522j40322a26170G8731f1920F8633f5232p2844j00288L5909
18685b02455j0315e8763j94183A1394b60211A59086b6353l02815A82486g6020
18674h5918G9134c19161g8890m7471C73976B3509c77491a42956A15136J5123i7353
18662A07122b13495l7577b2992o8808k54828L3634J25030e6163p5554A77984q8843
$$ y = [279146, -161729, 139825, -201715, -210123, 39065, -176802, 55859, -245309, -309726, 108495, -162579, -6922, 116694, -110647, -192887, -122638, 75573, -54571, -143823, 154774, -137035, 147748, -198552, -234167, 15594, -99114, -78744, -30964, -32652, -66317, 114015, -248280, 176529, 157334, -8561, 86541, -293166, 30813, 280385, -117490, -207469, -6292, -64327, 92235, 54537, -120483, -143005, -283327, -126170, 78731, -61920, 68633, -65232, -138076, -238364, -202455, -212770, -58763, -252946, 11394, -260211, 159086, -26353, -329168, 182486, -76020, -85918, 79134, -319161, -78890, -126361, 373976, 23509, -377491, -142956, 115136, 130259, -97353, 107122, -213495, -251072, -22992, -91800, -346628, -312994, -187964, -56163, -131717, 177984, 89141]
18651H9141a71449q5129H8026b33793i0973B57102e322n0302A13468i8255K1034
18640g7221K3512D1710f7958n9168j74022d749D3006j9284J56996C3030K02985
18629B36015c25400A00306a43884k02270C310e3874j81287L8095A26384a10026
18618I417h8164o4087A15699n3388f1981p9250D3537b8017l1328j4318r5904n146
18606a74713o5479A96462L7948d9886r3635k82253g0999p6386L2466j66527Q2531
18595a98915e8761o5473M7211b1505A41094d61630F6974c35730b5315N836j69155
18584a88634A44118a74124K2390C87000b0557A07241h5444L2718C67653f7425
18573f1219j10854p8226Q8204e8590B19702B2264J79680i628l36120C5813L6485
$$ y = [89141, -171449, -256578, 88026, -233793, -90973, 257102, -5322, -55624, 113468, -98255, -77221, -53709, 41710, -67958, -127126, -301148, -4749, 43006, 23722, 180718, 33030, 236015, -325400, 100306, -143884, -346154, 3310, -53874, -235161, -197066, 126384, -110026, 9417, -88164, -152251, 115699, 62311, -61981, -141231, 43537, -28017, -59345, -73663, -169567, -174713, -240192, 196462, 234410, -49886, -143521, -425774, -70999, -147385, -114919, -281446, -198915, -58761, -124234, -77023, -21505, 141094, -461630, 66974, -335730, -25315, -19479, -188634, 144118, -174124, -151734, 387000, -20557, 107241, -85444, -52726, 367653, -67425, -61219, -172073, -250299, -162095, -58590, 219702, 22264, 201944, -9628, -345748, 35813, 72298]
18562G2298N3728C3165j5310b05955L4351r7968G5291K7876M897K03365d51034
18550a66689C32792F4305K6539F126b63580G0685b3395r0032G9817b20597A8616
18538b56566J13974f3416j5569A63720C0790J48401l8723a75789A36896g8414
18527c02037B86227b29924A25980c841l47410B2c7384E8750J41863H6478c1854
18515a81490A24038e5107a1494k45496A14598B9972i9223F3592a64080B63349
18504D1584K96816H9601J3358C9889o40a36656L9354n6011B66114H7842b68374
18492a30178j98640A11470N415M8230J44224b38680e649B09101N0970G6024h7775
18480a31893f5812l5545M7662A77847c70219O45a28027B55545a25046o5262h4560
$$ y = [72298, 126026, 33165, 17855, -205955, -171604, -269572, 75291, 103167, 108064, 311429, -451034, -166689, 332792, 64305, 90844, 6126, -263580, 70685, -23395, -113427, 79817, -220597, 18616, -256566, -142592, -63416, -78985, 163720, 30790, 179191, 140468, -175789, 136896, -78414, -302037, 286227, -229924, 125980, -3841, -351251, 22, -37384, 58750, 200613, 86478, -31854, -181490, 124038, -55107, -11494, -256990, 114598, 29972, -99223, 63592, -164080, 263349, 41584, 338400, 89601, 102959, 39889, 39249, -136656, -97302, -153313, 266114, 87842, -268374, -130178, -328818, 111470, 116885, 165115, 309339, -238680, -5649, 209101, 260071, 76024, -87775, -131893, -65812, -101357, -53695, 177847, -370219, -369574, -128027, 255545, -125046, -190308, -84560]
18468F5651L453e12374C9635a11674c4154A01901i1209G9665c35356Q5617c9233
18456i4764c6299l97117G7817h9047G9353a66591K374e1837r0759l94763A83763
18444a78609B9367b39983h9973m04824G6375b71411B8487M2385J58213b49439
18433A54888G4400a28122n8883B8411a74184B2773h9325K6165A93671j2504D9063
18421G5786f8333p4110A21739B5085a35499A41009a86896O8557B6079b23421E4138
18409E460b43870G0819c6876e45j27825A48842e837l43765f5055C01193c8340
18397a25983d2216j96133l00834E8385P9913a81698B17780E2879c11811a0966
18386G9317a27853H9868a52017J5597r8602A2310c23511A2743i5855B37301a10881
$$ y = [65651, 69104, -512374, 39635, -111674, -34154, 101901, -91209, 79665, -335356, -249739, -39233, -94764, -36299, -433416, 77817, -89047, 79353, -166591, -164217, -51837, -142596, -537359, 183763, -178609, 29367, -239983, -89973, -494797, 76375, -271411, 28487, 70872, 229085, -249439, 154888, 74400, -128122, -187005, 28411, -174184, 22773, -89325, -63160, 193671, 181167, 49063, 75786, -68333, -142443, 121739, 25085, -135499, 141009, -186896, -118339, 26079, -223421, 54138, 5460, -243870, 70819, -36876, -545, -128370, 148842, -5837, -349602, -65055, 301193, -38340, -125983, -42216, -238349, -539183, 58385, 138298, -181698, 217780, 52879, -311811, -10966, 79317, -127853, 89868, -152017, -136420, -235022, 12310, -323511, 12743, -95855, 237301, -110881]
18374a05359A78926D9895c0554k4799r7862j50156A96879a15612A54842b88684
18363A82135J94766r5748H7106a83862J5481A00569h3303j31330N0234I1843L6108
18352A27951g9580a9174j01113c1978A88139h9344B79267A07585b21004J02479
18342a18525A37764A7711b94667R0944P073j25145C3065P489a39813j8112F0642
18330d0686g571B70058A6213e0050B4581Q0021c70196f3658b4978j85067A28429
18318I3276b24398A62668K44c39024J49423i0137p7498B44806i1204A84659c07209
18306b30925c1364A06459A2313P3656h6309i214k23770Q5009k91o9900A75466
18294A03374b69048H4379b04756G730a49949f4194O921F9687L7970j3899B8940
$$ y = [-105359, 178926, 49895, -30554, -55353, -153215, -303371, 196879, -115612, 154842, -288684, 182135, 376901, 281153, 87106, -183862, -168381, 100569, -83303, -214633, -164399, 91843, 127951, -79580, -19174, -120287, -31978, 188139, -89344, 279267, 107585, -221004, -118525, 137764, 17711, -294667, -203723, -196650, -321795, 33065, 40554, -139813, -157925, 60642, -40686, -7571, 270058, 16213, -50050, 24581, 104602, -370196, -63658, -24978, -210045, 128429, 93276, -224398, 162668, 162912, -339024, -189601, -90137, -167635, 244806, -91204, 184659, -307209, -230925, -31364, 106459, 12313, 85969, -86309, -9214, -232984, -147975, -148266, -218166, 175466, 103374, -269048, 84379, -204756, 7730, -149949, -64194, -57273, 69687, 107657, 93758, 28940]
18282D19151a4865j60055N8257j25333e024A46637b52702Q2240j33272a21844
18271d1494A2360J86514c1246o0639r1602m0738O3834B23647d5780j16277l5669
18260a97726A71882i697l14960D321J30132D0954J79036a36734D42812h9108A45809
18248b0920n0930j61193f5823A38898a86811F256a37022K8776D7108c78323E842
18236A18303A6244b75630L1259B6708P2121c5728m6257k21912A83164c5635L371
18225c2264C8776a62154B19938A6167a80378o390f5118j40336e6533Q091j25620
18214a74062g4933C08661b3772B11002a9394q082J226r146A69871H1769C4082
18202h8360c9616r4256E7293b29319A99457C5381a09265A06181a5756A07916h5292
$$ y = [419151, -14865, -174920, -116663, -241996, -5024, 146637, -252702, -170462, -303734, -121844, -41494, 12360, 198874, -31246, -91885, -183487, -224225, -160391, 223647, -45780, -162057, -197726, 171882, -9697, -324657, 4321, 134453, 40954, 219990, -136734, 442812, -89108, 145809, -20920, -71850, -233043, -65823, 138898, -186811, 6256, -137022, -108246, 47108, -378323, 5842, 118303, 16244, -275630, -244371, 26708, 98829, -35728, -81985, -303897, 183164, -35635, -32264, 38776, -162154, 219938, 16167, -180378, -186768, -65118, -205454, -56533, -48442, -174062, -74933, 308661, -23772, 211002, -19394, -27476, -26250, -35396, 169871, 81769, 34082, -88360, -39616, -133872, 57293, -229319, 199457, 35381, -109265, 106181, -15756, 107916, -85292]
18190b76984H0705A8423P3189g5367n3091H5129m1507c16233d841n1040J000n5648
18178a10529c8529a0331l278e298j01980A7783b09053k1494J08774D2899e8185
18166A31579b67815E9292h9488A24564e13866d7003r9245l8640r1491a09688A86846
18154a12793D7995L4077P5800a10176A00904a99614o8556i9372j01056l7435P5157
18143a62706L4462a0141a781p6637A27515b62373j86095A50511b18298c3421l6330
18132f9751F1221J76259D0700M9771b26429B3186L7117a33197a9325B61646a706
18120a42132B53245b06843e5875O555j96070B65472b37672d3270f801C7896d01388
18108A07177b83621c5656B63480a71727B69842h6098j2738B2540a29762B16194
$$ y = [-276984, 80705, 18423, 91612, -75367, -128458, 85129, 43622, -316233, -4841, -55881, -54881, -110529, -38529, -10331, -13609, -5298, -107278, 17783, -209053, -230547, -121773, 42899, -58185, 131579, -267815, 59292, -89488, 124564, -513866, -47003, -146248, -184888, -276379, -109688, 186846, -112793, 47995, 82072, 157872, -110176, 100904, -199614, -268170, -99372, -200428, -237863, -162706, -128244, -10141, -1781, -78418, 127515, -262373, -448468, 150511, -218298, -33421, -69751, 61221, 237480, 40700, 90471, -226429, 23186, 60303, -133197, -19325, 261646, -1706, -142132, 253245, -206843, -55875, -49320, -245390, 265472, -237672, -43270, -6801, 37896, -401388, 107177, -283621, -35656, 263480, -171727, 269842, -86098, -98836, 22540, -129762, 216194]
18097B3957K02796b92150A52520E6371k6906c08062J41954q043O0113K6362C9581
18085F5692c67506a10722A04788c96542E9905f7952B12338a95903B0153h3231
18074b2060A15925K0a6849B2929O1622J03942a47598O9715j50697h6754I3984
18062b82571Q7711E4876J59844H7847N576a79902F0401k788A4186a97195i0275
18050b38830E38864A86165h5482A06113b5275l4732k14863B766J55422a07404
18039d2082H1556D0157c33062B3904J93254I9520h8080A01928b00644a8095A90440
18027B49121F2354f6366j96650C5394c33353i7193A98051J10711A46508J16664
18017B63172b82933a00132B4923j708b3180l24064A53263a27980K7033I4809b7541
$$ y = [23957, 226753, -292150, 152520, 56371, 29465, -308062, -166108, -174151, -114038, -87676, 39581, 65692, -367506, -110722, 104788, -396542, 59905, -67952, 212338, -195903, 20153, -83231, -22060, 115925, 115945, -16849, 22929, 84551, 188493, -147598, -77883, -228580, -86754, 93984, -282571, -194860, 54876, 214720, 87847, 93423, -179902, 60401, 57613, 14186, -197195, -90275, -238830, 538864, 186165, -85482, 106113, -25275, -60007, -274870, 2766, 158188, -107404, -42082, 81556, 40157, -333062, 23904, 217158, 99520, -88080, 101928, -200644, -18095, 190440, 249121, 62354, -66366, -263016, 35394, -333353, -97193, 198051, 308762, 146508, 263172, -282933, -100132, 24923, 23215, -23180, -347244, 153263, -127980, -100947, 94809, -27541]
18005A16504k8831L3342a8334l0907G0982P831l5558K3914b19357O7763m4955
17994a96549F3424a41785e0629a829E5851f7170j33058A9949J49093b60407a15709
17982F1286M5150a81061C93082A64530A9220J60544j1447h9464n8317A42420a08192
17970H3848C642a57443O3516K1899m6459j61706c5198B09938A5594c75943c4321
17958a47039g1369a0306B54614c22511A24123b72389F3925g8058J6601H8130q190
17947G9940c29844E5448a53637B0136n194J75669D7085d5234k69716C36588A39986
17935G3146b9664k80215a30154j46225b0287j83096j10579h2081D8134g7077C65246
17923F0737L21551b64794k893C9925d4534k51471J04044C9253G517Q7620K02706
$$ y = [116504, 87673, 121015, -18334, -49241, 70982, 78813, 43255, 67169, -219357, -151594, -196549, 63424, -141785, -50629, -1829, 55851, -67170, -200228, 19949, 169042, -260407, -115709, 61286, 106436, -181061, 393082, 164530, 19220, 179764, 168317, -89464, -147781, 142420, -108192, 83848, 3642, -157443, -93927, -72028, -118487, -280193, -35198, 209938, 15594, -375943, -34321, -147039, -71369, -10306, 254614, -322511, 124123, -272389, 63925, -78058, -61457, 88130, 79940, -329844, 55448, -153637, 20136, 14942, 190611, 47085, -45234, -314950, 336588, 139986, 73146, -29664, -309879, -130154, -276379, -20287, -203383, -313962, -82081, 48134, -77077, 365246, 60737, 382288, -264794, -267687, 39925, -44534, -296005, -191961, 39253, 7517, 95137, 297843]
17912B97843B7801L73509a44275g1103j0573k987F9898h9226A16969b32915a00719
17900A06604c60655G4549b34678H902L1914i7770K0862B26979O7860a91234A07578
17888I9992K39408d4618B7916L6547d1797A08122b53646J04127A60089a59971
17877B49330a85585A25654a19018D1601J49220J26259b68950A635d8334C1g4048
17865A1632a24958B31855n53m0903F7156d3628E935a46675I0406D4249a07537
17853d957j26876j04108A417a02508E7464c80817Q2280J48372c7984D05175b96442
17841h1965e574B74774g0563A06510a6528O426B49359o5291G9084O8538D298J05205
17829A09503Q9711h7511d935m16577A28569L35246a64009O7639A43380g8383B8456
$$ y = [297843, 27801, 401310, -144275, -71103, -81676, -84663, 69898, -89226, 116969, -232915, -100719, 106604, -360655, 74549, -234678, 8902, 40816, -97770, -76908, 226979, 294839, -191234, 107578, 99992, 339400, -44618, 27916, 64463, -41797, 108122, -253646, -149519, 160089, -159971, 249330, -185585, 125654, -119018, 41601, 190821, 317080, -268950, 1635, -48334, 31, -74048, 11632, -124958, 231855, 231302, 190399, 67156, -43628, 5935, -146675, 90406, 44249, -107537, -4957, -131833, -235941, 1417, -102508, 57464, -380817, -298537, -150165, -37984, 405175, -296442, -81965, -5574, 274774, -70563, 106510, -16528, -10102, 249359, 184068, 79084, 147622, 4298, 109503, 199214, -87511, -4935, -421512, 128569, 463815, -164009, -96370, 143380, -78383, 28456]
17817A71156N763B3655a73029c4432l18065J8114B70508g0321p3779F2977L6610
17806I9587J86573d6604I7801J00806h9625j01041h8156k42630A14443J1000e5830
17794C41061a28370j96951J51918A27172Q3280r5803D97c1075k30793A83335J54043
17783C37378a90269D5728J59406p6401c8832o0517E5775c28843C58385j26236
17773B32149j05128f2827A4316h7356A86990g3113j93556H1066K33757f7331A11761
17761a70917B3707a22175C06552k7207F7613g3058A91202I851M4295b62564E7175
17749A45935e4537H4606N2925R3274i2216F3617J10676D7470J69237b91944B43515
17737A46497c6657A3481d6464j71227A67148g8051f050A55480P2740J77196j55986
$$ y = [171156, 176919, 23655, -173029, -34432, -352497, -334383, 270508, -70321, -144100, 62977, 99587, 286160, -46604, 97801, 198607, -89625, -190666, -88156, -330786, 114443, 125443, -55830, 341061, -128370, -325321, -173403, 127172, 210452, 114649, 497, -31075, -261868, 183335, 337378, -190269, 45728, 205134, 128733, -38832, -99349, 55775, -328843, 358385, 232149, 127021, -62827, 14316, -87356, 186990, -73113, -266669, 81066, 314823, -67331, 111761, -170917, 23707, -122175, 306552, 279345, 67613, -73058, 191202, 9851, 54146, -262564, 57175, 145935, -54537, 84606, 137531, 230805, -92216, 63617, 174293, 47470, 216707, -291944, 243515, 146497, -36657, 13481, -46464, -217691, 167148, -78051, -6050, 155480, 228220, 405416, 249430]
17726B49430a1552k58154N1835M0627A9629K7097M0354R8034i4483I7821G404
17714B01666b0008k98768a3269C38134f7748C89721A17958N45R2532I5886k5160
17703G0726f920l7810C15348j16696a61673K5526L2670K9825a2755A06448d8539
17691B2630K062J67740q8381C1704d4527A02078k2584c2190A31027f1667j42580
17680b04247F1454b1137j10807A29993C8686a8732k8633A73323e6619j3128C3343
17668A43185J2972E9044c24144Q0680a849A44360a46560A89207l0810L773P7145
17657B39315E8328J08382F9930a43541H4326i1825A28335k9198R6526E0050e8119
17645E16398A22212f116A5055a05262a7394j25891A92332b44816D4694K25789
$$ y = [249430, -11552, -269706, -217871, -177244, 19629, 46726, 87080, 185114, -94483, 97821, 7404, 201666, -20008, -318776, -13269, 338134, -67748, 389721, 117958, 118503, 211035, 95886, 70726, -6920, -44730, 315348, 198652, -161673, -136147, -103477, -73652, -12755, 106448, -48539, 22630, 24692, 192432, 104051, 31704, -44527, 102078, 79494, -32190, 131027, -61667, -204247, 61454, -21137, -131944, 129993, 38686, -18732, -47365, 173323, -56619, -69747, 33343, 143185, 156157, 59044, -324144, -243464, -1849, 144360, -146560, 189207, 158397, 162170, 239315, 58328, 166710, 69930, -143541, 84326, -91825, 128335, 99137, 195663, 50050, -58119, 516398, 122212, -6116, 15055, -105262, -17394, -143285, 192332, -244816, 44694, 270483]
17635B70483A22328f7200A34034E5653a4441I370J40764D5635i1707G3347g808
17623A56445i1425A31923K6264J9741J75658A13690d381D8451M8017J46416F4501
17611c51305A42363C6626i8877A36160N3060o1524A3772M9145c89496c1733r98
17600c2731k77253e7712j56003B4300b14234g8741l50691a51598m7251i1368J4130
17589g7238i505G7362K36729D9178c45834P2737A30329J18713H6136M499a89287
17577b15726E9784a49092b2030B21213o9568a57593A60795J0336D842J50269K05666
17566C60777j44319j7142d27102a12060M3829A55252h9097K7501A29516C2185
17555A9971a5096q6428A78453A205K3674J25974n7402a93719B68990I0972a6957
$$ y = [270483, 122328, -67200, 134034, 55653, -14441, 9370, 150134, 45635, -91707, 73347, -7808, 156445, -91425, 131923, 158187, 177928, 353586, 113690, -4381, 48451, 96468, 242884, 64501, -351305, 142363, 36626, -98877, 136160, 189220, 127696, 13772, 62917, -389496, -31733, -32731, -309984, -57712, -213715, 24300, -214234, -78741, -429432, -151598, -198849, -91368, -77238, -9505, 77362, 314091, 49178, -345834, -273097, 130329, 249042, 86136, 90635, -189287, -215726, 59784, -149092, -22030, 221213, 151645, -157593, 160795, 171131, 4842, 155111, 360777, 216458, 199316, -427102, -112060, -68231, 155252, -89097, -61596, 129516, 32185, 19971, -15096, -101524, 178453, 1205, 24879, 150853, 93451, -193719, 268990, 90972, -16957]
17543B16022a8825A61559b68748H4743M0962O3634a61851C78020J3263A44925
17532A65996F3273L8949L9757j7173a40170I4250a08472a5655A90731F0322a0633
17520b02012m9639A69851n3395J86723A34566j3770O2720K5267I4938d514j75029
17509a79543E58415A46900P8422c7163m6530L9313j38155B64975j04337b9214
17498A88369K28601J5709A11663C7336A408J66947J71216A12131J36319F6692
17487D0318J47420b16475F2037J95912b61583B79951D9770N6895c1209A05445
17476B19251J88797k02001k3428K7294n7305M9868J08642A12280Q7225G8745C479
17464G9534K12536e7154B89190i9172I4850P4326b19242f4104C48431j25707F0700
$$ y = [216022, -18825, 161559, -268748, 84743, 125705, 189339, -161851, 378020, 391283, 144925, 165996, 63273, 102222, 141979, 124806, -140170, 94250, -108472, -15655, 190731, 60322, -10633, -202012, -251651, 169851, 116456, 303179, 134566, 120796, 183516, 208783, 94938, -4514, -179543, 558415, 146900, 225322, -37163, -83693, -44380, -182535, 264975, 160638, -29214, 188369, 416970, 432679, 111663, 37336, 1408, 168355, 339571, 112131, 248450, 66692, 40318, 187738, -216475, 62037, 257949, -261583, 279951, 49770, 106665, -31209, 105445, 219251, 408048, 206047, 182619, 209913, 152608, 202476, 311118, 112280, 199505, 78745, 3479, 79534, 292070, -57154, 289190, -99172, 94850, 169176, -219242, -64104, 348431, 222724, 60700]
17452B40052a63910C0915l740J39778r07L14660q224n0045j60387m9359L6348
17441B49039r5816K35841A07032O8737J19579l1622j31253q134j5237J06891K52044
17430D68037j91246J78600r0919L4139A70681O9635J64158A02339J88942K07460
17420D98741j79736M1742A77179k0121J54933o5032K74364j75715q9232K70469
17410E26845k58843K2330i0972B16201E8262J13238j6344E3290R4248J1649a14665
17398D11182j92080J39599A23919P9965I1673k9586b4766A47918j1567E0581L05746
17387C56327D2943J72473b25036C61283Q8536m1263F9944K0884J7256j3128L2680
17376A27636J63025e97j2289A15926j1833J08187h6442C37313k4803r9241J27308
$$ y = [240052, -163910, 30915, 27175, 166953, 166046, 480706, 472482, 422437, 262050, 212691, 249039, 153223, 389064, 107032, 175769, 295348, 263726, 132473, 124339, 109102, 215993, 468037, 276791, 455391, 364472, 398611, 170681, 240316, 404474, 102339, 291281, 498741, 319005, 360747, 177179, 157058, 311991, 246959, 521323, 345608, 256376, 526845, 268002, 290332, -90972, 216201, 58262, 171500, 155156, 53290, 147538, 159187, -114665, 411182, 219102, 358701, 123919, 203884, 91673, 62087, -24766, 147918, 136351, 50581, 356327, 42943, 215416, -225036, 361283, 449819, 408556, 69944, 90828, 108084, 94956, 127636, 290661, -597, -12886, 115926, 104093, 212280, -86442, 337313, 312510, 213269, 340577]
17365C40577F5158k7214K45077q4354L03820I3887g7953b8763C20754d5876E8678
17353a09934C37993j29064J12691J4068a88264B03913P0518F9528a650j20212
17343a21862N6648B13849K44091F8427J82192G4640d2431C84955r6990G8739A5828
17331B28653J01604m5620K45205B08085J13487A281J47214L26856a39331a1641
17320a67282A68836a01977C98560j94031K19116j45476R7252a39053B18204o7628
17310A50576d4375B04222K29924A73043F2926R0581J2380F5429j8726J42125C6413
17298A37675R0411J19780j02700D9165J28756I128J7453h9173A58096L6472K58972
17287D53540B05287n0602a09288A63147o5711M9785Q2635l9249G5913c0478A54873
$$ y = [340577, 65158, 37944, 283021, 198667, 502487, 93887, -77953, -28763, 320754, -45876, 58678, -109934, 337993, 208929, 321620, 335688, -188264, 203913, 274431, 69528, -1650, -121862, -65214, 213849, 457940, 68427, 250619, 74640, -42431, 384955, 287965, 78739, 15828, 228653, 330257, 284637, 529842, 208085, 321572, 1281, 148495, 475351, -139331, -11641, -167282, 168836, -101977, 398560, 204529, 423645, 278169, 375421, -139053, 218204, 150576, -44375, 204222, 434146, 173043, 62926, 153507, 165887, 65429, 46703, 188828, 36413, 137675, 228086, 347866, 245166, 49165, 177921, 9128, 26581, -89173, 158096, 194568, 453540, 205287, 154685, -109288, 163147, 97436, 147221, 229856, 190607, 75913, -30478, 154873]
17275B14286f7810B42100E5919d3622m6529B05456O6877B1930L20543A32264J82939
17264C15203G2050P425J58528J67042j96155q3613Q9031p3575K56032J1891a85206
17252B47060j06439J16795k8015p0668J41364A36203Q1005J18606h5167A52721
17241B68454H6835K14669a94611D72976A49776M0784M3978l049G8872R9809J84848
17230C63529j78707E9841A2881K4957K69196l7670E3926L5185J62279B7831K11700
17219B39531J31708n2517l4084D6600K42427N347J15745E0158L02580E9281L32280
17208C91561K85422B05495J80157A74212B7166K08760l5720J20743o6639l3252
17198B21058b5275C59337A28914K82756j2781A72833K19413A04265L57896A79703
$$ y = [214286, -67810, 242100, 55919, -43622, -90151, 205456, 272333, 21930, 342473, 132264, 315203, 72050, 79475, 238003, 405045, 208890, 125277, 214308, 140733, 396765, 408656, -185206, 247060, 140621, 257416, 229401, 158733, 300097, 136203, 217208, 335814, -85167, 152721, 268454, 86835, 301504, -194611, 472976, 149776, 190560, 234538, 231489, 78872, 178681, 363529, 184822, 59841, 12881, 37838, 307034, 269364, 53926, 89111, 251390, 27831, 239531, 371239, 318722, 284638, 46600, 289027, 294374, 410119, 50158, 352738, 59281, 391561, 676983, 205495, 385652, 174212, 27166, 235926, 200206, 320949, 254310, 221058, -25275, 359337, 128914, 411670, 398889, 172833, 392246, 104265, 462161, 179703]
17187C85321A39127J39177Q6421R8707N4754K03196A35297P9125K59173J1840
17177D85435I8448K16197j29H7330J87507o1321K56134E2166L21988R4099p6431
17166C91822j2851B9831J06790R8219M12050Q395B54265J53386j83609K32747
17156D56789O0431j74664R0969o5997J33093f0367D54977j48805j0529A03896
17145C18907J16877I5200J30930K31780A66732O3028R8149Q6489j41103J45855
17135D19150j44139J6635K38123B18455q3730J35015p5296J29302K01222J20709
17125F45677C15882J83522B39768F5422N30553j86679j4372Q3655M2643F1565
17114D36368M2620k02572P9807L23674k74232J28884q8658J81196H1707J89523
$$ y = [385321, 139127, 278304, 364725, 463432, 518186, 721382, 135297, 214422, 473595, 485435, 98448, 314645, 314516, 87330, 274837, 213516, 469650, 52166, 374154, 468253, 391822, 378971, 29831, 136621, 234840, 646890, 655285, 254265, 407651, 224042, 456789, 517220, 342556, 433525, 367528, 500621, -60367, 454977, 306172, 295643, 103896, 318907, 435784, 95200, 226130, 457910, 166732, 229760, 327909, 414398, 273295, 419150, 275011, 291646, 529769, 218455, 134725, 269740, 194444, 323746, 524968, 645677, 315882, 499404, 239768, 65422, 595975, 409296, 394924, 478579, 521222, 61565, 436368, 478988, 276416, 356223, 679897, 405665, 534549, 445891, 627087, 81707, 271230]
17104B71230P8117j18470J71349p1365Q8835P2310L9400J23063j39315k26578
17094B88576L76687K6963k66688A30459L68697R0035k74029N21482D09041O6388
17084D75429L40736l66290j00204M47179B51407K21317J9343k9949K98363l75920
17074C84561J77217j37386K61819k07851J96960k49219P2402j34067J79473L57605
17064I01514l58683k04949L88517n8263j9669J00621j29295Q9508j90500K41254
17054G60055k3621j64475Q6071r9280J71176A13999M70197q9780o0453L67077
17044H01040o105O786C04949N37427j21730l05374N00839l61272k13108J93003
17034E34734Q3954j20023l8246J5253K27462K3224k02441n5618K22068L1978o7083
$$ y = [271230, 349347, 230877, 402226, 330861, 419696, 492006, 531406, 654469, 515154, 288576, 665263, 692226, 425538, 130459, 499156, 589191, 315162, 836644, 409041, 475429, 816165, 449875, 349671, 796850, 251407, 472724, 492067, 462118, 760481, 384561, 561778, 424392, 686211, 478360, 675320, 426101, 498503, 364436, 543909, 901514, 542831, 337882, 726399, 668136, 648467, 749088, 619793, 709301, 518801, 760055, 736434, 571959, 658030, 558750, 729926, 113999, 584196, 494416, 433963, 801040, 794935, 801721, 304949, 842376, 720646, 415272, 916111, 554839, 341731, 534734, 618688, 498665, 460419, 475672, 703134, 726358, 523917, 468299, 690367, 722345, 655262]
17023F55262p2540J16433k43750N67988k19352m5128Q1392N5015L1336o4974j92506
17012F69176j26806J39264K44984l60035J73535J31286L3574m05931L17066Q6915
17002I03028n0921J10276o9029j60531k348J69263J63475j32178k00004K8711
16992G59742R8367J45803J8236k09686M97075n08055M9258J01775L5722J4407
16982A002644J58751j02721j39493j44859K29192m0828K75637l88442M01398k40750
16972A010529K6899j73698K88344k99911L34334P7274n61478O97026k67538k81717
16962H50064K13930P7773K38227k53253M5053J6314K20966K29973l41527j43888
16952A153632K49787l38147k12474K77768k3975K24941o7337N605N2846R576j38126
$$ y = [655262, 582722, 699155, 455405, 1023393, 804041, 758913, 840305, 895320, 926656, 861682, 669176, 542370, 681634, 926618, 566583, 740118, 871404, 904978, 499047, 816113, 903028, 852107, 962383, 893354, 732823, 730475, 899738, 1063213, 931035, 731031, 759742, 858109, 1003912, 1022148, 812462, 1309537, 801482, 850740, 952515, 988237, 1002644, 1161395, 1058674, 919181, 774322, 1003514, 962686, 1238323, 849881, 1251279, 1010529, 1037428, 863730, 1152074, 852163, 1186497, 1263771, 702293, 1399319, 1131781, 850064, 1063994, 1141767, 1379994, 1126741, 1171794, 1188108, 1409074, 1639047, 1297520, 1153632, 1403419, 1065272, 852798, 1130566, 1106591, 1331532, 1264195, 1269800, 1322646, 1332222, 1194096]
16941A194096K27641j67353K03554l35458Q0561L00579k09663P3923l0196P7479
16931A415163J47918N0883q5973Q5429J08877j00628j29527j77453M60240l84776
16921A390153J15494J56477R4634n2659j93136L87852o391M8804q8140Q0952N5864
16910A989904R464j35957M3123j61559J09012M17577j23214l0521N9139k74888
16900A902080L47284k28031J36301n2606M92928l77676k01989J62554M1309K67262
16890B489416k4918L301k64416K95448k57488R2923J09112K12416n2500j2887
16880B590407k40946L76668j39725M4036L0828k51496K04072J10029L43906J13850
16870C181629j25608l9822r4391K11292K6055J04006p9365k58174P6062J41865
$$ y = [1194096, 1421737, 1254384, 1457938, 1122480, 1203041, 1503620, 1293957, 1367880, 1337684, 1415163, 1563081, 1613964, 1527991, 1613420, 1722297, 1621669, 1492142, 1314689, 1774929, 1390153, 1505647, 1662124, 1756758, 1704099, 1510963, 1898815, 1892424, 1941228, 1853088, 1934040, 1989904, 1999368, 1863411, 1906534, 1744975, 1853987, 2271564, 2148350, 2117829, 2176968, 1902080, 2249364, 2021333, 2157634, 2105028, 2597956, 2220280, 2018291, 2180845, 2222154, 2489416, 2464498, 2467799, 2203383, 2498831, 2241343, 2334266, 2443378, 2655794, 2603294, 2590407, 2349461, 2726129, 2586404, 2630440, 2661268, 2409772, 2613844, 2723873, 3067779, 3181629, 3056021, 3016199, 2921808, 3133100, 3159155, 3263161, 3183796, 2925622, 3001684, 3143549]
16860C143549J62213l8403M88717l23139J97104p5412n4337K72250L026l62915
16850C412653K23615J4402N26987J8098l98294L16987Q1369P4373M18182k99594
16840D388778K29957O1526R2885K88066l07603q5582L93862P5213k12046K32551
16830E157607M37043p2141r3079l6495K6842O30596j519K3868j21999N88827k45646
16819F293904K36933Q6342L43034j49221N7918K23447M13917R6520J16076J00068
16809G818938k3491M24032N88M71052M1688J39519K91948k6147K82141m7149N53816
16798I926935L57289J56974L73801L58674K59430K59307L78198j63450O50269
16789A2557427L58994J78819L29262L30928J93993P65069O0422N62617M82539
$$ y = [3143549, 3305762, 3267359, 3756076, 3432937, 3630041, 3554629, 3500292, 3772542, 3775568, 3412653, 3636268, 3650670, 4177657, 4195755, 3797461, 4114448, 4195817, 4270190, 4688372, 4388778, 4618735, 4680261, 4773146, 5061212, 4753609, 4668027, 5061889, 5137102, 4925056, 5157607, 5594650, 5522509, 5429430, 5392935, 5419777, 6050373, 6048854, 6072722, 5950723, 6539550, 6293904, 6530837, 6617179, 6960213, 6810992, 6868910, 7092357, 7506274, 7602794, 7718870, 7818938, 7795447, 8219479, 8220067, 8691119, 8732807, 8872326, 9164274, 9138127, 9420268, 9373119, 9926935, 10284224, 10441198, 10814999, 11173673, 11433103, 11692410, 12070608, 11907158, 12557427, 12916421, 13095240, 13424502, 13755430, 13949423, 14714492, 14774914, 15337531, 15820070]
16780A5820070O43969L28194M07142R80896M09396L97587N84972Q18969L90321
16771B0781516P17786N03437J169199R57742J078406Q49523P72869N83770J321063
16762B8735311J488506P68468J535665J029331J674550J208127J628251J413170
16754C9481379J892875J898332J998104J874230K390844K107989K499545K906248
16746E7049546K492327L001382L242236L293141L238656L935060L887076L592872
16738H3732296M894140M480846M611836M934768N167599N306717N321150N514613
16730A23963965N742726N401248N213947N409177M928492M563517L997105L543930
16722A62764107K944499K089362J346571M53771l76859r78136k310531k497788
$$ y = [15820070, 16464039, 16792233, 17199375, 18180271, 18589667, 18987254, 19572226, 20391195, 20781516, 21499302, 22002739, 23171938, 24129680, 25208086, 26057609, 26830478, 27414248, 28735311, 30223817, 30992285, 32527950, 33557281, 35231831, 36439958, 38068209, 39481379, 41374254, 43272586, 45270690, 47144920, 49535764, 51643753, 54143298, 57049546, 59541873, 62543255, 65785491, 69078632, 72317288, 76252348, 80139424, 83732296, 88626436, 93107282, 97719118, 102653886, 107821485, 113128202, 118449352, 123963965, 129706691, 135107939, 140321886, 145731063, 150659555, 155223072, 159220177, 162764107, 165708606, 167797968, 169144539, 169598310, 169221451, 168243315, 165932784, 163434996]
16714A63434996l479139m283296m040998n005309n199706n396275n604841n545701
16706A24879731n666486n756209n263328n114168n065036m783693m827587m184825
16698H4218399m376357m156580l330778l959836l319221l061077l147728k514458
16690E6352364k901063k360946k623424k250346j859321j895064j818022j921827
16682C8722351j385171k066173j138909j337704j169382j505787j018183j207275
16674B7893767r93236p64604j191597r77558p52035q12866q11525r43954l90413
16665B0255979o71078p51279p46139m12124p64556p0548j002765j68446n56694
16656A5112350o06716l70450l62163l90618q9919p56542q662j81249o39626l33336
$$ y = [163434996, 159955857, 155672561, 151631563, 146626254, 141426548, 136030273, 130425432, 124879731, 119213245, 113457036, 108193708, 103079540, 98014504, 93230811, 88403224, 84218399, 79842042, 75685462, 72354684, 68394848, 65075627, 62014550, 58866822, 56352364, 53451301, 51090355, 48466931, 46216585, 44357264, 42462200, 40644178, 38722351, 37337180, 35271007, 34132098, 32794394, 31625012, 30119225, 29101042, 27893767, 26900531, 26135927, 24944330, 23966772, 23214737, 22401871, 21590346, 20646392, 20255979, 19584901, 18833622, 18087483, 17675359, 16910803, 16840255, 15837490, 15669044, 15112350, 14505634, 14135184, 13773021, 13382403, 13292484, 12535942, 12527280, 12346031, 11706405, 11373069]
16646A1373069m84559j15794l44313k21450l54448j80828m40097K88664o39274
16637H880970j33279L5622l09557j11582k40688o4206m00810p8106k03597m648
16627G370119l51802Q8140j02675m05855r7045L90356p48806R2374k73601J3719
16617E974924j07022l34902j27229p1492r9874P2138Q451l01262l03761L31862
16607E041833l35102K0555o0323k69524J83225k91130J59398k51838j55850J84696
16597D225940j65276k43478L9621m547k080J12028m72195j27076j5575K02082
16587C549444j70448q21k42599L66164m65532K0633k58310L03110j14345N2494
16577C039790k05623o3875k5283K47182j27458J27316k39207j26838j93901j5688
$$ y = [11373069, 10888510, 10772716, 10428403, 10206953, 9852505, 9671677, 9231580, 9520244, 8880970, 8747691, 8783313, 8473756, 8362174, 8121486, 8057280, 7656470, 7578364, 7374767, 7370119, 7018317, 7106457, 7003782, 6597927, 6500882, 6891238, 6142432, 6234806, 5961205, 5974924, 5867902, 5533000, 5405771, 5334279, 5234405, 5306543, 5314994, 5013732, 4709971, 5041833, 4706731, 4727286, 4666963, 4397439, 4580664, 4289534, 4448932, 4197094, 4041244, 4225940, 4060664, 3817186, 3856807, 3852260, 3850180, 3962208, 3490013, 3362937, 3347362, 3549444, 3378996, 3378175, 3135576, 3501740, 3036208, 3056841, 2798531, 3101641, 2987296, 3039790, 2834167, 2770292, 2745009, 2992191, 2864733, 2992049, 2752842, 2626004, 2432103, 2416415]
16567B416415L3111N8458Q0947n13148L12752l946p8558j57598J94017o9350J02199
16556B375299l01739M0775J71286k55518J61757J5325l09220J31557k7447J47239
16546B149314n253m84225J25697m65569N58325l72722O3936L05999j79407k41692
16536A454403M45599l14909R6309m5823k52990j87648O57843l90719L50222L0419
16526A842706l10330l67339N56584l95885J92539P6956m00660L23706m51252K4337
16516A091362K48737m9072m5669K88910j39019P0884j09933o198J22869M6852
16506A519723j24553Q008j81133N2942o1167j78655J60679J8403L466l19282J08283
16495A006714L21427k72466J21681o2657j23289J60554k26224J67506j50041N7229
$$ y = [2416415, 2449526, 2507984, 2588931, 2075783, 2388535, 2384589, 2306031, 2148433, 2342450, 2273100, 2375299, 2073560, 2114335, 2285621, 2030103, 2191860, 2207185, 1897965, 2029522, 2002075, 2149314, 2144061, 1659836, 1785533, 1319964, 1878289, 1505567, 1569503, 1875502, 1696095, 1454403, 1900002, 1585093, 1681402, 1635579, 1382589, 1194941, 1852784, 1462065, 1812287, 1842706, 1532376, 1165037, 1721621, 1325736, 1518275, 1595231, 1194571, 1518277, 1067025, 1091362, 1340099, 1291027, 1245358, 1534268, 1395249, 1466133, 1356200, 1350002, 1472871, 1519723, 1395170, 1403178, 1222045, 1274987, 1213820, 1035165, 1195844, 1214247, 1217713, 898431, 1006714, 1328141, 1055675, 1177356, 1114699, 991410, 1151964, 925740, 1093246, 943205, 1000434]
16485A000434N1988K5525R4154j18970L0762r0835j01491j66515K60821J3540
16475I99413L0873l963k91552R2773j10165L63414k81682k17082m3513M9863L21199
16464I09578r8064Q785J67669j71366J46129m30686J43522J05652j62891J24361
16454G42689J34762K29257k17937j86281J58402R331j1275m4954o0359j46862
16444F06773K32763l46650N2449J34030l969K56134m56897K6514q8661K36268
16434F48754k84214J41005J09438J04042R8005o5714j8178q0625J24573k38427
16424E38659B27065J71029K82950n1192j8003j89823J81198n9953q3876k3176
16414D36219J876O9956O7781B81190L4599M70530l86621j85272H6495J79962K25840
$$ y = [1000434, 1052422, 1077947, 1172101, 1053131, 1083893, 993058, 891567, 725052, 985873, 999413, 1030286, 1026323, 734771, 827544, 717379, 1080793, 799111, 582029, 538516, 588379, 909578, 811514, 820299, 987968, 816602, 962731, 532045, 675567, 781219, 618328, 742689, 877451, 1106708, 888771, 702490, 860892, 870223, 858948, 813994, 753635, 606773, 839536, 492886, 545335, 679365, 675396, 931530, 474633, 501147, 412486, 648754, 364540, 505545, 614983, 719025, 817030, 751316, 733138, 652513, 777086, 538659, 227065, 398094, 681044, 629852, 611849, 422026, 603224, 543271, 459395, 436219, 438095, 508051, 575832, 281190, 315789, 786319, 399698, 214426, 86495, 266457, 492297]
16403D92297J18536k92110N6078K69898R84k64289q3079L2772N04775j51528k01778
16392D82556L4231k07011J53241J88459J17510B69680J38027j4870L1140f6524
16381A57167K56951J13456P2837k27710L9679J55513j4934o2910m6242B18432
16370E32777j50076k1661M49732B39881J64712J09611j71523l3607A34526J08155
16360B42681K8281M0935O0070J02910B23385m6253K57804j38671j42341L95532
16350E49456k05727J60687J88952j93029j04175p3442O0224A56699J99231l540
16340C52390J84060A08513K86903K03950B40964F658O00232j06605A96774J08432
16330C05206J70745j55312p7988R4283j57002J73862Q7568J6447A09305K58236
$$ y = [492297, 610833, 318723, 374801, 644699, 645683, 381394, 298315, 331087, 835862, 684334, 482556, 516787, 309776, 463017, 651476, 768986, 269680, 407707, 392837, 423977, -66524, 157167, 414118, 527574, 600411, 372701, 412380, 567893, 552959, 490049, 443807, 218432, 532777, 382701, 361040, 810772, 239881, 404593, 514204, 342681, 309074, 134526, 242681, 270962, 311897, 371967, 474877, 223385, 177132, 434936, 296265, 153924, 549456, 343729, 504416, 693368, 500339, 396164, 322722, 382946, 156699, 355930, 352390, 536450, 108513, 395416, 599366, 240964, 6658, 606890, 500285, 196774, 305206, 475951, 320639, 242651, 336934, 179932, 353794, 441362, 457809, 109305, 367541]
16320C67541B8863N13881A64710K11954J2585j70168a58910B96108H886M01670
16310D10556q9992N5964H8735O7713R0523J91703G4207N1941p268K27504k0483
16299C25901r330A10207M5973K19672J38810H7886J50999K19902m4991A10639
16288A1509J70956P4334j19321P1206C1973L95302B8727J19111K03263A64156
16277F6308M10059j42788A40597F4276e2821C36966q7207D909d0160B91983K5862
16266C17845J32261C6689b26124B10022J3215H0929M5103a7239A40642L5378H2242
16254A83182a72502D98708j65398d1009E9651R3581n2042K00833J65684p3295
16244C94412A16928B8016M77583d3167B99695o8959A13946J12320G2653O1183
$$ y = [367541, 28863, 542744, 164710, 376664, 389249, 219081, -158910, 296108, 8886, 410556, 320564, 376528, 88735, 156448, 246971, 438674, 74207, 126148, 118880, 346384, 325901, 316571, 110207, 156180, 375852, 514662, 87886, 238885, 458787, 413796, 110639, 11509, 182465, 256799, 137478, 208684, 31973, 427275, 28727, 147838, 351101, 164156, 66308, 476367, 333579, 140597, 64276, -52821, 336966, 249759, 4909, -40160, 291983, 317845, 450106, 36689, -226124, 210022, 223237, 80929, 126032, -17239, 140642, 176020, 82242, 183182, -172502, 498708, 333310, -41009, 59651, 153232, 101190, 302023, 467707, 394412, 116928, 28016, 505599, -43167, 299695, 230736, 113946, 226266, 72653, 133836]
16234A33836E3991J91144f7452D1246N66896G4673P3789J86547m7953J21504A04657
16222C3708f6208B8079K5392K32018p6516f3488A45687o1855c0157A66974A8255
16210C7738h336A92171H0274J14312J26935j06556b03895D8600L7723A967J50031
16199A51998P1463O9774l2548A25671K65448g8067c1797B10888J85483A2570a70997
16187B4344d3601q8076j85505B41092r6120F2051M32440A41294h1033r3891D674
16175B68272e8821H5873R8443F6965J80122M671p4556C290J11848E4812p934Q0345
16163A27223k8605K00338b4074C79074A33660d35473B87465a23511r293H4159
16152D501c1253j46388o5988B35955H2401K95317r0196H8353c6744j14675F5543
$$ y = [133836, 53991, 245135, -67452, 41246, 608142, 74673, 148462, 335009, 287056, 408560, 104657, 33708, -66208, 28079, 53471, 285489, 208973, -63488, 145687, 83832, -30157, 166974, 18255, 37738, -8336, 192171, 80274, 194586, 321521, 214965, -203895, 48600, 86323, 1967, 151998, 223461, 293235, 260687, 125671, 391119, -78067, -31797, 210888, 396371, 12570, -170997, 24344, -43601, -131677, -317182, 241092, 144972, 62051, 494491, 141294, -81033, -174924, 4674, 268272, -58821, 85873, 184316, 66965, 247087, 251758, 177202, 3290, 115138, 54812, 46878, 127223, 98618, 298956, -24074, 379074, 133660, -435473, 287465, -123511, -132804, 84159, 4501, -31253, -177641, -243629, 235955, 82401, 377718, 287522, 88353, -36744, -151419, 65543]
16140A33417d7081A10792d14387B98792c05618A42445a17465H6251o32J6571L1143
16129A33333i9326j29975a01748j5042A05757D3649H588K96592A03055c22319
16118B9584i4256K5666B67455A14585b01198g8311a4980o1770j27316A57462g6059
16106H689f4780J3553I3193e7833l7792I8281J39565K51765B37631m6119F9870
16094A69687d5144A35991E1488b53481A11831J10003a0533B01442a05985F6483
16083I3937J5722K7257l6290l6524j7662A9733f2649a0268D40656A62847D9579
16071A21791a02573j49938G2236b25048L3921O9363F884J30008o649J56391b17383
16059A95572j2993M3848E6494I957d5703A77994l3081b27615C5297g051n1848
$$ y = [133417, -47081, 110792, -414387, 298792, -305618, 142445, -117465, 86251, 85619, 102190, 133333, -99326, -229301, -101748, -116790, 105757, 43649, 8588, 305180, 103055, -322319, 29584, -94256, -68590, 267455, 114585, -201198, -78311, -14980, -76750, -204066, 157462, -76059, 8689, -64780, -51227, 93193, -57833, -95625, 98281, 237846, 489611, 237631, 191512, 69870, 169687, -45144, 135991, 51488, -253481, 111831, 221834, -10533, 201442, -105985, 66483, 93937, 109659, 136916, 100626, 64102, 46440, 19733, -62649, -10268, 440656, 162847, 49579, 121791, -102573, -252511, 72236, -225048, -191127, -121764, 6884, 136892, 130243, 286634, -217383, 195572, 182579, 226427, 56494, 9957, -45703, 177994, 144913, -227615, 35297, -7051, -58899]
16048e8899b0028r4020d9189q521H5975c70626A46621a22729j23008J05206A15026
16036E2957c92088a82336C11460d2652B3600a96505A89909a6438j23573m0087
16026a80098g9347B15040a41622b1517B5378O9679c0402O754C3663O480b49415
16014H7720b2551C1911J55425c30502a4735F1112P6976J36496A8305L3211a28826
16002c20106A02741M6022a20585B42248a64492J0588g0856A47573a72243A78181
15991B31889a60954g9282I3404a23123m3527I0217J48398A0490M23803l6836j05277
15980B92180M8850f2356G9339N2938c72839F6362A560h7393o520C23190a92274
15968g2209D2027c31336D7056J94604F1934J32322a68581A80970d2292A6445c08538
$$ y = [-58899, -20028, -114048, -49189, -57710, 85975, -370626, 146621, -122729, -245737, -140531, 115026, 52957, -392088, -182336, 311460, -42652, 23600, -196505, 189909, -16438, -140011, -180098, -79347, 215040, -141622, -21517, 25378, 95057, -30402, -23648, 33663, 40143, -249415, 87720, -22551, 31911, 187336, -330502, -14735, 61112, 138088, 274584, 18305, 51516, -128826, -320106, 102741, 148763, -120585, 242248, -164492, -153904, -70856, 147573, -172243, 178181, 231889, -160954, -79282, 93404, -123123, -166650, 90217, 238615, 10490, 434293, 397457, 292180, 341030, -62356, 79339, 132277, -372839, 66362, 1560, -87393, -93913, 323190, -192274, -72209, 42027, -331336, 47056, 241660, 61934, 194256, -168581, 180970, -42292, 16445, -308538]
15956c3399A3927a06857A199b58953B84332a29722B67533a88892j66647A08276
15945F3569b46117a05432B08498L5150b23B22383b21427F6332k4175b06130d2893
15933A93234g3362A96125J46930a19401F3105Q4812b3023j2240C9996c69647D3498
15921A13852c29916G4650d2069J2476j35747c396B73907d1011A00447P0962K2590
15910A93999E4261a80170I9922b33202B9956e8211J5564j58245K1207B54746I6487
15898B9437K80233a61286e2277A64409L7618F6523M2830J2355c27427A04804K52912
15887C57716d2332c907A12237A8457b23397A24904C6235a23802B45242b05995
15876d3545l40404f75p1404j57016i3211r8465A04593b06018i318A52630a59827
$$ y = [-33399, 13927, -106857, 1199, -258953, 284332, -129722, 267533, -188892, -355539, 108276, 63569, -246117, -105432, 208498, 243648, -223, 222383, -221427, 66332, 42157, -206130, -42893, 193234, -73362, 196125, 343055, -119401, 63105, 147917, -23023, -35263, 39996, -369647, 43498, 113852, -329916, 74650, -42069, -29593, -165340, -3396, 273907, -41011, 100447, 171409, 193999, 54261, -180170, 99922, -233202, 29956, -58211, -42647, -200892, -179685, 254746, 96487, 29437, 309670, -161286, -52277, 164409, 202027, 66523, 109353, 121708, -327427, 104804, 357716, -42332, -3907, 112237, 18457, -223397, 124904, 36235, -123802, 245242, -205995, -43545, -383949, -675, -72079, -229095, -93211, -191676, 104593, -206018, -9318, 152630, -159827]
15864E9890R9723C9144c13885b3581A46233a25223D0974g350k11296Q2410B7171
15852D08320B03473r8213C9038a52009B45191r3769b22579C4804h0466I3175I412
15840b80635a5233B72869C5K36444B8016J00944a01284j71363A81143d3850k6042
15829f9892j25268L6409N5613b8572A49283D9173a04549G7515j9413b18880C8920
15817B6992Q6242a20777n2788A81983a53718L1882B56634h1382k60427B99894
15806A08450J40391b69465j523h8036L9047A54790i9917A97255b71666R2971c2612
15794@C50960b08070E8062f1719l2956C03449c2998B1623b35375G0673m07K90105
15782C60371b5973D5374q405b38320A06871c95011A06166J06355a57450C36682
$$ y = [59890, 159613, 39144, -313885, -23581, 146233, -125223, 40974, -7350, -218646, -136236, 27171, 408320, 203473, 105260, 39038, -152009, 245191, 151422, -222579, 34804, -80466, 93175, 9412, -280635, -15233, 272869, 35, 236479, 28016, 128960, -101284, -272647, 181143, -43850, -69892, -195160, -158751, -103138, -28572, 149283, 49173, -104549, 77515, 58102, -218880, 38920, 26992, 113234, -120777, -173565, 181983, -153718, -121836, 256634, -81382, -341809, 299894, 108450, 248841, -269465, -270988, -88036, -48989, 154790, -99917, 197255, -271666, -178695, -32612, 0, 350960, -208070, 58062, -61719, -94675, 303449, -32998, 21623, -235375, 70673, 70266, 360371, -25973, 45374, 36969, -238320, 106871, -395011, 106166, 212521, -157450, 336682]
15771a95874A2340J33427g5229j27552P083L6454k1831n8548R9651Q873D4436
15759B37516b67239M069A79348o3377K00678a31172B1369P3016a0346M033B33601
15747E7643i2902A72100B2626a08024B75579h4238j03047R2380K0062A73280h0851
15735B02286p8531o965c65408A50407d66819a14821j3641o07j83374h5759k57701
15724c43460a07773d1665h434G2773b6676A01446g4236p0146j47457J26988N9775
15713a05076n3744D926K6703a36302j31781Q910H0711h2046j42979B37715a19629
15701b78526E0689K18162l3188a96303R7930j5977n5687A26894a45912G9224e9974
15689I7802c53535I0680O2878Q5973i1105j243B04300a15828A21059K43404C8034
$$ y = [-195874, 12340, 145767, -75229, -202781, -195698, -159244, -181075, -239623, -139972, -131099, 44436, 237516, -267239, -263170, 179348, 115971, 316649, -131172, 21369, 94385, -10346, -6313, 233601, 57643, -92902, 172100, 22626, -108024, 275579, -84238, -187285, -94905, -74843, 173280, -80851, 202286, 123755, 116790, -365408, 150407, -466819, -114821, -128462, -129069, -312443, -85759, -343460, -107773, -41665, -8434, 72773, -26676, 101446, -74236, -144382, -291839, -164851, -105076, -158820, 4926, 31629, -136302, -268083, -259173, 80711, -82046, -225025, 237715, -119629, -278526, 50689, 268851, 235663, -196303, -98373, -114350, -170037, 126894, -145912, 79224, -59974, 97802, -353535, 90680, 153558, 239531, -91105, -92348, 204300, -115828, 121059, 364463, 38034]
15677f0549p106c686k09355B87712a74853A28264b85488Q4701D688M45a68037
15665A90628a74226m8666O6843k63323A0214K85971A09030d71276C4724a28617
15654F2822A16J18936a79575A34786b07636B4241a33210j43025a2331B3612K41118
15643B64730d1344B6117J06133K87509h7542q4053q0683K0597b3694f795G053
15631A60570D0192i850D1081b54866L6719A85041J20425A28297q155a762B54032
15619a35016B18821J8677i6269A75636b62645J11377A9460a08284F1782A2635
15608a64612M5017o8099A46029m5482C1174J5838n140J00484a82810g0823A33396
15596C16864b87397i477G9784i7780e320l831o5267o6126B6715a26100B6159J63518
$$ y = [-60549, -67655, -3686, -213041, 287712, -174853, 128264, -285488, -200787, 4688, 5133, -168037, 190628, -174226, -222892, -156049, -419372, 10214, 296185, 109030, -471276, 34724, -128617, 62822, 116, 119052, -179575, 134786, -207636, 24241, -133210, -276235, -12331, 23612, 264730, -41344, 26117, 132250, 419759, -87542, -171595, -252278, -231681, -23694, -6795, 7053, 160570, 40192, -9850, 41081, -254866, -218147, 185041, 305466, 128297, 120142, -1762, 254032, -135016, 218821, 237498, -96269, 175636, -262645, -151268, 19460, -108284, 61782, 12635, -164612, -119595, -187694, 146029, 100547, 31174, 47012, 41872, 142356, -182810, -70823, 133396, 316864, -287397, -9477, 79784, -97780, -5320, -9151, -74418, -140544, 26715, -126100, 26159, 189677]
15584A89677H0677a09552o5321p7111A55413E8343i1395L5311A48061e1976B7129
15572e1188O836G9490P9293j5935c9815k89376a46020M471A36850E1197J07739
15561A58936a6669A57072G1389M9182D5246J02998p3304b10436B35328H796a11833
15549F4213a71672A19798a60230A51151a50299I427k739i8631d6177A16421Q4883
15538B01304F6942K98938G7388M2174h5576A38367k1353J9353O6250a62643n4008
15527b16651c4459h535E6876K5939I228b59173a370r3262A7562K56257b25509
15515a12129j2033M8622C4637L25928f138a558A13169a33949a9939B9100d5555
15503C60958A44757n2567c50049P180a60005C3444K1990B887M4340J33467b45992
$$ y = [189677, 80677, -109552, -174873, -251984, 155413, 58343, -91395, -56084, 148061, -51976, 27129, -51188, -44352, 79490, 158783, 142848, -39815, -329191, -146020, -141549, 136850, 51197, 158936, -16669, 157072, 71389, 120571, 45246, 148244, 74940, -210436, 235328, 8796, -111833, 64213, -171672, 119798, -160230, 151151, -150299, 9427, 6688, -98631, -46177, 116421, 201304, 66942, 365880, 77388, 119562, -85576, 138367, 117014, 136367, 202617, -162643, -216651, -34459, -8535, 56876, 82815, 9228, -259173, -1370, -94632, 17562, 273819, -225509, -112129, -124162, -75540, 34637, 360565, -6138, -1558, 113169, -133949, -19939, 29100, -45555, 360958, 144757, 92190, -350049, -342869, -160005, 33444, 55434, 2887, 47227, 180694, -245992]
15491A51130E1437O8436c50569a07966b9335E7786K43474e8573k7299o5981j1174
15480a63027I9100a86360P5803A14207l61B1341K4350J4775A8585K19964a46160
15468c5305H976e00839h0510b3670j08061B2570a0879j84376A5693f8706k25654
15457b94360G8919f339q2716B41161I5656b8181A30869a52176H825a29340j25069
15446b54409A3609K20506N4286H0528b09395k22873d230m9295k8321m2354k91154
15435d15354A48599C2917b22738P2210p6932B0744b07355J5100C39116b47956
15424b2466C8631b36176f9267A96663a93290b0787j43358A57939M705l4549E579
15412a485A12962a58333I1269b71624D3132c9104r0536f4195k9035M1769l6917
$$ y = [151130, 51437, 119873, -350569, -107966, -29335, 57786, 301260, -58573, -85872, -151853, -163027, 99100, -186360, -110557, 114207, 113846, 21341, 45691, 60466, 18585, 238549, -146160, -35305, 8976, -500839, -80510, -23670, -131731, 22570, -10879, -195255, 15693, -68706, -294360, 78919, -6339, -89055, 241161, 95656, -28181, 130869, -152176, 8825, -129340, -254409, 13609, 234115, 288401, 80528, -209395, -432268, -4230, -53525, -81846, -124200, -415354, 148599, 32917, -222738, -150528, -227460, 20744, -207355, -192255, 339116, -247956, -22466, 38631, -236176, -69267, 196663, -193290, -20787, -164145, 157939, 162644, 128095, 5579, -1485, 112962, -158333, 91269, -271624, 43132, -39104, -129640, -64195, -93230, -51461, -88378]
15401h8378A07953a12538a8476k19270a09651r6676B99574E7009a74901A39580
15390c38167a19070A01736J82696J6656C6151b78768I5510J3647k4562l2341h7970
15378c7520k45440R7692F5339e5423I6101a99225f4412l131k0482R311B21496
15366A10906Q0101a24637d1354p3937m9878l8153E1573A077R5382a46259e5168
15354i3851j15402L8917J0301B60046A12108D8070a07172n6622F7b0419j20958
15343a41377g851r8139J6064A4196a70078n1740G5809b20472A69896a40499k24264
15332c64763C12148j1204a0032o3048m9243E7806k8690N1424p032e6748C82733
15320G6467h4851a4235B2423a0247C39691I7547P8316a35605B51562H5005K7455
$$ y = [-88378, 107953, -112538, -18476, -237746, -109651, -206327, 299574, 57009, -174901, 139580, -338167, -119070, 101736, 284432, 301088, 36151, -278768, 95510, 109157, 84595, 52254, -87970, -37520, -282960, -185268, 65339, -55423, 96101, -199225, -64412, -67543, -88025, -78714, 221496, 110906, 191007, -124637, -41354, -115291, -165169, -203322, 51573, 1077, 96459, -146259, -55168, -93851, -209253, -170336, -160035, 260046, 112108, 48070, -107172, -163794, 67, -20419, -141377, -7851, -105990, -89926, 14196, -170078, -221818, 75809, -220472, 169896, -140499, -364763, 312148, 300944, -10032, -73080, -122323, 57806, 29116, 80540, 73508, -56748, 382733, 76467, -84851, -14235, 22423, -10247, 339691, 97547, 175863, -135605, 251562, 85005, 112460]
15309A12460L52a60397C5087a19973D79998b64057D4265b351k48289D12371H8927
15297C31348b6652A39286M3417C3807K2093a28131e8759N405C0068J20666B0159
15285c2233A94144e3196N14B15676b205j19875K9981E20481A58403a60455b8423
15273a2212C2807J46392p465L3438f1904B31276a22993D29081H7961a83315B16872
15261B20320E3165f3608A8626K23299M8367h9423A2385Q6205J55641C8098K62638
15250C00736A19479O87259M92540j66782M0364k38846l50597A18086h744C54391
15239a03460B67257o6867a98660B27116G2151J57326l9612p2344J08923f5056
15228a84665a4527B86407B349M4332h6128B00953I3267b33078L2087A52987a39029
$$ y = [112460, 112812, -160397, 35087, -119973, 479998, -264057, 44265, -2351, -250640, 412371, 88927, 331348, -26652, 139286, 182703, 33807, 55900, -128131, -58759, -53354, 30068, 150734, 20159, -32233, 194144, -53196, -52682, 215676, -2205, -122080, -92099, 520481, 158403, -160455, -28423, -12212, 32807, 179199, 171734, 205172, -61904, 231276, -122993, 429081, 87961, -183315, 216872, 220320, 53165, -63608, 18626, 241925, 290292, -89423, 12385, 98590, 254231, 38098, 300736, 119479, 806738, 1299278, 1132496, 1172860, 934014, 583417, 118086, -8744, 354391, -103460, 267257, 200390, -198660, 227116, 72151, 229477, 189865, 117521, 226444, -65056, -184665, -14527, 286407, 2349, 46681, -86128, 200953, 93267, -233078, -200991, 152987, -139029]
15216a8824E7235J59908b18569A55081b71885J10149B61181d9569C33139H7749
15205a8615B85859D742O3270I947c9286q9113C19008j50312J3285a46150c2674
15193A52805a19032j31538J00088k9165C4286J45623L1238a00615L7364B33527
15182E8920a51682O8481f749A1784O2219C3578P4113L82603I4890N8580m2230
15171A11240J25511C7713O496L690L00610p1653j18775O5791G3570J34696h6600
15159I9402A0020L68655e9746K0732A13654g1090Q446D0664A4629f1j73511B3905
15146E04443A94424a31888D1875J38956A2615J26344a59380A12032A5866P1227
15136H7093L29432e9581A90377A2232O7579k7028J83388J34560j40426j4668G9991
$$ y = [-18824, 57235, 217143, -218569, 155081, -271885, -161736, 261181, -49569, 333139, 87749, -18615, 285859, 4742, 68012, 9947, -39286, -128399, 319008, 168696, 181981, -146150, -32674, 152805, -119032, -250570, -150482, -179647, 34286, 179909, 211147, -100615, -63251, 233527, 58920, -151682, -83201, -6749, 11784, 74003, 33578, 107691, 490294, 94890, 153470, 111240, 236751, 37713, 44209, 47899, 348509, 276856, 158081, 223872, 73570, 208266, -86600, 99402, 10020, 378675, -59746, -39014, 113654, -71090, -62644, 40664, 14629, -61, -173572, 23905, 504443, 194424, -131888, 41875, 180831, 12615, 138959, -159380, 112032, 15866, 87093, 416525, -59581, 190377, 12232, 79811, 52783, 236171, 370731, 230305, 215637, 79991]
15124H0552c6259A88915K01820A11925a30974D64637A21838A540K19939a47694
15113B72072H6052J41624a51824B21946D9830e0687A79103l2012J87471a42881
15102A82436J9466a30553C05707e6930K1037A90443J33573a27083J7453D0643
15091B38025j091b8973A52710J85342j66059n721L1590n5563a44469A27681J4934
15080A42615D2122j7688M157a62821f2993B92009B9640M6174J36533j1150N8241
15069B59438J26013j86493n9591M2329L6134E1671R0769M0364J42514j38515J79953
15058C66756j73484b4960A73918B2329K00945C6698J62074K04788a3699A71024
15047B97224n0093c6224B14874F4971J94972K30987A38182K81992j97814L60496
$$ y = [80552, -36259, 188915, 390735, 111925, -130974, 464637, 121838, 1540, 221479, -147694, 272072, 86052, 227676, -151824, 221946, 49830, -50687, 179103, 147091, 334562, -142881, 182436, 201902, -130553, 305707, -56930, -35893, 190443, 324016, -127083, -109630, 40643, 238025, 236934, -28973, 152710, 338052, 171993, 166272, 197862, 142299, -144469, 127681, 142615, 42122, 24434, 28591, -162821, -62993, 292009, 29640, 75814, 212347, 201197, 259438, 385451, 198958, 139367, 181696, 217830, 51671, 142440, 182804, 325318, 186803, 366756, 193272, -24960, 173918, 22329, 223274, 36698, 198772, 403560, -13699, 171024, 297224, 247131, -36224, 214874, 64971, 259943, 490930, 138182, 420174, 222360, 582856]
15037E82856k33673B0955d4553C17534A51335k3436Q3542J9476C6005L08408j60876
15026A83537H1724J72046I3263L16624a3169E5502L09506K02555E4020K2186L8599
15015A14805b0847D27186A32301B9696K7180N8162M5737J28121I7956K35645m6920
15004B86681j33301l2576J15724M5737J07938e42173A43393L02476f2685C1007
14993A88942n9802J66429j47759M8320e6674D3978N5999c8289C08551a21112B61136
14981A11117L71838A66876N9157O2411R2655A29359L22146b07038C60049j74291
14971A85758k2127Q7133b20118C46923M403i6549A51930j2603B1191M49116N950
14960D76257j56746A17485i8683C613M02958P9243i849F09971a25439n7771H1860
$$ y = [582856, 349183, 20955, -44553, 317534, 151335, 127899, 211441, 230917, 36005, 344413, 183537, 81724, 253770, 93263, 409887, -13169, 55502, 365008, 567563, 54020, 76206, 114805, -20847, 427186, 132301, 29696, 56876, 115038, 160775, 288896, 97956, 333601, 286681, 153380, 120804, 236528, 282265, 390203, -542173, 143393, 445869, -62685, 31007, 188942, 129140, 295569, 147810, 196130, -56674, 43978, 99977, -38289, 308551, -121112, 261136, 111117, 482955, 166876, 226033, 288444, 381099, 129359, 451505, -207038, 360049, 185758, 163631, 250764, -220118, 346923, 351326, -96549, 151930, 139327, 21191, 470307, 476257, 319511, 117485, -98683, 3613, 406571, 485814, -9849, 609971, -125439, -183210, 81860]
14948B29963K5440E2999K31913R149K302f8294B05103L5041A00486J75058n2940
14937B22604p1386e6204B92394l8332A02834K84383K5446A99792J58409A62481
14926C36563J3410j17710J80592J27853B49434R7212q7792J16759N0181M1075
14916D66869o7122A82620K24488A44972J87103I5555K62917j804r6440k3681K77689
14905E14236A96227A7726K93693J29618A76430M07797j23418A31333Q6460J46821
14895C64614j00265N5719M26259l52469A17076K50433j11920K16272n5704m8060
14885C68097I6504M96463j89595J03617j05205A66241j0268K78487R161q4132
14875C59489j3232p8056p0817M76310j23387j48269A46198J2518J86511K17768
$$ y = [229963, 255403, 52999, 284912, 294061, 296363, -68294, 205103, 240144, 100486, 275544, 222604, 151218, -56204, 292394, 254062, 102834, 387217, 412663, 199792, 358201, 162481, 336563, 349973, 232263, 412855, 540708, 249434, 346646, 258854, 375613, 425794, 466869, 399747, 182620, 407108, 144972, 332075, 95555, 358472, 356668, 260228, 236547, 514236, 196227, 17726, 311419, 441037, 176430, 584227, 460809, 131333, 217793, 364614, 264349, 320068, 746327, 393858, 117076, 367509, 255589, 471861, 416157, 368097, 96504, 592967, 403372, 506989, 401784, 166241, 155973, 434460, 443621, 359489, 346257, 268201, 197384, 673694, 550307, 402038, 146198, 158716, 345227, 562995]
14865E62995O0428l06241J58135j32262K19678G4961L07738J0502j08628M21482
14855G06055j78160R0955n4746l627G0161M66928Q1429B07581O07205k36030k10754
14844C68002K35985r4682J33822C08868J6226J18744j01211L22175k58054J44861
14834E51609k56039N5157M20061C76661K22247o3230k30689M30701A87512L18210
14824E05722N5556n5540A83314L15071K3352j63615K10591B50885J10159n1239
14814C09805L82912j51737J16458C20594K67157C3403K76831L04702k35631P9344
14804D58649r4557J95178m9597K50092k66792J23994M6303L77637m93271k21045
14794C26591J89645j49030l3773K88450m5691k27632j5013l6266m3570L30515
$$ y = [562995, 623423, 317182, 475317, 343055, 562733, 74961, 382699, 393201, 284573, 706055, 527895, 618850, 564104, 560477, 70161, 537089, 618518, 207581, 814786, 578756, 368002, 603987, 509305, 643127, 308868, 325094, 443838, 342627, 664802, 406748, 551609, 295570, 350727, 770788, 376661, 598908, 535678, 304989, 735690, 187512, 505722, 561278, 505738, 183314, 498385, 521737, 358122, 568713, 250885, 361044, 309805, 692717, 540980, 657438, 320594, 587751, 33403, 310234, 614936, 379305, 458649, 364092, 559270, 509673, 759765, 492973, 616967, 663270, 1040907, 547636, 326591, 516236, 367206, 333433, 621883, 576192, 348560, 333547, 297281, 253711, 584226]
14784E84226j12284j66171r429J63968K806r0189K91598l09210M77845N5957m4140
14773H44977k57346q5344K13035A09998M00844K22956N243L5957k63894L32821
14763H43925k21029j73744K27910Q3807k94395L44579k51824N08069D54740J11224
14753E65964J42778R2423N5607D05398M99322l21805N8736N2400k86366K28990
14743F36675J61102j41507J98637k19611r3346J39755K92614N752j92567j41248
14733F46256j3923J62087L27927j90270L7498J6504j81539K58274l36275J83903
14723I10442m3857j79058J91513l9110o2022j6153m3052n2073K89175l90691L12142
14712H77256L8157k03510K10475l48826M56478j5455K53601j90069k34981m6435
$$ y = [584226, 471942, 305771, 296342, 460310, 463116, 372927, 664525, 355315, 833160, 889117, 844977, 587631, 502287, 715322, 109998, 510842, 733798, 739041, 774998, 511104, 843925, 622896, 449152, 677062, 760869, 466474, 811053, 559229, 1067298, 454740, 565964, 708742, 801165, 856772, 405398, 904720, 582915, 641651, 694051, 407685, 636675, 797777, 656270, 854907, 635296, 541950, 681705, 974319, 980071, 787504, 646256, 632333, 794420, 1122347, 932077, 969575, 986079, 804540, 1062814, 726539, 910442, 866585, 687527, 879040, 839930, 777908, 761755, 718703, 666630, 955805, 565114, 877256, 915413, 711903, 922378, 573552, 1030030, 1014575, 1268176, 1078107, 843126, 796691]
14702G96691Q9134K4482q5975J8414L9531j24379J02847j97759l615M51251l19260
14691G91362K02969q1621j53623j80566M12017l554K66959l92648R1511j09888
14681H42918L57398k50832p7779L3438K75308k31747K8727o7270L01105Q177l35087
14670H84356P9323K83025q9436k87142J49627j95607K95123K63598m64763L74781
14660A292885r1070J61572k48241n7367L7836J07362N4924j24181q316K95882
14650A421286j99838J25792k87402L54177J10163k33514L50418m84429J10410
14641A267063J08314j85485J67416Q9318J79793k59545K6249J30825j59560J03259
14631A467647k6340k56486L64404N836J07849k45225j18434q8691K56492l4097
$$ y = [796691, 885825, 910307, 824332, 842746, 882277, 757898, 860745, 662986, 659371, 1110622, 791362, 994331, 912710, 759087, 578521, 990538, 986984, 1253943, 861295, 952806, 842918, 1200316, 949484, 871705, 905143, 1180451, 948704, 977431, 910161, 1211266, 1219443, 884356, 963679, 1246704, 1157268, 870126, 1019753, 824146, 1119269, 1382867, 918104, 1292885, 1201815, 1363387, 1115146, 1057779, 1095615, 1202977, 1257901, 1133720, 1125404, 1421286, 1221448, 1347240, 1059838, 1414015, 1524178, 1290664, 1641082, 1156653, 1267063, 1375377, 1189892, 1357308, 1446626, 1626419, 1366874, 1393123, 1523948, 1364388, 1467647, 1441307, 1184821, 1549225, 1555061, 1662910, 1417685, 1299251, 1210560, 1467052, 1432955]
14621A432955L7667O7132r9807J94626n0566j5371j43411j0446K4121J5021l00139
14610A151782L82048p201P0868K40197l99580K73140j57668K85580j25439j78876
14600A534851M14081l60963J46533r8267q5466K55838j84363M08367j00265k16898
14590A713448R8008J26630j93723L27327n26897N79634k55358L69903r0986K3684
14580B171670o6807j09887J90222j29875J4085K75967k80979J25520K22421m02012
14570B010325L23577q2676M5420K09732P8270m70522N56940l94152K73615J70506
14560B721035p5605j48313L39263j66768N55753j87559N05920R6667L46895M06370
14550D393658J454896J458124M232546Q793536J8073125P066024k2282164A0579896
$$ y = [1432955, 1470622, 1537754, 1437947, 1632573, 1582007, 1566636, 1423225, 1412779, 1436900, 1451921, 1151782, 1533830, 1526629, 1597497, 1837694, 1438114, 1711254, 1553586, 1839166, 1713727, 1534851, 1948932, 1587969, 1734502, 1636235, 1550769, 1806607, 1622244, 2030611, 1930346, 1713448, 1811456, 1938086, 1744363, 2071690, 1544793, 2124427, 1869069, 2238972, 2147986, 2171670, 2104863, 1994976, 2185198, 2055323, 2069408, 2345375, 2064396, 2189916, 2412337, 2010325, 2333902, 2251226, 2296646, 2506378, 2584648, 2114126, 2671066, 2276914, 2550529, 2721035, 2645430, 2497117, 2836380, 2669612, 3225365, 3037806, 3543726, 3640393, 3987288, 4393658, 5848554, 7306678, 11539224, 20332760, 38405885, 45471909, 23189745, 10579896]
14541E063591k068212n78537l28969K00503r7600j10321j04819K39389q7372j56394
14531A971259J8609M31653j73664O46991l91825k51323J61743J38188l736r7023
14521B450872K18696k29648J28967m53138M01598j0658m6653L87601j51431L82024
14511C078230j46785P8666l4601J36157R3310j71251P3016k2556N3420J34136
14501C271742j64009L90559k66019k7629J13466j66572L52934K21124m23114K38610
14491C541092M7227P5726J03768q4039N8258o5509R5786J68635k23536M52590
14481D169998l61327K78181j18287R5353k10799L51293P2553K43501k6975L20545
14471D814036k99623L1379J19400J7069j50750N7600Q4210J83117L2132j2452
$$ y = [5063591, 2995379, 2416842, 2087873, 2288376, 2190776, 2080455, 1975636, 2215025, 2127653, 1971259, 1989868, 2421521, 2247857, 2894848, 2503023, 2251700, 2413443, 2551631, 2547895, 2450872, 2669568, 2439920, 2568887, 2115749, 2517347, 2506689, 2460036, 2847637, 2696206, 3078230, 2931445, 3010111, 2975510, 3111667, 3204977, 3033726, 3106742, 3084186, 3137606, 3271742, 3107733, 3498292, 3232273, 3204644, 3318110, 3151538, 3504472, 3725596, 3302482, 3541092, 3588319, 3664045, 3767813, 3683774, 3742032, 3676523, 3772309, 3940944, 3717408, 4169998, 3808671, 4086852, 3968565, 4063918, 3853119, 4204412, 4276965, 4520466, 4493491, 4814036, 4514413, 4545792, 4665192, 4682261, 4531511, 4589111, 4673321, 4856438, 4888570, 4876118]
14461D876118l1874K7594N14562l80198n4024L63960j13902m0560Q5071K65066
14451E511813j71160J21135M34859k18102N3678K65923j0114j03287M5019J57519
14441F087283J72791L0167J49977j91295n0663M76603j31544L85782l87043K25204
14431F767262O55690k62184R1164J44087K18943j52434O1461L36381j18142J16538
14421G858766J56301K52329N5521j634j6730O83498n09949M47059j30197K83363
14411I078327M04819l47023K17146J99518M8563K60049R9483M84384j84984K60397
14401A0520679M2046K59134J73344J36132K40577p1307L50281K26665J83766J76698
14391A2238015M11902M69203j40914k09014Q08316J93857J1350L56575L63711
$$ y = [4876118, 4844244, 4871838, 5386400, 5006202, 4952178, 5316138, 5202236, 5161676, 5246747, 5511813, 5340653, 5461788, 5896647, 5678545, 5732223, 5998146, 5988032, 5884745, 5929764, 6087283, 6260074, 6290241, 6440218, 6248923, 6198260, 6674863, 6543319, 6929101, 6542058, 6767262, 7422952, 7160768, 7251932, 7396019, 7614962, 7462528, 7523989, 7860370, 7742228, 7858766, 8015067, 8267396, 8322917, 8321283, 8304553, 8988051, 8478102, 8925161, 8794964, 9078327, 9483146, 9136123, 9353269, 9552787, 9601350, 9861399, 9960882, 10445266, 10260282, 10520679, 10562725, 10821859, 10995203, 11131335, 11371912, 11300605, 11650886, 11877551, 12061317, 12238015, 12649917, 13119120, 12978206, 12769192, 13577508, 13771365, 13782715, 14139290, 14503001]
14382A4503001J87560M67663r332K07805L76734L38230K99369K4908K17445P85138
14372A7398521j05977N93711L57289O27722M27880K73739J45432M40929L93208
14363B0552454M63408P6663P37418O11002K20292Q22359M14996M46106N00435
14354B4845133Q62331J48782J041917M32196N24521Q08411O35616R61832P09958
14345C0970697K86570J145365P68309P38668J305566P81380Q53443J133326Q66610
14336C8849934J306668J099684J096161J224122J474446R05627J856670J404383
14328D9217695J110365J821755J693642J504171K169936J845485K171594J686433
14320F3221076K551814K509965J899547K840848K755691K661539K961886K797003
$$ y = [14503001, 14690561, 15158224, 15148892, 15356697, 15733431, 16071661, 16371030, 16395938, 16613383, 17398521, 17292544, 17886255, 18243544, 18871266, 19299146, 19572885, 19718317, 20159246, 20552454, 21015862, 21092525, 21829943, 22440945, 22661237, 23483596, 23898592, 24344698, 24845133, 25707464, 25856246, 26898163, 27330359, 27854880, 28663291, 29298907, 30260739, 30970697, 31257267, 32402632, 33170941, 33909609, 35215175, 35996555, 36849998, 37983324, 38849934, 40156602, 41256286, 42352447, 43576569, 45051015, 45956642, 47813312, 49217695, 50328060, 52149815, 53843457, 55347628, 57517564, 59363049, 61534643, 63221076, 65772890, 68282855, 70182402, 73023250, 75778941, 78440480, 81402366, 84199369]
14312H4199369L769185L215709M066844L705600L934570M599421M337816M905685
14304A16734199N152667N338639N429879O160178O603060O400803P288666P357069
14296A66465160Q080594Q432012R010875R304939R688442J0838948J0829681J1555020
14288B44205671J2002330J2356540J3430764J3147289J3784461J4176486J4091551
14281C37195092J4688972J3952801J4099926J3367015J3109104J1925912J0670224
14274D29009046R509505O807542L035299J283787J202838J481419l235648k974395
14266D46119393k821790n957848q545149j0051643j1870089j2691621j4132159
14259C80049094j4373363j4868112j4977666j4315395j3872508j4050746j3866255
$$ y = [84199369, 87968554, 91184263, 95251107, 98956707, 102891277, 107490698, 111828514, 116734199, 121886866, 127225505, 132655384, 138815562, 145418622, 151819425, 159108091, 166465160, 174545754, 182977766, 191988641, 201293580, 210982022, 221820970, 232650651, 244205671, 256208001, 268564541, 281995305, 295142594, 308927055, 323103541, 337195092, 351884064, 365836865, 379936791, 393303806, 406412910, 418338822, 429009046, 438518551, 445326093, 448361392, 449645179, 450848017, 452329436, 449093788, 446119393, 443297603, 437339755, 428794606, 418742963, 406872874, 394181253, 380049094, 365675731, 350807619, 335829953, 321514558, 307642050, 293591304, 279725049]
14252B79725049j2866663j2845289j2435751j1257134j1537241j0074398r754131
14245A98954442r601274q594514q338009q167691p476470o996404o842920o069565
14237A36867595n756898n507753n679766m957624n121999m137088l596934m377988
14229I7731545l929501l836968l531058l358059l066640k794292k763150k342391
14221G2109486k701869k157152k537818j995006k200576j945921j701964j676409
14213E5192771j327991j740590j907712j542277j464674j575598m52160j780176
14205D3401593r05168j188033j542367r29486q20000q27965j369126q01713j249599
14196C3768136n05682j152418j59119j248962p52603n58615r43236k53326o78873
$$ y = [279725049, 266858386, 254013097, 241577346, 230320212, 218782971, 208708573, 198954442, 189353168, 180758654, 172420645, 164252954, 156776484, 149780080, 142937160, 136867595, 131110697, 125602944, 119923178, 114965554, 109843555, 105706467, 102109533, 97731545, 93802044, 89965076, 86434018, 83075959, 80009319, 77215027, 74451877, 72109486, 69407617, 67250465, 64712647, 62717641, 60517065, 58571144, 56869180, 55192771, 53864780, 52124190, 50216478, 48674201, 47209527, 45633929, 45181769, 43401593, 42496425, 41308392, 39766025, 38836539, 38016539, 37188574, 35819448, 35017735, 33768136, 33262454, 32110036, 31950917, 30701955, 29949352, 29390737, 28447501, 28194175, 27515302]
14187B7515302q79863n39404o65131l91362q44971n02665m18800l14872o77528
14178B2280706k22891j036243p0958k59322m35580n30587l29307o2370p22925
14169A8610523l49146m20921j00669n84972k50727l71356j38564j96345n21582
14160A5676241p8965p58509J00157l91099k52300l98649O4419m09429l07002k48667
14150A2996197j33053k67645l8604m52342J23661k38013j07519m43644N2097l66415
14140A1124720O5144k7113o33998l5805l28504K29757j46113k88751l45920J2812
14130I626229n62283K45544l02020K31988m01866O4359p0608j94153l49370J37547
14120H425367j23298l16543J78966j85111k46802J57041k34480j71126K56589
$$ y = [27515302, 26635439, 26096035, 25430904, 25039542, 24194571, 23691906, 23273106, 22958234, 22280706, 22057815, 21021572, 20950614, 20691292, 20255712, 19725125, 19395818, 19333448, 18610523, 18261377, 17840456, 17739787, 17154815, 16904088, 16532732, 16394168, 16197823, 15676241, 15597276, 14838767, 14938924, 14547825, 14295525, 13896876, 13961295, 13551866, 13244864, 12996197, 12863144, 12595499, 12556895, 12104553, 12228214, 11990201, 11882682, 11439038, 11491135, 11124720, 11189864, 11162751, 10528753, 10492948, 10164444, 10394201, 10248088, 9959337, 9613417, 9626229, 9063946, 9309490, 9007470, 9239458, 8837592, 8901951, 8831343, 8637190, 8287820, 8425367, 8302069, 7985526, 8164492, 7979381, 7732579, 7889620, 7655140, 7484014, 7740603]
14111G740603m03451j57014p2333j08916p3161l8790n6393O5655n67728O01696
14101F930168l26841l39419l395j56034J49306j32786M51283p72519L95840m27977
14091E767626J01896J57636l35202j75425n3197K55298j98759k03704o3035k11901
14081E041233K10198l97028M62440o22330J22880L7054K4807o9285j96037Q5565
14071D699497j47326Q9724l28683L30687l1197O6369k22096j20224M2439j19635
14061D259555N9945j0002J38214j08391j43348N0385n27416q6125M43851l25371
14051C751297j83109R5987r5121j0577J2280Q6857L4439j18318l20156J83205
14041C436784J38188k44713L10456m16618N7061O3838j75688j46770J7596J90770
$$ y = [7740603, 7337152, 7180138, 7107805, 6998889, 6925728, 6886938, 6830545, 6896200, 6328472, 6930168, 6603327, 6263908, 6260513, 6104479, 6253785, 6120999, 6572282, 5799763, 6195603, 5767626, 5869522, 6027158, 5691956, 5516531, 5463334, 5718632, 5519873, 5316169, 5253134, 5041233, 5251431, 4854403, 5316843, 4694513, 4817393, 4854447, 4879254, 4809969, 4613932, 4699497, 4552171, 4641895, 4313212, 4643899, 4612702, 4679071, 4456975, 4336751, 4379190, 4259555, 4319500, 4309498, 4447712, 4339321, 4195973, 4246358, 3718942, 3632817, 4076668, 3751297, 3568188, 3664175, 3569054, 3558477, 3570757, 3657614, 3692053, 3573735, 3253579, 3436784, 3574972, 3330259, 3640715, 3224097, 3281158, 3344996, 3169308, 3022538, 3040134, 3230904]
14031C230904M0126j25594L53587l34680o7978j79510J53028j29065R8745J14676
14021C154239j64447J8427q706k57831J26064k90923J93242k32365J09927j46215
14011B501412j41975L67030k88316J38185J25818l82503L39068m29938L83976
14002B612757k6239o9314k97195J31905j38186Q9806j8258m06366J63107J92695
13992B234712K28890K41433J19011P30529K925869O211392J7316681J6061873
13984D6070390j7498121j3017645o268788k700703j408092p00514n05720m39495
13976C531312l15476l3692k88009K05296j33585n7722j34771j04723R4585l4432
13966B728783m24464K28308K33968m28390J4577k03134K66533J43695l43976L0914
$$ y = [3230904, 3271030, 3145436, 3499023, 3164343, 3096365, 2916855, 3069883, 2940818, 3039563, 3154239, 2989792, 3008219, 2999513, 2741682, 2867746, 2576823, 2770065, 2537700, 2647627, 2501412, 2359437, 2726467, 2438151, 2576336, 2702154, 2319651, 2658719, 2228781, 2612757, 2586518, 2517204, 2220009, 2351914, 2213728, 2303534, 2285276, 1878910, 2042017, 2234712, 2463602, 2705035, 2824046, 3554575, 6480444, 12691836, 30008517, 46070390, 28572269, 15554624, 9285836, 6585133, 5177041, 4476527, 3970807, 3531312, 3215836, 3182144, 2894135, 3099431, 2965846, 2908124, 2773353, 2668630, 2763215, 2728783, 2304319, 2532627, 2766595, 2338205, 2352782, 2149648, 2416181, 2559876, 2215900, 2246814]
13956B246814k72232J2196K00573p5694L15194o01348L72459k25204J4654k71251
13946A716161P5651j11905k6821K01359L09448J47555n48850K49529Q5038j2200
13936B084965j09573k1315k01472K30126r3283k52253n4416o7704M14361k09972
13926A719464j74419J25299J87745o8934j4690k59896L01451k01018K61452k79930
13916A596524N1018Q6350o6724j27643j34154L30842l28733r0852K13683j55643
13906A374668J01115Q0396j89839J08307j76948K47143j13948J18907q5994j59019
13896A304788L29832n73962L40769J22270j62014j62977L98216k87220J11443
13887A421145k50589K48479J36730l08161K1054J464j3852K04132o7906R1908
$$ y = [2246814, 1974582, 1986778, 2187351, 2111657, 2426851, 1825503, 2197962, 1972758, 1987412, 1716161, 1791812, 1679907, 1653086, 1854445, 2163893, 2311448, 1762598, 2012127, 2097165, 2084965, 1975392, 1954077, 1752605, 1982731, 1889448, 1637195, 1582779, 1515075, 1929436, 1719464, 1545045, 1670344, 1858089, 1789155, 1774465, 1514569, 1816020, 1615002, 1876454, 1596524, 1647542, 1733892, 1667168, 1539525, 1405371, 1736213, 1407480, 1316628, 1530311, 1374668, 1475783, 1556179, 1366340, 1474647, 1297699, 1544842, 1430894, 1549801, 1463807, 1304788, 1634620, 1060658, 1401427, 1523697, 1361683, 1198706, 1596922, 1309702, 1421145, 1170556, 1419035, 1555765, 1247604, 1268658, 1270122, 1256270, 1460402, 1392496, 1484404]
13877A484404R0000n09225j5021K34261k17739J0019k27984L32209J96632l34959
13867A042597K10558Q3965l66052K6279k11951N60228j76641j38722j64838J87840
13857A053263J00498K45226k07972J23734m6238k99193J44328O9820m1295k64335
13847H77836K09245j4332K85959l51290k92185J58505J47342J7808j88940L14861
13837A164809m70294Q7456K18294p1069q8190M50732l33240J53935L09829n96204
13827H26058m0360P14322p15416Q4599l8952n2368J63172j36120J81032k69519
13817G16448J12324K96294k60655p0300K5046K40694j76046O2862p9072K67490
13807A135085l46429J17827j33584Q9178J52183k86282K1114J45201n945j3014
$$ y = [1484404, 1574404, 1065179, 1050158, 1284419, 1066680, 1076699, 848715, 1180924, 1377556, 1042597, 1253155, 1337120, 971068, 997347, 785396, 1345624, 1168983, 1030261, 865423, 1053263, 1153761, 1398987, 1191015, 1314749, 1268511, 969318, 1113646, 1183466, 1142171, 877836, 1087081, 1072749, 1358708, 1007418, 715233, 873738, 1021080, 1038888, 849948, 1164809, 694515, 781971, 1000265, 929196, 841006, 1291738, 958498, 1112433, 1422262, 826058, 785698, 1500020, 784604, 869203, 830251, 777883, 941055, 804935, 985967, 716448, 828772, 1125066, 864411, 794111, 819157, 1059851, 883805, 946667, 867595, 1135085, 788656, 906483, 772899, 862077, 1014260, 727978, 749092, 894293, 888348, 875334]
13797H75334k28619k41697M79835m2940J6742j41137K05479j49476J47731l26786
13787E94466j8167J00247K16697j60975L62514r6968l05596o1566Q4742j16846
13777E98548J82253k09702K27786J15832j63091C74798N30751j55155j7857L4821
13767G67358k24243J0440J90964K81067D97901K16080k06001L29107j78101o2344
13757E96642J32773J32200q5978B78708M95997J03001j30521Q8293C86933J85652
13747E72585J31748J72768j84095J93924l69116K8364K25954o4482o7514O6995
13737G07131k29454O7420j59793J03801j3897K2240k7265J73188J08502j04086
13727F47787P8679B86762K82081j42255J70459l4050j22925J32851l478P1287
$$ y = [875334, 646715, 405018, 884853, 841913, 858655, 717518, 922997, 773521, 921252, 594466, 576299, 676546, 893243, 732268, 1094782, 997814, 692218, 630652, 715394, 598548, 780801, 571099, 798885, 914717, 751626, 374798, 905549, 750394, 732537, 767358, 543115, 553555, 744519, 1025586, 497901, 713981, 507980, 837087, 658986, 596642, 729415, 861615, 775637, 278708, 774705, 877706, 747185, 835478, 386933, 572585, 704333, 877101, 693006, 886930, 517814, 546178, 772132, 707650, 640136, 707131, 477677, 545097, 385304, 489105, 475208, 497448, 470183, 643371, 751873, 647787, 726466, 286762, 568843, 426588, 597047, 562997, 440072, 572923, 569445, 640732]
13717F40732k62094K18843j09125L77905k82593J8493A96849N58260j56737j70456
13707D27916J19421J28065k89780O8078A93778M15664J42963j73998j1276p5715
13697D91416r2020L71071l30259K07879p9843K16576C61037n9163J17168K1896
13687D40938j38586J04710L13495j42901k25283J33033k8761J36861o5627O9131
13677E97010J53761m8636r4738k08264J68965K2817M5987j66180M52918j22711
13667H00929j60193B33351J73155l5333K70725k14921A36412N71476k21916j50899
13657C35073P7612A6378K52171K94204j62112N2148B12665M08388k1126A79657
13646D64626j32344j28920J69826L52401j74979O8362k2404k55271K74384k14840
$$ y = [640732, 378638, 597481, 488356, 866261, 583668, 602161, 196849, 755109, 598372, 427916, 547337, 675402, 385622, 453700, 193778, 609442, 752405, 578407, 567131, 491416, 399396, 770467, 440208, 648087, 568244, 784820, 361037, 301874, 419042, 440938, 302352, 407062, 720557, 577656, 352373, 485406, 456645, 593506, 527879, 597010, 750771, 702135, 607397, 399133, 568098, 590915, 636902, 470722, 923640, 800929, 640736, 233351, 406506, 371173, 641898, 426977, 136412, 707888, 485972, 335073, 412685, 16378, 268549, 562753, 400641, 452789, 212665, 621053, 599927, 179657, 464626, 332282, 203362, 373188, 725589, 550610, 618972, 596568, 341297, 615681, 400841]
13636D00841J32430K789q1981C8741L64652L5899A76907M15200k23979J44252
13626E12380k0219j00498m2396N1601J65424o5513k01668J45851j43852J1699
13616C12809J01617R164A77450K08595j54740J56558m5464n6400L80813k84685
13606C82127A70782K3551K04609A76033N11635k62302o8559Q5993p6210M40636
13596H07226l43848j84332L92513A39342K68958n9927o3002K07777A57485L6058
13586A93543H2009K00370q0880M44995j93921q8005J17213j84554M44536l58517
13576C83246j33017K20742E5876k4975K13522K87949p3579j92777J3837A15874
13565C18526K27934A27745J61101o3110L69493k64259r2904Q3380n1701L62133
$$ y = [400841, 533271, 536060, 454079, 38741, 403393, 439292, 176907, 592107, 368128, 512380, 492161, 391663, 349267, 400868, 566292, 500779, 299111, 444962, 301110, 312809, 414426, 423590, 177450, 386045, 231305, 387863, 342399, 285999, 666812, 382127, 170782, 194333, 398942, 176033, 687668, 425366, 356807, 442800, 366590, 807226, 463378, 279046, 671559, 139342, 408300, 348373, 285371, 493148, 157485, 193543, 82009, 282379, 201499, 646494, 452573, 364568, 481781, 297227, 741763, 383246, 250229, 470971, 55876, 30901, 244423, 532372, 458793, 266016, 279853, 115874, 318526, 546460, 127745, 288846, 225736, 595229, 330970, 238066, 321446, 269745, 631878]
13555F31878A39650J22163H0124J76730J46389J65485j48511L6839H6205K49048
13545C35253K0074K08009n3883M0922B29914I7355J35354m9074K0709M3996J36413
13534C84753j6219l6742D6173J21855K42920K694A53765J85500j23392D7702O02686
13523F50388l02699F7163K13100J18107N1491K67223H3346K35584P331c3012C11814
13511E73256A93566L13148G5351J91889J57441B01044q4348M99941j68995j76133
13501B71509R3326j55581K69715A53490J76179J3402M8708M14757B94782R4626
13491C89408l3153j31112C3470J60247K25355j7247j36247C2776L07516A55501
13480C33091F2016L48541j69455B614L80405j70905J20509d5822D17425j42419
$$ y = [631878, 139650, 261813, 80124, 256854, 403243, 568728, 420217, 457056, 86205, 335253, 355327, 563336, 509453, 550375, 229914, 97355, 232709, 183635, 204344, 248340, 384753, 368534, 331792, 46173, 168028, 410948, 413642, 153765, 339265, 215873, 47702, 650388, 347689, 67163, 280263, 398370, 449861, 717084, 83346, 318930, 326261, -33012, 311814, 573256, 193566, 506714, 75351, 267240, 424681, 201044, 116696, 616637, 447642, 271509, 364835, 209254, 478969, 153490, 329669, 343071, 391779, 806536, 294782, 389408, 356255, 225143, 33470, 193717, 419072, 401825, 265578, 32776, 340292, 155501, 333091, 62016, 410557, 241102, 2614, 383019, 212114, 332623, -45822, 417425, 275006]
13470B75006j0535K6010Q166o1252K45623j38251j37453J23540j47244q1614O4111
13459A66107J00827K02303Q5181k59976J4306F0322N7434O0055N3967M5541K968
13448B80287O7080A46571F9075O5957a3077A12328J68750k8379J29095A51689
13437G2959J58133p2712L5876J31299M812a02866G5544L85717A40399j2469K20506
13426C48436c3214C7832K18598K18816K2206I1914J43536a4244G6682k3185a5804
13414C44001H1070M05875k19506k4529J13146E6608N4474J27242Q4643k290j23757
13403A96920n3091m1310N9536b3056B38124K49137j41446A56783J70477o492b30362
13391A06389b2310I0544K8282L21272D0052J57832n2948m5008J33175m9175Q9700
$$ y = [275006, 264471, 290481, 298647, 237395, 483018, 344767, 207314, 330854, 183610, 101996, 166107, 266934, 469237, 554418, 294442, 308748, 60322, 117756, 177811, 231778, 277319, 280287, 347367, 146571, 69075, 135032, -13077, 112328, 281078, 252699, 381794, 151689, 72959, 231092, 158380, 194256, 325555, 330367, -102866, 75544, 461261, 140399, 127930, 348436, -33214, 37832, 256430, 475246, 497452, 91914, 235450, -14244, 76682, 53497, -15804, 344001, 81070, 486945, 267439, 242910, 356056, 56608, 111082, 238324, 322967, 320677, 196920, 143829, 102519, 162055, -23056, 238124, 487261, 345815, 156783, 327260, 320768, -230362, 106389, -22310, 90544, 118826, 440098, 40052, 197884, 144936, 99928, 233103, 183928, 273628]
13380B73628a33018A60224o433D8447N43K02635D4708P8039J15584M0872k7726
13369B51477L2914i18C07121I6080K44127l3049R9367m7407j48659K03874A89071
13357D5493P8145J74503r1603G4305J84609k2727J63093q2381o6131J60232j44959
13346B66041J27371j73083K21933j38945E3130K45861K78857E8998L53619i556
13335A34536M18303A17149J29122o3879F3995J49701C4594K47706A2715L77947
13325C90662A68028J8385H3964k582L10890E1277K20088P4397A11358J61657d3734
13313B48171p0712c6350A41129Q4373B6614O3347i1772G7947K05163q9503K8779
13302B22386L4868a52405A96543a44493B59610M1875A14116D8635A1283b8598
$$ y = [273628, -133018, 160224, 153791, 48447, 48990, 251625, 44708, 122747, 238331, 279203, 251477, 284391, -918, 307121, 96080, 340207, 307158, 406525, 359118, 210459, 414333, 189071, 45493, 123638, 298141, 206538, 74305, 258914, 236187, 399280, 316899, 250768, 411000, 266041, 393412, 220329, 442262, 303317, 53130, 298991, 577848, 58998, 412617, -9556, 134536, 552839, 117149, 246271, 182392, 63995, 213696, 34594, 282300, 12715, 390662, 168028, 186413, 83964, 81382, 392272, 51277, 271365, 345762, 111358, 273015, -43734, 248171, 177459, -36350, 141129, 225502, 26614, 89961, -91772, 77947, 283110, 193607, 222386, 257254, -152405, 196543, -144493, 259610, 301485, 114116, 48635, 11283, -28598]
13291D45898A24039K66113R8210B07958i6851G1843K13650M3566o0438N4958A350
13279b50077i4105A7509K23079m4014a07431d1043C6591J26713K0456e7887b2908
13267A72412l1665i1055A14072b2690A46756m1612N0247E5124K03793m3503p6288
13256A39126K00826D2808K95949A01946j5773J00663G8715b30975j5085e2282
13245a60343F8320a4498l1165B35922J46895D6234a1158D80736A848J45786K12071
13234C59705K09173A69831c6224k66570a9223B20373g8928E2969R9591L24763
13224D77323i0020F4548B1559J90049H274J76604C9008n190J29856G2506k2613
13213D9893N2521k0501K63561b5405A5230b1665B29156i9392C47341A4114b476
$$ y = [445898, 124039, 390152, 488362, 207958, -96851, 71843, 285493, 329059, 268621, 323579, 1350, -250077, -94105, 17509, 240588, 196574, -107431, -41043, 36591, 163304, 183760, -57887, -22908, 172412, 140747, -91055, 114072, -22690, 146756, 105144, 155391, 55124, 258917, 215414, 139126, 339952, 42808, 338757, 101946, 86173, 186836, 78715, -230975, -246060, -52282, -160343, 68320, -14498, -45663, 235922, 382817, 46234, -11158, 480736, 1848, 147634, 359705, 568878, 169831, -36224, -302794, -19223, 220373, -78928, 52969, 152560, 477323, -90020, 64548, 21559, 211608, 8274, 184878, 39008, 33818, 163674, 72506, 49893, 102414, 81913, 345474, -25405, 15230, -21665, 229156, -99392, 347341, 14114, -2476]
13201B79364J5468n7044G6551K46824b70186C87772a93167A19002g8268B83761
13190C03546e0064A24107a7984D75565f2773B19182l4902O2996J16949j4984m9347
13179B99894a09010A45294K9443q5132l9090P1474K14497A22501j2929C3608a9015
13167E675a61072L5646F9362J48239m8928l6438l9164O4352B656M91339B12677
13155A67314k5205J87191F2006f2443A74926b01824Q800B76632M17502A909N5096
13144E7005j795j7148C759N4331N2640l4906J69418c44242H0988M7818l6971J8811
13132A10646g5456D50024A42559l0499K42853A61064J32470d2680B45879g596
13121h1248A83070q2173B8692b3618A67665p1861l5525J32495K5921m4320D3388
$$ y = [279364, 294832, 237788, 76551, 323375, -270186, 387772, -193167, 119002, -78268, 283761, 303546, -50064, 124107, -17984, 475565, -62773, 219182, 184280, 247276, 364225, 349241, 299894, -109010, 145294, 174737, 89605, 50515, 121989, 336486, 122501, 109572, 33608, -19015, 5675, -161072, -125426, 69362, 217601, 168673, 132235, 93071, 157423, 2656, 493995, 212677, 167314, 142109, 329300, 62006, -62443, 174926, -201824, -193024, 276632, 694134, 1909, 57005, 55210, 38062, 3759, 58090, 110730, 75824, 245242, -344242, 80988, 128806, 91835, 110646, -75456, 450024, 142559, 112060, 354913, 161064, 293534, -42680, 245879, -7596, -81248, 183070, 100897, 28692, -23618, 167665, 95804, 60279, 192774, 218695, 174375, 43388]
13109B30288I2259d169C64702A07994A346J172b0426A1951L25616D8056d1207
13097i2959G2486R5237b81718B74410i584A60308E9955a11360K1870A98857N1750
13086B50607I4215d8635F9213K25950A43740a70974B27398p8468E7845K4520a25883
13074D20178B9488R4710g1815j26087C8854K17104r6943h7444I9853J35772h667
13062B44352k5082a1353B1230R4070e130H6096J8686j2092K30834c8983C87722
13050b9956k13345a03842B63497L6670c87797B54673Q0665j18854a14717j78260
13040b92977B6724J76611m8351p829c49n1515A85277D766a5991C70824D3859J57592
13028B01451r7786L19029F1947J16932K08516K5294A68573G4875e2320B41636
$$ y = [230288, 92259, -4169, 364702, 107994, 1346, 2518, -20426, 11951, 337567, 48056, -41207, -92959, 72486, 167723, -281718, 274410, -9584, 160308, 59955, -111360, -89490, 198857, 250607, 94215, -48635, 69213, 295163, 143740, -170974, 227398, 148930, 57845, 82365, -125883, 420178, 29488, 124198, -71815, -197902, 38854, 255958, 159015, -87444, 99853, 235625, -8667, 244352, 219270, -11353, 21230, 115300, -5130, 86096, 104782, 92690, 323524, -38983, 387722, -29956, -243301, -103842, 263497, 300167, -387797, 254673, 335338, 216484, -114717, -292977, 26724, 203335, 154984, 147155, -349, -51864, 185277, 4766, -15991, 370824, 43859, 201451, 103665, 422694, 61947, 178879, 387395, 412689, 168573, 74875, -52320, 241636]
13017C68266a60592A02024O6120O6454k7940a15959E1510P8533a6257H5953K95699
13006C81652a21732A30725G089K3809L09427A27439b86651d4850A78569H5001
12995C80335d4467A44648c50757G2526d6098B66289i2509I8901a5895A44919a48556
12983F8953r731Q8395J24169F9747i2967A43034P733m6039J9461M8471J40532
12972C13192E280R1256l2953J70317a54004A11263a63945g2159K7139A57958a38111
12960b3003A76386H7218D2817b83752G702D16e6664A32848b7342F9422K19035
12949B88457h582j51437B86073J08462i0398B92269A13963a01614A60974a170
12938b47001f5083a3666m5741b5533A16053L513K527J09675a53321A72468K26566
$$ y = [368266, -160592, 102024, 168144, 234598, 206658, -115959, 51510, 130043, -16257, 85953, 381652, -121732, 130725, 7089, 30898, 340325, 127439, -286651, -44850, 178569, 85001, 380335, -44467, 144648, -350757, 72526, -46098, 266289, -92509, 98901, -15895, 144919, -148556, 68953, 59222, 147617, 271786, 69747, -92967, 143034, 150767, 104728, 124189, 172660, 313192, 5280, 96536, 63583, 233900, -154004, 111263, -163945, -72159, -45020, 157958, -138111, -23003, 176386, 87218, 42817, -283752, 7702, 416, -56664, 132848, -27342, 69422, 288457, -8582, -160019, 286073, 394535, -90398, 292269, 113963, -101614, 160974, -1170, -247001, -65083, -13666, -59407, -25533, 116053, 119566, 122093, 231768, -153321, 172468, 399034]
12927C99034d5329A88786E4877i6809A41109b03798G1847J3086M28456a55611
12916g379k2292D46579D8698K48970f4855B53758B0754J36871F6236d6094A56369
12904a67545g5837F7254O7691J49530c50721C0708J62826N8408a9027A75752j4547
12893A61205c9722j4617H7466a15943c7964B77428c815C20658D2966a13534C9324
12881A58083a8998A65851a43651H2230a63667J0602E00481b956A40361B5530O7362
12870I2892a9923n0313q7349k52837D7842J29166o4346a06550B10475Q0963m7418
12859B44020B6827L51365C9734a86239B14978a19245j52813N4767d1804E3567
12848a3671D9573F223M1312O9186l8140H829b05829L0252A44940K0853D9803f151
$$ y = [399034, -45329, 188786, 54877, -96809, 141109, -203798, 71847, 84933, 513389, -155611, -7379, -29671, 446579, 48698, 297668, -64855, 253758, 20754, 157625, 66236, -46094, 156369, -167545, -75837, 67254, 134945, 284475, -350721, 30708, 193534, 251942, -19027, 175752, 161205, -39722, -54339, 87466, -115943, -37964, 277428, -3815, 320658, 42966, -113534, 39324, 158083, -18998, 165851, -143651, 82230, -163667, -153065, 500481, -2956, 140361, 25530, 92892, -19923, -70236, -157585, -410422, 47842, 177008, 112662, -106550, 210475, 291438, 244020, 26827, 378192, 39734, -186239, 214978, -119245, -272058, -217291, -41804, 53567, -13671, 49573, 6223, 47535, 116721, 78581, 8829, -205829, -175577, 144940, 165793, 49803, -6151]
12835b68030a07733G409L46303h9860F8787e7059H653K9810J09332J17945c1043
12823a9362C18731a45841C2734h4435B05940d3983A24380i3416D2863a89841K2079
12812a67762g9927b3559o1278j83604g6125a4201I6825K31163a50964D0568c3020
12800A01353g8121B23846G3424Q3457j4885a58107N9515j48121C22048J4983b5930
12788A47962a43647B36795A3469P736J6605K01710B4852a27781l456A08741K3063
12777A31804P0088F5993R8300p2621L36691c57515J64354d7799A28768b26131
12766g7700j39828M3362J2281J4245C7224J23794g0725o8932A36786a826A98542
12754b85879A61292j6906b18554A33154Q0844k4771d6935B39432n7022a82524
$$ y = [-268030, -107733, 7409, 353712, -89860, 68787, -57059, 8653, 38463, 147795, 265740, -31043, -19362, 318731, -145841, 32734, -84435, 205940, -43983, 124380, -93416, 42863, -189841, -167762, -79927, -23559, -84837, -268441, -76125, -14201, 96825, 327988, -150964, 40568, -33020, 101353, -78121, 223846, 73424, 156881, 141996, -158107, -98592, -246713, 322048, 337031, -25930, 147962, -143647, 236795, 13469, 21205, 37810, 239520, 24852, -127781, -131237, 108741, 131804, 201892, 65993, 164293, 91672, 428363, -357515, -193161, -47799, 128768, -226131, -77700, -217528, -174166, -161885, -147640, 37224, 161018, -70725, -139657, 136786, -1826, 198542, -285879, 161292, 144386, -218554, 133154, 213998, 189227, -46935, 239432, 182410, -182524]
12743a32936A59549a02744A02930e6446B30545G2316M9649c0673A73623R5301
12733B68924A33993o2285K02120h7182B32793a87547O5398B46979M2852P889j09602
12722A88118o2560e5835I3796J41763e9456B46599j16476E7757P995a18246K0457
12711i7789G8126a07665A58386J3376H1097d1267B28758J46968j34474r3120J70316
12700C18448D414L44273a72121b6605o6136C58713A45313C3789g3646H8612J89332
12689B77944a6266C6146J36746j0219J63622a53123c8226G4888d7432a573A91207
12677g6721B42702J52328g1121n03741G4905a18884A18400f1520I2839O3182P1341
12666B27362b3369A75721a82017H3777N0225g5264a2713b228B06558b339B07503
$$ y = [-132936, 159549, -102744, 102930, -56446, 230545, 72316, 121965, -30673, 173623, 268924, 133993, 71708, 273828, -87182, 232793, -187547, -122149, 246979, 289831, 297720, 188118, 125558, -55835, 93796, 235559, -59456, 246599, 130123, 57757, 65752, -118246, -97789, 78126, -107665, 158386, 171762, 81097, -41267, 228758, 375726, 241252, 148132, 318448, 4414, 348687, -172121, -26605, -92741, 358713, 145313, 33789, -73646, 88612, 277944, -16266, 36146, 172892, 162673, 326295, -153123, -38226, 74888, -47432, -1573, 191207, -76721, 242702, 395030, -71121, -574862, 74905, -118884, 118400, -61520, 92839, 156021, 227362, -23369, 175721, -182017, 83777, 134002, -75264, -12713, -2228, 206558, -2339, 207503]
12654A06459N3426J43607j39341l2376a30828C55657D1180A7113i1670H4166J39728
12643B23894G9993M4101C3018i9968c9326A25759L83K06647j65546l2364F2622
12631B29777a5860D08319D7684c3030B29904L4424I6902J4918f2558A36370J93410
12620C29780j43708J23720l682M1328h1431A57321R757J38223P8392i4227j16718
12609b10945a05178j13644N7985q8731A16640c05135a5119C86542j73225k1572
12599A91745J52653k3904A0153P2179k4790b2167k6616C63830G0174O4751a76737
12587A60013C6402K74991A14822L0394E7323f9532C9765L6244J89103A17312J2370
12576A29682h1982E5617e3649A07259B9155J72206I291f6590B6795O4509b7115
$$ y = [106459, 159885, 303492, 164151, 131775, -130828, 355657, 41180, 17113, -91670, 84166, 223894, 79993, 124094, 33018, -99968, -39326, 125759, 126142, 332789, 167243, 134879, 62622, 229777, -15860, 408319, 47684, -33030, 229904, 264328, 96902, 111820, -62558, 136370, 329780, 186072, 309792, 306110, 347438, -81431, 157321, 167078, 305301, 383693, -94227, -210945, -105178, -218822, -160837, -249568, 116640, -305135, -15119, 386542, 213317, 191745, 344398, 320494, 10153, 82332, 57542, -22167, -48783, 363830, 70174, 134925, -176737, 160013, 36402, 311393, 114822, 145216, 57323, -69532, 39765, 76009, 265112, 117312, 129682, -81982, 55617, -53649, 107259, 29155, 201361, 9291, -66590, 26795, 91304, -27115]
12564A36828A2881K9883b49252a16768I7215C8190J60087A1680d8675j3598b11
12552I0624B18a33753I0272J603a18865N8022A5443J07362k0437c1135A27576
12540b05763A73395a09431H2299a85450i013A17794a0785o4648B28134J71951
12530D00085A8401J59674g9408F7879k7910R1810E3354a83002c969A38621D1116
12518A99079o1481d1157A38353C2798J40714a41892B29914b00144R8254D4141
12507C5292K65761d1044C14944a03465c5245A78925b8664C26049a71259D2296
12496b00723d6395I3940m2095N2378B8046I531J11286E3304A8507e4541j20806
12485a75347A68688J9134F6444R299a91800Q4462B00818n2898F6124J29411a29017
$$ y = [136828, 12881, 42764, -249252, -116768, 97215, 38190, 198277, 11680, -48675, -62273, -211, 90624, 218, -133753, 90272, 91875, -118865, -60843, 15443, 122805, 102368, -31135, 127576, -205763, 173395, -109431, 82299, -185450, -9013, 117794, -10785, -75433, 228134, 400085, 18401, 178075, -79408, 67879, 39969, 131779, 53354, -183002, -3969, 138621, 41116, 199079, 137598, -41157, 138353, 32798, 173512, -141892, 229914, -200144, -101890, 44141, 35292, 301053, -41044, 314944, -103465, -35245, 178925, -28664, 326049, -171259, 42296, -200723, -46395, 93940, 51845, 104223, 28046, 9531, 120817, 53304, 18507, -54541, -175347, 168688, 187822, 66444, 75743, -191800, -107338, 200818, 147920, 66124, 195535, -129017]
12473a84826A36770i8376r6082j51142P7880A60927J10342b09750A84060D2727
12462e9266k83316B43387C2769M8661i5456p5855F4819a56536A38430b27863O3448
12451a64415j9465p3925a27646B11150q3879E1832J276j3100K984A5644j038c13392
12438A66039a55852A22868M192F3035Q057P1038H067K72093L9336C7939L02305
12427C40244Q6512a02713G4651C920L0208J01835d7049j61385O8373B66960a08457
12415e11801a74246P3766B0107e0604j59565c7997l4828a75j09785j13901H2710
12403a53272G8885K22942f8796j5153I406c9475A21275J62806a320H3214l0859
12392E2355K91767H8692J04372c40408A8278b64685k3361i8776r3118j2310B06579
$$ y = [-184826, 136770, -98376, -194458, -345600, -267720, 160927, 271269, -209750, 184060, 42727, -59266, -342582, 243387, 32769, 81430, -95456, -171311, 64819, -156536, 138430, -227863, -164415, -183880, -257805, -127646, 211150, 127271, 51832, 53108, 40008, 42992, 15644, 14606, -313392, 166039, -155852, 122868, 127060, 63035, 71092, 142130, 8067, 280160, 319496, 37939, 340244, 426756, -102713, 74651, 3920, 34128, 135963, -47049, -208434, -140061, 266960, -108457, -511801, -174246, -100480, 20107, -50604, -210169, -37997, -72825, -175, -109960, -223861, 82710, -153272, 78885, 301827, -68796, -83949, 9406, -39475, 121275, 284081, -1320, 83214, 52355, 344122, 88692, 193064, -340408, 18278, -264685, -288046, -98776, -191894, -204204, 206579]
12380e058G2260A501K64434e7687G4659k59P9392f141k23169B04882o8838a40083
12367B29509c86175A90937E9071a03173j52381i6408l3702j25367f5650k22542
12357b88192A59944d3964A72475F2540o363K83965D6064A695M4554b6480A50776
12345c58728a46255B3602g611A24072a5078A2516c556A72856D654P6518c1034
12333A13551a10095e3468J599A54413K40152A0493O7698a20234F0615e389j6911
12322b2300A80316c01796F615e4259A03559O4972C7192h8030a508j46577d8313
12310A03102f0137o570H9415K965b0497A15605a07690K4245D8150a0803B12076
12298A52437J0098k9667m3753B6883J56637a3877l01800m1648A29191C7972g7638
$$ y = [-5058, 72260, 1501, 265935, -57687, 74659, 74400, 153792, -6141, -229310, 204882, 136044, -140083, 229509, -386175, 190937, 59071, -103173, -255554, -96408, -130110, -255477, -65650, -288192, 159944, -43964, 172475, 62540, 56177, 340142, 46064, 1695, 46249, -26480, 150776, -358728, -146255, 23602, -7611, 124072, -15078, 12516, -3556, 172856, 4654, 81172, -31034, 113551, -110095, -53468, -51869, 154413, 394565, 10493, 78191, -120234, 60615, -5389, -22300, 180316, -301796, 6615, -54259, 103559, 168531, 37192, -88030, -1508, -148085, -48313, 103102, -60137, -66707, 89415, 92380, -20497, 115605, -107690, -83445, 48150, -10803, 212076, 152437, 162535, 132868, 89115, 26883, 183520, -13877, -315677, -357325, 129191, 37972, -77638]
12286D20074A89686N1555D050f3995j6625D36706j10284A51955a82444B10251
12275d0449A0710h0982A13485A7824M03178O8844F1208L80419j39406g7138F6960
12263D48102c567A80891k2644l282e9926A60394c3296C23617j42031h1212A21821
12251b88562c5596A92251J01817B5318a5485C54906H6402D0207a8082o8000A66974
12239h2288c2215j26951G7421f4423A65100a58238H8300A2400J3177K66669B6600
12227A83326H1206A2100a24327M7493D42359H7838K28583j19448n0009R4474d3278
12215B51331J91454j57657C2466K08220J3645j26538a59289A41351m408K2234
12205A59177p8010a22987B52716J24874K0821A98959m4203F4964L07866P8005
$$ y = [420074, 189686, 241241, 4050, -63995, -80620, 436706, 326422, 151955, -182444, 210251, -40449, 10710, -80982, 113485, 17824, 421002, 489846, 61208, 441627, 302221, -77138, 66960, 448102, -3567, 180891, 158247, 154965, -59926, 160394, -33296, 323617, 181586, -81212, 121821, -288562, -35596, 192251, 294068, 25318, -15485, 354906, 86402, 40207, -18082, -86082, 166974, -82288, -32215, -159166, 77421, -64423, 165100, -158238, 88300, 12400, 25577, 292246, 26600, 183326, 81206, 12100, -124327, -76834, 442359, 87838, 316421, 196973, 146964, 241438, -43278, 251331, 442785, 285128, 32466, 240686, 254331, 127793, -159289, 141351, 136943, 159177, 81167, -122987, 252716, 377590, 398411, 198959, 154756, 64964, 372830, 450835]
12195D50835j68772k0845j20611L49407j246A75299a7616n1606B2609M22649A50851
12183D0204A4492J1278J50101c38677C01631g415H5213b08455A79779a6802A17848
12171A6221a30522D163K95523j27983P6464f5788A28408J90591H0053J57789A15597
12159B57099j19534K80854k03408O3958e960C40037C8390K08856J73624j03547
12149C17323a1636m3713G9244c18791b1261q3544A7274N6692m407J27594k8230
12138A68923Q7331O4415N7894g0472K8618k4339F9909B8926e7167B79204b32131
12126A736i972j24354f0867K9584D356a44963O0163K994G5188l0277a61030p6987
12114b38017B5886b5643q9203C6785d7977A29574a4704D33235G5749b33238J04900
$$ y = [450835, 282063, 261218, 140607, 490014, 488768, 175299, -17616, -69222, 22609, 445258, 150851, 40204, 14492, 25770, 175871, -338677, 301631, -7415, 85213, -208455, 179779, -16802, 117848, 16221, -130522, 4163, 299686, 171703, 248167, -65788, 128408, 318999, 80053, 237842, 115597, 257099, 137565, 418419, 215011, 278969, -5960, 340037, 38390, 247246, 420870, 317323, -11636, -55349, 79244, -318791, -21261, -104805, 17274, 73966, 69559, 197153, 168923, 256254, 320669, 378563, -70472, -41854, -66193, 69909, 28926, -57167, 279204, -232131, 1736, -9972, -134326, -60867, -31283, 4356, -144963, -84800, -81806, 75188, 44911, -161030, -238017, 25886, -25643, -114846, 36785, -47977, 129574, -14704, 433235, 75749, -233238, -128338]
12103a28338A52235D1100K43251a78486C64204A79134a44838B3739P3101c6897
12092a496A75888a86973g0378A16104c7366j02527E895c00134b8105C6068J30533
12081A66601e11599g1068E8997K17202K54316M96920O49935B92828J02628f1231
12070b06197A01192L33558j00095b39583B6979g8335A21229a85A25441J5810i4177
12058b6019C9808f2883p4712C14810a39102A39021a80115A91209h2356A51181
12047D1665a6098l0762A23593K18551a54422A40958e1934A61322e529B35489a7114
12035I4624b72183a11385I5459c74964A09753N4190p4408J28360l7357a10364
12024a21524A7421K76433b11167Q9588A19562R8863p0518h0086C07780b9801B13450
$$ y = [-128338, 152235, 41100, 284351, -178486, 364204, 179134, -144838, 23739, 96840, -36897, -1496, 175888, -186973, -70378, 116104, -37366, -139893, 5895, -300134, -28105, 36068, 166601, -511599, -71068, 58997, 276199, 530515, 1027435, 1677370, 292828, 395456, -61231, -206197, 101192, 434750, 334655, -239583, 26979, -78335, 121229, -185, 125441, 141251, -94177, -26019, 39808, -62883, -137595, 314810, -139102, 139021, -180115, 191209, -82356, 151181, 41665, -16098, -46860, 123593, 342144, -154422, 140958, -51934, 161322, -5529, 235489, -17114, 94624, -272183, -111385, 95459, -374964, 109753, 163943, 89535, 217895, 180538, -110364, -121524, 17421, 293854, -211167, -121579, 119562, 218425, 147907, -80086, 307780, -29801, 213450]
12012A4911M4082J33971B22J68412c0765p0909E929i3095B30188m6106h7241j21306
12000b08547D9267a72346D0308N3717j3256p615a63630K8651e2648B54981a91586
11988f2270j83024A78585E0477R514b41709J05916j54862f851q4327j1697l13502
11977d16377h1122l52612G4389c4530k0702j61452a6913A66137K24011A54208
11966D7347j3472a25154a1024A25345c46921h3845k45507C67925c9196A5694J56396
11955A72090b75258A72313a15185a6597j34091I106L2918b48700k16977g4780
11944A77138h0991O688j80883C01331b68357D4922a81868b8954B32195J78252
11934D10447A1567P4395J11935E5303c5193A42079O1171b52816A03768J60034
$$ y = [14911, 58993, 192964, 222, 168634, -30765, -101674, 5929, -93095, 230188, 184082, -87241, -208547, 49267, -172346, 40308, 94025, 80769, 73154, -163630, -134979, -52648, 254981, -191586, -62270, -245294, 178585, 50477, 59991, -241709, -135793, -290655, -6851, -91178, -102875, -416377, -81122, -433734, 74389, -34530, -55232, -216684, -16913, 166137, 390148, 154208, 47347, 33875, -125154, -11024, 125345, -346921, -83845, -329352, 367925, -39196, 15694, 172090, -275258, 172313, -115185, -16597, -150688, 9106, 42024, -248700, -465677, -74780, 177138, -80991, -74303, -255186, 301331, -268357, 44922, -181868, -28954, 232195, 410447, 11567, 85962, 197897, 55303, -35193, 142079, 203250, -252816, 103768, 263802]
11924B63802J035j22762a42608l6166A86784B2519Q6285a01747m7668N3743C9126
11912i7685B3577J01850q723m1852O8844R3277a30932j3355c6876q0646A59333
11900F5026a3195k1256A55683a29578C75588c25556B65692B4016d4922j26592
11890a71514A53154b06880N1031A30713a51220A34889a29896B1720a34769j98822
11880c33591d7273j38044n1342M8320p5651E399c46292J48620D3990J2499a64515
11868f6840B02097f8516F7345e6058A28157h7563c2027j4868o2719L0261I8707
11856I957R032K2281a91937O3924F0609b86326a36490C7106a69415E5520J40738
11845A96258g2203A1779P5751N6386a701F5947c62047D4983O1325b21517B9236
$$ y = [263802, 264837, 142075, -142608, -178774, 186784, 22519, 108804, -101747, -149415, -95672, 39126, -97685, 23577, 125427, 116704, 74852, 143696, 236973, -130932, -144287, -36876, -117522, 159333, 65026, -13195, -34451, 155683, -129578, 375588, -325556, 265692, 24016, -44922, -171514, 153154, -206880, -155849, 130713, -151220, 134889, -129896, 21720, -134769, -333591, -47273, -185317, -236659, -188339, -263990, 5399, -346292, -197672, 43990, 56489, -164515, -66840, 202097, -68516, 67345, -56058, 128157, -87563, -32027, -46895, -109614, -79353, 98707, 9957, 18989, 41270, -191937, -128013, 60609, -286326, -136490, 37106, -169415, 55520, 196258, -72203, 11779, 87530, 143916, -1701, 65947, -362047, 44983, 106308, -221517, 29236]
11833b96625C8505c6709j9786k07479b2394A0879K01080a59809B3769Q5897h1476
11821a17538B232a62091m8634F2391k023M2479i0158A40552b35805H8902J1748
11810A00650N4Q607d45498a44210B70201D0886a7413A29797c0661J2902j8321
11799c6080A1577K06298G0076b23690C34969C9543c3305k79568a28200A5640O970
11788B2610R144f8185B66687C3917O4642K29382b0690C4329h734B40391d0454
11776i2563B63573A28402e4083a53l54231A0615a34044N2096L3250j80962i537
11764G9089a25431E2703b7361j37330B3108J64142i6229j93473A4311a12522N2639
11753e9883F4068a03707A87263h4951A52171c5883k00979E7285f2807A1846J90602
$$ y = [-296625, 38505, -36709, -56495, -263974, -22394, 10879, 211959, -159809, 23769, 109666, -81476, -117538, 2232, -162091, -210725, 62391, 60368, 102847, -90158, 140552, -235805, 88902, 100650, 100704, 109311, -445498, -144210, 270201, 40886, -17413, 129797, -30661, -17759, -36080, 11577, 217875, 70076, -223690, 334969, 39543, -33305, -312873, -128200, 15640, 22610, 31754, -68185, 266687, 33917, 98559, 327941, -20690, 34329, -8734, 240391, -40454, -92563, 263573, 128402, -54083, -153, -354384, 10615, -134044, -81948, -48698, -229660, -9537, 79089, -125431, 52703, -27361, -164691, 23108, 187250, -96229, -289702, 14311, -112522, -59883, 64068, -103707, 187263, -84951, 152171, -35883, -236862, 57285, -62807, 11846, 202448]
11742B02448J20404j2460I7279j5260a70538F1484j8853J41212R4519i0473d0840
11730D34694a64315A08768c20483A38368h1039j29483B23491b25135G2365B3651
11719C8571g7040D7665i2152k10933B15403a76081C37899D5591b47667B76830
11708g5635B28537d0357A39551J03060f1448B06609d6154j09029B8219i6398o6501
11697a62899C6059d9167C1337J45531G1722M5469a61487F8102J20261J1922b480
11685C45095d47828A1625g9141o4617O6063b0365A60943K0866g3199C16537e8207
11673b09457O9632B9819h2565K2456j99296e2020p8751n4516g750j67732h1437
11661a24438c6833o1447M5704J9417A12255a02971C66117b06652I4038a64859
$$ y = [202448, 322852, 310392, 97279, 82019, -170538, 61484, 42631, 183843, 278362, -90473, -40840, 434694, -164315, 108768, -320483, 138368, -81039, -210522, 223491, -225135, 72365, 23651, 38571, -77040, 47665, -92152, -303085, 215403, -176081, 337899, 45591, -247667, 276830, -75635, 228537, -40357, 139551, 242611, -61448, 206609, -46154, -155183, 28219, -96398, -162899, 36059, -49167, 31337, 176868, 71722, 117191, -161487, 68102, 188363, 200285, -2480, 345095, -447828, 11625, -79141, -143758, -77695, -20365, 160943, 181809, -73199, 316537, -58207, -209457, -139825, 29819, -82565, -60109, -259405, -52020, -130771, -185287, -7750, -175482, -81437, -124438, -36833, -98280, -52576, -33159, 112255, -102971, 366117, -206652, 94038, -164859]
11650c76409d8290j03289H927g1098o31D3530B0908b83798f0509b4950p4636i93
11637a10096A85278a41201B94155a52641b6245r4294I3647c68746c4948B07775
11626A9919c3820E30930B13338M744J95968k00740b56548B42382a21774D9864
11615a345C8873J44658J84840c5933F0622K7327k9735I114a95693n3330a5277
11603a23344E0839J34810k1202A2543K835J4578e2534E8886A0850J49354N5066
11592B15270H359b30598H437R5834R7920J38555j67208p3713F984N800K63304
11581B76088a78198i727B58176G9198K5085d6719B7826e3539B48304J00319c77173
11569F6965a782k40082e4898B55711q7483e008A55294c3099F7674c4108B39479
$$ y = [-376409, -48290, -151579, 8927, -71098, -71729, 43530, 20908, -283798, -60509, -24950, -99586, -993, -110096, 185278, -141201, 294155, -152641, -26245, -120539, 93647, -368746, -34948, 207775, 19919, -33820, 530930, 213338, 218082, 414050, 213310, -256548, 242382, -121774, 49864, -1345, 38873, 183531, 368371, -35933, 60622, 87949, 58214, 9114, -195693, -249023, -15277, -123344, 50839, 185649, 164447, 12543, 15378, 29956, -52534, 58886, 10850, 160204, 215270, 8359, -230598, 8437, 104271, 202191, 340746, 173538, 99825, 6984, 12784, 276088, -178198, -9727, 258176, 79198, 104283, -46719, 27826, -53539, 248304, 348623, -377173, 66965, -1782, -241864, -54898, 255711, 168228, -5008, 155294, -33099, 67674, -34108, 239479]
11557B40458b61568B06021h7170D6674j035b33049j62693g9137G4452b26544H1868
11545b58227A23484J44446j0809b67I720L47159D1074L0793a64279p993D84046
11533A4931a05842B39696H7773g5003O278D9563K36750j08967m9157M2300L5714
11522B06203B5188a21377B37589f7366A24149O2348a34912I9027K29124p144H040
11510E5967J29077J54391C9501K89343G0826M47807j87568a32935e5066A74075
11499I8679K84026j53925j1716E0336K56402A31095K52363A17216D6575d5269
11488D9805J44618c9873A24332a3137q1804A49548L36071k40244B4606J93803
11478B18409p9993Q9085J56968b65613d0425B7196K87346e1405B64038d7197C41325
$$ y = [240458, -261568, 206021, -87170, 46674, 45639, -233049, -395742, -79137, 74452, -226544, 81868, -258227, 123484, 267930, 257121, -267, 9720, 356879, 41074, 71867, -164279, -172272, 484046, 14931, -105842, 239696, 87773, -75003, -68725, 49563, 286313, 177346, 128189, 170489, 206203, 25188, -121377, 237589, -67366, 124149, 186497, -134912, 99027, 328151, 321007, 8040, 55967, 185044, 339435, 39501, 328844, 70826, 518633, 331065, -132935, -55066, 174075, 98679, 382705, 228780, 217064, 50336, 306738, 131095, 383458, 117216, 46575, -45269, 49805, 194423, -39873, 124332, -13137, -94941, 149548, 485619, 245375, 24606, 218409, 138416, 227501, 384469, -265613, -40425, 27196, 314542, -51405, 264038, -47197, 341325]
11466g2056A26176e1655C21796H9638e1206B25516D1967a74476B66880j20080
11456A46800C6737a5959H138M98538G7758e15904D01724f9989R163a5481B45187
11444a32002I86J88626c9681F3613K7320K62905A24832A5234A793b05485i1427
11432b13961H7351b37381A42332g5311a6303j56358a9252j00020B03399G4693
11421A30921a95560C60427i0331G6934d47012h1681A25545l4792g6805A09189
11410A5534a85969C10367e5219E10070A90486q4594m6097M0493P7704j9954i6242
11398C3717a69417C216J09791d8373k52076J35766B39740e4525E686f16044a89958
11386B17369c53141B08458g2568I0327b22813J07380j2435K8771C43660p0093
$$ y = [-72056, 126176, -51655, 321796, 89638, -51206, 225516, 41967, -174476, 266880, 146800, 36737, -15959, 8138, 506676, 77758, -515904, 401724, -69989, -60826, -15481, 245187, -132002, 986, 189612, -39681, 63613, 90933, 353838, 124832, 15234, 1793, -205485, -91427, -213961, 87351, -237381, 142332, -75311, -16303, -172661, -19252, -119272, 203399, 74693, 130921, -195560, 360427, -90331, 76934, -447012, -81681, 125545, 90753, -76805, 109189, 15534, -185969, 310367, -55219, 510070, 190486, 105892, 59795, 100288, 177992, 158038, -96242, 33717, -169417, 3216, 113007, -48373, -300449, -164683, 239740, -54525, 5686, -616044, -189958, 217369, -353141, 208458, -72568, 90327, -222813, -115433, -127868, -99097, 343660, 273567]
11376B73567a43885C7314h4559C25938b9694j61591A88678F08R2058k7969K7790
11365I2487b44673D3200D01i3527K588j01324Q4867n4766k19497A78322a13236
11353I152b47971j34263a65617j20641d8783I6615a41375a937A2595K50474i7246
11341A75293a1930m821B07447C0974b86813J13750k09464a02623A6287h8984A33157
11329F7304a65423k5314b3995j34684A60526a4549l2670A35906i740j99529k1806
11318b31075B23196F1073c40676A52892a74857D1194J66280a12832k53228J52266
11308b13794D2402b89161G0162k7648q85a06210m1998e0280j07727A79224a26481
11296c17529a48065M2510K5309A29479a73308B24037A05025g7123i504F1888a07653
$$ y = [273567, -143885, 37314, -84559, 325938, -29694, -191285, 188678, 608, 92666, 64697, 92487, -244673, 43200, 401, -93527, -90939, -192263, -107396, -162162, -381659, 178322, -113236, 9152, -247971, -382234, -165617, -286258, -48783, 96615, -141375, -1937, 12595, 263069, -97246, 175293, -11930, -16751, 207447, 30974, -286813, -173063, -382527, -102623, 16287, -88984, 133157, 67304, -165423, -190737, -23995, -158679, 160526, -14549, -47219, 135906, -9740, -209269, -231075, 223196, 61073, -340676, 152892, -174857, 41194, 207474, -112832, -366060, -213794, 42402, -289161, 70162, 42514, 41629, -106210, -148208, -50280, -158007, 179224, -126481, -317529, -148065, -105555, -80246, 129479, -173308, 224037, 105025, -77123, -9504, 61888, -107653]
11284A82984B2822b29289j709g0798A32653C6929h3720A36798d32979a52616f0799
11272B19559r2839e686A27430e8210K9050j6474B26055G635J27124n0508j0920
11261G3331N0756B8574e3855k88471B15036O9261b58000B9889O5564a88947b4552
11249G2638a55202M556j4372E53514g1008j3155A37386b92377i9833c3298j29418
11238a62716c2105j16666m6465D3168F240a99722i5127J1756E0162K21572a82901
11226a78159Q0758j24752d0156B81613J64471h5846A90801j7846n1535a52781
11215a31895K8927n2201p4457A34036B3946M53810a31940K523p9837A04709h5849
11203c26519D4951a41132j50090a14079j91620a27841B9914g0515A83207c32526
$$ y = [182984, 22822, -229289, -230998, -70798, 132653, 36929, -83720, 136798, -432979, -152616, -60799, 219559, 126720, -5686, 127430, -58210, -29160, -45634, 226055, 7635, 134759, 84251, 73331, 124087, 28574, -53855, -342326, 215036, 284297, -258000, 29889, 95453, -188947, -24552, 72638, -155202, -150646, -165018, 553514, -71008, -84163, 137386, -292377, -99833, -33298, -162716, -32105, -148771, -195236, 43168, 6240, -199722, -95127, -83371, 50162, 271734, -182901, -178159, -97401, -222153, -40156, 281613, 446084, -85846, 190801, 172955, 121420, -152781, -131895, -102968, -155169, -229626, 134036, 23946, 477756, -131940, -129417, -209254, 104709, -85849, -326519, 44951, -141132, -291222, -114079, -305699, -127841, 29914, -70515, 183207, -332526]
11192e5248C6134c08209H6486O6720e5058B45083E2844J8174G650a79206n5075
11181b34281D272b08563B56331b40743C15362G7754c3801F226J88311b82545J01052
11170a81493k6725O7643k54089d4448H7009J91994B7522J00322E2001a16859j7433
11159a34292A59455G0787i2230o4613A23775b55475a18365A17550a83623b2790
11148b38815B12971D9972a93387A32411G332a50212e5561j691j9157r8690a9919
11136b25351J05422A30405C3635a25461m9458a2878l8386a2106B56583f7409A25847
11124a9460j51507B01496e4805j69296K7139a7070B20715b08321B62878j29369
11114A33509J59493h7862C833J68505d6925r9732C8780L04670C3111j489J82696
$$ y = [-55248, 36134, -308209, 86486, 153206, -55058, 245083, 52844, 71018, 7650, -179206, -234281, 4272, -208563, 256331, -240743, 315362, 77754, -33801, 6226, 194537, -282545, -181493, -208218, -140575, -394664, -44448, 87009, 279003, 27522, 127844, 52001, -116859, -134292, 159455, 70787, -92230, -156843, 123775, -255475, -118365, 117550, -183623, -22790, -238815, 212971, 49972, -193387, 132411, 7332, -150212, -55561, -57252, -76409, -175099, -19919, -225351, -119929, 130405, 33635, -125461, -174919, -12878, -51264, -12106, 256583, -67409, 125847, -19460, -170967, 201496, -54805, -224101, -196962, -17070, 220715, -208321, 262878, 133509, 293002, -87862, 3833, 172338, -46925, -146657, 38780, 343450, 33111, 31622, 214318]
11103B14318M6253o3712K09524a8904A86861L34291B58444F2986P009a25374B25768
11091h0850G4702k3553K44492P095n5618J26208A07423L28115j36327A36510K30729
11080C67239N7576q2303b9974F24642B57416k7301j02874b43546C36259L83241
11070G19500C22263p9368K65881A33128c55939C32913K61320k05096J24165j91001
11060C22301L07377B63229J74739J11398K67533q9682B52409M99426m7802M7797
11050G51830J50889k40094Q0612q0858L06919j20941q1391l19747M32884L2284
11040I12387k96412J76849k17718J7293J4245K10344n8615k42004R6202Q291Q0794
11029G01656r1700r9778N11500k26068E3054N33695j3177j04042L8463K8936j17256
$$ y = [214318, 260571, 196859, 406383, -18904, 186861, 521152, 258444, 62986, 69995, -125374, 225768, -80850, 74702, 51149, 295641, 302736, 247118, 373326, 107423, 435538, 299211, 136510, 367239, 424815, 342512, -29974, 624642, 257416, 230115, 127241, -243546, 336259, 719500, 322263, 242895, 508776, 133128, -355939, 332913, 594233, 389137, 513302, 322301, 629678, 263229, 437968, 549366, 816899, 727217, 252409, 751835, 704033, 751830, 902719, 662625, 743237, 662379, 969298, 848357, 766966, 447219, 880103, 912387, 615975, 792824, 575106, 592399, 606644, 816988, 758373, 516369, 612571, 620862, 701656, 609956, 510178, 1021678, 795610, 53054, 586749, 573572, 469530, 507993, 536929, 419673]
11018D19673M47517j92150K01107l5557l44502O3443j19239K36583Q832m0194
11008F45513j33656N02869D54024j46245K34430M00005m22041N3161L24464l24075
10998E73723J25670j3781N6528o970r6607N9063N0937L08450m23337L30419l15924
10987F48171K56427j7873o2246J60914q7231j52512J87094K35738R8208k09678
10977A057012K63578L94784L21523K75056L85112j85371L66260Q4885m28000L81710
10967B916549p16066K24950m32823J23029l18441m36498M39542l06771J41053
10958A634524j2877P8266r8781q2336K14277k75892k32096j29740j40575k50472
10948G04298r564J0595A15421J08229J59858a09069D33082F3232K8887K88553
$$ y = [419673, 867190, 675040, 876147, 840590, 496088, 559531, 440292, 676875, 685707, 645513, 511857, 1014726, 454024, 307779, 542209, 942214, 520173, 573334, 897798, 573723, 699393, 685612, 742140, 735170, 638563, 697626, 748563, 1057013, 633676, 964095, 648171, 904598, 886725, 824479, 985393, 898162, 745650, 932744, 1168482, 1266690, 1057012, 1320590, 1715374, 2036897, 2311953, 2697065, 2511694, 2877954, 2962839, 2534839, 2916549, 2200483, 2425433, 1992610, 2115639, 1797198, 1360700, 1800242, 1493471, 1634524, 1621647, 1699913, 1601132, 1518796, 1733073, 1457181, 1225085, 1095345, 954770, 704298, 694734, 705329, 115421, 223650, 383508, -109069, 433082, 63232, 92119, 380672]
10938C80672j75803L7204l9345N6288E7848J34302F2324a9874B31405c9037k7340
10927f6377B65672R5352a97975G1322H02L41060A67483G1216a74189I4891L00601
10916C95492a47939A28044J27043b5060A23224c0481m8386G3134a46393F279d04286
10904b34735J04575R641e0338e77j0656n18577a11782d1239n1049B88788H0131
10892b91850F4969j3615b19326i4827G8657d54302a85536B90098J11977i7256
10881C2051j2012O850a61842B67743F896b71154B5460a27884e1831a5030C7566
10869a55367A38629e8720I7999b05885C48245c2331B82737a35355D444b70580
10858D8199a67520L019a7130j4236A05069A1341O2759a95343R7336H343a6171
$$ y = [380672, 204869, 242073, 202728, 259016, 57848, 192150, 62324, -19874, 231405, -39037, -66377, 265672, 361024, -197975, 71322, 802, 341862, 167483, 71216, -174189, 94891, 395492, -147939, 128044, 255087, -25060, 123224, -30481, -78867, 73134, -146393, 6279, -404286, -234735, -130160, -120519, -50338, -577, -11233, -529810, -111782, -41239, -92288, 288788, 80131, -291850, 64969, 51354, -219326, -94827, 78657, -454302, -185536, 290098, 402075, -97256, 32051, 20039, 26889, -161842, 267743, 6896, -271154, 25460, -127884, -51831, -15030, 37566, -155367, 138629, -58720, 97999, -205885, 348245, -32331, 282737, -135355, 4444, -270580, 48199, -167520, -164501, -17130, -31366, 105069, 11341, 74100, -195343, -98007, 8343, -16171]
10846D0099b32068i5546E8371e3533J5633B31444B8556a09747B1684L1857J596
10835E5137g936o687B16023i6109c4517j31048E3690j0a66314K1264d0991o7242
10823a08233n0106A98099a8769G5406e5486k13091j48640a55566L5344b3934A31546
10811B05993p0182h3899a3803l21348M9176C5773H178i999l3309j33380A17066
10799d44723a65770H8114d7545B32403a91658n9948Q8406d6399A21514g3694m8419
10788a22113j74953R1992f7457n2130c5753j26647A80845n1540b89429a28800
10777b97598B45875A09884b57087k11144A71573b27915A14141G156J26410R9472
10767B33038a26389C86379D4539P3708M4543O2238c62092a3052l56068J45778
$$ y = [40099, -232068, -95546, 58371, -53533, -37900, 231444, 28556, -109747, 21684, 53541, 55137, -7936, -14623, 216023, -96109, -34517, -165565, 53690, 53680, -166314, -145050, -40991, -108233, -158339, 198099, -18769, 75406, -55486, -268577, -417217, -155566, -120222, -23934, 131546, 205993, 135811, -83899, -13803, -335151, -285975, 35773, 8178, -9999, -43308, -176688, 117066, -444723, -165770, 88114, -47545, 232403, -191658, -251606, -163200, -46399, 121514, -73694, -122113, -297066, -205074, -67457, -119587, -35753, -162400, 180845, 129305, -289429, -128800, -297598, 245875, 109884, -257087, -468231, 171573, -227915, 114141, 7156, 133566, 233038, -126389, 386379, 44539, 118247, 162790, 225028, -362092, -13052, -369120, -223342]
10757b23342B86990i087r0290B6366f1211k0794l6579B00130E6174b9980G8573
10745B01781Q0231f2677n3600j16649A17540f6573C07073f4823n2915j40906a15712
10733A0766K38003b9902p6685p3725C0610m136a73003a6581A21801a3058p4866
10722h7924A07557b99918A31762n9776f9325H8880m3469J95475A6901b99627j2766
10711c12393P5393F2499a02955N0592A1703J75522D2102K20650b31610k62896
10701d94506A72800b35800a07273G7515k5541a90096Q6369r8732K2110A32651
10690A5217J08867c13439J41054f2066j62657j48682a47855c0045G8195K28716
10680C06911d6552m8455E7356c23945c5717A42094e6298C59158A4100O5864b55908
$$ y = [-223342, 286990, -9087, -99377, 26366, -61211, -82005, -118584, 200130, 56174, -29980, 78573, 201781, 282012, -62677, -116277, -232926, 117540, -66573, 307073, -64823, -117738, -258644, -115712, 10766, 248769, -29902, -106587, -180312, 30610, 26474, -173003, -16581, 121801, -13058, -87924, 107557, -299918, 131762, 71986, -69325, 88880, 45411, 240886, 16901, -299627, -312393, -237000, 62499, -102955, -52363, 11703, 187225, 42102, 262752, -231610, -494506, 172800, -235800, -107273, 77515, 51974, -190096, -103727, -202459, -180349, 132651, 15217, 124084, -313439, -172385, -62066, -224723, -373405, -147855, -30045, 78195, 306911, -46552, -95007, 57356, -323945, -35717, 142094, -56298, 359158, 14100, 79964, -255908]
10668b44821Q288a07974N1871j86755A26971a06311k07589i7802A11028a52012
10657e1713p6001a3171p937a0432B8120M9319A5704J12071b42918R1189B46031
10645B25920c1032A19903D6649c36702d3788j23809L5284r1163A6735a83451h6031
10633C0820b77155B198J65763b50204Q4565B0286b06715C06488o9049a14654p1010
10622a85664G8199c18311A15910b47380L5905P4961J7181o0964M6380C84524f1995
10610h125j38109b2823J656j86556C18660h0734q9372D772h5192j47043p527C2335
10597A26813a91426q6014d240j91694A12327a97937A22745J0803a3052j5232F8446
10585C1288a08855A17228H776a37068N3320L1378B5064c61617k50630i774k24684
$$ y = [-244821, -236533, -107974, -56103, -242858, 126971, -106311, -313900, -97802, 111028, -152012, -51713, -127714, -13171, -21108, -10432, 28120, 77439, 15704, 127775, -242918, -151729, 246031, 225920, -31032, 119903, 46649, -336702, -43788, -167597, -132313, -223476, 16735, -183451, -86031, 30820, -277155, 2198, 167961, -250204, -165639, 20286, -206715, 306488, 237439, -114654, -185664, 78199, -318311, 115910, -247380, -211475, -136514, -119333, -180297, -133917, 384524, -61995, -8125, -146234, -22823, -21167, -207723, 318660, -80734, -170106, 4772, -85192, -232235, -239762, 32335, 126813, -191426, -277440, -4240, -195934, 112327, -197937, 122745, 133548, -13052, -28284, 68446, 31288, -108855, 117228, 8776, -137068, -83748, -52370, 25064, -361617, -612247, -9774, -234458]
10574b34458L1272B41649f7550B92153c59674E381J51273l954a7415f89B79611
10562A63481q0131a57882f1532B01609a6515F94b77543B33205A3701a82263Q2297
10551i9966B26677I1778i5482B19959f8394k4055j5034I8469O5624E7644J18753
10540A76397a54152L1547D0981b0815k57498F3060c11522R5442j19575I5007a9634
10528B78626c64978j6715G7970f9126k55269A73145k6708i432o5194j87097j56298
10517d18021J70458k21809F1566k2630A1695a34593a9648m8627A94023F0920J0822
10506G1742R9550a16109A11700C1624e3310G4493q811M3508J55322b96422d5331
10494b54938B0102b05351C5719A0407a12405A81636b33882D2962a96975k49162
$$ y = [-234458, -203186, 241649, -67550, 292153, -359674, 5381, 156654, 152700, -17415, -689, 279611, 163481, 83350, -157882, -61532, 201609, -16515, 694, -277543, 233205, 13701, -182263, -99966, 226677, 91778, -95482, 219959, -68394, -92449, -107483, 98469, 164093, 57644, 176397, -154152, -122605, 40981, -20815, -278313, 63060, -311522, -216080, -335655, 95007, -19634, 278626, -364978, -381693, 77970, -69126, -324395, 173145, 146437, -9432, -74626, -261723, -418021, -247563, -469372, 61566, 38936, 11695, -134593, -19648, -68275, 194023, 60920, 71742, 171292, -116109, 111700, 31624, -53310, 74493, 65682, 109190, 264512, -296422, -45331, -254938, 20102, -205351, 35719, 10407, -112405, 181636, -233882, 42962, -196975, -446137]
10484d46137A95101a03264B64238O5438j38937N1451R7515Q0143k06429R9752
10474C13171a61021A25896J46322B9394c3473C17457A032h1668C31415A17727
10463c68640J68086R7769G1102J36035a79474p4858J04448p4524n0588A11240
10452i1112B0520b27868I9327P9056o3234d2518A92600j8214a35095D4167i4950
10440a08756L9608j98996a03951B2594J33493C5880J26882c5335D3315c87848
10429a23154C0266a55360p618K1432q3790h0300B28300b32991F4173L3113g0548
10417A15460K64656c28006A32243J57463a24874G4995b13085a2270C24238F611
10406H7582b89344G5665B3330a81520P9714A6317J94503H3111l8636b05526A82064
$$ y = [-446137, 195101, -103264, 264238, 329676, 190739, 242190, 339705, 419848, 213419, 313171, -161021, 125896, 272218, 29394, -33473, 317457, 1032, -81668, 331415, 117727, -368640, -200554, -102785, 71102, 207137, -179474, -254332, -149884, -224408, -274996, 111240, -91112, 20520, -227868, 99327, 178383, 115149, -42518, 192600, 174386, -135095, 44167, -94950, -108756, -69148, -268144, -103951, 22594, 156087, 35880, 162762, -35335, 43315, -387848, -123154, 30266, -155360, -162978, -141546, -225336, -80300, 228300, -232991, 64173, 97286, -70548, 115460, 380116, -328006, 132243, 289706, -124874, 74995, -213085, -12270, 324238, 6611, 87582, -289344, 75665, 23330, -181520, -101806, 16317, 210820, 83111, 44475, -205526, 182064]
10394b15744B21125a43176J597B69723j10046o390b49289F4401r939J87766j3811
10383B28417q7647b7306G3225g941B21998G0507L49402j86856R8124C6351F787
10371A207L04057E7188c5931B26022J32566K60819j66862j96736r0386N4583K47334
10360D67340J47963B32864J60508l4844H2673Q8732J65462K70268j88761K26716
10350F45090l05702J41007N3483A06817K92929j81784r6578J60986J12839A14532
10339b4739E9221L53620K9613a7493I5059K17176c2282I465J78175A101J29943
10328A31044i7356d838B59232b43254E6658k3062a64209B20723F7656R63J34330
10317B02949q4154R0908O4010K10749b6721g055j93877B74512E122a30744C1336
$$ y = [-215744, 221125, -143176, -141579, 269723, 159677, 153287, -249289, 64401, 54462, 242228, 228417, 140770, -27306, 73225, -7941, 221998, 70507, 419909, 233053, 331177, 36351, 6787, 1207, 305264, 57188, -35931, 226022, 358588, 619407, 452545, 255809, 165423, 220006, 467340, 615303, 232864, 393372, 358528, 82673, 171405, 336867, 607135, 418374, 645090, 339388, 480395, 533878, 106817, 399746, 217962, 121384, 282370, 395209, 114532, -24739, 59221, 412841, 442454, -17493, 95059, 312235, -32282, 9465, 187640, 1101, 131044, -97356, -4838, 259232, -243254, 56658, 33596, -164209, 220723, 67656, 68619, 202949, 118795, 209703, 273713, 484462, -26721, -7055, -200932, 274512, 5122, -130744, 31336]
10305a72644P6004E2677B4331j1437K42337b58669A46062J13569a65484f837B18018
10293b4977A30915b07519D25926b45776i2139A57425f4602c0369A88391j8983
10283A69408f3218r837H7515o437i9067L9395j22130A72799C3280a24987i074
10271B2157a76031h138m6635a1980A95570a27178B98824d2847J4388A34669J65579
10260C00248K25191j79381j50105P5106a04056B2934K72804C3546d3505A04537
10249b15384M0390g9180k803A46290c55171G535a29430k15611a43853o51D8543
10237a21768D7620J5374a49430L110I4708J78848I7916a70521J5217l9232A22787
10225C62726b4560A02056b4686A46483A7609L03190a49374N2549r0641A1295R537
$$ y = [-172644, -96640, 52677, 24331, 12894, 255231, -258669, 146062, 259631, -165484, -6837, 218018, -24977, 130915, -207519, 425926, -245776, -92139, 157425, -64602, -30369, 188391, 169408, -63218, -73055, 87515, 81078, -99067, -59672, -181802, 172799, 33280, -124987, -9074, 22157, -176031, -8138, -54773, -11980, 195570, -127178, 298824, -42847, -28459, 134669, 300248, 525439, 346058, 195953, 271059, -104056, 22934, 295738, 33546, -43505, 104537, -215384, -174994, -79180, -81983, 146290, -355171, 7535, -129430, -345041, -143853, -144504, 48543, -121768, 47620, 62994, -149430, -146320, 94708, 273556, 97916, -170521, -155304, -194536, 122787, 362726, -24560, 102056, -24686, 146483, 17609, 320799, -149374, -96825, -187466, 11295, 20832]
10214B0832b02717I180a29207K0916D9274i588l70334G7319K38724a93761e6338
10202f5045B09370a93110A27787K55126G7298d10757a40382A21739l7152b42286
10191C1765J15870c73507A03343I70a97762C4513a13442l38566G3937d2321k26407
10180b68728F8893b10500j36705R3002h2799b4739j70451p1907j26353i7656j93106
10169b90762i9638D9548b16796C15758C4849H992e9138k64255A61809b17195B24547
10157A55149o0824c852D0307J55989c3877n8205l42908r1006A24045d5051k22720
10146b67771A91620b83161d3884j18097F7764a58080B48916c7127C40051j55288
10136A84763f0643A13696i2447C77345a64095F6825b04523E2264k4402a98570
$$ y = [20832, -202717, 9180, -129207, -108291, 49274, -9588, -379922, 77319, 316043, -193761, -56338, -65045, 209370, -193110, 127787, 382913, 77298, -410757, -140382, 121739, 84587, -242286, 31765, 147635, -373507, 103343, 970, -197762, 34513, -113442, -452008, 73937, -42321, -268728, 68893, -210500, -347205, -254203, -82799, -24739, -195190, -267097, -393450, -97656, -290762, -99638, 49548, -216796, 315758, 34849, 8992, -59138, -323393, 161809, -217195, 224547, 155149, 94325, -3852, 40307, 196296, -33877, -92082, -434990, -525996, 124045, -45051, -267771, 191620, -283161, -43884, -161981, 67764, -158080, 248916, -37127, 340051, 184763, -60643, 113696, -92447, 377345, -164095, 66825, -204523, 52264, 27862, -198570]
10125b12400Q7734I6158D7360b4249I7882J52435b8607A02544b19360j0054f8524
10113g0438m31054a75535A62603a14241a5385l5848j03522I3315f616A66318E9871
10101B49863D9111N2874J3072b93860O5408P8557P1590A2540d91318A19372e5923
10089c20014d1800n5951E8536a01497j81434a33309e390r4853b715j12286o2329
10078a77330g2422H2578b76221B5850J01923b29364j06368c9060A12258a7345
10067a71331G6317a22734k72833a43939j01217A58927b93028J38325c5887m0366
10057g6253b0455j09766B60625N3138A55936L9860b32695A17698e0115C28681
10046d89358b7371B55403j14035b91667a23541m9520B02067d9706A6767f7890
$$ y = [-212400, -124666, 96158, 47360, -24249, 97882, 250317, -28607, 102544, -219360, -229414, -68524, -70438, -501492, -175535, 162603, -114241, -15385, -51233, -154755, 93315, -6616, 166318, 59871, 249863, 49111, 101985, 115057, -293860, -228452, -149895, -78305, 12540, -491318, 119372, -55923, -320014, -41800, -97751, 58536, -101497, -282931, -133309, -5390, -100243, -2715, -115001, -177330, -72422, 82578, -276221, 25850, 127773, -229364, -335732, -39060, 112258, -17345, -171331, 76317, -122734, -395567, -143939, -245156, 158927, -293028, -154703, -35887, -76253, -20455, -130221, 260625, 313763, 155936, 195796, -232695, 117698, -50115, 328681, -489358, -27371, 255403, 141368, -291667, -123541, -173061, 202067, -49706, 16767, -67890]
10035A30999b7815H6747a51464A24910b07444o9006a0266H6312b61976h6926o5103
10024a52029j03784A09815c3919j01711N1353A21112B8456A0b12471A00379E025
10012F196a83632m6132k07200I235b68078O0625a00925c8964n6710A02392b15600
10000c94883a12012B3987b7367j04810A62702b79808A02404b22334A02337a76623
9989a77879I203g7572j51723N0109b3535p3887C120Q7979a35847a1701o8708j00889
9977a81298m8119B93111a16454k31397B92618c05070M7170d0765G3893l4883b60459
9965b22219B08499a72457M9356j64753e9266B2928M20564b59917C7342f8948K3284
9954d5664g236H9691R9215p6180J26938G5483c0630k34214K8492b4269I7088m3675
$$ y = [130999, -27815, 86747, -151464, 124910, -207444, -276450, -10266, 86312, -261976, -86926, -152029, -255813, 109815, -33919, -135630, -84277, 121112, 28456, 10, -212471, 100379, 5025, 6196, -183632, -229764, -436964, 9235, -268078, -207453, -100925, -38964, -95674, 102392, -215600, -394883, -112012, 23987, -27367, -132177, 162702, -279808, 102404, -222334, 102337, -176623, -177879, 9203, -77572, -229295, -179186, -23535, -97422, 3120, 91099, -135847, -11701, -80409, -181298, -229417, 293111, -116454, -347851, 292618, -305070, -257900, -40765, 73893, 39010, -260459, -222219, 208499, -172457, -123101, -287854, -59266, 22928, 443492, -259917, 37342, -68948, -45664, -7236, 89691, 188906, 112726, 239664, 75483, -30630, -264844, -236352, -24269, 97088, 53413]
9942E3413P2254f2198j03194J2684B61829o320B6062K7726e5371r4036A86464
9930a82641G5427J15121b0364k95669e3780B4702a18969r8786E6739b72084a11934
9918C3126L13091f334j42428A98530n9308b30752a10716A83233a59210j55788
9908c14998C9173d16075K01757G4169J2692g5323J6177A51211D6254b4921m37661
9897d62582g8362b2841l08177a0697k26460b6839A26021E5139b20162B8671R016
9886C7687A4838J4107P1880l8254K4660c17235B33393a75362O5772l783p5327
9875a88700l4454J0103j24731b3964A78238H5701a32656q607O1985D9512R5829
9864A45341o1964a09421i603j96458E5307a5614A01927B7431J02473b50394P9988
$$ y = [53413, 125667, -62198, -165392, -152708, 261829, 255509, 26062, 53788, -55371, -149407, 186464, -182641, 75427, 190548, -20364, -316033, -53780, 24702, -118969, -217755, 56739, -272084, -111934, 33126, 346217, -6334, -148762, 198530, 139222, -230752, -110716, 183233, -159210, -314998, 39173, -416075, -214318, 74169, 86861, -75323, -59146, 151211, 46254, -24921, -462582, -78362, -22841, -331018, -10697, -237157, -26839, 126021, 55139, -220162, 28671, 37687, 14838, 28945, 100825, 62571, 87231, -317235, 233393, -175362, -109590, -113373, -188700, -223154, -213051, -337782, -23964, 178238, 85701, -132656, -141263, -79278, 49512, 145341, 83377, -109421, -9603, -206061, 55307, -15614, 101927, 27431, 129904, -250394, -170406]
9853a70406j06686a38373O4721A20065a28837e7942j71654J03683e8662A37933
9842A0596N9011b16520A6390b52111j07308J16423A1760h3612E8771i1396M1730
9831d9666p4334B7374a76159B726K5488K14600a85100j10632C5127L795K27300
9820B66222a72263K6490n7574j0503k5870K5720i9572k18979a24874B37511j6925
9809B20586b47649C6512L11139b6106O93r4562B30180B2879b38649g3592A15307
9797A552b16444B2923J21877b98675r6662a56370A26334b5035m18132A02243B5323
9785b41631G1651j0628C0359a08340l0811j97927J30660N2161b8062r2100B6062
9773c96767b6603D3425a0887b43j10349A43548a91274A67204k4748A3271e4756
$$ y = [-170406, -277092, -138373, -73652, 120065, -128837, -57942, -229596, -125913, -58662, 137933, 10596, 69607, -216520, 16390, -252111, -359419, -242996, 11760, -83612, 58771, -91396, -49666, -124000, 27374, -176159, 2726, 28214, 242814, -185100, -295732, 35127, 38922, 266222, -172263, -145773, -203347, -213850, -239720, -214000, -99572, -318551, -124874, 237511, 220586, -247649, 36512, 347651, -26106, -25413, -119975, 230180, 22879, -238649, -73592, 115307, 1552, -216444, 22923, 144800, -298675, -395337, -156370, 126334, -25035, -443167, 102243, 25323, -241631, 71651, 61023, 30359, -108340, -139151, -337078, -206418, -154257, -28062, -120162, 26062, -396767, -26603, 43425, -10887, -243, -110592, 143548, -191274, 167204, 142456, 13271, -54756]
9761f6257k40854B75652b27589d2019m2747K5819A79789a415j52913q0551J03625
9750a31254k78730j83693c7095E8470P5322K2998b97653a19626D7167D473b17202
9738a5079k38143d8145C2253d5791j16423A14984d06973A80090i6433L3541B14186
9726a70501N6608f238j64436B4699b11954c7648a1319m7030H6109a43607C14624
9714c17728A87647K0138l556b8195A70365i0132E625a52936P0944c0734a4246
9702A16960m0413a34585k4624A02164O5181a49393j76626A23408a94031I467K54732
9691B64199E9332a55315P2241l0138k18418A94568H464a34112j61993D2248a30539
9679e8014l166K2877D4327n438a91417n998A02419a99201j06912a40782B370L3094
$$ y = [-66257, -307111, 275652, -227589, -42019, -84766, -58947, 179789, -1415, -154328, -234879, -131254, -409984, -593677, -37095, 58470, 133792, 156790, -297653, -119626, 47167, 4473, -217202, -15079, -253222, -48145, 32253, -45791, -162214, 114984, -406973, 180090, -96433, -62892, 214186, -170501, -113893, -6238, -170674, 24699, -211954, -37648, -11319, -58349, 86109, -143607, 314624, -317728, 187647, 207785, 204229, -28195, 170365, -90132, 5625, -152936, -81992, -30734, -14246, 116960, 76547, -134585, -159209, 102164, 167345, -149393, -326019, 123408, -194031, 9467, 264199, 59332, -155315, -83074, -113212, -331630, 194568, 8464, -134112, -296105, 42248, -130539, -58014, -61180, -38303, 44327, 38889, -191417, -197415, 102419, -199201, -306113, -140782, 2370, 35464]
9667C5464a68643A09140g8465j45046A33944J20059a38277J1271d6715j33275
9657a79990N485C01977f2146k954n4507A81795c69744O8767r1181A50603L70367
9646E20970a52972a0308D2031d5924A54793b3460l7774C2281N962b75237I3482
9634b58620J09248k4322A05600a6383l34372r2909e2184K0928A65631g2205C42818
9622A2763P1879d5426E9573a64800n7043j16335g9191A10398a56531a9112m6028
9611f5140k17860D2509c30500D3992a11663B7788h5263b8431r8240k2725i026
9599e2121j7705A5852L64272d03141n7293C23154h5621j48609j26163J08861N7338
9588a94194e8586k3779J5368p0148C48900q5562F7598c19624B9436a92972n2930
$$ y = [35464, -168643, 109140, -78465, -223511, 133944, 254003, -138277, -127006, -46715, -179990, -174505, 301977, -62146, -65100, -119607, 181795, -369744, -300977, -392158, 150603, 520970, -152972, -10308, 42031, -45924, 154793, -23460, -61234, 32281, 38243, -275237, 93482, -258620, -149372, -173694, 105600, -16383, -350755, -443664, -52184, -31256, 165631, -72205, 342818, 12763, 84642, -45426, 59573, -164800, -221843, -338178, -79191, 110398, -156531, -19112, -65140, -283000, 42509, -330500, 43992, -111663, 27788, -85263, -28431, -126671, -149396, -9026, -52121, -69826, 15852, 380124, -403141, -460434, 323154, -85621, -234230, -360393, -251532, -194194, -58586, -82365, -66997, -137145, 348900, 263338, 67598, -319624, 29436, -192972, -245902]
9577b45902A77678d08544a03055j08972h0890j53532J0165q5080J49918f3130
9566c05565J08678C18569f1026D4297b28091L7261B39918c05356D7037a38520
9555I7023b62521E6024K89194i0835a5873o3346j319A1931a95459m138C60702
9543C2113K36965A67a84262B2148a94406C122f4797j87122B3773J18569c1220
9531b82493I9835a13820E889K22393a70095e6408k73843I5446a40648E0027C646
9519b97948C1540P5887r659c81164m4510j01244b1668p0653n4166A73400c88808
9507B8066i3120E7229J74542b38315j41572a11133d2699G8473j1400J28319D0234
9495B53210b8591O864F2865a99878J0388N922P5891j19162A943c45937g1012p2495
$$ y = [-245902, 177678, -408544, -103055, -212027, -80890, -234422, -224257, -309337, -159419, -63130, -305565, -196887, 318569, -61026, 44297, -228091, -190830, 239918, -305356, 47037, -138520, 97023, -262521, 56024, 345218, -90835, -15873, -79219, -80538, 11931, -195459, -199597, 360702, 32113, 269078, 167, -184262, 22148, -194406, 3122, -64797, -251919, 23773, 142342, -31220, -282493, 99835, -113820, 5889, 228282, -170095, -56408, -330251, 95446, -140648, 50027, 3646, -297948, 31540, 107427, 97768, -381164, -425674, -526918, -21668, -92321, -146487, 173400, -388808, 28066, -93120, 57229, 231771, -238315, -379887, -111133, -42699, 78473, 67073, 195392, 40234, 253210, -28591, -21727, 62865, -199878, -189490, -183568, -107677, -226839, 1943, -345937, -71012, -143507]
9483a43507C7696n72B986a53066A6619c10183a5759A3221f4113M968k49306B87456
9470a35716J7816B55215b11124I724d63202B05349b07321O1863B4615i5149j14234
9459b09383L91l5265H000J53565b8745J1377E1275L3966a08678A78699o1316C929
9446c49335a21814M4676o2005J4545c7293k91180H7060r970e2988G0480a47519
9434H5387k4656K7412g238H1611l3591d4151j25459A04114c07247G8216O0820
9423A39036D4241A9764d08329A83124M2417a45368p4582B33211E3555M8545B0414
9411b70292o6587A70637D1212a16602A6776a16154N432C9580a7291A5571K18720
9400B34291b56647G1063a40943O2757a6283m0168k30178G5611e9485l3205r9705
$$ y = [-143507, 37696, 37124, 2986, -153066, 16619, -310183, -15759, 13221, -64113, -59145, -308451, 287456, -135716, -117900, 255215, -211124, 9724, -463202, 205349, -207321, -145458, 24615, -95149, -209383, -208992, -244257, 8000, 161565, -28745, -17368, 51275, 85241, -108678, 178699, 117383, 3929, -349335, -121814, -77138, -139143, -124598, -37293, -328473, 87060, 77090, -52988, 70480, -147519, 85387, 60731, 88143, -7238, 81611, 48020, -44151, -169610, 104114, -307247, 78216, 139036, 44241, 19764, -408329, 183124, 225541, -145368, -219950, 233211, 53555, 102100, 20414, -270292, -336879, 170637, 41212, -116602, 16776, -116154, -110722, 39580, -17291, 15571, 234291, -256647, 71063, -140943, -78186, -16283, -56451, -286629, 75611, -59485, -92690, -192395]
9389a92395r6175D33084d30764a02388d0205q2685j42092a25803A2886a62669
9378b06623q0437A85596a6584k96516Q2050R2383A57508F7481c07752l6112e7903
9366B68242a86884r2779f3963j05978G0353b13414b9836A63907d16586a75182
9355I5105b7480I7364i8297A5752L8291f0136A47875a37659j01887k35076a95689
9343I944K23781a72532E1668O0583c32317a6501j12759C66804j82470H6503a54087
9331c5966k99199a61845A62649F464J43220a52106C2115b47763J14681n5302K2226
9320a66158j16803N8404c3679A52704n1038K9646l0624a9303j93517d3046I4619
9308a99881B30277c30117M7662J19365A54780J70477g0869n1961J7138I8326a36948
$$ y = [-192395, -288570, 433084, -430764, -102388, -40205, -122890, -264982, -125803, 12886, -162669, -206623, -287060, 185596, -16584, -313100, -231050, -138667, 157508, 67481, -307752, -343864, -57903, 268242, -186884, -279663, -63963, -169941, 70353, -213414, -29836, 163907, -416586, -175182, 95105, -27480, 97364, -98297, 15752, 54043, -60136, 147875, -137659, -239546, -474622, -195689, 9944, 233725, -172532, 51668, 112251, -332317, -16501, -129260, 366804, 184334, 86503, -154087, -35966, -335165, -161845, 162649, 6464, 149684, -152106, 32115, -247763, -133082, -188384, -166158, -282961, -224557, -33679, 152704, 101666, 131312, 100688, -19303, -212820, -43046, 94619, -199881, 230277, -330117, -282455, -163090, 154780, 325257, -70869, -122830, -105692, 98326, -136948]
9296a13118E4987e3718j77110I6151J9649b747k09670B43903a86935Q403g192
9284a02131K8722K4297n0992q7813Q0658d5174j68945i0156d1043a5099C1355
9272A41458e02184E2504q544R3303J84830I5113J13770b46883h4112A09211a63569
9260g7948m7982k3153M9224c5523l8264j15477A8509b53879N3044k10598b5685
9248e04282A3232b01746H2942b21168C60109b31861O6801f0822a4119l3900B6037
9236I941b0287j7684j06408B54921b275j10865j46A69948b28219J04892O0273
9225f3054C35221a28269C38042g0203m5978A15184j87C4813J6927a23368b5910
9213i9605D2817K44347d50976E00a05537b6192k78911J40701l39919b49003E8987
$$ y = [-113118, 54987, -53718, -230828, 96151, 115800, -2747, -212417, 243903, -186935, -178532, -7192, -102131, -73409, -49112, -100104, -187917, -107259, -45174, -214119, -90156, -41043, -15099, 31355, 141458, -502184, 52504, 43960, 137263, 322093, 95113, 208883, -246883, -84112, 109211, -163569, -77948, -125930, -149083, -99859, -35523, -73787, -189264, 18509, -253879, -200835, -411433, -25685, -504282, 13232, -201746, 82942, -221168, 360109, -231861, -165060, -60822, -14119, -48019, 26037, 9941, -20287, -37971, -144379, 254921, -2275, -113140, -113286, 169948, -228219, -123327, -63054, 335221, -128269, 338042, -70203, -116181, 115184, 114997, 34813, 51740, -123368, -25910, -99605, 42817, 287164, -450976, 500, -105537, -26192, -305103, -164402, -504321, -249003, 58987]
9201b47635K9042F8990j4662j5585L5918b59749o581A93068O8828l1447r0484
9190A39965m4840l1394a29965o3326J8884A32275J20073I5249m4797K07402C22
9178a55804f0902A47401e1006j86197J12929d0686j76842B05141H367h1861A15232
9166C6069h3447K427d52n2373j41058i3330K9458G4296C3558h7392m8084L6840
9154i8636j04113B05185a3671A72743b4556G269b03357m6938h6948k17648a08356
9142i1553H7117K6845b98468c2405M583o7911k41240A41858d16803k3834a34240
9130A99606A2398f7337F5931J39744c1317A35011k553a022k62832h5840J5411
9119g0429I9859l9333O1396B2732g6332r3821C0166b0609p0112k34869D2436J11375
$$ y = [-247635, -218593, 68990, 54328, 38743, 74661, -259749, -266330, 193068, 261896, 230449, 139965, 95125, 63731, -129965, -193291, -174407, 132275, 252348, 95249, 50452, 257854, 322, -155804, -60902, 147401, -51006, -237203, -124274, -40686, -217528, 205141, 8367, -81861, 115232, 36069, -83447, -81020, -452, -52825, -193883, -93330, -63872, 74296, 33558, -87392, -135476, -98636, -202749, 205185, -13671, 172743, -24556, 7269, -203357, -250295, -86948, -304596, -108356, -91553, 87117, 113962, -298468, -32405, -27822, -95733, -336973, 141858, -416803, -440637, -134240, 199606, 12398, -67337, 65931, 205675, -31317, 135011, 132458, -1022, -263854, -85840, -70429, 99859, 60526, 121922, 22732, -76332, -170153, 30166, -20609, -90721, -325590, 42436, 153811]
9107A53811f4210A23474P0402i4253j09630f2477k66383a6150j22061m4762Q1926
9096a01047j35693f9332l6928j60178A15052D1047b87004A4316a4534j14043A30359
9084A05156a04921p6470E0529c06386A11661j8450j7310b18385Q4063j9589j96583
9073c50494C8999a20457p0257J1624B15321H9096j6494a1328j85513l8106A49168
9061b54834B6816M7169a49485l4649A17584a22693A77612a4074p5091k9476B47586
9049a94629a5119D145J95129c4495A54401B9046b9788A8291c26727a35537A652
9037G724a10312A49171A342a69617C51516a56449b3884j67000F1281L1512D6069
9025b29356B26032d5205A01072b6566l2924j19492C33561E7935R5956A7392J05219
$$ y = [153811, -64210, 123474, 193876, -94253, -203883, -62477, -328860, -16150, -138211, -182973, -101047, -236740, -69332, -106260, -266438, 115052, 41047, -287004, 14316, -14534, -128577, 130359, 105156, -104921, -181391, 50529, -306386, 111661, 93211, 75901, -218385, -134322, -153911, -350494, 38999, -120457, -190714, -179090, 215321, 89096, 72602, -11328, -196841, -234947, 149168, -254834, 26816, 73985, -149485, -184134, 117584, -122693, 177612, -14074, -89165, -118641, 247586, -194629, -15119, 4145, 199274, -34495, 154401, 29046, -29788, 18291, -326727, -135537, 1652, 7724, -110312, 149171, 1342, -169617, 351516, -156449, -23884, -190884, 61281, 92793, 46069, -229356, 226032, -45205, 101072, -26566, -59490, -178982, 333561, 57935, 153891, 17392, 122611]
9014A22611a64306B650b10138g369j92260B62447c43434F4643a96377r0265M2740
9003b43902J13451D92654A58753D834a22864A94296F8572c56937B49377c90030
8992I892d0939A14496b43379C8579a69278e6245A53667b00565c7040j39825A62943
8980d63505d8360r1894a9797B8903a61522o0362R52J990A20220b52795F5844a33975
8967d7691q5732A32570m1721O5653B9725g7738E00a64895k19831F976d9906B48769
8954b51037D6794R641j6096g9772p9310I8097b71620E1260b10525p2265G8587
8942B99212B1435K701b4503B23565a20670A48596N252K77975M9820k10203A15349
8930a6225A3793J13669a91358C09006c0402B66823Q00866P85481L078446R031938
$$ y = [122611, -164306, 2650, -210138, -7369, -199629, 262447, -343434, 64643, -196377, -286642, -243902, -130451, 492654, 158753, 4834, -122864, 194296, 68572, -356937, 249377, -390030, 9892, -40939, 114496, -243379, 38579, -169278, -56245, 153667, -200565, -37040, -176865, 162943, -463505, -48360, -140254, -19797, 28903, -161522, -221884, -220932, -218942, 120220, -252795, 65844, -133975, -47691, -133423, 132570, 90849, 156502, 29725, -77738, 500, -164895, -384726, 6976, -49906, 248769, -251037, 46794, 56435, 40339, -79772, -159082, 98097, -271620, 51260, -210525, -282790, 78587, 299212, 21435, 24136, -24503, 223565, -120670, 148596, 153848, 431823, 481643, 271440, 115349, -16225, 13793, 127462, -191358, 309006, -30402, 266823, 1067689, 1853170, 4931616, 13963554]
8920A3963554F653380B326189A157060m78122l23443p8920f1671K9394A98245
8910B8846f0467A8927a0560A40900e7772I1239C7701g4292j78430n6725i4821
8898b07428A03553c0502E0934J910b91885L1995j07663F3821P7385d52374e6324
8886B06812h5088F5847a14058D7162J43212E8444J27780c56112I1149a35838B54556
8874A54678a50363E7450k8616g9855C5295N3156c76336C951a40907B43851G195
8862E3589a58088j11335j47331J99614K5118h0515j84418e6958G8303H017b20723
$$ y = [13963554, 6653380, 2326189, 1157060, 678938, 355495, 276575, -61671, -32277, 198245, 28846, -60467, 18927, -10560, 140900, -57772, 91239, 37701, -74292, -252722, -309447, -94821, -207428, 103553, -30502, 50934, 52844, -291885, -259890, -367553, 63821, 141206, -452374, -56324, 206812, -85088, 65847, -114058, 47162, 190374, 58444, 186224, -356112, 91149, -135838, 254556, 154678, -150363, 57450, 28834, -79855, 35295, 88451, -376336, 3951, -140907, 243851, 7195, 53589, -158088, -269423, -416754, -217140, -192022, -80515, -264933, -56958, 78303, 8017, -220723]
$$ [...]
##END NTUPLES=NMR SPECTRUM
##END=
