
##TITLE=AC1302_PERAH12114_7525498_Bu7zzF2CVs
##JCAMPDX= 6.0         $$ Bruker NMR JCAMP-DX V2.0
##DATA TYPE= NMR SPECTRUM
##DATA CLASS= NTUPLES
##ORIGIN= BRUKER
##OWNER= Administrator
$$ 1.72 TOPSPIN		Version 2.1
$$ 2013-02-20 03:20:32.273 -0500  Administrator@X
$$ Compression mode = diff/dup
##.OBSERVE FREQUENCY= 400.02188249412
##.OBSERVE NUCLEUS= ^1H
##.ACQUISITION MODE= SIMULTANEOUS (DQD)
##.ACQUISITION SCHEME= undefined
##.AVERAGES= 64
##.DIGITISER RES= 22
##SPECTROMETER/DATA SYSTEM= spect
##.PULSE SEQUENCE= noesygpps1d.comp
##.SOLVENT NAME= COFFEE_meoh
##.SHIFT REFERENCE= INTERNAL, COFFEE_meoh, 1, 14.96123
##AUDIT TRAIL= $$ (NUMBER, WHEN, WHO, WHERE, PROCESS, VERSION, WHAT)
$$ ##TITLE= Audit trail, TOPSPIN		Version 2.1
$$ ##JCAMPDX= 5.01
$$ ##ORIGIN= Bruker BioSpin GmbH
$$ ##OWNER= Administrator
$$ $$ E:\/data/COFFEE/nmr/AC1302_PERAH12114_7525498_Bu7zzF2CVs/22/pdata/1/auditp.txt
$$ ##AUDIT TRAIL=  $$ (NUMBER, WHEN, WHO, WHERE, PROCESS, VERSION, WHAT)
(   1,<2013-02-20 03:20:26.227 -0500>,<Administrator>,<X>,<go>,<TOPSPIN 2.1>,
      <created by zg
	started at 2013-02-20 03:08:56.381 -0500,
	POWCHK enabled, PULCHK disabled,
       configuration hash MD5:
       86 BA 57 50 F2 9D 5C 9B 26 00 A9 28 5F 66 2E 89
       data hash MD5: 64K
       60 D2 AA A0 A3 78 B4 1E 29 77 79 B8 05 A4 92 04>)
(   2,<2013-02-20 03:20:29.367 -0500>,<Administrator>,<X>,<proc1d>,<TOPSPIN 2.1>,
      <Start of raw data processing
       efp LB = 0.3 FT_mod = 6 PKNL = 1 PHC0 = 0 PHC1 = 0 SI = 128K 
       data hash MD5: 128K
       04 B6 09 FC 63 C4 62 D8 F1 FE 66 7B 0A 8E 81 55>)
(   3,<2013-02-20 03:20:30.414 -0500>,<Administrator>,<X>,<proc1d>,<TOPSPIN 2.1>,
      <pk PHC0 = 255.5804 PHC1 = 0 
       data hash MD5: 128K
       32 0E 59 2B 4F 7B B3 C4 8F 3C 8C 98 82 EA D0 B4>)
(   4,<2013-02-20 03:20:31.102 -0500>,<Administrator>,<X>,<proc1d>,<TOPSPIN 2.1>,
      <abs ABSG = 1 
       data hash MD5: 128K
       F8 F1 6A C7 94 C7 C1 86 74 8B 0E 58 B8 48 43 8B>)
(   5,<2013-02-20 03:20:31.398 -0500>,<Administrator>,<X>,<proc1d>,<TOPSPIN 2.1>,
      <abs ABSG = 2 
       data hash MD5: 128K
       E2 0A 97 81 8B F2 B1 95 73 CC A0 F2 49 07 D3 88>)
(   6,<2013-02-20 03:20:31.570 -0500>,<Administrator>,<X>,<proc1d>,<TOPSPIN 2.1>,
      <abs ABSG = 3 
       data hash MD5: 128K
       91 C1 77 46 5F DE 58 12 4C 6C AC F2 1E 9B 8C 72>)
(   7,<2013-02-20 03:20:31.742 -0500>,<Administrator>,<X>,<proc1d>,<TOPSPIN 2.1>,
      <abs ABSG = 4 
       data hash MD5: 128K
       A5 32 17 BA 38 EC 0F C6 14 72 1C 26 C6 23 31 7B>)
(   8,<2013-02-20 03:20:31.930 -0500>,<Administrator>,<X>,<proc1d>,<TOPSPIN 2.1>,
      <abs ABSG = 5 
       data hash MD5: 128K
       04 21 31 EE 4F F1 4C 06 40 12 81 64 FF 3B A5 9D>)
$$ ##END=
$$ 
$$ $$ hash MD5
$$ $$ E4 03 EB 34 AA 9B D9 68 E0 39 36 34 5E A5 FB 6D
##$RELAX= 
##$RELAX= 
##$RELAX= 
##$RELAX= 
##$RELAX= 
##$RELAX= 
##$RELAX= 
##$RELAX= 
$$ Bruker specific parameters
$$ --------------------------
##$DU= <E:\>
##$EXPNO= 22
$$ [...]
150 150 150 150 150 150 150 150
##$TP07= 0
##$TPNAME0= <>
##$TPNAME1= <>
##$TPNAME2= <>
##$TPNAME3= <>
##$TPNAME4= <>
##$TPNAME5= <>
##$TPNAME6= <>
##$TPNAME7= <>
##$TPOAL= (0..7)
0.5 0.5 0.5 0.5 0.5 0.5 0.5 0.5
##$TPOFFS= (0..7)
0 0 0 0 0 0 0 0
##$TUNHIN= 0
##$TUNHOUT= 0
##$TUNXOUT= 0
##$USERA1= <user>
##$USERA2= <user>
##$USERA3= <user>
##$USERA4= <user>
##$USERA5= <user>
##$V9= 5
##$VALIST= <valist>
##$VCLIST= <CCCCCCCCCCCCCCC>
##$VD= 0
##$VDLIST= <DDDDDDDDDDDDDDD>
##$VPLIST= <PPPPPPPPPPPPPPP>
##$VTLIST= <TTTTTTTTTTTTTTT>
##$WBST= 1024
##$WBSW= 4
##$XGAIN= (0..3)
0 0 0 0
##$XL= 0
##$YL= 0
##$YMAX_a= 6357460
##$YMIN_a= -10182077
##$ZGOPTNS= <>
##$ZL1= 120
##$ZL2= 120
##$ZL3= 120
##$ZL4= 120
##$ABSF1= 14.96123
##$ABSF2= -5.596951
##$ABSG= 5
##$ABSL= 3
##$ALPHA= 0
##$AQORDER= 0
##$ASSFAC= 0
##$ASSFACI= 0
##$ASSFACX= 0
##$ASSWID= 0
##$AUNMP= <proc_prof1d_extract.lims>
##$AXLEFT= 0
##$AXNAME= <>
##$AXNUC= <1H>
##$AXRIGHT= 0
##$AXTYPE= 0
##$AXUNIT= <>
##$AZFE= 0.1
##$AZFW= 0.1
##$BCFW= 0
##$BC_mod= 0
##$BYTORDP= 0
##$COROFFS= 0
##$CY= 15
##$DATMOD= 1
##$DC= 0
##$DFILT= <>
##$DTYPP= 0
##$F1P= 0
##$F2P= 0
##$FCOR= 0.5
##$FTSIZE= 131072
##$FT_mod= 6
##$GAMMA= 0
##$GB= 0
##$INTBC= 1
##$INTSCL= 1
##$ISEN= 128
##$LB= 0.3
##$LEV0= 0
##$LPBIN= 0
##$MAXI= 10000
##$MC2= 0
##$MEAN= 0
##$ME_mod= 0
##$MI= 0
##$NCOEF= 0
##$NC_proc= -2
##$NLEV= 6
##$NOISF1= 0
##$NOISF2= 0
##$NSP= 0
##$NTH_PI= 0
##$NZP= 0
##$OFFSET= 14.96123
##$PC= 1
##$PHC0= 255.5804
##$PHC1= 0
##$PH_mod= 1
##$PKNL= yes
##$PPARMOD= 0
##$PPDIAG= 0
##$PPIPTYP= 0
##$PPMPNUM= 2147483647
##$PPRESOL= 1
##$PSCAL= 4
##$PSIGN= 0
##$PYNMP= <proc.py>
##$REVERSE= no
##$SF= 400.020009544092
##$SI= 131072
##$SIGF1= 0
##$SIGF2= 0
##$SINO= 400
##$SIOLD= 131072
##$SPECTYP= <>
##$SREGLST= <1H.CDCl3>
##$SSB= 0
##$STSI= 131072
##$STSR= 0
##$SW_p= 8223.68421052631
##$SYMM= 0
##$S_DEV= 0
##$TDeff= 65536
##$TDoff= 0
##$TI= <>
##$TILT= no
##$TM1= 0
##$TM2= 0
##$TOPLEV= 0
##$USERP1= <user>
##$USERP2= <user>
##$USERP3= <user>
##$USERP4= <user>
##$USERP5= <user>
##$WDW= 1
##$XDIM= 131072
##$YMAX_p= 411601014
##$YMIN_p= -12042
##$CURPLOT= <Network HP LaserJet P1505>
##$CURPRIN= <$Network HP LaserJet P1505>
##$DFORMAT= <normdp>
##$LAYOUT= <+/1D_H.xwp>
##$LFORMAT= <normlp>
##$PFORMAT= <normpl>
##$SURQMSG= 1
$$ End of Bruker specific parameters
$$ ---------------------------------
##NTUPLES= NMR SPECTRUM
##VAR_NAME=  FREQUENCY,     SPECTRUM/REAL,   SPECTRUM/IMAG
##SYMBOL=    X,             R,               I
##VAR_TYPE=  INDEPENDENT,   DEPENDENT,       DEPENDENT
##VAR_FORM=  AFFN,          ASDF,            ASDF
##VAR_DIM=   131072,        131072,          131072
##UNITS=     HZ,            ARBITRARY UNITS, ARBITRARY UNITS
##FACTOR=    0.0627417313425164, 1,          1
##FIRST=     8223.62146879497, -171,         -63166
##LAST=      0,             1676,            -63589
##MIN=       0,             -12042,          0
##MAX=       8223.62146879497, 411601014,    0
$$ Real data points
##PAGE= N=1
##DATA TABLE= (X++(R..R)), XYDATA
$$ [...]
61692D71555k001k399k916l266l306l213l280l474l372k766k135k112k643l045
61678D31627k967k709k560k434k324k494k871k824k055j240j214j827k204j943
61664C99961j430j056p17j41O17J190J194N74k09m41J67J195K030K477K639K566
61648D10616K337K253K548L058L484L799M112M307M207L875L428K735J665L73
61634D52797r34k285l563m212l884l133k830l066l278l326l609m108m159l445
61620D06965k541k092k010j876j626j385j038n13k31p93k142l479m050l900l751
61605C75538m157m852n073m543l864l638l566k985k125j989k806l468l029k102
61591C27341j941k555k697j709m25P0j60k98p9J0l98j122j865k461k600j908o27
$$ plain form
61692 471555 469554 467155 464239 460973 457667 454454 451174 447700 444328 441562 439427 437315 434672 431627
61678 431627 428660 425951 423391 420957 418633 416139 413268 410444 408389 407149 405935 404108 401904 399961
61664 399961 398531 397475 396758 396617 397234 398424 399618 400192 399983 399542 399709 400904 402934 405411 408050 410616
61648 410616 412953 415206 417754 420812 424296 428095 432207 436514 440721 444596 448024 450759 452424 452797
61634 452797 451863 449578 446015 441803 437919 434786 431956 428890 425612 422286 418677 414569 410410 406965
61620 406965 404424 402332 400322 398446 396820 395435 394397 393884 393653 392860 390718 387239 383189 379289 375538
61605 375538 371381 366529 361456 356913 353049 349411 345845 342860 340735 338746 335940 332472 329443 327341
61591 327341 325400 322845 320148 318439 318014 318084 317924 317626 317547 317557 317159 316037 314172 311711 309111 307203 306576
61574C06576K49K9q35j360j219p51j18P90J623J608N96n67j082j018p53k37N97
61557C04128J219J079N06L37P39J086R27M90J59N7J91M97O81N00K88P12J813K789
61539C18198K957K524K179K258K576K790K659K070J128J26o78j150j218q69l24
61524C35226O2Q9j99o78j181j447j324j053j003j120r86m71R4M85R22J531J914
61507C30861J603P60J2l11m34o76j013j253j385j543j601j100J53J507J920J213
61491C28713L91L85R00J007O14M75Q40J005M77k13l58q5J12L36R95J841K079J483
61473C40997P39M94O16N89K72l8n7K47P09J124J371J520J682J740J415P47K57
61456C54424M22J019J296P92j43p83q37o38o06o75m07L80J233J436P83j35m86
$$ plain form
61574 306576 306825 306854 306019 304659 303440 302689 302571 303361 304984 306592 307188 306621 305539 304521 303768 303531 304128
61557 304128 305347 306426 306932 307269 308008 309094 310021 310511 310670 310727 310918 311415 312096 312596 312884 313596 315409 318198
61539 318198 321155 323679 325858 328116 330692 333482 336141 338211 339339 339465 338787 337637 336419 335550 335226
61524 335226 335288 335377 335178 334500 333319 331872 330548 329495 328492 327372 326386 325915 326009 326494 327416 328947 330861
61507 330861 332464 333224 333236 332925 332491 331815 330802 329549 328164 326621 325020 323920 324073 325580 327500 328713
61491 328713 329104 329489 330389 331396 332010 332485 333325 334330 334807 334594 334236 334151 334263 334599 335594 337435 339514 340997
61473 340997 341736 342230 342846 343435 343707 343669 343612 343859 344568 345692 347063 348583 350265 352005 353420 354167 354424
61456 354424 354846 355865 357161 357953 357810 357027 356190 355552 354946 354271 353864 354244 355477 356913 357696 357561 357075
61439C57075j6P98J342J451J378J401J635K046K513K889L146L278L017K034O32
61424C84619j17M65J709K345K080J735J897K241K309K094J556M17j039j812j444
61409C99055p95q14j175j018m97n29j203j584j169n69n15r32j309j414j313j110
61393C83109q88o92n07m04n15o34k27O75J104L84o37n64N63J313R40K83L34J006
61375C84643J773K605L542M098L789K851J913J295J036J189J612J852J650J371
61361D15219J608K589M081N541O251N816M780M313N055O513P765Q314Q188P668
61347D93701P023O169M716K833J752K422L842M043K781J857K303K874K120N42
61333E38978n24j024j820l004l948m490m774m475l442k605k913l740l707k805
$$ plain form
61439 357075 357059 357857 359199 360650 362028 363429 365064 367110 369623 372512 375658 378936 381953 383987 384619
61424 384619 384502 384967 386676 389021 391101 392836 394733 396974 399283 401377 402933 403350 402311 400499 399055
61409 399055 398260 397446 396271 395253 394756 394227 393024 391440 390271 389702 389187 388255 386946 385532 384219 383109
61393 383109 382221 381529 381022 380618 380103 379469 379242 379917 381021 381405 380768 380204 380767 382080 383020 383303 383637 384643
61375 384643 386416 389021 392563 396661 400450 403301 405214 406509 407545 408734 410346 412198 413848 415219
61361 415219 416827 419416 423497 429038 435289 441105 445885 450198 455253 461766 469531 477845 486033 493701
61347 493701 500724 506893 511609 514442 516194 518616 522458 526501 529282 531139 533442 536316 538436 538978
61333 538978 538454 537430 535610 532606 528658 524168 519394 514919 511477 508872 505959 502219 498512 495707
61319D95707k285k536k580j791o61L95J702L303M492M911N261O256P638Q714R306
61304E37832R742J0354J1215J1890J1403R140N914L365K166J548O83m16j559k915
61290F10362m360n220n266n204n608o051n902n310m744m209l585l129k909k263
61276E46602p33R37J584J158O68Q08J447K223K870K938K189J327J605L417N853
61261E74893P873R204R932R901R099Q099P473P034O235N082L978K703M32k839
61247F59099n607o352n424m684n267o556p395p472p053o206n099m483m880n623
61233E76998n581m714l889l264k016P7J918K554K430K496K833K964K966L330M058
61218E83160M659M958N177N362N366N272N310N307M899M191L691L547L432L240
$$ plain form
61319 495707 493422 490886 488306 486515 485854 486249 487951 491254 495746 500657 505918 512174 519812 528526 537832
61304 537832 547574 557928 569143 581033 592436 601576 607490 610855 613021 614569 615252 614836 613277 610362
61290 610362 606002 600782 595516 590312 584704 578653 572751 567441 562697 558488 554903 551774 548865 546602
61276 546602 545869 546806 548390 549548 550216 551024 552471 554694 557564 560502 562691 564018 565623 569040 574893
61261 574893 582766 591970 601902 611803 620902 629001 636474 643508 649743 654825 658803 661506 661938 659099
61247 659099 653492 647140 641716 637032 631765 625209 617814 610342 603289 597083 591984 587501 582621 576998
61233 576998 571417 566703 562814 559550 557534 557611 559529 562083 564513 567009 569842 572806 575772 579102 583160
61218 583160 587819 592777 597954 603316 608682 613954 619264 624571 629470 633661 637352 640899 644331 647571
61204F47571L373M093N125O115P098Q233R415J0501J1703J3295J5022J6152J6260
61191G73956J5665J4838J3605J1317P971M640K459J421O08n27j724k736l826n205
61177H32462o537p492q297r299j0243j0628j0561j0712j1468j2498j3119j2950
61165G08658j2249j1809j2240j3157j3419j2469j1007r930r122p968o547n431
61153E83310m493k980q08J077J906J867J432N52r99l033n052o595p278o941n973
61138E45992n079m489l800k769j733r39r3J135K599M080N652P283Q572R397J0295
61123E76103J1679J3144J4117J4772J5617J6638J7561J8595J9989K1205K1473
61112G60893K1053K0912K1107K0604J8939J6986J5566J4232J2121R306O491L857
$$ plain form
61204 647571 650944 655037 660162 666277 673375 681608 691023 701524 713227 726522 741544 757696 773956
61191 773956 789621 804459 818064 829381 837352 841992 844451 845872 846480 845953 844229 841493 837667 832462
61177 832462 825925 818433 810136 800837 790594 779966 769405 758693 747225 734727 721608 708658
61165 708658 696409 684600 672360 659203 645784 633315 622308 612378 603256 595288 588741 583310
61153 583310 578817 575837 575029 576106 578012 579879 581311 581863 580864 577831 572779 566184 558906 551965 545992
61138 545992 540913 536424 532624 529855 528122 527183 527090 528225 530824 534904 540556 547839 556411 565808 576103
61123 576103 587782 600926 615043 629815 645432 662070 679631 698226 718215 739420 760893
61112 760893 781946 802858 823965 844569 863508 880494 896060 910292 922413 931719 938210 942067
61100I42067J032k004m798p173r482j2010j4534j6575j7823j8299j8308j8276
61088H03817j8407j8524j8316j7634j6493j4957j3295j1882j0776r543p807n795
61076F40388m086k971k359k110k106k039j550n66P23K146L513M488M850M905N291
61061F48517O353P938R674J1145J1945J2075J2226J3247J5189J7282J8860J9915
61049H04366K0734K1495K2454K3992K6089K8081K9275K9713L0064L0838L1946
61038A099047L2950L3607L4181L5178L6777L8674M0640M2975M5948M9075N1494
61027A540546N3016N4163N5187N5881N6574N8448O2343O7933P4619Q2489R1691
61016B252890J01364J10316J18673J28082J40422J57190J80163K11586K52938
$$ plain form
61100 942067 943099 941095 936297 929124 919642 907632 893098 876523 858700 840401 822093 803817
61088 803817 785410 766886 748570 730936 714443 699486 686191 674309 663533 653990 646183 640388
61076 640388 636302 633331 630972 628862 626756 624717 623167 622601 623324 625470 628983 633471 638321 643226 648517
61061 648517 654870 662808 672482 683627 695572 707647 719873 733120 748309 765591 784451 804366
61049 804366 825100 846595 869049 893041 919130 947211 976486 1006199 1036263 1067101 1099047
61038 1099047 1131997 1165604 1199785 1234963 1271740 1310414 1351054 1394029 1439977 1489052 1540546
61027 1540546 1593562 1647725 1702912 1758793 1815367 1873815 1936158 2004091 2078710 2161199 2252890
61016 2252890 2354254 2464570 2583243 2711325 2851747 3008937 3189100 3400686 3653624
61007C653624L03962L63908M34298N20391O29633P68899R43706J158691J412410
60998A0189522J682561J911986K016552J922768J613702J147949O37222K01351
60990B1323613p0477j40962l3632J68805L44938L76707J97320j81000o75099j168935
60980B0141278j560086j792059j860952j800299j657733j476686j288137j109968
60972G595358r49754q08608o85028n77445m84839m06305l40911k87821k45874
60963B808773k12928j86213j63657j44535j28548j14802j02173r0294p9522o9997
60953A516104o1462n4001m8226m4428m2069m0417l9236l8470l7677l6320l4380
60942A039418l2257l0251k8514k7307k6720k6234k5111k3341k1655k0458j9319
$$ plain form
61007 3653624 3957586 4321494 4755792 5276183 5905816 6674715 7618421 8777112 10189522
60998 10189522 11872083 13784069 15800621 17723389 19337091 20485040 21122262 21323613
60990 21323613 21253136 21112174 21078542 21247347 21592285 21968992 22166312 21985312 21310213 20141278
60980 20141278 18581192 16789133 14928181 13127882 11470149 9993463 8705326 7595358
60972 7595358 6645604 5836996 5151968 4574523 4089684 3683379 3342468 3054647 2808773
60963 2808773 2595845 2409632 2245975 2101440 1972892 1858090 1755917 1665623 1586101 1516104
60953 1516104 1454642 1400641 1352415 1307987 1265918 1225501 1186265 1147795 1110118 1073798 1039418
60942 1039418 1007161 976910 948396 921089 894369 868135 843024 819683 798028 777570 758251
60931G58251j7793j6209j5091j4221j2971j1375j0139r464q615p035n263m244
60919F25831m096m175m133m181m371m263l546k467j411m14O23J592K263K507K287
60904F02046J694J095Q24O47q9j518k940l745m129m584n080n305n310n409n651
60889E62546n935o298o620o388n411m441m328m822n042m932n279o240o930o831
60875D83049o627p059p618p119n277l092j800j765k298k332j384Q5J343K263L114
60860D43483L705L487K646K229K782L514L322K218J160Q77J391K449L767M859
60846D81889N178M582L476K496J998J763J124l73k353l873m361m014l344k747
60832D81441k564k999l707l974l542k844k259j717j241j209j681k100k190k488
$$ plain form
60931 758251 740458 724249 709158 694937 681966 670591 660452 650988 642373 635338 630075 625831
60919 625831 621735 617560 613427 609246 604875 600612 597066 594599 593188 592774 593397 594989 597252 599759 602046
60904 602046 603740 604835 605659 606306 606217 604699 601759 598014 593885 589301 584221 578916 573606 568197 562546
60889 562546 556611 550313 543693 537305 531894 527453 523125 518303 513261 508329 503050 496810 489880 483049
60875 483049 476422 469363 461745 454626 449349 446257 444457 442692 440394 438062 436678 436763 438106 440369 443483
60860 443483 447188 450675 453321 455550 458332 461846 465168 467386 468546 469423 470814 473263 477030 481889
60846 481889 487067 491649 495125 497621 499619 501382 502506 502133 499780 495907 491546 487532 484188 481441
60832 481441 478877 475878 472171 468197 464655 461811 459552 457835 456594 455385 453704 451604 449414 446926
60818D46926l411m390m662m408m335m531m536m242l926l568l013k616k857l418
60804C93013l501l107l095l767m320m002l137k443j974j277l29L11K67j11j34
60789C62394L91Q80O89L0k28K46P34N72K04N40J612K547K751K395J857J417J441
60772C80472K142L036L305K811K178J821J591J413J471J570J153K60k69o5R7o13
60756D02373j888k777k939k762k625k571k444j969r05M66J365J389R75N98lj225
60740C85058k691l653m045m434m992n232m766l852l045k667k619k447j755q29
60726C38031n22j103j574r06M07Q63J4j006j110m77K50R92J779K100J582R34J199
60709C41453K265K977K761K229J958J587O31l01J3J814L828M542L672K222J332
$$ plain form
60818 446926 443515 439125 434463 430055 425720 421189 416653 412411 408485 404917 401904 399288 396431 393013
60804 393013 389512 386405 383310 379543 375223 371221 368084 365641 363667 362390 362061 362372 362639 362528 362394
60789 362394 362785 363665 364354 364384 364156 364402 365136 365708 365912 366452 368064 370611 373362 375757 377614 379031 380472
60772 380472 382614 385650 388955 391766 393944 395765 397356 398769 400240 401810 402963 403223 402954 402889 402986 402373
60756 402373 400485 397708 394769 392007 389382 386811 384367 382398 381493 381959 383324 384713 385688 386286 386283 385058
60740 385058 382367 378714 374669 370235 365243 360011 355245 351393 348348 345681 343062 340615 338860 338031
60726 338031 337509 336406 334832 333926 334333 335196 335210 334204 333094 332617 332867 333859 335638 337738 339320 340254 341453
60709 341453 343718 346695 349456 351685 353643 355230 355861 355560 355573 357387 361215 365757 369429 371651 372983
60694C72983J322J724J935J718J225P19L32Ql93q97j308j311p65J43R99J424J299
60677C81157Q15L90L61O69Q89P00K52o8j98n31j411k645l597l756l196k552k461
60660C64818k915l208k705j572n16Q9M75Q64J078J002R77J395K133K799L220L332
60644C71266K885J749L13r04j874k791l443l454l034k744k612k223j662j438j332
60629C48702m61J101J843P55j095j793q77N52J496J832J654R64J39j75K07Q93
60613C55737J510J877J651N89p72j409j044n21o57j265j514r34J83J121J393J204
60597C57149J230J675J882J276L68J16N55R64J216J883K909L325K710J889J622
60582C80769J496Q60M4k50j61l19o61n49K13J244K380L753N177O176O674P051
$$ plain form
60694 372983 374305 376029 377964 379682 380907 381626 381958 381966 381573 380676 379368 378057 377292 377435 378434 379858 381157
60677 381157 381972 382362 382723 383392 384281 384981 385233 385165 384967 384436 383025 380380 376783 373027 369831 367279 364818
60660 364818 361903 358695 355990 354418 353902 353991 354466 355330 356408 357410 358387 359782 361915 364714 367934 371266
60644 371266 374151 375900 376213 375309 373435 370644 367201 363747 360713 357969 355357 353134 351472 350034 348702
60629 348702 348241 349342 351185 351940 350845 349052 348175 348727 350223 352055 353709 354673 354812 354637 354844 355737
60613 355737 357247 359124 360775 361364 360592 359183 358139 357618 356961 355696 354182 353248 353431 354552 355945 357149
60597 357149 358379 360054 361936 363212 363580 363696 364251 365215 366431 368314 371223 374548 377258 379147 380769
60582 380769 382265 383125 383169 382919 382758 382439 381778 381229 381442 382686 385066 388819 393996 400172 406846 413897
60566D13897P469P750P918Q321Q991R420R113Q008O309M238K115L02j065k080
60552D90706k785l105l062k718j971p35O57J662K181K661L521M760O226P844R477
60537E15319J0970J2471J4350J6524J8111J8075J6136J2872R100N304J609j829
60525F49012m490n774n737n356n629o478o953o491n496m566l781k970k228j637
60511E81426r09K07J361J977K057K189K848M144O127Q824J1909J4854J7598K0673
60497F75285K4439K8521L2249L5391L8175M0735M2822M3874M3219M0283L4906
60486A079899K7441J8490Q575j879j2375k2330l1139l8189m3006m5543m6220m5504
60474H48220m3607m0818l7805l5121l2515k9247k5273k1656j9447j8377j7119
$$ plain form
60566 413897 421366 429116 437034 445355 454346 463766 472879 480887 487196 491434 493549 493851 492786 490706
60552 490706 487921 484816 481754 479036 477065 476330 476987 478649 480830 483491 487012 491772 497998 505842 515319
60537 515319 526289 538760 553110 569634 587745 605820 621956 634828 643928 649232 650841 649012
60525 649012 644522 638748 633011 627655 622026 615548 608595 602104 596608 592042 588261 585291 583063 581426
60511 581426 580517 580724 582085 584062 586119 588308 591156 595300 601427 610251 622160 637014 654612 675285
60497 675285 699724 728245 760494 795885 834060 874795 917617 961491 1004710 1044993 1079899
60486 1079899 1107340 1125830 1134405 1132526 1120151 1097821 1066682 1028493 985487 939944 893724 848220
60474 848220 804613 763795 725990 690869 658354 629107 603834 582178 562731 544354 527235
60463E27235j4789j1897r703q844q798q559p619o260n029m211l699l200k481j595
60449D30551r85j085j737k238k197k055k392k946k866j879p04j91m90j175j748
60434D05863j809j209l12J63p7n02m55L3L58J24n01j099j323r97k45M35M42l65
60416C98524j366j570m76J305K494K392J557J032J133J437J637J742J520O18n72
60401D11407j011k80R00J757K376L084L651L761L623L522L272K756K408K507K575
60386D46308K275K217K951L701L301K046J369J836K606K921K943K962K780K294
60372D82510J765J295P45L32N01J057J263R55P41R07J071J107J488K312K914K969
60356E03932L130M036N304O126O342O448O938P851Q683Q594P276N511M190K948
$$ plain form
60463 527235 512446 500549 490846 482002 473204 464645 457026 450766 445737 441526 437827 434627 432146 430551
60449 430551 429566 428481 426744 424506 422309 420254 417862 414916 412050 410171 409467 409276 408786 407611 405863
60434 405863 404054 402845 402533 402696 402619 402117 401662 401695 402053 402177 401676 400577 399254 398257 398012 398447 398889 398524
60416 398524 397158 395588 395112 396417 398911 401303 402860 403892 405025 406462 408099 409841 411361 411979 411407
60401 411407 410396 410116 411016 412773 415149 418233 421884 425645 429268 432790 436062 438818 441226 443733 446308
60386 446308 448583 450800 453751 457452 460753 462799 464168 466004 468610 471531 474474 477436 480216 482510
60372 482510 484275 485570 486315 486647 487148 488205 489468 490423 491164 492071 493142 494249 495737 498049 500963 503932
60356 503932 507062 511098 516402 522528 528870 535318 542256 550107 558790 567384 574660 580171 584361 587309
60342E87309P92k045m201n234o092p114p197n844m470m498n347n656n435n506
60328E19462n692n200m234l740l765l489k693j956j541j224j052j105p07Q86L101
60313D87051M516M767M876N721P206Q958J0626J1488J0996R884R602J0362J0838
60300E96891J0127Q722P179N059J930j584m594o985q962j0298j0832j1062j1451
60287E64140j1595j0888r589q502p896p397o802o239n696n008m285l814l525l027
60273D69877k307j885k097k526k494j931j460j530j772j514p33m1K56M87P77N46
60257D51653n22j566j463l87M56N71O75J306J912J805J206P53N15J41m04q73j306
60240D54472j950k640k764j938n30O45J057Q90P74J092J670K167K500K722K754
$$ plain form
60342 587309 588101 586056 581855 576621 570529 563415 556218 550374 545904 541406 536059 530403 524968 519462
60328 519462 513770 508570 504336 500596 496831 493342 490649 488693 487152 485928 484876 483771 483064 483950 487051
60313 487051 491567 496334 501210 506931 514137 523095 533721 545209 556205 566089 575691 586053 596891
60300 596891 607018 615740 622919 627978 629908 628324 623730 616745 607783 597485 586653 575591 564140
60287 564140 552545 541657 532068 523566 515670 508273 501471 495232 489536 484528 480243 476429 472904 469877
60273 469877 467570 465685 463588 461062 458568 456637 455177 453647 451875 450361 449628 449587 449843 450330 451107 451653
60257 451653 451131 449565 448102 447715 448171 448742 449417 450723 452635 454440 455646 456399 456914 457055 456651 455778 454472
60240 454472 452522 449882 447118 445180 444650 445295 446352 447242 448016 449108 450778 452945 455445 458167 460921
60225D60921K637K736L189L358K562J271P84J559K593K823K489K613L616N004
60211D98155O116O634O524N917N132M557M428M646M753M222L095K184K266L035
60197E61664L374K694J507N60m2n40r29j112j220j387j495j492j689k325l023
60182E54545l131k545j869j731k153k613k553j846q41m6K39J6m90q73p53k43L
60165E33116m65j238j499j036l94j33l34p71j071q70k13K91K19jK34O04L07n73
60147E26173j058p13j10K49N17P99Q85R90J734K952L624L491L573M418N002M352
60131E56878L176K727K872K671K162K118K420K141J100L9o98j384j789j147M61
60116E73747J860K270K116J962J645R41J78l39q21j383j650j473j377j718j998
$$ plain form
60225 460921 463558 466294 469483 472841 475403 476674 477458 479017 481610 484433 486922 489535 493151 498155
60211 498155 504271 510905 517429 523346 528478 533035 537463 542109 546862 551084 554179 556363 558629 561664
60197 561664 565038 567732 569239 569799 569757 569217 568288 567176 565956 564569 563074 561582 559893 557568 554545
60182 554545 551414 548869 547000 545269 543116 540503 537950 536104 535263 535217 535456 535472 534982 534109 533356 533113 533116
60165 533116 532651 531413 529914 528878 528484 528351 528017 527246 526175 525305 525092 525383 525602 525601 525835 526439 526746 526173
60147 526173 525115 524402 524292 524541 525058 525857 526742 527732 529466 532418 536042 539533 543106 547524 552526 556878
60131 556878 560054 562781 565653 568324 570486 572604 575024 577165 578265 578304 577606 576222 574433 573286 573747
60116 573747 575607 577877 579993 581955 583600 584541 584719 584380 583559 582176 580526 579053 577676 575958 573960
60101E73960j711j313j537k126k153j439p71o37m93L95J963L481M357M472M067
60086E80515L538L171K851K199J200M40L84O26K50j059k716m021m878n558o184
60071E70758o752p274p635p558p054o548o262n804m919m219m418n073m953l765
60057D88524k607k462k988l242k911k270j510o69R7P18J459K495L435L724L351
60042D85144K844K656K848L160L186K636J660P66K22j42n38r68j511k341l253
60027D96369l643l351k948k893k960k924l227m271n572o295o279n865n155m111
60013D36875l155k789k804k575k099j920k130k140j635j060q97r97r04m99j04
59998D11167n7k38k8J047K501L111K306R46L28P49J542K117K306K046J424R37
$$ plain form
60101 573960 572249 570936 569399 567273 565120 563681 562910 562273 561780 562175 564138 567619 571976 576448 580515
60086 580515 584053 587224 590075 592274 593474 593914 594298 594924 595174 594115 591399 587378 582500 576942 570758
60071 570758 564006 556732 549097 541539 534485 527937 521675 515871 510952 506733 502315 497242 492289 488524
60057 488524 485917 483455 480467 477225 474314 472044 470534 469865 469962 470680 472139 474634 478069 481793 485144
60042 485144 487988 490644 493492 496652 499838 502474 504134 504900 505122 504980 504442 503474 501963 499622 496369
60027 496369 492726 489375 486427 483534 480574 477650 474423 470152 464580 458285 452006 446141 440986 436875
60013 436875 433720 430931 428127 425552 423453 421533 419403 417263 415628 414568 413671 412674 411770 411271 411167
59998 411167 411110 410872 410844 411891 414392 417503 419809 420755 421083 421832 423374 425491 427797 429843 431267 432204
59982D32204R66J143Q07K4n62o94p02q17r65j190j597j895j633r40l95k37k54
59965D23263l66o77r75q08q2R57K188L452M146L741K568J359K38r47j662j257
59949D35138l34k85j292k053j785j209j160j387j337j062p48l15L3j70o12l28
59933D21094O02Q04k25j002j99J394K319K766L846N401O201N946N375M684L389
59918D62395J762Q73R57J055N49o9l04l74m50j86N16J155J502K015K879L332K652
59901D80259J189j34r05j201r82j21J049J868K058K048K471L445M439M879M878
59886E05240N093N695O004N577N182N809P027P361O423N509N725O497O566N582
59872E89290M006K164L07r64j301j371k093l319m097m082l780l477k913k148j819
$$ plain form
59982 432204 433170 434313 435120 435144 434582 433888 433186 432369 431404 430214 428617 426722 425089 424149 423754 423517 423263
59965 423263 422897 422220 421245 420437 420355 421312 423500 426952 431098 434839 437407 438766 439004 438057 436395 435138
59949 435138 434804 434519 433227 431174 429389 428180 427020 425633 424296 423234 422486 422171 422204 422034 421422 421094
59933 421094 421696 422500 422275 421273 421074 422468 424787 427553 431399 436800 443001 448947 454322 459006 462395
59918 462395 464157 465030 465987 467042 467591 467522 467218 466844 466394 466208 466724 467879 469381 471396 474275 477607 480259
59901 480259 481448 481314 480409 479208 478226 478105 479154 481022 483080 485128 487599 491044 495483 500362 505240
59886 505240 510333 516028 522032 527609 532791 538600 545627 552988 559411 564920 570645 577142 583708 589290
59872 589290 593296 595460 595767 594803 593502 592131 590038 586719 582622 578540 574760 571283 568370 566222 564403
59857E64403k129k392k045j383q19L7J761M032N903O974P584P864P338N696L460
59842F06284J555N07K57N69J259K101K688K541J426l76k214l572m373m722m562
59827E99368l819k807k100k011k365k827l118l048k746k798l672m895n345m664
59813E53153l825l849m428m484l804l327l717m376m218l036j678j026j170j585
59799E08630j862k036k270k477k501k459k585k697k272j242k38J82J91K00J38
59784D86702k74q02q88m19K57R58J742K389K489K125J887K040K249K285K380K618
59768E07738K567J962J267J095J387J666J790J952K138K147K136K563L464M198
59754E38070M161L502K924K891L250L654M064M645N185N043L924K499J855K313
$$ plain form
59857 564403 562274 559882 557837 556454 555635 555672 557433 561465 567368 574342 581926 589790 597128 602824 606284
59842 606284 607839 608346 608603 609172 610431 612532 615220 617761 619187 618811 616597 613025 608652 603930 599368
59827 599368 595549 592742 590642 588631 586266 583439 580321 577273 574527 571729 568057 563162 557817 553153
59813 553153 549328 545479 541051 536567 532763 529436 525719 521343 517125 514089 512411 511385 510215 508630
59799 508630 506768 504732 502462 499985 497484 495025 492440 489743 487471 486229 485991 486173 486364 486564 486702
59784 486702 486428 485626 484738 484319 484576 485534 487276 489665 492154 494279 496166 498206 500455 502740 505120 507738
59768 507738 510305 512267 513534 514629 516016 517682 519472 521424 523562 525709 527845 530408 533872 538070
59754 538070 542231 545733 548657 551548 554798 558452 562516 567161 572346 577389 581313 583812 585667 587980
59740E87980L172L629L616L505L428L182K693K174J821J578J322J076R80J074
59726F21230J196J189J066R56Q58O89N07M40L04k70j175j700j454j016j103j498
59710F20219j428q59n38p56r21n76o7J84L87R01J490J632J247P77O75J053J606
59693F25026J696Q89m40j404j635j553j498j260p53m76p79j260j463j692k420
59678F10978l409m127m704n556o354o276n314m455m349m519m201l380k621k276
59664E49437k189j984j387m61L70O96N77M90Q15J552K460L112K977J960Q24N80
59648E59829J230J558M82j698l784n047n680n977n728m670l163j997j562j577
59634E22216j686j892k209k297j885j366j411k005k454k421k395k873l584l909
$$ plain form
59740 587980 591152 594781 598397 601902 605330 608512 611205 613379 615200 616778 618100 619176 620156 621230
59726 621230 622426 623615 624681 625637 626495 627184 627691 628131 628435 628165 626990 625290 623836 622820 621717 620219
59710 620219 618791 617932 617394 616638 615717 615141 615074 615258 615645 616546 618036 619668 620915 621692 622367 623420 625026
59693 625026 626722 627611 627171 625767 624132 622579 621081 619821 619068 618592 617813 616553 615090 613398 610978
59678 610978 607569 603442 598738 593182 586828 580552 575238 570783 566434 561915 557714 554334 551713 549437
59664 549437 547248 545264 543877 543416 543786 544482 545059 545549 546364 547916 550376 553488 556465 558425 559249 559829
59648 559829 561059 562617 563099 561401 557617 552570 546890 540913 535185 530515 527352 525355 523793 522216
59634 522216 520530 518638 516429 514132 512247 510881 509470 507465 505011 502590 500195 497322 493738 489829
59620D89829l651l039k369j963k103k564k649k139j795k209k644j918k43Q78P03
59605D62124J75L79J015J086N11J36M09Q70J023J085J577K542L416L587K918J864
59589D84717J170J272J844K061J462M23l98r59j659k434k578j821r57q87j392
59574D79864j570j312j387k116k785k753k283j882j485q88l90k93k57J61O36N42
59558D61802rl78n00q77j499j631r06J19Q32J404K286L356M073M229M230M678
59542D81209N923P854J0011J2001J3959J6320J8886K0322J8919J4099P171N55
59530F27229l873n823o161n653m427k610r69l65o83q97l28M25J35j627l939n452
59514E84982n801n832o462p532q162p971p437p009o524n787n097m732m408l790
$$ plain form
59620 489829 486178 483139 480770 478807 476704 474140 471491 469352 467557 465348 462704 460786 460543 461421 462124
59605 462124 462299 462678 463693 464779 465290 465426 465835 466705 467728 468813 470390 472932 476348 479935 482853 484717
59589 484717 485887 487159 489003 491064 492526 492949 492551 491592 489933 487499 484921 483100 482143 481256 479864
59574 479864 478294 476982 475595 473479 470694 467941 465658 463776 462291 461403 461013 460720 460463 460624 461260 461802
59558 461802 461793 461415 460915 460038 458539 456908 456002 456121 456953 458357 460643 463999 468072 472301 476531 481209
59542 481209 487132 494986 504997 516998 530957 547277 566163 586485 605404 619503 626674 627229
59530 627229 623356 617533 611372 605719 601292 598682 597713 597348 596665 595768 595440 595865 596000 594373 590434 584982
59514 584982 579181 573349 566887 559355 551193 543222 535785 528776 522252 516465 511368 506636 502228 498438
59500D98438l175k994k942k343j213k83N3N2m6l21o10l53N94J515J653J163Q78
59483D90066J260J904K060J498Q37R94K228L796M685M608M088L679L454L173K685
59468E31015K047J443J016P24M78M15P91J424J727J600J853L189N112O432O709
59453E65975O523O505O746P052P122O525N102L416K124R83p84l099m862n412n288
59438E98628n208n084m501l566k716k107j725j649j821j866j508q44J04J641L820
59423E71598O007P500Q339R137J0299J1765J3253J4493J5465J6684J8919K2139
59411G25598K4895K5012K0972J2771K063q272j5319j7762j6457j3157q797l309
59399G28238L130R155J2548J1491N776k753j1126j6968j9604j9744j8436j6427
$$ plain form
59500 498438 495263 492269 489327 486984 485771 485488 485541 485593 485547 485226 484616 484263 484857 486372 488025 489188 490066
59483 490066 491326 493230 495290 496788 497625 498619 500847 504643 509328 513936 518024 521703 525157 528330 531015
59468 531015 533062 534505 535521 536245 536723 537138 537929 539353 541080 542680 544533 547722 552834 559266 565975
59453 565975 572498 579003 585749 592801 599923 606448 611550 614966 617090 618073 617289 614190 609328 603916 598628
59438 598628 593420 588336 583835 580269 577553 575446 573721 572072 570251 568385 566877 566033 566137 567778 571598
59423 571598 577605 585105 593444 602581 612880 624645 637898 652391 667856 684540 703459 725598
59411 725598 750493 775505 796477 809248 811311 803039 787720 769958 753501 740344 731547 728238
59399 728238 731368 740523 753071 764562 770338 767585 756459 739491 719887 700143 681707 665280
59387F65280j4070j1444q639o078m322l448k904k122j055L4R27J363J145O12O13
59372F15892J504K521K611J736Q31O15R18J166J114J025J364K354L631M488M617
59357F46387M525M934N929P014P937R047J0722J2678J4083J4395J3984J3715J3893
59344G79243J3897J3142J2009J1251J0637R008N906K316n95k856n206p779r938
59331H31035j1235j1857j2153j2194j1890j1244j0555j0337j0825j1434j1155
59320G06156r796q261p404p139p122p537q431q917q079o392n191m814m315l028
59306F09730j397M5J535L473N700P901J0035J1784J2130J0195O219J261l795q436
59292F66380j2065j4107j4592j4168j3387j2280j0672q601o298m015j934j06J601
$$ plain form
59387 665280 651210 639766 631127 625049 620727 617279 614375 612253 611198 611232 612159 613522 614667 615279 615892
59372 615892 617396 619917 622528 624264 625095 625710 626628 627794 628908 629933 631297 633651 637282 641770 646387
59357 646387 650912 655846 661775 668789 676726 685773 696495 709173 723256 737651 751635 765350 779243
59344 779243 793140 806282 818291 829542 840179 849187 855093 857409 856814 853958 848752 840973 831035
59331 831035 819800 807943 795790 783596 771706 760462 749907 739570 728745 717311 706156
59320 706156 696360 688099 680695 673556 666434 658897 650466 641549 633470 627078 621887 617073 612758 609730
59306 609730 608333 608378 609913 613386 619086 626987 637022 648806 660936 671131 677350 678611 674816 666380
59292 666380 654315 640208 625616 611448 598061 585781 575109 566508 560210 556195 554261 554155 555756
59279E55756L324M901N944O370O637P254Q119Q651Q628Q528Q895R568R878R499
59265F61952Q705P750O397M257J424j435l530m426m275l774l692m248m959n208
59251F54938m841m185l611l234k846k079p97O22J665K360L219M379N312N604N589
59236F62095N727N836N506M912M428L684J893p54k902l641l633m128n369o604
59222F67050p311p684p958p951p517o959o636o452o075n488n005m742m471m030
59208E78771l591l333l141k855k590k510k382j809q02J77Q20J291J790K204K301
59193E64341K138K003K113K488K957L282L405L612M231N144N819N872N392M696
59179F17493M098L897M206M646M630M086L542L364L337L221L189L429L717L767
$$ plain form
59279 555756 559080 563981 569925 576295 582932 590186 598305 606956 615584 624112 633007 642575 652453 661952
59265 661952 670657 678407 684804 689061 690485 689050 685520 681094 676819 673045 669353 665105 660146 654938
59251 654938 650097 645912 642301 639067 636221 634142 633345 633967 635632 637992 641211 645590 650902 656506 662095
59236 662095 667822 673658 679164 684076 688504 692188 694081 693327 690425 686784 683151 679023 673654 667050
59222 667050 659739 652055 644097 636146 628629 621670 615034 608582 602507 597019 592014 587272 582801 578771
59208 578771 575180 571847 568706 565851 563261 560751 558369 556560 555758 555935 556755 558046 559836 562040 564341
59193 564341 566479 568482 570595 573083 576040 579322 582727 586339 590570 595714 601533 607405 612797 617493
59179 617493 621591 625488 629694 634340 638970 643056 646598 649962 653299 656520 659709 663138 666855 670622
59165F70622L612L253K355Q00q33j875k435l131m164n230o186p201q272r124r627
59150F22564r858r732r028p893o893o414o288o137n828n450n101m777m416l994
59136E30755l597l340l096k541j594o06N9M56Q25J203J522J887K400K920L273
59121E30526L545L882M262M761N703P107Q296Q679Q653R117J0161J0946J0861
59108F26499J0206R600R249Q968Q439P353N743M259L598L556L087J560m91k059
59094F99567k714k721k472k130j682j089m86k35n79j300j950k417k941l621m290
59079F68940m933n778o826p629p765p268o474n713n212n013m864m499m082l989
59065E88895m135m016l544l295l651m135m061l449k819k425k176k167k624l277
$$ plain form
59165 670622 674234 677487 679842 680642 679809 677934 675499 672368 668204 662974 656788 649587 641315 632191 622564
59150 622564 612706 602974 593946 586053 579160 572746 566458 560321 554493 549043 543942 539165 534749 530755
59136 530755 527158 523818 520722 518181 516587 515981 516040 516496 517321 518524 520046 521933 524333 527253 530526
59121 530526 534071 537953 542215 546976 552679 559786 568082 576761 585414 594531 604692 615638 626499
59108 626499 636705 646305 655554 664522 672961 680314 686057 690316 693914 697470 700557 702117 701626 699567
59094 699567 696853 694132 691660 689530 687848 686759 686273 686038 685459 684159 682209 679792 676851 673230 668940
59079 668940 664007 658229 651403 643774 636009 628741 622267 616554 611342 606329 601465 596966 592884 588895
59065 588895 584760 580744 577200 573905 570254 566119 562058 558609 555790 553365 551189 549022 546398 543121
59051E43121l346k419j095l77o22j278j588j340q48l72J30P43J286J446J104M11
59035E34956l36p87o14K60J528K770L812M706N486O215P231Q923J1102J2840J3237
59020F11329J2281J0860R872R424Q832P386N045K418J68j509k779l765m321m214
59006F61027l435k299j181r4J241K820M064M415M084L750L684L626L424L128K443
58991F90697R43r34j971j760j422k118l517m520m840m913m692l628j684N19K537
58976F58697M265N456N923O209P162Q750J0105J0731J0871J0636R813Q740Q347
58963G65705Q893R455R125Q005O545M728K536M91r77k331m334o949r427j1269
58949G80196j2512j3230j3328j2805j1918j0968j0128r381q569p673p009o774
$$ plain form
59051 543121 539775 537356 536261 535884 535262 533984 532396 531056 530208 529836 529966 530709 531995 533441 534545 534956
59035 534956 534620 533833 533219 533479 535007 537777 541589 546295 551781 557996 565227 574150 585252 598092 611329
59020 611329 623610 634470 644342 653766 662598 669984 675029 677447 677615 676106 673327 669562 665241 661027
59006 661027 657592 655293 654112 654018 655259 658079 662143 666558 670642 674392 678076 681702 685126 688254 690697
58991 690697 691640 690706 688735 686975 685553 683435 679918 675398 670558 665645 660953 657325 655641 656160 658697
58976 658697 662962 668418 674341 680550 687712 696462 706567 717298 728169 738805 748618 757358 765705
58963 765705 774598 784053 793178 801183 807728 812456 814992 815483 814506 812175 807841 800892 791465 780196
58949 780196 767684 754454 741126 728321 716403 705435 695307 685926 677357 669684 662675 655901
58937F55901o395m945k541o50n09j657k643k771k466k209j954j676j643j909k043
58922F19890j714j198r47r86j037r93r17p23k88J76K58l5j50L49J322K437L709
58905F19153N261O842Q046Q894R761J0764J1674J2368J2816J2683J1676J0389
58893G40327J0069J1171J2871J4295J5510J6818J7813J7887J7114J5837J3895
58882I03607J1040P804N067K985J004j282l904o795r583j1423j1895j1700j1686
58869H63239j1589j0649r090p875p219o540n771n480n678n718n564n944p053q160
58855G60909q829r377r894r915r444r140r063q390o934n777n696n998n768n374
58841F51310n761o976q180q688q279p026n477m500m336m239l589k695k078j554
$$ plain form
58937 655901 649506 644561 642020 641370 640861 639204 636561 633790 631324 629115 627161 625485 623842 621933 619890
58922 619890 618176 616978 616031 615045 614008 613015 612098 611375 611087 611263 611521 611486 611336 611685 613007 615444 619153
58905 619153 624414 631256 639302 648196 657957 668721 680395 692763 705579 718262 729938 740327
58893 740327 750396 761567 774438 788733 804243 821061 838874 856761 873875 889712 903607
58882 903607 914647 922451 927518 930503 931507 930225 926321 919526 909943 898520 886625 874925 863239
58869 863239 851650 841001 831911 824036 816817 810277 804506 799026 793348 787630 782066 776122 769069 760909
58855 760909 752080 742703 732809 722894 713450 704310 695247 686857 679923 674146 668450 662452 656684 651310
58841 651310 645549 638573 630393 621705 613426 606400 600923 596423 592087 587848 584259 581564 579486 577932
58827E77932p58Q4N83Q70J254J643J933K421L279L997M109L925L966M069L738
58812F13045K994K229J566R30M46K15j1m53q64r51r09j142j795k813m042m994
58796F03451n163m866n101o116o899o592n616m770m039l043j950j043m8J172J950
58781E51327J806J587K477M242N536N696N166M365L210J752L30j077k768m537
58767E79112n653n768n229m472l647k897k388k039j616j196j090j340j540j253
58753E38984m31M23N75j25p63l03R02J434Q84N63J556L076L732L583L759M642
58737E62491N581O149O481O594O314N876N746N911N950N684N201M512L757L320
58723F39567L214K866K160K031L174M835N834O160O473O658O153N228M519L698
$$ plain form
58827 577932 577174 577258 577841 578711 579965 581608 583541 585962 589241 593238 597347 601272 605238 609307 613045
58812 613045 616039 618268 619834 620764 621210 621425 621414 620961 620097 619146 618237 617095 615300 612487 608445 603451
58796 603451 598288 593422 588321 582205 575306 568714 563098 558328 554289 551246 549296 548253 548205 549377 551327
58781 551327 553133 554720 557197 561439 566975 572671 577837 582202 585412 587164 587494 586417 583649 579112
58767 579112 573459 567691 562462 557990 554343 551446 549058 547019 545403 544207 543117 541777 540237 538984
58753 538984 538553 538976 539551 539426 538663 538360 539262 540696 541580 542143 543699 546775 550507 554090 557849 562491
58737 562491 568072 574221 580702 587296 593610 599486 605232 611143 617093 622777 627978 632490 636247 639567
58723 639567 642781 645647 647807 649838 653012 657847 663681 669841 676314 682972 689125 694353 698872 702570
58709G02570J991j50j453j873k757m800p232r241j0950j2524j3568j3908j4000
58696F12105j4116j3933j3248j2314j1215r754q182p133o662o157n432m911m542
58683D94506l644k219j353j713k537k764k411k126j973j451l52J028K382L681
58669D79054N004O355P624Q763J0095J2079J4403J5710J4892J2378R395O312K704
58656F04768j168m162n793o809p858q533q285p440o681o158n663n213m881m458
58642E21666l741k948k421k144j783j111k35N15R00J046J298J661J767J494J196
58627E17160R55L20p00j059k5J553K352K478K946L629L294J797P36J366K982M015
58611E43799L820K827J630O58K28L71P12Q25N61L8m42o18o59j059j802k077j430
$$ plain form
58709 702570 704561 704411 702958 701085 698328 693528 686296 677055 666105 653581 640013 626105 612105
58696 612105 597989 584056 570808 558494 547279 537525 529343 522210 515548 509391 503959 499048 494506
58683 494506 490862 488643 487290 485577 483040 480276 477865 475739 473766 472315 471963 472991 475373 479054
58669 479054 484058 490413 498037 506800 516895 528974 543377 559087 573979 586357 595752 602064 604768
58656 604768 603600 599438 593645 586836 578978 570445 562160 554720 548039 541881 536218 531005 526124 521666
58642 521666 517925 514977 512556 510412 508629 507518 507283 507798 508698 509744 511042 512703 514470 515964 517160
58627 517160 518115 518435 517735 516676 516651 518204 520556 523034 525980 529609 532903 534700 535436 536802 539784 543799
58611 543799 547619 550446 552076 552734 552962 553333 554045 554870 555431 555469 555027 554409 553750 552691 550889 548812 547382
58594E47382n81m33p33o02J34J111K341L860M992N225N438O806Q809R837R479
58579F03065Q717Q008O936N769N477N893N720M762M492N743P568R144J1078J3889
58565G06261J6686J8512J9757K1161K2482K3173K3421K3388K2248J9094J4300
58554I30483R132M495P57j843l300l985m240m161m044m365n175o207p658r927
58540H89962j2523j4355j5326j6413j7847j8550j7846j6446j5135j3685j1712
58529G20124r479p199m679k255q84o72n73k10o07k216l644l509k413j804j936
58514F78044k136k299k734l131k856j972j152r17j450k592l623l748l202k981
58500F43251l224k979k020j415j692j802r20J40M13M80J378K843L953M658N505
$$ plain form
58594 547382 546801 546368 545635 545033 545167 546278 548619 552479 557471 562696 568134 574940 583749 593586 603065
58579 603065 611782 619790 626726 632495 637972 643865 649585 654347 658839 664582 672150 681294 692372 706261
58565 706261 722947 741459 761216 782377 804859 828032 851453 874841 897089 916183 930483
58554 930483 939615 944110 944867 943024 939724 935739 931499 927338 923294 918929 913754 907547 899889 889962
58540 889962 877439 863084 847758 831345 813498 794948 777102 760656 745521 731836 720124
58529 720124 710645 703446 698767 696512 695628 694956 694383 694173 693566 691350 687706 684197 681784 679980 678044
58514 678044 675908 673609 670875 667744 664888 662916 661764 660847 659397 656805 653182 649434 646232 643251
58500 643251 640027 637048 635028 633613 631921 630119 629199 629339 629752 630232 631610 634453 638406 643064 648569
58485F48569O503P428Q577J0198J1772J2717J3200J3558J3602J3148J2305J0696
58473G82273P532L224m42k572m313o692q768r259q629q040p357n805l753k148
58459G25251r21O36K507M296O281Q751J0904J1617J0744Q686N496J587j608l049
58445G91178l461m109m953n200m834m270l348j977r62q57q37k3R75J211J172J922
58429G61627L239M226N014O283P731Q527Q671Q494P539N336K651M86j392l510
58415H24922n200n684n784o778q198q540p642o597n830m948m091l778l678l008
58401G45166j836o78N87K142L329L689M059N161O064N606M374L604L104K174J474
58386G88019J894K548K125J386J955L388L864L247K937L148K832K099K179L036
$$ plain form
58485 648569 655072 662500 671077 681275 693047 705764 718964 732522 746124 759272 771577 782273
58473 782273 789805 793029 792587 790015 785702 779010 770242 760983 752354 744314 736957 731152 727399 725251
58459 725251 724330 724966 727473 731769 738050 746801 757705 769322 780066 788752 794248 795835 794227 791178
58445 791178 787717 783608 778655 773455 768621 764351 761003 759026 758064 757207 756370 756347 757322 758533 759705 761627
58429 761627 764866 769092 774106 780389 788120 796647 805318 813812 821351 826687 829338 829824 828432 824922
58415 824922 819722 814038 808254 801476 793278 784738 777096 770499 764669 759721 755630 751852 748174 745166
58401 745166 743330 742652 743239 745381 748710 752399 756458 761619 767683 773289 777663 781267 784371 786545 788019
58386 788019 789913 792461 794586 795972 797927 801315 805179 808426 811363 814511 817343 819442 821621 824657
58372H24657L438L404M247O094P542P980Q237Q752R115R460J0407J1491J1547
58359I26371J0630R786R083P769O180N434N341M690L521L048L382L398K862K688
58345A004183L050L224L318M242O021P871R798J2225J4468J5482J5811J6662J7582
58332A133937J7187J5685J4353J3063J0828Q317P093O699N296K996J832K479L696
58319A243461M878O375P495P153O421P485R985J1422J1179J0981J1391J1117J0205
58306A359548J0524J2427J4050J4547J5077J5982J6050J5207J5010J5806J6249
58295A520477J6184J7039J8830J9815J9654J9940K1041K1455K0879K0821K1652
58284A737787K2119K2208K3338K5271K6112K5817K6361K8097K9402L0223L2265
$$ plain form
58372 824657 828095 831499 835746 841840 849382 857362 865599 874351 883466 892926 903333 914824 926371
58359 926371 937001 946787 955870 963639 969819 975253 980594 985284 988805 991853 995235 998633 1001495 1004183
58345 1004183 1007233 1010457 1013775 1018017 1024038 1031909 1041707 1053932 1068400 1083882 1099693 1116355 1133937
58332 1133937 1151124 1166809 1181162 1194225 1205053 1213370 1220463 1227162 1232458 1235454 1237286 1239765 1243461
58319 1243461 1248339 1254714 1262209 1269362 1275783 1283268 1293253 1304675 1315854 1326835 1338226 1349343 1359548
58306 1359548 1370072 1382499 1396549 1411096 1426173 1442155 1458205 1473412 1488422 1504228 1520477
58295 1520477 1536661 1553700 1572530 1592345 1611999 1631939 1652980 1674435 1695314 1716135 1737787
58284 1737787 1759906 1782114 1805452 1830723 1856835 1882652 1909013 1937110 1966512 1996735 2029000
58273B029000L5260L6994L7512L9253M2486M4774M5712M7745N1397N4165N5240
58262B519538N6858N9756O1753O2208O3349O5760O6997O6198O5621O6241O6410
58251C220689O6206O8252P2679P6273P8258Q1767Q7876R3556R7562J02852J10870
58240D156840J18726J24590J30685J38570J46517J53935J63089J74393J85248
58231E492593J95474K08168K23488K37861K51127K67684K88580L09878L30891
58222G805744L56129L86501M17038M46486M80536N22159N67670O15957O72224
58213A2270444P38645Q11196Q90054R82983J094157J220485J363446J532546J732474
58204B2636430J960428K222519K539600K931800L413516M010594M764422N709400
$$ plain form
58273 2029000 2064260 2101254 2138766 2178019 2220505 2265279 2310991 2358736 2410133 2464298 2519538
58262 2519538 2576396 2636152 2697905 2760113 2823462 2889222 2956219 3022417 3088038 3154279 3220689
58251 3220689 3286895 3355147 3427826 3504099 3582357 3664124 3752000 3845556 3943118 4045970 4156840
58240 4156840 4275566 4400156 4530841 4669411 4815928 4969863 5132952 5307345 5492593
58231 5492593 5688067 5896235 6119723 6357584 6608711 6876395 7164975 7474853 7805744
58222 7805744 8161873 8548374 8965412 9411898 9892434 10414593 10982263 11598220 12270444
58213 12270444 13009089 13820285 14710339 15693322 16787479 18007964 19371410 20903956 22636430
58204 22636430 24596858 26819377 29358977 32290777 35704293 39714887 44479309 50188709
58196E0188709O863887Q254088R933087J1975673J4480771J7580817K1404228
58189A40681260K5988966L1196260L6576508M1105115M3010873M0217328L1522955
58182C90299265J7719867J555695j3598912k5302174l2679918l6059778l6313199
58175B65620846l4437725l1359546k7795858k4195586k0801265j7741252j5064002
58168I4225612j2751188j0761111r065717p641314o450452n454553m629463l953460
58160C3518354l394869k925594k534068k212672j944549j714007j518155j356677
58152A5917763j219944j097367r88239q94477q10924p31847o59447n97282n41935
58143H376301m88892m40242l99415l64436l32924l07567k90049k75463k59082
$$ plain form
58196 50188709 57052596 65306684 75239771 87215444 101696215 119277032 140681260
58189 140681260 166670226 197866486 234442994 275548109 318558982 358776310 390299265
58182 390299265 408019132 409574827 395975915 370673741 337993823 301934045 265620846
58175 265620846 231183121 199823575 172027717 147832131 127030866 109289614 94225612
58168 94225612 81474424 70713313 61647596 54006282 47555830 42101277 37471814 33518354
58160 33518354 30123485 27197891 24663823 22451151 20506602 18792595 17274440 15917763
58152 15917763 14697819 13600452 12612213 11717736 10906812 10174965 9515518 8918236 8376301
58143 8376301 7887409 7447167 7047752 6683316 6350392 6042825 5752776 5477313 5218231
58134E218231k43115k30756k19138k04482j89018j76529j65655j53563j41893
58125C494082j33340j26233j18056j10606j06341j03120r7693r1126q6027q1589
58115B439951p6057p0923o8082o5701o1363n6551n3822n2275m9885m7585m6972
58104A790735m6569m4401m1817m0852m0240l7922l5139l4124l3947l2467l0435
58093A372822k9768k9677k8164k5775k4358k3596k2106k0455j9965j9952j9103
58082A109903j8125j8189j8461j7969j8065k0011k1931k1357j9250j8296j8597
58071H99652j8196j6729j5468j4671j3749j3149j3416j3395j1853r899r291r427
58059G40409q542o829n886o022o475p322q797r717q964p636p398p717p064n783
$$ plain form
58134 5218231 4975116 4744360 4525222 4320740 4131722 3955193 3789538 3635975 3494082
58125 3494082 3360742 3234509 3116453 3005847 2899506 2796386 2698693 2607567 2521540 2439951
58115 2439951 2363894 2292971 2224889 2159188 2097825 2041274 1987452 1935177 1885292 1837707 1790735
58104 1790735 1744166 1699765 1657948 1617096 1576856 1538934 1503795 1469671 1435724 1403257 1372822
58093 1372822 1343054 1313377 1285213 1259438 1235080 1211484 1189378 1168923 1148958 1129006 1109903
58082 1109903 1091778 1073589 1055128 1037159 1019094 999083 977152 955795 936545 918249 899652
58071 899652 881456 864727 849259 834588 820839 807690 794274 780879 769026 759127 749836 740409
58059 740409 731867 725038 719152 713130 706655 699333 690536 680819 671855 664219 656821 649104 642040 636257
58045F36257n363n738n792n699o376p291p177o343o070o336o159n636n549n646
58031E51082n291n108n916o892o732n974o036o729o795o220n899n679m837l919
58017D69055l968m471m086k971k337k232j800j258j487k056j690m91L08M85Q39
58002D41840J345J160L61j36j62l02n80p40j390l155n130n824n297m735m390l748
57986D09117l134l273l653l219k356k279k809k735k079k015k665k977k722k674
57972C70527k857k539j948k054k607k303j067k53l49l95N4K90K29Q78K388L263
57956C61257K338K29j796l207l896l757l124k698k562k187j585j426j733j583
57942C34270m29J225K755M095N306O288P131P991Q651Q913R183R744R813Q341
$$ plain form
58045 636257 630894 625156 619364 613665 607289 599998 592821 586478 580408 574072 567913 562277 556728 551082
58031 551082 545791 540683 534767 527875 521143 515169 509133 502404 495609 489389 483490 477811 472974 469055
58017 469055 465087 460616 456530 453559 451222 448990 447190 445932 444445 442389 440699 440208 440516 441001 441840
58002 441840 443185 444345 444706 444570 444408 444106 443526 442786 441396 438241 433111 427287 421990 417255 412865 409117
57986 409117 405983 402710 399057 395838 393482 391203 388394 385659 383580 381565 378900 375923 373201 370527
57972 370527 367670 365131 363183 361129 358522 356219 355152 354899 354550 354155 354209 354499 354728 355606 357994 361257
57956 361257 363595 363824 362028 358821 354925 351168 348044 345346 342784 340597 339012 337586 335853 334270
57942 334270 333841 335066 337821 341916 347222 353510 360641 368632 377283 386196 395379 405123 414936 423277
57928D23277N624K925P28j429l612n360o764q311r654r831q871p868p413p134
57914C56307o867o915p017o324m691k905j452j03J196K151K892L795M471M127
57900C38665K926J893J373Q35K66L84J273K139K624L164L777L866L446L345L747
57885C73723L806L085K201J614R24j30j062j551k024k824l697m450n234n849n699
57870C52833m803l990l783l861l858l767l367k280q53K6K72P62J844K756K940
57855C30871L013L837N339O701P151O404M927L789L547L461K556J222N69N56J29
57840C84072p67r50l1Q12O07k35r90j563j839j391n04k74j013j687j556j248j516
57823C69927k006k098j921j761j371o55j77k65l95j89k16j106k624m292o158q228
$$ plain form
57928 423277 428901 431826 432554 431125 427513 422153 415389 407078 397424 387593 378722 370854 363441 356307
57914 356307 349440 342525 335508 329184 324493 321588 320136 320033 321229 323380 326272 330067 334538 338665
57900 338665 341591 343484 344857 345692 345958 346342 347615 349754 352378 355542 359319 363185 366631 369976 373723
57885 373723 377529 380614 382815 384429 385353 385223 384161 382610 380586 377762 374065 369615 364381 358532 352833
57870 352833 348030 344040 340257 336396 332538 328771 325404 323124 322271 322297 322569 323331 325175 327931 330871
57855 330871 333884 337721 343060 349761 356912 363316 368243 372032 375579 379040 381596 382818 383387 383943 384072
57840 384072 383305 382355 382324 383136 383743 383508 382518 380955 379116 377725 377221 376947 375934 374247 372691 371443 369927
57823 369927 367921 365823 363902 362141 360770 360115 359938 359673 359278 359089 358873 357767 355143 350851 344693 336465
57807C36465r797j0094r166p604n999m921m750n051m869l976l103k671k226j449
57793B60789p59l97J7N71P27M12L67Q29J045P15P59J803L029L528L659M126M707
57776B85927N007N497O533P198O494N026M184M091L725K755J910J587J248L87
57762C41569p77j763k422k873l230l353k876j767q91j228k439l020k345j547j746
57747C09292k445k471j695p99r4M19M41j05m85m3O85P06L5n21o54o69o41m24k17
57728C00315k59k03L93J216J684J904K337K792K711K215J910J772J260M32O7N33
57712C21079J300J693J514Q36j64j103j652j980k561l527m546n153m974l933k592
57697B94237j915k244k893l152l207l542l976l963l447k743k039j549j717k483
$$ plain form
57807 336465 326668 316574 307408 299804 293805 288884 284134 279083 274214 270238 267135 264464 262238 260789
57793 260789 260030 259633 259650 260221 260948 261360 261727 262556 263601 264316 265075 266878 269907 273435 277094 281220 285927
57776 285927 290934 296431 302964 310162 316656 321682 325866 329957 333682 336437 338347 339934 341182 341569
57762 341569 340792 339029 336607 333734 330504 327151 324275 322508 321617 320389 317950 314930 312585 311038 309292
57747 309292 306847 304376 302681 301882 301788 302207 302648 302543 302058 302015 302700 303406 303441 302920 302266 301597 300956 300532 300315
57728 300315 300056 299853 300246 301462 303146 305050 307387 310179 312890 315105 317015 318787 320047 320479 320546 321079
57712 321079 322379 324072 325586 326422 326258 325155 323503 321523 318962 315435 310889 305736 300762 296829 294237
57697 294237 292322 290078 287185 284033 280826 277284 273308 269345 265898 263155 261116 259567 257850 255367
57683B55367k872k073n55P36J748L032M534N750O790Q246J0248J2629J5817K0438
57669C39835K6227L2324L8552M5013N0359N1670M6610L5068J8713Q8j7602l1120
57657F35737l8765m1159m0199l7498l3937l0002k6043k2391j9379j7021j4879
57646C14464j2606j0546r201q303p079n451m134l485l017k264j443r53p83p40
57632B44459p30n54J09J184K013J958R90m06j591k058j767j327j415j973k392
57617B36500k370k138j766j020m8M06o4r18j374j383j353j293q34o5K98j51p76
57600B21651n87M30J198R02K7m11k79l00p71j141j042r17j235j775k148k438k748
57583B08416k711k079j366j147j200r99p35j002j672j951j547j069j130j636k050
$$ plain form
57683 255367 252495 250422 249867 250603 252351 255383 259917 265667 272457 280703 290951 303580 319397 339835
57669 339835 366062 398386 436938 481951 532310 583980 630590 665658 684371 684459 666857 635737
57657 635737 596972 555813 515614 478116 444179 414177 388134 365743 346364 329343 314464
57646 314464 301858 291312 282111 273808 266729 261278 257144 253659 250642 248378 246935 245982 245199 244459
57632 244459 243729 243175 243284 244468 246481 248439 249429 249023 247432 245374 243607 242280 240865 238892 236500
57617 236500 234130 231992 230226 229206 229158 229564 229500 228582 227208 225825 224472 223179 222345 222280 222578 222427 221651
57600 221651 221064 221494 222692 223594 223621 223210 222931 222631 221860 220719 219677 218760 217525 215750 213602 211164 208416
57583 208416 205705 203626 202260 201113 199913 198914 198179 197177 195505 193554 192007 190938 189808 188172 186122
57568A86122k017j617j255j249j420j360j156j304j692j473l75O37P29M34P01
57553A73705J392J755J794J988K116J662J048J160J763J695P33l7J51R12J727
57538A93564K623L421L477K614J492N90l60j507k265k182j687j497j730k030k100
57523A92423j843j289o49r9M64J123J516J291Q55Q96J337J529J434J645K244K583
57507B05460K396K125J996J730J365J388J708J596R14M48N46N76K09J19O94J072
57491B24342L57r94j879k002j791j489j123r28j066j241j187j089j104r62n84
57476B07260m06o20o78k76p6p07j666k057j845j509j015j12P11P01K8m36m88p13
57458A96096j267j468q51J45P96Q90O84M56L14J88l5k09O1Q39J536J592J300J391
$$ plain form
57568 186122 184105 182488 181233 179984 178564 177204 176048 174744 173052 171579 171204 171841 172570 173004 173705
57553 173705 175097 176852 178646 180634 182750 184412 185460 186620 188383 190078 190811 190774 190925 191837 193564
57538 193564 196187 199608 203085 205699 207191 207781 207421 205914 203649 201467 199780 198283 196553 194523 192423
57523 192423 190580 189291 188642 188543 189007 190130 191646 192937 193792 194688 196025 197554 198988 200633 202877 205460
57507 205460 207856 209981 211977 213707 215072 216460 218168 219764 220678 221126 221672 222248 222457 222576 223270 224342
57491 224342 224699 223705 221826 219824 218033 216544 215421 214493 213427 212186 210999 209910 208806 207844 207260
57476 207260 206854 206234 205556 205280 205204 204497 202831 200774 198929 197420 196405 196293 197004 197705 197733 197297 196809 196096
57458 196096 194829 193361 192510 192655 193451 194341 195025 195481 195795 195983 195948 195739 195800 196639 198175 199767 201067 202458
57440B02458J962K367K167J601J005L77l30q28p94l54J6L3r3M0M69P22L93k37
57422B10974m21J95J150J721J564Q23k4l10L70J591K318K007J189P05O99P25N84
57405B25860N38P91J083J004N00M2K16J002J649J462O65J11K51P62J136J116O14
57388B38802k07p11l47N05Q83O24O06J355K237K491K207J767J049l9r00q93k43
57371B49186L87Q48J311J550J273Q44R10J385J546J096M88J87J55J46Q9J35N22
57354B62058J330K157K383J958J607J867K345K333J773J121O35L41L40O19Q36
57339B83703Q16R46J538K161K180J645J024M62o0j73L95J085J070M49rn9j19k53
57321B96801mO69J245J474J578J469P98l5N4J258K329K185J317Q20P65N26J86
$$ plain form
57440 202458 204420 206787 208954 210555 211560 211937 211607 210779 209985 209631 209647 209680 209587 209627 210096 210818 211211 210974
57422 210974 210553 210748 211898 213619 215183 216006 215982 215672 216042 217633 219951 221958 223147 223852 224551 225276 225860
57405 225860 226398 227189 228272 229276 229776 229818 230034 231036 232685 234147 234812 234923 235174 235936 237072 238188 238802
57388 238802 238595 237884 237537 238042 238925 239549 240155 241510 243747 246238 248445 250212 251261 251222 250322 249429 249186
57371 249186 249573 250421 251732 253282 254555 255399 256309 257694 259240 260336 260824 261011 261166 261312 261401 261536 262058
57354 262058 263388 265545 267928 269886 271493 273360 275705 278038 279811 280932 281567 281908 282248 282867 283703
57339 283703 284519 285465 287003 289164 291344 292989 294013 294475 294415 294242 294637 295722 296792 297241 297232 297173 297054 296801
57321 296801 296797 297466 298711 300185 301763 303232 304030 303995 304049 305307 307636 309821 311138 311958 312723 313249 313435
57304C13435M77J417K072J970J736J889J838R15j28J63J811L042K572J283Q97
57289C35389J697K551K801K832K848K390J526J315K346L655L937L288K878L339
57275C72792M281N149N702N795N371M727M259M048M028M258M672M805M381L831
57261D38099L726L927L918L662L554L719L996M412M982N229M684L758L412L942
57247D95020M777N420N884O175O065N573N128N075N346N714N987O097O314P180
57233E75755Q747J0154J0539J0163R909R987R931R759J0067J0923J1622J1776
57221F99332J1826J2104J2254J2017J1841J2231J3013J3728J4305J4950J5777
57210H43378J6860J8247J9534J9915J9075J7683J6591J5872J5138J4454J4322
$$ plain form
57304 313435 313912 315329 317401 319371 321107 322996 324834 325749 325621 325784 327595 330637 333209 334492 335389
57289 335389 337086 339637 342438 345270 348118 350508 352034 353349 355695 359350 363287 366575 369453 372792
57275 372792 377073 382222 387924 393719 399090 403817 408076 412124 416152 420410 425082 429887 434268 438099
57261 438099 441825 445752 449670 453332 456886 460605 464601 469013 473995 479224 483908 487666 491078 495020
57247 495020 499797 505217 511101 517276 523341 528914 534042 539117 544463 550177 556164 562261 568575 575755
57233 575755 584502 594656 605195 615358 625267 635254 645185 654944 665011 675934 687556 699332
57221 699332 711158 723262 735516 747533 759374 771605 784618 798346 812651 827601 843378
57210 843378 860238 878485 898019 917934 937009 954692 971283 987155 1002293 1016747 1031069
57199A031069J4819J5314J5241J4845J4910J5871J7403J8849J9850K0443K0754
57188A219368K0932K1217K1672K1816K1068J9711J8797J8840J9113J8716J7840
57177A439090J7389J7799J8865K0359K2061K3415K3975K4067K4369K4898K5044
57166A681331K4557K3818K3203K2737K2380K2131K1872K1669K2094K3648K5964
57155A935404K8158K9854L1259L2391L2912L2824L2678L3076L4278L6124L7884
57144B296842L8609L8295L8232L9436M1155M1909M1624M1566M2405M3650M5023
57133B748746M6967M9575N2242N4762N7656O0950O3849O6176O9143P4022Q0770
57122C424858Q8576R7092J06583J17504J30316J45195J61439J77672J92889K06919
$$ plain form
57199 1031069 1045888 1061202 1076443 1091288 1106198 1122069 1139472 1158321 1178171 1198614 1219368
57188 1219368 1240300 1261517 1283189 1305005 1326073 1345784 1364581 1383421 1402534 1421250 1439090
57177 1439090 1456479 1474278 1493143 1513502 1535563 1558978 1582953 1607020 1631389 1656287 1681331
57166 1681331 1705888 1729706 1752909 1775646 1798026 1820157 1842029 1863698 1885792 1909440 1935404
57155 1935404 1963562 1993416 2024675 2057066 2089978 2122802 2155480 2188556 2222834 2258958 2296842
57144 2296842 2335451 2373746 2411978 2451414 2492569 2534478 2576102 2617668 2660073 2703723 2748746
57133 2748746 2795713 2845288 2897530 2952292 3009948 3070898 3134747 3200923 3270066 3344088 3424858
57122 3424858 3513434 3610526 3717109 3834613 3964929 4110124 4271563 4449235 4642124 4849043
57112D849043K19976K32598K46182K62627K83212L08598L40174L80540M32468
57103G555418M98182N79874O79944Q00728R45172J118305J327188J579196J881029
57094A6965036K238903K657434L137130L673440M257798M877555N513917O141120
57086D9462333O727522P235774P622270P840390P846541P601524P067305O212455
57078A07616114N034002L580217J949669K62608j373463k881425m212171n333589
57070A04641962o221811o859619p241762p381643p311820p075950o717817o274478
57062D9557062n775263n243993m701493m166804l656453l182752k753047k370596
57054A7706661k035851j747186j501267j293440j118195r70083q44921p39979
$$ plain form
57112 4849043 5069019 5301617 5547799 5810426 6093638 6402236 6742410 7122950 7555418
57103 7555418 8053600 8633474 9313418 10114146 11059318 12177623 13504811 15084007 16965036
57094 16965036 19203939 21861373 24998503 28671943 32929741 37807296 43321213 49462333
57086 49462333 56189855 63425629 71047899 78888289 86734830 94336354 101403659 107616114
57078 107616114 112650116 116230333 118180002 118442610 117069147 114187722 109975551 104641962
57070 104641962 98420151 91560532 84318770 76937127 69625307 62549357 55831540 49557062
57062 49557062 43781799 38537806 33836313 29669509 26013056 22830304 20077257 17706661
57054 17706661 15670810 13923624 12422357 11128917 10010722 9040639 8195718 7455739
57046G455739o52587n79081n15789m60598m12576l70399l32253k97185k65392
57037C569879k37071k11838j89193j68495j48392j27391j05198q2276n8059l1423
57027B210543m154J7336K5543J7363m331l3611o4611r2238j12127j21769j21794
57016A716150j15401j06136r6202q6499p7491o9456o2276n5649m9610m4439m0019
57005I12972l5846l1855k8640k6560k5200k4092k3359k3126k2846k1900k0472
56994F29076j9071j7595j5683j3691j2356j1515j0101p476m047m25L271P021J0294
56981E37702J2063J1111O585j097r841j7078k1626k3948k4695k3795k1166j7587
56969D06628j4274j1848j0059q275n991l030M97M400Q473J2369J5752J8764K1984
$$ plain form
57046 7455739 6803152 6224071 5708282 5247684 4835108 4464709 4132456 3835271 3569879
57037 3569879 3332808 3120970 2931777 2763282 2614890 2487499 2382301 2300025 2241966 2210543
57027 2210543 2206389 2223725 2249268 2266631 2262300 2228689 2164078 2071840 1959713 1837944 1716150
57016 1716150 1600749 1494613 1398411 1311912 1234421 1164965 1102689 1047040 997430 952991 912972
57005 912972 877126 845271 816631 790071 764871 740779 717420 694294 671448 649548 629076
56994 629076 610005 592410 576727 563036 550680 539165 529064 521588 517541 517116 520387 527408 537702
56981 537702 549765 560876 567461 566364 556523 539445 517819 493871 469176 445381 424215 406628
56969 406628 392354 380506 370447 362172 356181 353151 353648 358048 366521 378890 394642 413406 435390
56956D35390K5291K7032K4921J7970P322m558j5139k2697k6779k8038k7357k5263
56944C88095k2293j9328j6805j4014j0100n512j543J495M654Q827J3805J9138
56932C46419K4949L1265L7014M0045L8071K9781J5952l45j5324k6672l4051l7739
56920D49365l7808l4843l0465k6314k2941k0091j7606j5519j3667j1790r945q428
56908A99948p394o702o069n257m239l234k419j752j174q40p06k34R89K516L555
56893A66988M088M769N851P119Q884J2046J6706K1513K4824K5863K4392K0099
56881C43142J3070M508l818j0676j5622j8423j8842j6971j3496r491n897k935
56869B44549k1L542P760J2196J6859K2329K8936L6361M4231N2360N9951O4860
$$ plain form
56956 435390 460681 487713 512634 530604 537926 533368 518229 495532 468753 440715 413358 388095
56944 388095 365802 346474 329669 315655 305555 300043 298500 299995 304649 313476 327281 346419
56932 346419 371368 402633 439647 479692 517763 547544 563496 563151 547827 521155 487104 449365
56920 449365 411557 376714 346249 319935 296994 276903 259297 243778 230111 218321 208376 199948
56908 199948 192554 185852 179783 174526 170287 167053 164634 162882 161708 160868 160162 159928 160917 163433 166988
56893 166988 171076 175845 181696 188815 197699 209745 226451 247964 272788 298651 323043 343142
56881 343142 356212 360720 356902 346226 330604 312181 293339 276368 262872 253381 247484 244549
56869 244549 244528 248070 255830 268026 284885 307214 336150 372511 416742 469102 529053 593913
56857E93913O4166N5702L9388J7668n197k4916l8856m6394m8112m5223l9438l2424
56845D90277k5002j7328r733k732L942J1361K0124K9799M0023N1413O4718P9446
56833G36308R3569J03827J05798R4868O9097L1872q773m4257o9444q3612q8593
56822I40660q6644p9726o9903n9282m9109l9361k9678k0325j1679l168O323J7032
56810E15140K8186L9359N0966O2796P2610P6538P0799N3537K6389n164l4014n5116
56798I02026o7326p2024p1026o6012n8764n0720m2552l4671k7665k1696j6070
56787C73500j0069l787K439Q900J6075K3661L0745L6403L9420L7805K9860J6084
56775F01036n90j6630k9640l8569m3186m3887m1654l7703l3071k8459k4344k1054
$$ plain form
56857 593913 658079 713781 753169 770837 765640 740724 701868 655474 607362 562139 522701 490277
56845 490277 465275 447947 438214 435482 439424 450785 470909 500708 540731 592144 656862 736308
56833 736308 829877 933704 1039502 1134370 1203467 1235339 1226566 1182309 1112865 1029253 940660
56822 940660 854016 774290 704387 645105 595996 556635 526957 506632 494953 491785 498108 515140
56810 515140 543326 582685 633651 696447 769057 845595 916394 969931 996320 991156 957142 902026
56798 902026 834700 762676 691650 625638 566874 516154 473602 438931 411266 389570 373500
56787 373500 363431 359644 362083 370983 387058 410719 441464 477867 517287 555092 584952 601036
56775 601036 600446 583816 554176 515607 472421 428534 386880 349177 316106 287647 263303 242249
56763B42249j8693j6932j5070j2629r957p903o844o314n676m828m069l657l617
56750A26060l672l243j977m28K27n18j867k644k515j959j515j347j291r76j65
56735A02170Q22J270R12K01m44j156k006k432j849n78M78R32J240J857K510K539
56719A06466J825J134J329K285K932K574J787J486J587J316O21K79N56P98O23
56704A27598N87J179J896J899J093P7n20m10J98N04j78j380j796r48J54M12j3
56687A30352k88r8L20Q22J344J677J695J554J306Q47L87M19Q94J173J053J033
56671A44490J257J134M94J22M64P47K46m61m35J75N84O18N80M11kj87L27J167
56653A51731J710J998K267K160J309K34k78k39n5L67J163J745J548J125J362K073
$$ plain form
56763 242249 223556 206624 191554 178925 168968 161065 154221 147907 142231 137403 133334 129677 126060
56750 126060 122388 119145 117168 116740 116967 116449 114582 111938 109423 107464 105949 104602 103311 102335 102170
56735 102170 102992 104262 105174 105375 104931 103775 101769 99337 97488 96910 97388 98320 99560 101417 103927 106466
56719 106466 108291 109425 110754 113039 115971 118545 120332 121818 123405 124721 125342 125621 126177 126975 127598
56704 127598 128185 129364 131260 133159 134252 134329 133809 133399 133597 134101 133923 132543 130747 129799 129953 130365 130352
56687 130352 130064 129966 130286 131108 132452 134129 135824 137378 138684 139531 139918 140337 141231 142404 143457 144490
56671 144490 145747 146881 147375 147497 147961 148708 148954 148493 148058 148233 148817 149435 150015 150426 150424 150237 150564 151731
56653 151731 153441 155439 157706 159866 161175 161409 161131 160892 160837 161204 162367 164112 165660 166785 168147 170220
56637A70220K410K143J489K38j673l185l165k115j453j379r97l62n74j744k570
56622A57283k372j957j921j666q53m19j105k052k008j112m70n03p00o78n31l14
56606A38622P8N15O76N34M35O31R74J078P12N1m87o54n22j44O06J592K125J660
56588A48482N70k17k90j5K17M30P68J168J407J275P53J48o9K05O62J118J690K204
56570A60506K141J525J185J573K074K193K566L894N534O392O592P024P606P480
56556B18285O742O547P319Q103P979P079N971M967M324M176M035L215J929J158
56542B91829J204J277P12k79j262k153k807k941k786l087m085n116n518n358n037
56527B54593m739m552m559m599m407m036l648k962j616j7Q52N61n23j960l468
$$ plain form
56637 170220 172630 174773 176262 176500 174827 171642 168477 166362 164909 163530 162533 162171 161597 159853 157283
56622 157283 154911 152954 151033 149367 148514 148095 146990 144938 142930 141818 141348 140845 140145 139467 138936 138622
56606 138622 138700 139215 139891 140425 140860 141491 142465 143543 144255 144306 143819 143165 142643 142499 143105 144697 146822 148482
56588 148482 149052 148835 148545 148530 148747 149177 149945 151113 152520 153795 154548 154696 154627 154832 155494 156612 158302 160506
56570 160506 162647 164172 165357 166930 169004 171197 173763 177657 183191 189583 196175 203199 210805 218285
56556 218285 225027 231574 238893 246996 254975 262054 268025 272992 277316 281492 285527 288742 290671 291829
56542 291829 293033 294310 295022 294743 293481 291328 288521 285580 282794 279707 275622 270506 264988 259630 254593
56527 254593 249854 245302 240743 236144 231737 227701 224053 221091 219475 219458 220310 220871 220348 218388 214920
56512B14920m434m183k884j493o77m10n33q92j078q96j004j983l052k858j639
56497A86904j093j891k767k557j730j181p60j7O78P78N91O74P75L10n10q55l46
56480A77003O17J432J678J271O21L95P10R05M12m11p25k52M42O22J79k71j68K17
56462A84677J07n54q38k15N47N78K81M80Q54N23k34l05K94M08k93p75m16J94N87
56443A85900J166K019K304J577O48L86N79O22N21N58O86P93R46J008P18L33M08
56426B01172P72O61N5k45OK20K92Q61J798J939R22o5j54n0n44j067p35J99R56
56407B06993J331J296N04q56j606j065j13J89J40N42J134J106N85L58N96Q52J063
56390B13049J548K191K489K296J964J887K193K620K554J737R31J095J841J779
$$ plain form
56512 214920 210486 206303 203419 201926 201249 200839 200306 199414 198336 197440 196436 194453 191401 188543 186904
56497 186904 185811 183920 181153 178596 176866 175685 174925 174908 175586 176364 176955 177629 178404 178714 178204 177349 177003
56480 177003 177620 179052 180730 182001 182622 183017 183727 184632 185044 184633 183908 183656 184098 184720 184899 184628 184460 184677
56462 184677 184784 184230 183392 183177 183724 184302 184583 185063 185917 186440 186206 185901 186195 186603 186310 185535 185119 185313 185900
56443 185900 187066 189085 191389 192966 193614 194000 194579 195201 195722 196280 196966 197759 198705 199713 200431 200764 201172
56426 201172 201944 202605 202660 202415 202421 202641 202933 203794 205592 207531 208453 208388 208234 208184 207640 206573 205838 206037 206993
56407 206993 208324 209620 210124 209268 207662 206597 206484 206673 206813 207355 208489 209595 210180 210538 211134 211986 213049
56390 213049 214597 216788 219277 221573 223537 225424 227617 230237 232791 234528 235459 236554 238395 240174
56376B40174O54j42K76R52P45J0l47m38q33j256r89l8J004J792K160J845R63K29
56358B46761J22M33R40J687K184J625L62q7P56J520J220Q11J327J966J525M99
56342B63651J66M89O06N85J048J689J720J329J279J447J173O17M41N77N95Q65
56326B78277J960L268L586K885K227K103K069J880J806J905J937J938J985J731
56312C09557R77M07Q05J847K619K943L302L782M030M031M036M037L995M202M690
56297C55260M803M172L536L698M278M384M038L950M347M922N496N933N872N348
56283D20037N135N671O297O300O088O403P140P779Q362R161J0002J0653J1238
56270E20266J1681J1665J1668J2876J5361J7656J8926K0116K2035K3991K5513
$$ plain form
56376 240174 240828 240686 240962 241914 242659 242669 242322 241884 241051 239795 238806 238768 239772 241564 243724 245569 246532 246761
56358 246761 246883 247316 248256 249943 252127 253752 254114 254027 254783 256303 257523 258334 259661 261627 263152 263651
56342 263651 263817 264306 264912 265497 266545 268234 269954 271283 272562 274009 275182 275799 276240 276817 277412 278277
56326 278277 280237 283505 287091 289976 292203 294306 296375 298255 300061 301966 303903 305841 307826 309557
56312 309557 310534 310941 311746 313593 316212 319155 322457 326239 330269 334300 338336 342373 346368 350570 355260
56297 355260 360063 364235 367771 371469 375747 380131 384169 388119 392466 397388 402884 408817 414689 420037
56283 420037 425172 430843 437140 443440 449528 455931 463071 470850 479212 488373 498375 509028 520266
56270 520266 531947 543612 555280 568156 583517 601173 620099 640215 662250 686241 711754
56259G11754K7690L1369L5643L9728M4578N0891N7314O2798O8965P7623Q7406
56248A295759R5681J02578J10183J18497J25314J29660J32492J34015J32969J28702
56238B505850J21469J10689R5324P6180N5624L4833J3413q291k8730m7180o4071
56227B865110p9117r1194j00258j07341j12437j14532j13902j12234j10084j06340
56217A817671j00689r4615q9310q4458p9517p4555o9324o3268n6948n1822m8150
56206A005015m4664m0614l6567l2933k9347k5932k3513k2141k0824j9048j7218
56195F92214j5389j3053j0386q320p119o209n426n079m917m385l779l736l863
56182F00553l415k815k865l005k275j373j582k172j332P09K062K431L210M359
$$ plain form
56259 711754 739444 770813 806456 846184 890762 941653 998967 1061765 1130730 1208353 1295759
56248 1295759 1391440 1494018 1604201 1722698 1848012 1977672 2110164 2244179 2377148 2505850
56238 2505850 2627319 2738008 2833332 2909512 2965136 2999969 3013382 3005091 2976361 2929181 2865110
56227 2865110 2785993 2694799 2594541 2487200 2374763 2260231 2146329 2034095 1924011 1817671
56217 1817671 1716982 1622367 1533057 1448599 1369082 1294527 1225203 1161935 1104987 1053165 1005015
56206 1005015 960351 919737 883170 850237 820890 794958 771445 749304 728480 709432 692214
56195 692214 676825 663772 653386 645066 637947 631738 626312 621233 616316 611931 608152 604416 600553
56182 600553 597138 594323 591458 588453 586178 584805 583223 581051 579719 580428 582490 584921 588131 592490
56168E92490M179K595J821K966M564N298N780O664P279P205P278Q024Q817R355
56154F74315J0258J1697J3061J4354J6187J8250J9652K0992K3996K8872L4200
56143H85834L9585M6193N4329O2891P1491Q0697Q9716R6162R8620R7251R1807
56132A714576Q1854O9385N8330N0635M5209M1075L8518L6436L1796K3271J2945
56121B204030L283n100j1908j6308j9053k2894k9535l8247m8367o0438p3602q4465
56109A797396r0196r0900q7927q2055p4348o6437n8773n0540m2040l4902k9395
56098A089883k4054j8583j4402j1683q758n278k884j876l69K185L882L920M035
56085A016018N126N786N538O150Q153R367Q661Q022R098J0721J1557J2158J2838
$$ plain form
56168 592490 596669 599264 601085 604051 608615 613913 619693 626357 633636 640841 648119 656143 664960 674315
56154 674315 684573 696270 709331 723685 739872 758122 777774 798766 822762 851634 885834
56143 885834 925419 971612 1025941 1088832 1160323 1241020 1330736 1426898 1525518 1622769 1714576
56132 1714576 1796430 1865815 1924145 1974780 2019989 2061064 2099582 2136018 2167814 2191085 2204030
56121 2204030 2207313 2202213 2190305 2173997 2154944 2132050 2102515 2064268 2015901 1955463 1881861 1797396
56109 1797396 1707200 1616300 1528373 1446318 1371970 1305533 1246760 1196220 1154180 1119278 1089883
56098 1089883 1065829 1047246 1032844 1021161 1012403 1007125 1004241 1002365 1001996 1004181 1008063 1011983 1016018
56085 1016018 1021144 1026930 1032468 1038618 1046771 1056138 1064799 1072821 1081919 1092640 1104197 1116355 1129193
56072A129193J2602J1776J2484J4913J6402J5818J5312J6130J6443J5211J4426
56061A290710J5352J6200J5748J5523J6329J6329J4889J4484J6276J7678J6865
56050A466383J5900J6696J7813J7917J8538K0539K1826K1446K1900K4464K6394
56039A689816K5915K5682K7866L0172L0439L0796L3368L5946L6176L6029L7970
56028B040175M0505M1679M3189M6669M9783N0255N0173N2066N4419N5319N6606
56017B580838O0089O3528O4757O5897O9132P2456P3963P6056Q0827Q5688Q8230
56006C381461R0885R6038J01334J04799J09529J18021J26947J33014J38781J47097
55996D547906J55256J60676J66706J76590J87329J95969K05895K20230K35326
$$ plain form
56072 1129193 1141795 1153571 1166055 1180968 1197370 1213188 1228500 1244630 1261073 1276284 1290710
56061 1290710 1306062 1322262 1338010 1353533 1369862 1386191 1401080 1415564 1431840 1449518 1466383
56050 1466383 1482283 1498979 1516792 1534709 1553247 1573786 1595612 1617058 1638958 1663422 1689816
56039 1689816 1715731 1741413 1769279 1799451 1829890 1860686 1894054 1930000 1966176 2002205 2040175
56028 2040175 2080680 2122359 2165548 2212217 2262000 2312255 2362428 2414494 2468913 2524232 2580838
56017 2580838 2640927 2704455 2769212 2835109 2904241 2976697 3050660 3126716 3207543 3293231 3381461
56006 3381461 3472346 3568384 3669718 3774517 3884046 4002067 4129014 4262028 4400809 4547906
55996 4547906 4703162 4863838 5030544 5207134 5394463 5590432 5796327 6016557 6251883
55987F251883K47999K62646K83594L06961L28134L50398L77894M07232M34995
55978I251736M66170N05805N50009N94913O46352P10314P82477Q58350R44679
55969A5310805J049120J168558J300588J456170J647082J872155K131470K442895
55961B8378843K829082L301992L879001M599977N506914O620156P957159R563100
55953G2636224J1508060J3879647J6800364K0413181K4797048K9876947L5330799
55946B25242270M0351183M3332384M2033398L4666296K1354698M620785j1770747
55939C99830267k4717289l2908356l6627268l6915708l4940962l1733557k8069018
55932A73918109k4415175k0998716j7926335j5240090j2920673j0919927r207019
$$ plain form
55987 6251883 6499882 6762528 7046122 7353083 7681217 8031615 8409509 8816741 9251736
55978 9251736 9717906 10223711 10773720 11368633 12014985 12725299 13507776 14366126 15310805
55969 15310805 16359925 17528483 18829071 20285241 21932323 23804478 25935948 28378843
55961 28378843 31207925 34509917 38388918 42988895 48495809 55115965 63073124 72636224
55953 72636224 84144284 98023931 114824295 135237476 160034524 189911471 225242270
55946 225242270 265593453 308925837 350959235 385625531 406980229 411601014 399830267
55939 399830267 375112978 342204622 305577354 268661646 233720684 201987127 173918109
55932 173918109 149502934 128504218 110577883 95337793 82417120 71497193 62290174
55925F2290174p765214o562097n555267m718050m033413l471598k998073k596638
55917B4589824k263806j987232j748780j542222j369366j223585j093399r77279
55909A2384155q79577p96291p18920o47953n88988n39351m91332m45101m06404
55900F870238l74592l44232l15574k92714k73936k54034k33758k17569k04514
55891D359315j90227j75438j63827j53896j41474j27928j17809j10547j02427
55882C075742r4606r1339r2024r2384r1710r1950r1606q7651q1823p8135p5804
55871B106710p1318o5654o2641o1696n8989n4540n1588m9935m6493m1700l9076
55860A503080l8884l8083l6176l5446l5795l4781l2496l1235l0718k8625k5479
$$ plain form
55925 62290174 54524960 47962863 42407596 37689546 33656133 30184535 27186462 24589824
55917 24589824 22326018 20338786 18590006 17047784 15678418 14454833 13361434 12384155
55909 12384155 11504578 10708287 9989367 9341414 8752426 8213075 7721743 7276642 6870238
55900 6870238 6495646 6151414 5835840 5543126 5269190 5015156 4781398 4563829 4359315
55891 4359315 4169088 3993650 3829823 3675927 3534453 3406525 3288716 3178169 3075742
55882 3075742 2981136 2889797 2797773 2705389 2613679 2521729 2430123 2342472 2260649 2182514 2106710
55871 2106710 2035392 1969738 1907097 1845401 1786412 1731872 1680284 1630349 1583856 1542156 1503080
55860 1503080 1464196 1426113 1389937 1354491 1318696 1283915 1251419 1220184 1189466 1160841 1135362
55849A135362k4049k4277k3707k2574k3528k6356k7779k6658k5116k4301k3099
55838H63918k1255j9877j8792j6886j4923j4635j5334j4829j3220j2396j2395
55827F89376j1692j0424r908r610q188o743p405r370r998r215r127r907r906r258
55813E58625r508r997q569n674l968l833l025q50R85J879L148N027O110O164O416
55798E42930O814N979L938J959k07l824p972j0132j0108j0089j0672j0088p819
55785D90709n724m938m626m463n418p285q104o960n035l162n46L502Q563J4224
55771D60737K0040K4108K3852J8655J0162L0j0528j9351k4121k4859k3696k2026
55759D33003j9848j7564j6019j4825j2943j0936j0336j0890j0825r837r302r556
$$ plain form
55849 1135362 1111313 1087036 1063329 1040755 1017227 990871 963092 936434 911318 887017 863918
55838 863918 842663 822786 803994 787108 772185 757550 742216 727387 714167 701771 689376
55827 689376 677684 667260 657352 647742 639554 632811 625406 616036 606038 596823 587696 577789 567883 558625
55813 558625 549117 539120 530551 524877 520909 517076 514051 513201 514186 516065 519213 524240 530350 536514 542930
55798 542930 549744 555723 559661 561620 561413 557589 549617 539485 529377 519288 508616 498528 490709
55785 490709 484985 480047 475421 470958 465540 458255 450151 443191 438156 434994 434448 437950 446513 460737
55771 460737 480777 504885 528737 547392 557554 557584 547056 527705 503584 478725 455029 433003
55759 433003 413155 395591 379572 364747 351804 340868 330532 319642 308817 298980 289678 280122
55747B80122r376q284o990n479l108o21M08K36O17J727J933P39o40j811l611n654
55731B40208o170m849l355k548j673p76j223l033m260l878l063k801k441j511
55717A98627p30l17O80K592M462N827P243Q495Q329O495M180J980n06k788l549
55702B41020l123l493n153o364o248o113o771p065o307n759o223o334m807k586
55688A64674j243q05n21k59Q7J116K682L584L443L417M166M716M353L853L796
55673A97059L302J698q5j064j616k216k263j424p52j065j532j145l57K8M16J491
55657A90475K703L058K591J995J524J210J293J615J381L50p00j314k085l330m210
55642A96556m054l459l210l207l311m045n490o484o023m642l525l052k944k969
$$ plain form
55747 280122 270746 262462 255472 249993 246885 246264 246672 246908 247525 249252 251185 251924 251284 249473 245862 240208
55731 240208 234038 229189 225834 223286 221613 220837 219614 216581 212321 208443 205380 202579 200138 198627
55717 198627 197897 197580 198260 200852 205314 211141 218384 226879 235208 241703 245883 247863 247357 244569 241020
55702 241020 237897 234404 229251 222887 216639 210526 203755 196690 190383 184624 178401 172067 167260 164674
55688 164674 163431 162626 162105 161846 161933 163049 165731 169315 172758 176175 180341 185057 189410 193263 197059
55673 197059 200361 202059 201974 200910 199294 197078 194815 193391 192639 191574 190042 188897 188540 188568 188984 190475
55657 190475 193178 196236 198827 200822 202346 203556 204849 206464 207845 208195 207495 206181 204096 200766 196556
55642 196556 192502 189043 185833 182626 179315 175270 169780 163296 157273 152631 149106 146054 143110 140141
55628A40141k812k068j055p48j340j893j913k099k898l541l284k473j652p31J28
55613A11762J23q28j490j077m80p91j614j915j603j252j057j038j456k205k443
55598I2636j712o19J61P23J160R86J34m92l00O3j94p93j036q47m60O6M62K14m87
55579H9665p43l40j04l43k74M84J198J537K281L608M239L428K422K556L140K743
55563A15497J453M07j41p61j497j918k011j957j537p80m89j101j704j290k96J41
55547A02016j90p06j095j224o30P55J964K090J506J108R46N55k3m64q18j047o69
55530A04074K94P20j53j505k127k092k109k059j495r33j200j952k119j581j187
55515H4576j301j476j400j229j078j009j252j747j814r50L72J358J850K058J931
$$ plain form
55628 140141 137329 135261 134206 133458 132118 130225 128312 126213 123315 119774 116490 114017 112365 111634 111762
55613 111762 111885 111057 109567 108490 108010 107219 105605 103690 102087 100835 99778 98740 97284 95079 92636
55598 92636 90924 90305 90466 91189 92349 93335 93469 92977 92677 92740 92546 91753 90717 89870 89410 89476 89938 90152 89665
55579 89665 88922 88582 88478 88135 87861 88345 89543 91080 93361 96969 101208 104636 107058 109614 112754 115497
55563 115497 116950 117357 117216 116455 114958 113040 111029 109072 107535 106755 106266 105165 103461 102171 101875 102016
55547 102016 101826 101120 100025 98801 98171 98926 100890 102980 104486 105594 106540 107095 107072 106608 105790 104743 104074
55530 104074 104368 105088 104935 103430 101303 99211 97102 95043 93548 92615 91415 89463 87344 85763 84576
55515 84576 83275 81799 80399 79170 78092 77083 75831 74084 72270 71320 71692 73050 74900 76958 78889
55500G8889J547J427J705J665Q99J56J64M44K29j58n8J94j29q12j164j327j782
55483H1889k122j602o12k40o23r09p46o31q42j077j154j165r52l57J95J32l00
55466F8884l40J77P02Q44O97M13M3l32o28p59m28M79J224Q41k78n68M27J261Q65
55447G3524J81L39O75N9r16r26j90L1l85n69m84p84j129n32P35J338J058J056
55429G3081J752K094J363L07r0J19L12K38P7J39O80J518J983J826J767K412L148
55412I2726L034K276J696J225K16j119j930k189k593l181l313k961k688k463j827
55397G6909j118j148j664j516m78M24N23J97j83o56r18m64L28M94j0l54m25r14
55379F9027j662j533m02L01k94j228j304o86j82P8L33N54P64J253J809J644O13
$$ plain form
55500 78889 80436 81863 83568 85233 86132 86288 86452 86896 87125 86967 86909 87103 86974 86162 84998 83671 81889
55483 81889 79767 78165 77553 77313 76690 75781 75035 74404 73562 72485 71331 70166 69214 68857 69052 69184 68884
55466 68884 68544 68721 69423 70267 70964 71377 71420 71088 70460 69701 69273 69752 70976 71817 71539 70971 71398 72659 73524
55447 73524 73705 74044 74719 74778 73862 72936 72746 72777 72392 71823 71339 70555 69426 68894 69629 70967 72025 73081
55429 73081 74833 76927 78290 78597 78507 78626 78938 79176 79253 79392 80072 81590 83573 85399 87166 89578 92726
55412 92726 95760 98036 99732 100957 101173 100054 98124 95935 93342 90161 86848 83887 81199 78736 76909
55397 76909 75791 74643 72979 71463 70985 71409 71932 72129 71946 71290 70372 69908 70236 70730 70720 70366 69941 69027
55379 69027 67365 65832 65430 65731 65437 64209 62905 62219 62037 62115 62448 63002 63766 65019 66828 68472 69085
55362F9085k97l25Q2K56L71P53J009O64J22P8M21M83R9k46k20J6J82K67M46P95
55342G4041J069Q76K05m77q59j171j562j613j069m99m38m33R5N57N2q72q35K05
55324F7272R29Q62Q85J307J181J76n24r5N71M43L2K96Q93Q22Q9n07p44j000j179
55305G1709p38L04J202J362Q13j13j054j597j469p52J62Q44R82O55M35Q03J402
55288G4950J389O42o4j71j5j20m59p13p30m37J88P96Q63M33J27J99K34oj22J81
55268G7165N26M81J64j08k67k76L0N56Q34O62L92L27L21J81j2k10m87o72m73r5
55248G9039j18n02m84K45J006J134Q97R50J374J747J666R77j50j121j429j331
55232H3900j414j549j060o3M42J05j74L04R58R40L92p0m03q78j343j506j490j437
$$ plain form
55362 69085 68788 68463 68545 68801 69172 69925 70934 71598 71720 71798 72219 72702 72801 72555 72335 72351 72533 72800 73246 74041
55342 74041 75110 75986 76191 75714 74855 73684 72122 70509 69440 68941 68503 68070 68165 68722 68774 67902 67067 67272
55324 67272 68201 69063 69948 71255 72436 72612 72088 71993 72564 73007 73039 73335 74228 75050 75139 74632 73888 72888 71709
55305 71709 70971 71275 72477 73839 74652 74539 73485 71888 70419 69667 69829 70673 71655 72310 72745 73548 74950
55288 74950 76339 76981 76917 76746 76731 76611 76152 75439 74709 74272 74460 75256 76119 76552 76679 76878 77112 77106 76984 77165
55268 77165 77691 78172 78336 78228 77961 77685 77715 78271 79105 79767 80159 80486 80807 80988 80976 80766 80279 79607 79134 79039
55248 79039 78921 78419 77935 78180 79186 80320 81217 82167 83541 85288 86954 87931 87781 86660 85231 83900
55232 83900 82486 80937 79877 79814 80256 80361 80187 80491 81449 82389 82781 82711 82308 81430 80087 78581 77091 75654
55214G5654j086l41J44k81j236j708j217j75P53J195J218J255J654K135K059J337
55198H1360N66J20k86q07j047p84m78n27n91k12M03O88M41j59p96j050o40J07
55180G6308N46O01O98P93L68l68l99N16J267J003K65j58m03o88m57M97J106N08
55162H2003l53l8J071J370N35j22J70O77N90J97J13M20R70J746K430K260R04q88
55144I4055j912j664p10l1j00m61l31L83Q80N62j45m02j58j57q23j694j962j306
55126H4024j93N09L04l89o41k0J033J816J947J339K26p18q65m77m09p68p07O4
55108H6075N53k7r33r44j13N38O50P95J282J660J475Q73L39K29N41Q48O81J67
55090I4689n3K67O58P48P97R77Q81L49k7J31K12l43r55p70m1L89M37N62O34J99
$$ plain form
55214 75654 74568 74227 74371 74090 72854 71146 69929 69754 70507 71702 72920 74175 75829 77964 80023 81360
55198 81360 81926 82046 81760 80953 79906 79122 78644 78117 77526 77314 77717 78405 78846 78687 77891 76841 76201 76308
55180 76308 76854 77455 78153 78946 79314 78946 78547 79063 80330 81333 81598 81440 81037 80349 79892 80389 81495 82003
55162 82003 81650 81612 82683 84053 84588 84466 84636 85313 85903 86100 86213 86633 87603 89349 91779 94039 94943 94055
55144 94055 92143 90479 89769 89738 89638 89177 88846 89229 90109 90671 90526 90124 89966 89809 88986 87292 85330 84024
55126 84024 83831 84340 84644 84255 83614 83594 84627 86443 88390 89729 89955 89237 88372 87895 87486 86718 86011 86075
55108 86075 86628 86601 85668 84724 84611 85149 85799 86594 87876 89536 91011 91884 92223 92452 92993 93841 94522 94689
55090 94689 94636 94903 95561 96309 97106 98083 98964 99313 99286 99417 99629 99286 98331 97561 97520 97909 98346 98908 99542 99741
55070I9741m05m17M1J16l45o71n85m79l54L21J419J881J106j33o97m16M8J60n7
55051A00274l13m20m32m73m73k94k04p15j675k071j308j20M15K58M4j08m68p68
55033I1149n08%Kl84k88M65J088J144J023R51N73j15l83J70J000J509J750J794
55015A00940J195k17j549j725q72j97m74j156j133j20R75J079J97o79q24m92j85
54998I4763J45O70J019P65K82L36R84J607J863J900J691J031J29m85p56j117j633
54981A03194j795j271l26N93J169J175O97L25N44R80R10L94J47L86O21N88N85
54964A08916P65Q53P31N98M21m1n82o29j10M88R48J416J631J011k71j208j311
54947A13626j173j384j656j485r05j86N47J024Q51J94k61k65k71m00r5Q07J512
$$ plain form
55070 99741 99336 98919 98960 99076 98731 98060 97475 96996 96642 96963 98382 100263 101369 101236 100539 100123 100171 100331 100274
55051 100274 99961 99541 99109 98636 98163 97869 97665 96950 95275 93204 91896 91776 92191 92449 92493 92385 91917 91149
55033 91149 90641 90641 90643 90259 89971 90436 91524 92668 93691 94642 95215 95100 94717 94887 95887 97396 99146 100940
55015 100940 102135 101918 100369 98644 97772 97575 97101 95945 94812 94692 95667 96746 96943 96264 95440 94948 94763
54998 94763 94908 95578 96597 97362 97644 97980 98964 100571 102434 104334 106025 107056 107185 106700 105944 104827 103194
54981 103194 101399 100128 99802 100395 101564 102739 103436 103761 104305 105285 106195 106589 106736 107122 107743 108331 108916
54964 108916 109681 110534 111265 111863 112284 112243 111661 111032 110922 111410 112358 113774 115405 116416 116145 114937 113626
54947 113626 112453 111069 109413 107928 107023 106837 107384 108408 109259 109453 109192 108927 108656 108256 108161 108968 110480
54930A10480J436J095J224J700K114K640L526M298M434M388M948N853O003M945
54916A59084L336J867N04j047k676l967m678m916m985n068n029m617l882l118
54902A20808k363j369k63L22R6l51l83k12m17q66q63k70K64L77N66J316K117K006
54884A20515R63J98P80K392L830M463M635M707M492L953L672L958L989K626j01
54869A65072k971m857n452m985m026l357l293l152k287j372j599k636k796j497
54855A20792k61n13j634k053j427o18k15j95n77j398k156k165j500q79o56n44
54839A04001l26j70j92j83N2L82M73J18n73j152j159o34n5L07O88J310J900K044
54821A06831J655Q86j51j205j773j566q82j88M17R86J256R07J71k87j28L21N95
$$ plain form
54930 110480 111916 113011 114235 115935 118049 120689 124215 128513 132947 137335 142283 148136 154139 159084
54916 159084 162420 164287 164791 163744 161068 157101 152423 147507 142522 137454 132425 127808 123926 120808
54902 120808 118445 117076 116813 117135 117231 116880 116497 116285 115868 115002 114139 113869 114133 114510 115076 116392 118509 120515
54884 120515 121478 121676 122456 124848 128678 133141 137776 142483 146975 150928 154600 158558 162547 165173 165072
54869 165072 162101 157244 151792 146807 142781 139424 136131 132979 130692 129320 127721 125085 122289 120792
54855 120792 120531 120018 118384 116331 114904 114286 114071 113876 113299 111901 109745 107580 106080 105201 104545 104001
54839 104001 103675 103505 103313 103130 103182 103564 104037 104155 103582 102430 101271 100637 100582 100889 101577 102887 104787 106831
54821 106831 108486 109372 109221 108016 106243 104677 103795 103607 104024 105010 106266 107173 107344 107057 106929 107250 107845
54804A07845P10J048J748K346K182J214J24m78o80q42q78m91J51O34J020J614
54788A17267K088J724O61p7l4P4l77r30r00m45q4K34P95J363J513J437J719K516
54770A28544L522M477N224N520N367N266N575N798N115L379J216p41k228l208
54756A72826l811m350m904n119m687l856l130k669k377k259k274k165j773j352
54742A28100j115q28k48L06L26j66p29j006p64K32J736K786K660J932J896K943
54726A38061M093M298L688L332L957N119N583M586K628Q16m30j585k941m124m918
54711A62163n735o723p102o079m016j974o05m0l62j373k259k330j816j285p10
54696A19754J39P69M86m10r03o55k34o2m7j52m56o30l05P0l08j178j299k48Q54
$$ plain form
54804 107845 108555 109603 111351 113697 115879 117093 117217 116739 116059 115217 114339 113848 113999 114633 115653 117267
54788 117267 119355 121079 121740 121663 121629 121703 121326 120396 119496 119051 118967 119201 119996 121359 122872 124309 126028 128544
54770 128544 132066 136543 141767 147287 152654 157920 163495 169293 174408 177787 179003 178262 176034 172826
54756 172826 169015 164665 159761 154642 149955 146099 142969 140300 137923 135664 133390 131225 129452 128100
54742 128100 126985 126157 125909 126215 126541 126375 125646 124640 123876 124108 125844 128630 131290 133222 135118 138061
54726 138061 142154 146452 150140 153472 157429 162548 168131 172717 175345 176161 175731 174146 171205 167081 162163
54711 162163 156428 149705 142603 136524 132508 130534 129929 129889 129527 128154 125895 123565 121749 120464 119754
54696 119754 119893 120662 121148 120738 119835 119180 118946 118884 118837 118685 118229 117599 117294 117364 117056 115878 114579 114331 115185
54677A15185Q25j54j004j063m54K96O24L38j14j45J22O0m05o62m42j83j76m8M36
54658A13036Q67Q79P61Q47Q38L56l09n52l27j10k07m66n75l04L34J005J310J263
54640A18646J224J284J155P46L70J57j81p38j134j209j400j934k143j315J38J023
54624A14689P74m8n64m86j74j84o48r91m14J024K253K415J845J331Q67k0j039
54607A20630j218l79L92J39p77j293r78k09O09J346J820J677Q04l63j118j064
54591A20018m30J26J52j83l73k35j5J42M29Q84J102P41P7l86n50n63l28K62P88
54572A21658O34n3n33o03p68j088q18K46J035O51j35N6J074J473O92k71m72j54
54554A22624J33M50R51J345J482J711K037J715M96m92l1J414K247J771P97K92
$$ plain form
54677 115185 116010 115856 114852 113789 113335 113631 114255 114593 114479 114334 114456 114516 114111 113449 113007 112824 112648 112600 113036
54658 113036 113903 114782 115543 116390 117228 117584 117275 116723 116396 116286 116079 115613 115038 114734 115068 116073 117383 118646
54640 118646 119870 121154 122309 123055 123425 123582 123401 122663 121529 120320 118920 116986 114843 113528 113666 114689
54624 114689 115463 115415 114851 114365 114191 114007 113359 112368 111954 112978 115231 117646 119491 120822 121689 121669 120630
54607 120630 119412 119033 119425 119564 118787 117494 116516 116307 116916 118262 120082 121759 122563 122200 121082 120018
54591 120018 119588 119714 119866 119683 119310 119075 119060 119202 119631 120515 121617 122358 122435 122049 121499 120936 120608 120870 121658
54572 121658 122292 122239 121706 121103 120335 119247 118429 118675 119710 120361 120226 120282 121356 122829 123521 123250 122778 122624
54554 122624 122757 123207 124158 125503 126985 128696 130733 132448 132944 132452 132421 133835 136082 137853 138650 138942
54538A38942L77P23J167J550J587J127L41n45j335j779j730j428j287j341j245
54523A35124q66n38o16r77j137p21J01O86N14j97p33p89p27q01o83r6N29O50M13
54504A29136L52M98M91K99J74N5l28q32j009q40o96o14l01J29J47l18o05k15N56
54485A26079J127J314J278J199J241J522J905K034J723J148O05L52N48J028J196
54470A44299O14l50r03q45o70o49m18L30J206J563J202M73q1r0L80P85N92j21
54452A47317p73r63p52l01L21R44J205Q32j63j450k384k282j174n2J38m15p87
54435A39261o11k69K2M31Q02O66J71J73R69J697J473N67j21k49j43o1O5K11J27
54416A45181k96p36o44K10J344J887J513Q03M15K01l16r40r95m21J65M60O99P99
$$ plain form
54538 138942 139319 140042 141209 142759 144346 145473 145814 145269 143934 142155 140425 138997 137710 136369 135124
54523 135124 134258 133720 133104 132127 130990 130269 130370 131056 131570 131373 130640 129851 129124 128323 127640 127544 128073 128723 129136
54504 129136 129488 129986 130477 130776 130950 131005 130677 129845 128836 127996 127300 126686 126385 126514 126661 126343 125738 125523 126079
54485 126079 127206 128520 129798 130997 132238 133760 135665 137699 139422 140570 141175 141527 142075 143103 144299
54470 144299 144913 144563 143660 142815 142145 141496 141078 141408 142614 144177 145379 145852 145771 145681 146061 146846 147438 147317
54452 147317 146544 145581 144829 144528 144849 145793 146998 147830 147667 146217 143833 141551 140377 140325 140463 140048 139261
54435 139261 138650 138381 138403 138834 139636 140302 140473 140646 141615 143312 144785 145352 145231 144982 144839 144778 144843 145054 145181
54416 145181 144885 144149 143505 143715 145059 146946 148459 149262 149677 149878 149562 148622 147627 147206 147371 147831 148530 149329
54398A49329K62p64j222n26N51Q90L47l94p86o80j25N16O50J31m26m15j0K50K32
54379A47810J88K63M27O14O09J72m48n25K58J335K043K444K884L198K950K232
54363A66454J698J811K462L193L519L212K467J684R79J73p24j477k062k645k994
54348A77750k659j965j958k932l764l392k279j617j651j671j316r19p23n28j74
54333A50202J77L36K29j12m28l07K31O12M87K27J78m3q17j574j447o22j25l38
54315A46866n67j87N64J114J241J031O09R5m05q34j027p11k0L03k69j204j514
54298A45085j034m54j99K6N18J071J389J460J354J093Q32Q07R15Q17M60J38m3
54281A54235l30q46j325j451j122l85N34J116R50L06q6O7L12J88j78l80k69N6
$$ plain form
54398 149329 149591 148827 147605 147079 147630 148520 148867 148473 147687 147007 146882 147398 148048 148179 147753 147338 147328 147578 147810
54379 147810 147998 148261 148688 149302 149911 150083 149635 149110 149368 150703 152746 155190 158074 161272 164222 166454
54363 166454 168152 169963 172425 175618 179137 182349 184816 186500 187479 187652 186928 185451 183389 180744 177750
54348 177750 175091 173126 171168 168236 164472 161080 158801 157184 155533 153862 152546 151627 150904 150376 150202
54333 150202 150379 150715 150944 150832 150404 150097 150328 150940 151427 151654 151832 151789 150972 149398 147951 147329 147204 146866
54315 146866 146299 146112 146676 147790 149031 150062 150671 150766 150361 149527 148500 147789 147769 148072 147803 146599 145085
54298 145085 144051 143597 143398 143424 143942 145013 146402 147862 149216 150309 151141 151948 152863 153680 154140 154278 154235
54281 154235 153905 153059 151734 150283 149161 148776 149310 150426 151376 151682 151596 151663 151975 152163 151985 151605 151336 151392
54263A51392N01R87J392J619J634J356P65J35q7K40P56R55O33m1p06j021q49l28
54245A59333K68O47N58n8q13j120q56n81p86j191j153n59J28N45P06P09N78L97
54227A56752L03K89K96L52L59j3q65j674j798j290p59n36m49l46l62n19n37j92
54209A49011L68P60O43J0o64p05rP31Q23L86m8l50o82q68n97n9K84M83R17J392
54189A51826J213L47l36k13L06M87J98k27n40o04l00K72P06P24M56J74jmJ94L76
54169A55054K43j08k62j34q9k86l70p3K89L20J05j1L0O9Q6J86L53M50L84J61j37
54148A56260l18l02l24o42r97p81Q8Q89R16K61m33o90m63L0L92K53l28p45m18
54129A52648N95J646K062J615O60q3p6M87R17Q20M64K84L40M00L41K61L54Q17
$$ plain form
54263 151392 151893 152880 154272 155891 157525 158881 159646 159781 159694 159934 160690 161645 162278 162237 161531 160510 159661 159333
54245 159333 159601 160248 160806 160748 159935 158815 157959 157378 156592 155401 154248 153689 153817 154362 155068 155777 156355 156752
54227 156752 157055 157344 157640 157992 158351 158338 157473 155799 154001 152711 151952 151416 150967 150621 150259 149740 149203 149011
54209 149011 149379 150139 150782 150792 150128 149423 149414 150145 150968 151354 151306 150956 150274 149406 148809 148750 149034 149517 150434 151826
54189 151826 153039 153386 153050 152837 153143 153630 153828 153601 153061 152457 152157 152429 153135 153859 154315 154489 154488 154484 154678 155054
54169 155054 155297 155189 154927 154793 154704 154418 154048 153975 154264 154584 154689 154678 154708 154777 154863 155049 155402 155852 156236 156397 156260
54148 156260 155942 155640 155316 154674 153677 152896 152984 153873 154789 155050 154617 153927 153464 153494 153886 154139 153811 153066 152648
54129 152648 153243 154889 156951 158566 159226 159143 159067 159554 160471 161291 161755 162039 162379 162779 163120 163381 163735 164552
54111A64552J625K327K331J573O83L17M95P64Q46R38J384K198K986L419L740M519
54095A94697N721O475O115N051M001K773O72j956l739m082l963m395m962m608
54081A97800l331k184j860k044k041j418j35J417K510K712K416K366K687K806
54067B01701K354J621J070P22K86m06j262k085k695k964k925k798k801k851k532
54052A84435j550j92P76Q85M54K23N88J380K159K507K263J836K030L099M156M144
54036B09193L322L010L767M687M824M485M492M772M538L582K561K046J934J911
54022B59124J999K362K805K753J766Q1j429k080k092k243k754l087k930k835l378
54007B48062m167m328l692k921k538k453k494k718l072l176k754k003j298q09
$$ plain form
54111 164552 166177 168504 170835 172408 173091 173408 173903 174667 175513 176451 177835 180033 183019 186438 190178 194697
54095 194697 200418 206893 213008 218059 222060 224833 225505 223549 219810 215728 211765 207370 202408 197800
54081 197800 194469 192285 190425 188381 186340 184922 184787 186204 188714 191426 193842 196208 198895 201701
54067 201701 204055 205676 206746 207468 207754 207348 206086 204001 201306 198342 195417 192619 189818 186967 184435
54052 184435 182885 182693 183469 184354 184808 185031 185619 186999 189158 191665 193928 195764 197794 200893 205049 209193
54036 209193 212515 215525 219292 223979 228803 233288 237780 242552 247090 250672 253233 255279 257213 259124
54022 259124 261123 263485 266290 269043 270809 270890 269461 267381 265289 263046 260292 257205 254275 251440 248062
54007 248062 243895 239567 235875 232954 230416 227963 225469 222751 219679 216503 213749 211746 210448 209639
53993B09639n79p56j380k124k548k629k690k770k368j173K14P28J13p11q08l19
53977A89839j3j13j40K14O70R13R92J017R14P37P79J177J737K320L036L879M533
53960B12491M807M979N542O870R160J2163J4807J5615J3937J0447O193J704k690
53947C16025o267q341q959q641p680o256m847l909l235k241q38N35J633K607L480
53932B63066L925L752L171K546K108J926J880J730J490J551K103K666K701K506
53918B97121K849L813M679N019N178N417N403M900M422M465M617M115L010K015
53904C57023J259O9j726l100k975j692o47o46j252j764k154k750l535m251m927
53889C26932n730o476o742o511o217o113n991n694n474n554n663n296m330l122
$$ plain form
53993 209639 209060 208304 206924 204800 202252 199623 196933 194163 191795 190622 190836 191564 191677 190966 190158 189839
53977 189839 189826 189713 189573 189787 190457 191370 192362 193379 194293 195030 195809 196986 198723 201043 204079 207958 212491
53960 212491 217298 222277 227819 234689 243849 256012 270819 286434 300371 310818 317011 318715 316025
53947 316025 309758 301417 292458 283817 276137 269881 265034 261125 257890 255649 254811 255346 256979 259586 263066
53932 263066 266991 270743 273914 276460 278568 280494 282374 284104 285594 287145 289248 291914 294615 297121
53918 297121 299970 303783 308462 313481 318659 324076 329479 334379 338801 343266 347883 351998 355008 357023
53904 357023 358282 358351 356625 353525 350550 348858 348211 347565 346313 344549 342395 339645 336110 331859 326932
53889 326932 321202 314726 307984 301473 295256 289143 283152 277458 271984 266430 260767 255471 251141 248019
53875B48019k092j459j349j856k859l814m028l274k123j432j436j673j727j715
53861B17182j809j782j421j013r56j169j380j660k045k031j208j84N9m10o00j00
53845A99473N04P67Q82Q63L57l82m72J99O29K62j46K9J79l11p95m49J93O8o52
53826B01198r48o39l81k68K95J328K065K108J805J398P45l2m22k64P3M11R83J881
53808B11336K810L473L693L370K760K602L281M158M423M285M409M566M019L046
53794B62231K801L498L981L454K516K047K044K076K000J712R55j44r97j442k010
53779B84722k950l718l883l779l807l795l586l456l501l341k991l144l902m136
53765B34733l084j747j572k296k438j625r90j204j493j035l49n20j648k741k882
$$ plain form
53875 248019 245927 244468 243119 241263 238404 234590 230562 227288 225165 223733 222297 220624 218897 217182
53861 217182 215373 213591 212170 211157 210201 209032 207652 205992 203947 201916 200708 200524 200583 200173 199573 199473
53845 199473 199977 200744 201626 202489 202846 202464 201992 202191 202820 203082 202936 202965 203144 202833 202038 201589 201782 201850 201198
53826 201198 200250 199611 199230 198962 199257 200585 202650 204758 206563 207961 208706 208674 208252 207988 208061 208472 209455 211336
53808 211336 214146 217619 221312 224682 227442 230044 233325 237483 241906 246191 250600 255166 259185 262231
53794 262231 265032 268530 272511 275965 278481 280528 282572 284648 286648 288360 289315 289171 288174 286732 284722
53779 284722 281772 278054 274171 270392 266585 262790 259204 255748 252247 248906 245915 242771 238869 234733
53765 234733 231649 229902 228330 226034 223596 221971 220981 219777 218284 217249 216900 216380 214732 211991 209109
53750B09109k085j114p47j075j377q34N09J662J759R39N8l17k61l0K92O00N83
53733B07671J43k37k8N17O27K21J75J001J901J875J272J295K113K533J775N64
53717B23418J5K19N52P58R99J265J407J603K069K531K526K225K304K955L555L511
53701B51912L014K640K575K608K729L244M152M801M537L535K527J760Q16l75j000
53686B89475m56N70Q96N03M99J414K380K277R76q69k561l520l327k218j089n40
53670B84410k33L63J027J166P93M81M24K15m18j146j498j408j116p44k64K43N16
53653B82811M43L53P13J444J803J266K26m79o25o16n90j62Q28J885K447K467K242
53636B96456K008J920K040K192K163K095K241K360K008J467J615K634L613L857
$$ plain form
53750 209109 207024 205910 205163 204088 202711 201877 202386 204048 205807 206746 206804 206487 206226 206196 206488 207088 207671
53733 207671 207814 207577 207549 208066 208693 208914 209089 210090 211991 213866 215138 216433 218546 221079 222854 223418
53717 223418 223433 223652 224204 224962 225961 227226 228633 230236 232305 234836 237362 239587 241891 244846 248401 251912
53701 251912 254926 257566 260141 262749 265478 268722 272874 277675 282212 285747 288274 290034 290850 290475 289475
53686 289475 289019 289589 290485 290988 291487 292901 295281 297558 298534 297665 295104 291584 288257 286039 284950 284410
53670 284410 284177 284540 285567 286733 287526 288007 288431 288646 288228 287082 285584 284176 283060 282316 282052 282295 282811
53653 282811 283254 283607 284320 285764 287567 288833 289059 288580 287955 287339 286749 286587 287415 289300 291747 294214 296456
53636 296456 298464 300384 302424 304616 306779 308874 311115 313475 315483 316950 318565 321199 324812 328669
53622C28669L778M008M375M517M744N448O098N784M528L226K489K242K304K576
53608C84786K720K432K034K165K815L309L298L159L259L437L396L172K880K408
53594D25270J604N96l10q70r59n54J62P35O58k37j471k247k263k118k494l106
53578D12396l036k138j399j565k208k535k471k309j975j423j227j841k655k675
53564C82939j891j104n97L3P36Q02J8q28r72n82l15m91r22j180q04L03J608K396
53546C79149K560K525K527K431K266K221K183J829J328J314K044L114M139N119
53532D14749O007O554O804P134P611P860P856Q175R189J0473J1380J1802J2037
53519E27631J2323J2739J3279J3852J4456J5351J6674J7983J8854J9762K1488
$$ plain form
53622 328669 332447 336455 340830 345347 350091 355539 361637 367421 371949 375175 377664 379906 382210 384786
53608 384786 387506 389938 391972 394137 396952 400261 403559 406718 409977 413414 416810 419982 422862 425270
53594 425270 426874 427470 427160 426290 425331 424777 424939 425674 426332 426095 424624 422377 420114 417996 415502 412396
53578 412396 409360 407222 405823 404258 402050 399515 397044 394735 392760 391337 390110 388269 385614 382939
53564 382939 381048 379944 379347 379380 380116 380918 380936 380108 379136 378554 378239 377748 376826 375646 374842 375145 376753 379149
53546 379149 381709 384234 386761 389192 391458 393679 395862 397691 399019 400333 402377 405491 409630 414749
53532 414749 420756 427310 434114 441248 448859 456719 464575 472750 481939 492412 503792 515594 527631
53519 527631 539954 552693 565972 579824 594280 609631 626305 644288 663142 682904 704392
53508G04392K3609K4685K4307K3849K4523K5678K5978K5383K4863K4675K4177
53497I76119K3175K2306K2006K1945K1712K1353K1045K0782K0531K0337K0148
53486A211459J9906J9723J9677J9547J9153J8841J9036J9469J9410J8693J7904
53475A422818J7462J7033J6083J4565J2761J0830Q765O585M289J746j128m156
53463A527653o934r116j0672j1942j3307j4718j5680j5910j5812j6056j6839j7847
53451A362820j8831j9844k0938k1945k2642k2886k2659k2175k1784k1519k0927
53440A126670j9679j8156j6920j5787j3979j1311q565o542n314m519l948l412
53428I98538k522r97R59K864M387N525O589Q105J0287J2513J3844J4312J5120
$$ plain form
53508 704392 728001 752686 776993 800842 825365 851043 877021 902404 927267 951942 976119
53497 976119 999294 1021600 1043606 1065551 1087263 1108616 1129661 1150443 1170974 1191311 1211459
53486 1211459 1231365 1251088 1270765 1290312 1309465 1328306 1347342 1366811 1386221 1404914 1422818
53475 1422818 1440280 1457313 1473396 1487961 1500722 1511552 1520317 1526902 1531191 1532937 1531809 1527653
53463 1527653 1520719 1511603 1500931 1488989 1475682 1460964 1445284 1429374 1413562 1397506 1380667 1362820
53451 1362820 1343989 1324145 1303207 1281262 1258620 1235734 1213075 1190900 1169116 1147597 1126670
53440 1126670 1106991 1088835 1071915 1056128 1042149 1030838 1022273 1015731 1010417 1005898 1001950 998538
53428 998538 996016 995019 995978 998842 1003229 1008754 1015343 1023448 1033735 1046248 1060092 1074404 1089524
53415A089524J7118J9613K1263K1790K2099K2938K4225K5627K7099K8643L0119
53404A350058L1568L3306L5426L7582L9431M1032M2654M4465M6468M8534N0388
53393A800912N1911N3432N5341N7298N8421N8522N8578N9458O0642O0823N9553
53382B434891N7611N5808N4101N2073M9681M7150M4411M1089L6962L2264K7506
53371B933547K3079J8986J4914J0552N722K31o161j3469k1235k8809l5795m2051
53359B859511m7438n1803n5138n7501n8863n9318n9254n8994n8432n7344n5876
53348B239550n4224n2118m9315m6579m5200m5337m5647m5002m3774m2851m2143
53337A727360m0918l9103l7281l5587l3513l0842k8042k5540k3212k0805j8384
$$ plain form
53415 1089524 1106642 1126255 1147518 1169308 1191407 1214345 1238570 1264197 1291296 1319939 1350058
53404 1350058 1381626 1414932 1450358 1487940 1527371 1568403 1611057 1655522 1701990 1750524 1800912
53393 1800912 1852823 1906255 1961596 2018894 2077315 2135837 2194415 2253873 2314515 2375338 2434891
53382 2434891 2492502 2548310 2602411 2654484 2704165 2751315 2795726 2836815 2873777 2906041 2933547
53371 2933547 2956626 2975612 2990526 3001078 3006800 3007031 3000870 2987401 2966166 2937357 2901562 2859511
53359 2859511 2812073 2760270 2705132 2647631 2588768 2529450 2470196 2411202 2352770 2295426 2239550
53348 2239550 2185326 2133208 2083893 2037314 1992114 1946777 1901130 1856128 1812354 1769503 1727360
53337 1727360 1686442 1647339 1610058 1574471 1540958 1510116 1482074 1456534 1433322 1412517 1394133
53326A394133j6177j4328j2983j2288j2232j2665j3446j4315j4710j4191j2989
53315A243809j1750j0741r760q754p931p182n998m171k142m06R94K218L348M533
53301A186067N970P456Q484R127J0252J2408J4991J7073J8609K0201K1974K3489
53289A356101K4619K5760K7053K8062K8387K8118K7393K6040K3949K1480J9168
53278A636130J7190J5365J3508J1544R404O989M218J027k552o204r419j1995j4321
53265A670884j6950j9912k2625k4584k5895k7046k8254k9286k9893l0261l0773
53254A385405l1475l1989l1993l1595l1058l0414k9610k8871k8457k8123k7283
53243A054537k5903k4842k4905k5841k6651k6686k5984k4713k2953k1090j9778
$$ plain form
53326 1394133 1377956 1363628 1350645 1338357 1326125 1313460 1300014 1285699 1270989 1256798 1243809
53315 1243809 1232059 1221318 1211558 1202804 1194873 1187691 1181693 1177522 1175380 1174974 1175968 1178186 1181534 1186067
53301 1186067 1192037 1199493 1207977 1217104 1227356 1239764 1254755 1271828 1290437 1310638 1332612 1356101
53289 1356101 1380720 1406480 1433533 1461595 1489982 1518100 1545493 1571533 1595482 1616962 1636130
53278 1636130 1653320 1668685 1682193 1693737 1703141 1710130 1714348 1715375 1712823 1706619 1697200 1685205 1670884
53265 1670884 1653934 1634022 1611397 1586813 1560918 1533872 1505618 1476332 1446439 1416178 1385405
53254 1385405 1353930 1321941 1289948 1258353 1227295 1196881 1167271 1138400 1109943 1081820 1054537
53243 1054537 1028634 1003792 978887 953046 926395 899709 873725 849012 826059 804969 785191
53232G85191j9136j8458j7183j5715j4723j4030j2857j1058r302q105p389p152
53220F30083p682q751r406r248r207j0306j2050j3002j2754j2300j2448j2766
53208E00163j2464j1523j0444r413q310p213o462o260o570p182p715p791p504
53195C91312p419p817q171p792o845o214o403o992p313p211o945o618o016n004
53181B94552l820k889k415k235k052j808j679j789j998k094k039j941j837j678
53167B64278j441j143p70l45n9j15m49p30p68p11p67q89r39j037j451k095k398
53150B48171j898p80K71P26N81K01m9m9J7j01l40l41N4M54M15P8q8l5o9k4P02
53129B47896K051K941K537J391O45N44M50J07k4K96P00R70J452K310K916K503
$$ plain form
53232 785191 766055 747597 730414 714699 699976 685946 673089 662031 652729 644624 637235 630083
53220 630083 622401 613650 604244 594996 585789 575483 563433 550431 537677 525377 512929 500163
53208 500163 487699 476176 465732 456319 448009 440796 434334 428074 421504 414322 406607 398816 391312
53195 391312 383893 376076 367905 360113 353268 347054 340651 333659 326346 319135 312190 305572 299556 294552
53181 294552 290732 287843 285428 283193 281141 279333 277654 275865 273867 271773 269734 267793 265956 264278
53167 264278 262837 261694 260924 260579 260520 260405 259956 259226 258458 257747 256980 256091 255152 254115 252664 250569 248171
53150 248171 246273 245493 245764 246490 247071 247272 247223 247174 247191 247090 246750 246409 246463 246917 247332 247410 247322 247287 247218 247194 247896
53129 247896 249947 252888 255425 256816 257461 258005 258455 258562 258538 258834 259534 260504 261956 264266 267182 269685
53113B69685J111n31j786k467k601k303j825j466j317j261j200j213j421j761
53099B49644j898j558r17m85m29k84L23R09O78k95r98p76p8L57M59N99Q23Q36
53081B46910N40O9n19j193j685j694j313q92m77J63Q62R13m9j276j509m10Q92
53064B39332R98k31j622k072j584q13j17N36J026J046O07R4k20l58k96R9O85J044
53046B38154J022Q79P53M40r7m08j88J80J09l76p06n00O5N28N22k8p88j167q36
53027B37558j16L07O1n32p42j06J022J704J390O11L63Q61J386J375J053Q07N30
53010B47532L3m18n00m19n59q18p98n07l51n07p16o80l50J69O85R16P08K11k70
52991B43361n21m54r0K90L37J15J27N55R57R94J023J444J922J816J180O71O12
$$ plain form
53113 269685 270796 270265 268479 266012 263411 261108 259283 257817 256500 255239 254039 252826 251405 249644
53099 249644 247746 246188 245271 244786 244357 244073 244396 245305 245983 245688 244690 243914 243836 244193 244652 245251 246074 246910
53081 246910 247450 247519 247000 245807 244122 242428 241115 240223 239746 239909 240771 241684 241635 240359 238850 238440 239332
53064 239332 240330 240099 238477 236405 234821 234008 233891 234427 235453 236499 237106 237200 236980 236622 236326 236425 237110 238154
53046 238154 239176 240055 240808 241248 241151 240743 240555 240735 240844 240468 239762 239262 239327 239855 240377 240349 239561 238394 237558
53027 237558 237442 237749 237810 237278 236536 236430 237452 239156 240546 241157 241520 242381 243767 245142 246195 247002 247532
53010 247532 247565 247147 246647 246228 245669 244851 244053 243546 243195 242688 241972 241292 240942 241111 241796 242712 243420 243631 243361
52991 243361 242840 242386 242296 242586 242923 243038 243165 243720 244677 245671 246694 248138 250060 251876 253056 253727 254339
52974B54339P66Q98R79R00N72K99M73Q68Q95N06K57L85M41P9l61l60J03O17P44
52955B63400K53p01j501j597j213j057j269j265p96m61o90q89l48M70M65m79j194
52938B51128q12J34N51K28j51j25l6m08j190j845j920j375m56M83J107J219Q84
52921B47416L35j54l61k19L6K3k70l82l3L47J93l02m81k80k54n20m94LK76j62
52901B44717p29o69j81Q9J62M71R17R73O00J80j86n51m60N70J957K444J705P06
52883B52715K27kl96o78n51m19p28j177j204q98o78m59J96J213K034K444K727
52866B54366K932K595J544M65J55M79N29j45j016j447j574j894k305k211j539
52851B50934r40q59j087j389j888k442k422j682j137j603k563k922k550k159j947
$$ plain form
52974 254339 255105 256003 256982 257882 258454 258753 259226 260094 260989 261495 261752 262137 262578 262657 262296 261936 262039 262656 263400
52955 263400 263653 262952 261451 259854 258641 257584 256315 255050 254254 253793 253103 252214 251866 252336 252801 252322 251128
52938 251128 250316 250450 251001 251229 251078 250953 250917 250509 249319 247474 245554 244179 243723 244206 245313 246532 247416
52921 247416 247751 247597 247236 247017 247053 247076 246806 246424 246391 246738 246931 246629 246148 245868 245614 245094 244600 244603 244879 244717
52901 244717 243988 243319 243138 243227 243389 243860 244777 245750 246350 246530 246344 245793 245333 245903 247860 250304 252009 252715
52883 252715 252942 252940 252544 251866 251315 250896 250168 248991 247787 246889 246211 245752 245948 247161 249195 251639 254366
52866 254366 257298 259893 261437 261902 262057 262536 263065 262920 261904 260457 258883 256989 254684 252473 250934
52851 250934 249994 249135 248048 246659 244771 242329 239907 238225 237088 235485 232922 230000 227450 225291 223344
52836B23344j398l75N95J147J380J264O68k2j24L23N78L43M9p9l01n27j57Q39
52818B27547J602J512R19M00J29K80J085K092K263J367L67q5n12j328j796j248
52802B34594m39n17j309j806j774j761j831j500q23m12m69n85n02l18p9J53J4
52785B20636o40j128p08L04R63J056J100J154P56L8j99K24M94R7m20m14j42k52
52767B22919q30j415j550r84K13J431J809J102j6p75j023r47o02J3O73J128J361
52750B22507J424J254R40Q76J367K146K602K400J810J363J248J101N50o5J02J278
52734B42903K553K893K402J892J577R76L2n47m04k14p44j786k524k600k325k105
52718B41979k033j971j693j041j64M53M35j04o93q87n06K98J065J352J160Q84
$$ plain form
52836 223344 221946 221571 222166 223313 224693 225957 226625 226603 226479 226802 227380 227723 227772 227693 227392 226865 226708 227547
52818 227547 229149 230661 231580 231980 232109 232389 233474 235566 237829 239196 239563 239478 238966 237638 235842 234594
52802 234594 234155 233638 232329 230523 228749 226988 225157 223657 222834 222422 221953 221368 220866 220548 220469 220622 220636
52785 220636 219996 218868 218160 218464 219427 220483 221583 222737 223493 223531 223332 223556 224050 224147 223727 223313 223171 222919
52767 222919 222089 220674 219124 218140 218353 219784 221593 222695 222679 221904 220881 219934 219332 219345 220018 221146 222507
52750 222507 223931 225185 226125 227001 228368 230514 233116 235516 237326 238689 239937 241038 241588 241523 241625 242903
52734 242903 245456 248349 250751 252643 254220 255196 255228 254681 254277 254063 253319 251533 249009 246409 244084 241979
52718 241979 239946 237975 236282 235241 235077 235530 235965 235861 235168 234281 233775 234073 235138 236490 237650 238534
52702B38534Q08Q27P66P14Q66J190J436J321O80l60j283j459o89N76J594J872
52686B47393J402N40k83q65j254j448j227m96M00R08P92J85o64j424j705j392
52670B40862q57m77j43L28N93K19m37n00K61J227J887K299K517K339J912J811
52654B53841K158K342J942J312Q33L46k15l89o2p4j089k367k622j775r30p74q94
52637B51583p21k55K79P60J012R00P60J098J733J934J492J031Q48K98j096k562
52621B59094k883k023j137j003j217j073o42m49n38l69L96J358J797J417N99M9
52605B53376J93Q06J214R65L41LJ14K10lp4N15J426J750J164K61l31n77o48n14
52586B60191k26j42m04n53j08O90J187J175R94R32Q82N87o3q99j390j006lN37
$$ plain form
52702 238534 239342 240169 240935 241649 242515 243705 245141 246462 247142 246782 245499 244040 243351 243927 245521 247393
52686 247393 248795 249335 249052 248187 246933 245485 244258 243762 244162 245070 245862 246047 245383 243959 242254 240862
52670 240862 240005 239528 239385 239713 240306 240525 240088 239588 239849 241076 242963 245262 247779 250118 252030 253841
52654 253841 255999 258341 260283 261595 262428 262774 262559 262170 262108 262034 260945 258578 255956 254181 253251 252477 251583
52637 251583 250862 250607 250886 251646 252658 253558 254318 255416 257149 259083 260575 261606 262454 262752 261656 259094
52621 259094 256211 254188 253051 252048 250831 249758 249116 248667 248129 247760 248156 249514 251311 252728 253327 253376
52605 253376 253569 254375 255589 256554 256895 256898 257012 257222 257219 257145 257660 259086 260836 262000 262261 261930 261353 260705 260191
52586 260191 259965 259823 259419 258866 258758 259448 260635 261810 262804 263736 264618 265205 265142 264243 262853 261847 261844 262381
52568B62381J2o76j97J242K036J351J66k74j16l08j064j805k236k493k448j748
52552B53823n85L42P33Q56P80K15o49r44l09M05K35n63r38m93K13N94N76L23N7
52533B54671J70Q55J581J542P21n7l13m19p10q44m93p2p5k37l8L25K51k13m12
52514B56233q2M80J158K113L003L029K109J251J235J522J156K09m29n09p10j428
52498B70340k084k000j428j110j147r43k57K89O2o56j051q39m58k41K4N57J135
52481B60193J414J382J066K53j027j993j736k93J368K372K529J977Q99k43p66
52466B67395l39P29J917K887L408L300K666J829R24j48j276k092k467k622k587
52451B73524k058j094m06n14j042j261j027o48k18L41P49N25l18j227j770k018
$$ plain form
52568 262381 262393 261717 261520 262762 264798 266149 266315 266041 265925 265617 264553 262748 260512 258019 255571 253823
52552 253823 253238 253580 254313 255169 255949 256164 255515 254571 254262 254667 254902 254339 253401 252908 253121 253715 254291 254614 254671
52533 254671 254841 255696 257277 258819 259540 259483 259170 258751 258041 257197 256704 256632 256557 256320 256282 256607 256858 256645 256233
52514 256233 256151 256631 257789 259902 262905 265934 268043 269294 270529 272051 273207 273416 272987 272478 271768 270340
52498 270340 268256 266256 264828 263718 262571 261628 261371 261660 261722 261066 260015 259176 258718 258477 258501 259058 260193
52481 260193 261607 262989 264055 264308 263281 261288 259552 259259 260627 262999 265528 267505 268404 268161 267395
52466 267395 267056 267785 269702 272589 275997 279297 281963 283792 284716 284568 283292 281200 278733 276111 273524
52451 273524 271466 270372 269966 269452 268410 267149 266122 265474 265256 265597 266346 266871 266553 265326 263556 261538
52435B61538k195k280k060j388m01M71Q59R24J202J761J934J303N04M63J089J516
52419B65240J517J744K420K724K065J181J195K021K587K540K797M210O389Q296
52405C06926R463J0088J0202R452P605M806J308k509n757p380p314o735o677o812
52391C16666o240n046m131l707l021j777p97p18q95k80J115K348K806K614K174
52376C01111J906K206K991L454K977K107J975K676L114K503J334N63M51N57M68
52361C30393J50j32K1P55J624J937J601J220J203J273J161J204J734K281K066
52346C48491J124L44L79J050J834K438K691K454J928J758K462L897N475O704P319
52331C90348P255O878P042Q332J0265J1702J2170J2311J2876J3812J4597J5061
$$ plain form
52435 261538 259343 257063 255003 253615 253214 253685 254544 255468 256670 258431 260365 261668 262172 262635 263724 265240
52419 265240 266757 268501 270921 273645 275710 276891 278086 280107 282694 285234 288031 292241 298630 306926
52405 306926 316389 326477 336679 346131 353736 358542 359850 357341 351584 344204 336890 330155 323478 316666
52391 316666 310426 305380 301249 297542 294521 292744 291947 291229 290334 290054 291169 293517 296323 298937 301111
52376 301111 303017 305223 308214 311668 314645 316752 318727 321403 324517 327020 328354 328917 329368 329925 330393
52361 330393 330543 330411 330432 331187 332811 334748 336349 337569 338772 340045 341206 342410 344144 346425 348491
52346 348491 349615 349959 350338 351388 353222 355660 358351 360805 362733 364491 366953 370850 376325 383029 390348
52331 390348 397603 404481 411523 419855 430120 441822 453992 466303 479179 492991 507588 522649
52319E22649J5334J5364J5016J4586J4634J5359J6475J7654J8661J9125J8798
52308G03655J8031J7487J7271J6952J6492J6503J7272J8109J8130J7182J5643
52297H92727J3795J1892J0343R230P950N931L513J488L4j314k746l940m713n339
52283I38851o002o453o315n493m173k750j728j404j495j342n25R08K629M203N235
52268I14146N691O028O634P320P697P862Q320R297J0582J1910J3065J3712J3725
52255A035989J3611J4038J4854J5163J4476J3262J2179J1255J0058Q232N724K811
52243A171652O9j999l414m536n500o217o880p797q779r266r214r143r253r178
52229A080545q848q779r109r141q441p667p599p844p315n748l966k791k333k272
$$ plain form
52319 522649 537983 553347 568363 582949 597583 612942 629417 647071 665732 684857 703655
52308 703655 721686 739173 756444 773396 789888 806391 823663 841772 859902 877084 892727
52297 892727 906522 918414 928757 937987 945937 951868 955381 956869 956903 955589 952843 948903 944190 938851
52283 938851 932849 926396 920081 914588 910415 907665 905937 904533 903038 901696 901171 902079 904708 908911 914146
52268 914146 919837 925865 932499 939819 947516 955378 963698 972995 983577 995487 1008552 1022264 1035989
52255 1035989 1049600 1063638 1078492 1093655 1108131 1121393 1133572 1144827 1154885 1163117 1168841 1171652
52243 1171652 1171721 1169722 1166308 1161772 1156272 1150055 1143175 1135378 1126599 1117333 1108119 1098976 1089723 1080545
52229 1080545 1071697 1062918 1053809 1044668 1036227 1028560 1020961 1013117 1005802 1000054 996088 993297 990964 988692
52215I88692k195j627l07J462L019L995M456M539M298L946L871M210M597M487
52201A027443L782L102L338M702O280O869O300N545N431N742N764N259M381L163
52187A097101J599j2j312k306l218m069m756n401o157o879p318p456p356o923
52173A035537o176n478n044m506l524k445j832j554j055l32Q3J11K88Q31J350
52158A006254J578J732J867J576P32m9j41K91O43O82O55Q77J487K398L170L208
52142A026960K334R42n36j988l188l531k708j309k22M71J435L029M832O323P540
52127A040384Q849J0409J2112J3855J5635J7411J9078K0539K1727K2531K2783
52116A225313K2393K1563K0802K0626K1055K1497K1241K0203J9007J8289J7945
$$ plain form
52215 988692 986497 984870 984563 986025 989044 993039 997495 1002034 1006332 1010278 1014149 1018359 1022956 1027443
52201 1027443 1031225 1034327 1037665 1042367 1048647 1055516 1061816 1067361 1072792 1078534 1084298 1089557 1093938 1097101
52187 1097101 1098700 1098688 1097376 1095070 1091852 1087783 1083027 1077626 1071469 1064590 1057272 1049816 1042460 1035537
52173 1035537 1029361 1023883 1018839 1014333 1010809 1008364 1006532 1004978 1003923 1003591 1003674 1003785 1004073 1004904 1006254
52158 1006254 1007832 1009564 1011431 1013007 1013739 1013690 1013549 1013840 1014483 1015165 1015820 1016697 1018184 1020582 1023752 1026960
52142 1026960 1029294 1030236 1029700 1027712 1024524 1020993 1018285 1016976 1016754 1017225 1018660 1021689 1026521 1032844 1040384
52127 1040384 1049233 1059642 1071754 1085609 1101244 1118655 1137733 1158272 1179999 1202530 1225313
52116 1225313 1247706 1269269 1290071 1310697 1331752 1353249 1374490 1394693 1413700 1431989 1449934
52105A449934J7345J6201J4974J4178J3554J2296J0030P225M542K161j10k444
52093A559886n002p932j0989j3395j4548j4742j4719j4729j4460j3831j3177j2597
52081A409765j1776j0616r471q466p175n473m046l473l166k036K1K105L757N536
52067A355486P889J0283J1953J2965J3847J4578J4703J4354J4273J4749J5145
52056A500225J4848J4010J2988J1521R217O421L925J872l09k786m952o372p518
52043A553090r024j0786j2240j3250j4104j4880j5351j5462j5430j5410j5452
52032A401701j5736j6431j7284j7769j7687j7427j7493j8009j8567j8488j7325
52021A209485j5419j3756j2987j2786j2465j1907j1377j0785r907r127r079r536
$$ plain form
52105 1449934 1467279 1483480 1498454 1512632 1526186 1538482 1548512 1555737 1560279 1562440 1562330 1559886
52093 1559886 1554884 1546952 1535963 1522568 1508020 1493278 1478559 1463830 1449370 1435539 1422362 1409765
52081 1409765 1397989 1387373 1377902 1369436 1362261 1356788 1352742 1349269 1346103 1344067 1344088 1346193 1349950 1355486
52067 1355486 1363375 1373658 1385611 1398576 1412423 1427001 1441704 1456058 1470331 1485080 1500225
52056 1500225 1515073 1529083 1542071 1553592 1562809 1569230 1573155 1575027 1574718 1571932 1566980 1560608 1553090
52043 1553090 1544066 1533280 1521040 1507790 1493686 1478806 1463455 1447993 1432563 1417153 1401701
52032 1401701 1385965 1369534 1352250 1334481 1316794 1299367 1281874 1263865 1245298 1226810 1209485
52021 1209485 1194066 1180310 1167323 1154537 1142072 1130165 1118788 1108003 1098096 1088969 1079890 1070354
52009A070354r627r393j0023j2113j4577j6091j6793j7579j8277j7697j5467j2750
51997H99967j0967j0504j0918j1704j2468j2869j2864j2869j3299j4052j4606
51986G62847j4656j4479j4652j5419j6362j6780j6446j5759j5156j4566j3687
51975E94885j2434j0888r033o945n031l647k603j467j97R59K048L295M360M436
51961E57738L328J823O48l30j551k887l955m847n815o404n782m003k179j101k37
51946E24446J374L689N749P008P915R103J0586J2026J3379J4754J5885J6275J5926
51933F58115J5508J5676J6483J7552J8485J8782J7660J4381Q814J547o525j4491
51921G81987k1436k6579k9562l0533k9867k8001k5412k2572j9698j6712j3595
$$ plain form
52009 1070354 1060727 1051334 1041311 1029198 1014621 998530 981737 964158 945881 928184 912717 899967
51997 899967 889000 878496 867578 855874 843406 830537 817673 804804 791505 777453 762847
51986 762847 748191 733712 719060 703641 687279 670499 654053 638294 623138 608572 594885
51975 594885 582451 571563 562530 555585 550554 546907 544304 542837 542640 543599 545647 548942 553302 557738
51961 557738 561066 562889 563537 563207 561656 558769 554814 549967 544152 537748 531966 527963 525784 524683 524446
51946 524446 525820 529509 535258 542266 550181 559284 569870 581896 595275 610029 625914 642189 658115
51933 658115 673623 689299 705782 723334 741819 760601 778261 792642 801456 803003 796478 781987
51921 781987 760551 733972 704410 673877 644010 616009 590597 568025 548327 531615 518020
51910E18020j0644q279o608n336m059k626j196k2P71J111P51p11l298o241q340
51895D63293q984q634q203q053p769o829n343l982l245k866k020k08K140M016
51881D03313M855N024N274N874O480O777O887O992O758N561L333R00p89j613k171
51866D63455k831l333l385l161k928k520j639m85L99Q56J209J543J453P03k95
51851D49041j039j704k877m606o160o752o316n443m796m639m740m601l836k513
51837C89019j143k99q9m0M23J356K210K444K048J329L43j014k429l132k705j650
51821C86671q02m24j85J18K84J33j34j27L59J176J876J975J305K05p99j467j816
51804C88348j798j293m65K18M41L19J64J73L97P17P52J16r93j747j542p43k39
$$ plain form
51910 518020 507376 499097 492489 487153 483094 480468 479272 479250 480021 481132 481883 481172 477874 471633 463293
51895 463293 454309 445675 437472 429419 421650 414821 409478 405496 402251 399385 397365 397157 399297 403313
51881 403313 408168 413192 418466 424340 430820 437597 444484 451476 458234 463795 467128 468028 467239 465626 463455
51866 463455 460624 457291 453906 450745 447817 445297 443658 443173 443572 444428 445637 447180 448633 449336 449041
51851 449041 448002 446298 443421 438815 432655 425903 419587 414144 409348 404709 399969 395368 391532 389019
51837 389019 387876 387577 387488 387448 387871 389227 391437 393881 395929 397258 397601 396587 394158 391026 388321 386671
51821 386671 385869 385445 385260 385378 385662 385795 385661 385534 385893 387069 388945 390920 392225 392430 391631 390164 388348
51804 388348 386550 385257 384792 385010 385451 385770 385934 386107 386504 387221 387973 388089 387096 385349 383807 383064 382825
51787C82825l57n73l12K79N51J90l76m76N2P63J308J892K827L815M252M224M589
51770D05473N763O949P094O205N070L976K500N59j221k391l311m435n565o314
51756D20352o804p333p631p072n651m154l317l205l458l673l433k448r46L72J074
51741C62673J456J980K492K438J797J245J306J701J841J679J635J811J791J289
51727C87134O13K38K20L50N91R59J165Q41J41l43l77l25m82n50j06P20J334J355
51709C93478R38O03R42K211L978N286N407M326K488L67j490k463k373j725j004
51694D10969o4J302K494K547J393p2j228k355l793n169n829n627m884l954l102
51679C82628k488k011j455r78j031j544j716r91J45Q79J232J888L117M443N384
$$ plain form
51787 382825 382468 381895 381583 381862 382413 382603 382227 381751 381803 382566 383874 385766 388593 392408 396660 400884 405473
51770 405473 411236 418185 425279 431484 436554 440530 443030 443589 442368 439977 436666 432231 426666 420352
51756 420352 413548 406215 398584 391512 385861 381707 378390 375185 371727 368054 364621 362173 361227 361599 362673
51741 362673 364129 366109 368601 371039 372836 374081 375387 377088 378929 380608 382243 384054 385845 387134
51727 387134 387747 387985 388205 388555 389146 390105 391270 392111 392252 391909 391532 391207 390725 390175 390069 390789 392123 393478
51709 393478 394416 395019 395961 398172 402150 407436 412843 417169 419657 420024 418534 416071 413698 411973 410969
51694 410969 410905 412207 414701 417248 418641 418569 417341 414986 411193 406024 400195 394568 389684 385730 382628
51679 382628 380140 378129 376674 375696 374665 373121 371405 370414 370559 371438 372670 374558 377675 382118 387502
51664C87502N897O046N679M704L318J838M00r67k064k404j544L73K540M212N479
51649D21009O795P762P124M330N01k811n241p294q902r337q424o854n218l644
51635C89796k430j989j890r79R22K345K015O32j78j09k79j226k106k082j576j523
51619C79343j999k327k205k066k330k806l056k992k877k856k790k512j969j086
51605C45472K31J735K809L121L151L712M939O198P063P896R226J0778J1427J0107
51591D27865O675K083k191n051o331o481n830m451k622r21M08J782L740O289Q946
51576D23910J1119J2289J2284J1689J1584J2457J3615J4025J3365J1841R583O972
51564E64733N247N802Q736J2853J7147K1580K6148K9968L1807L1065K7918K2964
$$ plain form
51664 387502 393399 399445 405124 409828 413146 414984 415384 414417 412353 409949 408405 408778 411318 415530 421009
51649 421009 427804 435566 442690 447020 447521 444710 439469 432175 423273 413936 405512 398658 393440 389796
51635 389796 387366 385377 383487 382508 383430 385775 387790 388422 388244 388135 387856 386630 384524 382442 380866 379343
51619 379343 377344 375017 372812 370746 368416 365610 362554 359562 356685 353829 351039 348527 346558 345472
51605 345472 345703 347438 350247 353368 356519 360231 365170 371368 378431 386327 395553 406331 417758 427865
51591 427865 434540 436623 434432 429381 423050 416569 410739 406288 403666 402745 403153 404935 408675 414964 423910
51576 423910 435029 447318 459602 471291 482875 495332 508947 522972 536337 548178 557761 564733
51564 564733 569980 575782 584518 597371 614518 636098 662246 692214 724021 755086 783004 805968
51552H05968J7137J1456O281J003n044j1512j7220k1328k3946k5738k7286k8688
51540F81083k9409k8574k5871k2151j8766j6244j4021j1480q777o461m713l415
51528D91201k643k577l077l738m465n447o518o944o286n053m152l872l939m245
51514D28245m922n602n464m364l284l171l763m160m113l975l718k954j911j472
51500C75372j848k129j557o28k66m78n73l34j70k06q2K74L45j11n24k04O55J159
51482C68695P69j62q73r72o41l12k50l85m83m23l74o35j258j897k160k124k316
51465C54199l027l812l875k960j560l69K72M04K94L15O92J196J401J320J498K227
51449C48215L121L759M437N801P907J0050J1530J2093J1768J0640Q936P020N180
$$ plain form
51552 805968 823105 834561 840842 841845 836801 825289 808069 786741 762795 737057 709771 681083
51540 681083 651674 623100 597229 575078 556312 540068 526047 514567 505790 499329 494616 491201
51528 491201 488558 485981 482904 479166 474701 469254 462736 455792 449506 444453 440301 436429 432490 428245
51514 428245 423323 417721 412257 407893 404609 401438 397675 393515 389402 385427 381709 378755 376844 375372
51500 375372 373524 371395 369838 369210 368944 368466 367893 367559 367389 367183 367101 367375 367720 367609 367085 366881 367536 368695
51482 368695 369464 369302 368429 367457 366816 366504 366254 365869 365386 364963 364589 363954 362696 360799 358639 356515 354199
51465 354199 351172 347360 343485 340525 338965 338596 338868 339272 339566 339881 340573 341769 343170 344490 345988 348215
51449 348215 351336 355095 359532 365333 373240 383290 394820 406913 418681 429321 438257 445277 450457
51436D50457L637K657K342K230J452m89l194n761p517q395q714q794q675q200
51422D03036p300o110m845l774l279l543l998l588k047m48N0k99l25L26Q88Q69
51406C65613P33Q63Q87O01O91J735L059L470K832K090J912K082K186K208K356
51391C93318K777L569M680N834O859Q110J0067J2671J5471J8367K1619K5179K8574
51378E57095L1539L4292L6953L9134M0249L9771L7254L2606K6494J9910J3163
51367I08460N837k093r834j6771k3166k9250l4282l7274l8257l8083l7230l5556
51355F12501l3093l0300k7448k4468k1443j8650j6034j3256j0434q307p351p190
51343C94527p064o512n452m054k763k067j927j795j335p89m21q2M05Q70J126J335
$$ plain form
51436 450457 454094 456751 459093 461323 462775 462286 459092 453331 445814 437419 428705 419911 411236 403036
51422 403036 395736 389626 384781 381007 377728 374185 370187 366599 364552 364104 364154 363855 363530 363856 364744 365613
51406 365613 366346 367209 368096 368697 369388 371123 374182 377652 380484 382574 384486 386568 388754 390962 393318
51391 393318 396095 399664 404344 410178 417037 425147 435214 447885 463356 481723 503342 528521 557095
51378 557095 588634 622926 659879 699013 739262 779033 816287 848893 875387 895297 908460
51367 908460 914297 912204 902370 885599 862433 833183 798901 761627 723370 685287 648057 612501
51355 612501 579408 549108 521660 497192 475749 457099 441065 427809 417375 409068 401717 394527
51343 394527 387463 380951 375499 371445 368682 366615 364688 362893 361558 360769 360348 360266 360671 361541 362667 364002
51327C64002J605J617J082K44m63r90j419j510j106p15r92j740k095j701j013
51312C54806m66n6J46j85r26j378j147p12o18o70m32j20l41j132j892k203k227
51295C40447k228k118j677r76l91k09k59O0J126K534L426L518L374L542L853L927
51279C57949L866L871L559K433Q49k00l52k00k12J7J012K492L610L843L280K291
51263C88108J228L61k80r12j635k179k175j619r43o76j078j932k604k508j741
51248C69415j093j223j881k169j574o01k45r16j906k117j306l44p7k38J9P56J132
51231C55632P75N21J229K475L018K360J195M06K04L05M34M58L07J7k92n03m81
51214C68060q0O37J239J301R18O04O88J094J651K231K578K422J940J746K072K365
$$ plain form
51327 364002 365607 367224 368306 368550 368087 367097 365678 364168 363062 362347 361355 359615 357520 355819 354806
51312 354806 354340 354284 354430 354245 353319 351941 350794 350082 349464 348794 348362 348242 347901 346769 344877 342674 340447
51295 340447 338219 336101 334424 333448 333057 332848 332589 332649 333775 336309 339735 343253 346627 350169 354022 357949
51279 357949 361815 365686 369245 371678 372527 372327 371975 371775 371563 371580 372592 375084 378694 382537 385817 388108
51263 388108 389336 389697 389417 388505 386870 384691 382516 380897 379954 379278 378200 376268 373664 371156 369415
51248 369415 368322 367099 365218 363049 361475 360874 360629 359713 357807 355690 354384 354040 353963 353725 353744 354500 355632
51231 355632 356407 356928 358157 360632 363650 366010 367205 367611 367815 368120 368554 369012 369319 369336 369044 368541 368060
51214 368060 367980 368617 369856 371157 372075 372679 373367 374461 376112 378343 380921 383343 385283 387029 389101 391466
51198C91466J978J096N18N80P68M93j22m67k57J72L12nn89j125j346j184q66p47
51180C90675q69q01j87O42R22L57m86q15m01L71R61J017N71O4J6M33P66O38L11
51161C94185J21j35p91j536j725j403j342j936k631k743k294j719j242r50j074
51146C72785j649k103j789q54q2J44K04M85P48O34M37Q71K027L036K971J936R36
51129C80737P39J154J583J880K294K731K644J865J024P84R83J010Q38J048J770
51114D03084K299K028J334J018J185J277J036Q34R63J149J091R65J042J134R85
51099D21424Q82J245J719J405J90r04j022n68m33n89k85O15J336J355J152J411
51083D28933K005K252J852J110M05j04l36k51J0K21M04Q05J454J990K131K107
$$ plain form
51198 391466 393444 394540 395058 395638 396406 396899 396777 396310 396053 396225 396537 396532 395943 394818 393472 392288 391422 390675
51180 390675 389806 389005 388818 389460 390382 390739 390253 389438 389037 389408 390369 391386 391957 392021 392037 392470 393236 393874 394185
51161 394185 394306 394171 393380 391844 390119 388716 387374 385438 382807 380064 377770 376051 374809 373859 372785
51146 372785 371136 369033 367244 366390 366308 366452 366656 367141 367889 368523 368960 369831 371858 374894 377865 379801 380737
51129 380737 381476 382630 384213 386093 388387 391118 393762 395627 396651 397435 398418 399428 400266 401314 403084
51114 403084 405383 407411 408745 409763 410948 412225 413261 414095 415058 416207 417298 418263 419305 420439 421424
51099 421424 422306 423551 425270 426675 426865 425961 424939 424371 423938 423349 423064 423679 425015 426370 427522 428933
51083 428933 430938 433190 435042 436152 436557 436453 436117 435866 435876 436097 436501 437306 438760 440750 442881 444988
51067D44988K429L272M297N110N753O648Q019R552J0660J1098J1186J1345J1497
51054E45854J1162J0126Q847P998P756P696P279O246M645K796J214K23n49j856
51040F19437l878n887p151p721p899p394n775l590k161k146l050m279n806p390
51026E45310q066p207n530m186l243j915n3J567K453L057L975N141O184P036P920
51011E52443Q967J0117J1186J1943J2313J2476J2548J2311J1614J0843J0446J0076
50999F87283Q947P020N142L813K544Q37q80j811j855j586j477j556j527q72R03
50984G04925L758O994R961J2524J4690J6061J6182J5158J3667J2563J2706J4687
50972H53876J8276K2421K6263K9966L4138L8762M3248M7302N1157N4984N8612
$$ plain form
51067 444988 447417 450689 454986 460096 465849 472497 480516 490068 500728 511826 523012 534357 545854
51054 545854 557016 567142 575989 583987 591743 599439 606718 612964 617609 620405 621619 621842 621293 619437
51040 619437 615559 609672 602521 594800 586901 579507 573732 570142 567981 565835 562785 558506 552700 545310
51026 545310 537244 530037 524507 520321 517078 515163 515110 516677 519130 522187 526162 531303 537487 544523 552443
51011 552443 561410 571527 582713 594656 606969 619445 631993 644304 655918 666761 677207 687283
50999 687283 696230 703250 708392 712205 714749 715586 714706 712895 711040 709454 707977 706421 704894 704022 704925
50984 704925 708683 715677 725638 738162 752852 768913 785095 800253 813920 826483 839189 853876
50972 853876 872152 894573 920836 950802 984940 1023702 1066950 1114252 1165409 1220393 1279005
50961A279005O1765O4234O5777O6182O5416O3498O0406N6351N1829M7036M1534
50950A923033L5107K8547K2990J8582J4552J0565P284N475N095N355N176L569
50938B085330K17m035p750j0159j1599j2821j4455j7050k0853k5279k9291l2632
50926A899623l6087m0231m4522m8117n0931n3323n5218n6182n6088n5120n3302
50915A350502n0589m7263m3792m0390l7080l4016l1333k8843k6295k3801k1577
50904I65523j9503j7352j5320j3794j2669j1459j0067q889q110p401o504n558
50892H28897m696l680k313q49K77R05J154J192J240J573K247K981L595M392N770
50877H42685P531Q875R233Q940Q919R786J1334J2918J4225J5479J6910J8322J9537
$$ plain form
50961 1279005 1340770 1405004 1470781 1536963 1602379 1665877 1726283 1782634 1834463 1881499 1923033
50950 1923033 1958140 1986687 2009677 2028259 2042811 2053376 2060660 2066135 2071230 2076585 2081761 2085330
50938 2085330 2085547 2081512 2073762 2063603 2052004 2039183 2024728 2007678 1986825 1961546 1932255 1899623
50926 1899623 1863536 1823305 1778783 1730666 1679735 1626412 1571194 1515012 1458924 1403804 1350502
50915 1350502 1299913 1252650 1208858 1168468 1131388 1097372 1066039 1037196 1010901 987100 965523
50904 965523 946020 928668 913348 899554 886885 875426 865359 856470 848360 840959 834455 828897
50892 828897 824201 820521 818208 817359 817636 818541 819695 820887 822127 823700 825947 828928 832523 836915 842685
50877 842685 850216 859091 868324 877264 886183 895969 907303 920221 934446 949925 966835 985157 1004694
50864A004694K0942K3134K6017K8889L1570L4821L9221M4201M8868N3430N8938
50853A414725O5767P3234Q0811Q8876R7778J06893J15278J22790J29906J36647
50843B432705J42382J46525J48830J48939J46181J39962J30090J16712J00375
50834C652701Q2083O2955M3699K4815P223p840j9680k8419l4138l6271l4286k8650
50822C684192k0810j2323m311K426P090Q706O279n96j1193k4035l8018n2856o8292
50809C476259q3371r6951j08617j18587j26834j32718j35466j34709j30687j24199
50799B284120j16280j07574r8125q7933p7527o7668n8652n0244m2135l4137k6184
50788A517661j8588j2171p677n008l368k126j247r72j479k782m619o479q041r424
$$ plain form
50864 1004694 1025636 1048770 1074787 1103676 1135246 1170067 1209288 1253489 1302357 1355787 1414725
50853 1414725 1480492 1553726 1634537 1723413 1821191 1928084 2043362 2166152 2296058 2432705
50843 2432705 2575087 2721612 2870442 3019381 3165562 3305524 3435614 3552326 3652701
50834 3652701 3734784 3797739 3841438 3866253 3873476 3865636 3845956 3817537 3783399 3747128 3712842 3684192
50822 3684192 3663382 3651059 3646748 3649174 3656264 3664970 3671249 3670653 3659460 3635425 3597407 3544551 3476259
50809 3476259 3392888 3295937 3187320 3068733 2941899 2809181 2673715 2539006 2408319 2284120
50799 2284120 2167840 2060266 1962141 1874208 1796681 1729013 1670361 1620117 1577982 1543845 1517661
50788 1517661 1499073 1486902 1479225 1474217 1470849 1468723 1467476 1466504 1465025 1462243 1457624 1451145 1443104 1433680
50774A433680j0719j1623j2010j2523j3874j5757j7252j8263j9663k1857k4050
50763A256089k5251k5295k4473k2897k0789j8795j7335j5964j3928j1169q359
50752A051834o031m133k239L4K849O065R408J2783J6281J9907K3548K7266L1262
50739A188834L5435L9406M3109M6973N1287N5782O0011O3804O7137O9960P2355
50728A794093P4465P6011P6446P5798P4810P3813P1991O8216O2163N4054M3826
50717B545686L1358J7235K692j1115k3228l2586l8370m0622m0011l7035l1938
50706B342066k5320j8173j1241m801R17N467Q348R036O923J730o088j5714k6631
50693B266519l8379m9837n9447o6324p0634p2794p2872p0894o7156o1931n5401
$$ plain form
50774 1433680 1422961 1411338 1399328 1386805 1372931 1357174 1339922 1321659 1301996 1280139 1256089
50763 1256089 1230838 1205543 1181070 1158173 1137384 1118589 1101254 1085290 1071362 1060193 1051834
50752 1051834 1045803 1041670 1039431 1039465 1042314 1048379 1057787 1070570 1086851 1106758 1130306 1157572 1188834
50739 1188834 1224269 1263675 1306784 1353757 1405044 1460826 1520837 1584641 1651778 1721738 1794093
50728 1794093 1868558 1944569 2021015 2096813 2171623 2245436 2317427 2385643 2447806 2501860 2545686
50717 2545686 2577044 2594279 2596971 2585856 2562628 2530042 2491672 2451050 2411039 2374004 2342066
50706 2342066 2316746 2298573 2287332 2282531 2283448 2288915 2297263 2306299 2313222 2314952 2308864 2293150 2266519
50693 2266519 2228140 2178303 2118856 2052532 1981898 1909104 1836232 1765338 1698182 1636251 1580850
50682A580850m8085m0849l4037k7064j9357j1333l907K782R479J6614K3513K9144
50670A477750L3248L6324L8641L9760L9165L6995L3850L0161K6112K2092J8683
50659A832781J6177J4414J3231J2568J2131J1403J0298R305Q788Q624Q787R703
50647A968210J1583J3967J6525J9738K4045K8812L3007L6616M0381M4251M7157
50636B284292M8373M8172M6976M4782M1824L8976L6942L5650L4837L4608L4720
50625B730152L3617K8781J8252K000j7625l6670n1414o0108o3076o1357n5859
50614B466693m7715l8520k9545k1086j3075n829J67M738P770Q794P369L595k198
50601B341158r957j9559l0177m0536m9675n7134o2656o6345o8825p0592p1225
$$ plain form
50682 1580850 1532765 1491916 1457879 1430815 1411458 1400125 1396218 1399000 1408479 1425093 1448606 1477750
50670 1477750 1510998 1547322 1585963 1625723 1664888 1701883 1735733 1765894 1792006 1814098 1832781
50659 1832781 1848958 1863372 1876603 1889171 1901302 1912705 1923003 1932308 1941096 1949720 1958507 1968210
50647 1968210 1979793 1993760 2010285 2030023 2054068 2082880 2115887 2152503 2192884 2237135 2284292
50636 2284292 2332665 2380837 2427813 2472595 2514419 2553395 2590337 2625987 2660824 2695432 2730152
50625 2730152 2763769 2792550 2810802 2812802 2795177 2758507 2707093 2646985 2583909 2522552 2466693
50614 2466693 2418978 2380458 2350913 2329827 2316752 2310923 2311090 2315828 2323598 2332392 2339761 2343356 2341158
50601 2341158 2331201 2311642 2281465 2240929 2191254 2134120 2071464 2005119 1936294 1865702 1794477
50590A794477o9896o6709o2882n9416n6171n2587m8707m5024m1599l7967l3855
50579A219664k9567k5543k1810j8125j4439j1002p944m972j674J890N058P195
50567A098731Q439R634J1484J3845J6034J7753J9513K1961K5047K8131L0716L2777
50555A334065L4332L5298L5904L6763L8094L9242L9363L8377L6830L5127L3420
50544A736815L2012L1305L1405L2266L4107L7075M0678M4219M7770N2043N7191
50533B176886O2567O7841P3552Q0192Q7504R5131J03240J11807J19846J26105
50523C104671J30331J33180J35014J35201J32662J26672J17198J04651Q9349P1285
50513D280214N0638K8439O167j5463l6762n7906p8023r5724j09963j20037j25472
$$ plain form
50590 1794477 1724581 1657872 1594990 1535574 1479403 1426816 1378109 1333085 1291486 1253519 1219664
50579 1219664 1190097 1164554 1142744 1124619 1110180 1099178 1091234 1086262 1084588 1086478 1091536 1098731
50567 1098731 1107170 1116804 1128288 1142133 1158167 1175920 1195433 1217394 1242441 1270572 1301288 1334065
50555 1334065 1368397 1403695 1439599 1476362 1514456 1553698 1593061 1631438 1668268 1703395 1736815
50544 1736815 1768827 1800132 1831537 1863803 1897910 1934985 1975663 2019882 2067652 2119695 2176886
50533 2176886 2239453 2307294 2380846 2461038 2548542 2643673 2746913 2858720 2978566 3104671
50523 3104671 3235002 3368182 3503196 3638397 3771059 3897731 4014929 4119580 4208929 4280214
50513 4280214 4330852 4359291 4365458 4349995 4313233 4255327 4177304 4081580 3971617 3851580 3726108
50502C726108j26386j23507j17226j07184r3311p6659n8583l9590j9833k45J7785
50491B981369L3550M6883N6961O2085O0720N2211L6708J5303r847l6227o1951
50480C237765q5594j05443j19933j28850j33285j34249j32134j27341j20568j12230
50470B038138j02601r2684q4008p7144p1278o5577o0179n5371n0682m5502l9981
50459A293131l4590k9345k4100j9148j4885j1188p669m313j327J300L599N309
50447A156774O294O985Q015R594J1618J3914J5962J6819J6046J4432J3098J2100
50435A301651J0674Q687O989O207N952N520M823M270M148M453N176O373Q014R914
50421A392851J1856J3837J6212J9466K3638K8224L2778L7520M3018M9333N5808
$$ plain form
50502 3726108 3599722 3476215 3358989 3251805 3158494 3081835 3023252 2983662 2963829 2963584 2981369
50491 2981369 3014919 3061802 3118763 3180848 3241568 3293779 3330487 3345790 3335943 3299716 3237765
50480 3237765 3152171 3046728 2926795 2797945 2664660 2530411 2398277 2270936 2150368 2038138
50470 2038138 1935537 1842853 1758845 1681701 1610423 1544846 1484667 1429296 1378614 1333112 1293131
50459 1293131 1258541 1229196 1205096 1185948 1171063 1159875 1152206 1147893 1146566 1147866 1151465 1156774
50447 1156774 1163068 1170053 1178068 1187662 1199280 1213194 1229156 1245975 1262021 1276453 1289551 1301651
50435 1301651 1312325 1321012 1328001 1334208 1340160 1345680 1350503 1354773 1358921 1363374 1368550 1374923 1382937 1392851
50421 1392851 1404707 1418544 1434756 1454222 1477860 1506084 1538862 1576382 1619400 1668733 1724541
50410A724541O1681O6620P0667P3922P6346P7638P7340P5172P1259O5856N9047
50399B500089N0866M1615L1651K0896Q848m834j9835l5131m9319o1232p0545p7626
50387B335443q2567q4650q3159p8482p1821o4058n5444m6216l6746k6913j6241
50376A689146m956N694J4494K1111K5570K7453K6205K1791J4620N103o148j8051
50364A822032k9407l9393m7378n2768n5585n6747n7042n6048n2949m8249m3653
50353A282813m0090l6760l2489k7238k1848j7070j3552j2217j3674j7278k1358
50342A029239k4422k5825k5566k3988k1726j9335j6822j3847j0496p420n132l509
50330H31151k150r56k8P41J697K966M201M893M966N014N762P229Q503Q656P689
$$ plain form
50410 1724541 1786222 1852842 1923509 1997431 2073777 2151415 2228755 2303927 2375186 2441042 2500089
50399 2500089 2550955 2592570 2624221 2645117 2653965 2649131 2629296 2594165 2544846 2483614 2413069 2335443
50387 2335443 2252876 2168226 2085067 2006585 1934764 1870706 1815262 1769046 1732300 1705387 1689146
50376 1689146 1684190 1689884 1704378 1725489 1751059 1778512 1804717 1826508 1841128 1846231 1840083 1822032
50364 1822032 1792625 1753232 1705854 1653086 1597501 1540754 1483712 1427664 1374715 1326466 1282813
50353 1282813 1242723 1205963 1173474 1146236 1124388 1107318 1093766 1081549 1067875 1050597 1029239
50342 1029239 1004817 978992 953426 929438 907712 888377 871555 857708 847212 839792 834660 831151
50330 831151 829001 828045 828017 828758 830455 833421 837622 842515 847481 852495 858257 865486 873989 882645 890334
50315H90334O437N594N149M791M369L894L372K899K686K830L203L680M236M663
50301I48137M541L737K741K172K040J839J285P06N83R51J399J565J567J839K499
50286I77601L034K772J695M90l02p74j118r71K27K349M512N920O506O725O973
50271A015639P341P716P970Q091Q099P900P351O638O368P112Q881J1288J4031
50258A124425J6997J9940K2460K4305K5513K6168K6202K5495K4055K2155K0334
50247A378049J9157J8809J8924J8932J8413J7041J4427J0281M708j864q824j5385
50235A492668k0761k4714k7541k9235k9044k6463k2354j8351j5416j3747j3887
50224A251155j6698k1872k7522l1821l4392l5613l5358l3362l0270k7333k5088
$$ plain form
50315 890334 896771 902365 907514 912305 916674 920568 923940 926839 929525 932355 935558 939238 943474 948137
50301 948137 952678 956415 959156 961328 963368 965207 966492 967198 967781 968732 970131 971696 973263 975102 977601
50286 977601 980635 983407 985102 985592 985290 984516 983398 982427 982654 985003 989515 995435 1001941 1008666 1015639
50271 1015639 1022980 1030696 1038666 1046757 1054856 1062756 1070107 1076745 1083113 1090225 1099106 1110394 1124425
50258 1124425 1141422 1161362 1183822 1208127 1233640 1259808 1286010 1311505 1335560 1357715 1378049
50247 1378049 1397206 1416015 1434939 1453871 1472284 1489325 1503752 1514033 1518741 1516877 1508053 1492668
50235 1492668 1471907 1447193 1419652 1390417 1361373 1334910 1312556 1294205 1278789 1265042 1251155
50224 1251155 1234457 1212585 1185063 1153242 1118850 1083237 1047879 1014517 984247 956914 931826
50213I31826k3053k0742j8310j6100j4182j2586j1542j1080j0655r546p722o033
50201G70275n361n648n969n646m955m481m147l514k822k954m112n246n241m157
50187G06022k887k049j766k010k582k922k625j981j540j312r15l81j63l81o25
50172F81883n39j14O15J615K566K974K774K446K455K886L604M369M757M518M105
50157G20914M434N931Q149J0416J2353J3749J4480J4875J5575J6738J7810J8498
50145H73922J9502K1722K5072K8664L2088L5837M0482M5815N1013N5218N7851
50134A287186N8650N7795N5943N3968N2488N1573N0767M9410M6835M2397L5479
50123A842491K5819J3882P12j2658k5472l7027m6594n3848n9113o2860o4990o4934
$$ plain form
50213 931826 908773 888031 869721 853621 839439 826853 815311 804231 793576 784030 776308 770275
50201 770275 764914 759266 753297 747651 742696 738215 734068 730554 727732 724778 720666 715420 710179 706022
50187 706022 703135 701086 699320 697310 694728 691806 689181 687200 685660 684348 683433 683052 682889 682508 681883
50172 681883 681344 681230 681845 683460 686026 689000 691774 694220 696675 699561 703165 707534 712291 716809 720914
50157 720914 725348 731279 739428 749844 762197 775946 790426 805301 820876 837614 855424 873922
50145 873922 893424 915146 940218 968882 1000970 1036807 1077289 1123104 1174117 1229335 1287186
50134 1287186 1345836 1403631 1459574 1513542 1566030 1617603 1668370 1717780 1764615 1807012 1842491
50123 1842491 1868310 1882192 1882904 1870246 1844774 1807747 1761153 1707305 1648192 1585332 1520342 1455408
50111A455408o2447n8106n2973m7921m3304l9109l5351l2297l0247k9029k7910
50100I96714k6254k4173k2271k0734j9037j6670j3874j1302r185p155m985l011
50088H18063j634o59M05J555K235K229K117K564L417L931L793L538L851M794N847
50073H56046O512O676O507O148N538M556L360K415K018J843J216j37j823l293
50059H97582m297m777m654m037l504l750m835n959o152n131l457j828m45Q98K281
50044H47935L592M897O474Q241R614J0317J0978J2357J4226J5645J6316J6851
50032I77443J7599J8027J7568J6519J5487J4565J3656J3150J3614J4974J6710
50021A149312J8688K1079K3532K5209K5785K5747K5423K4392K2304J9769J7871
$$ plain form
50111 1455408 1392961 1334855 1281882 1233961 1190657 1151548 1116197 1083900 1053653 1024624 996714
50100 996714 970460 946287 924016 903282 884245 867575 853701 842399 833214 826059 821074 818063
50088 818063 816429 815770 816175 817730 819965 822194 824311 826875 830292 834223 838016 841554 845405 850199 856046
50073 856046 862558 869234 875741 881889 887427 891983 895343 897758 899776 901619 902835 902698 900875 897582
50059 897582 893285 888508 883854 879817 876313 872563 867728 861769 855617 850486 847029 845201 844756 845654 847935
50044 847935 851527 856424 862898 871139 880753 891070 902048 914405 928631 944276 960592 977443
50032 977443 995042 1013069 1030637 1047156 1062643 1077208 1090864 1104014 1117628 1132602 1149312
50021 1149312 1168000 1189079 1212611 1237820 1263605 1289352 1314775 1339167 1361471 1381240 1399111
50010A399111J7000J6622J6028J4931J3345J1294Q676N072k54p796j7041k6461
49998A450527l4524m0587m4753m7121m7555m6134m3476m0421l7533l5043l3008
49987A000372l1367k9889k8319k6553k4624k2577k0521j8678j7088j5429j3421
49976G51906j1380r926r148q518p761p268p285p216o282m615l151k519k500k498
49962F61839k067r99N61K008K743K898L252M310N798P125P895P898P097N884M944
49947G21186M455L849K633J125m6q51j766l004m415n958p718r432j0594j1144
49933F78320j1520j1898j1940j1517j1050j0734r923q017n637m091l666l163j456
49920E73708J038K917L440L141K978L354L965M211L691K637J919K363L920N746
$$ plain form
50010 1399111 1416111 1432733 1448761 1463692 1477037 1488331 1497007 1502079 1501825 1494029 1476988 1450527
49998 1450527 1416003 1375416 1330663 1283542 1235987 1189853 1146377 1105956 1068423 1033380 1000372
49987 1000372 969005 939116 910797 884244 859620 837043 816522 797844 780756 765327 751906
49976 751906 740526 730600 721452 712934 705173 697905 690620 683404 677122 672507 669356 666837 664337 661839
49962 661839 659772 658773 659334 661342 664085 666983 670235 674545 680343 687468 695363 703261 710358 716242 721186
49947 721186 725641 729490 732123 733248 733202 732351 730585 727581 723166 717208 709490 700058 689464 678320
49933 678320 666800 654902 642962 631445 620395 609661 599738 591721 586084 581993 578327 575164 573708
49920 573708 574746 577663 581103 584244 587222 590576 594541 598752 602443 605080 606999 609362 613282 619028
49906F19028P160Q173Q969R388R230Q779Q425P961O841N148L737L129K722J459
49892G10149r37l763o204q024r422j0506j1112j0989j0128q910p964p728q060
49879F06402q361q107p329o521o076n858n422m610l724l043k416j532m10P16J820
49864E45529L008M133M973N795P185R078J0628J1319J1672J2232J2423J1216Q740
49851F57931O294M740L671K403J046R0m93j162k186l540n191o974q385q989q972
49836F30283q852q678q003o633m958l375j894m41P96J642K170K435K301J931K156
$$ plain form
49906 619028 626188 634361 643330 652718 661948 670727 679152 687113 693954 699102 702839 705968 708690 710149
49892 710149 709212 705449 699245 691221 681799 671293 660181 649192 639064 630154 622190 614462 606402
49879 606402 598041 589934 582605 576084 570008 564150 558728 554118 550394 547351 544935 543403 542993 543709 545529
49864 545529 548537 552670 557643 563438 570623 579701 590329 601648 613320 625552 637975 649191 657931
49851 657931 664225 668965 672636 675039 676085 676175 675682 674520 672334 668794 663603 656629 648244 639255 630283
49836 630283 621431 612753 604750 598117 593159 589784 587890 587449 588245 589887 592057 594492 596793 598724 600880
$$ [...]
##END NTUPLES=NMR SPECTRUM
##END=
