
##TITLE=AC1302_PERAH12114_7525498_Bu7zzF2CVs
##JCAMPDX= 6.0         $$ Bruker NMR JCAMP-DX V2.0
##DATA TYPE= NMR SPECTRUM
##DATA CLASS= NTUPLES
##ORIGIN= BRUKER
##OWNER= Administrator
$$ 1.72 TOPSPIN		Version 2.1
$$ 2013-02-20 21:34:06.140 -0500  Administrator@X
$$ Compression mode = diff/dup
##.OBSERVE FREQUENCY= 400.02188249412
##.OBSERVE NUCLEUS= ^1H
##.ACQUISITION MODE= SIMULTANEOUS (DQD)
##.ACQUISITION SCHEME= undefined
##.AVERAGES= 8
##.DIGITISER RES= 22
##SPECTROMETER/DATA SYSTEM= spect
##.PULSE SEQUENCE= zg30
##.SOLVENT NAME= COFFEE_meoh
##.SHIFT REFERENCE= INTERNAL, COFFEE_meoh, 1, 14.98509
##AUDIT TRAIL= $$ (NUMBER, WHEN, WHO, WHERE, PROCESS, VERSION, WHAT)
$$ ##TITLE= Audit trail, TOPSPIN		Version 2.1
$$ ##JCAMPDX= 5.01
$$ ##ORIGIN= Bruker BioSpin GmbH
$$ ##OWNER= Administrator
$$ $$ E:\/data/COFFEE/nmr/AC1302_PERAH12114_7525498_Bu7zzF2CVs/40/pdata/1/auditp.txt
$$ ##AUDIT TRAIL=  $$ (NUMBER, WHEN, WHO, WHERE, PROCESS, VERSION, WHAT)
(   1,<2013-02-20 21:33:57.703 -0500>,<Administrator>,<X>,<go>,<TOPSPIN 2.1>,
      <created by zg
	started at 2013-02-20 21:32:51.531 -0500,
	POWCHK enabled, PULCHK disabled,
       configuration hash MD5:
       86 BA 57 50 F2 9D 5C 9B 26 00 A9 28 5F 66 2E 89
       data hash MD5: 64K
       65 53 DC 86 DC 80 B2 57 BC 3E A2 97 31 6F D5 DA>)
(   2,<2013-02-20 21:34:00.875 -0500>,<Administrator>,<X>,<proc1d>,<TOPSPIN 2.1>,
      <Start of raw data processing
       efp LB = 0 FT_mod = 6 PKNL = 1 PHC0 = 0 PHC1 = 0 SI = 32K 
       data hash MD5: 32K
       9E FB 65 5E 42 35 A2 E7 BF 5E DB 14 9E 3C 09 05>)
(   3,<2013-02-20 21:34:01.375 -0500>,<Administrator>,<X>,<proc1d>,<TOPSPIN 2.1>,
      <pk PHC0 = 68.36792 PHC1 = 0 
       data hash MD5: 32K
       F4 D9 D5 16 EF D7 39 6E 94 88 F4 CC A2 39 1C 87>)
(   4,<2013-02-20 21:34:01.609 -0500>,<Administrator>,<X>,<proc1d>,<TOPSPIN 2.1>,
      <abs ABSG = 1 
       data hash MD5: 32K
       66 53 AF 22 57 97 70 AA 93 BB B7 7C BA 54 7E C3>)
(   5,<2013-02-20 21:34:01.765 -0500>,<Administrator>,<X>,<proc1d>,<TOPSPIN 2.1>,
      <abs ABSG = 2 
       data hash MD5: 32K
       37 84 3C BE F4 9D BE 90 16 36 CB 97 68 59 E8 CA>)
(   6,<2013-02-20 21:34:01.906 -0500>,<Administrator>,<X>,<proc1d>,<TOPSPIN 2.1>,
      <abs ABSG = 3 
       data hash MD5: 32K
       D8 A6 30 DB D8 B5 DF 3F 34 0E AB 6B 03 5F 22 FF>)
(   7,<2013-02-20 21:34:02.062 -0500>,<Administrator>,<X>,<proc1d>,<TOPSPIN 2.1>,
      <abs ABSG = 4 
       data hash MD5: 32K
       14 83 99 AC 16 13 8B CE 43 0E EC 33 67 22 3F DC>)
(   8,<2013-02-20 21:34:02.218 -0500>,<Administrator>,<X>,<proc1d>,<TOPSPIN 2.1>,
      <abs ABSG = 5 
       data hash MD5: 32K
       10 86 64 84 29 25 5A FE 7B 8B 6A 5D 15 8D C5 42>)
$$ ##END=
$$ 
$$ $$ hash MD5
$$ $$ 85 38 0B 42 EF 29 B3 0A 87 1E ED 5C 89 6B E8 76
##$RELAX= 
##$RELAX= 
##$RELAX= 
##$RELAX= 
##$RELAX= 
##$RELAX= 
##$RELAX= 
$$ Bruker specific parameters
$$ --------------------------
##$DU= <E:\>
##$EXPNO= 40
##$NAME= <AC1302_PERAH12114_7525498_Bu7zzF2CVs>
$$ [...]
150 150 150 150 150 150 150 150
##$TP07= 0
##$TPNAME0= <>
##$TPNAME1= <>
##$TPNAME2= <>
##$TPNAME3= <>
##$TPNAME4= <>
##$TPNAME5= <>
##$TPNAME6= <>
##$TPNAME7= <>
##$TPOAL= (0..7)
0.5 0.5 0.5 0.5 0.5 0.5 0.5 0.5
##$TPOFFS= (0..7)
0 0 0 0 0 0 0 0
##$TUNHIN= 0
##$TUNHOUT= 0
##$TUNXOUT= 0
##$USERA1= <user>
##$USERA2= <user>
##$USERA3= <user>
##$USERA4= <user>
##$USERA5= <user>
##$V9= 5
##$VALIST= <valist>
##$VCLIST= <CCCCCCCCCCCCCCC>
##$VD= 0
##$VDLIST= <DDDDDDDDDDDDDDD>
##$VPLIST= <PPPPPPPPPPPPPPP>
##$VTLIST= <TTTTTTTTTTTTTTT>
##$WBST= 1024
##$WBSW= 4
##$XGAIN= (0..3)
0 0 0 0
##$XL= 0
##$YL= 0
##$YMAX_a= 555931
##$YMIN_a= -552684
##$ZGOPTNS= <>
##$ZL1= 120
##$ZL2= 120
##$ZL3= 120
##$ZL4= 120
##$ABSF1= 14.98509
##$ABSF2= -5.573092
##$ABSG= 5
##$ABSL= 3
##$ALPHA= 0
##$AQORDER= 0
##$ASSFAC= 0
##$ASSFACI= 0
##$ASSFACX= 0
##$ASSWID= 0
##$AUNMP= <proc_prof1d_extract_pilot.lims>
##$AXLEFT= 0
##$AXNAME= <>
##$AXNUC= <1H>
##$AXRIGHT= 0
##$AXTYPE= 0
##$AXUNIT= <>
##$AZFE= 0.1
##$AZFW= 0.1
##$BCFW= 0
##$BC_mod= 0
##$BYTORDP= 0
##$COROFFS= 0
##$CY= 15
##$DATMOD= 1
##$DC= 0
##$DFILT= <>
##$DTYPP= 0
##$F1P= 0
##$F2P= 0
##$FCOR= 0.5
##$FTSIZE= 32768
##$FT_mod= 6
##$GAMMA= 0
##$GB= 0
##$INTBC= 1
##$INTSCL= 1
##$ISEN= 128
##$LB= 0
##$LEV0= 0
##$LPBIN= 0
##$MAXI= 10000
##$MC2= 0
##$MEAN= 0
##$ME_mod= 0
##$MI= 0
##$NCOEF= 0
##$NC_proc= -8
##$NLEV= 6
##$NOISF1= 0
##$NOISF2= 0
##$NSP= 0
##$NTH_PI= 0
##$NZP= 0
##$OFFSET= 14.98509
##$PC= 1
##$PHC0= 68.36792
##$PHC1= 0
##$PH_mod= 1
##$PKNL= yes
##$PPARMOD= 0
##$PPDIAG= 0
##$PPIPTYP= 0
##$PPMPNUM= 2147483647
##$PPRESOL= 1
##$PSCAL= 4
##$PSIGN= 0
##$PYNMP= <proc.py>
##$REVERSE= no
##$SF= 400.02
##$SI= 32768
##$SIGF1= 0
##$SIGF2= 0
##$SINO= 400
##$SIOLD= 32768
##$SPECTYP= <>
##$SREGLST= <1H.CDCl3>
##$SSB= 0
##$STSI= 32768
##$STSR= 0
##$SW_p= 8223.68421052631
##$SYMM= 0
##$S_DEV= 0
##$TDeff= 65536
##$TDoff= 0
##$TI= <>
##$TILT= no
##$TM1= 0
##$TM2= 0
##$TOPLEV= 0
##$USERP1= <user>
##$USERP2= <user>
##$USERP3= <user>
##$USERP4= <user>
##$USERP5= <user>
##$WDW= 1
##$XDIM= 32768
##$YMAX_p= 462140102
##$YMIN_p= -743856
##$CURPLOT= <Network HP LaserJet P1505>
##$CURPRIN= <$Network HP LaserJet P1505>
##$DFORMAT= <normdp>
##$LAYOUT= <+/1D_H.xwp>
##$LFORMAT= <normlp>
##$PFORMAT= <normpl>
##$SURQMSG= 1
$$ End of Bruker specific parameters
$$ ---------------------------------
##NTUPLES= NMR SPECTRUM
##VAR_NAME=  FREQUENCY,     SPECTRUM/REAL,   SPECTRUM/IMAG
##SYMBOL=    X,             R,               I
##VAR_TYPE=  INDEPENDENT,   DEPENDENT,       DEPENDENT
##VAR_FORM=  AFFN,          ASDF,            ASDF
##VAR_DIM=   32768,         32768,           32768
##UNITS=     HZ,            ARBITRARY UNITS, ARBITRARY UNITS
##FACTOR=    0.250966925370066, 1,           1
##FIRST=     8223.43324360094, -54719,       -77250
##LAST=      0,             -267471,         -117464
##MIN=       0,             -743856,         0
##MAX=       8223.43324360094, 462140102,    0
$$ Real data points
##PAGE= N=1
##DATA TABLE= (X++(R..R)), XYDATA
$$ [...]
19551b6257A12914a24110E7082J91510F7854h8716j3600L9607A4512b25827A33690
19539a07043C4961b19986D2319R156o02a89807O6106c5809j32224b5347o8703
19528i4050A47631G1688g4101n1230b3999A0020N2491L9389J00518B2209b97559
19516i282F5577D183f3758o2044A86880l3303d0685D2863a11613A05818j6762
19505H9056f0745j9771p1535d4735n4811K5265A49523b2467A1429g0367C55634
19493a11208C36111c63484b7551j70605d4436q3506l47904a972j41808N026f9205
19481d01027J58086b0450j07759N2686l92397b24341A51892a5109A08344a4176
19470H7156a07130j97914A61507n4799a58837j41295A20514J7224j1752l1237
$$ y = [-26257, 112914, -124110, 57082, 248592, 67854, -88716, -102316, -62709, 14512, -225827, 133690, -107043, 34961, -219986, 42319, 51475, 50873, -189807, -123701, -35809, -168033, -25347, -94050, 147631, 71688, -74101, -125331, -23999, 10020, 62511, 101900, 202418, 22209, -297559, -9282, 65577, 4183, -63758, -125802, 186880, 153577, -40685, 42863, -111613, 105818, 89056, -60745, -80516, -152051, -44735, -99546, -74281, 149523, -22467, 11429, -70367, 355634, -111208, 336111, -363484, -27551, -198156, -44436, -127942, -475846, -1972, -143780, -138754, -69205, -401027, -242941, -20450, -128209, -75523, -467920, -224341, 151892, -15109, 108344, -14176, 87156, -107130, -305044, 161507, 106708, -158837, -300132, 120514, 137738, 125986, 94749]
19460I4749d05393A55416l1820k1334M7593a62049E2653b40520g6916E8459a01527
19448c5262j18655N318A34902b70460J12558k35950J14901h42r026j33673j40433
19437b83974D7636b90290N5285J9370A16480j0897a99259a9869B0468h9623m26848
19426e16471a47128o6492M1611e9294C4906a71333O4280C50073I4748b55771c7353
19414A6411m695K42659b53127O8109C7763K7843a11500N4058C09109a14799N3182
19403f1617C0629b9539A21052a24489j42017B6013b54893c4478B43647F3797i5671
19391B9890i1591k54982J56946k05180I0424J64138D4350a84157A39543b15764
19380c24614G4749d04514a34591j0745n8067A01218b22474f8415n222l0478L6758
$$ y = [94749, -405393, 155416, 123596, 102262, 149855, -162049, 52653, -240520, -76916, 58459, -101527, -35262, -153917, -148599, 134902, -270460, -157902, -393852, -278951, -842, -9868, -143541, -283974, 47636, -290290, -235005, -215635, 116480, 105583, -199259, -19869, 20468, -89623, -516471, -147128, -213620, -172009, -59294, 34906, -171333, -107053, 350073, 94748, -255771, -37353, 16411, 11716, 254375, -253127, -185018, 37763, 65606, -111500, -57442, 309109, -114799, -61617, 30629, -29539, 121052, -124489, -266506, 26013, -254893, -34478, 243647, 63797, -95671, 29890, -91591, -346573, -189627, -394807, 90424, 254562, 44350, -184157, 139543, -215764, -324614, 74749, -404514, -134591, -145336, -203403, 101218, -222474, -68415, -73637, -104115, -67357]
19369f7357j78933J08666A98644j7486a67092m09669a46578J5838A59653i4859
19358g119A05245B0333J02172a63683G8702i799j71820N2170d5666A04017h071
19346b91384k5549i1755D6137P2315b89086f1351j64120h8247A02827c0476A43081
19334A49799n7391K137b86343k3478F7965a64360N5764j07828A29562a11915j4543
19323a26458C9587j770B810e9287K9369m4186H2349l8054P0455i766L515a307
19310e0051b4195m1097G1266a85959h5591b0996n6376K6481q9939A12476a41129
19298c24213F9995K5265a99970K3928k756P1092G3433C2008a78368d7707D3537
19286F2487e2272a3470k88334a31745a2159j14983A74962a05074k64916a43849
$$ y = [-67357, -246290, -137624, 198644, 181158, -167092, -576761, -146578, -130740, 159653, -94859, -7119, 105245, 20333, 122505, -163683, 78702, -9799, -181619, -129449, -45666, 104017, -8071, -291384, -316933, -91755, 46137, 118452, -289086, -61351, -225471, -88247, 102827, -30476, 143081, 149799, 92408, 94545, -286343, -309821, 67965, -164360, -108596, -216424, 129562, -111915, -126458, 39587, 37817, 2810, -59287, -29918, -74104, 82349, 44295, 114750, -9766, -6251, -1307, -50051, -24195, -65292, 71266, -185959, -85591, -20996, -77372, -50891, -140830, 112476, -141129, -324213, 69995, 95260, -199970, -176042, -178798, -107706, 73433, 32008, -178368, -47707, 43537, 62487, -52272, -13470, -301804, -131745, -12159, -127142, 174962, -105074, -369990, -143849]
19275E0882L9744a16597j03746L530R8496n4206d851D9988J41880a20439j16457
19264b36896Q9710B45525a73933A17027h0959r1144O9961F0283J24152C0561h7080
19252d98139A17661g9639B69135d3788l0007A64200b08311f8999B4352a67505
19241e4351J3125A11268b13004E7448b24502k7226L8714A31042d2616r7310A71286
19229a24257A72629h2178H6728h2700p659k06164f4962b8708G2712E59a00544
19217c23909E968d07318B73848A00743q196J55069d9565D4720c87392c3291B03637
19205c78628m9082J20910J04690j04916q7253a1898j14490K0019e406o2050A50702
19193a86068f115k8450A5189J37694K01348a6045q7159j55349B18187c1071l9497
$$ y = [50882, 90626, -116597, -220343, -216813, -118317, -172523, -4851, 49988, 191868, -120439, -236896, -147186, 245525, -173933, 117027, -80959, -172103, -102142, 60283, 184435, 30561, -87080, -498139, 117661, -79639, 269135, -43788, -73795, 164200, -208311, -68999, 24352, -167505, -54351, -41226, 111268, -213004, 57448, -224502, -251728, -213014, 131042, -42616, -139926, 171286, -124257, 172629, -82178, 86728, -82700, -90359, -296523, -64962, -28708, 72712, 559, -100544, -323909, 5968, -407318, 273848, 100743, 92547, 247616, -49565, 44720, -387392, -33291, 203637, -378628, -427710, -306800, -202110, -307026, -394279, -11898, -126388, -106369, -5406, -67456, 150702, -186068, -6115, -34565, 15189, 152883, 354231, -16045, -103204, -258553, 218187, -31071, -70568]
19182g0568A41957a58368k6404j09636e4002j3916j55094O3022p4491A09663a33445
19170a10598A39006a47728k95389A15312b135k31803f7725q4663A39381a85394
19159E8400m935o349K53594J1197c7697k5668I1330b5869r1437j17051g6394A3533
19146b08239d4442k9013k29638o8515c6675l4104p3338A04454a88931j6887e3254
19134a56818I2956J0417m5155L18946A00929a04699q9593P2555K2297A73227b31381
19122B44254E636K04414D810b44078c2849j43467A20029l2052f6037p5972j20652
19111b62661J19640K2163D7336g6602F2789a27063B8036N1685J09497B3242f1719
19099c91615B3967b6147A2459M5571i732E9653d50140a73237c1092k70215d5860
$$ y = [-70568, 141957, -158368, -184772, -294408, -54002, -67918, -223012, -159990, -234481, 109663, -133445, -110598, 139006, -147728, -443117, 115312, -2135, -233938, -67725, -152388, 139381, -185394, 58400, 53465, 47116, 300710, 311907, -37697, -63365, 91330, -25869, -117306, -234357, -76394, 13533, -208239, -44442, -73455, -303093, -371608, -36675, -70779, -144117, 104454, -188931, -205818, -53254, -156818, 92956, 103373, 58218, 377164, 100929, -104699, -194292, -121737, -99440, 173227, -231381, 244254, 5636, 210050, 4810, -244078, -32849, -176316, 120029, 87977, -66037, -142009, -262661, -143021, -120858, 47336, -76602, 62789, -127063, 28036, 79721, 189218, 23242, -61719, -391615, 23967, -26147, 12459, 58030, -9732, 59653, -450140, -173237, -31092, -301307, -45860]
19087A54901A0964J1074b50181e2441j13506e2404C574a64604b9855m7011h576
19075a8506m4503j1275G5140c8070H8841a05546J9670j9261k28144a63185m9666
19064b12851Q1042G666J11640a11815O458B45965b4791k15869a18147C8972c82589
19052b47326L8331A2340J27055J57985K8729a33148C92063b79793f5759h48H9979
19040I5855i5978o7945B8500a37388A1757b8613J0924j69670B41367d4758p8640
19029a23398J6244C52248A01595B5359a96476C65290a60899F4595Q3157m263b66256
19017d7599A12615a39031j43569a32805k8926L1881I3827L3249A2786c17401H2487
19005G5018Q2331J69933A51860a5605B46472b0745E6432B7668R5578k0935a85417
$$ y = [154901, 10964, 22038, -250181, -52441, -165947, -52404, 3574, -164604, -29855, -76866, -8576, -18506, -63009, -74284, 75140, -38070, 88841, -105546, -85876, -105137, -333281, -163185, -212851, -131809, 7666, 119306, -111815, -105357, 245965, -24791, -240660, -118147, 38972, -382589, -247326, -208995, 12340, 139395, 297380, 326109, -133148, 392063, -279793, -65759, -848, 89979, 95855, -95978, -163923, 28500, -137388, 11757, -28613, -17689, -187359, 241367, -44758, -123398, -107154, 352248, 101595, 25359, -196476, 365290, -160899, 64595, 147752, 143489, -266256, -47599, 112615, -139031, -282600, -132805, -161731, -129850, 93827, 127076, 12786, -317401, 82487, 75018, 157349, 327282, 151860, -15605, 246472, -20745, 56432, 27668, 123246, 102311, -185417]
18993E2399J19072g3449C03314A09639m1731h1901A42559c66035a21005m15935
18983e36940b6929k0329A72237L7043p5163a18611F9934b6428j18300n3651M3627
18972a54752j3511n2690B21329e76467B53414A8572h6126j04497G0267Q0315d9687
18960a27621C15091E4104b79075E4220K7187J27559A5801d3595n4977C9385c0896
18948a49516B94324h8037k04420a36114k36784a31297m0795L8034r7778j01734
18938c33570a882E4381c87546b1406p4737a2888I7181b4794H2404a37524J7439
18927a20085F8853a12100C8338a50480c9529H8332i6419k5066p6156B49385N8467
18916C07852d1961j07287a0421G3846j756f5589j99845j1515Q3816h58l1878p7745
$$ y = [52399, 171471, -73449, 303314, 109639, 67908, -81901, 142559, -366035, -121005, -536940, -26929, -47258, 172237, 209280, 134117, -118611, 69934, -26428, -144728, -198379, -154752, -168263, -220953, 221329, -576467, 253414, 18572, -86126, -190623, 70267, 150582, -49687, -127621, 315091, 54104, -279075, 54220, 81407, 208966, 15801, -43595, -98572, 39385, -30896, -149516, 294324, -88037, -292457, -136114, -372898, -131297, -172092, -134058, -231836, -333570, -1882, 54381, -387546, -21406, -96143, -12888, 97181, -24794, 82404, -137524, -120085, 68853, -112100, 38338, -150480, -39529, 88332, -96419, -121485, -197641, 249385, 307852, -41961, -149248, -10421, 73846, 72090, -65589, -265434, -276949, -193133, -858, -32736, -110481]
18904a10481j57185b6323l8422j1727r5440O3337c2570D5856J00132o1327a97823
18892a45586N1085k12931L9032P7567j61672e9274B03875a3329j78363K6321A17985
18880D5627d2291J9200m90082a56509l5943B29711h6558j04671A7979g431j94674
18869b02105n6898E7497a47452p2836O023H0785b3167G6719k3166P5018d5946
18857B0804J30515j8492b84837C48058d37014A07244h6465A61556a48114B19408
18846I9283P947D6418J9751J17803f8459o0406d6479B173e2039b0675i959j3876
18834b3835m6906m04733D2826e7056o6492k580A87586K3679C9125b9625m2209
18823g1834n4874B35080G6074H8b51093A8624h7260A05776Q1625d5746A30471
$$ y = [-110481, -267666, -26323, -64745, -76472, -171912, -108575, -32570, 45856, 145988, 84661, -197823, -145586, -94501, -307432, -268400, -190833, -352505, -59274, 203875, -13329, -191692, -165371, 117985, 45627, -42291, -23091, -513173, -156509, -192452, 229711, -86558, -191229, 17979, -7431, -202105, -259003, 57497, -147452, -220288, -214265, 80785, -23167, 76719, 53553, 128571, -45946, 20804, 151319, 132827, -284837, 348058, -437014, 107244, -86465, 161556, -148114, 219408, 99283, 107230, 46418, 66169, 183972, -68459, -128865, -46479, 2173, -52039, -20675, -9959, -23835, -70741, -475474, 42826, -57056, -123548, -126128, 187586, 211265, 39125, -29625, -71834, -126708, 235080, 76074, 88, -251093, 18624, -87260, 105776, 187401, -45746, 130471]
18811C80392G8979R9722a777n3936o6614F6383a95634c1951k38556Q274a20100
18799D5140j8391n162i0158K4328j81211i6991A04605a47940N8066m2241o0583
18788a92698k401H1298l8713a02410B45056c54760c1513C76629I3850d6418j02692
18777a49110k9344j67921B34493b88113c1982A04833b15134a9817B94233b43490
18766A00514b32282E9549a27896e8828b0530F4898k5484a55989J1006q5115A24916
18754b53898B28019b5907A54133h8779k74622j52321I6462b42010J11438r4369
18744b24941C8173b7742k40910b1627k26850F0347L7181E942e052j52615j16438
18733b74105k5249g6991B2081c28459L9598I5411a94682N4966j09891A20801J18038
$$ y = [380392, 78979, 178701, -1777, -55713, -122327, 66383, -195634, -31951, -270507, -262233, -120100, 45140, 26749, 21587, -90158, -65830, -247041, -96991, 104605, -147940, -89874, -132115, -192698, -195099, 81298, 42585, -102410, 245056, -354760, -31513, 376629, 93850, -46418, -149110, -178454, -346375, 234493, -288113, -31982, 104833, -215134, -19817, 294233, -243490, 100514, -232282, 59549, -127896, -58828, -20530, 64898, 39414, -155989, -144983, -230098, 124916, -253898, 228019, -25907, 154133, -88779, -363401, -515722, 96462, -242010, -130572, -224941, 38173, -27742, -268652, -21627, -248477, 60347, 97528, 5942, -5052, -157667, -274105, -299354, -76991, 22081, -328459, -288861, 95411, -194682, -139716, -249607, 120801, 238839]
18722B38839c08653A33871b14117j28197g5101a024j9847l37827d5781N321D2501
18710a04235j82067h4106j61861k8568E4086a80007j26144F8797c1602H0956J44229
18699B25185a4328k18046J14046p0283h6255k5550p1639B5503L0036Q8370c7239
18687c1795j11925B45564a54780j0748k22170J84804g2579j67687A25727d2695
18676d41672I3641l7566f9318B80296F3118d2420k3526F4891C6a55918F429c56419
18663B6777a20524j09800g0312B20706a02084B29476a46319B9015b18720e3667
18652a42962B3233L92030e1762B70742c19005a44150l46754C0316i2601A59053
18641a96140Q7843k84824B82948i606l6750H7153N5432a7599j16286j17521j36972
$$ y = [238839, -308653, 133871, -214117, -342314, -75101, -1024, -20871, -358698, -45781, -40460, 42501, -104235, -286302, -84106, -245967, -274535, 54086, -180007, -306151, 68797, -31602, 80956, 225185, -14328, -232374, -118328, -188611, -86255, -111805, -183444, 25503, 55539, 143909, -37239, -31795, -143720, 245564, -154780, -165528, -387698, -202894, -72579, -240266, 125727, -42695, -441672, 93641, 56075, -69318, 280296, 63118, -42420, -65946, 64891, 36, -155918, 6429, -356419, 26777, -120524, -230324, -70312, 220706, -102084, 229476, -146319, 29015, -218720, -53667, -142962, 23233, 415263, -51762, 270742, -319005, -144150, -490904, 30316, -92601, 159053, -196140, -108297, -393121, 282948, -9606, -46356, 87153, 142585, -17599, -133885, -251406, -388378]
18630c88378d6453k45881c4050j28970A0580b20209A3357b39199A8367c12413
18619E4448a01348K4628j29543j5886R1120k08239D8021h8551q6671A50700b36145
18607i3695A6854a16926A72579c9774k34908B32820a66881m9181a04253k7701
18597a31954c1643J3488k48690A0763a4277A0739O4175b49601Q0563c5016k04527
18586b39543i5255J5544J7725k31444a6981j82157A46535A4780Q0572D5446O3468
18575A08914c20957a25860I2152d0009k13142B47300a62427E2708b84001i0786
18564B34920a80885K8060A47016b01007H0396b37004K074e3361k19526C84547
18553B49941C2255a15693B01309h9041L0470p2171C1441a91442Q5890I7753a42332
$$ y = [-388378, -46453, -292334, -34050, -163020, 10580, -220209, 13357, -239199, 18367, -312413, 54448, -101348, -76720, -206263, -222149, -131029, -339268, 48021, -88551, -175222, 150700, -236145, -93695, 16854, -116926, 172579, -39774, -274682, 232820, -166881, -216062, -104253, -131954, -31643, -18155, -266845, 10763, -14277, 10739, 74914, -249601, -169038, -35016, -239543, -95255, -79711, -61986, -293430, -16981, -199138, 146535, 14780, 95352, 45446, 108914, -320957, -125860, 92152, -40009, -253151, 247300, -162427, 52708, -284001, -90786, 234920, -180885, -152825, 147016, -201007, 80396, -237004, -234930, -53361, -272887, 384547, 249941, 32255, -115693, 201309, -89041, -58571, -130742, 31441, -191442, -105552, 97753, -142332]
18541B21042k3302G534a01741r9019j00628A8129a76418l00340e1328A45713f5496
18529h9504j16639e6693r3929f3058D7801b41777D3949b6112j64854B19100d0930
18517e7126E9328a37567b5388l43805A26436N0145a6385j5480j83029G4392a33377
18505a76291k3893a2418k00911h2504C9774d1561n9506J9550C7179b04708O7280
18494a37428b7713j79858d2761K303p9649A59683K436n0622f8057E5642b30640
18482a57484D332b59868k03539h9523b1622A37712a81576L9556G1475c3886m9381
18471h3267L9273A2802i8135L4029k39383J24888P8087j42208A82146D0987J61626
18460B02613n7430j2196d16708a39613I708E26c555j62248N5167B94236i7874
$$ y = [221042, 197740, 7534, -101741, -200760, -301388, 18129, -176418, -476758, -51328, 145713, -65496, -89504, -206143, -56693, -150622, -63058, 47801, -241777, 43949, -26112, -190966, 219100, -40930, -57126, 59328, -137567, -25388, -369193, 126436, 176581, -16385, -31865, -214894, 74392, -133377, -176291, -200184, -12418, -213329, -82504, 39774, -41561, -101067, -81517, 37179, -204708, -137428, -27713, -207571, -42761, -40458, -120107, 159683, 162119, 111497, -68057, 55642, -230640, -157484, 4332, -259868, -463407, -89523, -21622, 137712, -181576, -142020, 71475, -33886, -83267, -43994, 12802, -98135, -64106, -303489, -178601, -100514, -242722, 182146, 40987, 202613, 145183, 132987, -416708, -139613, 9708, 526, -3555, -165803, -110636, 294236, -97874]
18448A72547C901R4137m3558J6160L09030A67361K3940b62074A15550a83668H8948
18436A23312f9038j61774A25397j5928K7345a26405j39291E1118a01872H7710
18425B82657A2192K24851q3659N1487E2728B4012e52379G9317j6092h9734j04309
18414a94043F9222a44523a6692A5809J3511b49741g1671A69426Q9168E9538B0858
18402C71004b33746A0129e6679J2897r1902N5638b8742A26578d5589B04400a59534
18390e6795c438C104b0199J382G7093a34886I0492b3763n1031C08123a34020d5097
18377i4073H2119L78123b30071R3193j75068A28444a79424A80001G8270b45132
18366e9724B15308m0962d9694o8807C551e2961A62187j5704c15069B63119E4873
$$ y = [172547, 3901, 98038, 54480, 70640, 379670, 167361, 191301, -262074, 115550, -183668, 88948, 123312, -69038, -230812, 125397, 109469, 136814, -126405, -265696, 51118, -101872, 87710, 282657, 12192, 237043, 153384, 204871, 52728, 24012, -552379, 79317, 63225, -89734, -194043, 69222, -144523, -16692, 15809, 29320, -249741, -71671, 169426, 258594, 59538, 20858, 371004, -233746, 10129, -56679, -43782, -135684, -80046, -28742, 126578, -45589, 204400, -159534, -56795, -3438, 3104, -20199, -18817, 77093, -134886, 90492, -23763, -74794, 308123, -134020, -45097, -94073, 82119, 460242, -230071, -136878, -311946, 128444, -179424, 180001, 78270, -245132, -59724, 215308, 174346, -49694, -118501, 3551, -52961, 162187, 146483, -315069, 263119, 54873]
18354a29823B8203a02901A08415a89465P5070a7172A08518b49436F3307d05885
18343b4307k65355C10275b00711j27737d9389j10398H4014l0629b79985B43957
18332f3781B04473b74473F056P2228K14898a5324B20949a01109A67657a47359
18321I791h819B8593g1902b9548j25755B4973R5964c35536J29222O2316O2956
18310h1042b250I761J51965m4394c4278B68037c16123A9159a44515H5387g538
18298a70372J6262a225B07057f442j09508j9376B193e962C7999f6517G1050a15197
18285a77372C0995a48190g0569k01378d2480I4979h9679B32149F4040j9984K62686
18274C06742B7226J27696E3870a82100e2504B7407e5390n0765m9936C0441O1733
$$ y = [-129823, 28203, -102901, 108415, -189465, -114395, -17172, 108518, -249436, 63307, -405885, -24307, -289662, 310275, -200711, -328448, -49389, -159787, 84014, 53385, -279985, 243957, -63781, 204473, -274473, 6056, 78284, 293182, -15324, 220949, -101109, 167657, -147359, 9791, -8819, 28593, -71902, -29548, -155303, 24973, 120937, -335536, -206314, -143998, -81042, -2250, 9761, 161726, 117332, -34278, 268037, -316123, 19159, -144515, 85387, -7538, -170372, -154110, -1225, 207057, -6442, -115950, -135326, 2193, -5962, 37999, -66517, 71050, -115197, -177372, 30995, -148190, -70569, -271947, -42480, 94979, -89679, 232149, 64040, 44056, 306742, 27226, 154922, 53870, -182100, -52504, 27407, -55390, -106155, -156091, 30441, 92174]
18263I2174b298o6859k9116A02739b09263d2240j45981q0972e4813m9919k32241
18252c36973f4182A61549B7584d3035j31973A84456b90637A59865A234e2382B30931
18240a60847k7774e4092C6183a81873d7426D4943J75767I8569J53468A5878J06412
18229A22290a30912l987G1404a24295G8418c1568n89m10829a7973k34696A1535
18217B98184B5103K18390d07079B72472r7824J04255a01583q5343g1583C18796
18206D5467b87715F6037f60392A34967G277e2183l1920L2863H1035J6863a01032
18194b24848B09165C3242j1598M7896M2180h9485K7197j59886g8271a3271d934
18182d25887b4385A89631b71247f2071k72069f1815G1494a24251B2542c52006
$$ y = [92174, -2298, -69157, -98273, 102739, -209263, -42240, -188221, -269193, -54813, -104732, -336973, -64182, 161549, 27584, -43035, -175008, 184456, -290637, 159865, 1234, -52382, 230931, -160847, -188621, -54092, 36183, -181873, -47426, 44943, 220710, 98569, 252037, 15878, 122290, -130912, -134899, 71404, -124295, 78418, -31568, -32157, -442986, -17973, -252669, 11535, 298184, 25103, 243493, -407079, 272472, 174648, 278903, -101583, -186926, -71583, 318796, 45467, -287715, 66037, -660392, 134967, 7277, -52183, -84103, -51240, 81035, 97898, -101032, -224848, 209165, 33242, 21644, 69540, 111720, -89485, -62288, -222174, -78271, -13271, -4934, -425887, -24385, 189631, -271247, -62071, -334140, -61815, 71494, -124251, 22542, -352006]
18171a88888A04440b0705q6941a9020A83224A3932J16174m6957a3405E569N5577
18160F1146a16302R76A46948D8123A1722a68320L7864a4131j12968b5110B58681
18148A66562c10866D9776i8989B22583r6000b35883A57298C1219K0564e6763b6034
18136a72494c4301I4492h905k1840k25211q1308O8495B01310E1352a39946o3745
18125b03691p1315f2067l69219a6122q530k598k72026C8376c5477D7677a58105
18113H7203f623j07602a1833n525A2583L1020a0769j70008A25949A2326a52231
18101h4761A04799a22323e3840c826j68461h4583b8138l67420F33542a28414D4601
18089E5819J54254A2796E653a86161G7266c4392A11674g4583J889L4136k7670
$$ y = [-188888, 104440, -20705, -107646, -19020, 183224, 13932, 130106, 83149, -13405, 5569, 61146, -116302, -115326, 146948, 48123, 11722, -168320, -130456, -14131, -127099, -25110, 258681, 166562, -310866, 49776, -98989, 222583, 126583, -235883, 157298, 31219, 51783, -56763, -26034, -172494, -34301, 94492, -8905, -30745, -255956, -337264, -268769, 201310, 51352, -139946, -203691, -275006, -62067, -431286, -16122, -24652, -27250, -299276, 38376, -35477, 47677, -158105, 87203, -6623, -114225, -11833, -17358, 12583, 43603, -10769, -180777, 125949, 12326, -152231, -84761, 104799, -122323, -53840, -3826, -172287, -84583, -28138, -395558, 633542, -128414, 44601, 55819, 210073, 12796, 5653, -186161, 77266, -34392, 111674, -74583, -72694, -38558, -66228]
18078f6228j40045H9304J14012B974d9112J1842o4213A28853o3665b05567p5278
18067b80845D9937J2451a04140j83652a29514I8251b78860a06150d84m9149j47395
18056a97028l23553b2562A9277L6375J30134b36125A67914a06320A84986b43122
18045e6263j27056c3694B7885b00756R8280A3976R1105i848B48805L0466D0123
18033B75862c08438g0496B6106R9833b79966b2870j47832e6296k00738A26777
18022a9680j1468r4493j5947K6981o4977E8055f3188A24533b34141a11198E4607
18010A60301J1558a38153A4648g2778j36873R8669B43660A03166m9677b25381
17999b30104g0956C84807f952j42668B61097A04948J13650a52985j43154A17892
$$ y = [-66228, -206273, 89304, 203316, 2974, -49112, -37270, -101483, 128853, 65188, -205567, -280845, 49937, 62388, -104140, -287792, -129514, 98251, -278860, -106150, -484, -49633, -197028, -520581, -22562, 19277, 55652, 185786, -236125, 167914, -106320, 184986, -243122, -56263, -183319, -33694, 27885, -200756, -102476, 13976, 105081, -9848, 248805, 279271, 40123, 275862, -308438, -70496, 26106, 125939, -279966, -22870, -170702, -56296, -257034, 126777, -19680, -31148, -125641, -141588, -114607, -179584, 58055, -63188, 124533, -234141, -111198, 54607, 160301, 171859, -138153, 14648, -72778, -209651, -110982, 243660, 103166, 53489, -225381, -230104, -70956, 384807, -6952, -149620, 261097, 104948, 218598, -152985, -296139, 117892]
17988A3318L71078F7522J86684E2729b37839b6921A74632a85506R0223A66354
17977D26676H3498A6575R755b31511D48630h536n542k76672g7369K0371p1528
17966a28526A85a20638L3186F3441A8774i919B7646J15651a28652L4881p1638
17955a65409A93930q9329H859c61159A75629l7065E5187e4149q1876F7796R7849
17944A65645L5174a62350E606J70011k7903a63970A68840n3248h4610E2463a02805
17932b07147G2918a94374h6616b6677a2456k23883F3398a56926B5551d26278a35144
17920A12658a67491j70311r4048H7552b01910J9320F5537R3534o2510N2979d58537
17908g6313A52838e4522I972O6030K6399l0334M2763b48739a8439k69865a12015
$$ y = [13318, 384396, 67522, 254206, 52729, -237839, -26921, 174632, -185506, -95283, 166354, 426676, 83498, 16575, 26330, -231511, 448630, -8536, -14078, -290750, -77369, -56998, -128526, 185, -120638, -87452, 63441, 18774, -9919, 27646, 143297, -128652, -93771, -165409, 193930, 104601, 8859, -361159, 175629, 138564, 55187, -54149, -136025, 67796, 165645, 200819, -162350, 5606, 175617, 147714, -163970, 168840, 115592, -84610, 52463, -102805, -207147, 72918, -194374, -86616, -26677, -12456, -236339, 63398, -156926, 25551, -426278, -135144, 112658, -167491, -337802, -431850, 87552, -201910, -182590, 65537, 159071, 96561, 149540, -458537, -76313, 152838, -54522, 9972, 76002, 102401, 72067, 114830, -248739, -18439, -288304, -112015]
17896B519b22996C06191m7384e168o1694j16855a7119C2338c1209B31553a90025
17884a19073H3152a56238A98962a18801j2280C4213C764a01223r3626h6717B06687
17872i595r762j36581C14161B7587d0423j67394H3027p479Q3406g2344l28552
17861d00896e7982j41059d7721A99747a66548A31720Q4888C5158e9401A72524
17850A99751g2430j70185P2588D99217H0768N1087D6157b43731J06877A5117a35016
17838B3315a78307C39415a44052A76390f9043B47225B3522J50133c2878j02917
17828a35795B47590b05823i8275j52884B57377F3477K9669c41388F1726M8356
17818A10082L83091i4101l5561A26415d2059n0613J7578l46081A3438J34974a80720
$$ y = [2519, -222996, 306191, 258807, -5168, -66862, -183717, -17119, 32338, -31209, 231553, -190025, -119073, 83152, -156238, 198962, -118801, -131081, 34213, 3764, -101223, -194849, -86717, 206687, -9595, -19357, -155938, 314161, 27587, -40423, -207817, 83027, 75548, 158954, -72344, -400896, -57982, -199041, -47721, 199747, -166548, 131720, 216608, 35158, -59401, 172524, 199751, -72430, -242615, -170027, 499217, 80768, 131855, 46157, -243731, -136854, 15117, -135016, 23315, -178307, 339415, -144052, 176390, -69043, 247225, 23522, 173655, -32878, -135795, 247590, -205823, -98275, -251159, 257377, 63477, 93146, -341388, 61726, 110082, 493173, -94101, -129662, 126415, -42059, -92672, -75094, -421175, 13438, 148412, -180720]
17806C02948M0549a34789A04874c39050i4586f588A63d43058D6882b38588k1954
17795b60542A97741l7300d16779E6791e22913a86688q6060J13105A19479n4203
17785F5276K518a96614N8653B13229H3322D452J30471R1161h281j49555C4266
17773F7466a56359A34538J4342M1082a69560K5623e6647A2732K26123a08289D9793
17761c7353A57857C4125J90746C6985L69599o217A66891R274b69274A07658Q4089
17750A91747a03423C314b5407p7509K6995a4984k01315A30743b52495A47084n1416
17739I5668O151J06595k8509C0871J27476a61230p3293R1678B06921b13273B47262
17727A0331g0597A16085g6954j712j30037J00808q7310D1068h3710j2011A51534
$$ y = [302948, 343497, -134789, 104874, -339050, -94586, -6588, 163, -443058, 46882, -238588, -260542, 197741, 160441, -416779, 56791, -522913, -186688, -272748, -159643, 119479, 65276, 67794, -196614, -137961, 213229, 83322, 4452, 134923, 226084, -8281, -157836, 34266, 67466, -156359, 134538, 148880, 189962, -169560, -143937, -56647, 12732, 238855, -108289, 49793, -37353, 157857, 34125, 224871, 36985, 406584, 400367, 166891, 176165, -269274, 107658, 191747, -103423, 3314, -25407, -102916, -75921, -14984, -216299, 130743, -252495, 147084, 95668, 101819, 208414, 179905, 30871, 158347, -161230, -234523, -142845, 206921, -213273, 247262, 10331, -70597, 116085, -76954, -78666, -208703, -107895, -195205, 41068, -83710, -95721, 151534]
17715f1241B8304a76632a4207A90122N8086o0899d8914D0114f6790j55479a10027
17703a47777A87607c10904A9555b59539C2417i5293G5750b1706k18228e1938j41330
17692a93268j22700a18627b0084A03337J51266J3645b78573B71884j13545m8140
17682A10199f7282p5361O2926L1221n4996r8458G3845Q2791a2382A01601j9220
17671H2381j1523p253L1388N9218L1044j6271a44855A33039n2957b9095A90970
17659A8721a23967D9619L5879a40192I0370b42289d8129B88685M7738g1241A36916
17647b81219c1048A4305b5104A0318N5912J1141L64914a00360r6509B8220a58238
17635A07797K93637G0337g2084E9144R0220e4434o0512d7011A03756K93056a30177
$$ y = [-61241, 28304, -176632, -14207, 190122, 248208, 187309, -48914, 40114, -66790, -222269, -110027, -147777, 187607, -310904, 19555, -259539, 32417, -95293, 75750, -21706, -239934, -51938, -193268, -315968, -118627, -20084, 103337, 254603, 268248, -278573, 271884, 158339, 110199, -67282, -142643, -79717, -48496, -103492, -201950, 73845, 156636, -12382, 101601, 82381, 70858, 63605, 94993, 154211, 185255, 168984, -144855, 133039, 80082, -29095, 190970, 18721, -123967, 49619, 85498, -140192, 90370, -242289, -48129, 288685, 336423, -71241, 136916, -281219, -31048, 14305, -25104, 10318, 66230, 77371, 442285, -100360, -196869, 28220, -158238, 107797, 401434, 70337, -72084, 59144, 149364, -54434, -114946, -47011, 103756, 396812, -130177]
17623F3170f6457F3821a98665A45451b4821j86335b9579A04388L11250A44153
17612C30964j64214Q1871h008p0982A34468K8121J66559E7701a57480K0723F7541
17600e5146A93736c63444e6488b3195A75641E4569j4010L6702a59139D1635J59742
17589B01377G2044a41746A81345b18214d8297J3668m5871A62298F4379a15056
17578A97658k2429A0238e4520B41791L27363h8123F4496J34222C1802b69764C29056
17566G4273A1907a77375k4004a4906j95517b3913l3125A09095N4226i7840B52959
17554A95458o1245a48915G7134K47250a86500B7444J80308L0913p3971A6086O9420
17543H5506P48K37690f6410q7956A57818E3924J75176d1372C03707a05042D5408
$$ y = [63170, -66457, 63821, -198665, 145451, -24821, -211156, -29579, 104388, 415638, 144153, 330964, 166750, 248621, -8008, -78990, 134468, 162589, 329148, 57701, -157480, -136757, 67541, -55146, 193736, -363444, -56488, -23195, 175641, 54569, 40559, 77261, -159139, 41635, 201377, 72044, -141746, 181345, -218214, -48297, -34629, -80500, 162298, 64379, -115056, 197658, 175229, 10238, -54520, 241791, 569154, -88123, 64496, 198718, 31802, -269764, 329056, 74273, 11907, -177375, -201379, -14906, -210423, -23913, -57038, 109095, 163321, -97840, 252959, 195458, 134213, -148915, 77134, 324384, -186500, 27444, 207752, 238665, 164694, 16086, 85506, 86254, 323944, -66410, -154366, 157818, 53924, 229100, -41372, 303707, -105042, 45408]
17531A40680d9004q4299B33456L1303L8446K540d4695F9989L06191D3412g2967
17519i8612D2066K80677H8478l1427J77077B3907F95b76577h8484A85433J01147
17508B86580j6295n0836F4911k9504J2288J43207l184a10800B45536H8818a5595
17496c01761h400c023B44390b0830A12485i1344C36078g8813A09960J78234C0852
17484b1614A44099J62732a14607A93583a62873B76266R2802a70430A08735J62627
17474B71362F2508o850L05633A08524d2424C34644F7107a06077q5408B66583a48742
17462b0825C19874i5406C20096I6066b01677B01561o2023J15588D9479d9771D72424
17450B5079j696i754C14559j13617R629F3127K23206A05884O9185E8941L44400
$$ y = [140680, -49004, -133303, 233456, 264759, 303205, 305745, -44695, 69989, 376180, 43412, -72967, -98612, 42066, 322743, 88478, 57051, 234128, 23907, 695, -276577, -88484, 185433, 286580, 270285, 219449, 64911, 35407, 47695, 190902, 187718, -110800, 245536, 88818, -15595, -301761, -8400, -3023, 244390, -20830, 112485, -91344, 336078, -78813, 109960, 288194, 30852, -21614, 144099, 306831, -114607, 193583, -162873, 276266, 369068, -170430, 108735, 271362, 62508, 55658, 361291, 108524, -42424, 334644, 67107, -106077, -191485, 266583, -148742, -20825, 319874, -95406, 320096, 96066, -201677, 201561, 139538, 255126, 49479, -49771, 472424, 25079, 23383, -9754, 314559, 200942, 210571, 63127, 286333, 105884, 175069, 58941, 403341]
17439D03341A17352J98324R2547a39859C12396m3518j31575K13626A1889Q2916
17429I4805J40231L05362A79815D6155K34451r1116H6375K18469o0021J77132
17419D21955m4592O7410k15208J56586K02710A58410J62853I5844J0656M0431
17409A46931k1223K71724j50466L3481H5096J61418K1845O9675j66241J36152
17399C07945j43741J12089f2135B59856A14917J4264J14533o3151b77891B83509
17388B77171J1817j03767q6365k2778J22505a00752E6438J73912n4033j6275L30428
17377D90470j90686j12683Q4603a97578A95473f9575B38806n9850Q4762q4060
17367A79658c02922A04303a60741A99115D9878L12383j67020a31862A15992i8769
$$ y = [403341, 117352, 315676, 408223, -139859, 312396, 268878, 137303, 350929, 11889, 94805, 235036, 540398, 179815, 46155, 280606, 189490, 86375, 304844, 244823, 421955, 377363, 444773, 229565, 386151, 588861, 158410, 321263, 95844, 106500, 146931, 125708, 397432, 246966, 280447, 85096, 246514, 268359, 338034, 171793, 307945, 164204, 276293, -62135, 259856, 114917, 129181, 243714, 180563, -277891, 283509, 277171, 288988, 185221, 98856, 76078, 198583, -100752, 56438, 230350, 176317, 160042, 490470, 299784, 187101, 271704, -197578, 195473, -69575, 238806, 178956, 263718, 179658, -302922, 104303, -160741, 199115, 49878, 362261, 195241, -131862, 115992, -98769]
17356B38705H3307J15419N3400Q5664a20587E03610b0348E76685I2459O866m0073
17345E9252c8843H8645O2716k0146J7106h2196j54842B83998J4137i2517o3417
17334a55934a2088C50988A68477j2507J14522p8896j3933G3190k3109K89220A24317
17322B35836M8984m8691K29092A15384J87747j47310a3046k9270A53684J2059
17312A65743j3888M83549E6068a5570C5677a16765F9711c0933A71226J84137a8324
17300A89232l0352b3700G310J24720J31655k4782f659A2869J69446g2119C40255
17288A78294J09057j32823J19850O7122j44816N7992m255O6338g1312A51110B6112
17276A2908J83528o1190J34406l4667N7617G7979J26971A8807K04931q4266F458
$$ y = [238705, 83307, 198726, 252126, 337790, -120587, 503610, -20348, 576685, 92459, 99325, 59252, -38843, 88645, 151361, 131215, 148321, -82196, -237038, 283998, 298135, -92517, -155934, -12088, 350988, 168477, 155970, 270492, 191596, 177663, 73190, 50081, 339301, 124317, 235836, 284820, 236129, 465221, 115384, 303131, 155821, -13046, -42316, 153684, 165743, 151855, 635404, 56068, -15570, 35677, -116765, 69711, -30933, 171226, 355363, -18324, 189232, 158880, -23700, 7310, 132030, 263685, 238903, -6659, 12869, 182315, -72119, 340255, 178294, 287351, 154528, 274378, 341500, 196684, 254676, 250421, 316759, -71312, 151110, 26112, 12908, 196436, 135246, 269652, 234985, 292602, 77979, 204950, 18807, 223738, 139472, 6458]
17264B12893l0561J95749j09315l2479Q786K2507j10973k0445m1386K0434a08536
17252A67963J09794j23895J00603P198E9163P7010J50939A28881J88654P7896
17242C95431j79338O5682J8992B1731K51142a7832C43596l9198E691M53823l6112
17231D23402j0830c4540F48756k04545G01P1981K73594A02205M9193J74741A19445
17219A70424k5198J92463j3138E3263K58608A4573L73517A75954M05610k75548
17209C06016I7525a04575F0613R0665j4941J35175J42771k2217A24681J14360
17199B39041r4770l1818J37803m1057N0394H2139L16396I1347K13387J3413j43480
17188A74667l6270J9118G6196K77434K66132A68662K12884A19796M2080Q9829
$$ y = [212893, 182332, 378081, 268766, 236287, 245073, 267580, 156607, 136162, 94776, 115210, -108536, 167963, 277757, 153862, 254465, 261663, 59163, 136173, 287112, 128881, 317535, 395431, 216093, 281775, 300767, 21731, 272873, -17832, 343596, 304398, 5691, 459514, 423402, 412572, -34540, 648756, 444211, 701, 72682, 346276, 102205, 151398, 326139, 119445, 170424, 145226, 337689, 324551, 53263, 311871, 14573, 388090, 175954, 581564, 306016, 97525, -104575, 60613, 151278, 136337, 271512, 414283, 392066, 124681, 239041, 144271, 112453, 250256, 209199, 259593, 82139, 398535, 91347, 304734, 318147, 174667, 138397, 157515, 76196, 353630, 619762, 168662, 381546, 119796, 161876, 251705]
17178B51705A07123J50020o1293F4033L99801j27328j26353J88650o641A32192
17167C02046J36684l1000p3040Q4422A05314M20584n0963K1787j59541G5751K93244
17156C68995j41200K32487p5509p8688o7991K41165B23269R9376K9411J7391C6657
17144C18141j18807N4943J94560R7169j2367j58379j53678K7014k6129J65489
17134C87956j51679J3075F6816L77932j14453J81151j44262q2884M3466n0427
17124B77339K20305j6662H6622L92141R9114k79903J78559J22992m2774k67799
17114B88952J22408A81824B5428K96649j43797j1568L71324j11130o1341K78410
17104F43975j45207R4541B58062I7812J89734N8305M0600K9639n091L44478M9506
$$ y = [251705, 107123, 257143, 195850, 64033, 463834, 336506, 210153, 398803, 392162, 132192, 302046, 438730, 407730, 334690, 419112, 105314, 525898, 474935, 496722, 337181, 75751, 368995, 227795, 460282, 384773, 306085, 238094, 479259, 223269, 322645, 352056, 369447, 36657, 318141, 199334, 254277, 448837, 546006, 533639, 375260, 221582, 248596, 222467, 387956, 236277, 249352, 66816, 444748, 330295, 511446, 367184, 284300, 327766, 277339, 497644, 480982, 86622, 478763, 577877, 297974, 476533, 599525, 556751, 288952, 411360, 181824, 25428, 322077, 178280, 166712, 538036, 426906, 365565, 643975, 498768, 593309, 258062, 97812, 287546, 345851, 386451, 416090, 410999, 755477, 804983]
17093H04983k00287J9505c9120B30593l726L20208j9185j80188P088J51009j28806
17082C76993R2476Q7571J33863k31560K27314C32836L84152j53785A59898M20098
17072E79996j12168k18394L65561j18324j07847K19232j63040B19276j00073L03192
17062D22395P3703j98720L9189j58616L34160j35646j3284K39262j01625k8703
17052D72115K7023J98061R6331k68214j3403K69565j62371p5381K99519p5604
17042G67641p3011J8439l41252K07861K92899j92627j99430K07963k47339K62852
17032G03996m7920B60862J79093J58731M1456K47377j86136Q6442j64803o4497
17022E58525J67475K53784D54170J95368J66113J4447l19519L96777l49457O2160
$$ y = [804983, 604696, 624201, -39120, 230593, 226867, 547075, 527890, 347702, 354790, 505799, 376993, 469469, 557040, 690903, 459343, 686657, 332836, 716988, 563203, 159898, 579996, 467828, 249434, 614995, 496671, 388824, 608056, 445016, 219276, 119203, 422395, 496098, 297378, 336567, 177951, 512111, 376465, 363181, 602443, 500818, 472115, 499138, 697199, 793530, 525316, 511913, 781478, 619107, 543726, 843245, 767641, 694630, 713069, 371817, 579678, 872577, 679950, 480520, 688483, 441144, 703996, 656076, 260862, 439955, 598686, 640142, 887519, 701383, 787825, 623022, 558525, 726000, 979784, 454170, 649538, 815651, 830098, 510579, 907356, 557899, 620059]
17012F20059P3654J02782O1699j0177l7864K9735J08742k30080J30451L2202l75301
17001E05902L05921n0677J22201L23303m32299J54677N9929l10872K81366n8348
16991I01103j48298M59163k66764j4192j42255L1391J98551k59463J0498J75279
16981I45013k8507J42621k1956k83628K49414J92264l84716L36881J8893j7043
16971A149236m53734L93325j03445k1101k39387Q7688M26954k23641j92312l0718
16961G92865K31262N5206K9880J52903l64520M3316l881J45047j4796n3112O6452
16950A080622L2683k45130L16834K41088k69615J54106P146J77968m17496K02755
16940A280961P2475j73254J50393p6041K42076p0419l58911L45446j5463j41988
$$ y = [620059, 693713, 796495, 858194, 848017, 810153, 839888, 948630, 718550, 849001, 881203, 505902, 811823, 761146, 883347, 1206650, 774351, 929028, 988957, 678085, 959451, 901103, 752805, 1211968, 945204, 931012, 788757, 820148, 1018699, 759236, 769734, 945013, 916506, 1059127, 1037171, 753543, 1002957, 1195221, 810505, 1147386, 1166279, 1149236, 695502, 1088827, 985382, 964281, 724894, 812582, 1239536, 1015895, 823583, 792865, 1024127, 1079333, 1109213, 1262116, 897596, 940912, 937031, 1082078, 1067282, 1014170, 1080622, 1113305, 868175, 1185009, 1426097, 1156482, 1310588, 1317734, 1495702, 1078206, 1280961, 1353436, 1180182, 1330575, 1254534, 1496610, 1426191, 1067280, 1412726, 1397263, 1255275]
16930A255275M00905Q78k99873J45045p1799M7793k6363K1810j73297K73491q1881
16919A491984r6459K73875K58521n17213L30990k37173M49763l63085R9135j80416
16909A509922L92946l79117J55146k7553J06023M70598o06282K52842q9248J06494
16899A891771J28760j84121J69642j0305K62286k51665J63932P9706o15295L48798
16889A983509K59534k30231J51668J18619N2090L6672N3737j78020J8951J89420
16879B455949r7550K75943m3353L23049k85731L01602k52518j3916O401K36369
16869B906245j58938L56397k12166J61163K35539j96355k37664N34989m09851
16860B979359M57462j5288j69182K19854k12118K37198M4297l25409N09588j62301
$$ y = [1255275, 1656180, 1657058, 1357185, 1502230, 1430431, 1478224, 1451861, 1473671, 1300374, 1573865, 1491984, 1395525, 1669400, 1927921, 1410708, 1741698, 1504525, 1954288, 1591203, 1690338, 1509922, 1902868, 1523751, 1678897, 1651344, 1757367, 2227965, 1621683, 1874525, 1785277, 1891771, 2020531, 1836410, 2006052, 1995747, 2258033, 2006368, 2170300, 2250006, 1634711, 1983509, 2243043, 2012812, 2164480, 2283099, 2335189, 2371861, 2425598, 2247578, 2266529, 2455949, 2358399, 2634342, 2590989, 2914038, 2628307, 2929909, 2677391, 2663475, 2669876, 2906245, 2747307, 3103704, 2891538, 3052701, 3288240, 3091885, 2854221, 3389210, 2979359, 3436821, 3421533, 3252351, 3472205, 3260087, 3497285, 3541582, 3216173, 3725761, 3563460]
16850C563460P0981J75420J1806L3806K35240j75310N390L49314l49473J40693
16840D061327Q6056J88988M51199j95672j74809K23050L27564l58137R6801K26589
16830D932956O8801K55610R5645R3348j72324L22540K44296Q1166k56368O19498
16820F285168p2413l26970Q41867k88187r0989L93357K2992R4109K14290L93430
16810G466654m24960N12456L1571R6360L81779J95455j35630L65400j07752O11447
16800H992780L16919j80930O16033J22962K54571L5285J14986N13725J63289M04457
16790A1354077K04334M07654J47705L78044M69930K86546K56343M71795M34167
16781A4410595M37829j40436J259968J76862L90419O60773L44660N50201J99397
$$ y = [3563460, 3634441, 3809861, 3821667, 3855473, 4090713, 3915403, 3920793, 4270107, 3920634, 4061327, 4147383, 4336371, 4787570, 4591898, 4417089, 4640139, 4967703, 4609566, 4706367, 4932956, 5001757, 5257367, 5353012, 5446360, 5274036, 5596576, 5840872, 5922038, 5665670, 6285168, 6212755, 5885785, 6727652, 6439465, 6348476, 6741833, 6764825, 6858934, 7073224, 7466654, 7041694, 7554150, 7585721, 7682081, 8063860, 8259315, 8123685, 8489085, 8381333, 8992780, 9309699, 9128769, 9744802, 9867764, 10122335, 10157620, 10272606, 10786331, 10949620, 11354077, 11558411, 11966065, 12113770, 12491814, 12961744, 13248290, 13504633, 13976428, 14410595, 14848424, 14707988, 15967956, 16144818, 16535237, 17196010, 17540670, 18090871, 18290268]
16772A8290268J044264Q42615J046236j67419R08701J176094L11848J223031R37378
16763B5613016O95287J131592R28432J325360J188157J257532J216974J311402
16755C4667752J681722J070424K075473J572099J813139J879614J995091K002711
16747D8758025K271718K980740K500060K514242K991570L029077L743500K944587
16739G1733519M173411L886259L843311M660002M513911M718434M927443N214673
16731A07670963N991249N426538N520323N603924N833461N922426N571371N504878
16723A53045133M629332M861418L809023L114919K503790J725352Q01542k92692
16715A74197817r53340j555009l188610l064607m455177m268221n503771n360470
$$ y = [18290268, 19334532, 20177147, 21223383, 21055964, 21964665, 23140759, 23452607, 24675638, 25613016, 26308303, 27439895, 28368327, 29693687, 30881844, 32139376, 33356350, 34667752, 36349474, 37419898, 39495371, 41067470, 42880609, 44760223, 46755314, 48758025, 51029743, 54010483, 56510543, 59024785, 62016355, 65045432, 68788932, 71733519, 75906930, 79793189, 83636500, 88296502, 92810413, 97528847, 102456290, 107670963, 113662212, 119088750, 124609073, 130212997, 136046458, 141968884, 147540255, 153045133, 157674465, 162535883, 166344906, 169459825, 171963615, 173688967, 174490509, 174197817, 173244477, 171689468, 168500858, 165436251, 160981074, 156712853, 151209082, 145848612]
16707A45848612n575754n753927o151843o176106n360207n749831n646235n310485
16699A00124224n131207m869412m627752m252534m220588l914042l752043l450962
16691F5905684l215075l127513k812297k819261k594413k139793k529076k407749
16683D4260507j611881k016253j565181j590475j761362j503727j566875j174653
16675C1470100j452995j126429r80852j160036q89923j041517j007953r84950
16667B2825445l87673r44815n06104q02863m26103o85698j035206m37087m95352
16658A7104544n37415o02319m76408j20946r97475o4372p05250k23844l27942
16649A3048573m68442l42936l91335k65636k43719N4660p02973j36136o29685
$$ y = [145848612, 140272858, 134518931, 128367088, 122190982, 116830775, 111080944, 105434709, 100124224, 94993017, 90123605, 85495853, 81243319, 77022731, 73108689, 69356646, 65905684, 62690609, 59563096, 56750799, 53931538, 51337125, 49197332, 46668256, 44260507, 42648626, 40632373, 39067192, 37476717, 35715355, 34211628, 32644753, 31470100, 30017105, 28890676, 27909824, 26749788, 25859865, 24818348, 23810395, 22825445, 22437772, 21492957, 20986853, 20183990, 19757887, 19072189, 18036983, 17599896, 17104544, 16567129, 15964810, 15488402, 15367456, 14369981, 14305609, 13600359, 13376515, 13048573, 12580131, 12237195, 11845860, 11580224, 11336505, 11391165, 10688192, 10552056, 9922371]
16640I922371j377k89693P5070m26856L2868j31009n78358l75007J84630m24637
16630G988002m08557M0840k27329R2025j98930p0467l59152l21221J50244r4398
16620F591057n69913J54039K4701l15055Q2760j40587n19935J23091K66212p82481
16610D913889L45127j71706J7626k55455k4015k56304J53429k51927J08295m34230
16600D144729J48647k01690K66039l71558k36934J00108q7497J17073M94n9999
16590C819412m37092J7256q8442K18951k00433j47544j7441J8878K95427l66798
16580C112174J27269J47435l05012l3742k49539M8624K33374r4760l42633J6696
16570B659886j36879j28207M33383k635n11693J93303O9786k59715j6337K26082
$$ y = [9922371, 9920994, 9631301, 9706371, 9279515, 9312383, 9181374, 8603016, 8228009, 8412639, 7988002, 7579445, 7620285, 7392956, 7484981, 7286051, 7215584, 6856432, 6535211, 6685455, 6591057, 6021144, 6175183, 6199884, 5884829, 5967589, 5827002, 5307067, 5430158, 5696370, 4913889, 5259016, 5087310, 5104936, 4849481, 4825466, 4569162, 4722591, 4470664, 4578959, 4144729, 4293376, 4091686, 4357725, 3986167, 3749233, 3849341, 3761844, 3878917, 3879411, 3819412, 3382320, 3399576, 3311134, 3530085, 3329652, 3182108, 3164667, 3183545, 3478972, 3112174, 3239443, 3386878, 3081866, 3048124, 2798585, 2847209, 3080583, 2985823, 2643190, 2659886, 2523007, 2394800, 2828183, 2825548, 2313855, 2507158, 2576944, 2317229, 2300892, 2526974]
16560B526974O4256l25363K00207k91140j18786L31393j82002j12850Q8553k03203
16550A978039k37142K93522j08686l31725K25856P1982N3707J24569m63464L96402
16540B003060l13076J38080j78838K23003J55117n09814N32602l54367k87541
16531A408226J46717J00930n6017j763P8798l93084J31253K6888r0315K35079
16521A586712k36068K14762J29939k63757L15529l25772j71497P6757K39688J6484
16511A582777n17170O4910n623J33175J42071J4185j24311J38865k74251n9118
16501A095510N1355J88466k12815k86662J94395K99905l51393r1961N69073m89816
16491I66057N83684p67896K95544J4721l32374J16777L06912k21648k05843M5339
$$ y = [2526974, 2591230, 2265867, 2466074, 2174934, 2056148, 2387541, 2205539, 2092689, 2181242, 1978039, 1740897, 2034419, 1925733, 1594008, 1819864, 1891846, 1945553, 2070122, 1606658, 2003060, 1689984, 1828064, 1649226, 1872229, 2027346, 1517532, 2050134, 1695767, 1408226, 1554943, 1655873, 1599856, 1598093, 1676891, 1283807, 1415060, 1441948, 1351633, 1586712, 1350644, 1565406, 1695345, 1431588, 1747117, 1421345, 1249848, 1326605, 1566293, 1582777, 1065607, 1130517, 1124894, 1258069, 1400140, 1414325, 1290014, 1428879, 1154628, 1095510, 1146865, 1335331, 1122516, 835854, 1030249, 1330154, 978761, 886800, 1455873, 966057, 1549741, 781845, 1077389, 1092110, 759736, 876513, 1183425, 961777, 755934, 801273]
16481H01273K15195J82616n4682m43199J72573N1697J82509m79420M72814j64650
16471I36726J44736j87980j12351l6456p1545Q9726O5698k02986K69259K10671
16461A105498j35263q281j9493P4096l66630K38466R517l73868L77449k58659
16451F42832M4305K40350m00565N47942l53185O5725p2545n1948p1210J23079
16441G14780j20408L77665l3952D61277L77671j00616O7433o7355k51957K42254
16431G28707l5985K32758o3023C08169L13067J58001o5795k05182L15607C41784
16420G77553j87374J68577B9111O38879k91102k7782P6754K03286M3008j30435
16410E41719k15635M19285k33069N1863K66201j24376C08194L75118J90783j17609
$$ y = [801273, 1016468, 1199084, 1144402, 701203, 873776, 925473, 1107982, 628562, 1101376, 936726, 1081462, 893482, 781131, 744675, 673130, 762856, 828554, 625568, 894827, 1105498, 970235, 961954, 942461, 1016557, 649927, 888393, 897910, 524042, 901491, 642832, 687137, 927487, 526922, 1074864, 721679, 787404, 714859, 662911, 591701, 714780, 594372, 972037, 938085, 461277, 838948, 738332, 805765, 738410, 486453, 728707, 692722, 925480, 862457, 308169, 621236, 779237, 713442, 508260, 823867, 341784, 777553, 590179, 758756, 29111, 667990, 376888, 349106, 425860, 629146, 672154, 541719, 326084, 745369, 512300, 564163, 830364, 705988, 308194, 683312, 874095, 756486]
16400G56486l26709K45620j19297j11838J01304j76972J81359n7744K944j19790
16390C75363O8569k7897L44639k84501K57425P0601A18071N28859o1826r0049
16380D95055A75860L38844I633M34114L10800B29594L92563k34006A72337J45767
16370C18104A52633C9402K05784j17605M88953A8193K69314K70470k36050L7040
16360C58967L24818A94322p0074L28477A59592M46678k22766A66143K93130j64104
16350B95169r0558K45149L09758C63614C3585K59385K18350A43138K11942j28095
16340B26985K12343j74579N9977M73625B43079R6581k7873K36709A96633K05529
16330D02162J97337k79927J38328R3930k05160J91188C0505K79303Q6437j72991
$$ y = [756486, 429777, 675397, 556100, 444262, 545566, 368594, 549953, 492209, 495153, 375363, 443932, 416035, 760674, 476173, 733598, 804199, 118071, 646930, 585104, 495055, 175860, 514704, 9633, 443747, 754547, 229594, 622157, 388151, 172337, 318104, 152633, 39402, 245186, 127581, 616534, 18193, 287507, 557977, 321927, 358967, 683785, 194322, 124248, 452725, 159592, 606270, 383504, 166143, 459273, 295169, 204611, 449760, 759518, 363614, 33585, 292970, 511320, 143138, 355080, 226985, 439328, 264749, 324726, 798351, 243079, 339660, 311787, 548496, 196633, 402162, 599499, 319572, 457900, 551830, 346670, 537858, 30505, 309808, 396245, 223254]
16320B23254Q1604A31630n3087k1675L63947r203A88393a97694A78460H7033L97775
16309D84808G4289M77403B14921J14513J29436A27464D7771L21758i2313A39857
16298C69426j44434N3623L0433j08523O8605j34407L50782j52787a1991B43341
16287A32734O5571J70170l791A23455J7374K24078j79944o445k969A7270J59675
16276A76945J89418j14416n8925K19224j06228P8906H6187a55762B95117b1666
16265A48574g2182B42689l6408a53002A57988N7420D9986R1901F4381J04874a78465
16253A28520d555C30999k5655A08331B9195a770D65167B01680J69623F3199e7283
16241C11518M6A44515k0989a53009B34528q116G4988K27401a22514F3017J62344
$$ y = [223254, 304858, 131630, 78543, 56868, 420815, 411612, 188393, -197694, 178460, 87033, 484808, 74289, 551692, 214921, 329434, 458870, 127464, 47771, 369529, -92313, 139857, 369426, 224992, 278615, 309048, 200525, 269130, 134723, 485505, 332718, -11991, 243341, 132734, 198305, 368475, 364684, 123455, 140829, 364907, 184963, 178518, 175549, 17270, 176945, 366363, 251947, 193022, 412246, 306018, 384924, 86187, -155762, 295117, -21666, 148574, -72182, 242689, 206281, -153002, 157988, 215408, 49986, 141887, 64381, 169255, -178465, 128520, -4555, 330999, 305344, 108331, 29195, -1770, 465167, 201680, 371303, 63199, -57283, 311518, 311564, 144515, 123526, -153009, 234528, 226412, 74988, 302389, -122514, 63017, 225361]
16230B25361g4835l5656d486p7595A75712a98267R2105C33014A31942c30480h1653
16218C66853I3104e0412a0294I1263m4652J92976A13952Q1000a47966A73507B6024
16206B42892G4790Q7015B6351K24868C0665J53267R5020A19133J1888a45793B32429
16194b04051e2370j78784E1587A5887O3580h5774B31958C4528J47580E0649d431
16182A31711k6493K42386J52801A64832j7746K14695A6888A483J3975L71714j03136
16171B84036m8565l2037b23127A72077B8208b59866C7459C799K04788r3179J08392
16160B23800I7022m4413L02078A00298J69507b42198a15631F66a6119j38380B23623
16148b56577B32352b67649E2352a3309D0854a92509H405M97623A39214A4374O0533
$$ y = [225361, -74835, -110491, -4486, -82081, 175712, -198267, -106162, 333014, 131942, -330480, -81653, 366853, 93104, -50412, -10294, 91263, 46611, 239587, 113952, 194952, -147966, 173507, 26024, 242892, 74790, 161805, 26351, 251219, 30665, 183932, 278952, 119133, 131021, -145793, 232429, -204051, -52370, -231154, 51587, 15887, 79467, -85774, 231958, 34528, 182108, 50649, -4431, 131711, 105218, 347604, 500405, 164832, 147086, 361781, 16888, 1483, 15458, 387172, 284036, 235471, 203434, -223127, 172077, 28208, -259866, 37459, 3799, 208587, 115408, 223800, 97022, 52609, 354687, 100298, 269805, -242198, -115631, 666, -16119, -154499, 223623, -256577, 232352, -267649, 52352, -13309, 40854, -192509, 8405, 506028, 139214, 14374, 74907]
16137G4907R6837D6619j0833K24378p8857K20458q6344o3651f1969C52694b446
16125H242J24109L751R9911C4672K53180j13111c02485C69740j26921b14906f0109
16113e95240B76859F3440K26344b6354A42039a87712c462D0636a95120h3618c8061
16101A08754P5082m3551A9819M4972k9005Q7627J56961B6937M6049Q789P2076
16090A53851E8576b48456M7929F6328b67969B95633b1152j47231a4598B8012R5176
16079A23188h2169A39755b55496H0278J8032B1042J54417C036K79427H1973K8149
16068A10122a82472D15115R157c0524D4701a51960r0631R4270A54894o4009a17256
16056a16349n1399I2860L61809C8338M4878J37823c3358B68181o9675q0869K80327
$$ y = [74907, 171744, 46619, 35786, 260164, 181307, 401765, 315421, 251770, -61969, 352694, -2446, 8242, 132351, 136102, 236013, 34672, 287852, 174741, -302485, 369740, 242819, -214906, -60109, -595240, 276859, 63440, 289784, -26354, 142039, -187712, -3462, 40636, -195120, -83618, -38061, 108754, 183836, 140285, 19819, 64791, 35786, 123413, 280374, 26937, 72986, 81775, 153851, 58576, -248456, -200527, 66328, -267969, 295633, -21152, -168383, -14598, 28012, 123188, -82169, 139755, -255496, 80278, 98310, 21042, 175459, 3036, 282463, 81973, 110122, -182472, 415115, 424272, -30524, 44701, -151960, -242591, -148321, 154894, 90885, -117256, -116349, -167748, 92860, 454669, 38338, 83216, 221039, -33358, 268181, 198506, 117637, 397964]
16045C97964b29242B20177f1256D6779b15409a01921B41343h6255B56718a45790
16034B10915c29798D6983a99834K0253p396B36647F725J48754c20073a12721H2851
16022B81079c6370H0029C4790d27928g6291C1582J72762o3464J45570c26587B32075
16010B3814L4589M7088R0152a50346a7736A84177g7334A77441d6108b092p709
15999i801p1757K5644A53076b4034l2231E7J4930K02050b77611a0944C35938a09810
15986b627j33975B3923e435C16684J08465J17813A78748h9650G2506a09014d7445
15974b52803e6230k35042A09150d0493n1657m2107A88035d5349C2608e7851F2069
15962a58782H3166b33262D6643d8427j87173R4300p2233a03118A61042c68831
$$ y = [397964, -229242, 220177, -61256, 46779, -215409, -101921, 241343, -86255, 256718, -145790, 210915, -329798, 46983, -199834, -179581, -186977, 236647, 6725, 155479, -320073, -112721, 82851, 281079, -36370, 80029, 34790, -427928, -76291, 31582, 204344, 140880, 286450, -326587, 232075, 23814, 58403, 105491, 195643, -150346, -17736, 184177, -77334, 177441, -46108, -2092, -9801, -81558, -55914, 153076, -24034, -56265, 57, 14987, 217037, -277611, -10944, 335938, -109810, -2627, -136602, 23923, -5435, 316684, 425149, 542962, 178748, -89650, 72506, -109014, -47445, -252803, -56230, -291272, 109150, -40493, -92150, -134257, 188035, -45349, 32608, -57851, 62069, -158782, 83166, -233262, 46643, -48427, -235600, -141300, -213533, -103118, 161042, -368831]
15951G3378o019J4331N4114K25029b77058C2397d0619A48608m6306A4358a12222
15939d86009C3287b3114A33155C4623e0436o4232a8431A40557a85332i1760G1260
15927a0614A04091a03724B3268a18982C0351a81572A44798J39852n0688o7228
15917A66734G9725j9204d270A18232h1712q9140E5520b74835a312A21755P45a03580
15904c6824n4832M3962A79095R2281a83911A85963a85267H4867b89863J38574
15894a51289j74772g7668F3448a66222g3354k79460J40831B52801c70214E7584
15883a25251j17557j36762a010k59701j2772D9860J20148C0213a78040F7997j4010
15872E3987a04078D37511h8702A82933a87195B99821A7083G676J74179C1608a94512
$$ y = [73378, 67359, 81690, 135804, 360833, -277058, 32397, -40619, 148608, 102302, 14358, -112222, -486009, 33287, -23114, 133155, 34623, -50436, -114668, -18431, 140557, -185332, -91760, 71260, -10614, 104091, -103724, 23268, -118982, 30351, -181572, 144798, 284650, 233962, 166734, 79725, 60521, -4270, 118232, -81712, -170852, 55520, -274835, -1312, 121755, 122500, -103580, -36824, -91656, -47694, 179095, 271376, -183911, 185963, -185267, 84867, -289863, -151289, -326061, -77668, 63448, -166222, -73354, -352814, -211983, 252801, -370214, 57584, -125251, -242808, -379570, -1010, -260711, -273483, 49860, 170008, 30213, -178040, 67997, 53987, -104078, 437511, -88702, 182933, -187195, 299821, 17083, 7676, 181855, 31608, -194512]
15860A48042a25632J0644r1080R4345B52699I0285b07758B57135G5555K60309
15850C35864d1147D467a73284A06681a31847j75626a38114A4399a14604I7822
15839A67768h7707C2933J31637J26820D926J866J4688J20045f656k79247O4825
15828b21078G0669N4034g667r0071A44271n5731b80426i1809C05439j33876g2211
15816a22664j05654J2090d4764C09830f1201j44530K2900g6663A89012b83759
15805a33199k042j49736A43805k0279b67553J10258l6246O2288B03775a27155
15794A37300c2019I932a9402l36781B13835D2967a60251B53486c9202k81761a44576
15782d0008B88754l6811c05192q7297h6723b6173A1593a58955A81905M165C7036
$$ y = [148042, -125632, -114988, -206068, -111723, 252699, 90285, -207758, 257135, 75555, 335864, -41147, 4467, -173284, 106681, -131847, -307473, -138114, 14399, -114604, 97822, 167768, -87707, 32933, 164570, 291390, 4926, 6792, 21480, 141525, -6656, -285903, -221078, 70669, 124703, -7667, -97738, 144271, 88540, -280426, -91809, 305439, 171563, -72211, -122664, -228318, -216228, -44764, 309830, -61201, -205731, -182831, -76663, 189012, -283759, -133199, -135241, -284977, 143805, 123526, -267553, -157295, -193541, -131253, 203775, -127155, 137300, -32019, 9932, -19402, -356183, 213835, 42967, -160251, 253486, -39202, -320963, -144576, -40008, 288754, 251943, -305192, -392489, -86723, -26173, 11593, -158955, 181905, 186070, 37036]
15770E3723a29865A10951b00979J0531B49660E6223B6850N1196a31066A23634
15759A96018J2244c6264LC0302b64676D1377K37937F230L16506h7194K9232B02368
15746b59434Q980C25108e8918F940c2190j37950D1953Q6564i2529B1557N2592
15735G4149b35227Q9487B57126h8460A05920b0317j13044D02190I2415A2077b0376
15723d73664G2607a85853Q2290M5843E7945J00421b08099D0173b56163C24909
15712A98696a63250M2769J709M025j10879j20582C4847d48653G7221j5297J31625
15701A93549r494m9288g2541B0775J28777N5775K90962c15772c8166A0414J63628
15690A74042J55472j11436h4809H4767a39335j52950D3172Q2122a12945c7382
$$ y = [53723, -129865, 110951, -200979, -190448, 249660, 56223, 26850, 78046, -131066, 123634, 196018, 208262, -36264, -36261, 30302, -264676, 41377, 279314, 6230, 322736, -87194, -57962, 202368, -259434, -250454, 325108, -58918, 6940, -32190, -170140, 41953, 128517, -92529, 21557, 74149, -235227, -145740, 257126, -88460, 105920, -20317, -133361, 402190, 92415, 12077, -20376, -473664, 72607, -185853, -103563, -57720, 57945, 158366, -208099, 40173, -256163, 324909, 198696, -163250, -120481, -118772, -114747, -225626, -346208, 34847, -448653, 77221, 61924, 193549, 184055, 134767, -72541, 20775, 149552, 205327, 496289, -315772, -38166, 10414, 174042, 329514, 218078, -84809, 84767, -139335, -292285, 43172, 125294, -112945, -37382]
15679B03008A4380J07498E7965A3696E567J12691i9184F2457b0636A20254B3695
15667C0166R3652c52011a40658l4366l90793b02109a1331A83674a61847A44101
15656b67829A69378R3733a36733A34604d43722i2785C0193b16034i1776j50532
15646b42308h9297j6945k12339d5435j62084f3253j2229A21950d6308j15685A92654
15634a96265Q9150c401l08146a17871c1192I5692R5821L8847k2784e4014b1103
15622c53312F0701R4222a28084L8417p2930A26840b27046A7097c3314B67585E2060
15610f6595j99954H9667C6149a41391A8013d45293F5623k3851c70318O5411C442
15598a23259n8457F1947a46514D4235B0044P27J70968n0786a64949a7177A1759
$$ y = [203008, 14380, 121878, 57965, 13696, 5567, 118258, -99184, 62457, -20636, 120254, 23695, 30166, 123818, -352011, -140658, -175024, -565817, -202109, -11331, 183674, -161847, 144101, -267829, 169378, 263111, -136733, 134604, -443722, -92785, 30193, -216034, -91776, -242308, -89297, -106242, -318581, -45435, -207519, -63253, -75482, 121950, -46308, -161993, 192654, -196265, -107115, -3401, -311547, -117871, -31192, 95692, 191513, 230360, 207576, -54014, -21103, -353312, 60701, 154923, -128084, -89667, -162597, 126840, -227046, 17097, -33314, 267585, 52060, -66595, -266549, 89667, 36149, -141391, 18013, -445293, 65623, 41772, -370318, -304907, 3442, -123259, -181716, 61947, -146514, 44235, 20044, 20771, 191739, 140953, -164949, -17177, 11759]
15586a34579A02371e548j93248F3323R1995a77707E6802M40998A7553N3984f8996
15574B6782O0345K52103R2059B4869f0016A34562N8018C3529g2767m957A01630
15562a88909D77263c03793A67254J34881A7037K7977e8341i547k58233Q2444a9004
15550i2636A92473d1914l82061b3062C55919N0558k02593c02292h7322k6722F5764
15538c0543l1502I9864R3275r1342b68709a20616A93725a47833M3369l8903J2524
15527a30843B2994a30502M5948q2394A77598p0094E482J1276b6684m5906D7669
15515a35234j7419A73035a61797B13798a1842J927D4466J10281a78169h2416k8659
15504a11075L4196f917B031J12879g2847B3225a64248j44129C435b24153C2227
$$ y = [-134579, 102371, -5548, -198796, 63323, 155318, -177707, 56802, 497800, 17553, 71537, -68996, 26782, 87127, 339230, 431289, 24869, -60016, 134562, 192580, 33529, -72767, -77724, 101630, -188909, 477263, -303793, 167254, 302135, 17037, 45014, -58341, -9547, -267780, -185336, -19004, -92636, 192473, -41914, -423975, -23062, 355919, 406477, 203884, -302292, -87322, -114044, 65764, -30543, -62045, 99864, 193139, 101797, -268709, -120616, 193725, -147833, -104464, -143367, -130843, 22994, -130502, -84554, -166948, 177598, 107504, 5482, 16758, -26684, -72590, 47669, -135234, -152653, 173035, -161797, 213798, -11842, -9915, 44466, 154747, -178169, -82416, -111075, -76879, -6917, 2031, 114910, -72847, 23225, -164248, -308377, 3435, -224153, 32227]
15492b7398k7492k35473J07710B33685D1765f3023F006L59470c78479k7953g9926
15480a30087D51312I2562i6570B03192e8187B464J55780a54789K2387j39256A00494
15468A53439d04962C05552b77281j03944d328A05447J25695J7520a57259A05439
15457B90337b5204j4599B8227h050A57554g4271p0054N1687j51168g0268e498
15445h4215B28931o5383J07663b46411N1372g6321P459A34902E9863b93524a22577
15433a85387F6944K27781d37495C03282p952f2863B48043e9357o3507d2640B9867
15421h3903B6545L5709a85446e1430A72625e439B26746B4927J83325b23334a0912
15409a33666A10980G811P049b16329Q2957J7409A27496a0642H8988B2778L6906
$$ y = [-27398, -54890, -290363, -182653, 233685, 41765, -63023, 6006, 365476, -378479, -406432, -79926, -130087, 451312, 92562, -96570, 203192, -58187, 2464, 158244, -154789, -132402, -271658, 100494, 153439, -404962, 305552, -277281, -381225, -4328, 105447, 231142, 248662, -157259, 105439, 290337, -25204, -39803, 28227, -8050, 157554, -74271, -144325, -92638, -243806, -70268, -5498, -84215, 228931, 163548, 271211, -246411, -195039, -76321, -68862, 134902, 59863, -293524, -122577, -185387, 66944, 294725, -437495, 303282, 295330, -62863, 248043, -59357, -122864, -42640, 29867, -83903, 26545, 62254, -185446, -51430, 172625, -5439, 226746, 24927, 208252, -223334, -10912, -133666, 110980, 7811, 14860, -216329, -133372, -115963, 127496, -10642, 88988, 22778, 59684]
15398E9684c17628C7756b1595C19953a60354g4706B95906e2311k68666A32232
15387G993i6339A64360f22B84694A332K88054q8625D1710n956M5849j3783a68112
15374I1444a03778A48569N7801a73028A3049a66239O036k28484J26234A02787
15363A08375M5269a9273k24954G4552N8778a04182A39687b60509A14871J55016
15353B69887j22132a62937B2069J36794c602D7132J80975q7379c2714k46478B66264
15341b17778B6759g3797A80992b06111L0841B27615N3954a66107E3699J80262
15331B33961p9247L6616h7911n4357A52312c78250F4886J13332A6291K3299g2970
15319a36912A47704a55908b2705f693B9890J26745a16106B71922E0174L5060d6552
$$ y = [59684, -317628, 37756, -21595, 319953, -160354, -74706, 295906, -52311, -320977, 132232, 7993, -96339, 164360, -622, 284694, 1332, 289386, 200761, 41710, 35754, 81603, 67820, -168112, 91444, -103778, 148569, 206370, -173028, 13049, -166239, -160203, -388687, -262453, 102787, 108375, 153644, -19273, -244227, 74552, 133330, -104182, 139687, -260509, 114871, 269887, 147755, -162937, 22069, 158863, -3602, 47132, 228107, 140728, -32714, -279192, 266264, -217778, 26759, -73797, 180992, -206111, -175270, 227615, 281569, -166107, 53699, 233961, 154714, 191330, -87911, -142268, 152312, -378250, 64886, 178218, 16291, 39590, -72970, -136912, 147704, -155908, -22705, -6693, 29890, 156635, -116106, 271922, 50174, 85234, -46552]
15307h3571L3769j06676P5108B30589b85666I7558a63849O3621A51084N753e4618
15295b4246A73108D202a29086K2975B29656h6511j75420P4145E80204a31481A19677
15283C6989a3991j9541C37988a58653c4141I0834K40620H7453b97623i4273k13419
15272c07692h6355l9312l1237N0245A11786J6207J18377A6611K36628a70217B02045
15260A93137c41488g2517A43717J33112F2679L00495F3141c5722B60451P958J53831
15249D22240N18346O02231l19351r757l43055l94888j93727n5897L7242n8585
15239B04799D5879J99893f9685D413R1413R9430K0634B5542a10378B74704j7173
15228B57531A02519a04078H1262L07310j40717A4562J75206j2968q042l8552C8455
$$ y = [-83571, -49802, -156478, -81370, 230589, -285666, 97558, -163849, -100228, 151084, 156837, -54618, -24246, 173108, 4202, -129086, -106111, 229656, -86511, -261931, -187786, 580204, -131481, 119677, 36989, -13991, -33532, 337988, -158653, -34141, 90834, 331454, 87453, -297623, -94273, -307692, -86355, -125667, -156904, -106659, 111786, 127993, 246370, 16611, 253239, -170217, 202045, 193137, -341488, -72517, 143717, 276829, 62679, 363174, 63141, -35722, 260451, 268409, 422240, 940586, 1542817, 1223466, 1213709, 870654, 475766, 282039, 226142, 263384, 204799, 45879, 245772, -69685, 4413, 95826, 195256, 215890, 25542, -110378, 274704, 257531, 102519, -104078, 81262, 388572, 247855, 14562, 189768, 176800, 168758, 130206, 38455]
15216b76129I7874N3022P7231b15459B20603H4803a09763B25408q1545D6903N964
15205E2867J83677a75222B84970a14366j8997c801k33439B84375b04796e856F1431
15193i5173j63700B09044H3838M198a39527A66463J27922I7246c11653c0520C23060
15181H5977d4123F4116a3295F1362Q2338b29210L2965I3397J11631a45333B33528
15169e23353h3174B33356a94582G726K43250p6512b04550C62429l0478E733K04218
15158B09951Q7067a36452A04709m3683j6828g776G1249A2514P0374J0621a10895
15146B41425G9486L53451k15409K02097b32836f6207B17642O0937C4937R6548
15136A31485g3464C91714I8450Q5688a15922G5314N4350B3423E582K21609F6459
$$ y = [-276129, 97874, 150896, 228127, -215459, 220603, 84803, -109763, 225408, 143863, 46903, 52867, 236544, -175222, 284970, -114366, -133363, -3801, -237240, 284375, -204796, -5856, 61431, -95173, -258873, 209044, 83838, 88036, -139527, 166463, 294385, 97246, -311653, -30520, 323060, 85977, -44123, 64116, -13295, 61362, 143700, -229210, -196245, 93397, 205028, -145333, 233528, -523353, -83174, 233356, -194582, 7726, 250976, 174464, -204550, 362429, 331951, 5733, 209951, 297018, -136452, 104709, 61026, 44198, -7776, 71249, 12514, 82888, 93509, -110895, 241425, 79486, 432937, 217528, 419625, -232836, -66207, 217642, 278579, 34937, 131485, -73464, 391714, 98450, 184138, -115922, 75314, 129664, 23423, 5582, 227191, 66459]
15124C36867G1099a44303B78104j38483h1384C1019h2450H3593M68610A57555
15113A11046K5839J30738e2822B75014b8245A08400J79390j18295A7714d523I4993
15101a4551B35661c86409A04013c9758j71663D61447j83922d3454d905H7400M76073
15090E63473I0175c25821H4969a37197C09120A18379O1989R9026J7296r3380J14682
15079C17992A16383Q7371J20999r8825G138f770A58960J1998L14596B36441A01775
15067a7878C97920O4998H6856l7912J54897r7729m5987L18732i8304D7833d1828
15055C6448N6986J08656O2789A27309A3128K39182o595D0510K62441q0463k2283
15044B00205Q2614p8146K79633A27934e5327A29481J44011O0218j09324A741K46146
$$ y = [336867, 71099, -144303, 278104, 139621, -81384, 31019, -82450, 83593, 552203, 157555, 111046, 136885, 267623, -52822, 275014, -28245, 108400, 287790, 169495, 17714, -4523, 94993, -14551, 235661, -386409, 104013, -39758, -211421, 461447, 277525, -43454, -4905, 87400, 563473, 90175, -325821, 84969, -137197, 309120, 118379, 180368, 279394, 296690, 203310, 317992, 116383, 203754, 324753, 225928, 7138, -6770, 158960, 170958, 485554, 236441, 101775, -17878, 397920, 462918, 86856, 48944, 203841, 106112, 60125, 378857, -98304, 47833, -41828, 36448, 93434, 202090, 264879, 127309, 13128, 252310, 245715, 40510, 302951, 222488, 200205, 282819, 204673, 484306, 127934, -55327, 129481, 273492, 333710, 224386, 1741, 247887]
15033B47887K66531A3117K21631a38900B50487a34183B02563l5493K2512F07a2200
15021E8443R4477P1321h1373B62747J32590D6090K59208P6088j4625j24805I8437
15009g2932C50011A43204K49552f185A82291B9144a40770j2552A17490K6157b6593
14997B49047O5902k435j12351O8161C0810J59736J53144j34163J76899H8762K72169
14986C60931j30403K32897A43106o0899K84830P6108a62282C8720J92916G9026
14975A59919B6656J33991a09361D9946A0235J60989E579L58891b3474D50809A52084
14963D37373a15181F1167J41901J82469j28253A19831J26428K75830A35838B8952
14952A84675R9674m552j18949Q1923E7881a22288A68421Q1678m0174l9643q2396
$$ y = [247887, 514418, 13117, 234748, -138900, 250487, -134183, 202563, 167070, 189582, 607, -12200, 58443, 152920, 224241, -81373, 262747, 395337, 46090, 305298, 381386, 366761, 241956, 98437, -72932, 350011, 143204, 392756, -6185, 182291, 29144, -140770, -153322, 117490, 143647, -26593, 249047, 314949, 312514, 200163, 268324, 30810, 190546, 343690, 209527, 386426, 88762, 360931, 230528, 463425, 143106, 82207, 367037, 443145, -162282, 38720, 231636, 79026, 159919, 26656, 160647, -109361, 49946, 10235, 171224, 5579, 364470, -23474, 450809, 152084, 437373, -115181, 61167, 203068, 385537, 257284, 119831, 246259, 522089, 135838, 28952, 184675, 284349, 279797, 160848, 242771, 57881, -122288, 168421, 250099, 209925, 170282, 87886]
14941H7886L06025j50088J95579A51454L27870A86575J77872A19295M1921a5224
14930A71951K58623G3715K78372A70968J48888D3285L67471k03295Q5928o0711
14920B32678K21864K52511D4609M09667A79210K99326B08175J15372A29502L6519
14910A66021Q4720J49153j71765l212K37493j76195Q4430I1006K44481Q8098p0151
14899C53434K45882k75165P0475m3873j29852J90819J32247k19851A22944L08960
14889D31904J86219r6005A66697J42448g316B88455k7538K56106k27151J71642
14879D61514j3027R4687j31016J25306L570j77566A39300M52964K5403F1928K86845
14868C48773m8016L82699A71952J58909n6133C1155N06467j69767A24624L57507
$$ y = [87886, 393911, 243823, 439402, 151454, 479324, 186575, 364447, 119295, 161216, -15224, 171951, 430574, 73715, 352087, 170968, 319856, 43285, 410756, 207461, 293389, 232678, 454542, 707053, 44609, 454276, 179210, 478536, 208175, 323547, 129502, 166021, 250741, 399894, 228129, 224917, 462410, 286215, 370645, 91006, 335487, 423585, 353434, 599316, 324151, 394626, 350753, 220901, 411720, 543967, 324116, 122944, 431904, 618123, 522118, 166697, 309145, -7316, 288455, 260917, 517023, 289872, 461514, 448487, 543174, 412158, 537464, 541034, 363468, 139300, 592264, 617667, 61928, 348773, 300757, 683456, 171952, 330861, 274728, 31155, 537622, 367855, 124624, 482131]
14858D82131q5659m2172J48683B50168M41285k11345j18480r2293K59667J28767
14848F57769k8222A65686J21852J56967A73183J3670J56440K35875j70229O3599
14838D72538k26586K77910J23637A49564P24266l65782R6761k95772Q2410r4588
14828B96859k7866K33716n9961L55601B08594L34400n3222j78018K54711L5914
14818F02379B88406K42824j59460p3104L46100n0716j30537m2748K28364M6860
14808F95989o4404n8678m2486j71655K85764j12114j06479K15277j22131P7911
14798E96994P8226k55526M17008l72034K14923j96472r5959L23824k25284J90761
14788F76461j42367J01077q3207Q6246k27606j89851J77119M36366K6523C85131
$$ y = [482131, 396472, 354300, 502983, 250168, 691453, 480108, 361628, 269335, 529002, 657769, 629547, 165686, 287538, 444505, 173183, 186853, 343293, 579168, 408939, 472538, 245952, 523862, 647499, 149564, 873830, 508048, 604809, 309037, 391447, 296859, 268993, 502709, 442748, 798349, 208594, 542994, 489772, 311754, 566465, 602379, 288406, 531230, 371770, 298666, 644766, 594050, 463513, 420765, 649129, 695989, 631585, 572907, 530421, 358766, 644530, 532416, 425937, 641214, 519083, 596994, 675220, 419694, 836702, 464668, 679591, 483119, 387160, 710984, 485700, 676461, 534094, 635171, 551964, 638210, 410604, 220753, 397872, 834238, 860761, 385131]
14777D89255J22223K28358q9876k47781M8188J18862j83912j3462m0101L09851
14767G41605J61079j83638k32310k09886N07194p5851C28927O75101j57291J21847
14757I68584B58747K5793M73126j37821J84835j62239K52506k24031J3083J45155
14747H29154k82023K76924r8460j70528K04855j08783o1912j30050m8253N81143
14737I92067D04745M64409o6881L5698j99289O1944K10259l17321K59928r382
14727H44110o3414P4053k06347K74083j31038j38745N2221J70357M3310k85896
14717F32694j40795L05022j74227M0999J06433J66552j44294j55756p063J33720
14707G63285L54735l98494J66035k6265K81122l92478L97087j06461l64404J91964
$$ y = [489255, 611478, 839836, 749960, 502179, 550367, 669229, 485317, 471855, 431754, 741605, 902684, 719046, 486736, 276850, 784044, 708193, 328927, 1004028, 846737, 968584, 258747, 284540, 757666, 619845, 804680, 642441, 894947, 670916, 683999, 829154, 547131, 824055, 725595, 555067, 759922, 651139, 589227, 459177, 410924, 992067, 404745, 869154, 802273, 837971, 638682, 700626, 910885, 593564, 853492, 844110, 780696, 854749, 648402, 922485, 791447, 652702, 704923, 875280, 918590, 632694, 491899, 796921, 622694, 663693, 770126, 936678, 792384, 636628, 629565, 763285, 1118020, 719526, 885561, 859296, 1140418, 747940, 1145027, 1038566, 674162, 866126]
14697H66126L15520J6577l41854Q4212J84737J0037r5585O5091k48789J38117
14687I94189m28648L42904j43738J80411K82150k51362j5802r01l178P3135l23080
14676G06080K83504J59710l42010M5776N9493K57198m03001J29094m32165P73834
14666A237513K07134k99372j27306P9041l9207j68089j52293M21511j98160K46090
14656A206862J78741j33513j48269O0733j08873j35312L18469Q8254K17521l66965
14646A177648L3947L3905j81861M44641n20149M85320k99399r9172L3694J18220
14636A226794P9163j24255J33509J21722j75017k0929o6687K78163J0295j09984
14626A352774q7149L24399l86224O64230n17605J51311J5202j19692j6567M221
$$ y = [866126, 1181646, 1198223, 856369, 940581, 1125318, 1135355, 1039770, 1104861, 856072, 994189, 565541, 908445, 764707, 945118, 1227268, 975906, 960104, 959203, 956025, 1029160, 706080, 989584, 1149294, 807284, 853060, 912553, 1169751, 766750, 895844, 463679, 1237513, 1444647, 1145275, 1017969, 1097010, 1057803, 889714, 737421, 1158932, 960772, 1206862, 1385603, 1252090, 1103821, 1164554, 1055681, 920369, 1238838, 1327092, 1544613, 1177648, 1211595, 1245500, 1063639, 1508280, 988131, 1473451, 1174052, 1074880, 1108574, 1226794, 1305957, 1181702, 1315211, 1436933, 1261916, 1240987, 1174300, 1452463, 1462758, 1352774, 1265625, 1590024, 1203800, 1868030, 1350425, 1501736, 1516938, 1397246, 1380679, 1384900]
14616A384900J63857l06412J77767k2210k85112L31241k25311K92861M400k2994
14606A492987P5717L63875l45472N0590R409k55675N59906k49156k32095J74800
14596A644886j2858m7745K9183K79943k8589K16575k49491K14274k4735j04030
14586A917413J12547q0511K391K02037j08551j0700l08882K73430L5755p6749
14576A958180J84977j31254K30684j73570j04294O3703K98951K51457l66042K18234
14566B431026J01480k8121N3869L81734k46799j84030J75054J75775J89082K7494
14556C076564K52919R5187N3109L49924R9384Q02516J026838J785314L950046
14547A1491801Q540967J7601053Q940636k1562855A0658394E130902j891565o00041
$$ y = [1384900, 1548757, 1242345, 1420112, 1397902, 1112790, 1444031, 1218720, 1511581, 1515981, 1492987, 1568704, 1932579, 1587107, 1637697, 1647106, 1391431, 1951337, 1702181, 1470086, 1644886, 1632028, 1584283, 1613466, 1893409, 1864820, 2081395, 1831904, 2046178, 2021443, 1917413, 2029960, 1949449, 1951840, 2153877, 2045326, 2034626, 1725744, 1999174, 2034929, 1958180, 2143157, 2011903, 2242587, 2069017, 1964723, 2028426, 2327377, 2578834, 2212792, 2431026, 2532506, 2504385, 2558254, 2939988, 2693189, 2509159, 2684213, 2859988, 3049070, 3076564, 3329483, 3424670, 3477779, 3827703, 3927087, 4729603, 5756441, 7541755, 11491801, 20032768, 37633821, 46574457, 25011602, 10658394, 5130902, 3239337, 2639296]
14539B639296m83139j36295o4955j51226M07984k12820J28513m9199j07262L03746
14529B274643N9009K76112k23870k07627K21823j09362m270l7468J84364M0426
14519B473780O1610l29347N50471O503j25258R4774K7626k00268L42353O6427
14509B968671r8286J51063K55073j71512J11605k94871K35488m9364k0180L90640
14499C478327K19770m35998L84147m45622o8826L79988k94223L00503M9857M3543
14489C611466p2289K18126j10849L4756J44191l52712M55818O2663J45776j84224
14479C952722L55420n30542L31691J88556K4775r9527j09612K21098j08118O983
14469D233446L50175k18789L95710m01847M07848P9109P8352r8401q5678K60001
$$ y = [2639296, 2156157, 2019862, 1954907, 1803681, 2211665, 1998845, 2127358, 2078159, 1970897, 2274643, 2333652, 2609764, 2385894, 2178267, 2400090, 2290728, 2286458, 2248990, 2433354, 2473780, 2535390, 2206043, 2756514, 2763017, 2637759, 2732533, 2760159, 2559891, 2902244, 2968671, 2870385, 3021448, 3276521, 3105009, 3216614, 2921743, 3157231, 3107867, 3087687, 3478327, 3698097, 3262099, 3646246, 3200624, 3131798, 3511786, 3217563, 3518066, 3567923, 3611466, 3539177, 3757303, 3646454, 3681210, 3825401, 3472689, 3928507, 3991170, 4136946, 3952722, 4308142, 3777600, 4109291, 4297847, 4322622, 4223095, 4113483, 4334581, 4226463, 4233446, 4583621, 4364832, 4760542, 4358695, 4766543, 4845652, 4924004, 4825603, 4739925, 4999926]
14459D999926l9973L12159J27232l17167O5074K90332k27755Q2715j38738L15793
14449E469598M32798j71236J26558M35097m79735K47222K5367O5733j61384N5936
14439F045954L67425K32874K94055l55692K24354k79563L75445J984J46423Q1911
14429G135170Q0955j4299O88245m33441K87694l50885L88685K37456m8448J55452
14419H126584J63739L2595M48706k39560Q47516m62202O69041p02349L49830K32960
14409I466860K19209N6585o678N96654j35853q6562M64739o1168J57155J32942
14399A0803883Q73129j50284k39584L42525L17310J12032N330M48538o2091N60151
14389A3010939L55375R1949K94747J60353J29845M00590J79122K66440J42064
$$ y = [4999926, 4959953, 5272112, 5399344, 5082177, 5147251, 5437583, 5209828, 5292543, 5153805, 5469598, 5902396, 5731160, 5857718, 6292815, 5813080, 6060302, 6085669, 6151402, 5990018, 6045954, 6413379, 6646253, 6940308, 6584616, 6808970, 6529407, 6904852, 6906836, 7053259, 7135170, 7216125, 7201826, 7890071, 7456630, 7744324, 7393439, 7782124, 8019580, 7971132, 8126584, 8290323, 8322918, 8771624, 8532064, 9379580, 8917378, 9586419, 8884070, 9233900, 9466860, 9686069, 9742654, 9735976, 10332630, 10196777, 10110215, 10574954, 10513786, 10670941, 10803883, 11677012, 11526728, 11287144, 11629669, 11946979, 12059011, 12064341, 12512879, 12450788, 13010939, 13366314, 13458263, 13753010, 13913363, 14043208, 14443798, 14622920, 14889360, 15031424]
14380A5031424P05130j36623M76698M08101K92545J97809J07633O77151J72551
14371A7932419M25412O23118K6196J95990P86803p5930L96166M70642N12998Q32634
14361B2126448L87927P04368l52258P23736O83529P90296L38815O33252L29481
14352B6365594J127042M47719M20716J021056P00330P99197N52446R26127J040690
14343C3400917P77997R50919O71927J304039R69272N83929J477907J351020Q97355
14334D2385282J289117J494059J360806J333709J277669J328414J832374J834256
14326E4135686J573914J792969J871464K258023K061153K450561K082772K630521
14318G0857063K979041J934590L176320K927110L110136L255824L545701L793858
$$ y = [15031424, 15736554, 15599931, 16076629, 16484730, 16777275, 16975084, 17082717, 17759868, 17932419, 18357831, 18980949, 19007145, 19203135, 19989938, 19914008, 20310174, 20780816, 21293814, 22126448, 22514375, 23218743, 22866485, 23590221, 24273750, 25064046, 25402861, 26036113, 26365594, 27492636, 27940355, 28361071, 29382127, 30082457, 30881654, 31434100, 32360227, 33400917, 34178914, 35129833, 35801760, 37105799, 38075071, 38659000, 40136907, 41487927, 42385282, 43674399, 45168458, 46529264, 47862973, 49140642, 50469056, 52301430, 54135686, 55709600, 57502569, 59374033, 61632056, 63693209, 66143770, 68226542, 70857063, 73836104, 75770694, 78947014, 81874124, 84984260, 88240084, 91785785, 95579643]
14310I5579643L937889M078643M319839M476580M957570M918558N661901N483416
14302A33414039O202453O389829O680088P198013P758935Q099375Q540361Q664201
14294A92947294R639385R824053J0711118J0926765J1822276J1952677J2763656
14287B70587224J2987895J3775043J4082664J4193375J4678176J4666844J4750590
14280C69721811J4713205J3799715J3756506J2919018J1483686J0084065Q752158
14273D55230164N658494J251444j123503j555789j93518m288154l660943m766354
14265D46551841q674583j0790533j2023680j3382369j3907090j4678247j4923169
14258C58172170j4988817j5371315j5244468j3997935j4291398j3644203j3377530
$$ y = [95579643, 99517532, 103596175, 107916014, 112392594, 117350164, 122268722, 127930623, 133414039, 139616492, 146006321, 152686409, 159884422, 167643357, 175742732, 184283093, 192947294, 202586679, 212410732, 223121850, 234048615, 245870891, 257823568, 270587224, 283575119, 297350162, 311432826, 325626201, 340304377, 354971221, 369721811, 384435016, 398234731, 411991237, 424910255, 436393941, 446478006, 455230164, 460888658, 462140102, 461016599, 459460810, 459267292, 454979138, 451318195, 446551841, 437877258, 427086725, 415063045, 401680676, 387773586, 373095339, 358172170, 343183353, 327812038, 312567570, 298569635, 284278237, 270634034, 257256504]
14251B57256504j2438326j2014262j1602138j0665802j0177550j0024948q725432
14244A81608046q397644q083751p573113p313554o795367o685992n445839n692282
14236A25620504n137450n515462m865885m521851m248812l845404l455972l883935
14228I0145733l430424k990728l827312k843419k552799k540626k486918k387775
14220F7085732k429247j823353k222191j996097j816807j675091j850474j070803
14212E2201669k016460j710100j382582j305531j423677m81279j304688j528024
14204D1049328j166851j218255q96497r02290q82607r49710r61144q36755j420699
14195C1814520j50704p02906q66300p61712p49355p73244p11326n70717o81572
$$ y = [257256504, 244818178, 232803916, 221201778, 210535976, 200358426, 190333478, 181608046, 173210402, 165126651, 157553538, 150239984, 143444617, 136758625, 131312786, 125620504, 120483054, 114967592, 110101707, 105579856, 101331044, 97485640, 94029668, 90145733, 86715309, 83724581, 79897269, 77053850, 74501051, 71960425, 69473507, 67085732, 64656485, 62833132, 60610941, 58614844, 56798037, 55122946, 53272472, 52201669, 50185209, 48475109, 47092527, 45786996, 44363319, 43882040, 42577352, 41049328, 39882477, 38664222, 37767725, 36865435, 35982828, 35033118, 34071974, 33235219, 31814520, 31663816, 30960910, 30094610, 29332898, 28583543, 27810299, 27098973, 26528256, 25846684]
14186B5846684p60450n1882q25749r79282n9929q51952k20932m45218n62261n63901
14176B0525128l26568l16664m91820j53528m97526l26474k00254o06341l09486
14167A7296467k10440k28943r14542J15349j24895o83493l02411k5430j42864
14158A4778798j55566k02145k27437n23276k85129m5179k76170l23280q8457k7254
14148A2624905n26815j7815j3327j03006j76973o03605p2210J12415l25340j39463
14138A0758766n1415j38435m45566q7758l4135q8401J96873o69074K07386n64438
14128I083803l8577j5958m76233M65276o11638J82586l91097r6001J99507l80002
14118G921666j7890l76166J76319m6939M1698k97245J47338k9710l18091j17224
$$ y = [25846684, 25086234, 25034352, 24208603, 23229321, 23169392, 22317440, 22096508, 21651290, 21089029, 20525128, 20198560, 19881896, 19390076, 19236548, 18739022, 18412548, 18212294, 17605953, 17296467, 17086027, 16857084, 15942542, 16057891, 15932996, 15249503, 14947092, 14921662, 14778798, 14623232, 14421087, 14193650, 13670374, 13385245, 13340066, 13063896, 12740616, 12652159, 12624905, 12098090, 12080275, 12066948, 11963942, 11786969, 11183364, 11111154, 11223569, 10898229, 10758766, 10707351, 10568916, 10123350, 10035592, 10001457, 9913056, 10109929, 9440855, 9648241, 9083803, 9045226, 9029268, 8553035, 9018311, 8406673, 8589259, 8198162, 8102161, 8301668, 7921666, 7903776, 7527610, 7703929, 7656990, 7698688, 7401443, 7548781, 7519071, 7200980, 7083756]
14108G083756j42630k0994j7856j95391q9326l25833K15589o7436j55021O8678
14098F353536j41759j23987M7524n1133j60414j51037L3755j56132Q6947J3355
14088E750655j91017K6290j45739l9658j86883L63715r8618k81284j56775p6325
14078D964361j96095M12399j29021l50420J94919j11192r0414J17874k07494J08171
14068D713088l06950n2213p8756K66693l53621L2101J3976K78855k64230M0273
14058D289216k35816p6693L62157l07623k40775J46327j8614j96941l2494N83988
14048D272732l79930k55018k7315K3683k53380R9714q6419J78259q2616j68976
14038C320734J0114J23923j91103j4414J43422n3154J14483m74747l6827K84123
$$ y = [7083756, 6941126, 6920132, 6902276, 6706885, 6617559, 6291726, 6507315, 6439879, 6284858, 6353536, 6211777, 6087790, 6135314, 6084181, 5923767, 5772730, 5806485, 5650353, 5737300, 5750655, 5559638, 5585928, 5440189, 5400531, 5213648, 5577363, 5478745, 5197461, 5040686, 4964361, 4768266, 5180665, 5051644, 4701224, 4896143, 4784951, 4694537, 4812411, 4604917, 4713088, 4406138, 4353925, 4275169, 4541862, 4188241, 4220342, 4234318, 4513173, 4248943, 4289216, 4053400, 3976707, 4338864, 4031241, 3790466, 3936793, 3918179, 3721238, 3688744, 4272732, 3892802, 3637784, 3610469, 3634152, 3380772, 3480486, 3394067, 3572326, 3489710, 3320734, 3330848, 3454771, 3263668, 3249254, 3392676, 3339522, 3454005, 2979258, 2942431, 3226554]
14028C226554k85874K18163m95576K06152Q1410q6633J32641n6383j07298L9245
14018B872401j85948J93100k12021K8953N0942k19093O2589K8789K7734p7261
14008B570185J14042n6511j89666j14618p2511J19227q7863q5662K27494M5959
13998B470076n01595K43777K7063k1135J49710k51405N69245j4458J02481J028213
13988C801972K343995O475518J6454358J6246768j5005553j4285815o890483k536460
13980F604300j333589p39700o20425O0180n14975p3011q89240L42968J35501j00437
13970B871572j51147n69159L55783O4938M0870j99748j60694J13871O7606j6232
13960B417660m74776J19211k4197J61330J79388n17500L03428P6864l22213k2084
$$ y = [3226554, 2940680, 3158843, 2663267, 2869419, 2950829, 2864196, 2996837, 2940454, 2833156, 2872401, 2686453, 2879553, 2667532, 2696485, 2747427, 2528334, 2590923, 2619712, 2647446, 2570185, 2684227, 2627716, 2438050, 2323432, 2250921, 2370148, 2282285, 2196623, 2424117, 2470076, 1968481, 2212258, 2239321, 2218186, 2367896, 2116491, 2685736, 2671278, 2773759, 3801972, 6145967, 12621485, 29075843, 45322611, 30317058, 16031243, 9140760, 6604300, 5270711, 4531011, 3910586, 3970766, 3455791, 3382780, 2493540, 2836508, 2972009, 2871572, 2720425, 2151266, 2507049, 2571987, 2612857, 2413109, 2252415, 2366286, 2433892, 2417660, 1942884, 2062095, 2037898, 2199228, 2378616, 1861116, 2164544, 2241408, 1919195, 1897111]
13950A897111O4016K77608j34867k41987J70496K62421l13437k25211N2499O4079
13940A872728p5796j48925M83975k42896N7238K44105n96699M4747L09233j20202
13930A827508n3624J79871k0309l88178J16417l5057L74798j85241j94304K15559
13920A837440m49983J48743K58298k47739j07759j50973M04164l42340K05016
13911A554867K29928m72484K19604k97405K35685o3887m2403N7637M05382m80691
13901A346233N54654m31684J12476l57028J99127N1540L60236m77472J03286n2335
13891A409033q9466K46971k94397J86940N6385l75160L22069j87376j05012J40999
13881A310986L9495K22498m33132K05819O029P7006l24089Q0219j91164K59935
$$ y = [1897111, 1961127, 2238735, 2103868, 1861881, 2032377, 2294798, 1981361, 1756150, 1808649, 1872728, 1796932, 1648007, 2131982, 1889086, 1946324, 2190429, 1593730, 1638477, 1947710, 1827508, 1773884, 1953755, 1933446, 1545268, 1661685, 1626628, 2001426, 1816185, 1621881, 1837440, 1387457, 1536200, 1794498, 1546759, 1439000, 1288027, 1692191, 1349851, 1554867, 1784795, 1312311, 1531915, 1234510, 1470195, 1406308, 1363905, 1421542, 1826924, 1346233, 1900887, 1469203, 1581679, 1224651, 1423778, 1475318, 1835554, 1358082, 1461368, 1409033, 1319567, 1566538, 1272141, 1459081, 1515466, 1140306, 1462375, 1274999, 1169987, 1310986, 1350481, 1572979, 1139847, 1345666, 1351695, 1428701, 1104612, 1184831, 993667, 1253602]
13871A253602o2278J63711j06564k4731J65469l83944J88250k5645j04343L14577
13861A378104j99235Q6780J05570k61546r4685r951O0859j64676J98199M874j83947
13850I20346L75185m60242Q4118K25736l72796J92837j84952M33987m67851L45454
13840A091822p9618K58160k71648J93383n34370M20265j23813J79469l36894J69884
13830I66640O950J64690j16757K3603J6249k22779K9555K0250N5169O6024p1987
13819I37607K20031l30883J02020J88787j76947J39875j45061K30495m49768J41336
13809H57492N9062j01876l97622P11199m01583M28873E11668M50051l04k6009
13799I35406J97181n08100M7223K66231j67260n3000K63828P7484l72744n1253
$$ y = [1253602, 1191324, 1355035, 1248471, 1223740, 1389209, 1005265, 1193515, 1167870, 1063527, 1378104, 1178869, 1265649, 1371219, 1109673, 1014988, 1005037, 1065896, 901220, 1099419, 1104293, 920346, 1295531, 835289, 919407, 1145143, 772347, 965184, 780232, 1214219, 746368, 1091822, 1012204, 1270364, 998716, 1192099, 657729, 1077994, 954181, 1133650, 796756, 966640, 973590, 1138280, 1021523, 1045126, 1061375, 838596, 868151, 888401, 943570, 1009594, 937607, 1157638, 826755, 928775, 1117562, 940615, 1080490, 935429, 1165924, 716156, 857492, 916554, 814678, 417056, 1128255, 726672, 1155545, 511668, 961719, 961415, 935406, 1132587, 624487, 671710, 937941, 770681, 717681, 981509, 1058993, 686249, 634996]
13789F34996J72641J53290j08154j30868j27014R1529J20699j07405K26269k54424
13779F71559m5937J74524n2226J75526l90599K67267k32043J47533j49313K55667
13769H21958m2597Q0038m21255N25706K15411m11964l2547m4352q9186K07472
13759H08684j37863J62667l39318O9722R8507q6585N8644K78983j51638J279k87584
13748D75498j9719J86504L6904N7319K09413l00312k74477R6965J54511Q6912
13738G09518j04775J41255J84991l08519p3769j65773Q7651J9252B18532K79735
13728D98267J63586J68589j80776J93669k29062L68733m38151P743J30156k84639
13718C98115K72051L34946D26139N82415j94305l68604K00925B65177Q0921O71323
$$ y = [634996, 807637, 960927, 852773, 721905, 594891, 686420, 807119, 699714, 925983, 671559, 625622, 800146, 747920, 923446, 532847, 800114, 568071, 715604, 566291, 821958, 779361, 859399, 438144, 963850, 1179261, 767297, 734750, 690398, 601212, 808684, 670821, 833488, 494170, 563892, 662399, 575814, 634458, 913441, 761803, 763082, 475498, 455779, 642283, 679187, 736506, 945919, 645607, 371130, 468095, 622606, 709518, 604743, 745998, 930989, 622470, 548701, 382928, 470579, 489831, 218532, 498267, 661853, 830442, 649666, 843335, 614273, 983006, 544855, 552598, 682754, 398115, 670166, 1005112, 426139, 1008554, 814249, 445645, 646570, 265177, 346098, 1017421]
13708A017421l61593o4208J25654K0920k31713k02924J37151L00543J11450l83837
13698D68864J95918j02983J69693P9166l58192K86420j96993K4633J5862k90421
13688B91967K33541j6535p8732J36585M91221D77115P1873k6592j6181j41076
13678C65139R3490j01802J71558K8981Q5760j52564J96798R0070o1049j87795
13668E28586L2278j08250K40188j09047B35443q4898M88869j95530L43652C52268
13657F24015l11197O0692K2790J32390J67665J41256C70174M54063n7938k45522
13647E20777j16010P8891B28265K64859B07389L48256K4985B28854J72827K09168
13637F10849j47613l2814J05221j73384J69143k5480j65492j66300O7715j8638
$$ y = [1017421, 655828, 591620, 717274, 738194, 506481, 303557, 440708, 741251, 852701, 468864, 664782, 561799, 731492, 810658, 452466, 738886, 541893, 566526, 582388, 291967, 525508, 508973, 430241, 566826, 1058047, 477115, 548988, 522396, 506215, 365139, 458629, 356827, 528385, 557366, 643126, 490562, 687360, 777430, 716381, 528586, 560864, 452614, 692802, 583755, 235443, 150545, 639414, 443884, 787536, 352268, 624015, 312818, 373510, 396300, 528690, 696355, 837611, 370174, 824237, 766299, 520777, 404767, 483658, 228265, 493124, 207389, 555645, 580630, 228854, 401681, 610849, 463236, 430422, 535643, 362259, 531402, 505922, 340430, 174130, 241845, 223207]
13627B23207l1870M80627B78333M4474L28403k35296j64909L93299j93908k22855
13617B27541K21052J2055A91571L26164J45046k19984J26855p8033B30806J29794
13607C60600A28012K02226J82624A54977K06898j55714J16170K97428A40294L45491
13597D85785J04881j17139k6318k02711J18394j41935N5725o9514L6822K78373
13587E22363A68774J58144j27651J31033J02993j33333J31938m0162K31365m2338
13577E80763j22971J75866E3072M07155k12891K95794r7838K91776l25236j16131
13567B95701J03365J59757k9028j6911L048B12469J18459J21631q1210J15675
13557D87024p2313A18118K65447N21555m13333J8573K23060l64263p6959K37599
$$ y = [223207, 191337, 671964, 278333, 322807, 651210, 415914, 251005, 644304, 450396, 227541, 448593, 460648, 191571, 517735, 662781, 442797, 569652, 491619, 230806, 360600, 128012, 330238, 512862, 154977, 361875, 206161, 322331, 619759, 140294, 485785, 590666, 473527, 447209, 244498, 362892, 220957, 276682, 207168, 243990, 522363, 168774, 326918, 199267, 330300, 433293, 299960, 431898, 391736, 623101, 580763, 457792, 633658, 53072, 460227, 247336, 543130, 445292, 737068, 411832, 295701, 399066, 558823, 529795, 512884, 515932, 212469, 330928, 452559, 371349, 487024, 414711, 118118, 383565, 905120, 491787, 510360, 733420, 369157, 292198, 529797]
13547E29797F5823M46372I5269K14669J8619K18813j3773k31381L6125N1553l3441
13536C56453J55816j55998f982E72856k11609K09948k32093j28138o7152K85686
13526D29498G3078K34384a8043B44563J67210A66807H658e3934C18971D1059Q7813
13515A28872Q4646N2523k0943A09794J08254M9280a4700L993E16299A61709J85673
13504C47382j463l2096k7873Q5461j65485m0756K94727A83926L56733B45210o0333
13493A84877J71888k5007j43897L2590q3096L801K21075h9796D97889k03655b5386
13481B91580h454D49976j16992j31524q9329a0919D30263j1991e2627D19847L4206
13470D54053j45034p084j594R2053I4478J28842J95613L5316J72571B90222a66233
$$ y = [529797, 65823, 512195, 95269, 309938, 328557, 547370, 533597, 302216, 338341, 389894, 356453, 512269, 356271, -6982, 572856, 361247, 571195, 339102, 210964, 143812, 429498, 73078, 307462, -18043, 244563, 411773, 166807, 8658, -53934, 318971, 41059, 128872, 213518, 266041, 245098, 109794, 218048, 267328, -14700, -10707, 516299, 161709, 347382, 345919, 313823, 285950, 371411, 205926, 165170, 459897, 183926, 540659, 245210, 184877, 356765, 331758, 187861, 220451, 137355, 141156, 362231, -89796, 497889, 294234, -25386, 291580, -8454, 449976, 332984, 201460, 112131, -10919, 430263, 418272, -52627, 419847, 454053, 309019, 301935, 300341, 392394, 94478, 223320, 418933, 454249, 626820, 290222, -166233]
13458H2141N0209B7844Q8502L37959P1398f496C36370B7898J43857J76998N0068
13447C98821j38659A05180K82306J18730A10139K55409A65760K45977k3519D0848
13436B01037J19345E0237L21949c9697C78046p9277o9332E8890J14653J81531
13426C55074Q3096H6220J25131H8762J96825E5159L90292m5579P7651d4304D44254
13414A95950D7460L23161j53601O4471K1536j26748N2984Q7789b62244A01049
13403A01645J54485j844Q6065A32163a04521A08815K31981r7453K061k808c16367
13391A33255K4882l3810K83219A96326M65179B94020b9149C90588D3989N95080
13381F39069a24100B12404Q9391r7576c7648A37471J28427H8859L76267o4614
$$ y = [82141, 132350, 27844, 116346, 454305, 525703, -6496, 336370, 27898, 171755, 348753, 398821, 260162, 105180, 387486, 506216, 110139, 365548, 165760, 411737, 388218, 40848, 201037, 320382, 50237, 372186, -39697, 378046, 298769, 229437, 58890, 173543, 355074, 438170, 86220, 211351, 88762, 285587, 55159, 445451, 399872, 477523, -44304, 444254, 195950, 47460, 370621, 217020, 281491, 303027, 176279, 229263, 317052, -262244, 101049, 101645, 256130, 254286, 340351, 132163, -104521, 108815, 340796, 243343, 245404, 242596, -316367, 133255, 158137, 124327, 407546, 196326, 661505, 294020, -29149, 390588, 43989, 639069, -124100, 212404, 301795, 204219, -37648, 137471, 265898, 88859, 465126, 400512]
13371D00512B6500P0034j5795L06566A2075J96146Q2263L05413N9410k87922N2939
13360D20324A57772K15999j76201K62429r9704l1946g3600E43874r5581k06950
13350B41343M7869o6775K4154J46453A61407j3943L1068N13560l16622K70L04519
13339F80259B41709A2636O17352C07943J15139p0272R4916M1860j62417a27191
13328I0845M6996c8713C9908J15592M8982o2650B9920J0933K77818b5867B19717
13316A88679K44870A65667i3630B61121j04001a36923d5176C14767J73519J34926
13306F23212k44420C5694J9638L1291C9338i7413H068L28060k2825A05101C2624
13294B57369A01709L43118r0866p5358A3364L06594A28568J59759i3506P184B58688
$$ y = [400512, 26500, 96534, 80739, 387305, 12075, 208221, 290484, 595897, 655307, 367385, 420324, 157772, 373771, 197570, 459999, 360295, 328349, -73600, 543874, 448293, 241343, 289212, 222437, 246591, 393044, 161407, 147464, 178532, 692092, 375470, 375740, 680259, 241709, 12636, 629988, 307943, 423082, 352810, 447726, 489586, 327169, -127191, 90845, 137841, -38713, 39908, 155500, 204482, 141832, 29920, 40853, 318671, -25867, 219717, 188679, 433549, 165667, -93630, 261121, 157120, -136923, -45176, 314767, 488286, 623212, 378792, 35694, 55332, 86623, 39338, -97413, 8068, 336128, 313303, 105101, 32624, 257369, 101709, 444827, 353961, 278603, 13364, 319958, 128568, 288327, -93506, -86322, 258688]
13282E76409A60888c49581C87714A26341a50072A49572b46133B68134b34294e5375
13271a01445I0036L2941C02J49398N09164C06025j19582N6946K04943A10766k6756
13260H4010K69935J54377a1522C32054c4608C22863R1711A82110m140A8592Q4506
13249A03098L0625b33485I3268O7719J16150j04363m4992i1918H4431A8036N14964
13238E33000k26461J0576A5035J38312k2070n2768f4285A57091a1053C10391E0733
13226B91369A15380d4666A47861p2253a97104C12183a19607a8744I6929C8618
13215a05186B70866A1976b8978a107G3913N3085e5821B95201b03165F9787J64516
13204B34303J45831a29321f4321A74887J11471I1925K35228J99915G5315O9857
$$ y = [576409, 160888, -349581, 387714, 126341, -150072, 149572, -246133, 268134, -234294, -55375, -101445, 90036, 122977, 302, 149700, 658864, 306025, 186443, 243389, 448332, 110766, 84010, 353945, 508322, -11522, 332054, -34608, 322863, 414574, 182110, 177970, 18592, 103098, 133723, -233485, 93268, 160987, 277137, 172774, 127782, -91918, 84431, 18036, 533000, 306539, 317115, 15035, 153347, 131277, 78509, -64285, 157091, -11053, 310391, 50733, 291369, 115380, -44666, 147861, 75608, -197104, 312183, -119607, -18744, 96929, 38618, -105186, 270866, 11976, -28978, -1107, 73913, 126998, -55821, 295201, -203165, 69787, 234303, 380134, -129321, -64321, 174887, 286358, 91925, 327153, 527068, 75315, 145172]
13194A45172c5291B53482n9552b15974E1951h5319C21947K43570j75048j1701
13184C78768j88353K24418k07316c2860A41387B8111K21453J64654j54470a7541
13173D37012G3300P8977l8662j9824c1936B51233r5859a23793b9578A78164C9848
13161B5336f5494D16047D3592a21031B77988A35044K13909G8598L9434g7782q2126
13150a59908B34037h4162A37206r944l3230J68697b6612k41273B24J25614Q7284
13139B13122A02420J8462m5762L53060B02245r0798d01576A37559F5615c34314
13128E5339J49500J25683f0518k3238j6791h248A23007J28159h0736A09517a13586
13116A77613f5546C23a42816B57787J95579B16823o343F8260N2338g720B14581
$$ y = [145172, -35291, 253482, 193930, -215974, 51951, -85319, 321947, 565517, 390469, 378768, 190415, 414833, 207517, -32860, 141387, 28111, 249564, 414218, 259748, -17541, 437012, 73300, 152277, 113615, 93791, -31936, 251233, 155374, -123793, -29578, 178164, 39848, 25336, -65494, 416047, 43592, -121031, 277988, 135044, 348953, 78598, 118032, -77782, -159908, 234037, -84162, 137206, 127262, 94032, 262729, -26612, -267885, 224, 125838, 213122, 102420, 120882, 75120, 428180, 202245, 111447, -401576, 137559, 65615, -334314, 55339, 204839, 330522, -60518, -83756, -100547, -8248, 123007, 251166, -80736, 109517, -113586, 177613, -65546, 323, -142816, 257787, 453366, 216823, 210480, 68260, 120598, -7720, 214581]
13104B50079M359A14944b10251C22622a08241A85170o4208Q6515I9341J22108
13094B21449e9931p3438A08493d6326C21246b97966D78020a9270A96687e054k8573
13083c3627B05416M9087D3297a62085A58654j9445L00437a8958C51640i2207L1717
13072f0490J6543A95117o4557k5998j4618d50043F3372a8344H7067K9724N993
13061A22784J2756b71839A26094b94387D89520k02021A1979a18345A84797b33582
13050B87489a0906A5566a6543A87507K2841B3455K14746i873A93003e3655C70582
13038B91275P0628A40277A901a40181O889A3764K30757I568a21652B38375B3067
13026B22328G821b2695B17752a62227C00316A12898E4739J33401J9346k4296O8280
$$ y = [250079, 254438, 114944, -210251, 322622, -108241, 185170, 120962, 207477, 99341, 221449, -59931, -133369, 108493, -46326, 321246, -297966, 478020, -19270, 196687, -5054, -33627, 205416, 254503, 43297, -162085, 158654, 139209, 439646, -18958, 351640, -92207, -60490, -43947, 195117, 130560, 104562, 89944, -450043, 63372, -18344, 87067, 116791, 122784, 135540, -271839, 126094, -294387, 489520, 287499, 11979, -118345, 184797, -233582, 287489, -10906, 15566, -16543, 187507, 210348, 23455, 238201, -9873, 193003, -53655, 370582, 291275, 361903, 140277, 1901, -140181, -133292, 13764, 244521, 9568, -121652, 238375, 23067, 222328, 7821, -22695, 217752, -162227, 300316, 112898, 54739, 188140, 207486, 183190, 251470]
13015B51470a76400C3496K51840a03600A58779M033C6113K614J19078a32092B16419
13003A30190K0640a02603a2534C21643A39117J77212j06908a8444A5894b16030
12992g7303A41638K2382o2313n118A6296a32461B2295J13899a57024d1116A67726
12980A90829O5610d47260D6971Q4287E7530K5126a443j66166M8938H930a1043
12968F02h3912D3643J11625q629f5989E6989K9852j0424a24160A87662h177n9656
12956f7833A22893D8183J46262K45807a36519f93B29626l7605f0229A68132N4388
12945B22520D5585R2347J9083C2825f2896A26972D5002J3040a65486A85056H6153
12933B6724J1226M2950O6648D3232a80093I3299c3143C7095b63665D17667j79376
$$ y = [251470, -176400, 33496, 285336, -103600, 158779, 162812, 36113, 38727, 157805, -132092, 216419, 130190, 150830, -102603, -12534, 321643, 139117, 316329, 209421, -18444, 15894, -216030, -77303, 141638, 164020, 101707, 96589, 16296, -132461, 22295, 136194, -157024, -41116, 167726, 190829, 256439, -447260, 46971, 131258, 57530, 82656, -1443, -167609, -118671, 8930, -11043, 602, -83912, 43643, 155268, 146639, -65989, 56989, 86841, 76417, -124160, 187662, -8177, -67833, 122893, 48183, 194445, 440252, -136519, -693, 229626, 192021, -60229, 168132, 222520, 45585, 137932, 157015, 32825, -62896, 126972, 45002, 58042, -165486, 185056, 86153, 26724, 37950, 80900, 147548, 43232, -180093, 93299, -33143, 37095, -263665, 417667, 238291]
12922B38291a793A67993a13067C2425N1364D67J44941n236a89963Q6402B83291
12910A62593N8312D1270K13496H1363R5719a75141f2127A18111h5917A40178Q761
12899A48939n2965M5723P359b32001G0339d9102j14785B806h8350A3845P0393
12888H4238L8018J02645J07681i5030m8378o567A41740a28709l9334n5871A8407
12876F0419j0895K26836f3225J8236m1397l6122A9017K03286i3937E399i9636
12864B07568G9425L08517R0072B1898B73J9146J75412K1360J38708a02222l46
12853a02568j8846c9579j37291j75550a01798j24303A61771M201P2960M4013A18683
12841c5864j5769a6157j57403g7469k2419G5230Q7422f551E6745i7752C955m09
$$ y = [238291, -1793, 167993, -113067, 32425, 83789, 467, 145408, 140172, -189963, -103561, 283291, 162593, 220905, 41270, 254766, 81363, 177082, -175141, -62127, 118111, -85917, 140178, 148939, 95974, 141697, 149056, -232001, 70339, -49102, -163887, 2806, -88350, 13845, 84238, 122256, 224901, 332582, -95030, -143408, -149975, 141740, -128709, -168043, -223914, 18407, 60419, 49524, 276360, -63225, -44989, -86386, -122508, 19017, 222303, -93937, 5399, -99636, 207568, 79425, 387942, 478014, 21898, 273, 19419, 194831, 216191, 354899, -102222, -102568, -121414, -39579, -176870, -352420, -101798, -226101, 161771, 165972, 238932, 282945, 118683, -35864, -51633, -16157, -173560, -77469, -99888, 75230, 162652, -6551, 56745, -97752, 3955, 3546]
12829C546b54229K5084E5749k1142Q3242h7959j29189B0796O0518M106p158f4066
12816g3329k35839h2325C6126b32553h0329G1682b5271A94779a6250B31947a50823
12804c04529f7148h577B1957K13035b21324C7810J39308O1754d2780j1206B53597
12792G8963c014j22349D2738a4655M408B27842i2782M1131C16858b14151G272
12780d0539A24901L1387J76205a09396F2610b38125h5499B95703L4454j40703
12770A89454E141M29924F2738G890J16007e6146B45234j18789B2582n66c4926
12758g8448N78j24775R6818b4865B74426n3768H2444h5061l2315A19289c4731
12746b07135L7949C02982m8978J07199A07010J5207h2720A20827P0603n4682h6005
$$ y = [3546, -254229, -229145, 55749, 34607, 117849, -87959, -217148, 20796, 81314, 85420, 78262, -64066, -73329, -309168, -82325, 36126, -232553, -80329, 71682, -25271, 194779, -16250, 231947, -150823, -304529, -67148, -8577, 21957, 234992, -221324, 37810, 177118, 238872, -42780, -53986, 253597, 78963, -3014, -125363, 42738, -14655, -10247, 227842, -92782, -51651, 316858, -214151, 7272, -40539, 124901, 156288, 332493, -109396, 62610, -238125, -85499, 295703, 330157, 189454, 5141, 435065, 62738, 7890, 123897, -56146, 245234, 126445, 22582, 22016, -34926, -78448, -77870, -202645, -105827, -24865, 274426, 220658, 82444, -85061, -117376, 119289, -34731, -207135, -169186, 302982, 254004, 361203, 107010, 122217, -82720, 120827, 191430, 136748, -86005]
12734A25917a33947C48616a55878l5194A80923G6287J72463i2367k80092A0037
12723B0993K69074f623j61703A05961a53058A29940d2396B08810c9404B97132
12712e91r3484C50297A07513p386P3672N36284e8383H4755L49219a10985A00597
12700A27979b7352A45807b92727F7416C209L82094H2781B4591d2727j2184D4769
12688A11068r123l8390Q3223O1436C1694K3798c05324a1648H1990K38110A1423
12676c59098f2986B06268B2887L17348b7200P756B32968J9192j12262D8417j4566
12665C3851b42290j23092B19218K8217a85115F0974J23872b09137B18906m2704
12655A76202A5641a16479e2404B95871r9642N8678J48075B00436M0726A5711J19979
$$ y = [125917, -133947, 348616, -155878, -191072, 180923, 76287, 248750, -92367, -372459, 10037, 20993, 290067, -6623, -168326, 105961, -153058, 129940, -42396, 208810, -39404, 297132, -591, -94075, 350297, 107513, 100127, 173799, 710083, -58383, 84755, 433974, -110985, 100597, 127979, -27352, 145807, -292727, 67416, 3209, 385303, 82781, 24591, -42727, -54911, 44769, 111068, 101945, 63555, 146778, 208214, 31694, 55492, -305324, -11648, 81990, 320100, 11423, -359098, -62986, 206268, 22887, 340235, -27200, -19444, 232968, 252160, 139898, 48417, 33851, -242290, -365382, 219218, 247435, -185115, 60974, 184846, -209137, 218906, 176202, 15641, -116479, -52404, 295871, 196229, 254907, 402982, 200436, 241162, 15711, 135690]
12644A35690c5545C6983a31670e2406k0897j0431B58912A744a16143i451A18412
12632B24250b1712B76056A03859C3346J74753D1191a30625d8825O53E6032J33395
12621A89427M6357C9087a22149A52091k6819L1821L9017a10849C47261q0985a41818
12609a1471C75431j76910i9559k05406B1774e6596b3670G5002g5137C57944A04527
12597A82641f3009C12596o5531E0874i859p2932c2661H6277B6519b24557G7800
12585B48723c433E1638a88181P1637j23438b2127C29508a17033N5792B76265c56675
12573c6351B60016A23431b4395C09262B0249o611f1568b5966E5470O969q924L0016
12561H3531L6203k1404M20889B59250C2804i9370B9576J58855j8170a85799O8426
$$ y = [135690, -35545, 36983, -131670, -52406, -73303, -83734, 258912, 1744, -116143, -9451, 118412, 224250, -21712, 276056, 103859, 33346, 208099, 41191, -130625, -48825, -48172, 56032, 189427, 235784, 39087, -122149, 152091, 125272, 157093, 196110, -110849, 347261, 266276, -141818, -11471, 375431, 198521, -99559, -304965, 21774, -56596, -23670, 75002, -75137, 357944, 104527, 182641, -63009, 312596, 247065, 50874, -9859, -82791, -32661, 86277, 26519, -224557, 77800, 248723, -3433, 51638, -188181, -116544, -239982, -22127, 329508, -117033, -61241, 276265, -356675, -36351, 260016, 123431, -24395, 309262, 20249, 13638, -61568, -25966, 55470, 62439, 53515, 83531, 119734, 98330, 519219, 259250, 32804, -99370, 29576, 188431, 170261, -185799, -117373]
12550a17373m1495A89448f276D8122k3224H288J12463a5100j97056A99869b390
12538A52037B7113c26129e9420A0913L0903J69869n6247J03245a27187G8803J852
12527H0655a90642F3786a02952C2374J15325a57531B94411d24856B02901c2142
12516E6717J17935n442E7619g3587C1009M4754c04624A20851A0650J26581a80560
12504A2026e3742B97853K04498A79833g2198A17137M5891j8982f2607i795n062
12493a4857C4552f5174j3035G7164b13940B00789a84144A03770e2767B02624l3633
12482A68991a20402B41264i5608k26422N6178B47337J443h8869r0344n2270Q2765
12471a48718A89083E4311n200g6914j41802A37722h2542B39090B2518R8622b70631
$$ y = [-117373, -158868, 189448, -6276, 48122, 24898, 8288, 120751, -15100, -212156, 199869, -2390, 152037, 27113, -326129, -59420, 10913, 41816, 211685, 155438, 258683, -127187, 78803, 80655, -190642, 63786, -102952, 32374, 147699, -157531, 294411, -424856, 202901, -32142, 56717, 174652, 169210, 57619, -73587, 31009, 75763, -304624, 120851, 10650, 137231, -180560, 12026, -53742, 297853, 502351, 179833, -72198, 117137, 163028, 144046, -62607, -9795, -14857, 34552, -65174, -78209, 77164, -213940, 200789, -184144, 103770, -52767, 202624, 168991, -120402, 241264, -95608, -322030, -265852, 247337, 248780, -88869, -179213, -231483, -148718, 189083, 54311, 49111, -76914, -218716, 137722, -82542, 239090, 22518, 121140, -270631]
12459i073l80902J84817c6083A11772a39962K3394b3992F1906J64377b42466B64005
12447a58325F9645b35080A74844a47989A76185p0927M1638f0771m173A9634J51037
12436A70671F6146f2374A46893k8377a39650D9035K8589J3990M6358N2552b57373
12424C10101a76077A59969E5524J11434J7025q5170a88173H4043j4375e9694A48372
12412C1075K15473Q176C2199a00362I682L27994A38422o865c32997h0814j54787
12401b35601k80222g0671o3340p4411B57641d5084l21004b9180j70299B93307
12390H2705K0122a19765j70773A36997g846A94793b7088l9892j75311Q6127f8712
12378F7593O1260e707I848L15449d545r6058C23708A50578P0465J06688B0093
$$ y = [-9073, -389975, -205158, -36083, 111772, -139962, -116568, -23992, 61906, 226283, -242466, 264005, -158325, 69645, -235080, 174844, -147989, 176185, 105258, 146896, -60771, -64944, 19634, 170671, 66146, -62374, 146893, 118516, -139650, 49035, 77624, 91614, 137972, 190524, -257373, 310101, -176077, 159969, 55524, 166958, 183983, 98813, -188173, 84043, 69668, -59694, 148372, 31075, 246548, 254724, 32199, -100362, 9682, 337676, 138422, 131557, -332997, -80814, -235601, -515823, -70671, -134011, -208422, 257641, -45084, -366088, -29180, -199479, 293307, 82705, 102827, -119765, -290538, 136997, -7846, 194793, -27088, -66980, -242291, -156164, -68712, 67593, 128853, -5707, 9848, 325297, -4545, -100603, 323708, 150578, 221043, 327731, 20093]
12366e43109f2609A15107E5910c17114J53241O9462q6273g2625b5409k33667E18951
12354d85424K26131J02020a1877k68079H1073d8927L453A88011p2649G973a47982
12342C72630b484o9118L0821H3862O0342J8964P370b51849F0204o18J80051g7629
12329b37805a1257A19275J57610d2473B25725o5416e1321A65140b6891j39011
12319a65902j05762C92137j94912c57424C4529k494a28575n5880K3193J119B39602
12307C0211O1574A8259a18569D2363h7870l4821j49911a0543m3986A12947D7119
12295a09438J5017D8799P5176B6615K37307H9490l5693e1469A23587J4935K02124
12284C40646l7468a29325A56153h0120A7838c16273A42984l423K4214k7635k0953
$$ y = [-543109, -62609, 115107, 55910, -317114, -163873, -94411, -180684, -72625, -25409, -259076, 518951, -485424, -259293, -157273, -11877, -279956, 81073, -48927, -45474, 188011, 115362, 7973, -147982, 372630, -2484, -71602, -40781, 83862, 144204, 163168, 170538, -251849, 60204, 59586, 239637, -77629, -237805, -11257, 119275, 276885, -42473, 225725, 160309, -51321, 165140, -26891, -165902, -271664, 392137, 197225, -357424, 34529, 32035, -128575, -184455, -161262, -160143, 239602, 30211, 91785, 18259, -118569, 42363, -87870, -122691, -272602, -10543, -54529, 112947, 47119, -109438, -94421, 48799, 123975, 26615, 263922, 89490, 53797, -51469, 123587, 138522, 340646, 303178, -129325, 156153, -80120, 17838, -316273, 142984, 139561, 163775, 136140, 115187]
12273A15187K27078p009h3980A42711a54154K8331n261B86833L605a43868K2790
12262a21078c794G8438P7300f5878J8665j86813E5351a73966k964D5719O0135
12251A05854g3154B54549C598b1824j18272B454J64348I655R9939c51163C05284
12239B5078J74675M5605p3465C6132n643K42990e4647j5750D8416j3929N13542
12228E48029B4756a13630B87991H8076C7178K03968N0089O1248A17274J93010
12218C10284g9742j16312B14433B720h1473J9707j7529l2239B41339I0064J59724
12207B49788D5798J04081K01027J64384d7926B17233f7421B17130m9469L11692
12197D79353G2298K53447F452L9743L16031o9952Q2997n763n0745A16596j0900
$$ y = [115187, 342265, 335256, -83980, 142711, -154154, -125823, -131084, 286833, 290438, -143868, -121078, -3794, 78438, 155738, -65878, -47213, -234026, 55351, -173966, -176930, 45719, 105854, -73154, 254549, 3598, -21824, -140096, 2454, 166802, 9655, 109594, -351163, 305284, 25078, 199753, 245358, 171893, 36132, 30489, 273479, -54647, -70397, 48416, 34487, 548029, 24756, -113630, 287991, 88076, 37178, 241146, 291235, 352483, 117274, 310284, -79742, -196054, 214433, 2720, -81473, -61766, -79295, -111534, 241339, 90064, 249788, 45798, 149879, 350906, 515290, -47926, 217233, -67421, 217130, 167661, 479353, 72298, 325745, 6452, 46195, 362226, 292274, 375271, 369508, 318763, 116596, 105696]
12186A05696Q373N1696a1557A41563k8715B9145N7122l9424K200J54629m6189
12175A57483L7793q1912L28444D9288J6501Q2969K49453A18899Q0423A595a16822
12163A37022a07601G7090k3866j953L2499R6511k159h1221B9010J80293a98287
12151E7897F025g1692K2244B7346Q3526B3147a01487A44481O1158a82243A88347
12139F3618a21917L9976D3527P2629a47930A09852g2809j85098Q4428d9262j53993
12128b03255q3043A41939c31045B0675a07057q4965j19189B8875K54934A10926
12117B1250J07397i5676G439c1575A29719a25575a3844m0308F7083K15495n8124
12106B24454G0045j5791g4466A45310h9285A8852g4148a2465j28871B86623D4464
$$ y = [105696, 114069, 165765, -11557, 141563, 112848, 29145, 86267, 46843, 49043, 203672, 157483, 195276, 113364, 441808, 49288, 65789, 148758, 398211, 118899, 199322, 1595, -116822, 137022, -107601, 77090, 53224, 51271, 83770, 180281, 178122, -81221, 29010, 209303, -198287, 57897, 6025, -71692, -49448, 27346, 110872, 23147, -101487, 144481, 205639, -182243, 188347, 63618, -121917, -81941, 43527, 116156, -147930, 109852, -72809, -257907, -173479, -49262, -203255, -286298, 141939, -331045, 20675, -107057, -192022, -311211, 28875, 283809, 110926, 21250, 128647, -95676, 7439, -31575, 129719, -125575, -13844, -54152, 67083, 282578, 224454, 70045, 54254, -74466, 145310, -89285, 18852, -74148, -12465, -141336, 286623, 44464]
12094d5210A59320b40128g1932L1574G3543b06168l8262h6526j662F9835h9039
12082C5940c55697E4460d1030o0296C04101J8287M95627O06075F47534l05624
12072C41910A48311b45993A41330a33995C6616J55093e7188B53022A03104a30963
12061a90172I7389K78072A16492l8820b90095B7377J91196k6184a82782C12422
12050A92332g2116A88345a54823B08357e1492e473j52763c2216o5068B54030m7025
12039B07005a85239h5131n0793A43245D3503b56961Q332d1188j85619j02109e303
12027A88778H7043b38010a08207A00705m7367b6990E9597h9103n7955B5082c2743
12015C0127b46760g0752D0405a09415A36520F5712J8077l9264R864h3981k24753
$$ y = [-45210, 159320, -240128, -71932, -40358, 73543, -206168, -244430, -86526, -88188, 69835, -89039, 35940, -355697, 54460, -41030, -101326, 304101, 322388, 818015, 1424090, 647534, 341910, 148311, -245993, 141330, -133995, 36616, 191709, -57188, 253022, 103104, -130963, -190172, 97389, 375461, 116492, 77672, -290095, 27377, 218573, 192389, -182782, 312422, 192332, -72116, 188345, -154823, 208357, -51492, -5473, -158236, -32216, -97284, 254030, 207005, -185239, -85131, -135924, 143245, 43503, -256961, -248629, -41188, -226807, -328916, -5303, 188778, 87043, -238010, -108207, 100705, 53338, -26990, 59597, -89103, -147058, 25082, -32743, 30127, -246760, -70752, 40405, -109415, 136520, 65712, 83789, 44525, 54389, -83981, -308734]
12004c08734a5600E6941g9752a6269A2122a2613j51654P3001A73089g542q8407
11993i5949F8395b16813M6228C0401J86185C60b46516P8633d3302A15233l9614
11982G5619J62115i8680d5354F8944J2702B873b6130C21831m3884a4378E3046
11970g2029B94621a9002j20976A69706m1878j6673B6201h651A61519m8311B3623
11958c62280P567B4457n930b28713B3304h5632C89884B7201L9190b41802C3990
11946B92375H9782J4275c48528A69905a89932f7961j89197b3405A11666i3764
11935A14462b11726A54557a14320c9518o8990D1594J2867d2856k1493B62431j19200
11924A43231d75854e0397j49698h5331B26491a49463B19903p9362a12888A17835
$$ y = [-308734, -15600, 56941, -79752, -16269, 12122, -12613, -164267, -91266, 173089, -7542, -95949, 68395, -216813, -170585, 30401, 216586, 360, -246516, -167883, -43302, 115233, 75619, 237734, -98680, -45354, 68944, 81646, 2873, -26130, 321831, 277947, -14378, 53046, -72029, 294621, -19002, -139978, 169706, 127828, 111155, 26201, -8651, 161519, 113208, 23623, -362280, -354713, 24457, 18527, -228713, 23304, -85632, 389884, 27201, 66391, -241802, 33990, 292375, 89782, 104057, -348528, 169905, -189932, -67961, -257158, -23405, 111666, -93764, 114462, -211726, 154557, -114320, -39518, -108508, 41594, 54461, -42856, -64349, 262431, 143231, -475854, -50397, -200095, -85331, 226491, -149463, 219903, 140541, -112888, 117835]
11913b24612p7023e5129n9501A93733n9706c19360B23347b05473o6499H8373b3528
11901H7789b53418e9101o5526A63838a14566N5374j2966j39831N1325C7233b39892
11889h9780L1354F2081e7498j59493N3510j82043f9116A6125b06984i2201q3396
11878a75597P1807k36206o1086J91969J8514L1070A50635b98158C62735j18188
11868B44547b15746g2394E1149b56622R3734j06557F8268K73816A21611b24092
11857d75415J61925L8090H4957d5520p4484j00333A41637h5990A61276A4071K07369
11846B21440K1065a82277a6694j43161H3903c7436C6633M2927A163M0745K62405
11835C04313G3815b03574M7221C04530e285p0419j29817e9840j27510A27796b1089
$$ y = [-224612, -301635, -55129, -114630, 193733, 134027, -319360, 223347, -205473, -271972, 88373, -23528, 87789, -253418, -59101, -124627, 163838, -114566, -59192, -72158, -211989, -160664, 37233, -239892, -89780, -58426, 62081, -57498, -216991, -163481, -345524, -69116, 16125, -206984, -92201, -175597, -103790, -339996, -401082, -209113, -190599, -159529, 150635, -298158, 362735, 244547, -215746, -72394, 51149, -256622, -162888, -269445, 68268, 342084, 121611, -224092, -475415, -313490, -275400, 84957, -45520, -120004, -220337, 141637, -85990, 161276, 14071, 221440, 242505, -182277, -16694, -159855, 83903, -37436, 36633, 79560, 1163, 41908, 304313, 73815, -203574, -156353, 304530, -5285, -75704, -205521, -59840, -187350, 127796, -21089]
11823e2079l7736j18841B3140a36618A32156J49484A20902a23721n7752O3774
11813a17699C17647a02852C28598i6480K8892j10902d452A27937f3724D9832K00418
11802B50250c4391j8482q598B29230c15880G104Q8635h1607B49994a78443d8235
11790A48438f07070b44866C490g0243B73844d51395C7808h3051B18033c9656l05494
11779c45150I3540J3551b33423F6073A0263J23269a0528l6838b2957A27080b99046
11767H6285j2015A162J99812b52360j72246i6464c4100L847B1599M20651a05965
11755a04930k8778d1746j07538a5181p8026B29063c8314D7096K37943g184I3508
11743e3410B5656K24544a61044o6570b5433p9709m769n5659P6523a4172E19399
$$ y = [-52079, -89815, -208656, 23140, -136618, 132156, 281640, 120902, -123721, -181473, -117699, 317647, -102852, 328598, -96480, -67588, -178490, -4452, 127937, -63724, 49832, 250250, -34391, -52873, -61471, 229230, -315880, 7104, 95739, -81607, 249994, -178443, -48235, 148438, -607070, -244866, 3490, -70243, 273844, -451395, 37808, -83051, 218033, -39656, -345150, 93540, 107091, -233423, 66073, 10263, 133532, -10528, -47366, -22957, 127080, -299046, 86285, 74270, 1162, 200974, -252360, -424606, -96464, -34100, -30253, 21599, 442250, -105965, -104930, -133708, -41746, -149284, -15181, -93207, 229063, -38314, 47096, 285039, -7184, 93508, -53410, 25656, 250200, -161044, -227614, -25433, -105142, -109911, -165570, -89047, -14172, 519399]
11731H9045a91303A6033K3364a8883r6869b4036k822k34695q8009Q5915C30218
11719E68684I5756J71854n3387N1405d532A86806D744J85549b5517j24497G5212
11707a85853B36893a45452A59396a26745e0926B62547j30237n6490b60389B99931
11696a2720C17039b52373h4047E5873h2379j05987d328A81049B1800K1823O7260
11685A10883a85146C03065B9514K27954o5058b6867A53211b40722D4714a32095
11674e1317B86938a03643E1218e2883B6375c6632A05903J1088a21896b4180j36122
11663a60302A01887K25308c6306C43185e9480B23360k4862a28511A03052b17698
11652G6594e9653E1041i6512F1370d8919F299c1807o6504B23973a79536f9601
$$ y = [89045, -191303, 16033, 39397, -18883, -115752, -24036, -26858, -261553, -349562, -263647, 330218, 568684, 95756, 267610, 214223, 265628, -4532, 186806, 4744, 190293, -25517, -150014, 75212, -185853, 236893, -145452, 159396, -126745, -50926, 262547, 132310, 75820, -260389, 299931, -12720, 317039, -252373, -84047, 55873, -82379, -188366, -4328, 181049, 21800, 43623, 110883, -185146, 303065, 29514, 257468, 192410, -26867, 153211, -240722, 44714, -132095, -51317, 286938, -103643, 51218, -52883, 26375, -36632, 105903, 116991, -121896, -24180, -160302, 101887, 327195, -36306, 343185, -59480, 223360, 198498, -128511, 103052, -217698, 76594, -59653, 51041, -96512, 61370, -48919, 6299, -31807, -98311, 223973, -179536, -69601]
11640A94689H2566f412p752A16265a841D4422i1575G8199j7506O0712m7038j1948
11628F2419c11998H3097c63380E395O22465a8922G676e2962E5188L0160b82206
11616A62754C1632b87955e2446B75755j23806O8626n0339o762c27926r4755d3203
11604g507A90266a06019B24978b109k12543D3485a16710e3347F0492J99758R5554
11593C55804j29307G9797a33886E3992K29593Q4013A59995j3294g1602b4153C1078
11581E39666C7835a66131D6516a57576q736M8719B70383a34167B15882J45798
11571C61680a70273D64420A10113J50324C5321K31478h8069C04136b98906C32019
11560A38955N0055d6679m8741d729D84407D5717J9790d30139A23646D8393N0075
$$ y = [194689, 82566, -6412, -14164, 116265, -1841, 44422, -91575, 78199, 60693, 121405, 74367, 62419, -311998, 83097, -363380, 5395, 627860, -18922, 7676, -52962, 55188, 85348, -282206, 162754, 31632, -287955, -52446, 275755, 151949, 220575, 170236, 163474, -327926, -422681, -43203, -7507, 190266, -106019, 224978, -2109, -214652, 43485, -116710, -53347, 60492, 260250, 355804, 226497, 79797, -133886, 53992, 283585, 367598, 159995, 146701, -71602, -24153, 31078, 539666, 37835, -166131, 46516, -157576, -166312, -117593, 270383, -134167, 215882, 361680, -170273, 464420, 110113, 260437, 35321, 266799, -88069, 304136, -298906, 332019, 138955, 189010, -46679, -95420, -4729, 484407, 45717, 65507, -430139, 123646, 48393, 98468]
11549I8468e0977B03394e3281B27327O7623A45240o8607a32008C68561j20476
11539B48085I3718P4691a12956A73140l2730L6820A4367K12559N4972G6513c8221
11527B27958A05787a93249h0538c386C34340b74287k1962f6196A38485a43824
11516A51263B1302J51499a87258D03589A80188b23348A05746a39185B76536A06157
11505C29637b924k66509E5446L32765d0607C01589A8846L15526e1007a3522B66206
11493a37104o6057A94671N8767J20726l7009j56486j3453M4441J36720j37886
11483B10491a0381E56805k23500I4116l9150A6904M44368g3904B06116J1641G3634
11471A34285P6812B8155K41753Q4590a16413H9723K79993C7416J37700a82019
$$ y = [98468, -50977, 203394, -53281, 227327, 294950, 145240, 76633, -132008, 368561, 248085, 93718, 168409, -112956, 173140, 140410, 177230, 14367, 226926, 281898, 76513, -38221, 227958, 105787, -193249, -80538, -3386, 334340, -274287, -296249, -66196, 138485, -143824, 151263, 21302, 172801, -187258, 403589, 180188, -223348, 105746, -139185, 276536, 106157, 329637, -2924, -269433, 55446, 388211, -40607, 301589, 18846, 334372, -51007, -13522, 266206, -137104, -203161, 194671, 253438, 374164, 337155, 180669, 167216, 211657, 348377, 210491, -10381, 556805, 333305, 94116, 54966, 16904, 461272, -73904, 206116, 217757, 73634, 134285, 211097, 28155, 269908, 354498, -116413, 89723, 369716, 37416, 175116, -182019]
11460A34387b11321A68666J75285F6643J3187Q5717A0420O1683K98250A55391
11449E10737A92935K56110D8457b17317j08432J24122h0758C50054a33898A31599
11438g8180b704A28867a53968A62465d148C0150c67448A88666F7517K9876a76132
11426A85516a38671C10195f7903n9522H9231a4209l41271D0339c98741e4657B40596
11414A23529c4411H8401e1448p5682A6797K39499J64653A09701i8481C5195a02233
11402a20289A46905n3065B0571a5605E2020i9919E34147a70811I9435l7189a30493
11390c7054C37763A30501a03682d0919J869q0081l02279G6075J22471B5762K26029
11379B51791d7329B7072C827L398c27950A16863c41422A47634a16107l08501A9588
$$ y = [134387, -211321, 168666, 343951, 66643, 79830, 165547, 10420, 72103, 370353, 155391, 510737, 192935, 449045, 48457, -217317, -325749, -201627, -80758, 350054, -133898, 131599, -78180, -2704, 128867, -153968, 162465, -4148, 30150, -367448, 188666, 67517, 97393, -176132, 185516, -138671, 310195, -67903, -127425, 89231, -14209, -355480, 40339, -398741, -54657, 240596, 123529, -34411, 88401, -51448, -127130, 16797, 256296, 420949, 109701, -98481, 35195, -102233, -120289, 146905, 93840, 20571, -15605, 52020, -99919, 534147, -170811, 99435, 62246, -130493, -37054, 337763, 130501, -103682, -40919, -39050, -119131, -421410, 76075, 198546, 25762, 251791, -47329, 27072, 3827, 7225, -327950, 116863, -341422, 147634, -116107, -424608, 19588]
11367d78697A15927R405d1330j64234a0967A65331P8989o1251J77899a73473B82933
11355c9150n1171A25848F2244b15432N4136A45529a32449M3452r5551G3036b42205
11343B13361D3655O6000h1423r8916O5514k74897A48834A3179J65896G4913J32156
11332B07069a82266a3039H0331i2360n8601C018a21265A090f9502C98458F0777
11320H3855J35717q1467A9447f6454A90245b73941C8862b18654C45838b1648B5170
11308A52572b82827h2150I8693a19433c2807A56980D1324d41747A84847a02732
11297d2943A94438b12899e2205l302E4122J85859l6821a91867k18970B63458c32597
11285E6489b95387Q3623R4502k01517A05339R5473E5809L0454R3006a5723D3293
$$ y = [-478697, 115927, 125332, -41330, -205564, -10967, 165331, 244320, 183069, 360968, -173473, 282933, -39150, -90321, 125848, 62244, -215432, -161296, 145529, -132449, -88997, -184548, 73036, -242205, 213361, 43655, 109655, -81423, -180339, -114825, -389722, 148834, 13179, 179075, 74913, 207069, -182266, -13039, 80331, -92360, -150961, 3018, -121265, 1090, -69502, 398458, 60777, 83855, 219572, 138105, 19447, -66454, 190245, -273941, 38862, -218654, 345838, -21648, 25170, 152572, -282827, -82150, 98693, -119433, -32807, 156980, 41324, -441747, 184847, -102732, -42943, 194438, -212899, -52205, -55507, 54122, 239981, 203160, -191867, -410837, 263458, -332597, 56489, -295387, -211764, -117262, -318779, 105339, 200812, 55809, 86263, 179269, -15723, 43293]
11273A83836a17488j50626a11184C78307E4917a64966g3523j91289R5375F5005
11262A3238K7170J75903b57759D4721J41758K579j7787o7952a45407b1398D9330
11250b01378B32441a75988P4927M759L4498B40752d81230J81275a15067e5479
11239B8559J19072C0725b51273B24502c66835l8426I6474f9404B12064d81271
11228b30120A73878B0249o596b77607a6290m8480k33934A36169j9902j2960b9299
11216a80633c3491o9381L8366B20303f38533K34019i6647n2200i404B9980A2785
11204d8520C67034d5801j0247l2901K8583B76910C2226A517K07777c32946A85617
11192d79679I5304J28672A1943a32274A64834J13923j38165b84345c6317o9632
$$ y = [183836, -117488, -268114, -111184, 378307, 54917, -164966, -73523, -264812, -169437, 65005, 13238, 40408, 216311, -257759, 44721, 186479, 189058, 171271, 103319, -145407, -21398, 49330, -201378, 232441, -175988, -101061, -96302, -61804, 240752, -481230, -299955, -115067, -55479, 28559, 147631, 30725, -251273, 224502, -366835, -405261, 96474, -69404, 212064, -481271, -230120, 173878, 20249, 13653, -277607, -16290, -64770, -298704, 136169, 116267, 103307, -29299, -180633, -33491, -102872, -64506, 220303, -638533, -404514, -96647, -148847, -9404, 29980, 12785, -48520, 367034, -45801, -56048, -88949, -60366, 276910, 32226, 1517, 209294, -332946, 185617, -479679, 95304, 223976, 11943, -132274, 164834, 278757, 140592, -284345, -36317, -105949]
11182a05949A14672a15144j67256a32001a6345I9767R1870G0686R146a39944J2061
11171a27883d332o9617A4293b02416A69298h6438k9099N822R772B05873n2683
11160A53190a67208B18868L7068f1526E8834N9979a78108A91586b03446r8187
11150c01633B4436c95694a34415j88862J26343d4230k0413L311A7587a03671k7553
11139a31224N8373k56513A52208C0733K64557a01679j12820A53078R2376J16742
11129C62196r7444b20395N9093A37380P282F5994K17572q218A17677i615k14134
11118b23749h2348A09161i2881B37084b13684A24361c84743B80418j19071C3051
11107B1221a43660G6619M76R3303a44417I7697J39135K4761g4725B83556K7364
$$ y = [-105949, 114672, -115144, -282400, -132001, -16345, 99767, 191637, 70686, 79832, -139944, -127883, -4332, -73949, 14293, -202416, 169298, -86438, -115537, -109715, -99943, 205873, 153190, -167208, 218868, 255936, -61526, 58834, 118813, -178108, 191586, -203446, -301633, 24436, -395694, -134415, -323277, -196934, -44230, -64643, -61332, 17587, -103671, -131224, -72851, -329364, 152208, 30733, 295290, -101679, -214499, 153078, 245454, 362196, 264752, -220395, -161302, 137380, 144662, 65994, 283566, 275348, 117677, -9615, -223749, -82348, 109161, -92881, 237084, -213684, 124361, -384743, 280418, 161347, 33051, 21221, -143660, 76619, 77095, 170398, -144417, 97697, 236832, 261593, -74725, 283556, 310920]
11096C10920b81015A03712a51778B07038J1586o0150Q2471J58281A47574B4284
11085B19435a91748B61843D7535K26579J03897A02279R1043K71528A26941M37198
11075E64139k15985n8176j23094K16038k3572L05356A81324e8922F17971k39642
11065C78329L17124l22116j27351K54525r275k12951M87118B82056K38100J54302
11055F74458J9687p2445k96221N11916j19242j59205M02835k36050m138q263Q5807
11044G99139C59741K61937l4661L33775M7613k24025L3408j39239J60686k7216
11034G72019l06769L59256j37264p4487J63468j79267L60221j06087k25498J57022
11024G82614C74594K78665M4195K9601l31392J72013M4185p3520K05205k79894
$$ y = [310920, -281015, 103712, -151778, 207038, 218624, 158474, 240945, 399226, 147574, 24284, 219435, -191748, 261843, 47535, 274114, 378011, 102279, 193322, 464850, 126941, 564139, 348154, 289978, 166884, 382922, 359350, 664706, 181324, -58922, 617971, 378329, 695453, 373337, 245986, 500511, 491236, 278285, 765403, 282056, 520156, 674458, 694145, 621700, 325479, 837395, 718153, 558948, 961783, 725733, 721595, 713332, 799139, 359741, 621678, 587017, 920792, 968405, 744380, 777788, 638549, 799235, 772019, 465250, 824506, 687242, 612755, 776223, 596956, 957177, 851090, 625592, 782614, 374594, 653259, 697454, 727055, 395663, 567676, 611861, 538341, 743546, 463652]
11014D63652O8564j55254q4434L79535L2935o189j94794j40292Q5226J66168J46503
11003G61620O2266j48315J45742j11588j20590K23293j01234j55947L01849l48383
10993E08713J08298K97085p5931j36382j11271L22495j24989K03809k89455K24368
10983I26740p7165J91997j15221P2075L78130k97564L82723N01891Q7617J66326
10973B217549K3432L93192J26685j994K17042l63591l59573j85967l65980m9824
10963A650971O8860m0836n7696q6411L04267k76022J72420j39296J02435p8241
10953A620451k31580l81068M4054n8316j60866J8302D21966P1307l1045A72798
10942D66632k31620M7846j2189r6051J67972E4260K0757a34348B08467R8764N6187
$$ y = [463652, 532216, 376962, 292528, 672063, 704998, 698809, 504015, 363723, 448949, 615117, 761620, 823886, 675571, 821313, 709725, 589135, 812428, 711194, 555247, 857096, 508713, 617011, 914096, 838165, 701783, 590512, 913007, 788018, 991827, 702372, 926740, 849575, 1041572, 926351, 998426, 1376556, 1078992, 1461715, 1963606, 2051223, 2217549, 2240981, 2634173, 2760858, 2758864, 2975906, 2612315, 2252742, 2066775, 1700795, 1650971, 1719831, 1678995, 1621299, 1534888, 1839155, 1563133, 1735553, 1596257, 1698692, 1620451, 1388871, 1007803, 1051857, 993541, 832675, 850977, 421966, 493273, 462228, 172798, 466632, 235012, 282858, 270669, 174618, 342590, 54260, 75017, -134348, 208467, 307231, 363418]
10931C63418j48641J87703j61065E3904a32080E0745J13578a55046D33188e2003
10920a10793C02329a88741A27874d5645I1961J54929b60067A13519K8657b12643
10909c08371b0566C17693o0844j18383Q7138a37815e0602B76120I950i4821J6937
10898g7884k90233I5376M2546J04406M3234f4775G4376c25826I9063c29306M8054
10887b81252B726f8444A82483c52148B0596Q3738a71738j35109i0804D28584d0038
10875b54986H1322O3570a0155r3983d2184J9813j52487G308b03995A01520h9178
10863f6912q9966B3755a48626B2170N2403b64606A38665l1504K7892a4652b670
10851C05495a94367l3361Q7325j8585b8810A48355J18694b53782i9836n8038f1017
$$ y = [363418, 214777, 402480, 241415, 53904, -132080, 50745, 164323, -155046, 433188, -52003, -110793, 302329, -188741, 127874, -45645, 91961, 246890, -260067, 113519, 142176, -212643, -308371, -20566, 317693, 256849, 138466, 225604, -137815, -50602, 276120, 9950, -94821, -77884, -368117, 95376, 137922, 242328, 285562, -64775, 74376, -325826, 99063, -329306, -281252, 2726, -68444, 182483, -352148, 20596, 104334, -171738, -306847, -90804, 428584, -40038, -254986, 81322, 144892, -10155, -104138, -42184, -22371, -174858, 7308, -203995, 101520, -89178, -66912, -156878, 23755, -148626, 22170, 74573, -264606, 138665, 107161, 135053, -14652, -2670, 305495, -194367, -227728, -140403, -158988, -28810, 148355, 267049, -253782, -99836, -157874, -61017]
10839a40931j3419A85032c28112h6284j36901A63760a95723A17449K021J52433
10829B71903b33525N3422H7254g8047o3875c2812A03063B5016K53672F6058I438
10817A13956b67988H4971j5663L0117m4235f9966l45436Q2078F1165a17160a6347
10805A04603b19447e3733B0177b29805A06310b3408H9567K9278b42617J9743J09828
10794a13046a4110n3493G6071J72281A9597J33947D1622Q2049n2467a20987B03940
10782i0874B12686N2174C9464a06658C60625b4363j94822F9854c8066k20986A54766
10770a35196e974D0904i4801k8748G2420L7010c8561I6564b6612B56299B8147
10758b40977a09254j82834Q1171A32329O6339a57466A24949b905l7126r797B26815
$$ y = [-140931, -154350, 185032, -328112, -86284, -223185, 163760, -195723, 117449, 119470, 271903, -233525, -180103, 87254, -78047, -141922, -32812, 103063, 25016, 278688, 66058, 9438, 113956, -267988, 84971, 69308, 99425, 55190, -69966, -415402, -333324, 61165, -117160, -16347, 104603, -219447, -53733, 20177, -229805, 106310, -23408, 89567, 118845, -242617, -222874, -113046, -14110, -67603, 76071, 248352, 19597, 153544, 41622, 123671, 71204, -120987, 203940, -90874, 212686, 264860, 39464, -106658, 360625, -24363, -219185, 69854, -38066, -259052, 154766, -135196, -5974, 40904, -94801, -123549, 72420, 109430, -38561, 96564, -26612, 256299, 28147, -240977, -109254, -292088, -210917, 132329, 198668, -157466, 124949, -2905, -40031, -49828, 226815]
10746a93230J0566h0589k30583Q7298m236D6994a01948c7401A49286a64718c2241
10734a8058A88217D4445j0664Q8960a35013G8912j549b50210Q2959f1833B33552
10722b64973j71491a76204k37502J45879H1634C9799J21425b14507Q5415A77008
10711g8510B96590a91943A52828b24218Q1692j8295m4238l6714k08896J27514
10701c23155A04510i0685B9580a41692k00375a47784J2495A57406e2806j32957
10691a85763K2365H475g4510G1508D804P609J9559h5639A30821a86834K4334j98083
10679c60583h0907b4833E076b73978a3619o6520n29182I0648J15602G9815a2037
10667b9424I7032a00322A56746c2972A22034a23335A06937c56939h1434H8211
$$ y = [-193230, -182664, -80589, -311172, -223874, -228110, 46994, -101948, -37401, 149286, -164718, -32241, -18058, 188217, 44445, 33781, 122741, -135013, 78912, 77363, -250210, -167251, -61833, 233552, -264973, -436464, -176204, -413706, -267827, 81634, 39799, 161224, -214507, -129092, 177008, -78510, 296590, -191943, 152828, -224218, -142526, -160821, -205059, -241773, -450669, -323155, 104510, -90685, 29580, -141692, -342067, -147784, -135289, 157406, -52806, -185763, -163398, 8475, -74510, 71508, 4804, 12413, 31972, -85639, 130821, -186834, -162500, -360583, -80907, -24833, 5076, -273978, -13619, -80139, -609321, 90648, 206250, 79815, -12037, -29424, 97032, -100322, 156746, -32972, 122034, -123335, 106937, -356939, -81434, 88211]
10656f6953l9794j2752J0920A02005b34901a0038j58348q0499A34944A6155Q6529
10645A02684i1612j47201B96302j24217M1407c6635j8614o175k07618j08265D2699
10633D5161h2781o9716j8387C2761N4929b05616g8741B22228a63926A52154a39890
10621F3783A3235i2296D4834M2851P400m0602e0402C475J2850e9582j67502B05032
10608B8471J39691h4638A29054E9614a23269j30217J15674p2353Q2723m9517A4332
10596A38271b62158L2233g3822l5802d9812j38859r8497n2814B15605J63450a71179
10584B32774a9146A05981c0318G6896a96692K8929A6662a09366j86556g9773A00554
10572a87492c3861E6248b39554H5325k227J7793a12624k4962a3929j48864g6423
$$ y = [-66953, -106747, -119499, -108579, 102005, -234901, -10038, -168386, -248885, 134944, 16155, 102684, -91612, -238813, 296302, 172085, 213492, -36635, -55249, -61424, -269042, -377307, 42699, 45161, -82781, -152497, -170884, 32761, 87690, -205616, -78741, 222228, -163926, 152154, -139890, 63783, 13235, -92296, 44834, 87685, 95085, 54483, -50402, 3475, 16325, -59582, -227084, 205032, 28471, 168162, -84638, 129054, 59614, -123269, -253486, -137812, -210165, -127442, -176959, 14332, 138271, -262158, -229925, -73822, -109624, -49812, -188671, -287168, -339982, 215605, 379055, -171179, 232774, -19146, 105981, -30318, 76896, -196692, -167763, 16662, -109366, -295922, -79773, 100554, -187492, -33861, 56248, -239554, 85325, 83098, 100891, -112624, -137586, -13929, -162793, -76423]
10560B16144b11837A25899c8808A11113i128A36930c63679a45579A91879E2409
10549I881N8185c02538J26396j56208A26421a1189A511R6470i6747j0672A12817
10537B13660D2327a15360H4521M0641c8654j21468I2837J17461b31786F8405l14
10526F8091h3780A29806a2321n0058C50845D5448a4377j64749a6476l40298a70341
10514i1990A1792a23390E6545a54356g1164A36814c27022K450B93043A15043a26326
10502c4230j79444A40771Q2430a04355b9516k1586B18273c01014N6753A68542
10491d97467a32613d0349J6537j59592A57314Q7316b631A59677n165J22309L52078
10480F28899j19236k10085q7950K7746b98785M8068A81641C1978K19060B173h553
$$ y = [216144, -211837, 125899, -38808, 111113, -9128, 136930, -363679, -145579, 191879, 52409, 9881, 68066, -302538, -176142, -332350, 126421, -11189, 1511, 97981, -96747, -107419, 112817, 213660, 42327, -115360, 84521, 125162, -38654, -160122, 92837, 210298, -231786, 68405, 68091, -83780, 129806, -12321, -62379, 350845, 45448, -14377, -179126, -16476, -356774, -170341, -91990, 11792, -123390, 56545, -154356, -71164, 136814, -327022, -324572, 293043, 115043, -126326, -34230, -213674, 140771, 223201, -104355, -29516, -51102, 218273, -301014, -244261, 168542, -497467, -132613, -40349, -23812, -183404, 157314, 244630, -2631, 159677, 154512, 276821, 628899, 509663, 299578, 211628, 239374, -298785, -250717, 181641, 31978, 251038, 2173, -8553]
10468I2443a29168q5844B11693N9638a6808A35120l710J87537c07746h8747B6778
10456a58172d9808n616j78315b9988A67527b8922r5956B45063f6477m3664A83606
10444b7215C5756b41763B09546q0656b7186A99638p1335c6559A86959e3373k94792
10433c48165h0730A0328g6964D7284c12794B63600m6963J2129j05456j8468b15879
10421c93706R0444A41717F7142A8565J25220R2733d0302A38723b70734L9253f9367
10409B3566K5756J35555K4202J74102a77752N0252o4039c3857j6611j01468C4222
10397F2088Q5436c5201j6368A1379a89132A17200b2356e267C5838J69312J04383
10386C09533B6308J5438a36277A04121e7206q9042B8323J61895J01893A43844
$$ y = [92443, -129168, -215012, 211693, 271331, -16808, 135120, 131410, 318947, -307746, -88747, 26778, -158172, -49808, -55424, -233739, -29988, 167527, -28922, -124878, 245063, -66477, -110141, 183606, -27215, 35756, -241763, 209546, 128890, -27186, 199638, 128303, -36559, 186959, -53373, -348165, -80730, 10328, -76964, 47284, -312794, 263600, 216637, 228766, 123310, 104842, -215879, -393706, -303262, 141717, 67142, 18565, 143785, 236518, -40302, 138723, -270734, -231481, -69367, 23566, 49322, 184877, 209079, 383181, -177752, -127500, -191539, -33857, -50468, -151936, 34222, 62088, 147524, -35201, -51569, 11379, -189132, 117200, -22356, -5267, 35838, 205150, 309533, 26308, 41746, -136277, 104121, -57206, -146248, 28323, 190218, 292111, 143844]
10375B56129K56q4367q578F5241C1111L2799J70895B1663N49072J12391j20805
10364E62321j05555l4294O4082B27972J55868j70959a4523m2134D8407K39852
10354B88259j04938L53122B59879O2195L38239C25401L99185A62119J56342j7694
10344C00767K82789A88056M7076K8937L62070H3375l0848I538Q1890b188p9972
10333h2160A17849K57734c3374O609B68253G6875a25410f0772b3736A88660A0996
10321D45674A82688O1285P066L59272A31337o3102K22902q8442l5772K12440B5563
10309i1010A24452e6313B92412H8460a17800m3118P5463C1270a76920G7099l941
10298G3158B3939L0408b05858j25533B54430H6301a26639l9123m9977g3918m9740
$$ y = [256129, 256385, 172018, 163440, 65241, 31111, 63910, 234805, 21663, 570735, 683126, 562321, 456766, 422472, 486554, 227972, 383840, 212881, -14523, -56657, 48407, 288259, 183321, 536443, 259879, 322074, 660313, 325401, 724586, 162119, 318461, 300767, 583556, 188056, 235132, 264069, 626139, 83375, 52527, 9538, 91428, -2188, -82160, 117849, 375583, -33374, -26765, 268253, 76875, -125410, -60772, -23736, 188660, 10996, 445674, 182688, 243973, 251039, 610311, 131337, 68235, 291137, 202695, 166923, 379363, 25563, -91010, 124452, -56313, 292412, 88460, -117800, -160918, -85455, 31270, -176920, 77099, 73158, 23939, 54347, -205858, -331391, 254430, 86301, -126639, -165762, -215739, -73918, -123658]
10287a23658j264K406B15065g8046F3417b33475g7478J7784j2382o5387m1390
10276a78853j50282A33326n3208k4549i3826K1322r9831e2120m6633H8597C3256
10264B79527E4198L10223A79210R2981K22676j39674H7610m1470J64518J46006
10254C56664q9529j6896J20963E044L8173K60024A20549c49407J33833A08706
10243I5993J88664a35518L531n7678E1827c55228n7224C03330m5262A01421a12499
10231D6620N0035b1528j22811E6651a87329i442A18603b36753A63858a54782L1660
10220a23122L9132K8071A18031b61347a15722a1807m7301o23661b58345a18772
10209C5453b45615a0490G8442d36074A25029a1285j5941c907A82902a75115k4935
$$ y = [-123658, -124922, -122516, 215065, -78046, 63417, -233475, -77478, -59694, -72076, -137463, -178853, -329135, 133326, 80118, 55569, -93826, -72504, -172335, -52120, -98753, 88597, 33256, 279527, 54198, 364421, 179210, 272191, 494867, 355193, 87610, 46140, 210658, 356664, 267135, 250239, 371202, 5044, 43217, 303241, 120549, -349407, -215574, 108706, 95993, 284657, -135518, -131987, -189665, 51827, -355228, -412452, 303330, 258068, 101421, -112499, 46620, 96655, -21528, -144339, 56651, -187329, -9442, 118603, -236753, 163858, -154782, -123122, -83990, -55919, 118031, -261347, -115722, -11807, -59108, -682769, -258345, -118772, 35453, -245615, -10490, 78442, -436074, 125029, -11285, -27226, -3907, 182902, -175115, -200050]
10198b00050J1641P0469c3793k4559j29309B85963I7210b23982Q9309B44144r1975
10187A52169c8552j17888j57827a32478N3951j20485A48014b87274g8720a1796
10176b58022m3807B3201a96299A29270b29385h5370l6016B84592c01506A76124
10165H9706L9588a61404k37705B07292c42927A47774b05218K4623c2899k6464
10155e9363j62015Q0490c8622j14803j67014a38403j27059j76292c9570j57224
10145a96794A80Q7465c581o0426A518P8257d10987J71606A45647p249a02609k8651
10133a31260c3517r0400k12900i792A68107b94008q140A7542b28816A06831a33389
10121I5059a7823k11852d3488k11953Q9754g8674l77959a18476M9248E8123f3591
$$ y = [-200050, -188409, -117940, -33793, -58352, -187661, 285963, 97210, -223982, -134673, 244144, 152169, -38552, -156440, -314267, -132478, -78527, -199012, 148014, -287274, -78720, -11796, -258022, -301829, 23201, -196299, 129270, -229385, -85370, -121386, 284592, -301506, 176124, 89706, 129294, -161404, -399109, 207292, -342927, 147774, -205218, -180595, -32899, -59363, -221378, -140888, -38622, -153425, -320439, -138403, -265462, -441754, -39570, -196794, 180, 87645, -3581, -64007, 1518, 79775, -410987, -239381, 145647, 138398, -102609, -131260, -33517, -123917, -336817, -9792, 168107, -294008, -302148, 17542, -228816, 106831, -133389, 95059, -17823, -229675, -43488, -255441, -165687, -78674, -456633, -118476, -69228, 58123, -63591]
10109h9009I8361f168n7476k10556c1407j42507j52481i5869B431J62290o7630
10098I7091d3036j00141B21206A03356Q7623J3599J80419a94256f0033l39748
10088c99781E9951J91002a09675j65827A63797K7036a28207b9559j63217A66769
10077C33271a06944I3880a18135C05630C2086b9370f147A54241o4214b00157d6060
10065C3575d2067P107F6958a69497P6583m334B71624d738k56105B43310i7617
10053i4398E213b40364o9032D7723a59633A48236E749a95488N277j70976C2873
10041C30570a66446p9182D699b53465e6675A46058J93988a35990m2006q2545d3717
10029c52653a34537d3537l21870G1160f4097B12509e8615k3308K3119k367H2359
$$ y = [-89009, 98361, -6168, -63644, -274200, -31407, -173914, -326395, -95869, 2431, 164721, 97091, -43036, -143177, 221206, 103356, 190979, 204578, 384997, -194256, -60033, -399781, 59951, 250953, -109675, -275502, 163797, 190833, -128207, -29559, -192776, 166769, 333271, -106944, 93880, -118135, 305630, 32086, -29370, -6147, 154241, 90027, -200157, -46060, 33575, -42067, -34960, 66958, -169497, -92914, -97248, 271624, -4738, -260843, 243310, -97617, -94398, 5213, -240364, -309396, 47723, -159633, 148236, 5749, -195488, -190211, -361187, 32873, 330570, -166446, -245628, 4699, -253465, -56675, 146058, 340046, -135990, -177996, -260541, -43717, -352653, -134537, -43537, -365407, 71160, -64097, 212509, -58615, -81923, -58804, -61171, 82359]
10017B15332a03680j92876k86983K36760a29209A25074n9153a16988b5942k48125
10007b74067m6340A62313O4707j02578o834d75543a1326G1595J18394H9192b2642
9995a04166J6506k3687L1945H7051a45589A26633e15764A87306f5414r7719n0595
9984b13728H4579J79656a09727l2241K9115c0855k57652B7146g0219C896K05785
9973B09681B872K41489H6873l8741c35169f8855A77372d12076a29967A29544d3121
9961A86096b03431j2266k4460g4115c5202B0507M2399J21695A0694a93886P0771
9950a23115L4879j48865g4755j53481E2407e1682A04043a76516n7789G0828c61020
9938a27232o5312r1108Q2381P8945O57c1250B0394M9301c41241i6512d3675o8660
$$ y = [215332, -103680, -296556, -583539, -346779, -129209, 125074, 65921, -116988, -25942, -274067, -320407, 162313, 227020, 124442, 117608, -475543, -11326, 71595, 189989, 89192, -22642, -104166, -87660, -111347, -79402, 87051, -145589, 126633, -515764, 187306, -65414, -163133, -213728, 84579, 264235, -109727, -141968, -112853, -30855, -288507, 27146, -70219, 3896, 209681, 2872, 244361, 86873, 48132, -335169, -68855, 177372, -412076, -129967, 129544, -43121, 186096, -203431, -215697, -240157, -74115, -35202, 20507, 62906, 184601, 10694, -193886, -123115, -88236, -237101, -74755, -228236, 52407, -51682, 104043, -176516, -234305, 70828, -361020, -127232, -192544, -283652, -201271, -122326, -121669, -31250, 20394, 69695, -341241, -96512, -43675, -112335]
9926a12335M001p91a163j85981e1646b3885j63211L3722c7417B05648f8901j43757
9914b12658R8499a0534n3792F830i8142F0873a95507b6204k13178j36705J40304
9903b35783g3622B86225a07325c5708A38082a12205B24682d21674d7888k78236
9893c26124f467A32767A9481e11542A60070a44934e5305m8995k5280p8457a8290
9881c29354P339a17590M3165A4823a39854A13659a20248d7333k11682B6191d43488
9869a78528j3041b4747B80843b40900m7652j47854h066k52589q2282h061C8925
9857e9161j9464p875A15176b37602l850E0638a52520k2985B54507a51748H8114
9845a79662p627l3005j35480A32685L2184h5476l05090i2099j42971A41144a5341
$$ y = [-112335, -108334, -109125, -1163, -187144, -51646, -23885, -187096, -153374, -37417, 205648, -68901, -212658, -114159, -10534, -64326, 6830, -98142, 60873, -195507, -26204, -239382, -376087, -235783, -73622, 286225, -107325, -35708, 138082, -112205, 224682, -421674, -47888, -326124, -6467, 132767, 19481, -511542, 160070, -144934, -55305, -104300, -129580, -208037, -18290, -329354, -322015, -117590, -74425, 14823, -139854, 113659, -120248, -47333, -259015, 26191, -443488, -178528, -191569, -24747, 280843, -240900, -288552, -436406, -8066, -260655, -342937, -8061, 38925, -59161, -78625, -86500, 115176, -237602, -241452, 50638, -152520, -175505, 254507, -151748, 88114, -179662, -187289, -220294, -355774, 132685, 164869, -85476, -390566, -92099, -235070, 141144, -15341]
9833b34163e8219E6377a57791B2727P467f018j93608L3432I2683c72592a08110
9821a04200b7352a0197A5267e6440j74133C0885d1335j51098P1172n0842A52384
9809a4686j6109n2511A41061a22537j03516g7771B6882J05126J9363g6400B00218
9797c17598D1951a38266A17823e6051D0695L3948J17884c47328F7144J12383a71617
9785i7399D0355o474b1625A0028J64204K87942P2035i1175j61637g1083r3020
9774a64103k00974J23952A02740a32464M3963n2412O8410C2169J272a86868m3806
9763b30674E4957M0242Q470a30018A72561c74785A43080d47392K14106k69222
9753e02508a59080A46961c28909J07333j99195h1947j71646Q7463A40389a5759
$$ y = [-234163, -58219, 56377, -157791, 22727, 30194, -6018, -199626, -166194, 92683, -372592, -108110, -104200, -27352, -10197, 15267, -56440, -230573, 30885, -41335, -192433, -121261, -172103, 152384, -14686, -30795, -83306, 141061, -122537, -226053, -77771, 26882, 132008, 151371, -76400, 200218, -317598, 41951, -138266, 117823, -56051, 40695, 74643, 192527, -347328, 67144, 179527, -171617, -97399, 40355, 33881, -21625, 10028, 174232, 462174, 534209, -91175, -252812, -71083, -164103, -365077, -241125, 102740, -132464, -88501, -140913, -72503, 32169, 33441, -186868, -230674, 54957, 95199, 103669, -130018, 172561, -374785, 143080, -447392, -233286, -502508, -159080, 146961, -328909, -221576, -420771, -81947, -253593, -166130, 140389, -15759]
9742H3068j0666d07642a33437q773a8417B58731k445h649n1174k02446G785b87001
9729B18784b71694n4288I2078g1136A25704A7789e3633j56378j29102a16440J0763
9718a05677c6471B7374a93908r7880N0665M4379k35310Q2341d5500j36323p2742
9707b54565A44100a69396G5243f2723k3730B80706r3560c67444a47642B75144
9696E5075K2261a6875k20247h9969F4540n750a04852J1082b1311H5831a0860A2042
9683a29575f3301j19040B35323b26598L8902f3578o0477A76063o789D798a77343
9671b02469L7215k88918G7764J87283c01545G1125h9960d4660r2702j7976j6546
9660a71884A32636c10196a31433n7344I8085a15944m8531P3000l3787B50751h0990
$$ y = [83068, 72402, -407642, -133437, -142210, -18417, 258731, 256286, -8649, -59823, -262269, 7785, -287001, 218784, -271694, -325982, 92078, -71136, 125704, 17789, -53633, -210011, -339113, -116440, -105677, -36471, 27374, -193908, -291788, -241123, -196744, -432054, -349713, -45500, -181823, -254565, 144100, -169396, 75243, -62723, -86453, 280706, 187146, -367444, -147642, 275144, 55075, 77336, -16875, -237122, -89969, 64540, 58790, -104852, -93770, -21311, 85831, -10860, 12042, -129575, -63301, -182341, 235323, -226598, -187696, -63578, -124055, 176063, 169274, 4798, -177343, -202469, -165254, -454172, 77764, 265047, -301545, 71125, -89960, -44660, -137362, -155338, -171884, 132636, -310196, -131433, -188777, 98085, -115944, -164475, -91475, -125262, 250751, -80990]
9648f0162B44508b24209f8482B44381c0423B54790a45742g315A07602D6006J57701
9637B03707a43241A88519c461I0385a35474I3572C9447b5834j01689A14209M1419
9626A55628k4478a60613H8107a92573C33270f7713B2242b6972k22609B20380B0454
9614F0520K21313e7094r5754B39510j03187F198J07553a19544M5262b4353B2400
9602d20568B1737b44490B70131f5276b4814j91624L8794E898b43293J17351j84416
9591c10358G5354B5800a78735f1381j12577J5229b8995j64211i53m08811b3480
9579d7251A93852H7086g1185K480k73822a61122k5865G8016g8300j04585c549
9567F0407k1948b2023k9133B73531a02713A43108a0660m62282A21313L099g2272
$$ y = [-60162, 244508, -224209, -68482, 244381, -30423, 254790, -145742, -7315, 107602, 46006, 203707, -143241, 188519, -3461, 90385, -135474, 93572, 39447, -25834, -127523, 114209, 155628, 131150, -160613, 88107, -192573, 333270, -67713, 22242, -26972, -249581, 220380, 20454, 60520, 281833, -57094, -152848, 239510, 136323, 6198, 113751, -119544, -74282, -24353, 22400, -420568, 21737, -244490, 270131, -65276, -24814, -216438, -177644, 5898, -243293, -125942, -310358, 75354, 25800, -178735, -61381, -173958, -158729, -28995, -193206, -953, -409764, -23480, -47251, 193852, 87086, -71185, -68705, -342527, -161122, -186987, 78016, -78300, -182885, -3549, 60407, 38459, -22023, -51156, 273531, -102713, 143108, -10660, -472942, 121313, 124412, -72272]
9555a84570A731a11995m4913l7309G7697K32965b22384M7744N2371j2287A49736
9543b75145N4543a3136n180A43086m5423O3241c01820B73262P2280B0292a6137
9531d1519j68114k8031k5343a28163m3574C9118M2904J97030a82151k78978h5542
9519a3889n441F3798e5482B20491h5108A16639b50178j13441C33871a56330g1233
9507a6660k76577B36343c64773H6832l1122O7222n1976c60527J39776R1775d8945
9495c25857L0030a29762c6641j53844A57596p0202A0781a25239c6423E2970a77736
9483a38296k9150o2026D8534A4561K43333G780Q1261e3151j79703g8544j94462
9472b73006C05045b1411o5540j64220A65049c13931j7969J29987j14178b3787
$$ y = [-184570, 1731, -111995, -156908, -194217, 77697, 310662, -222384, -174640, -122269, -134556, 149736, -275145, -220602, -13136, -18316, 143086, 97663, 160904, -301820, 273262, 345542, 20292, -16137, -41519, -209633, -237664, -263007, -128163, -171737, 39118, 82022, 279052, -182151, -461129, -85542, -13889, -19330, 63798, -55482, 220491, -85108, 116639, -250178, -363619, 333871, -156330, -71233, -16660, -293237, 236343, -364773, 86832, 55710, 122932, 70956, -360527, -220751, -128976, -48945, -325857, -295827, -129762, -36641, -190485, 157596, 87394, 10781, -125239, -36423, 52970, -177736, -138296, -167446, -229472, 48534, 14561, 257894, 7780, 89041, -53151, -232854, -78544, -273006, 305045, -21411, -86951, -251171, 165049, -313931, -331900, -201913, -316091, -23787]
9461f0167A5597M6855k197c7194r3546q0243G2354J08325B3293a82833A1504g6394
9448b16783R3679k92523G6885h3968A98525b624n6194m12500A05254a28592A18649
9436b99800l3574f2159n0796B28230A122c00661J50298A0222J54384D1386J52256
9425A93642a0015j61745n3018A6521a31846m26201a53411R665j51471k4511a25357
9413B282b41860O0358f4877a9587p7870C8811d476m9290k50201B81496a38984
9401D3229a60458C18569b48461e9126j56803f7322B6761a72480J849j60350P3031
9390b57950J6517C7543l256c28680J11447M3381m2152A32371a94048A36906a2505
9378I4191M9613a59856k11772A40735e9657B9435b10109r3329a4323B579K86272
$$ y = [-60167, 15597, 62452, 60255, -37194, -130740, -210983, 72354, 180679, 23293, -182833, 11504, -76394, -216783, -123104, -415627, 76885, -83968, 198525, -2624, -58818, -471318, 105254, -128592, 118649, -299800, -333374, -62159, -112955, 228230, 1122, -300661, -150363, 10222, 164606, 41386, 193642, -10015, -171760, -224778, 16521, -131846, -558047, -153411, -143746, -295217, -319728, -125357, 2282, -241860, -181502, -64877, -19587, -97457, 38811, -4476, -53766, -303967, 281496, -138984, 43229, -160458, 318569, -248461, -59126, -215929, -67322, 26761, -172480, -170631, -330981, -257950, -241433, 37543, 34287, -328680, -217233, -173852, -216004, 132371, -194048, 136906, -12505, 94191, 143804, -159856, -371628, 140735, -59657, 29435, -210109, -303438, -14323, 2579, 288851]
9367B88851Q7544h0264O924F372a91806c0797p5787j12003f8740j43422L7572
9356a74590A57050n413C8571K36466g6695A8884b80374J09983j10782e4041B39962
9344f8647J3962j02513A03922a6259B63098i2373k40547a5941C3318b88806H432
9332a9231j56229A01083a99239A4229N0109a15701n9934A2542d492k14917a00379
9320a72760d6814a3540p9968j85245h2926l5529l5540r4355j98459i5370F1658
9308c03350a45321A90885p5342B0534J79239a06681A68960D0222L3763c46372
9297D969a63160A0742M4124b31986A877N3703J09786Q7162E75K18269q3380b03921
9284c8438q5378a8220j18835J9905B7092H156h3576a9705B37083D6919b07057
$$ y = [288851, 376395, -80264, -73340, 6372, -191806, -30797, -106584, -218587, -68740, -212162, -174590, 157050, 151637, 38571, 275037, -76695, 18884, -280374, -170391, -281173, -54041, 239962, -68647, -54685, -157198, 103922, -16259, 263098, -92373, -332920, -15941, 33318, -288806, 8432, -19231, -175460, 101083, -199239, 14229, 64338, -115701, -175635, 12542, -4492, -219409, -100379, -172760, -46814, -13540, -93508, -278753, -82926, -118455, -153995, -248350, -446809, -95370, 61658, -303350, -145321, 190885, 115543, 20534, 199773, -106681, 168960, 40222, 73985, -346372, 4969, -163160, 10742, 54866, -231986, 1877, 55580, 165366, 252528, 575, 218844, 135464, -203921, -38438, -123816, -18220, -137055, -117150, 27092, 8156, -83576, -19705, 237083, 46919, -207057]
9272B80045A09047O4286K2812a88596k04724I4034J37866p5602a65755B50574
9261B7139a20872D377c8815G0310J16545e6420A2947c80581d262l8742i81A44527
9248B08609C2357K61871i7631b8644j5947j58032c9215l58835b8796j35950L4346
9237a30400f3867E3922e393F6825J23758p8631J7801a62349p1538r6732b1616
9225C46854a21907A18186d6360A35941A8039O29404I8801a21576N2421q9055b691
9213A12540a19911j49489A55828c3580k5896C7268P7359b59944k2261J26316I7829
9201a12390G9964h9400m4763I100g6857A38421F4738a13579A17409a54632O9073
9190h5559r0791K4591k96955R6193E5788e8186I8242D0922a3457l8719l19235
$$ y = [280045, 109047, 173333, 196145, -188596, -393320, 94034, 231900, 156298, -165755, 250574, 27139, -120872, 4377, -38815, 70310, 186855, -56420, 12947, -380581, -4262, -43004, -981, 144527, 208609, 32357, 294228, -97631, -28644, -44591, -202623, -39215, -398050, -28796, -164746, -130400, -63867, 53922, -5393, 66825, 190583, 111952, 129753, -162349, -233887, -330619, -21616, 346854, -121907, 118186, -46360, 135941, 18039, 647443, 98801, -121576, -69155, -158210, -2691, 112540, -119911, -269400, 155828, -33580, -59476, 37268, 114627, -259944, -282205, -155889, 97829, -112390, 79964, -89400, -134163, 9100, -76857, 138421, 64738, -113579, 117409, -154632, -85559, -176350, -151759, -448714, -352521, 55788, -58186, 98242, 40922, -13457, -52176, -371411]
9179c71411A94462F4189a65568f5377C2256h7974c1099K404o0738B24371b64383
9167b01152E9302b03140P9596e5618G8497a27890n1926k3393Q8856J0908A13435
9155e1803j42352C12836a85380h0781m7736B53744j8543a36761K8571k19744A58641
9143a32697A7650K4333P3080b40518A3265L22702a62077k94336d1203k50886F0609
9131c71189A39395a26108D4583a38171a4438j30757r5827K1204B69130B6582L789
9120C0371J25997G7829N868c5802r5434C5328b87516g7721A74133i2076B5620
9108b5461j37615j80067a35271N652m1967I0955B6861e3305A19612J36596I973
9096a70975F3793a61605M172b7829n9150j99110i5684r3464j52547J56887j94881
$$ y = [-371411, 194462, 64189, -165568, -65377, 32256, -87974, -31099, -28695, -89433, 224371, -264383, -201152, 59302, -203140, -123544, -55618, 78497, -127890, -179816, -203209, -114353, -103445, 113435, -51803, -194155, 312836, -185380, -80781, -128517, 253744, 235201, -136761, -108190, -327934, 158641, -132697, 17650, 41983, 115063, -240518, 13265, 335967, -162077, -456413, -41203, -292089, 60609, -371189, 139395, -126108, 44583, -138171, -14438, -145195, -241022, -219818, 269130, 26582, 30371, 156368, 77829, 83697, -35802, -131236, 35328, -287516, -77721, 174133, -92076, 25620, -25461, -163076, -343143, -135271, -129619, -171586, 90955, 26861, -53305, 119612, 256208, 9973, -170975, 63793, -161605, -157433, -27829, -86979, -286089, -95684, -189148, -341695, -184808, -379689]
9085c79689m5739C42645d58531P7972C2198C77Q1204j9292b74135J19842n325
9074a59618I5916A986b55488A94078F5492h7180a2101n2801k55818K7023R0294
9063b03403j35498E4981K8195K88925A65758a22109F411J43227p2610c1770k39
9052c2009G7262c3184f803p8347o9265P4427l6828b7187j21306P0339j32240B02516
9039H4418K9710a38474k7821o2228D8216b0666A07469a10121D1097k203h5633
9027e2109q3152R632a7564j06528B17016a03617o0929H3867A4489e5605a4094
9015a13846j06050G7814Q8510a80576A2556c1158k68452H72b63329F7047B7091
9003a02587D5636e41920b59995f5945j66683l6824C919b5871A07890D6646M6988
$$ y = [-379689, -425428, 342645, -458531, -380559, 32198, 377, 81581, 62289, -274135, -154293, -159618, 95916, 1986, -255488, 194078, 65492, -87180, -12101, -64902, -320720, -293697, -203403, -338901, 54981, 83176, 372101, 165758, -122109, 6411, 149638, 77028, -31770, -32009, 77262, -33184, -6803, -85150, -154415, -79988, -116816, -27187, -148493, -78154, -210394, 202516, 84418, 114128, -138474, -166295, -228523, 48216, -20666, 107469, -110121, 41097, 38894, -85633, -52109, -135261, -125629, -17564, -124092, 217016, -103617, -164546, 83867, 14489, -55605, -14094, -113846, -219896, 77814, 166324, -180576, 12556, -31158, -299610, 872, -263329, 67047, 27091, -102587, 45636, -541920, -259995, -65945, -232628, -269452, 3919, -25871, 107890, 46646, 93634]
8992I3634a71225M2504J2565D6430d1965o6369j8022A2337b51296i955n5424p838
8980g3217j26582q7432e017j32326c701n4030F7431a60568C31948I9718a6648
8968c12822B48585B8992J64433a98107A08910c7660I5887a900H7100a36912A70154
8956a85796k4320j11748b8656l9447A31078L5722a32832E2799b25529A83215c16016
8944f1876l07342A34072c94170D83163c69303a5723C2801d7908n7982G3579L1990
8933A05569c5884C7303g9249j85747e5023B48006b57142d6687C31687M81828J302902
8922B116417N065660O961517E389227A885792G02567j25151j50943r3282o1188
8913B72003j7579l8817e3691K3334C48779A15701e0453j66735O7337j65005B02065
$$ y = [93634, -171225, -128721, -116156, 46430, -41965, -108334, -126356, 12337, -251296, -9955, -65379, -73217, -199799, -287231, -5017, -137343, -3701, -57731, 67431, -160568, 331948, 99718, -16648, -312822, 248585, 28992, 193425, -198107, 108910, -37660, 95887, -1900, 87100, -136912, 170154, -185796, -210116, -321864, -28656, -68103, 131078, 166800, -132832, 52799, -225529, 183215, -316016, -61876, -369218, 134072, -394170, 483163, -369303, -15723, 32801, -47908, -105890, 73579, 105569, -35884, 37303, -79249, -264996, -55023, 248006, -257142, -46687, 331687, 813515, 2116417, 7182077, 14143594, 5389227, 1885792, 702567, 577416, 426473, 333191, 272003, 254424, 215607, -53691, -30357, 348779, 115701, -50453, -217188, -149851, -314856, 202065]
8901C9167d6585l4563B72499G7700i3464K8001B0451a12083A95538a81507j82772
8890c64279a9446A63600N7765c467I3227l9591R6482C9564c5036E6333J34721
8879A91054b11195f6597I195R0668c13845c5086A05346H119a36904b4135B81755
8867A42570a24817J6126D4361b9526j25724M5693A42865L3144a16744A0123J11605
$$ y = [39167, -46585, -81148, 272499, 77700, -93464, -65463, 20451, -112083, 195538, -181507, -364279, -19446, 163600, 221365, -3467, 93227, 53636, 150118, 39564, -35036, 56333, 191054, -211195, -66597, 9195, 99863, -313845, -35086, 105346, 8119, -136904, -24135, 281755, 142570, -124817, -108691, 44361, -29526, -155250, -109557, 142865, 176009, -116744, 10123, 121728]
$$ [...]
##END NTUPLES=NMR SPECTRUM
##END=
