
##TITLE=AC1302_PERAH12114_7525498_Bu7zzF2CVs
##JCAMPDX= 6.0         $$ Bruker NMR JCAMP-DX V2.0
##DATA TYPE= NMR SPECTRUM
##DATA CLASS= NTUPLES
##ORIGIN= BRUKER
##OWNER= Administrator
$$ 1.72 TOPSPIN		Version 2.1
$$ 2013-02-20 23:59:06.081 -0500  Administrator@X
$$ Compression mode = diff/dup
##.OBSERVE FREQUENCY= 400.02188249412
##.OBSERVE NUCLEUS= ^1H
##.ACQUISITION MODE= SIMULTANEOUS (DQD)
##.ACQUISITION SCHEME= undefined
##.AVERAGES= 8
##.DIGITISER RES= 22
##SPECTROMETER/DATA SYSTEM= spect
##.PULSE SEQUENCE= zg30
##.SOLVENT NAME= COFFEE_meoh
##.SHIFT REFERENCE= INTERNAL, COFFEE_meoh, 1, 14.98509
##AUDIT TRAIL= $$ (NUMBER, WHEN, WHO, WHERE, PROCESS, VERSION, WHAT)
$$ ##TITLE= Audit trail, TOPSPIN		Version 2.1
$$ ##JCAMPDX= 5.01
$$ ##ORIGIN= Bruker BioSpin GmbH
$$ ##OWNER= Administrator
$$ $$ E:\/data/COFFEE/nmr/AC1302_PERAH12114_7525498_Bu7zzF2CVs/50/pdata/1/auditp.txt
$$ ##AUDIT TRAIL=  $$ (NUMBER, WHEN, WHO, WHERE, PROCESS, VERSION, WHAT)
(   1,<2013-02-20 23:58:57.566 -0500>,<Administrator>,<X>,<go>,<TOPSPIN 2.1>,
      <created by zg
	started at 2013-02-20 23:57:51.253 -0500,
	POWCHK enabled, PULCHK disabled,
       configuration hash MD5:
       86 BA 57 50 F2 9D 5C 9B 26 00 A9 28 5F 66 2E 89
       data hash MD5: 64K
       59 44 C0 90 93 5A 23 1E 83 61 7E EC 3F 18 A8 FE>)
(   2,<2013-02-20 23:59:00.738 -0500>,<Administrator>,<X>,<proc1d>,<TOPSPIN 2.1>,
      <Start of raw data processing
       efp LB = 0 FT_mod = 6 PKNL = 1 PHC0 = 0 PHC1 = 0 SI = 32K 
       data hash MD5: 32K
       93 92 CD 9E C0 A4 86 17 01 49 7E 62 86 8C 9A 69>)
(   3,<2013-02-20 23:59:01.253 -0500>,<Administrator>,<X>,<proc1d>,<TOPSPIN 2.1>,
      <pk PHC0 = 70.92773 PHC1 = 0 
       data hash MD5: 32K
       ED 16 2B 15 2F 45 DD A0 FA 87 05 D8 37 AD 86 83>)
(   4,<2013-02-20 23:59:01.488 -0500>,<Administrator>,<X>,<proc1d>,<TOPSPIN 2.1>,
      <abs ABSG = 1 
       data hash MD5: 32K
       AE DE 6F 9E 0E 8B 81 43 F8 9B 72 73 F7 C1 6A 92>)
(   5,<2013-02-20 23:59:01.628 -0500>,<Administrator>,<X>,<proc1d>,<TOPSPIN 2.1>,
      <abs ABSG = 2 
       data hash MD5: 32K
       80 3F 9F C0 03 8B 15 72 01 4E 28 80 79 0E 59 DB>)
(   6,<2013-02-20 23:59:01.784 -0500>,<Administrator>,<X>,<proc1d>,<TOPSPIN 2.1>,
      <abs ABSG = 3 
       data hash MD5: 32K
       30 5B 5D 21 98 22 A1 70 49 1C D4 4F E3 C6 69 8A>)
(   7,<2013-02-20 23:59:01.972 -0500>,<Administrator>,<X>,<proc1d>,<TOPSPIN 2.1>,
      <abs ABSG = 4 
       data hash MD5: 32K
       E7 35 C5 11 96 A1 78 BA BE 7C 83 43 4C CD F6 76>)
(   8,<2013-02-20 23:59:02.144 -0500>,<Administrator>,<X>,<proc1d>,<TOPSPIN 2.1>,
      <abs ABSG = 5 
       data hash MD5: 32K
       4E 10 97 4D 01 6B 4D 6E 4C C5 ED B3 3E AD 53 92>)
$$ ##END=
$$ 
$$ $$ hash MD5
$$ $$ 57 24 08 9D 3A CE 68 49 D5 66 D3 88 C8 74 A4 1D
##$RELAX= 
##$RELAX= 
##$RELAX= 
##$RELAX= 
##$RELAX= 
##$RELAX= 
##$RELAX= 
$$ Bruker specific parameters
$$ --------------------------
##$DU= <E:\>
##$EXPNO= 50
##$NAME= <AC1302_PERAH12114_7525498_Bu7zzF2CVs>
$$ [...]
##$TP= (0..7)
150 150 150 150 150 150 150 150
##$TP07= 0
##$TPNAME0= <>
##$TPNAME1= <>
##$TPNAME2= <>
##$TPNAME3= <>
##$TPNAME4= <>
##$TPNAME5= <>
##$TPNAME6= <>
##$TPNAME7= <>
##$TPOAL= (0..7)
0.5 0.5 0.5 0.5 0.5 0.5 0.5 0.5
##$TPOFFS= (0..7)
0 0 0 0 0 0 0 0
##$TUNHIN= 0
##$TUNHOUT= 0
##$TUNXOUT= 0
##$USERA1= <user>
##$USERA2= <user>
##$USERA3= <user>
##$USERA4= <user>
##$USERA5= <user>
##$V9= 5
##$VALIST= <valist>
##$VCLIST= <CCCCCCCCCCCCCCC>
##$VD= 0
##$VDLIST= <DDDDDDDDDDDDDDD>
##$VPLIST= <PPPPPPPPPPPPPPP>
##$VTLIST= <TTTTTTTTTTTTTTT>
##$WBST= 1024
##$WBSW= 4
##$XGAIN= (0..3)
0 0 0 0
##$XL= 0
##$YL= 0
##$YMAX_a= 556207
##$YMIN_a= -553642
##$ZGOPTNS= <>
##$ZL1= 120
##$ZL2= 120
##$ZL3= 120
##$ZL4= 120
##$ABSF1= 14.98509
##$ABSF2= -5.573092
##$ABSG= 5
##$ABSL= 3
##$ALPHA= 0
##$AQORDER= 0
##$ASSFAC= 0
##$ASSFACI= 0
##$ASSFACX= 0
##$ASSWID= 0
##$AUNMP= <proc_prof1d_extract_pilot.lims>
##$AXLEFT= 0
##$AXNAME= <>
##$AXNUC= <1H>
##$AXRIGHT= 0
##$AXTYPE= 0
##$AXUNIT= <>
##$AZFE= 0.1
##$AZFW= 0.1
##$BCFW= 0
##$BC_mod= 0
##$BYTORDP= 0
##$COROFFS= 0
##$CY= 15
##$DATMOD= 1
##$DC= 0
##$DFILT= <>
##$DTYPP= 0
##$F1P= 0
##$F2P= 0
##$FCOR= 0.5
##$FTSIZE= 32768
##$FT_mod= 6
##$GAMMA= 0
##$GB= 0
##$INTBC= 1
##$INTSCL= 1
##$ISEN= 128
##$LB= 0
##$LEV0= 0
##$LPBIN= 0
##$MAXI= 10000
##$MC2= 0
##$MEAN= 0
##$ME_mod= 0
##$MI= 0
##$NCOEF= 0
##$NC_proc= -8
##$NLEV= 6
##$NOISF1= 0
##$NOISF2= 0
##$NSP= 0
##$NTH_PI= 0
##$NZP= 0
##$OFFSET= 14.98509
##$PC= 1
##$PHC0= 70.92773
##$PHC1= 0
##$PH_mod= 1
##$PKNL= yes
##$PPARMOD= 0
##$PPDIAG= 0
##$PPIPTYP= 0
##$PPMPNUM= 2147483647
##$PPRESOL= 1
##$PSCAL= 4
##$PSIGN= 0
##$PYNMP= <proc.py>
##$REVERSE= no
##$SF= 400.02
##$SI= 32768
##$SIGF1= 0
##$SIGF2= 0
##$SINO= 400
##$SIOLD= 32768
##$SPECTYP= <>
##$SREGLST= <1H.CDCl3>
##$SSB= 0
##$STSI= 32768
##$STSR= 0
##$SW_p= 8223.68421052631
##$SYMM= 0
##$S_DEV= 0
##$TDeff= 65536
##$TDoff= 0
##$TI= <>
##$TILT= no
##$TM1= 0
##$TM2= 0
##$TOPLEV= 0
##$USERP1= <user>
##$USERP2= <user>
##$USERP3= <user>
##$USERP4= <user>
##$USERP5= <user>
##$WDW= 1
##$XDIM= 32768
##$YMAX_p= 457866444
##$YMIN_p= -804603
##$CURPLOT= <Network HP LaserJet P1505>
##$CURPRIN= <$Network HP LaserJet P1505>
##$DFORMAT= <normdp>
##$LAYOUT= <+/1D_H.xwp>
##$LFORMAT= <normlp>
##$PFORMAT= <normpl>
##$SURQMSG= 1
$$ End of Bruker specific parameters
$$ ---------------------------------
##NTUPLES= NMR SPECTRUM
##VAR_NAME=  FREQUENCY,     SPECTRUM/REAL,   SPECTRUM/IMAG
##SYMBOL=    X,             R,               I
##VAR_TYPE=  INDEPENDENT,   DEPENDENT,       DEPENDENT
##VAR_FORM=  AFFN,          ASDF,            ASDF
##VAR_DIM=   32768,         32768,           32768
##UNITS=     HZ,            ARBITRARY UNITS, ARBITRARY UNITS
##FACTOR=    0.250966925370066, 1,           1
##FIRST=     8223.43324360094, -16615,       -97147
##LAST=      0,             -39244,          -92236
##MIN=       0,             -804603,         0
##MAX=       8223.43324360094, 457866444,    0
$$ Real data points
##PAGE= N=1
##DATA TABLE= (X++(R..R)), XYDATA
$$ [...]
19537a46246j09447e1981B26751I5920K83161F4283g5302A35381a35342n9279
$$ -146246 -255693 -51981 226751 95920 379081 64283 -75302 135381 -135342 -194621
19527a94621h0837A23807a54765C1765K35183A5150J03041k8712a07196B20102
$$ -194621 -80837 123807 -154765 31765 266948 15150 118191 89479 -107196 220102
19516h4820A62076c7273j7135A16414b01315g5873o1447f6270j99465i0042j27257
$$ -84820 162076 -37273 -54408 116414 -201315 -75873 -137320 -66270 -265735 -90042 -217299
19505b17299I4414Q4175a78848A0086c66668J14452J1984A40338P9915r8163g6689
$$ -217299 94414 178589 -178848 10086 -366668 -252216 -240232 140338 220253 122090 -76689
19493A0984K00448a55685G4126j5612b55283J12715L4680m58236i2108B9295J20163
$$ 10984 211432 -155685 74126 58514 -255283 -142568 -107888 -566124 -92108 29295 149458
19482A49458c21934M4521d4036j20655K5473D2235a9974k2732j8887k02471a215
$$ 149458 -321934 -277413 -44036 -164691 -139218 42235 -19974 -42706 -61593 -264064 -1215
19470B17012a78105j9019K4849O2558j66784B90990b13677q3841A33031P491a00300
$$ 217012 -178105 -197124 -172275 -109717 -276501 290990 -213677 -297518 133031 140522 -100300
19458C6239d31194F2944b13667b4706k1175l47585A03106b56686M3175O5456A1441
$$ 36239 -431194 62944 -213667 -24706 -45881 -393466 103106 -256686 -213511 -148055 11441
19446A8632a11762k16641B43586F4194a10770J2289q8498Q6232A84120h5350N981
$$ 18632 -111762 -328403 243586 64194 -110770 -98481 -186979 -100747 184120 -85350 -79369
19435g9369r4813E9555K87822E8207h1142l13622h214A84536c3791q779d095l29582
$$ -79369 -174182 59555 347377 58207 -81142 -394764 -8214 184536 -33791 -42570 -4095 -333677
19423c33677a54295b9434j68383A26252a39119j64066I7122a27036B2830a11194
$$ -333677 -154295 -29434 -197817 126252 -139119 -303185 97122 -127036 22830 -111194
19412C83877A25990h1311B2764d9654B15082b93740l6679C979Q5996D3258a00018
$$ 383877 125990 -81311 22764 -49654 215082 -293740 -330419 3979 89975 43258 -100018
19400f6042j08379p7731M1995c0325B16424k2628H8716e2275A1121J34718a21923
$$ -66042 -174421 -252152 -210157 -30325 216424 193796 88716 -52275 11121 145839 -121923
19388a89099f0148n3642k0540C28890a17754e310A11334O6042a57078j32916g3698
$$ -189099 -60148 -113790 -134330 328890 -117754 -5310 111334 177376 -157078 -289994 -73698
19376a44757k01323A00582a75926d072A73189b47082j35496a8864j44154j34573
$$ -144757 -346080 100582 -175926 -4072 173189 -247082 -382578 -18864 -163018 -297591
19366b97591a00898j95664a46647q5398c7821A11239i1388J2433j22297g6329
$$ -297591 -100898 -296562 -146647 -232045 -37821 111239 -91388 -78955 -201252 -76329
19355H5196E857f9907k6102H1583a37257B4891K3506i4568B6557a24142c2291
$$ 85196 5857 -69907 -96009 81583 -137257 24891 48397 -94568 26557 -124142 -32291
19343A1093L25328a50408f9648A56050p0475J65762c82156J53677g446A6669g1708
$$ 11093 336421 -150408 -69648 156050 85575 251337 -382156 -228479 -7446 16669 -71708
19331A6866L57324a70406c7558l36903j68157A3870P9107G175b06959a2359j24710
$$ 16866 374190 -170406 -37558 -374461 -542618 13870 92977 7175 -206959 -12359 -137069
19320a37069O4151D1846M4946b94863A02857P8698G407b3836j3188B67035G6924
$$ -137069 -72918 41846 86792 -294863 102857 181555 7407 -23836 -37024 267035 76924
19308e7301a0742l11823b5176o0919r1986N9316r3797A17519a04750p6862h7207
$$ -57301 -10742 -322565 -25176 -86095 -178081 -118765 -212562 117519 -104750 -181612 -87207
19296G5182a58511A01828b8278k07493k8033e1587k33905M9870C4124d8939B70979
$$ 75182 -158511 101828 -28278 -235771 -263804 -51587 -285492 -235622 34124 -48939 270979
19284c43400A59211G8875J44763b91241J17525N092A15972e4004j5708m5235c0100
$$ -343400 159211 78875 223638 -291241 -173716 -168624 115972 -54004 -69712 -114947 -30100
19272d29976B15068a20038c6383q7266C93603a3403D3438P5792a32516j36723
$$ -429976 215068 -120038 -36383 -123649 393603 -13403 43438 119230 -132516 -269239
19262b69239a31592k40540a19380A0568J45475a37863b6495D9995R0062a02995
$$ -269239 -131592 -372132 -119380 10568 156043 -137863 -26495 49995 140057 -102995
19251a58982f1500k57219d5574o9138A44941a30494j47308c3004C997b35427A95432
$$ -158982 -61500 -318719 -45574 -114712 144941 -130494 -277802 -33004 3997 -235427 195432
19239D8536N2880c95514C8220O209A5451h6728B68243f4230q7918k78375a94829
$$ 48536 101416 -395514 38220 44429 15451 -86728 268243 -64230 -152148 -430523 -194829
19227d5551a4857k05391D8490a9752R272l6299m41028B3564f5285A82377M8288
$$ -45551 -14857 -220248 48490 -19752 -10480 -46779 -487807 23564 -65285 182377 230665
19216B30665a79619A16387h9824L1213E3503K62487d2471k01920A3262a62473
$$ 230665 -179619 116387 -89824 -58611 53503 315990 -42471 -244391 13262 -162473
19205a49241A47715b26758A24130n9507e6464a7698B8387h8617K4980j91887f401
$$ -149241 147715 -226758 124130 64623 -56464 -17698 28387 -88617 -63637 -255524 -6401
19193b37842E911a91693o0591J13238J4271c6106n2542k86896a07231j43115g5146
$$ -237842 5911 -191693 -252284 -139046 -124775 -36106 -88648 -375544 -107231 -250346 -75146
19181c18907a36035B18385b87528j29619J7716a09830b5953c714k61426d3672
$$ -318907 -136035 218385 -287528 -417147 -399431 -109830 -25953 -3714 -265140 -43672
19170A08356a05653A41304b59256E3338e9237o7851r9440C9198b27598F7064N8685
$$ 108356 -105653 141304 -259256 53338 -59237 -127088 -226528 39198 -227598 67064 125749
19159A25749a35509c3558A97631d631B4813g3894B98102A01420Q785B6081M5898
$$ 125749 -135509 -33558 197631 -4631 24813 -73894 298102 101420 110205 26081 71979
19148G1979J45546f4794l2596k0873k24715L9488a44464D7448b34269J04472j9981
$$ 71979 217525 -64794 -97390 -118263 -342978 -303490 -144464 47448 -234269 -129797 -149778
19137a49778A02825c11137a16315a773C4002a0294B32231a24524J5444M9042C3918
$$ -149778 102825 -311137 -116315 -1773 34002 -10294 232231 -124524 -109080 -60038 33918
19125A97762B6340c1205n8507n0418H0367C7125a37479b5881k3783E3738g5046
$$ 197762 26340 -31205 -89712 -140130 80367 37125 -137479 -25881 -49664 53738 -75046
19113b56538d8521p8143k63762d6480a0333r6675l4343e1644A28725M8770b35916
$$ -256538 -48521 -126664 -390426 -46480 -10333 -107008 -141351 -51644 128725 177495 -235916
19101h7633C0067L9550f4463G6204a96317H6466d1939J4758l0489j06602K6075
$$ -87633 30067 69617 -64463 76204 -196317 86466 -41939 -27181 -57670 -164272 -138197
19090a38197e452a79j81361A97280b80659a20002b3166l14752g5136l470I0373
$$ -138197 -5452 -179 -181540 197280 -280659 -120002 -23166 -337918 -75136 -78606 90373
19078i6538j47283A12548m8037B2032c36937g9340A0145a00805B0751a76945j71361
$$ -96538 -243821 112548 64511 22032 -336937 -79340 10145 -100805 20751 -176945 -348306
19067c48306a17329j1067e7307A27518e9925n9615q5286f9736C12544c42582i1209
$$ -348306 -117329 -128396 -57307 127518 -59925 -119540 -204826 -69736 312544 -342582 -91209
19055D75127A8547a64721j20665Q3945f6561c3021j03916a7633n3169m0745J184
$$ 475127 18547 -164721 -285386 -201441 -66561 -33021 -136937 -17633 -70802 -111547 -110363
19044a10363o1438j58731d2452n1941C8962L03486h7179c6498m8990k3790l7227
$$ -110363 -171801 -330532 -42452 -94393 38962 342448 -87179 -36498 -85488 -109278 -146505
19033a46505B21951C1189d21895E981K7379c9626a0877B90880F5410a58693b2030
$$ -146505 221951 31189 -421895 5981 33360 -39626 -10877 290880 65410 -158693 -22030
19021A81731I832J62050f7902A1582a81502j26824e1116C57728A02729J37884
$$ 181731 9832 171882 -67902 11582 -181502 -308326 -51116 357728 102729 240613
19011B40613f8841j93120a26616e3092k39874J16891g0730A1273b42025B03301
$$ 240613 -68841 -261961 -126616 -53092 -292966 -176075 -70730 11273 -242025 203301
19000a80630e8209A97525g9658A99697G024a9387C8863O4039J18515j05718c88722
$$ -180630 -58209 197525 -79658 199697 7024 -19387 38863 102902 221417 115699 -388722
18988b13862C26918b062k35662H3190b24502N4502B7249L57707b0606g732C8470
$$ -213862 326918 -2062 -237724 83190 -224502 -170000 27249 384956 -20606 -7732 38470
18976g5407l6252a7230j13369a9540B5525a90589A18867a33672C765L1717J50190
$$ -75407 -111659 -17230 -130599 -19540 25525 -190589 118867 -133672 3765 35482 185672
18965A85672a43124B2103c31325C45918E1806a18675d8596B52864q6160C9054
$$ 185672 -143124 22103 -331325 345918 51806 -118675 -48596 252864 166704 39054
18954g2302q2946J9752j85263B73443j35982o018b5551D458J94453a32415E3761
$$ -72302 -155248 -135496 -320759 273443 137461 131443 -25551 4458 198911 -132415 53761
18942A40450d6686m1338j94594A47516E0916N5990a86306D3766i4128j5029A1654
$$ 140450 -46686 -88024 -282618 147516 50916 106906 -186306 43766 -94128 -109157 11654
18930a64903B56489q6342o9092M6957n8014M2152a95171A11810c84038I730L9506
$$ -164903 256489 170147 101055 148012 89998 132150 -195171 111810 -384038 9730 49236
18919D9236J11144i6523k20313a49395K138L9721l86117f2885g096D8418d9952
$$ 49236 160380 -96523 -316836 -149395 -147257 -107536 -493653 -62885 -7096 48418 -49952
18907E3509b84564h7286l4479j13753P274A27992R5973j2298C136K17899f0119
$$ 53509 -284564 -87286 -121765 -235518 -228244 127992 223965 211667 3136 221035 -60119
18895a16133A77166b29623Q976l0863f5697A15866a48412D8980a4362n2322G9148
$$ -116133 177166 -229623 -220647 -251510 -65697 115866 -148412 48980 -14362 -66684 79148
18883b13663A09225l7309a86796r3100a11845n4937c1111k97732m8220B6575J33650
$$ -213663 109225 71916 -186796 -279896 -111845 -166782 -31111 -328843 -377063 26575 160225
18872A60225B6883c78686a14319A42318B2159i2119l04153B85879L9446j53654
$$ 160225 26883 -378686 -114319 142318 22159 -92119 -396272 285879 325325 171671
18862A71671a2671k39026J9193A05222a24810A19734a33608B67585b57027H6720
$$ 171671 -12671 -251697 -232504 105222 -124810 119734 -133608 267585 -257027 86720
18851A35301c22996I8699J61656A08743j1732a5553n160A14666b36578E1284c36753
$$ 135301 -322996 98699 260355 108743 97011 -15553 -20713 114666 -236578 51284 -336753
18839C8827h1311k1590k03751A44147k2163d1986I5216b54518j28523k4335C43017
$$ 38827 -81311 -102901 -306652 144147 121984 -41986 95216 -254518 -383041 -407376 343017
18827g0331o3573l4700A42333f9272l3889j50952d5249A24909f0441J7962C11954
$$ -70331 -133904 -168604 142333 -69272 -103161 -254113 -45249 124909 -60441 -42479 311954
18815B47241a2804D7176A3469b18331A98717I8929L41964A69606p4616b3991j28017
$$ 247241 -12804 47176 13469 -218331 198717 98929 440893 169606 94990 -23991 -152008
18804a52008C47452a06680k9183N371C1328J2006a45681b3522n3456a917j83275
$$ -152008 347452 -106680 -135863 -130492 31328 43334 -145681 -23522 -76978 -1917 -185192
18793a85192A35691g22n21310d6820k18131j01921A20483g7932j349A47367D6785
$$ -185192 135691 -722 -522032 -46820 -264951 -366872 120483 -77932 -79281 147367 46785
18781A5359a34105A01917b63257H9911c59122h5110j05765n7522n3060e3099n9042
$$ 15359 -134105 101917 -263257 89911 -359122 -85110 -190875 -248397 -301457 -53099 -112141
18770a12141B0842J84780O0108I1436b83605g3667j43191A572b04151A73161c3577
$$ -112141 20842 205622 265730 91436 -283605 -73667 -216858 1572 -204151 173161 -33577
18758C03420E2535a65808l15158c1954k17584G5043a58737B95068a84947q7239
$$ 303420 52535 -165808 -480966 -31954 -249538 75043 -158737 295068 -184947 -272186
18748b72186J12995A54857N9176r8602J73946r3741a83434J745c3379E6788o74
$$ -272186 -159191 154857 214033 115431 289377 195636 -183434 -181689 -33379 56788 56114
18737E6114a28674c7058C02289F3243J25053e1729b019E128a87906G0205L2542
$$ 56114 -128674 -37058 302289 63243 188296 -51729 -2019 5128 -187906 70205 102747
18726A02747b13957C21781c9838q6649C4593i6141G170a43244e6037o4774j92303
$$ 102747 -213957 321781 -39838 -126487 34593 -96141 7170 -143244 -56037 -120811 -313114
18715c13114d4077i860b640j21444r4047O2947k09843a02862j90864B44102a50890
$$ -313114 -44077 -9860 -2640 -124084 -218131 -155184 -365027 -102862 -293726 244102 -150890
18703b19791j93888c6207r4440j45133F3580b22612Q8270B71102b55889b8656
$$ -219791 -413679 -36207 -130647 -275780 63580 -222612 -134342 271102 -255889 -28656
18692a60889a5587B39726F5817a35061c0418A23268E7481g7966j24557h3077C20625
$$ -160889 -15587 239726 65817 -135061 -30418 123268 57481 -77966 -202523 -83077 320625
18680D565M6956L32984C1623c60657h2589k18574J42114H1418b08940a1131m41947
$$ 4565 51521 384505 31623 -360657 -82589 -301163 -159049 81418 -208940 -11131 -453078
18669d53078A744g4226B9658J37598b35104m4526J05337k17429f8475j64458j3443
$$ -453078 1744 -74226 29658 167256 -235104 -279630 -174293 -391722 -68475 -232933 -246376
18658b46376f288H6381k3672d43576B5922J96121J192b5139A72459l7977d9776
$$ -246376 -6288 86381 62709 -443576 25922 222043 223235 -25139 172459 134482 -49776
18646G1056c5995O382C10061a07431A22131J44721p3472G413K71224A09141b88098
$$ 71056 -35995 -29613 310061 -107431 122131 266852 193380 7413 278637 109141 -288098
18634f07534A37478a73129B20825c87034R5267m460g9699j01607Q2543j54628
$$ -607534 137478 -173129 220825 -387034 -291767 -296227 -79699 -181306 -98763 -253391
18624b53391a17124k8a3562I3357h257k16287m474A05424a10762k72296A1077
$$ -253391 -117124 -117152 -13562 93357 -8257 -224544 -229018 105424 -110762 -383058 11077
18612i2139A1448n002J15544i1559j63557B3891f17476i2011A769L88981A59708
$$ -92139 11448 6446 121990 -91559 -255116 23891 -617476 -92011 1769 390750 159708
18600H553J23017c37222J45727G6785A7675J57614m2590b34017H9984a07963A47759
$$ 8553 131570 -337222 -191495 76785 17675 175289 132699 -234017 89984 -107963 147759
18588H1457R529h8268j18475j27299n0453h8381F1303L9738d8991F0735b81815
$$ 81457 90986 -88268 -206743 -334042 -384495 -88381 61303 101041 -48991 60735 -281815
18576e4328F2334a44929e8793A49179c41598F8401J18827o8046a13346H9816C2770
$$ -54328 62334 -144929 -58793 149179 -341598 68401 187228 119182 -113346 89816 32770
18564E4441a83821F5514J07063h5545D4575h6107A76499n8122a03901q3494E3897
$$ 54441 -183821 65514 172577 -85545 44575 -86107 176499 118377 -103901 -187395 53897
18552d2210j43939A19663b04904f1821J552C21111h8578k4051L7814j15869F667
$$ -42210 -186149 119663 -204904 -61821 -60269 321111 -88578 -112629 -74815 -190684 6667
18540H2704L7114A905d06160J85378N2000m7989A28145b7999q3245j74477c3387
$$ 82704 119818 1905 -406160 -220782 -168782 -216771 128145 -27999 -111244 -285721 -33387
18528B83081f6243k20954O3579P6611H379J13575f153C11893a53333d0926A62269
$$ 283081 -66243 -287197 -223618 -147007 8379 121954 -6153 311893 -153333 -40926 162269
18516A03086b08112G3936a19454L4433C16833a0097B65352i8799j6165m7459f8661
$$ 103086 -208112 73936 -119454 -85021 316833 -10097 265352 -98799 -114964 -162423 -68661
18504D6852K531Q334b42366P7067C7956d4028q0689p2241F5500a98736G5825c13731
$$ 46852 49383 57717 -242366 -165299 37956 -44028 -124717 -196958 65500 -198736 75825 -313731
18491B15554m2869g6772B30255G0692b7095J2335B30455a11988B5765b8797F6373
$$ 215554 172685 -76772 230255 70692 -27095 -14760 230455 -111988 25765 -28797 66373
18479G5004c43196A4183a78399h0213L5532k9410B44927a01169A41844J5755o9068
$$ 75004 -343196 14183 -178399 -80213 -44681 -74091 244927 -101169 141844 157599 88531
18468H8531a31113j53049c3431j41939B16674k0799g0446m121p459B63891b23116
$$ 88531 -131113 -284162 -33431 -175370 216674 195875 -70446 -74567 -82026 263891 -223116
18456h8939q4945g3252a7362r7979p7606d0730A40578I585N5638b04997P3183
$$ -88939 -173884 -73252 -17362 -115341 -192947 -40730 140578 9585 65223 -204997 -131814
18445a31814A10063l5971K0960g147l41220B79382r0966c36659P2842a23786A33969
$$ -131814 110063 74092 95052 -7147 -348367 279382 188416 -336659 -263817 -123786 133969
18433f8057A7115D946c11132B88398A24565c6480j04610M7152o3360A3750K2044
$$ -68057 17115 4946 -311132 288398 124565 -36480 -141090 -93938 -157298 13750 35794
18422C5794b40185G7394a58942c5252A11030m0944a28220j2065e8948A23885e5746
$$ 35794 -240185 77394 -158942 -35252 111030 70086 -128220 -140285 -58948 123885 -55746
18410b06506B8504d4018j2655D27131a36840j7082k93065A0410e2712J0312A7295
$$ -206506 28504 -44018 -56673 427131 -136840 -153922 -446987 10410 -52712 -42400 17295
18398A64223a36759e8142B799K62275p9855o7667B2867K43593c5955j47462A23308
$$ 164223 -136759 -58142 2799 265074 185219 117552 22867 266460 -35955 -183417 123308
18386b61722P9516j65333a09921j99556R8026B12645L2083a02772j49124C8017
$$ -261722 -182206 -347539 -109921 -309477 -211451 212645 244728 -102772 -251896 38017
18375C45364a72399a3949k29613i7341j09981d0800A03660b900C2890a71978j572
$$ 345364 -172399 -13949 -243562 -97341 -207322 -40800 103660 -2900 32890 -171978 -173550
18364a73550k29192a94343Q6745j86501B47154h9443j32045e3548j93089i1998
$$ -173550 -402742 -194343 -107598 -294099 247154 -89443 -221488 -53548 -246637 -91998
18353A07215D6414a83499h5238r0820b8490j19809d7399k59252J28258A77198
$$ 107215 46414 -183499 -85238 -176058 -28490 -148299 -47399 -306651 -178393 177198
18342d4652A80572n9159c09426D0915A9159b9742B2568O5491a24494b9844j02705
$$ -44652 180572 121413 -309426 40915 19159 -29742 22568 88059 -124494 -29844 -132549
18331a32549a3821n1000B6808c4930j53612f0003j27064J5753j9602A10810b20746
$$ -132549 -13821 -64821 26808 -34930 -188542 -60003 -187067 -171314 -190916 110810 -220746
18319g0943B1373c25510a29006l2667l05399H0056b21924B27309a9499k221c03
$$ -70943 21373 -325510 -129006 -161673 -467072 80056 -221924 227309 -19499 -21720 -303
18307b96090D8241e7819k16760K7508e0074A05686C0773d52506C46604E3771b10253
$$ -296090 48241 -57819 -274579 -247071 -50074 105686 30773 -452506 346604 53771 -210253
18295b02345l1951j19481A99005a78628h1155G500a05683e0571B02416K20381
$$ -202345 -234296 -353777 199005 -178628 -81155 7500 -105683 -50571 202416 422797
18285D22797e5202j39034O3679B69800b01443A48663d2136j94058B50908l3227
$$ 422797 -55202 -194236 -130557 269800 -201443 148663 -42136 -236194 250908 217681
18275B17681b26785A57814L41655a66350d7274j01299C27334a56993N6352i747
$$ 217681 -226785 157814 499469 -166350 -47274 -148573 327334 -156993 -100641 -9747
18264C15070C4827j5022c5879A11071K2352M3766o1775D7194O8255a12955E6647
$$ 315070 34827 19805 -35879 111071 133423 177189 115414 47194 115449 -112955 56647
18252d7587A0573b28855a0970C95427j38305h9477m4080E455b13388d4004o6135
$$ -47587 10573 -228855 -10970 395427 257122 -89477 -133557 5455 -213388 -44004 -110139
18241a10139j94049C56625k6929r0405F8503c11858b6490o2998g613k39890A73002
$$ -110139 -304188 356625 329696 239291 68503 -311858 -26490 -89488 -7613 -247503 173002
18229b65750A10580g5281j30086O754N3829A81447c30613J60843e7812b8586B6904
$$ -265750 110580 -75281 -205367 -198613 -144784 181447 -330613 -169770 -57812 -28586 26904
18217D91151a87026k6824O6519A81811b72623C03289b03794A01142i4384j15312
$$ 491151 -187026 -213850 -147331 181811 -272623 303289 -203794 101142 -94384 -209696
18207b09696f3115A83634b4134p7018b9722m4993k6916l7640j11599Q7748G8014
$$ -209696 -63115 183634 -24134 -101152 -29722 -74715 -101631 -139271 -250870 -163122 78014
18195A48662b38463A12810j7895Q0834k6732i4552j74637d4649H0213g7573j58552
$$ 148662 -238463 112810 94915 175749 149017 -94552 -269189 -44649 80213 -77573 -236125
18184b36125B16453f7207m6915o5828h3197c7883j6391F10618b26071B71500a72279
$$ -236125 216453 -67207 -114122 -179950 -83197 -37883 -54274 610618 -226071 271500 -172279
18172a61739F5343K9744a2317A444N8755d37737a71866B292N3056k7511i0244
$$ -161739 65343 95087 -12317 1444 60199 -437737 -171866 2292 55348 27837 -90244
18160b30046B47516B3656d9381p3133p39B80212b8479I5031Q867b6242j78931
$$ -230046 247516 23656 -49381 -122514 -123253 280212 -28479 95031 103898 -26242 -205173
18149b05173B35914b57203L7609A63920a6256j74261j7933E8112B8634g3437j45055
$$ -205173 235914 -257203 -219594 163920 -16256 -190517 -208450 58112 28634 -73437 -218492
18138b18492a03357e759A27759e6103A13125M9885o3812b35831f6930o0632n9911
$$ -218492 -103357 -5759 127759 -56103 113125 163010 99198 -235831 -66930 -127562 -187473
18127a87473i39A81694L8008j095i9570B6930a34954f3483B4297J2733b36312
$$ -187473 -939 181694 219702 218607 -99570 26930 -134954 -63483 24297 37030 -236312
18115B60909o8064c3352o5634A82467G437h8019c2082b821k07624E1332a48821
$$ 260909 192845 -33352 -98986 182467 7437 -88019 -32082 -2821 -210445 51332 -148821
18103B04276b62212k1321l3109A15409a63687j17214B5393J01285R9219C1848
$$ 204276 -262212 -283533 -316642 115409 -163687 -280901 25393 126678 225897 31848
18092a14111n3025A89726q7727M1248F5928g7751G7163d7884B1552L9365a8860
$$ -114111 -167136 189726 101999 143247 65928 -77751 77163 -47884 21552 60917 -18860
18080a49385A6455J07380c05990a39522j2399j01451F7934a10695A18756D6333
$$ -149385 16455 123835 -305990 -139522 -151921 -253372 67934 -110695 118756 46333
18069b49779A25925d3003B4702a00118m5912B56834O4756b30640b2213n1182j20671
$$ -249779 125925 -43003 24702 -100118 -146030 256834 321590 -230640 -22213 -73395 -194066
18058a94066c9711m39675a99773G8729C7655J33674a19385C00210C1881K76873
$$ -194066 -39711 -479386 -199773 78729 37655 171329 -119385 300210 31881 308754
18048C08754A31926a25250G0586K720e7485A19670J99158a3903A4909a61619L6993
$$ 308754 131926 -125250 70586 73306 -57485 119670 318828 -13903 14909 -161619 -124626
18037a24626A34243f7764O511j57544p7221f8692r9805b9573j72193e8651n6352
$$ -124626 134243 -67764 -61253 -218797 -296018 -68692 -168497 -29573 -201766 -58651 -115003
18026a15003j09285A93744a87456H1521k7822b19039b9956A71384a25258C0725
$$ -115003 -224288 193744 -187456 81521 53699 -219039 -29956 171384 -125258 30725
18015A19547d0380l0445j53520o1077J17546b7470O752m6534B94815j43281d52255
$$ 119547 -40380 -70825 -224345 -285422 -167876 -27470 -20718 -67252 294815 151534 -452255
18003C06661A6308a64642B38197a62717l3968E8698k4852c0114n3995A59924d54183
$$ 306661 16308 -164642 238197 -162717 -196685 58698 33846 -30114 -84109 159924 -454183
17991a59231B3049a13892m1567A42060e1974E8915b04020E3289P285d5647B43433
$$ -159231 23049 -113892 -155459 142060 -51974 58915 -204020 53289 60574 -45647 243433
17979A04930J2825b79749f4551F7729C777b6555A42067b8013l75249A45583g7417
$$ 104930 117755 -279749 -64551 67729 3777 -26555 142067 -28013 -403262 145583 -77417
17967a46912D2248R2445R2293f9532J3534D27220b19541i4328b8726k48429a27856
$$ -146912 42248 134693 226986 -69532 -55998 427220 -219541 -94328 -28726 -277155 -127856
17955C714i1370H7692b8056B7077a12281I0591J33617q7349d8149F6343e6012
$$ 3714 -91370 87692 -28056 27077 -112281 90591 224208 136859 -48149 66343 -56012
17943e6434o5488n9a2796J935l4751a3345A34980J1487b89823h5460j92433H154
$$ -56434 -121922 -121981 -12796 -10861 -45612 -13345 134980 146467 -289823 -85460 -277893 8154
17930G2879a54319m5159A07342J25085b43285D88340b52980A02342a56267r8931
$$ 72879 -154319 -199478 107342 232427 -243285 488340 -252980 102342 -156267 -255198
17920b55198J17640A4244Q6265j3503b0174B96364F3388a17240j03859C07194
$$ -255198 -137558 14244 100509 87006 -20174 296364 63388 -117240 -221099 307194
17909h6945k06624a35733F9792b56072E7342J48931q417m8713Q6240b26800B9105
$$ -86945 -293569 -135733 69792 -256072 57342 206273 197856 149143 235383 -226800 29105
17897B52006F2838O9131K19052k0297e7511j74390e4669G1351K40259A18830a43919
$$ 252006 62838 131969 351021 330724 -57511 -231901 -54669 71351 311610 118830 -143919
17885a13617k3483k62702h0132m1322D6056K34277A39825O0268m4183i9484a6434
$$ -113617 -137100 -399802 -80132 -121454 46056 280333 139825 200093 155910 -99484 -16434
17873a58106M0884M5105A87052n295a13429L4040l91495C61336a06165A31828
$$ -158106 -117222 -72117 187052 181757 -113429 -79389 -470884 361336 -106165 131828
17862A27025J0036a35982d0978m3703n1767a2189m45227A39120b09855k40808
$$ 127025 137061 -135982 -40978 -84681 -136448 -12189 -457416 139120 -209855 -450663
17852d50663G3431K41502A26624D1676a64963L1321A86525b32937h521j97930
$$ -450663 73431 314933 126624 41676 -164963 -133642 186525 -232937 -8521 -206451
17842b06451e5806j32605G5981J5261M4303R5929b73042D2157B0543L5938f1876
$$ -206451 -55806 -188411 75981 91242 135545 231474 -273042 42157 20543 56481 -61876
17830g2523E063J84279I3022i6063j92002A64411h8446o7962A30300l4040d3156
$$ -72523 5063 189342 93022 -96063 -288065 164411 -88446 -156408 130300 96260 -43156
17818G152J03139c25468E2451J07236b13424P2979j25007a8576m0983m8446k03405
$$ 7152 110291 -325468 52451 159687 -213424 -140445 -265452 -18576 -59559 -108005 -311410
17807c11410L2267a37221B00898a33777a3j08662B1332D963P1664b3816j15936
$$ -311410 -279143 -137221 200898 -133777 -13 -108675 21332 4963 76627 -23816 -139752
17796a39752j06400E8202O4928f3144q3645q5510P2810C7014L24964a86983D1798
$$ -139752 -246152 58202 123130 -63144 -146789 -232299 -159489 37014 361978 -186983 41798
17784E4548c0306k2286B00657f6538C4372N6274b21984b6757I5442f9525A4327
$$ 54548 -30306 -52592 200657 -66538 34372 90646 -221984 -26757 95442 -69525 14327
17772B15726D5829h4824j03970K797P1164c5732n6140F1228c4408n151j99720
$$ 215726 45829 -84824 -188794 -185997 -114833 -35732 -91872 61228 -34408 -39559 -239279
17761b39279A868e3022b4220k0210A48397C2477f5807C5956g5845C7962J67393
$$ -239279 1868 -53022 -24220 -44430 148397 32477 -65807 35956 -75845 37962 205355
17750B05355a78630O6816b5333p2799j31927B78535E3410J63328q7565b28853
$$ 205355 -178630 -111814 -25333 -98132 -230059 278535 53410 216738 129173 -228853
17739a38370A17808G129j806O8662h9798K5150j84968A10738c11066d8421a7234
$$ -138370 117808 7129 5323 73985 -89798 -64648 -249616 110738 -311066 -48421 -17234
17727A75454a89578R3995A56416i3619B8224a25303I1151a29027N3356A76322
$$ 175454 -189578 -95583 156416 -93619 28224 -125303 91151 -129027 -75671 176322
17716B0500a79535N4467D8100M6077a62716P715r5978N6078A9091b6440j5314
$$ 20500 -179535 -125068 48100 94177 -162716 -155001 -250979 -194901 19091 -26440 -41754
17705d1754E473Q154d699G6402L42250q3728f0755B00751b83921D6c5242B63888
$$ -41754 5473 13627 -4699 76402 418652 334924 -60755 200751 -283921 46 -35242 263888
17692A07831g369A04746b33267A65011c1680q7555N4805j04889b1086B72097a35734
$$ 107831 -7369 104746 -233267 165011 -31680 -119235 -64430 -169319 -21086 272097 -135734
17680D40652A80788J92100G9613c31255A54830d6817j252C51507j47783g4884
$$ 440652 180788 372888 79613 -331255 154830 -46817 -48069 351507 203724 -74884
17669d2997A26002b2637B9366L15211G3242a17357A66161C2779c76p0874E1168
$$ -42997 126002 -22637 29366 344577 73242 -117357 166161 32779 -376 -71250 51168
17657f9406l17536F9748K10648J11071a7796k17685j36243a71219C39629g608
$$ -69406 -386942 69748 280396 391467 -17796 -235481 -371724 -171219 339629 -7608
17646c02257g0261C47616j64675D5338L3411g3907A49350a46182g875p5565k0332
$$ -302257 -70261 347616 182941 45338 78749 -73907 149350 -146182 -7875 -83440 -103772
17635a03772C2383e3743A97408a2054j08693M3937A28560a16240a0221B90997
$$ -103772 32383 -53743 197408 -12054 -120747 -76810 128560 -116240 -10221 290997
17624A26156b26325A76209b55253J12831n6940c4091H3861J29056j02110f3979
$$ 126156 -226325 176209 -255253 -142422 -199362 -34091 83861 212917 110807 -63979
17613c2479n5282r1434f109A65247o9227d0483E5215M9677c07784A14596m4413
$$ -32479 -87761 -179195 -6109 165247 96020 -40483 55215 104892 -307784 114596 70183
17602G0183g1872K6685l1876K9236A58071B7866b9295F1618N0610J7124a740H8427
$$ 70183 -71872 -45187 -77063 -47827 158071 27866 -29295 61618 112228 129352 -1740 88427
17589C28670A00519K37778I1754K10932B7573J75088D6783b6288k94886A41030
$$ 328670 100519 338297 91754 302686 27573 202661 46783 -26288 -321174 141030
17578d5126F3319Q6811n9337b55765H6391J04837a7388j0497j95876A61410i7791
$$ -45126 63319 150130 90793 -255765 86391 191228 -17388 -27885 -223761 161410 -97791
17566g923A56921m6283K0258c86770J21968b9304l03651A95760B208a6297A07957
$$ -7923 156921 110638 130896 -386770 -264802 -29304 -332955 195760 2208 -16297 107957
17554A2815b6762G5453R692A19K01657O5925a33376q3731A55849Q107e8264B52430
$$ 12815 -26762 75453 85145 119 201776 267701 -133376 -217107 155849 163956 -58264 252430
17541B48624a1384B6398a10902C7370a35102B09135j8509M4596c737B98416k6686
$$ 248624 -11384 26398 -110902 37370 -135102 209135 190626 235222 -3737 298416 271730
17530B71730j17054D5612J40148n6755K3889K00630k5342B358K52624d30218b11594
$$ 271730 154676 45612 185760 129005 152894 353524 328182 2358 254982 -430218 -211594
17518a66099B58097p5359B0887K07265H4663J93057D4717c38957A86833b1400
$$ -166099 258097 182738 20887 228152 84663 277720 44717 -338957 186833 -21400
17507C20529A39595F917J85996b5596A93588a82072A54094Q3305b23938a11348
$$ 320529 139595 6917 192913 -25596 193588 -182072 154094 237399 -223938 -111348
17496a02938F390a68468A01419b9355F3461J67762f0336H6801a43442A20768J29141
$$ -102938 6390 -168468 101419 -29355 63461 231223 -60336 86801 -143442 120768 249909
17485B49909K62587k55929i0021D01115h1138J0105J92A54601K25246m2690K2646
$$ 249909 512496 256567 -90021 401115 -81138 -71033 -70841 154601 379847 337157 359803
17474C59803j20330a05712B06716O2575a30831D74542j53482N8412I922J23261
$$ 359803 239473 -105712 206716 269291 -130831 474542 321060 379472 9922 133183
17464A33183B4934K86365A01952c2296Q523C8510K67715j8931f672j19895A12763
$$ 133183 24934 311299 101952 -32296 -23773 38510 306225 287294 -6672 -126567 112763
17452B55023E446M36931P0867P232e3102B72904P4987n4278H1223L40725j82457
$$ 255023 5446 442377 513244 520476 -53102 272904 347891 293613 81223 421948 239491
17441B39491J1434b1025A66881K0768K21408A89352l7819R7177J0419O9510A36254
$$ 239491 250925 -21025 166881 187649 409057 189352 151533 248710 259129 328639 136254
17429B09852O3732L4778j51795a7963A59362l0030J74280j7162J7763J21408A43280
$$ 209852 273584 308362 156567 -17963 159362 129332 303612 286450 304213 425621 143280
17417C82367n5925n8150H7069L2138L86131Q6101j03217H7872J90309b3479A89815
$$ 382367 326442 268292 87069 119207 505338 591439 488222 87872 278181 -23479 189815
17405D34832A16840K33336j43977J86264b9721L523C68696N6398A04718J04765
$$ 434832 116840 350176 206199 392463 -29721 -26198 368696 425094 104718 209483
17395B09483p7200J84936H7467a03115A22306o035O1100J74684P913A31824C024
$$ 209483 132283 317219 87467 -103115 122306 116271 177371 352055 359968 131824 3024
17383H1409a89751C0126N6817l8821J5272Q34K49046G6409K01835j07075J0860
$$ 81409 -189751 30126 86943 48122 63394 64228 313274 76409 278244 171169 182029
17372A82029b0799D38561C3123a77643B37888p9858F3784K79181J3979E5193J33485
$$ 182029 -20799 438561 33123 -177643 237888 158030 63784 342965 356944 55193 188678
17361A88678J17524A0039Q8181J4181J2699O4399q1239M4421M5082N2092A12284
$$ 188678 306202 10039 98220 112401 125100 189499 108260 152681 197763 249855 112284
17349g4437C55145b27805A91206f8938k8588A06493a20374C48313A8168K92484
$$ -74437 355145 -227805 191206 -68938 -97526 106493 -120374 348313 18168 310652
17339C10652g5237A77505K2252a48690c8421D44487F642K0390J8508e0857d013
$$ 310652 -75237 177505 199757 -148690 -38421 444487 6642 27032 45540 -50857 -4013
17327A49325J6331a78672A77092C1668a5473B87155A38344J95770J09184D1986
$$ 149325 165656 -178672 177092 31668 -15473 287155 138344 334114 443298 41986
17316C96713j79519n185J95178j88455m7008l3634b0059j45016B37408r7964J73863
$$ 396713 217194 212009 407187 218732 171724 138090 -20059 -165075 237408 139444 313307
17305C13307Q6510A95555q6245K42725k1037H9420L2719K6549L19179j60050c704
$$ 313307 399817 195555 109310 352035 330998 89420 122139 148688 467867 307817 -3704
17293G9688K50901j19249C3768a35581C29024d6531A21837L09957p8193J93166
$$ 79688 330589 211340 33768 -135581 329024 -46531 121837 431794 353601 546767
17283E46767B09534I155a334C39982A46638i3562B57202J29828j09358a9782A36832
$$ 546767 209534 9155 -1334 339982 146638 -93562 257202 387030 277672 -19782 136832
17271H4793l1583J92563a65244L6132B50978k9391K16243A99210L65041J43955
$$ 84793 53210 245773 -165244 -129112 250978 221587 437830 199210 564251 708206
17261G08206A16449O1047p5732O6767J38583a2973K995A13662b3443B77424n8440
$$ 708206 116449 177496 101764 168531 307114 -12973 -9978 113662 -23443 277424 218984
17250B18984r9311J3811O053O3710G3265K66589P2361A56018P8687J333n3352
$$ 218984 119673 133484 139537 203247 73265 339854 412215 156018 234705 236038 182686
17239A82686G5948L7846J66587M5175J01113j81108j4138j10589e7832E22666
$$ 182686 75948 113794 280381 325556 426669 245561 231423 120834 -57832 522666
17228E11954A22105J13294r6696Q1050j8061j6208n4099J39615J01073A05692
$$ 511954 122105 235399 138703 219753 201692 185484 131385 271000 372073 105692
17217B52844f1500h130I2030N5490L3638K32646H2268P4447P3757J66993h2501
$$ 252844 -61500 -8130 92030 147520 181158 413804 82268 156715 230472 397465 -82501
17205A2438K00939k6350J35783N4098q6081J29028Q1396k01387L9640L2731j09523
$$ 12438 213377 187027 322810 376908 290827 419855 501251 299864 339504 372235 262712
17194B62712L16173j37622B10933p8501L36046I5279C2609M32974j87022k7130
$$ 262712 578885 441263 210933 132432 468478 95279 32609 465583 278561 251431
17184B51431e894B90769H7756K53637F0650K82344f299D53528J22108j98971m1586
$$ 251431 -5894 290769 87756 341393 60650 342994 -6299 453528 575636 376665 335079
17173C35079j08093L1805R3361n9641J1592O7167A43565p614K40890r0585c8212
$$ 335079 226986 258791 352152 292511 304103 371270 143565 135951 376841 286256 -38212
17161C14706j37906J39362L96279j93184A93934J24167J34518Q9913A92603J15631
$$ 314706 176800 316162 712441 519257 193934 318101 452619 542532 192603 308234
17151C08234K62601j60051J8074A47989D5798M07144a19305D80572k35010J15374
$$ 308234 570835 410784 428858 147989 45798 452942 -119305 480572 245562 360936
17141C60936A16549K61971L13524k17849A29690J95876j3454j45402O5434K03371
$$ 360936 116549 378520 692044 474195 129690 325566 312112 166710 232144 435515
17131D35515q547o2676K01155j91110L1986j14100R017N8439K47046j77983j43690
$$ 435515 426968 364292 565447 374337 406323 292223 301240 359679 606725 428742 285052
17120B85052q3604J80852J82781k74018o8558G5088K86410a0655C16775M8729
$$ 285052 201448 382300 565081 291063 222505 75088 361498 -10655 316775 365504
17110C65504J02365j56676I1696L80731M2401R1256j97924J33671j53271J75670
$$ 365504 467869 311193 91696 472427 514828 606084 408160 541831 388560 564230
17100E64230j29718J60749j34304J67333l03149L74296k41450K67148A99867j2465
$$ 564230 434512 595261 460957 628290 325141 699437 457987 725135 199867 187402
17090A87402M06951j09377j00337j69921J547N08768j90959j89987m5415J54261
$$ 187402 594353 484976 384639 214718 216265 725033 534074 344087 298672 452933
17080D52933L24868C42143J60360j50741C5601O63294j43666k42679J37544P9330
$$ 452933 777801 342143 502503 351762 35601 698895 555229 312550 450094 529424
17070E29424K35839l63077J36123K01699l32763K99491k52876K11343m9408k95
$$ 529424 765263 402186 538309 740008 407245 706736 453860 665203 615795 615500
17060F15500o1803n5040L0574m3417L85874k05350k87598K90926j41702B43401
$$ 615500 553697 498657 529231 485814 871688 666338 378740 669666 527964 243401
17049A013115j23546k00542M7861k67386K85920k82581N2944J07283J32715j98420
$$ 1013115 889569 689027 736888 469502 755422 472841 525785 633068 765783 567363
17039E67363L15727k96959J25129K70506m24201J91686K30593k36829C16129N07158
$$ 567363 883090 586131 711260 981766 557565 749251 979844 743015 316129 823287
17029H23287k85611O0715o086j01886K00163J60414K93397j47569j97237j06460
$$ 823287 537676 598391 592305 490419 690582 850996 1144393 996824 799587 693127
17019F93127L4877J89126L057k05122K42653n9276l22577J68957o1572L00349
$$ 693127 728004 917130 920187 715065 957718 898442 575865 744822 683250 983599
17009I83599J56170l38287j49544J43846j91310K93995m6875R7430j3365j50075
$$ 983599 1139769 801482 651938 795784 604474 898469 851594 949024 935659 785584
16999G85584Q1905k8896j88206L77438k38649M9688J24409k84433J73981k0812
$$ 785584 867489 838593 650387 1027825 789176 838864 963273 678840 852821 832009
16989H32009N1360J12163j90463L9221K78508J72282k24678j05198j27183K53877
$$ 832009 883369 995532 805069 844290 1122798 1295080 1070402 965204 838021 1091898
16979A091898k13790R6673j28508r4038j468K18420L37925k91898J22381m11469
$$ 1091898 878108 974781 846273 752235 750767 969187 1307112 1015214 1137595 726126
16969G26126L02844J74456l86602J34993L28528Q9538l94036L64313k57271l14227
$$ 726126 1028970 1203426 816824 951817 1280345 1369883 975847 1340160 1082889 768662
16959G68662M20219k35551L03984j27286j8672j6895J13394j90081P9397J04293
$$ 768662 1188881 953330 1257314 1130028 1111356 1094461 1207855 1017774 1097171 1201464
16949A201464K48680j218j80815J58395n26535M35688k24255L71295m28887N48543
$$ 1201464 1450144 1448926 1268111 1426506 899971 1335659 1111404 1482699 1053812 1602355
16939A602355J1321k7027n9061j47099M6098p1230p5236K98324O173k49741l3470
$$ 1602355 1613676 1586649 1527588 1380489 1426587 1355357 1280121 1578445 1584618 1334877 1301407
16928A301407L33544j62268k98188N23202j62628R7591j73101J15521k28125M07989
$$ 1301407 1634951 1472683 1174495 1697697 1535069 1632660 1459559 1575080 1346955 1754944
16918A754944Q6065p5902k48458K32504m2676K16536j14669J56658k39491J01457
$$ 1754944 1841009 1765107 1516649 1749153 1706477 1923013 1808344 1965002 1725511 1826968
16908A826968M2393j42431l2876N03067n11023J58031k1806O28259m58982J67367
$$ 1826968 1869361 1726930 1694054 2197121 1686098 1844129 1822323 2450582 1991600 2158967
16898B158967k89010Q4470J48872l4567J72108l15915j54439K78823K00668k4280
$$ 2158967 1869957 1954427 2103299 2068732 2240840 1924925 1770486 2049309 2249977 2225697
16888B225697J89169n2866J08434P0190j28484M09769j28174k34558k47782N42387
$$ 2225697 2414866 2362000 2470434 2540624 2412140 2821909 2693735 2459177 2211395 2753782
16878B753782O429l51643N43360j20286J02510k90505L00343q1883J64824j92391
$$ 2753782 2760211 2408568 2951928 2831642 2934152 2643647 2943990 2862107 3026931 2834540
16868B834540j35014O03611k04586l14004L89294k68509K86840K18978Q094j29081
$$ 2834540 2699526 3303137 3098551 2784547 3173841 2905332 3192172 3411150 3419244 3290163
16858C290163Q4871k40474K88511K32462K27823o7536k08713n838K99537n0990
$$ 3290163 3375034 3134560 3423071 3655533 3883356 3815820 3607107 3601269 3900806 3849816
16848C849816K24180j17756j23025J83791K81673r9833J26443k08012J34983J09045
$$ 3849816 4073996 3956240 3833215 4017006 4298679 4198846 4325289 4117277 4252260 4361305
16838D361305L8416J13782O2592j79680N28635j0080J39131K75121n6881j87617
$$ 4361305 4399721 4513503 4576095 4396415 4925050 4914970 5054101 5329222 5272341 5084724
16828E084724J69844K25971J38213j18812L18903M7459l9497L80593J97935k88099
$$ 5084724 5254568 5480539 5618752 5499940 5818843 5866302 5826805 6207398 6405333 6117234
16818F117234K25547M99709K1481K59071k52833K8723N97403o4007J32663J01765
$$ 6117234 6342781 6842490 6863971 7123042 6870209 6898932 7496335 7432328 7564991 7666756
16808G666756L54911q103L95806J78458n0367R5798J56492M00823R6343J72139
$$ 7666756 8021667 8013564 8409370 8587828 8537461 8633259 8789751 9190574 9286917 9459056
16798I459056M70428j51046Q77414l71211K58150O04141J41227L50692M63684
$$ 9459056 9929484 9778438 10655852 10284641 10542791 11146932 11288159 11638851 12102535
16789A2102535p7609O61419L98504N03899j06759L82432M94116M37158Q38219
$$ 12102535 12024926 12686345 13084849 13588748 13481989 13864421 14358537 14795695 15633914
16780A5633914K3611M69421O25684K31265L77303Q00336N00802N96500P16007
$$ 15633914 15657525 16126946 16752630 16983895 17361198 18161534 18662336 19258836 19974843
16771A9974843M88615Q06836O44296R92399P28032Q36637J057506R58119Q13363
$$ 19974843 20463458 21270294 21914590 22906989 23635021 24471658 25529164 26487283 27300646
16762B7300646R00888J021825J330979J057120J282458J353520J479849J096345
$$ 27300646 28201534 29223359 30554338 31611458 32893916 34247436 35727285 36823630
16754C6823630K057371J132514K034468J987337J587661K149213K373478K600241
$$ 36823630 38881001 40013515 42047983 44035320 45622981 47772194 50145672 52745913
16746E2745913K068694K862278K633841L026366L174509L275099L826466L527647
$$ 52745913 54814607 57676885 60310726 63337092 66511601 69786700 73613166 77140813
16738G7140813M055521M154278M207894M844640M880276M540337N401326N665352
$$ 77140813 81196334 85350612 89558506 94403146 99283422 103823759 109225085 114890437
16730A14890437M920785O096323N603124N439750N288078N331786N094919M545798
$$ 114890437 119811222 125907545 131510669 136950419 142238497 147570283 152665202 157211000
16722A57211000M239989K962173L398625K259826J275712M41672m33485j157655
$$ 157211000 161450989 164413162 167811787 170071613 171347325 171788997 171355512 170197857
16714A70197857k087362k680439l543806m215524m152230m773389n580076n387257
$$ 170197857 168110495 165430056 161886250 157670726 153518496 148745107 143165031 137777774
16706A37777774n504654n754086n968564n651970n284054n395658m954504m892944
$$ 137777774 132273120 126519034 120550470 114898500 109614446 104218788 99264284 94371340
16698I4371340m803561m455821m323356l960152m195557l390902l280431l424953
$$ 94371340 89567779 85111958 80788602 76828450 72632893 69241991 65961560 62536607
16690F2536607l257240k387882l005294k418290k252883k385243k354592j918062
$$ 62536607 59279367 56891485 53886191 51467901 49215018 46829775 44475183 42557121
16682D2557121j752331j835858j079154j957216j539829j280223j350799j531304
$$ 42557121 40804790 38968932 37889778 35932562 34392733 33112510 31761711 30230407
16674C0230407j262823q08472j032992j222243q56038j211979j49629j141298
$$ 30230407 28967584 28159112 27126120 25903877 25047839 23835860 23686231 22544933
16666B2544933j056246k89042q53080o03043j036080n05016n36144m27037k80484
$$ 22544933 21488687 21199645 20346565 19743522 18707442 18202426 17666282 17239245 16958761
16657A6958761j111157l11598l50832l76099m52243l31093m76363l98255n82958
$$ 16958761 15847604 15536006 15185174 14809075 14356832 14025739 13549376 13151121 12568163
16648A2568163j94615j85337o93803J37991l43939o35584M7101O1888q33449m448
$$ 12568163 12373548 12188211 11494408 11632399 11288460 10652876 10699977 10761865 9928416 9923968
16638I923968l59148j28869m91169J32263k61311l09911j62833j22669k30721
$$ 9923968 9564820 9435951 8944782 9077045 8815734 8505823 8342990 8220321 7989600
16629G989600l06468J63260q68215J66597J44739l41234m21678M01991m71185
$$ 7989600 7683132 7846392 6978177 7144774 7289513 6948279 6526601 6928592 6457407
16620F457407J54649j85976l90641k99325M7979q4898n6338j66050o7954l01327
$$ 6457407 6612056 6426080 6035439 5736114 5784093 5699195 5642857 5476807 5408853 5107526
16610E107526N69041l18491l26395k20944R3719k53816k41219K51330m35339N32566
$$ 5107526 5676567 5358076 5031681 4810737 4904456 4650640 4409421 4660751 4225412 4757978
16600D757978l89403k00506K42031j54392j86612k80276L8547K11974k36082J29242
$$ 4757978 4368575 4168069 4410100 4255708 4069096 3788820 3827367 4039341 3803259 3932501
16590C932501o6328l18091J66135j27272k716o3948k81257K11633l16035K8486
$$ 3932501 3866173 3548082 3714217 3586945 3584229 3520281 3239024 3450657 3134622 3163108
16580C163108j52197Q2410q3247K5517k79944K85244l72840J93219m5160q3377
$$ 3163108 3010911 3093321 3010074 3035591 2755647 3040891 2668051 2861270 2816110 2732733
16570B732733j16154K75753m4585k76585J99638q9883k70494K36628M3582l81188
$$ 2732733 2616579 2892332 2847747 2571162 2770800 2680917 2410423 2647051 2690633 2309445
16560B309445m881J66851O3239j08099j53657k63504j54357N73257k94044k21971
$$ 2309445 2304564 2471415 2534654 2426555 2272898 2009394 1855037 2428294 2134250 1912279
16550A912279J5573J59733l2180j75390J88540r7436J12786P6752l24621K3031
$$ 1912279 1927852 2087585 2055405 1880015 2068555 1971119 2083905 2160657 1836036 1859067
16540A859067J50308l56664J04736J75715l73946K39753J0588j42574O7073P4431
$$ 1859067 2009375 1652711 1757447 1933162 1559216 1798969 1809557 1666983 1734056 1808487
16530A808487k77033J5491J77631m1484p9085N7050J82616p39752L65487j97916
$$ 1808487 1531454 1546945 1724576 1683092 1604007 1661057 1843673 1103921 1469408 1271492
16520A271492J15030n7663K82970k99762K86372o8165Q2965k61241l6909m37982
$$ 1271492 1386522 1328859 1611829 1312067 1598439 1530274 1613239 1351998 1315089 877107
16510H77107L08524K05633L7149j53988J60686k94567j69634L83481n3059o4414
$$ 877107 1185631 1391264 1428413 1274425 1435111 1140544 970910 1354391 1301332 1236918
16500A236918r9061r7602M75451m55232P819p0492J3546J10557M49213n61215
$$ 1236918 1137857 1040255 1515706 1060474 1068293 997801 1011347 1121904 1571117 1009902
16490A009902k19286J65345j7848r9961J02396Q3207Q8599k12608o3198M22298
$$ 1009902 790616 955961 938113 838152 940548 1023755 1112354 899746 836548 1258846
16480A258846j09219k39224k64243M63805l86268J87717J45057k61758r927L97733
$$ 1258846 1149627 910403 646160 1109965 723697 911414 1056471 794713 784786 1182519
16470A182519m46547J44543j08938j6559J52333j75323L55511l79107K47910O4128
$$ 1182519 735972 880515 771577 755018 907351 732028 1087539 708432 956342 1020470
16460A020470m19650P7964K07376r3547o3527J46750j0908j3119L2395j96235
$$ 1020470 600820 678784 886160 792613 729086 875836 864928 851809 884204 687969
16450F87969J13392j62187J84767k4920j89403J06259Q7988j84677L30106L9719
$$ 687969 801361 639174 823941 799021 609618 715877 803865 619188 949294 989013
16440I89013D91081L97769l19201J90377N1576l21111J31310B89433N58456l13594
$$ 989013 491081 888850 569649 760026 811602 490491 621801 289433 847889 534295
16430E34295j11708L82018q8826k48801N4874R8804q9484j08135O64504m02370
$$ 534295 422587 804605 715779 466978 521852 620656 531172 423037 1087541 685171
16420F85171p6049J34056l25521M3070L36861k16346k66482K87027J44256l32812
$$ 685171 609122 743178 417657 460727 797588 581242 314760 601787 746043 413231
16410D13231K32092k0725o8784p1721N717j92654K43383J18154j23464j42887
$$ 413231 645323 624598 555814 484093 489810 297156 540539 658693 535229 392342
16400C92342J83117j42262L20976l9097B44205K05846K12449k79981A06282M71178
$$ 392342 575459 433197 754173 715076 244205 450051 662500 382519 106282 577460
16390E77460l6097j22547J37179k17720J72975K8983l5601j74208J62111o1609
$$ 577460 541363 418816 555995 338275 511250 540233 504632 330424 492535 430926
16380D30926p5555n3400M03938l47665J21740J11861k38558J99321j83472K02290
$$ 430926 355371 301971 705909 358244 479984 591845 353287 552608 369136 571426
16370E71426J25515B02010K26381p6366j04769L14905n5224L3895J47845C26847
$$ 571426 696941 202010 428391 352025 247256 562161 506937 540832 688677 326847
16359A35580L17941j43875L44498l14838O7725F5801j3539M69303k57586R7628
$$ 135580 453521 309646 654144 339306 407031 65801 52262 521565 263979 361607
16349C61607N1351k4026L1816I0979J906J92800K44636k39972F2349L23903l6577
$$ 361607 412958 388932 420748 90979 92885 285685 530321 290349 62349 386252 349675
16338C49675K36697k73034M7316j28081J31038D8565J72207M64681B81278o6507
$$ 349675 586372 313338 360654 232573 363611 48565 220772 685453 281278 214771
16328B14771k2723J87306J01049o483B25824J44158o3478K4367J50469E6242L87149
$$ 214771 192048 379354 480403 473920 225824 369982 306504 330871 481340 56242 443391
16317D43391j69867A7654K84444K0892R5365n3066A34012k208P2784p4778K48419
$$ 443391 273524 17654 302098 322990 418355 365289 134012 131804 204588 129810 378229
16306C78229l8709C984Q2978L57671a21443D29694N7762j35661E8489K39509j04202
$$ 378229 339520 3984 86962 444633 -121443 429694 487456 351795 58489 297998 193796
16295A93796p8070K27653A56016J64261P295J46985j55598D799h5551B19563N1666
$$ 193796 115726 343379 156016 320277 327572 474557 318959 4799 -85551 219563 271229
16284B71229E9490M12024j39846P0031j53646b2909B98073L9484j9117a05737
$$ 271229 59490 471514 331668 401699 248053 -22909 298073 337557 318440 -105737
16273C04160G1956p665K43235L2038j43416m2781P3422M6826n9456J08219m7870
$$ 304160 71956 64291 307526 339564 196148 153367 226789 273615 214159 322378 274508
16262B74508F8294N0655N6123a21126B52499c9672B53756B4213c3395I1289J13835
$$ 274508 68294 118949 175072 -121126 252499 -39672 253756 24213 -33395 91289 205124
16251B05124b7404G9935F791K04292J20759a95408C46935j08307J56887d6414
$$ 205124 -27404 79935 6791 211083 331842 -195408 346935 238628 395515 -46414
16240A47300J15105H6839R3398c89A94849B5982J79810O7007K17016P4252B16827
$$ 147300 262405 86839 180237 -389 194849 25982 205792 272799 489815 564067 216827
16228A48748L4001a8404B19466J34997I5981J87457A16532i7027c622I5593A8089
$$ 148748 182749 -18404 219466 354463 95981 283438 116532 -97027 -3622 95593 18089
16216c56888A43642J73105E587P7237P2514P1401L5698e8997j17359R214j93451
$$ -356888 143642 316747 5587 82824 155338 226739 262437 -58997 -176356 -167142 -360593
16205c60593b4038B7312P6436J46290F782M32477H247e9132j63739a4355A12149
$$ -360593 -24038 27312 103748 250038 6782 439259 8247 -59132 -222871 -14355 112149
16193B73279b70675B06468J25450j59994o4046K64094p6510A5155c62511d1510
$$ 273279 -270675 206468 331918 171924 107878 371972 295462 15155 -362511 -41510
16182b20523A96610D3779J30842h4343B0017M03099A12267B723M5701K62541I6125
$$ -220523 196610 43779 174621 -84343 20017 423116 112267 2723 48424 310965 96125
16170E961a77408D05766a52202B03282M5332A712L73968k3072a42062L2374J6002
$$ 5961 -177408 405766 -152202 203282 248614 1712 375680 352608 -142062 -109688 -93686
16159i3686j17259B36072D6829P028J95072J78876d463B67309A22717D0144K49444
$$ -93686 -210945 236072 46829 53857 248929 427805 -4463 267309 122717 40144 289588
16148B89588I0668J64000D384d4035B12844a35303C1232c5395B67929d8963K28
$$ 289588 90668 254668 4384 -44035 212844 -135303 31232 -35395 267929 -48963 -48735
16137d8735j30991O9840B01186J56551i4709j26887e1102D21750n5004A28479
$$ -48735 -179726 -109886 201186 357737 -94709 -221596 -51102 421750 366746 128479
16126C13802a61493C96290a82326A12583J40164j19247K0562d887o6523A46107
$$ 313802 -161493 396290 -182326 112583 252747 133500 154062 -4887 -71410 146107
16115e2422B5960N1006b44369B76223p4908C5685d889l4981l4544F4916e4572
$$ -52422 25960 76966 -244369 276223 201315 35685 -4889 -39870 -74414 64916 -54572
16103a10153j62120a3497A70234K4334B675J29548b42056A38806Q8164d4069C46753
$$ -110153 -272273 -13497 170234 194568 2675 132223 -242056 138806 226970 -44069 346753
16091B48413k3967a53185f2359B8811J18758J43937I7245a70318F3339k745a37449
$$ 248413 224446 -153185 -62359 28811 147569 291506 97245 -170318 63339 60594 -137449
16079b75648b742A39108c3752B57974l4432a4938A2054b9658k10587P4666H6187
$$ -275648 -2742 139108 -33752 257974 223542 -14938 12054 -29658 -240245 -165579 86187
16067f7473B13149i1828A22501b00830j44585E6035a2571q6707C26974b53766
$$ -67473 213149 -91828 122501 -200830 -345415 56035 -12571 -99278 326974 -253766
16056C05141J57343e2236j92046A63387K9458J39985j06363m2643d6125B38588
$$ 305141 462484 -52236 -244282 163387 192845 332830 226467 183824 -46125 238588
16045g0572A77509F9708J87985F5415f8075A65666c32437B41128d5709j04302
$$ -70572 177509 69708 257693 65415 -68075 165666 -332437 241128 -45709 -150011
16035a50011O1074G8373d8767l14066g4630A41490L4320J33994a16843A08705
$$ -150011 -88937 78373 -48767 -362833 -74630 141490 175810 309804 -116843 108705
16024B02334F5208i5347E9609P5410m7207F379a74143A94817H7303b69185J11170
$$ 202334 65208 -95347 59609 135019 87812 6379 -174143 194817 87303 -269185 -158015
16013a58015m3628D78977k04273g3586m7344A00323a98514B56969E7581B623f202
$$ -158015 -201643 478977 274704 -73586 -120930 100323 -198514 256969 57581 2623 -6202
16001c87127a87920b4788F877b6881j11685M9604k2492B339a02816a5186j29332
$$ -387127 -187920 -24788 6877 -26881 -138566 -88962 -111454 2339 -102816 -15186 -144518
15990a44518B72247j01744K30388A18813K02980R2568P2888B32125Q0833L6822
$$ -144518 272247 170503 400891 118813 321793 414361 487249 232125 312958 349780
15980C49780a8306A80616B1251f7505C5982R1048Q85d05109b9931j63550M4664
$$ 349780 -18306 180616 21251 -67505 35982 127030 127915 -405109 -29931 -193481 -148817
15969a48817Q891d5326B10374I7148l1626J05190g2991C29118c00865h880A21366
$$ -148817 -139926 -45326 210374 97148 65522 170712 -72991 329118 -300865 -8880 121366
15957a0690n9207A38158i9399j35913O3139q3651r4048D3500a3796A81506K019
$$ -10690 -69897 138158 -99399 -235312 -172173 -255824 -349872 43500 -13796 181506 183525
15946A83525B8535J83983a03858A01303c93200J85045A5235a19322D82a20243
$$ 183525 28535 212518 -103858 101303 -393200 -208155 15235 -119322 482 -120243
15935a60063D0856b1115k15308J3579A02657f2387A35029a90400B3701c9407H7227
$$ -160063 40856 -21115 -236423 -222844 102657 -62387 135029 -190400 23701 -39407 87227
15923a69486A25797l798J0833a58179B72488M9628j24843o9394n4133b43632B92246
$$ -169486 125797 121999 132832 -158179 272488 322116 197273 127879 73746 -243632 292246
15911a61094E5790b08796n7049g9727j35275n5126E0936a80198A01705g6889k46222
$$ -161094 55790 -208796 -265845 -79727 -215002 -270128 50936 -180198 101705 -76889 -323111
15900c23111P6345a14954K8436a5153I9944K2071J30496D1512K47703b97914F2963
$$ -323111 -246766 -114954 -86518 -15153 99944 122015 252511 41512 289215 -297914 62963
15888a16605r924L0895A73738n4924B824M2198P8285o233b0549k16059A54357
$$ -116605 -126529 -95634 173738 118814 2824 45022 123307 117074 -20549 -236608 154357
15876B84300b03846m1241P3092j07774A23365h4064n4831O6720p0145O8476m659
$$ 284300 -203846 -245087 -171995 -279769 123365 -84064 -138895 -72175 -142320 -73844 -78503
15865g8503B34181b41695a13562I8325a53511A07568l1813l6296K47980A19605
$$ -78503 234181 -241695 -113562 98325 -153511 107568 75755 39459 287439 119605
15854A28354d5557A45186k6258j6626j1080i7226k0765E673a52882J242A04037
$$ 128354 -45557 145186 118928 102302 91222 -97226 -117991 5673 -152882 -151640 104037
15842G6380j7401k6504K68953i3981B69677H7959J6755m504B4596a92135o5801
$$ 76380 58979 32475 301428 -93981 269677 87959 104714 100210 24596 -192135 -257936
15831b57936P9460K1328p9512n5829M5163A23724C644a96398I6184b0004j51173
$$ -257936 -178476 -157148 -236660 -292489 -247326 123724 3644 -196398 96184 -20004 -171177
15820a71177C5223b10082c4209F7734J11661l7926a58758j44394a36634L8060
$$ -171177 35223 -210082 -34209 67734 179395 141469 -158758 -303152 -136634 -98574
15810i8574j10699A05548M2846c19026a07541L1246K4083j15376A98634b30010
$$ -98574 -209273 105548 148394 -319026 -107541 -76295 -52212 -167588 198634 -230010
15799b03315i4422B3854M6983c8554A34154l478c08679A80239b30392a826A76999
$$ -203315 -94422 23854 70837 -38554 134154 130676 -308679 180239 -230392 -1826 176999
15787a6026j53551A23171h5844c3258r5136j1675B25690b21623K1072A61019B4818
$$ -16026 -169577 123171 -85844 -33258 -128394 -140069 225690 -221623 -200551 161019 24818
15775h1138l53527F3471a43868j5791r1565F17J77313c47670A7512b47104e036
$$ -81138 -434665 63471 -143868 -159659 -251224 617 177930 -347670 17512 -247104 -5036
15763B15695n9986F2497J33041n5853h7567I8224c60652A89868L9340B4965a44550
$$ 215695 155709 62497 195538 139685 -87567 98224 -360652 189868 229208 24965 -144550
15751h0932B52374a42704d8120k08245A44635i745A68387J00739p6651a78484
$$ -80932 252374 -142704 -48120 -256365 144635 -9745 168387 269126 192475 -178484
15740a02558j97185D325J07273k1998a03843k22705J26618M9238f3699D5537Q535
$$ -102558 -299743 4325 111598 89600 -103843 -326548 -199930 -150692 -63699 45537 54072
15729E4072b25429g1161B6442J35460a99988e5725H6781C1043e8694C54571D9358
$$ 54072 -225429 -71161 26442 161902 -199988 -55725 86781 31043 -58694 354571 49358
15717B64046D8925d36724I5488a30179m6397A47829a97873g9205j7179a3062A0124
$$ 264046 48925 -436724 95488 -130179 -176576 147829 -197873 -79205 -96384 -13062 10124
15705F344b14226k94693G1882a46265C0779b37478A98241b56013e7673B37881
$$ 6344 -214226 -508919 71882 -146265 30779 -237478 198241 -256013 -57673 237881
15694a2659B43741p3706g7221A51417L2704a4200D9434f9537j62909N0292A60537
$$ -12659 243741 170035 -77221 151417 184121 -14200 49434 -69537 -232446 -182154 160537
15682I1849J55185j09604a24210H6719J96516I8278f5133j72514R309A419J48700
$$ 91849 247034 137430 -124210 86719 283235 98278 -65133 -237647 -228338 1419 150119
15671A50119f588A99850J23450p194a14240k38909h540H4950i4653I5716b89801
$$ 150119 -6588 199850 323300 316106 -114240 -353149 -8540 84950 -94653 95716 -289801
15659a1677k37730a22194j83610A5731J14580o2097J02108e9458o6471a6995j52772
$$ -11677 -249407 -122194 -305804 15731 130311 68214 170322 -59458 -125929 -16995 -169767
15648a69767e0791j33758J1423A2860h1700n6225C4032K68170f1060A73694n4989
$$ -169767 -50791 -184549 -173126 12860 -81700 -137925 34032 302202 -61060 173694 118705
15637A18705m949o954a99768B552i0038I2392e78571F0779J94961c6380m9823
$$ 118705 113756 106802 -199768 2552 -90038 92392 -578571 60779 255740 -36380 -86203
15626h6203A81599p5158L3218a73523a4164A56218K96828c1291E6195a43733n5199
$$ -86203 181599 106441 139659 -173523 -14164 156218 453046 -31291 56195 -143733 -198932
15615a98932K5216j89336J71213g9180o7397G5334j9302d47337J86032a22136
$$ -198932 -173716 -363052 -191839 -79180 -146577 75334 56032 -447337 -261305 -122136
15604i2902d2030r5895B22658a43387J9939J4088c544l8602p7133A92502a59916
$$ -92902 -42030 -137925 222658 -143387 -123448 -109360 -3544 -42146 -119279 192502 -159916
15592g0855C4224J01204l1022Q0082n9584K9778a82008g4882G3516J8126K04890
$$ -70855 34224 135428 104406 184488 124904 154682 -182008 -74882 73516 91642 296532
15581B96532k6281d057E6984b94120A68973b02172R9265A73751C7702J37397d04613
$$ 296532 270251 -4057 56984 -294120 168973 -202172 -102907 173751 37702 175099 -404613
15569a7961k99659a3371A4824J09657a1905F8016f3794r1940K3935F0926J7570
$$ -17961 -317620 -13371 14824 124481 -11905 68016 -63794 -155734 -131799 60926 78496
15558G8496Q8138b08666K7690b7514C0974L5581J11696p4271K04644D6130a09225
$$ 78496 166634 -208666 -180976 -27514 30974 66555 178251 103980 308624 46130 -109225
15546G0453M6301a50093L6281C38167a86851A82114i2136C4602K02131A8997N3220
$$ 70453 116754 -150093 -113812 338167 -186851 182114 -92136 34602 236733 18997 72217
15535G2217J07053p5744b45999e4891A26505E989b56172l0581E5173a1104l34151
$$ 72217 179270 103526 -245999 -54891 126505 5989 -256172 -286753 55173 -11104 -345255
15524c45255A69086m4466A0859c48100G1355h7447B47600a41212F1201N6161c61691
$$ -345255 169086 124620 10859 -348100 71355 -87447 247600 -141212 61201 117362 -361691
15512B24893a20537j37459B71091A04639a37349K4610B49522p0496b8048A7495
$$ 224893 -120537 -257996 271091 104639 -137349 -112739 249522 179026 -28048 17495
15501I9955d0675H3799a10197e5067p0285o8764B22999b70159f0852D78a20657
$$ 99955 -40675 83799 -110197 -55067 -125352 -194116 222999 -270159 -60852 478 -120657
15489H8369q015r407a07943r0073C46928b3830A06141i5301J8019E7372a01291
$$ 88369 80354 70947 -107943 -198016 346928 -23830 106141 -95301 -77282 57372 -101291
15477A21284d01101a20216K5451E4283N7795i8354M0096k18720R4953N0502l50086
$$ 121284 -401101 -120216 -94765 54283 112078 -98354 -58258 -276978 -182025 -131523 -481609
15466d81609A34467b68688F1751J74527d1084E9508R58L12676b4880A67581A1295
$$ -481609 134467 -268688 61751 236278 -41084 59508 60466 373142 -24880 167581 11295
15454G706a13936C37012A3990L83800A47360B4796L0418J97048g4898q5394A4718
$$ 7706 -113936 337012 13990 397790 147360 24796 55214 252262 -74898 -160292 14718
15442F0434N9344o322m3326h1870b6521m9061q8234n9991D6980c2114A58239j2941
$$ 60434 119778 113456 70130 -81870 -26521 -75582 -163816 -223807 46980 -32114 158239 145298
15430A45298A2795c1520A19840P6890p8850e1013r030B2844L5093K084M8459A3093
$$ 145298 12795 -31520 119840 196730 117880 -51013 -60043 22844 57937 60021 108480 13093
15417a06155o7980D2134a20547b077j5407l2571j25315l1816B44266K3513j12549
$$ -106155 -174135 42134 -120547 -2077 -17484 -50055 -175370 -207186 244266 267779 155230
15406A55230b68753a19707E641c02676a26334a519j64252A54288A2046e8983A6090
$$ 155230 -268753 -119707 5641 -302676 -126334 -1519 -165771 154288 12046 -58983 16090
15394D0970M5643J90340H5303c30491A97335e1299H7469a18689j33891D3903K02569
$$ 40970 86613 276953 85303 -330491 197335 -51299 87469 -118689 -252580 43903 246472
15383B46472j05561a94185a4514k2252B01b43919k9693G3268K49161C2263Q1768
$$ 246472 140911 -194185 -14514 -36766 201 -243919 -273612 73268 322429 32263 114031
15372A14031b38090A83125J92835c5191A97211d7117k03177A69535a97705Q7714
$$ 114031 -238090 183125 375960 -35191 197211 -47117 -250294 169535 -197705 -109991
15362a09991a7547m8768A05357a31799G9672a22048A57313b99014D30803j69308
$$ -109991 -17547 -66315 105357 -131799 79672 -122048 157313 -299014 430803 261495
15352B61495A00921L1816E5773J1186K35936r6254m2448J2873d0958A31367a90818
$$ 261495 100921 132737 55773 66959 302895 206641 164193 177066 -40958 131367 -190818
15340D7366a6310m1957A54991a6548p9263A71112E9253a8315e738B25276g2744
$$ 47366 -16310 -58267 154991 -16548 -95811 171112 59253 -18315 -5738 225276 -72744
15328I1551j3229K27738j28508J7248a58426Q109M1643I5919d33689B00641a59637
$$ 91551 78322 306060 177552 194800 -158426 -150317 -108674 95919 -433689 200641 -159637
15316D9317b32346J0220P7417l3490A70380D7467c3917C3230b7023A98205B690
$$ 49317 -232346 -222126 -144709 -178199 170380 47467 -33917 33230 -27023 198205 2690
15304E0702i8265A41639e1267A82426q4871a24846A30852f1156j32603R569B4251
$$ 50702 -98265 141639 -51267 182426 97555 -124846 130852 -61156 -193759 -184190 24251
15292A3622b97253B99390i967A29122i1208A22111A6896d2394A63281h8211A77768
$$ 13622 -297253 299390 -9967 129122 -91208 122111 16896 -42394 163281 -88211 177768
15280A41661a5249p3352E4815K48743b55641C9927J74869b4176A37384k5153o992
$$ 141661 -15249 -88601 54815 303558 -255641 39927 214796 -24176 137384 112231 105239
15269A05239b2390C7259b58211A11633c10199B34115c10462h972E6745K99127
$$ 105239 -22390 37259 -258211 111633 -310199 234115 -310462 -8972 56745 355872
15259C55872C5643K27632N6574G9763L20244a20639C63148K4963j71474M26254
$$ 355872 35643 263275 319849 79763 400007 -120639 363148 388111 216637 642891
15249F42891L21031L31552p7527J20485l72816k91105B98120A19900b06418L9992
$$ 642891 963922 1295474 1217947 1338432 965616 674511 298120 119900 -206418 -166426
15239a66426h2304C14086f5155A90108a90103C765Q8998e3060j43383E2604N0790
$$ -166426 -82304 314086 -65155 190108 -190103 3765 92763 -53060 -196443 52604 103394
15228A03394Q1726J15652I833J67332b65204E7924F037M9179L5809c02013d2063
$$ 103394 185120 300772 9833 177165 -265204 57924 6037 55216 91025 -302013 -42063
15216d2525L22k0183q0072A4561L22761B8545M365L86854a12866E5452J34057
$$ -42525 -42203 -62386 -142458 14561 337322 28545 32910 419764 -112866 55452 189509
15205A89509a74498B7020h8094F14744f847A44786K93702c8585k1735A0953a80800
$$ 189509 -174498 27020 -88094 614744 -6847 144786 438488 -38585 -60320 10953 -180800
15193c62820D35512A85404a2868o2813o3713A64078L0844K16899D8537b1543j13269
$$ -362820 435512 185404 -12868 -75681 -139394 164078 194922 411821 48537 -21543 -134812
15182a34812F881K69254E8050J22213g7376A59451A4204K82875b98901Q7506B24494
$$ -134812 6881 276135 58050 180263 -77376 159451 14204 297079 -298901 -211395 224494
15170b87289F5791P5908n208M3962q7841D4304b45182d0911l5478A26685J42728
$$ -287289 65791 141699 136491 180453 92612 44304 -245182 -40911 -76389 126685 269413
15159B69413q2625B8929c5503B40380b43457J03428A92829f7984B04004L20974
$$ 269413 186788 28929 -35503 240380 -243457 -140029 192829 -67984 204004 524978
15149E24978G5733b54194D7614h5927K2745l9797j63946B65514I1968K13669C0447
$$ 524978 75733 -254194 47614 -85927 -63182 -102979 -266925 265514 91968 305637 30447
15137C32835D9270N8726j5370N2244d6644B10873a71487f7583A13427a9284B1266
$$ 332835 49270 107996 92626 144870 -46644 210873 -171487 -67583 113427 -19284 21266
15125A35983j7647C3468A1675K35409G0883L22118J06983a9437A80259a41072
$$ 135983 118336 33468 11675 247084 70883 393001 499984 -19437 180259 -141072
15114B04931c4767A91064c40502A13331J35226D7911C283J54485l4486J96614
$$ 204931 -34767 191064 -340502 113331 248557 47911 3283 157768 123282 319896
15104C19896a48796B87622j08198a08578C09677O6991A16535J41863g5018A77641
$$ 319896 -148796 287622 179424 -108578 309677 376668 116535 258398 -75018 177641
15093A10732c6327b496A74075j8582f3743G916N3879J03623a29758D5126a7634
$$ 110732 -36327 -2496 174075 155493 -63743 7916 61795 165418 -129758 45126 -17634
15081A17176k7901J44196L24283A80686n0019n628M9686G7209K24891o3176B3022
$$ 117176 89275 233471 557754 180686 130667 125039 174725 77209 302100 238924 23022
15069A88813K99373e6113A7717K16311j02825m9830B3773L09916A63015E4183
$$ 188813 488186 -56113 17717 234028 131203 81373 23773 333689 163015 54183
15058B36691B7786K87940B6509g6762L6008p5901A23261L60161A58994J40471
$$ 236691 27786 315726 26509 -76762 -40754 -116655 123261 483422 158994 299465
15048B99465F1173d9756C2293L17072A08263M6998L35974k35434e9060C89335
$$ 299465 61173 -49756 32293 349365 108263 155261 491235 255801 -59060 389335
15037F9688J06656N6678b3673C78063M401q9400k9742Q6663A48427J83401j27463
$$ 69688 176344 233022 -23673 378063 382464 293064 263322 349985 148427 331828 204365
15026B04365Q9060G9599J89669J65604j28862A27073J32139K9695A38349a1560
$$ 204365 293425 79599 269268 434872 306010 127073 259212 288907 138349 -11560
15015B35151j11447n9962K97580k6526o4526h0569B96242M8369b78723B91628
$$ 235151 123704 63742 361322 334796 270270 -80569 296242 344611 -278723 291628
15004A00441d3241A25169c95032B0241L50615q1676A21871a98440B30056K58762
$$ 100441 -43241 125169 -395032 20241 370856 289180 121871 -198440 230056 488818
14994D88818G9414f1577m4187H6429K15407a8210B46162E5674b2400A00790R8564
$$ 488818 79414 -61577 -105764 86429 301836 -18210 246162 55674 -22400 100790 199354
14983A99354L759J17002l7300L8655K2899F7615M13553j30444N172J55434A68996
$$ 199354 203113 320115 282815 321470 344369 67615 481168 350724 355896 511330 168996
14971A75531k2756l1097J23178k7403L4995N0576A48592C0308K63961K04735B03503
$$ 175531 152775 121678 244856 217453 252448 303024 148592 30308 294269 499004 203503
14959a6301B98067K89188B69811l6570O2952A13872E6059J34251J23625J14251
$$ -16301 298067 587255 269811 233241 296193 113872 56059 190310 313935 428186
14949D28186p5173A58807p545J06475O0993j21635L36316k52156A4706K00597
$$ 428186 353013 158807 151262 257737 318730 197095 533411 281255 14706 215303
14939B15303k4585J7421K14617C1253K64239J045L747j36204j4913K87854j3919
$$ 215303 190718 208139 422756 31253 295492 296537 300284 164080 149167 437021 423102
14928D23102l9042p7653j05526J86115M6987j37531j03605K56464j58250d2791
$$ 423102 384060 306407 200881 386996 433983 296452 192847 449311 291061 -42791
14917F6472L30813C9792K17889c5287B77854P182q3768J00429K2548J7675M6645
$$ 66472 397285 39792 257681 -35287 277854 285036 201268 301697 324245 341920 388565
14906C88565r6515B5257J97395E0967J0467N25535k30951l6441E5081K8762O2578
$$ 388565 292050 25257 222652 50967 61434 586969 356018 319577 55081 83843 146421
14895A46421L54067L604G9920L40625j94480F0300K16297m6175J09152H5544K92689
$$ 146421 500488 504092 79920 420545 226065 60300 276597 230422 339574 85544 378233
14884C78233A13403L29497j42717H9353K31804q230L04661C03081K18593B15004
$$ 378233 113403 442900 300183 89353 321157 312927 617588 303081 521674 215004
14873E46921j82654l0581P5675j01851M6254j61037E8537K65001J3613J2729A35756
$$ 546921 364267 333686 409361 307510 353764 192727 58537 323538 337151 349880 135756
14861C58770j27862K8696K32493J8775H7666M07614b1577D82757J2696q1004A78884
$$ 358770 230908 259604 492097 510872 87666 495280 -21577 482757 495453 414449 178884
14849D54079M84260C33137L88920k63498J3441Q5417J07165k79824m8210j10694
$$ 454079 938339 333137 722057 458559 472000 557417 664582 384758 336548 225854
14839B25854L94255B88667J46630R1674r575K44465l51774Q975j23238I0535P07847
$$ 225854 620109 288667 435297 526971 517396 761861 410087 419062 295824 90535 798382
14828G98382l11102J7116j86632G7620L93982Q7937M4089J15687P0453B03223
$$ 798382 487280 504396 317764 77620 471602 559539 603628 719315 789768 203223
14817E92179j34874J25809j8868O6923j76423J26539B38445M17308M5218J559
$$ 592179 457305 583114 564246 631169 454746 581285 238445 655753 700971 702530
14807G02530l04862J28577M33948C89517J55775n7267M23655D51421J17112A59908
$$ 702530 397668 526245 960193 389517 545292 488025 911680 451421 568533 159908
14796B30168J07272J54457K99170B36300I6160O76728k0854J17389k03758l13761
$$ 230168 337440 491897 791067 236300 96160 772888 752034 869423 665665 351904
14786C51904K14186M1797J10636J07761l75285j74419M13994j94770M66003j76231
$$ 351904 566090 607887 718523 826284 450999 276580 690574 495804 961807 785576
14776G85576j59046p4800K30086j5968C61141L32156K6428n4574M6077J76959
$$ 785576 626530 551730 781816 765848 361141 693297 719725 665151 711228 888187
14766H88187j72664l717k63298J57505M4685J91412k77556L4344K74019D09107
$$ 888187 715523 711806 448508 606013 650698 842110 564554 598898 872917 409107
14755H80601k77015k6239L12818D34642J56979K74069q3737k9249j90561K08274
$$ 880601 603586 577347 890165 434642 591621 865690 781953 752704 562143 770417
14745G70417j46013J75810l15951K70597j77581L74860o5216m2744j08296j23060
$$ 770417 624404 800214 484263 754860 577279 952139 886923 844179 735883 612823
14735F12823L74545k46116K8054Q4895j54518J39162J77362k95681n3895R4507
$$ 612823 987368 741252 769306 854201 699683 838845 1016207 720526 666631 761138
14725G61138l7049n5483J95129j09381K11941k5228k8541J83604k99752J90673
$$ 761138 724089 668606 863735 754354 966295 941067 912526 1096130 796378 987051
14715I87051l41673n9395J96842L87729k32093O2104j59543Q9018m6449j68194
$$ 987051 645378 585983 782825 1170554 938461 1000565 841022 930040 883591 715397
14705G15397K95348J63915E06306M99051q8466k04472L15207j9155k29090J17492
$$ 715397 1010745 1174660 506306 1005357 916891 712419 1027626 1008471 779381 896873
14695H96873K10840L20831k57608p6084k06588j25576R631J73030k90380M60835
$$ 896873 1107713 1428544 1170936 1094852 888264 762688 772319 945349 654969 1115804
14685A115804K00234m22314L1940p4127k800N6670J0585q2911R8027L69993k96126
$$ 1115804 1316038 893724 925664 851537 848737 905407 915992 833081 931108 1301101 1004975
14674A004975O0958j21591P2889P7828l1072Q6969j33013J6986K58776q9321j46603
$$ 1004975 1065933 944342 1017231 1095059 1063987 1150956 1017943 1034929 1293705 1204384 1057781
14663A057781l79088L94297L7441R361k32971L62483j28951J39967J6409k96566
$$ 1057781 678693 1072990 1110431 1119792 886821 1249304 1120353 1260320 1276729 980163
14653I80163K55102k32878j94891O78131m65644M72529k49536o6360J27747q7793
$$ 980163 1235265 1002387 807496 1485627 1019983 1492512 1242976 1176616 1304363 1216570
14643A216570k22856L51537p9885J52742N7689j64634K78108k73333M45573k73198
$$ 1216570 993714 1345251 1265366 1418108 1475797 1311163 1589271 1315938 1761511 1488313
14633A488313o98898L74246L7297j7338K91416o857m7911p8400J77309K652j67968
$$ 1488313 789415 1163661 1200958 1183620 1475036 1468179 1420268 1341868 1519177 1521829 1353861
14622A353861K40994k1565K09433j87575q1964J21831k26433j22563L06584k04296
$$ 1353861 1594855 1573290 1782723 1595148 1513184 1635015 1408582 1286019 1592603 1388307
14612A388307K88735l12905J3326K95145J06366j70481r0294K26101j37396n9397
$$ 1388307 1677042 1364137 1377463 1672608 1778974 1608493 1518199 1744300 1606904 1547507
14602A547507K90364l144m04101J72443L56199p1369j6613L25956m34546K78279
$$ 1547507 1837871 1834727 1430626 1603069 1959268 1887899 1871286 2197242 1762696 2040975
14592B040975j30132K74929n18807K45023P5672k33615M01408j23136j01081J7474
$$ 2040975 1910843 2185772 1666965 1911988 1987660 1754045 2155453 2032317 1931236 1948710
14582A948710R6373o8777P7131L807m3862m5985N9214J87279M65157q02037N43773
$$ 1948710 2045083 1976306 2053437 2057244 2013382 1967397 2026611 2213890 2679047 1877010 2420783
14571B420783l00804J36016L65449k18991O6992j46428P7383J42380K02332q0309
$$ 2420783 2119979 2255995 2621444 2402453 2469445 2323017 2400400 2542780 2745112 2664803
14561B664803J89239l02159Q47510l90003J75546n0487J13523N24429n7291O76559
$$ 2664803 2854042 2551883 3399393 3009390 3184936 3134449 3247972 3772401 3715110 4391669
14551D391669M44999J340375J560020M311590R254971J7659791M750051j9722148
$$ 4391669 4836668 6177043 7737063 12048653 21303624 38963415 43713466 23991318
14543B3991318A0978726E276386k201742m38069r01063L66783k05649L38753l57697
$$ 23991318 10978726 5276386 3074644 2636575 1735512 2102295 1896646 2235399 1877702
14534A877702L58413j1706M5604J30947l7230n1635J20377k22418K10379J24092
$$ 1877702 2236115 2224409 2270013 2400960 2363730 2312095 2432472 2210054 2420433 2544525
14524B544525J0390k33769Q6622M54430l49627J04138P6756o890K91595k12819
$$ 2544525 2554915 2321146 2407768 2862198 2512571 2616709 2693465 2686575 2978170 2765351
14514B765351J96455J3144k82657J49684k3502J61111k4325k1057L08788k40938
$$ 2765351 2961806 2974950 2692293 2841977 2818475 2979586 2955261 2934204 3242992 3002054
14504C002054N24417m81204K81762j75223n1894L20843l04344K95664L0206n5260
$$ 3002054 3526471 3045267 3327029 3151806 3099912 3420755 3116411 3412075 3442281 3387021
14494C387021K06201l27639N58260l34226J83769l04087L22613k09832M64343
$$ 3387021 3593222 3265583 3823843 3489617 3673386 3369299 3691912 3482080 3946423
14485C946423N0332j5262l48758L92619m01216M56578M2691m16325L23001q823
$$ 3946423 3996755 3981493 3632735 4025354 3624138 4080716 4123407 3707082 4030083 4021260
14475D021260p322L8119K15184J71027k88857N19611k07767j0191L68211j65647
$$ 4021260 4013938 4052057 4267241 4438268 4149411 4669022 4461255 4451064 4819275 4653628
14465D653628J16499J50694o4409M33932l96565J09157L8255K91341J6402j62839
$$ 4653628 4770127 4920821 4856412 5290344 4893779 5002936 5041191 5332532 5348934 5186095
14455E186095P1404J38616L88341m31071M82763l03179J33763P9421O5961j41734
$$ 5186095 5257499 5396115 5784456 5353385 5836148 5532969 5666732 5746153 5812114 5670380
14445E670380K28661K7937o3801L83653Q4370Q2640J90957p326p6317L9037K16953
$$ 5670380 5899041 5926978 5863177 6246830 6331200 6413840 6604797 6597471 6521154 6560191 6777144
14434F777144J73707j02976L66969j60515M8794M99603j92185K71416j87410L85262
$$ 6777144 6950851 6847875 7214844 7054329 7103123 7602726 7410541 7681957 7494547 7879809
14424G879809p1312q1137L88052J07608L02092k93958L30561J11665L56153j97753
$$ 7879809 7808497 7727360 8115412 8223020 8525112 8231154 8561715 8673380 9029533 8831780
14414H831780R9844J43398K84814j63071K50355K38374L7959J50363K28190K42406
$$ 8831780 8931624 9075022 9359836 9196765 9447120 9685494 9723453 9873816 10102006 10344412
14404A0344412P3214j2577M69823j24601L47541K41945j44774M81271J37343O2942
$$ 10344412 10417626 10405049 10874872 10750271 11097812 11339757 11194983 11676254 11813597 11876539
14394A1876539K591K00007O60024o3176M29955P6464J06135N91681j58931K20055
$$ 11876539 11879130 12079137 12739161 12675985 13105940 13182404 13288539 13880220 13721289 13941344
14384A3941344L67597K00807K17017M40213J39891O3247M52587M73364M21492
$$ 13941344 14308941 14509748 14726765 15166978 15306869 15370116 15822703 16296067 16717559
14375A6717559K82724K34165N26591q834O28096L24302N02138K81214J88148M42787
$$ 16717559 17000283 17234448 17761039 17752205 18380301 18704603 19206741 19487955 19676103 20118890
14365B0118890M74124K88795O59622L92422O84705N05732K21517N62260J048572
$$ 20118890 20593014 20881809 21541431 21933853 22618558 23124290 23345807 23908067 24956639
14356B4956639K51494L28672O17494N13002Q77793L66472Q09743P66803O34556
$$ 24956639 25208133 25536805 26154299 26667301 27545094 27911566 28721309 29488112 30122668
14347C0122668Q45543O31650R65367J106788P03932O55965R24228J051174J422420
$$ 30122668 30968211 31599861 32565228 33672016 34375948 35031913 35956141 37007315 38429735
14338C8429735O86842R10153J449277R12846J404082J274757J433637J256203
$$ 38429735 39116577 40026730 41476007 42388853 43792935 45067692 46501329 47757532
14330D7757532J543217J530398J230293J735380K083281J576435J855940K073993
$$ 47757532 49300749 50831147 52061440 53796820 55880101 57456536 59312476 61386469
14322F1386469J945737K503585K179491K504147K879213K191576K935998L055030
$$ 61386469 63332206 65835791 68015282 70519429 73398642 75590218 78526216 81581246
14314H1581246L213223L011581L331373L752789M009265L756081M465481M333867
$$ 81581246 84794469 87806050 91137423 94890212 98899477 102655558 107121039 111454906
14306A11454906M875310M974650N382115N666985N829723O285077O740818P401047
$$ 111454906 116330216 121304866 126686981 132353966 138183689 144468766 151209584 158610631
14298A58610631P078089P808586Q575468Q594732R482262R558370J0341513J0730725
$$ 158610631 165688720 173497306 182072774 190667506 200149768 209708138 220049651 230780376
14290B30780376J1458871J1675345J2683196J2674895J3633756J3639553J4036095
$$ 230780376 242239247 253914592 266597788 279272683 292906439 306545992 320582087
14283C20582087J4101190J4658290J4654476J4111321J4056549J3762232J2889716
$$ 320582087 334683277 349341567 363996043 378107364 392163913 405926145 418815861
14276D18815861J2033341J0284657Q972772N094226K367437K98150p78838p49322
$$ 418815861 430849202 441133859 450106631 455200857 457568294 457866444 457087606 456338284
14268D56338284m015158k500254l630529o972938r582644j1097365j2331356j3533657
$$ 456338284 452323126 449822872 446192343 439219405 429636761 418539396 406208040 392674383
14260C92674383j4202578j4662732j4965822j5149505j5373675j4212453j4144397
$$ 392674383 378471805 363809073 348843251 333693746 318320071 304107618 289963221
14253B89963221j4006134j3143709j2691261j2338049j1234299j1180517j0566769
$$ 289963221 275957087 262813378 250122117 237784068 226549769 215369252 204802483
14246B04802483r680466r200796q555351q085959q309133p018691o992258o863858
$$ 204802483 195122017 185921221 177365870 169279911 160970778 153952087 146959829 140095971
14238A40095971n825838n496522n495430n398734n101876m571933m225562l668552
$$ 140095971 134270133 128773611 123278181 117879447 112777571 108205638 103980076 100311524
14230A00311524m212922l842728l732410l291591l398016l021080k782362k745200
$$ 100311524 96098602 92255874 88523464 85231873 81833857 78812777 76030415 73285215
14222G3285215k409498k540214k095724k374641j993846k348066j968287j643013
$$ 73285215 70875717 68335503 66239779 63865138 61871292 59523226 57554939 55911926
14214E5911926j512881j251304k172303j302419j446614j519797j166543o88487
$$ 55911926 54399045 53147741 50975438 49673019 48226405 46706608 45540065 44851578
14206D4851578j471401j766817r69531j576477n90893j179562n37910p46576j467957
$$ 44851578 43380177 41613360 40643829 39067352 38476459 37296897 36758987 36012411 34544454
14197C4544454p90408r72384q08542p38804n07260j041388p55402p63859m88427
$$ 34544454 33754046 32781662 31973120 31234316 30727056 29685668 28930266 28166407 27677980
14188B7677980q66705m15088m43026o10527q32627m73218m86624m61973o62984
$$ 27677980 26811275 26396187 25953161 25342634 24510007 24036789 23550165 23088192 22425208
14179B2425208m39203k92727m71493l61788p63564j07924o05320k94511r5155
$$ 22425208 21986005 21693278 21221785 20859997 20096433 19988509 19383189 19088678 18993523
14170A8993523p33110n68665j15361m62322j94647r0840o72958k86137J57335
$$ 18993523 18260413 17691748 17576387 17114065 16919418 16828578 16155620 15869483 16026818
14161A6026818l65351l29435k95964l16321l48937J43267o87306r2087k85737
$$ 16026818 15661467 15332032 15036068 14719747 14370810 14514077 13826771 13734684 13448947
14152A3448947n45331P8878J73467k46347o70564L98090p36242K45137o49115
$$ 13448947 12903616 12982494 13155961 12909614 12239050 12637140 11900898 12146035 11496920
14143A1496920p927o1122m43319K30291n25290Q6268l66583j19288j52801J07610
$$ 11496920 11488993 11427871 10984552 11214843 10689553 10775821 10409238 10289950 10137149 10244759
14133A0244759k26694m92048p2633l40759L00700k54951j75205K59726l02551
$$ 10244759 10018065 9526017 9453384 9112625 9413325 9158374 8983169 9242895 8940344
14124H940344l19692J76603n43182L2418J9192k35233l9718L22017m26561k5392
$$ 8940344 8620652 8797255 8254073 8286491 8305683 8070450 8030732 8352749 7926188 7900796
14114G900796j19293J43418p11994L68215j65774j47765J15588m1135n27291k41381
$$ 7900796 7781503 7924921 7212927 7581142 7415368 7267603 7383191 7342056 6814765 6573384
14104F573384M4460K37743k42696M34069q92992L83076n32608L8308J88985m03046
$$ 6573384 6617844 6855587 6612891 7046960 6153968 6537044 6004436 6042744 6231729 5828683
14094E828683M25224k97519q6193m31497O53259m36761j79014j35626Q2646l62667
$$ 5828683 6253907 5956388 5870195 5438698 6091957 5655196 5476182 5340556 5423202 5060535
14084E060535M02363p2070l80535K88059R2003n17417J85098j04928R926j49304
$$ 5060535 5462898 5390828 5010293 5298352 5390355 4872938 5058036 4953108 4963034 4813730
14074D813730p5433j72384O4709l52916L40151k69880M43841l16229j30028j80525
$$ 4813730 4738297 4565913 4630622 4277706 4617857 4347977 4791818 4475589 4345561 4165036
14064D165036O17248n73131K70297k37257J26990L72418k30385k10229L1589j57517
$$ 4165036 4782284 4209153 4479450 4242193 4369183 4741601 4511216 4300987 4332576 4175059
14054D175059l08299K88223j83117l74196J23747J6404j3980o5656J08211k11557
$$ 4175059 3866760 4154983 3971866 3597670 3721417 3737821 3723841 3658185 3766396 3554839
14044C554839m9337K55510p41348L44169O4333k15907O9639O1348M2150j99446
$$ 3554839 3505502 3761012 3019664 3363833 3428166 3212259 3281898 3343246 3385396 3185950
14034C185950j9148J01807p2416L2104Q4376j64379J88993k80666J8905k02696
$$ 3185950 3166802 3268609 3196193 3228297 3312673 3148294 3337287 3056621 3075526 2872830
14024B872830K54714k23443L19259j12634l67712k37002q2254M70055l14333R5198
$$ 2872830 3127544 2904101 3223360 3110726 2743014 2506012 2423758 2893813 2579480 2674678
14014B674678R5560j2814n38234M34911K67707m14084J75746J64157o79313L74746
$$ 2674678 2770238 2757424 2219190 2654101 2921808 2507724 2683470 2847627 2168314 2543060
14004B543060j09831N2680o3315l10191J35158k9059K50011l76011R9454L23427
$$ 2543060 2433229 2485909 2422594 2112403 2247561 2218502 2468513 2092502 2191956 2515383
13994B515383k52979j10809J23598M32246M21733J152539K394548P028131J7491300
$$ 2515383 2262404 2151595 2275193 2707439 3129172 4281711 6676259 13704390 31195690
13985C1195690J1790907j3641068j3059017o697395l021795j241652q82577o47778
$$ 31195690 42986597 29345529 16286512 9589117 6567322 5325670 4443093 3795315
13977C795315j16698k54818j26046l52442j68207N0540q1968l8034j10922o6178
$$ 3795315 3678617 3423799 3297753 2945311 2777104 2827644 2745676 2707642 2596720 2530542
13967B530542L15808o34995L45181J02602k93785j88811J48361J47825O2287n42589
$$ 2530542 2846350 2211355 2556536 2659138 2365353 2176542 2324903 2472728 2535015 1992426
13957A992426j2423j07912J32147N1349K36867l61511Q6693j49780J60732m302
$$ 1992426 1980003 1872091 2004238 2055587 2292454 1930943 2017636 1867856 2028588 2024286
13947B024286R9702l219m41638M72714J57784n64754l16536N46099J0202l63766
$$ 2024286 2123988 2120769 1679131 2151845 2309629 1744875 1428339 1974438 1984640 1620874
13937A620874K65165j24465K61412O211n91354K63433p8300J24597p7068j65251
$$ 1620874 1886039 1761574 2022986 2029197 1437843 1701276 1622976 1747573 1670505 1505254
13927A505254O89646o2812j52670j94771M8331k10780j08207J99609Q9490k24249
$$ 1505254 2194900 2132088 1979418 1784647 1832978 1622198 1513991 1713600 1803090 1578841
13917A578841J46497j24189j32044l3947J39728N1905q7609R5862l51530K32733
$$ 1578841 1725338 1601149 1469105 1435158 1574886 1626791 1539182 1635044 1283514 1516247
13907A516247R1574Q3389m8367m27176Q00244m31142l67580R4604l5082q0473
$$ 1516247 1607821 1691210 1642843 1215667 2015911 1584769 1217189 1311793 1276711 1196238
13897A196238M4352k2358L24228J3254j90473q6562L88178j01443j13326m0715
$$ 1196238 1240590 1218232 1542460 1555714 1365241 1278679 1666857 1565414 1452088 1411373
13887A411373j11462j99198J21794J74482k23628K06576n3537k3688K20557j33418
$$ 1411373 1299911 1100713 1222507 1396989 1173361 1379937 1326400 1302712 1523269 1389851
13877A389851N4220k77014j10059K85226k28992J35343P7062k9509j63032j31481
$$ 1389851 1444071 1167057 1056998 1342224 1113232 1248575 1325637 1296128 1133096 1001615
13867A001615M5938j84701K72194Q7813K88497l09954P7193o5852k08093L01857
$$ 1001615 1047553 862852 1135046 1222859 1511356 1201402 1278595 1212743 1004650 1306507
13857A306507P3747l96207j6652K48034l06848L00601k18171j88635M44005j77479
$$ 1306507 1380254 984047 967395 1215429 908581 1209182 991011 802376 1246381 1068902
13847A068902j40897K15513o3783J99257j40107J51965m50529K02038j07937m19830
$$ 1068902 928005 1143518 1079735 1278992 1138885 1290850 840321 1042359 934422 514592
13837E14592O93301l70848K85989m4667k71993N47273m16417j96950N35569j29347
$$ 514592 1207893 837045 1123034 1078367 806374 1353647 937230 740280 1275849 1146502
13827A146502p7773k24961j61027J20333O9071M3422L85995m69506M14207m13653
$$ 1146502 1068729 843768 682741 803074 872145 915567 1301562 832056 1246263 832610
13817H32610J00478L12425m68623K33973n7348n7250Q8018j99991K51694j87561
$$ 832610 933088 1245513 776890 1010863 953515 896265 984283 784292 1035986 848425
13807H48425J85005j01669N43j97599L24544j09152J16553j78546j69746n464
$$ 848425 1033430 931761 932304 734705 1059249 950097 1066650 888104 718358 712894
13797G12894M56454n83449n099Q5143J04493j34560K54279l4778j40275R0871
$$ 712894 1169348 585899 580800 665943 770436 635876 890155 855377 715102 805973
13787H05973j14757J4035l2856L84199m3217j82862j91798L50342j45868k77843
$$ 805973 691216 705251 672395 1056594 1013377 830515 638717 989059 843191 565348
13777E65348J115k5261K68259j02590j08292J03924J76824j35695J23291l22770
$$ 565348 566463 541202 809461 706871 598579 702503 879327 743632 866923 544153
13767E44153M70912k68367j95360r3060J26562K54094J62470l33330k0316J66044
$$ 544153 1015065 746698 551338 458278 584840 838934 1001404 668074 647758 813802
13757H13802k52112J34221k64029P2392N8842J31680J01684k00188O22206n14006
$$ 813802 561690 695911 431882 504274 563116 694796 796480 596292 1218498 704492
13747G04492R931k36409K91400k73758K56939k713J56j28350j7125L7239K3272
$$ 704492 714423 478014 769414 495656 752595 749882 750038 621688 604563 641802 665074
13736F65074l6619R9585K32632l81972R5626m058r6683L56482l08699J60597j40286
$$ 665074 628455 728040 960672 578700 674326 670268 573585 930067 621368 781965 641679
13725F41679q1768O1141J2643j32174L04648l52455J22631k47545L63306p9839
$$ 641679 559911 621052 633695 501521 806169 453714 576345 328800 692106 612267
13715F12267J85930l61060K35584n8529j53463J92883Q4584C44191K86863k5187
$$ 612267 798197 437137 672721 614192 460729 653612 738196 344191 631054 605867
13705F05867Q3390k25381J78527j98436M46262C42612M06140k24800J42489Q9909
$$ 605867 689257 463876 642403 443967 890229 342612 748752 523952 666441 756350
13695G56350j82295k52379p6500K4876M16781O8834n1446k05339k00537K96517
$$ 756350 574055 321676 245176 270052 686833 755667 704221 498882 298345 594862
13685E94862n347R9009k92127K75487j34285m0575K42312l65359F3588K55332
$$ 594862 589515 688524 396397 671884 537599 497024 739336 373977 63588 318920
13675C18920J67719q8603K67507j11939B16356K24061o8234P8618A45697M49757
$$ 318920 486639 398036 665543 553604 216356 440417 372183 450801 145697 595454
13665E95454j40909L6300j20273J11231k05760L1089K16954O2679k19409J42241
$$ 595454 454545 490845 370572 481803 276043 307132 524086 586765 367356 509597
13655E09597p5596G8739J09384L6058A5522L61632O3909M9328k6152K1660K36116
$$ 509597 434001 78739 188123 224181 15522 377154 441063 490391 464239 485899 722015
13644G22015J8189j77935j51146L35560J30847m33816Q2175k62166R1774k4859
$$ 722015 740204 562269 411123 746683 877530 443714 525889 263723 355497 330638
13634C30638L1836J63322L3650q4781A36292J96523J92424J25460k03638j60504
$$ 330638 362474 525796 559446 474665 136292 332815 525239 650699 447061 286557
13624B86557J07988j14213M13315C31814N28561m06513J56150B12822g2279D93678
$$ 286557 394545 280332 693647 331814 860375 453862 610012 212822 -72279 493678
13613A66888Q7478L60469k88564K74490l9117k70764k6747J42651J44193l0807
$$ 166888 254366 614835 326271 600761 561644 290880 264133 406784 550977 520170
13603E20170j50986K26156A21708M85027r7753r8966j59454j02325M98666C18168
$$ 520170 369184 595340 121708 606735 508982 410016 250562 148237 646903 318168
13592A92110O1776P5369J13254E1088L35444A68351M28792B33652L57098j21168
$$ 192110 253886 329255 442509 51088 386532 168351 597143 233652 590750 469582
13582D69582p5955n9440J28555M1287J26783A41476M5423p3073K74468j13082
$$ 469582 393627 334187 462742 504029 630812 141476 186899 113826 388294 275212
13572B75212F0834K90707k2203J72103A63238K81031J68689m6187A74588J51979
$$ 275212 60834 351541 329338 501441 163238 444269 612958 566771 174588 326567
13562C26567A20351K64983j9673E6744L45841K77407k67086A97488K26717H6055
$$ 326567 120351 385334 365661 56744 402585 679992 412906 197488 424205 86055
13551E88436k27600B3128J78130K19323K57738A61841k6309M61393k08635J24793
$$ 588436 360836 23128 201258 420581 678319 161841 135532 596925 388290 513083
13541E13083p0679j98116I5744L10104R4082j03783j55729A18164O7372p0734
$$ 513083 442404 244288 95744 405848 499930 396147 240418 118164 185536 114802
13531A14802K67721o6726q8598K69245F0606K16059F6908K65527J7759Q4579L2945
$$ 114802 382523 315797 227199 496444 60606 276665 66908 332435 350194 434773 467718
13520D67718j82293J5462P9135E7074J85586q0313O7467J22412j05944N1575J91906
$$ 467718 285425 300887 380022 57074 242660 162347 229814 352226 246282 297857 489763
13509D89763l459j94077m0025b3138E13891j79282j67088L6639J74320A70053
$$ 489763 486304 292227 252202 -23138 513891 334609 167521 204160 378480 170053
13498A12385c8116E74353j72290A75265P3485A16561N39413k94656j05123P3755
$$ 112385 -38116 574353 402063 175265 248750 116561 655974 361318 256195 329950
13488C29950K8712A68599P8978P8694M8576Q842p9265O1483M1256o3842o5619
$$ 329950 358662 168599 247577 326271 374847 383689 304424 365907 407163 343321 277702
13477B77702k7195K3770K41896L75316B87684J63090K03702g4438A71687l7834
$$ 277702 250507 274277 516173 891489 287684 450774 654476 -74438 171687 133853
13467A33853Q1733C6541L14938N565J9680f3106C04157J26679j43288m7583L2920
$$ 133853 215586 36541 351479 357044 376724 -63106 304157 430836 287548 239965 272885
13456B72885P367c4408H6848K95632A42079J84746m2286L873j9488J73227A85994
$$ 272885 280252 -34408 86848 382480 142079 326825 284539 288412 268924 442151 185994
13444C28330j42022M9926l3358l6815K24383n9714B1216K77546A20101J18392
$$ 328330 186308 236234 202876 166061 390444 330730 21216 298762 120101 238493
13434B38493J63366j44445p2787A1266K33432j6041e9488B29833J7748P7037r1379
$$ 238493 401859 257414 184627 11266 244698 228657 -59488 229833 247581 324618 233239
13423B33239I9654K80067K00536F4423L28672P8313I6495L06142A90832k4084
$$ 233239 99654 379721 580257 64423 393095 471408 96495 402637 190832 166748
13413A66748B7282L26284m4590j38059K1128B4268K85981G9439M7159K10985A01352
$$ 166748 27282 353566 308976 170917 192045 24268 310249 79439 126598 337583 101352
13401A60692h0016A89985N1297a57775B02114a22915B65229p7143j1222F3095
$$ 160692 -80016 189985 241282 -157775 202114 -122915 265229 188086 176864 63095
13390I006J77678b742E7204K91083c7031F31961C5560M79030k26799J53519c076
$$ 9006 186684 -2742 57204 348287 -37031 631961 35560 514590 287791 441310 -3076
13378I1826J85953J0673M1088K3668j00107H9194K1027L8121M54364H4507K97889
$$ 91826 277779 288452 329540 353208 253101 89194 110221 148342 602706 84507 382396
13367C82396j49528l9856l1499J79518j49924J43260a2822D50238k14075O0626
$$ 382396 232868 193012 161513 341031 191107 334367 -12822 450238 236163 296789
13357B96789a38350A60133L32422k22702D4275L08266l2949A59546K66611A50966
$$ 296789 -138350 160133 492555 269853 44275 352541 319592 159546 426157 150966
13346E14550B04996J35780J7928j29689p1225M85376C19659R1269o2539q1074
$$ 514550 204996 340776 358704 229015 157790 643166 319659 410928 348389 267315
13336B67315K45935D4809J60273n5902j8403K60342p0720p7611L4082I2409J27034
$$ 267315 513250 44809 205082 149180 130777 391119 320399 242788 276870 92409 219443
13325B19443P9310E3762M46540a7517C08849c3603C48980J39852j97469A35073
$$ 219443 298753 53762 500302 -17517 308849 -33603 348980 488832 291363 135073
13314i2775D26283j96087C8313J64344K25136G3878N1943E774J94958D7185K47050
$$ -92775 426283 230196 38313 202657 427793 73878 125821 5774 200732 47185 294235
13303B94235A05586J4912J35321j17379F8798K60599J66129A53380e3272A88445
$$ 294235 105586 120498 255819 138440 68798 329397 495526 153380 -53272 188445
13292E7603Q5112b513B39870a39170r623B94035J05586B4131L58708P990n6406
$$ 57603 142715 -2513 239870 -139170 -148793 294035 399621 24131 382839 390829 334423
13281C34423C8161a45682B22838a4218r8061J6795I6978D4747N6487l906J72445
$$ 334423 38161 -145682 222838 -14218 -112279 -95484 96978 44747 101234 97328 269773
13270B69773m8674a61053B24690L9847c8527A79567A0739K67443n9586K97985
$$ 269773 221099 -161053 224690 264537 -38527 179567 10739 278182 218596 516581
13260E16581e6930F8272M6502D7239R793F302O5333Q4314L94836A75906K03343
$$ 516581 -56930 68272 114774 47239 57032 6302 71635 155949 550785 175906 379249
13249C79249A77722Q010P7173g3575J6627A55842B0315K39392A08441C9958K29799
$$ 379249 177722 185732 262905 -73575 -56948 155842 20315 259707 108441 39958 269757
13238B69757C464h8080A68006A0752i4429l2274b6517C3121L26297j18993I0724
$$ 269757 3464 -88080 168006 10752 -94429 -126703 -26517 33121 359418 240425 90724
13226a24813G7186f9164B02458K03847D7149J32139n5862K48650A13791J64990
$$ -124813 77186 -69164 202458 406305 47149 179288 123426 372076 113791 278781
13216B78781j32189n5206c6551B81250H4961a717A63998C7102j1539e2169F3901
$$ 278781 146592 91386 -36551 281250 84961 -1717 163998 37102 25563 -52169 63901
13204B5770K87879j26491a25883q4817B18090F5336J12669B5208a67783B00669
$$ 25770 313649 187158 -125883 -210700 218090 65336 178005 25208 -167783 200669
13193D07556h0085B4681J16862j110a57274g5444H2400M9143K73676a00324C45984
$$ 407556 -80085 24681 141543 140433 -157274 -75444 82400 131543 405219 -100324 345984
13181H8326B6848J5289O1241i0764B8967M3657f4509A62458F890L035L53317g8974
$$ 88326 26848 42137 103378 -90764 28967 72624 -64509 162458 6890 9925 363242 -78974
13168A4296R4530D6779a05668A20927k3316a95422g3711D63537B25531J04954
$$ 14296 108826 46779 -105668 120927 97611 -195422 -73711 463537 225531 330485
13158C30485B0620J47784l5942d608B32894E1769J21966d5150A59945h5926B12199
$$ 330485 20620 168404 132462 -4608 232894 51769 173735 -45150 159945 -85926 212199
13146A11679P8051N62m4779J13234K8815J06451C4921L37904c81775G9341I178
$$ 111679 189730 190292 145513 258747 287562 394013 34921 372825 -381775 79341 9178
13134A26372c3632A37625K1899b57706O2564B72305J20180D560K9657K9880b62062
$$ 126372 -33632 137625 159524 -257706 -195142 272305 392485 4560 34217 64097 -262062
13122A04805l412J2951a29762B82325I5371i1153H1212b38635A66681c1602A26265
$$ 104805 101393 114344 -129762 282325 95371 -91153 81212 -238635 166681 -31602 126265
13110a26290A38894G567a48409B46948D5715A5681M87614a12782d530A15464n6136
$$ -126290 138894 7567 -148409 246948 45715 15681 503295 -112782 -4530 115464 59328
13099E9328D114i0240H3733N1671K21177a75147d3709J6285F4870k2182I319J47327
$$ 59328 4114 -90240 83733 135404 356581 -175147 -43709 -27424 64870 42688 9319 156646
13087A56646J04485A16156J01990g3311l3674B6361L18529A07560L8654O6352
$$ 156646 261131 116156 218146 -73311 -106985 26361 344890 107560 146214 212566
13077B12566P3251b8815C18875k0618j39783B2322a3661A01496h2224B42075j17394
$$ 212566 285817 -28815 318875 298257 158474 22322 -13661 101496 -82224 242075 124681
13066A24681N4761a7767H9965J39798G5107k6785M63240B12158N1957r6964h2170
$$ 124681 179442 -17767 89965 229763 75107 48322 511562 212158 264115 167151 -82170
13054A27581J36364b64737c3049A19731D4826J29109k0452B1517a80302A81508
$$ 127581 263945 -264737 -33049 119731 44826 173935 153483 21517 -180302 181508
13043A3098J71902k3855C4802J29691K54996j92483O3587m2850A10293a54016
$$ 13098 185000 161145 34802 164493 419489 227006 290593 247743 110293 -154016
13032e2084I6389P2122a16117A60769a3749n2185A13718h1661q3494C71583A3742
$$ -52084 96389 168511 -116117 160769 -13749 -65934 113718 -81661 -165155 371583 13742
13020E83018B11347b19591A67278d4685j4534A97597F7063M10161I1405m1848
$$ 583018 211347 -219591 167278 -44685 -59219 197597 67063 477224 91405 49557
13010D9557j4899Q5569J04711b98071D0295J05475i1087B94771j34859M9787P0057
$$ 49557 34658 120227 224938 -298071 40295 145770 -91087 294771 159912 209699 279756
12999B79756a37943B02844L8549c5586C0648P2797i5009A68723b5109A60448F6691
$$ 279756 -137943 202844 241393 -35586 30648 103445 -95009 168723 -25109 160448 66691
12987c69460A30431o3480a59266d0863C3764j3551a90869A51824J63999F3060
$$ -369460 130431 66951 -159266 -40863 33764 20213 -190869 151824 315823 63060
12976B81780D1251b19734C25201e3682b0831C11773A43923c8074o3888j11509
$$ 281780 41251 -219734 325201 -53682 -20831 311773 143923 -38074 -101962 -213471
12966b13471I100M6750d2026A47109a80111B87031j00823g7827A44851k6730C8708
$$ -213471 9100 55850 -42026 147109 -180111 287031 186208 -77827 144851 118121 38708
12954A79289b46271A9557a88999I3327f1445k36545h2947A40501a6015r0317l5845
$$ 179289 -246271 19557 -188999 93327 -61445 -297990 -82947 140501 -16015 -106332 -142177
12943a42177B36682J05751j02288a9706p2657l99354B90228G0149c09343B59951
$$ -142177 236682 342433 240145 -19706 -92363 -491717 290228 70149 -309343 259951
12932a99950D55782A8162c50042A69447n3929J11200b07375B34689a38761B30536
$$ -199950 455782 18162 -350042 169447 115518 226718 -207375 234689 -138761 230536
12921D0749j1053h797j78209B69660j07065k7913K8751a81055A64344J1135o3592
$$ 40749 29696 -8797 -187006 269660 162595 134682 163433 -181055 164344 175479 111887
12910A11887a77763A5804O9428B5158h665B72471A2879a79024E1713c8153q2261
$$ 111887 -177763 15804 85232 25158 -8665 272471 12879 -179024 51713 -38153 -120414
12899a20414A16785O9148C4415a7157A93746o6893N036b01838C97808C0031J27108
$$ -120414 116785 185933 34415 -17157 193746 126853 131889 -201838 397808 30031 157139
12888A57139L7610J07346a89564A61541d40404C08737J7939b80421A78311r388
$$ 157139 194749 302095 -189564 161541 -440404 308737 326676 -280421 178311 168923
12878A68923b04379h2119B37094B9749b4373E2173Q3478a95134A35340J30169
$$ 168923 -204379 -82119 237094 29749 -24373 52173 135651 -195134 135340 265509
12868B65509g1548m827k95378r512B84384a75795A93441h7413A10756Q4469a98858
$$ 265509 -71548 -76375 -371753 -381265 284384 -175795 193441 -87413 110756 195225 -198858
12856i2716B37191A12250J07347J88801F9921K5084b16520h2704K520A10674k9052
$$ -92716 237191 112250 219597 408398 69921 95005 -216520 -82704 -80184 110674 81622
12845H1622a65217A53181J9957K2406O8077j07682E0801b41720A45598N3392b36017
$$ 81622 -165217 153181 173138 195544 263621 155939 50801 -241720 145598 198990 -236017
12833a00341l7350c2597A8423f3797k4306A03016C4372c11191d3134a9953k29775
$$ -100341 -137691 -32597 18423 -63797 -88103 103016 34372 -311191 -43134 -19953 -249728
12822b49728b9655o607B68991l4329i848A89475R7999J52588A01663c655j96702
$$ -249728 -29655 -36262 268991 234662 -9848 189475 287474 440062 101663 -3655 -200357
12811b00357e5333C1419J704K6970J94270c72510B23779a43664A07863m223C8331
$$ -200357 -55333 31419 33123 60093 254363 -372510 223779 -143664 107863 103640 38331
12799I2505e3453j7140G8329J89226a16451j19222G1897a60544n0815B4591M6501
$$ 92505 -53453 -70593 78329 267555 -116451 -235673 71897 -160544 -211359 24591 71092
12788G1092Q843O4099A9989J67720c71431A39678c5456M709G3129B5430j0392
$$ 71092 79935 144034 19989 187709 -371431 139678 -35456 -30747 73129 25430 15038
12777A5038a10420B72754L6564a3766k48725A49840D226L7226g3807A11080P3751
$$ 15038 -110420 272754 309318 -13766 -262491 149840 4226 41452 -73807 111080 184831
12766A84831Q069c0958p0109E9842M13061g0652j8439K4015B46080d9212B61040
$$ 184831 192900 -30958 -101067 59842 472903 -70652 -89091 -65076 246080 -49212 261040
12754b3881A47000b37790D378a06924c3109j50226D25720b00773B0740R0694a25786
$$ -23881 147000 -237790 4378 -106924 -33109 -183335 425720 -200773 20740 111434 -125786
12742a0878b071C6631b26148C22115g2094B01381e2119A38588J55054H3979B4927
$$ -10878 -2071 36631 -226148 322115 -72094 201381 -52119 138588 293642 83979 24927
12730A13463g239m3471l5973B88811e5832P434j97206m922E235c3055M854G5344
$$ 113463 -7239 -50710 -86683 288811 -55832 -48398 -245604 -250526 5235 -33055 -28201 75344
12717b5995B83781b17167a7837A74753a42865A08544L25413A80163G3471J05662
$$ -25995 283781 -217167 -17837 174753 -142865 108544 433957 180163 73471 179133
12707A79133K17695H0501K98296D0904J04538m4971K72382C2585b0520B2636J57664
$$ 179133 396828 80501 378797 40904 145442 100471 372853 32585 -20520 22636 180300
12696A80300a33905q8393a03327p3717B76509b6411g158A06086f0866A12249b58395
$$ 180300 -133905 -222298 -103327 -177044 276509 -26411 -7158 106086 -60866 112249 -258395
12684B95269A43234b04898A87499b7780A10720c8328B45941d8769l57443A56534
$$ 295269 143234 -204898 187499 -27780 110720 -38328 245941 -48769 -406212 156534
12673C48253b62527F893K97649a58396C5351a21339G9042K2550J44769A04939
$$ 348253 -262527 6893 304542 -158396 35351 -121339 79042 101592 246361 104939
12662I7142O0991M8783b6636D8538L52995F6158K12335E4686K64756j04190D6530
$$ 97142 158133 206916 -26636 48538 401533 66158 278493 54686 319442 215252 46530
12650B15163j8152h1227A54142b28091j4949R5256B14722C2870a57209B92285
$$ 215163 197011 -81227 154142 -228091 -243040 -147784 214722 32870 -157209 292285
12639C3873a69046B26093g3465A44604b26765B597J41424P3751K24091A82522
$$ 33873 -169046 226093 -73465 144604 -226765 2597 144021 217772 441863 182522
12628B57506D8435L99888j61143a3170B1898K57502l8199m310I6172L02692A53247
$$ 257506 48435 448323 287180 -13170 21898 279400 241201 236891 96172 398864 153247
12616A05131r582J80815B9366b8063j6321k05959O6857D1360h0316C31004A58272
$$ 105131 95549 276364 29366 -28063 -44384 -250343 -183486 41360 -80316 331004 158272
12604c17508a05968E1984a03101B61966G5128J93464K76075i8061B91952C4700
$$ -317508 -105968 51984 -103101 261966 75128 268592 544667 -98061 291952 34700
12593b84499b7181k68646d3407A73903h3969o6454B08073J51448h8843F4266L09691
$$ -284499 -27181 -295827 -43407 173903 -83969 -150423 208073 359521 -88843 64266 373957
12582C73957d2315C8830P5229O0741n9008C6123O7478L9025a23076H4373a33434
$$ 373957 -42315 38830 114059 174800 115792 36123 103601 142626 -123076 84373 -133434
12570b29459D2968a20285B4419Q4133K67945D5560a57469B69297a67468A76940
$$ -229459 42968 -120285 24419 108552 376497 45560 -157469 269297 -167468 176940
12559b05313B07603p4500J51762E4264R4892a25907j29299c3621j23092j01987
$$ -205313 207603 133103 284865 54264 149156 -125907 -255206 -33621 -156713 -258700
12549b58700a26320c9538C36738c6571j44896f090k76332B0040d1271B89575b0162
$$ -258700 -126320 -39538 336738 -36571 -181467 -6090 -282422 20040 -41271 289575 -20162
12537A0784R9234K34602g9612H9479b7219J1093C44760C6382d3476A44103i7362
$$ 10784 110018 344620 -79612 89479 -27219 -16126 344760 36382 -43476 144103 -97362
12525H2293K53945b74351H3117r261B7255o115b6579l3899A49712m7275N75R5246
$$ 82293 336238 -274351 83117 73856 27255 21140 -26579 -60478 149712 102437 103012 198258
12513A98258a80376I4544b9211D11631a70799j40022f2938j53249B92593b4142
$$ 198258 -180376 94544 -29211 411631 -170799 -310821 -62938 -216187 292593 -24142
12502f5781I1571L6098J60972j4275l7348b14417B08979A790J08757f7849b9283
$$ -65781 91571 127669 288641 274366 237018 -214417 208979 1790 110547 -67849 -29283
12490a82961e3066C80670a10335k4411A56144p1313a35216H8231a35100b5729
$$ -182961 -53066 380670 -110335 -134746 156144 84831 -135216 88231 -135100 -25729
12479a73201r6205d1207A31085a68623D1267o627Q1833J57151b57533A25329d9201
$$ -173201 -269406 -41207 131085 -168623 41267 34640 116473 273624 -257533 125329 -49201
12467F0265e6762A9503d9532A77340E7856b12542N18N8965O0732A02540a04756
$$ 60265 -56762 19503 -49532 177340 57856 -212542 -212024 -153059 -92327 102540 -104756
12455C0359a73321J6400B77490j04884J37438a08365a1011A64240F5549a07518
$$ 30359 -173321 -156921 277490 172606 310044 -108365 -11011 164240 65549 -107518
12444c78510F4311f4967L1070C86355i1746j27248C543a99917B0100i8858H9039
$$ -378510 64311 -64967 -33897 386355 -91746 -218994 3543 -199917 20100 -98858 89039
12432F3754J975g0980J4401B73526g8859A66131b09482A14411d5173o9761B85937
$$ 63754 65729 -70980 -56579 273526 -78859 166131 -209482 114411 -45173 -114934 285937
12420C3020a08374j32085A1429b34208A69328n2641h7274H890R6633K8204B7663
$$ 33020 -108374 -240459 11429 -234208 169328 116687 -87274 8890 105523 133727 27663
12408c42939j31547B082b04645a02002k3372A00965P5882b17993B94526E5900
$$ -342939 -474486 2082 -204645 -102002 -125374 100965 176847 -217993 294526 55900
12397i6937G1624B9682e9680j6957A05700J63835h4328a3564A21450i9574k272
$$ -96937 71624 29682 -59680 -76637 105700 269535 -84328 -13564 121450 -99574 -101846
12386a01846A57114G1883K47240H668J67682b08210P3952c2629k4568E8682r03
$$ -101846 157114 71883 319123 8668 176350 -208210 -134258 -32629 -57197 58682 57779
12375E7779A3962b66096E97631A81933K30080H3134L23987e36264d9822E8545
$$ 57779 13962 -266096 597631 181933 412013 83134 407121 -536264 -49822 58545
12364A70819a24163A28556c33163J51914Q5363j5088B1017N1053b8994A4408K1115
$$ 170819 -124163 128556 -333163 -181249 -95886 -110974 21017 72070 -28994 14408 35523
12353C5523L59240I9021N979k9736a796B6442K04280D668O9976Q6149G2024f3603
$$ 35523 394763 99021 105000 75264 -1796 26442 230722 4668 74644 160793 72024 -63603
12340c2111B64371I2552O4268a60224r8000H7564J7119e5446m69650K12547a5471
$$ -32111 264371 92552 156820 -160224 -258224 87564 104683 -55446 -525096 -312549 -15471
12328C46276I3039a02712K199c9246A82974a73041o9521B38588b39513b9482k39381
$$ 346276 93039 -102712 -100513 -39246 182974 -173041 -242562 238588 -239513 -29482 -268863
12317b68863B26292r5037b01985K9500F8475K40628a34465j51629b4815k13172
$$ -268863 226292 131255 -201985 -172485 68475 309103 -134465 -286094 -24815 -237987
12307b37987G7561a87308b6842D58930a40231B3696P6225a02553C06764b28025
$$ -237987 77561 -187308 -26842 458930 -140231 23696 99921 -102553 306764 -228025
12296e8450A13980a82946A57513a13291j12299B32562m1415b08136A28369a41934
$$ -58450 113980 -182946 157513 -113291 -225590 232562 191147 -208136 128369 -141934
12285b54421G53b25970M0479A89497f8670A44716B7363F849L1903b6341A13774
$$ -254421 753 -225970 -185491 189497 -68670 144716 27363 6849 38752 -26341 113774
12273A49145J92148l1128K44808a67663C98994A42572k2683J93812b5988E44971
$$ 149145 341293 310165 554973 -167663 398994 142572 119889 313701 -25988 544971
12262B58744I1272K3143a23097C36468I7117g061A24414J48807a69491A42574
$$ 258744 91272 114415 -123097 336468 97117 -7061 124414 273221 -169491 142574
12251F6265c2009j6244B09020e7881A32390n2758J49587K5254m4881K0708j4488
$$ 66265 -32009 -48253 209020 -57881 132390 79632 229219 254473 209592 230300 215812
12240B15812a96915d4430B88115g0905A86333B1170b73651A57514O1320q0019
$$ 215812 -196915 -44430 288115 -70905 186333 21170 -273651 157514 218834 138815
12230A38815j2046R670J07294E6305Q6198l2836K7372K18829J04518A36727m4585
$$ 138815 126769 136439 243733 56305 142503 109667 137039 355868 460386 136727 92142
12219I2142J03728J98426L596A09666J66777A36483O9278d58405C01547F6655
$$ 92142 195870 394296 397892 109666 276443 136483 205761 -458405 301547 66655
12208B97806J18529j71176c7351G2351K75607H1848P8050P4593j06649O6400O9226
$$ 297806 416335 245159 -37351 72351 347958 81848 159898 234491 127842 194242 263468
12197B63468f6099A74313L9416a12859G127J03962K73474A73109J97462A05147
$$ 263468 -66099 174313 213729 -112859 7127 111089 384563 173109 370571 105147
12186a47057f3929q2370B1070N6717Q2301l8360a09545A06192l6965d4698B78585
$$ -147057 -63929 -146299 21070 77787 160088 121728 -109545 106192 69227 -44698 278585
12174B65119M87250B31884l3913h0858A96714G6264a20480B72664c6228m0966
$$ 265119 752369 231884 197971 -80858 196714 76264 -120480 272664 -36228 -77194
12164g7194a8497H8135J63074b866G3647K23424b7601j93506b1242B42442a11196
$$ -77194 -18497 88135 251209 -2866 73647 297071 -27601 -221107 -21242 242442 -111196
12152B67529A3399f0643A3781J79889k947c13864I7755J11701r3008J31530a09195
$$ 267529 13399 -60643 13781 193670 190723 -313864 97755 209456 116448 247978 -109195
12140G5759j9004A9840J41781n28b15381I5192C6822j3764E969M9221M4466f5248
$$ 75759 56755 19840 161621 161093 -215381 95192 36822 23058 5969 55190 99656 -65248
12127H8497J51180a93414A08642N9343c22985E2706J38821f5016j10972A08570
$$ 88497 239677 -193414 108642 167985 -322985 52706 191527 -65016 -175988 108570
12116I1294O7174a18297A28625Q7694c68861G6039h6736E3567b5366k00851Q6055
$$ 91294 158468 -118297 128625 216319 -368861 76039 -86736 53567 -25366 -226217 -140162
12105a40162B95383a47051m5397H0779a99047A9200N5169b42698I8786h3242A0836
$$ -140162 295383 -147051 -192448 80779 -199047 19200 74369 -242698 98786 -83242 10836
12093a19838j11105K7980H3132K58070a35613C8212g716A08148D2021L3753a5733
$$ -119838 -230943 -202963 83132 341202 -135613 38212 -7716 108148 42021 75774 -15733
12081a40171G6984g764A9372b05548H0732J105845N00307E82599A20378d33466
$$ -140171 76984 -7764 19372 -205548 80732 1186577 1686884 582599 120378 -433466
12070D1132J97623g6305A74437a51748j27389B80173H9755J23953c55776c9106
$$ 41132 238755 -76305 174437 -151748 -279137 280173 89755 213708 -355776 -39106
12059D5931d979l01884b3192j0989j03239E40546F7847a70157c6764R30p7707
$$ 45931 -4979 -306863 -23192 -34181 -137420 540546 67847 -170157 -36764 -35834 -113541
12048a13541I6401J38181a5481A19792Q3709j00639D1301f6676K1610r277C2514
$$ -113541 96401 234582 -15481 119792 203501 102862 41301 -66676 -45066 -54343 32514
12036A1678M7188R2807J0113j9946c23842G1746b27088A09514C2786b42011g0600
$$ 11678 58866 151673 161786 141840 -323842 71746 -227088 109514 32786 -242011 -70600
12024b39678L6157O2815E845a57222C37231A64328K13915G4270a06832A5026J48529
$$ -239678 -203521 -140706 5845 -157222 337231 164328 378243 74270 -106832 15026 163555
12013A63555M3648I8772J17606a63852j74009B38903C4649b7044D4309c99778
$$ 163555 207203 98772 216378 -163852 -337861 238903 34649 -27044 44309 -399778
12002A06923b64213A316c36568A7794a93645P7827g676B41605q7187C6889a4320
$$ 106923 -264213 1316 -336568 17794 -193645 -115818 -7676 241605 154418 36889 -14320
11990D4080a52312G9489K37008g9447B29666a92807A41967a69514d1809k87274
$$ 44080 -152312 79489 316497 -79447 229666 -192807 141967 -169514 -41809 -329083
11980c29083a27046O2518C27135n6464b59994c9535c299B46814h039j93277d8763
$$ -329083 -127046 -64528 327135 270671 -259994 -39535 -3299 246814 -8039 -201316 -48763
11968B4987d0670C8210i4930H8602h5313q5862m7629P5247p3472B13746A7461
$$ 24987 -40670 38210 -94930 88602 -85313 -171175 -218804 -143557 -217029 213746 17461
11956c3125C5517a70912A75216a82007h296A26537C0393h3026B22136a12394E4434
$$ -33125 35517 -170912 175216 -182007 -8296 126537 30393 -83026 222136 -112394 54434
11944a35789C19039f3593h72k50276E3280b41893d6186c988j62517B60176J5283
$$ -135789 319039 -63593 -872 -251148 53280 -241893 -46186 -3988 -166505 260176 275459
11933B75459a1470r0804F7925a38047A88119A05J94789I1745L3498J238A9823
$$ 275459 -11470 -102274 67925 -138047 188119 105 194894 91745 125243 126481 19823
11921f9042j84348B60089d3047p4213A04953d4089B10250b89241a2870j02999
$$ -69042 -253390 260089 -43047 -117260 104953 -44089 210250 -289241 -12870 -115869
11911a15869B33635a68133A13660b973H9477m2034h8887A75591F9375j8264P820
$$ -115869 233635 -168133 113660 -2973 89477 47443 -88887 175591 69375 51111 58931
11900E8931b96846g4914k65478G7330b44183a17809A47499l0609b3632B67160
$$ 58931 -296846 -74914 -340392 77330 -244183 -117809 147499 116890 -23632 267160
11889f0701k54187a14331k08231J35786j02900a6195k13687g9754l7376k73575
$$ -60701 -314888 -114331 -322562 -186776 -289676 -16195 -229882 -79754 -117130 -390705
11879c90705f0556R888j790j28388H9601A1790d1623K099A27762C783a33022G5298
$$ -390705 -60556 -50668 -52458 -180846 89601 11790 -41623 -39524 127762 3783 -133022 75298
11866A68089e8203l4628j00823n128n2857f9378j51905f7219C26912a37303E761
$$ 168089 -58203 -92831 -193654 -198782 -251639 -69378 -221283 -67219 326912 -137303 5761
11854a78581G4462P2373D6927M02329a35670j58346f3503j66275f2458j54608
$$ -178581 74462 146835 46927 449256 -135670 -294016 -63503 -229778 -62458 -217066
11844b17066B6091j2427a32928l27774J57287J9282J22748e6326E4475b2362k3074
$$ -217066 26091 13664 -132928 -460702 -303415 -284133 -161385 -56326 54475 -22362 -45436
11833d5436F7252i2567j53135f5296p9195a4159e395k90069a3121A790a00442
$$ -45436 67252 -92567 -245702 -65296 -144491 -14159 -5395 -295464 -13121 1790 -100442
11821b81787e1849K2147J4523F5959A8085R1710c939r7345L4205k19201a28415
$$ -281787 -51849 -29702 -15179 65959 18085 109795 -3939 -101284 -67079 -286280 -128415
11809h7692B16195c630I2196Q5365D200a70260j36420a18479K258M0358M043j09488
$$ -87692 216195 -3630 92196 177561 4200 -170260 -306680 -118479 -116221 -75863 -71820 -181308
11797a81308K0939g6486k88112a01214M1993j04290A00726c79756a07241j35147
$$ -181308 -160369 -76486 -364598 -101214 -59221 -163511 100726 -379756 -107241 -242388
11787b42388F9670e2500A7217J87591H6003p548g4349C39426A15203j5866O878
$$ -242388 69670 -52500 17217 204808 86003 78455 -74349 339426 115203 99337 106215
11776A06215N8927b74563A38580a10073E41924b84407A6897K25555j7160b32182
$$ 106215 165142 -274563 138580 -110073 541924 -284407 16897 242452 225292 -232182
11765a59230A710O4003a4613j39930a6998j40138A52087a44798c4482j11569d284
$$ -159230 1710 65713 -14613 -154543 -16998 -157136 152087 -144798 -34482 -146051 -4284
11753A99814J53606a14745a8948k25030a02020K3953A62329c02144Q9954a0283
$$ 199814 353420 -114745 -18948 -243978 -102020 -78067 162329 -302144 -212190 -10283
11742D88296a21981A30202n4438a46163M4286j70861H8724C2689K02530c620j34843
$$ 488296 -121981 130202 75764 -146163 -101877 -272738 88724 32689 235219 -3620 -138463
11731a38463E7594J34674R649m2388a80583A98903a22905p8030A52318g6825m5472
$$ -138463 57594 192268 201917 159529 -180583 198903 -122905 -200935 152318 -76825 -122297
11720a22297F4201J8715Q633R0665j5926B9739C468O6240b18414B3089a80828
$$ -122297 64201 82916 91549 182214 166288 29739 3468 69708 -218414 23089 -180828
11708B93143a07516A63069b11896I1853i0837A70787J14096a18024H9851k2173
$$ 293143 -107516 163069 -211896 91853 -90837 170787 284883 -118024 89851 67678
11698F7678e1481m0201G9765J11007a72188B9168K38132A159b69004B76467o7757
$$ 67678 -51481 -91682 79765 190772 -172188 29168 267300 1159 -269004 276467 208710
11687B08710P1761g0609j59730b8915B36446j05011C8800L05010j42785H2066
$$ 208710 280471 -70609 -230339 -28915 236446 131435 38800 343810 201025 82066
11676b3311C2099a96509A77290q1023K790B5560H671L83083A9875l094b57505
$$ -23311 32099 -196509 177290 96267 99057 25560 8671 391754 19875 16781 -257505
11664a69455H9718c4427j19534j32637B42607b3957o730A53943Q6171b21499e2174
$$ -169455 89718 -34427 -153961 -286598 242607 -23957 -30687 153943 240114 -221499 -52174
11652A71831d0101D2262a27495A60659a40231C8580a65510N7632A73795g4127
$$ 171831 -40101 42262 -127495 160659 -140231 38580 -165510 -107878 173795 -74127
11641A33096E9127f2752D02724D8250a3527j74916j25914l7365B42418a55404
$$ 133096 59127 -62752 402724 48250 -13527 -188443 -314357 -351722 242418 -155404
11630H6364k3258b5297A84927A3753e6569E0021j6920e0137h065C7001h6551B18338
$$ 86364 63106 -25297 184927 13753 -56569 50021 33101 -50137 -8065 37001 -86551 218338
11617A94679a88962A55135i0767n8103e4502G6956K3904D3080O7368a9089A28283
$$ 194679 -188962 155135 -90767 -148870 -54502 76956 100860 43080 110448 -19089 128283
11605E617a93916A54986a37301A15882a07508G2263J3229b08850j19101A92049
$$ 5617 -193916 154986 -137301 115882 -107508 72263 85492 -208850 -327951 192049
11594A89304Q730K0871J0388c9110B39799r5976P9269q7884K1345F3144j1399
$$ 189304 198034 218905 229293 -39110 239799 143823 223092 135208 156553 63144 51745
11583E1745k358K06891q5715d4644A39376b00592A78724g6953B06884r4100E4469
$$ 51745 49387 256278 170563 -44644 139376 -200592 178724 -76953 206884 112784 54469
11571A34304h2005A07311d9722B44891d3302k0576b3233B87368b53609E5861Q6650
$$ 134304 -82005 107311 -49722 244891 -43302 -63878 -23233 287368 -253609 55861 142511
11560A42511a49723J8552L0341D3974J15512J64554j19367b17489L2908A72649
$$ 142511 -149723 -131171 -100830 43974 159486 324040 204673 -217489 -184581 172649
11549C55418r2117i4338A94047J21180a97887e539m1686p291A35340J21376A12916
$$ 355418 263301 -94338 194047 315227 -197887 -5539 -47225 -54516 135340 256716 112916
11537B08090d34131A57120J26913B5317O51073A49403N538o1673J97663a40546
$$ 208090 -434131 157120 284033 25317 676390 149403 154941 93268 290931 -140546
11526h7642o3091A54654k1507J39366a4018B60511k0925r6492a37339B04876b06010
$$ -87642 -150733 154654 133147 272513 -14018 260511 239586 143094 -137339 204876 -206010
11514f0129r8693C2443K07413J14424j57676n4976f0312B90495A10700J29414
$$ -60129 -158822 32443 239856 354280 196604 141628 -60312 290495 110700 240114
11504B40114b54886A90277o669b67389f1670D8111c6378E7270K03952K6105E9910
$$ 240114 -254886 190277 183608 -267389 -61670 48111 -36378 57270 261222 287327 59910
11492B54108A9892L16212A9751J68957a093F4185J44044e9601A97754b16799B84475
$$ 254108 19892 336104 19751 188708 -1093 64185 208229 -59601 197754 -216799 284475
11480D53202j02677E7821k2879J70022j8176J18170m464A03635J93536A09593
$$ 453202 350525 57821 34942 204964 186788 304958 300494 103635 297171 109593
11469A29698j1934b088A44697J31733j18357l5430K55560J7505F7683R4286b9047
$$ 129698 117764 -2088 144697 276430 158073 122643 378203 395708 67683 161969 -29047
11457b11930E3534N954J73363m7929o4241a66201m0868B17110C8356j0325a03701
$$ -211930 53534 59488 232851 184922 120681 -166201 -207069 217110 38356 28031 -103701
11445c3105A04946J0961K1370a93593E3879j5235j7128a59818H6055O4350B0938
$$ -33105 104946 115907 137277 -193593 53879 38644 21516 -159818 86055 150405 20938
11433B81360j38527J5867e4301B47437E1016j3367J22599E0720B0013a51168q6113
$$ 281360 142833 158700 -54301 247437 51016 37649 160248 50720 20013 -151168 -237281
11422b37281a7606A26291A34b52233D7623A6014R978J54886a04082K909n2692
$$ -237281 -17606 126291 134 -252233 47623 16014 25992 180878 -104082 -101173 -153865
11411a53865A68693c3446j51347h4993c9957k30449A15594B0572F434M6509J36124
$$ -153865 168693 -33446 -184793 -84993 -39957 -270406 115594 20572 6434 52943 189067
11400A89067o0980J2261K67549d8965k9788A47440M860e4920k52248B08070o3890
$$ 189067 128087 140348 407897 -48965 -78753 147440 152300 -54920 -307168 208070 144180
11389A44180N7403E2241b3123C6530c9807j26571O8340B6661K8841A3694J9661
$$ 144180 201583 52241 -23123 36530 -39807 -166378 -98038 26661 55502 13694 33355
11378C3355o95K49864B7577h4203A58156a66717C0578a0885k40594A5755N9474
$$ 33355 32660 282524 27577 -84203 158156 -166717 30578 -10885 -251479 15755 75229
11367G5229f0781A21074B5106P6898b7893j3168B7600e4117F6528J37865B0426
$$ 75229 -60781 121074 25106 102004 -27893 -41061 27600 -54117 66528 204393 20426
11355a31941o9631A04194e7562E8260a67207O4320l32872J83700P7421j1602G9160
$$ -131941 -201572 104194 -57562 58260 -167207 -102887 -435759 -252059 -174638 -186240 79160
11343A30673K381h5082F0630c08n6631H1617a54794L205e8466A46153b20670D56849
$$ 130673 133054 -85082 60630 -308 -56939 81617 -154794 -151589 -58466 146153 -220670 456849
11330a59515A67373m2374a61211K0889j02055J07382D5246c3198P711n5451B71757
$$ -159515 167373 124999 -161211 -140322 -242377 -134995 45246 -33198 -25487 -80938 271757
11318i8012K0719A28017P5064r0812J2362J90971B1552h526m28989E7088a1746
$$ -98012 -77293 128017 203081 112269 124631 315602 21552 -8526 -437515 57088 -11746
11306b04860j0714M8917A748P549e8926E0507a35481d1274k4732F5054j1210h7734
$$ -204860 -215574 -166657 1748 9297 -58926 50507 -135481 -41274 -66006 65054 53844 -87734
11293a83524j5397A14629b43216A54829G6539i4367K4293B08364n8327D647L0511
$$ -183524 -198921 114629 -243216 154829 76539 -94367 -70074 208364 150037 4647 35158
11282C5158c75161J01280A32804D4205c3569A17263h3697j53546E5407b2194A2725
$$ 35158 -375161 -273881 132804 44205 -33569 117263 -83697 -237243 55407 -22194 12725
11270A72437b31898A40026b23851R7187A98735G5816a43775q5961a03897k087
$$ 172437 -231898 140026 -223851 -126664 198735 75816 -143775 -229736 -103897 -105984
11260a05984D5005K82284a96901b7142O05o0193j72157b7151k77835B28232a52411
$$ -105984 45005 327289 -196901 -27142 -26537 -86730 -258887 -27151 -304986 228232 -152411
11248b06791I162b24786J1205c3225B2738a20554D37508a36931e3189B21489d56704
$$ -206791 9162 -224786 -213581 -33225 22738 -120554 437508 -136931 -53189 221489 -456704
11236c96718a60856F0172a50443M0390j2784E6777j517J99737a26028A83811H6033
$$ -396718 -160856 60172 -150443 -110053 -122837 56777 55260 254997 -126028 183811 86033
11224c881m9023M553j62017j53026a47231e6751A75333p6523b65995B0160h2253
$$ -3881 -52904 -48351 -210368 -363394 -147231 -56751 175333 98810 -265995 20160 -82253
11212a28583f2664b0855k66871J28822A08501d90057K35365a18599k1131I5763
$$ -128583 -62664 -20855 -287726 -158904 108501 -490057 -254692 -118599 -139730 95763
11201c1276l51228H3107b36114q8541I5270a22700A01079a39866E2042e4312j09232
$$ -31276 -382504 83107 -236114 -324655 95270 -122700 101079 -139866 52042 -54312 -163544
11190a63544E2998c37975P4343P0975N1859j08414H8940J44228H2176A5787J11736
$$ -163544 52998 -337975 -263632 -192657 -140798 -249212 88940 233168 82176 15787 127523
11179A27523e2697A62495G3281a28998k44907c471A91687h0525B9759b487H2730
$$ 127523 -52697 162495 73281 -128998 -373905 -3471 191687 -80525 29759 -2487 82730
11167b63282A07023c12769J00624A33726J1582M4886h7643G6627c06383J17040
$$ -263282 107023 -312769 -212145 133726 145308 190194 -87643 76627 -306383 -189343
11157a89343j47973H957J05922K5546g0269A16644a37230d6090a4742E36052h6852
$$ -189343 -337316 8957 114879 140425 -70269 116644 -137230 -46090 -14742 536052 -86852
11145C7027e7377A86578o7998f2657J8981l7407I8448M9059M7764H7843l0246
$$ 37027 -57377 186578 118580 -62657 -43676 -81083 98448 147507 195271 87843 57597
11134E7597L265Q6091h0178A88823L816b84717D0525K4755h9690A97356H9403
$$ 57597 60862 146953 -80178 188823 192639 -284717 40525 65280 -89690 197356 89403
11122b21499h8115F5085g9787L3601C7390K52138a35032A050a38763E2408K93667
$$ -221499 -88115 65085 -79787 -46186 37390 289528 -135032 1050 -138763 52408 346075
11111C46075j31305l3365F1331J44831a55444A11546A6360L16936g281I2377M5515
$$ 346075 214770 181405 61331 206162 -155444 111546 16360 333296 -7281 92377 137892
11100A37892L78900H196J42861C8243J29828K6980K4602j00299e6393A12810D4807
$$ 137892 516792 8196 151057 38243 168071 195051 219653 119354 -56393 112810 44807
11088H1875M524L20375J45392A24564E7094K25969f356B01864J84637G3422J25609
$$ 81875 86399 406774 552166 124564 57094 283063 -6356 201864 386501 73422 199031
11077A99031O6973k2958A12923b0454A55667k9747M21130r8790J03877n2369k49662
$$ 199031 266004 243046 112923 -20454 155667 125920 547050 448260 552137 499768 250106
11066B50106J64452J47513k17123J02166k05599K16139j22674J88421q5658M0407
$$ 250106 414558 562071 344948 447114 241515 457654 334980 523401 437743 478150
11056D78150o2211j15309N51228q1727l6098j66477Q8573J88904n0498j40055
$$ 478150 415939 300630 851858 770131 734033 567556 656129 845033 794535 654480
11046F54480J52958l01903J82223o3936K92661l35642N5572J93856A42491N47158
$$ 654480 807438 505535 687758 623822 916483 580841 636413 830269 142491 689649
11036F89649r0563J50175j95091N6420J24574j8521J50810k60314k37139J05278
$$ 689649 599086 749261 554170 610590 735164 716643 867453 607139 370000 475278
11026D75278L75740k65604k05821K31719p8572O6388J74564K1383j01872r5606
$$ 475278 851018 585414 379593 611312 532740 599128 773692 795075 693203 597597
11016E97597J11259P4214k10887J17586J90664C52960L57559k68186M45817k29178
$$ 597597 708856 783070 572183 689769 880433 352960 710519 442333 888150 658972
11006F58972Q3409l33204J91686K05264j9652C36163M28188j28793P2911j37028
$$ 658972 742381 409177 600863 806127 786475 336163 764351 635558 708469 571441
10996E71441J86991j86776B82328N72639j42348n990l19656K75812L77344j94716
$$ 571441 758432 571656 282328 854967 712619 706629 386973 662785 1040129 845413
10986H45413j13385L35158k00588l9592L30004k03038J06783J44050M16718k06564
$$ 845413 732028 1067186 866598 827006 1157010 953972 1060755 1204805 1621523 1414959
10976A414959N11570k81239P46221R7146K22086r1031L22568q8171j76341L4789
$$ 1414959 1926529 1645290 2391511 2488657 2710743 2619712 2942280 2854109 2677768 2712557
10966B712557q02234k26936K48984j64270P6271k72035j29101M29618q8954q9338
$$ 2712557 1910323 1683387 1932371 1768101 1844372 1572337 1443236 1872854 1783900 1694562
10956A694562J73911j1421l30043J07523k68654m39090o3703l65859M68431j70123
$$ 1694562 1868473 1857052 1527009 1634532 1365878 926788 863085 497226 965657 795534
10946G95534I4329M73004j3841C1645K92149A09330L45781m1150I3097J75333
$$ 795534 94329 567333 553492 31645 323794 109330 455111 413961 93097 268430
10936B68430b06138B57149G2644a21497H2831a29661F9737J81837f3172A08759
$$ 268430 -206138 257149 72644 -121497 82831 -129661 69737 251574 -63172 108759
10925A21868a24201A60890L9196o6855C2354h8830j14363b3390l3196j31740C87241
$$ 121868 -124201 160890 200086 133231 32354 -88830 -203193 -23390 -56586 -188326 387241
10913a27310N2962A05885l407q492b25028g9541F6758K4596J9107N5055a56494
$$ -127310 -74348 105885 102478 93986 -225028 -79541 66758 91354 110461 165516 -156494
10901c0162D3638J39357d9130j38238m0637C19725a37900d279G5144M706b25197
$$ -30162 43638 182995 -49130 -187368 -228005 319725 -137900 -4279 75144 79850 -225197
10889G2479J5667C0063a00104j02626k53993a47424N3026D2819M6827j7124c797
$$ 72479 88146 30063 -100104 -202730 -456723 -147424 -94398 42819 89646 72522 -3797
10877d45626F6739J42705c3433j79604g6214g732F1344a32831B48387n7267b18646
$$ -445626 66739 209444 -33433 -213037 -76214 -7732 61344 -132831 248387 191120 -218646
10865a41532O745L3243a324A92167J3349D2419L25732A36838b49282A42147D2275
$$ -141532 -134787 -101544 -1324 192167 205516 42419 368151 136838 -249282 142147 42275
10853b61408A98621a71617A3094J19212e830l40804C73161a75238Q159b6788k34510
$$ -261408 198621 -171617 13094 132306 -5830 -346634 373161 -175238 -167079 -26788 -261298
10842b61298E4783M36327B11247b69107J08431G2253a39485C41353A939R6331
$$ -261298 54783 491110 211247 -269107 -160676 72253 -139485 341353 1939 98270
10832I8270m9111a31815j3853O8831k55858A38325j6799c48266a57530B25802
$$ 98270 49159 -131815 -145668 -76837 -332695 138325 121526 -348266 -157530 225802
10821B4576e24091a37399D440b44513a840q0978M0128k43175J24702A07295c5125
$$ 24576 -524091 -137399 4440 -244513 -1840 -82818 -42690 -285865 -161163 107295 -35125
10809A24155b15356j603f6494q4605o1129p3196I7986l7200P9669O188a95346
$$ 124155 -215356 -216959 -66494 -151099 -212228 -285424 97986 60786 140455 146643 -195346
10797c9998j74182e6920j16326A94689A5215b29906B10522D5540a80749B81610
$$ -39998 -214180 -56920 -173246 194689 15215 -229906 210522 45540 -180749 281610
10786d8846j54569B3438N2471l7541b64346i2685E006a46158j731A86384c17286
$$ -48846 -203415 23438 75909 38368 -264346 -92685 5006 -146158 -147889 186384 -317286
10774a63174d3634p3520A55459k1905J45959J2997k4468b9562p303D12042b91266
$$ -163174 -43634 -117154 155459 133554 279513 292510 268042 -29562 -36865 412042 -291266
10762a35744G8934h1036H626a90102m395f1050K2068A37661K579a26643D11439
$$ -135744 78934 -81036 8626 -190102 -194497 -61050 -38982 137661 140240 -126643 411439
10750d4748J7915C06544c54736J39901i3089F7918J13722c1025j28573A16689
$$ -44748 -26833 306544 -354736 -214835 -93089 67918 181640 -31025 -159598 116689
10739b21828l7321a08759l910M0624j87569a09902A5054g2925q5212L259C08678
$$ -221828 -259149 -108759 -112669 -72045 -259614 -109902 15054 -72925 -158137 -154878 308678
10727a58016A650a83855l17500g8004D2615M9323a22432P957d7342n1599j69923
$$ -158016 1650 -183855 -501355 -78004 42615 91938 -122432 -114475 -47342 -98941 -268864
10716b68864A31851b20608C3633a19921l1878b6310l6191B42600A8501a63036
$$ -268864 131851 -220608 33633 -119921 -151799 -26310 -62501 242600 18501 -163036
10705b16149k8458g8391m816j9763C86883a55875B09112c00126P2732d6808j5796
$$ -216149 -244607 -78391 -83207 -102970 386883 -155875 209112 -300126 -227394 -46808 -62604
10694f2604B2927e3017J1418a0734B3887b2572j99096J7251k07288a24608D5465
$$ -62604 22927 -53017 -41599 -10734 23887 -22572 -221668 -204417 -411705 -124608 45465
10682a53509O853d4019G357e9710C0174a56160j82473I1971H886J53699R3762
$$ -153509 -146656 -44019 7357 -59710 30174 -156160 -338633 91971 8886 162585 256347
10671B56347I4221i89l29144C0202b31696e8717j95927f2496H1792b41727G2750
$$ 256347 94221 -989 -330133 30202 -231696 -58717 -254644 -62496 81792 -241727 72750
10659b49255d3799I8548b05398P2349d0718q8075o4392p1451e8128k45621D7287
$$ -249255 -43799 98548 -205398 -133049 -40718 -128793 -193185 -264636 -58128 -303749 47287
10647A80386i2527B7973a79517M4302l1141F261b72243N8468B27481a16684j22061
$$ 180386 -92527 27973 -179517 -135215 -166356 6261 -272243 -213775 227481 -116684 -238745
10636b38745c6483k99353i6946b796B92255k6603b38190e9188k0673j38970A14443
$$ -238745 -36483 -335836 -96946 -2796 292255 265652 -238190 -59188 -79861 -218831 114443
10624b4069p7918B0027c5628D5447G491a33450F0741a82543d3083h347j01628
$$ -24069 -101987 20027 -35628 45447 7491 -133450 60741 -182543 -43083 -8347 -109975
10613a09975r9906j03937B04290i4192A37450a26472n6480N0932O2331k3339B35753
$$ -109975 -209881 -313818 204290 -94192 137450 -126472 -182952 -132020 -69689 -93028 235753
10601i3476A79041b64722R4723k61431e5708j52245A55171a5501A78021a46360
$$ -93476 179041 -264722 -169999 -431430 -55708 -207953 155171 -15501 178021 -146360
10590d3931j82597A23641G155a63998O44B64935a06425I9576K45218F4858f6302
$$ -43931 -226528 123641 7155 -163998 -163354 264935 -106425 99576 344794 64858 -66302
10578C12325c4614j93718K8864l229N794o9624b745B62010d4121A00829c22568
$$ 312325 -34614 -228332 -199468 -202697 -196903 -266527 -2745 262010 -44121 100829 -322568
10566B39482j13404a3569p1149j44731Q0674J2415F9579a26450K5231j46431g0390
$$ 239482 126078 -13569 -84718 -229449 -148775 -136360 69579 -126450 -101219 -247650 -70390
10554G3248J92392g0190j72240C6339a38086B24579c98507F4365K54802q1734
$$ 73248 265640 -70190 -242430 36339 -138086 224579 -398507 64365 319167 237433
10544B37433q4761B1864L4165b45448R9913j03903A65668a18120A19345K06200
$$ 237433 152672 21864 56029 -245448 -145535 -249438 165668 -118120 119345 325545
10534C25545g1665o5110k01965D4580L3596a22997H3364l4544a26914A32501b36111
$$ 325545 -71665 -136775 -338740 44580 78176 -122997 83364 48820 -126914 132501 -236111
10522f0919B21099a06965B08029e0455k0770m1847C61034C523h303k70048F0198
$$ -60919 221099 -106965 208029 -50455 -71225 -113072 361034 3523 -8303 -278351 60198
10510a88615B23676d6311M116o1169H8360b91022d9660B01290H7389a03118L7809
$$ -188615 223676 -46311 -42195 -103364 88360 -291022 -49660 201290 87389 -103118 -65309
10499f5309c2582m00363C4433a12701A42342N19F0083b75180h6716B02886h5069
$$ -65309 -32582 -432945 34433 -112701 142342 142861 60083 -275180 -86716 202886 -85069
10487c7389j14481C54620B8936J69772J60511k8134j62293K48604o6229j8074
$$ -37389 -151870 354620 28936 198708 359219 331085 168792 417396 351167 333093
10477C33093j00332c1689I4952J5912a00380K5579I1488a28270A97860a22500
$$ 333093 232761 -31689 94952 110864 -100380 -74801 91488 -128270 197860 -122500
10466b74951a01593A45992f1996j48978g7126A49300m2241c69203A11137f0928
$$ -274951 -101593 145992 -61996 -210974 -77126 149300 107059 -369203 111137 -60928
10455H8375J86221A30566c8378f427I6838C0805a47064e3152G0978b8503k18913
$$ 88375 274596 130566 -38378 -6427 96838 30805 -147064 -53152 70978 -28503 -247416
10444b47416P5562K772A84047a44862A1483b09111B70859b3368A38477k1195f0699
$$ -247416 -171854 -169082 184047 -144862 11483 -209111 270859 -23368 138477 117282 -60699
10432a93704C2061D832c35256a4818p9828A12095J76074H9870C2053b60709A4162
$$ -193704 32061 4832 -335256 -14818 -94646 112095 288169 89870 32053 -260709 14162
10420C85152D7444K76644a28385q4634B84084d5113R322A99483q8051c37808a02583
$$ 385152 47444 324088 -128385 -213019 284084 -45113 -35791 199483 111432 -337808 -102583
10408A55055h0910A8311K03270B7179g6833b3088K809G0824c5107B50262D3095
$$ 155055 -80910 18311 221581 27179 -76833 -23088 -20279 70824 -35107 250262 43095
10396b35331N9246c6035I6078L0662e7845A11207n4253J13395B2086K51087G3914
$$ -235331 -176085 -36035 96078 126740 -57845 111207 56954 170349 22086 273173 73914
10384b08169A13418O8432C9512J81888c22231A83752N2462j10640a23709A00055
$$ -208169 113418 181850 39512 221400 -322231 183752 236214 125574 -123709 100055
10373C22508r8877k8293M44325k20733B03619L31585j38152p9153J24541K75562
$$ 322508 223631 195338 639663 418930 203619 535204 397052 317899 442440 718002
10363G18002l44166E9232b6266j24052B41818g7491D33592E0635b28833F44727
$$ 718002 373836 59232 -26266 -150318 241818 -77491 433592 50635 -228833 644727
10352D30600j02078M6388N1076K24567C03465P9362p0468C5155J47602M50629
$$ 430600 328522 374910 425986 650553 303465 382827 312359 35155 182757 633386
10342F33386j66000g1540k9117B84421J83278D3490c9005C34492H2043L0766b41550
$$ 633386 467386 -71540 -100657 284421 467699 43490 -39005 334492 82043 112809 -241550
10330b02761A46038l5594a0431A88424J17082L320A523O2859K55442H7655B6050
$$ -202761 146038 110444 -10431 188424 305506 308826 1523 64382 319824 87655 26050
10318e8530G0716L5085I979J07608a36069A55265K5415K1133B8801d40450g720
$$ -58530 70716 105801 9979 117587 -136069 155265 180680 201813 28801 -440450 -7720
10306I1716C0980a35812d9360F4011A818c63141e8286j04137k33129c0461C834
$$ 91716 30980 -135812 -49360 64011 1818 -363141 -58286 -162423 -395552 -30461 3834
10294A75296c73065D6831i4074B1784g575m64864A48782c23280C5485c40550R6586
$$ 175296 -373065 46831 -94074 21784 -7575 -472439 148782 -323280 35485 -340550 -243964
10283b43964A39463a4343B3058c9641j53329P2184B31216H3103R4276a8556k19536
$$ -243964 139463 -14343 23058 -39641 -192970 -120786 231216 83103 177379 -18556 -238092
10272b38092e6083j44991a2034A57340b43633H8255P4601a35539A32833P7433
$$ -238092 -56083 -201074 -12034 157340 -243633 88255 162856 -135539 132833 210266
10262B10266q019L84542a09966E27318p9764L1346a22941C35996A23531J6819
$$ 210266 202247 586789 -109966 527318 447554 478900 -122941 335996 123531 140350
10252A40350a16689J2949C72459i6138o1209n1116i6102L4239B38288c91172O8972
$$ 140350 -116689 -103740 372459 -96138 -157347 -208463 -96102 -61863 238288 -391172 -322200
10241c22200B02999a34268A39410C1613K43475C8843L532b86102a11744c4538
$$ -322200 202999 -134268 139410 31613 275088 38843 42375 -286102 -111744 -34538
10230D0021A7487i7197b7528F6127a7378C93686c7464C06838a09872j07543A63875
$$ 40021 17487 -97197 -27528 66127 -17378 393686 -37464 306838 -109872 -217415 163875
10218F8728B9278J16733G078f2561A00256N8278h3784o4844l42630D6310K38436
$$ 68728 29278 146011 7078 -62561 100256 158534 -83784 -148628 -491258 46310 284746
10207B84746b14256i8314d385B47863r2435N1712a48933j53007N589P9341H9170
$$ 284746 -214256 -98314 -4385 247863 155428 207140 -148933 -301940 -296351 -217010 89170
10195B18069a95120R7256A86251b71385d8747D0647c31825J60552E5242a39827
$$ 218069 -195120 -97864 186251 -271385 -48747 40647 -331825 -171273 55242 -139827
10184B49587C6207J8005M9302b64380o7092R1750A40468g105A86127f0903j06915
$$ 249587 36207 54212 103514 -264380 -331472 -239722 140468 -7105 186127 -60903 -167818
10173a67818L6981B37230a38616k7165p9089h3479k54361I22b03378P2857k87035
$$ -167818 -130837 237230 -138616 -165781 -244870 -83479 -337840 922 -203378 -130521 -417556
10162d17556Q5360J38384r6369n7010C0757b17604M9743J4103j70693a25742m651
$$ -417556 -332196 -193812 -290181 -347191 30757 -217604 -167861 -153758 -324451 -125742 -130393
10151a30393p155l5645A04237l9379a06047j25607k0130L7463B44817i4709d7013
$$ -130393 -137548 -173193 104237 64858 -106047 -231654 -251784 -214321 244817 -94709 -47013
10139b72258h8282B55749a65261N5597A03351a95087C41143I2547a89517h9391
$$ -272258 -88282 255749 -165261 -109664 103351 -195087 341143 92547 -189517 -89391
10128d362B10858f3918j4290p328j58813f523C1555K55028a15121j72294i2480
$$ -4362 210858 -63918 -78208 -85536 -244349 -6523 31555 286583 -115121 -287415 -92480
10116B5246e5088A66613n7838O8208a03768c6668J7965j24813k481r8365a07716
$$ 25246 -55088 166613 108775 176983 -103768 -36668 -18703 -143516 -145997 -244362 -107716
10104b02178J0066A19443b18314b3870B29800a50726B7767N5570b22296j9458
$$ -202178 -192112 119443 -218314 -23870 229800 -150726 27767 83337 -222296 -241754
10094b41754R4942j6832m3079g324j80547h4163K9372A63733Q0306Q559b68039
$$ -241754 -146812 -163644 -206723 -7324 -187871 -84163 -54791 163733 244039 252598 -268039
10082e1575H066J36413e1515E3028J48715c21424a08786j45116F8257k6881j7157
$$ -51575 8066 144479 -51515 53028 201743 -321424 -108786 -253902 68257 41376 24219
10071B4219a62838j31314J42825B3654J29361F6168b20045F3907J23560c49805
$$ 24219 -162838 -294152 -151327 23654 153015 66168 -220045 63907 187467 -349805
10060A51190N0550J70108j80946g0526k6330J1054K7027I9366b87220c3875C473
$$ 151190 201740 371848 190902 -70526 -96856 -85802 -58775 99366 -287220 -33875 3473
10048G3488f4674D01J9592C768a61430F0992a68922L9469k18433e9627A58402
$$ 73488 -64674 401 19993 3768 -161430 60992 -168922 -129453 -347886 -59627 158402
10036B09394b06474b5691A81817d9258m1835j44760R1824c3356B32285r4655c29134
$$ 209394 -206474 -25691 181817 -49258 -91093 -235853 -144029 -33356 232285 137630 -329134
10024a13109j08878f2335j4765k65571B84129p822d65225a79861L9240K9793J89
$$ -113109 -221987 -62335 -77100 -342671 284129 276307 -465225 -179861 -140621 -110828 -110639
10013a10639j34476H4569g282A84212c21543c7242m74496A78788b2495j33990
$$ -110639 -245115 84569 -7282 184212 -321543 -37242 -511738 178788 -22495 -156485
10003a56485d5331o7205k41618k02604A07262a09799k67994a84166N8969A08641
$$ -156485 -45331 -112536 -354154 -556758 107262 -109799 -377793 -184166 -125197 108641
9992c3172D052L54993a31951C7942d0874k03136A58182a72452A05364b37958J08795
$$ -33172 4052 359045 -131951 37942 -40874 -244010 158182 -172452 105364 -237958 -129163
9981a29163K5100j54874k0948f1572k25745A92322a93245B22317d2697k66143
$$ -129163 -104063 -258937 -279885 -61572 -287317 192322 -193245 222317 -42697 -308840
9971c08840b8621G251d8776j1976B6366K823a54954F685b27502A8673K7218d9833
$$ -308840 -28621 7251 -48776 -60752 26366 29189 -154954 6685 -227502 18673 45891 -49833
9958f7182j97897g0325C6495d64853f5273A59065C5414a88964O8459p0884d3156
$$ -67182 -265079 -70325 36495 -464853 -65273 159065 35414 -188964 -120505 -191389 -43156
9946g5986l33305d4906I4194a44472K8177D6475g8954k8769k4501l570e1428B68876
$$ -75986 -409291 -44906 94194 -144472 -116295 46475 -78954 -107723 -132224 -135794 -51428 268876
9933b86136h345E476a27900B04453b8997n4875b5288G624b54148d157k27164A02997
$$ -286136 -8345 5476 -127900 204453 -28997 -83872 -25288 7624 -254148 -4157 -231321 102997
9920a3287C21065b6364p207A80759d61735I9480C6722d3773G3038J1967P657b83387
$$ -13287 321065 -26364 -33571 180759 -461735 99480 36722 -43773 73038 85005 92662 -283387
9907a01774A1706a26411j89297g6229b1497A09562J03095F8617g4101H2989l1720
$$ -101774 11706 -126411 -315708 -76229 -21497 109562 212657 68617 -74101 82989 51269
9896E1269g873n0912G4847b10524e7294A48510J79804j54696A9845Q1252a54826
$$ 51269 -7873 -58785 74847 -210524 -57294 148510 328314 173618 19845 101097 -154826
9884B3892K0566b7756o2273j04285i5776j98283o3917R7980R3893A82340a95533
$$ 23892 44458 -27756 -90029 -194314 -95776 -294059 -357976 -259996 -166103 182340 -195533
9872b61532R3771c1005A77598o9773a22329j62654a28927j67157A28461P3140
$$ -261532 -167761 -31005 177598 107825 -122329 -284983 -128927 -296084 128461 201601
9862B01601a57826I1742b8499k0933D0551a10084p9743F5368B7660f2641l6074
$$ 201601 -157826 91742 -28499 -49432 40551 -110084 -189827 65368 27660 -62641 -98715
9851i8715I3613a55886d9640K088k04869a22129k65372J5071B5690O6147a17312
$$ -98715 93613 -155886 -49640 -47552 -252421 -122129 -387501 -372430 25690 91837 -117312
9839A21260K72276g681D4681Q2547n8423c42574A0984b93662A16679l0717J4922
$$ 121260 393536 -7681 44681 127228 68805 -342574 10984 -293662 116679 85962 100884
9828A00884f0268o5552a8346k8729j73108h1231K9758k27345J01971F2823a87416
$$ 100884 -60268 -125820 -18346 -47075 -220183 -81231 -51473 -278818 -176847 62823 -187416
9816H8168c46695J25840a5418p8602a1466l2390A12339a26991A16248a82213j22618
$$ 88168 -346695 -220855 -15418 -94020 -11466 -43856 112339 -126991 116248 -182213 -304831
9805c04831f498G9020d4605B93i8292a3086k69027a01514k9707l53994b26007
$$ -304831 -6498 79020 -44605 293 -98292 -13086 -282113 -101514 -131221 -485215 -226007
9793C0602K9468c1485j45664A16564f2226b9054k0464j79660h9617D8542P7537
$$ 30602 60070 -31485 -177149 116564 -62226 -29054 -49518 -229178 -89617 48542 126079
9782A26079c7308a731o9645A42941b45254f1298B08577a70720r083f4118J2990
$$ 126079 -37308 -1731 -71376 142941 -245254 -61298 208577 -170720 -179803 -64118 -51128
9771e1128j51018C0768a10025j5401C0791b40233b2826F4323j99A6582J3888d64369
$$ -51128 -202146 30768 -110025 -125426 30791 -240233 -22826 64323 64124 16582 30470 -464369
9758i9346j44439C6758c78785B73311g9264l903d881B57168J0988C0446a33342
$$ -99346 -243785 36758 -378785 273311 -79264 -83167 -4881 257168 268156 30446 -133342
9746C7939b37091A1328P870a45626N7952j82341a10521D8195a27423H9524a39370
$$ 37939 -237091 11328 19198 -145626 -87674 -270015 -110521 48195 -127423 89524 -139370
9734A99608b44179j01221a20381m763D4746a14416p7370I1483c95358C20801A48939
$$ 199608 -244179 -345400 -120381 -125144 44746 -114416 -191786 91483 -395358 320801 148939
9722a43923N3120A90196E6541K6526e3434m0862b549k28835g4888A66757a77883
$$ -143923 -90803 190196 56541 83067 -53434 -94296 -2549 -231384 -74888 166757 -177883
9710a62298B01244N4761j04216Q200n0324i8575A04104L6647K3137B3413b46802
$$ -162298 201244 256005 151789 159989 109665 -98575 104104 140751 163888 23413 -246802
9698B3006M1133d2328l8815k10173C02185A22529N5335a27661C0962d3339B4366
$$ 23006 64139 -42328 -81143 -291316 302185 122529 177864 -127661 30962 -43339 24366
9686A02595L6785a06859L5165B23762a71974k0927d0161j8704j69852A91961b95092
$$ 102595 139380 -106859 -71694 223762 -171974 -192901 -40161 -58865 -228717 191961 -295092
9674g5728j10529L3546a5136H811a30589l5457i127j63682B84372A21891a10708
$$ -75728 -186257 -152711 -15136 8811 -130589 -166046 -9127 -172809 284372 121891 -110708
9662A74098C0677a01701l31018B23523c42631J10310a15681j17128a2047j19806
$$ 174098 30677 -101701 -432719 223523 -342631 -232321 -115681 -232809 -12047 -131853
9652a31853M7604k17821R8496M276L5710e6570E6966K5577a89850N2976K4416
$$ -131853 -84249 -302070 -203574 -199298 -163588 -56570 56966 82543 -189850 -136874 -112458
9641a12458j22506I2236a4402j93041K5921L2610k09011J48134Q8740E1130J46002
$$ -112458 -234964 92236 -14402 -207443 -181522 -148912 -357923 -209789 -121049 51130 197132
9630A97132g6313B15346E9443a04137D1904i3316M5439r356q8522o285J5127A06590
$$ 197132 -76313 215346 59443 -104137 41904 -93316 -47877 -57233 -145755 -152040 -136913 106590
9617C3236j6496d40870d1410J2532B34285b72533J21961k22933J71631f2255B4645
$$ 33236 16740 -440870 -41410 -28878 234285 -272533 -150572 -373505 -201874 -62255 24645
9605B5285J0066a27366l8859c9640j26289k56289a63924P9232l29500a5262j89303
$$ 25285 35351 -127366 -166225 -39640 -165929 -422218 -163924 -84692 -414192 -15262 -204565
9594b04565l4614R5658a5436E8507M7576b64989B14254B7587c6587n2530k11458
$$ -204565 -239179 -143521 -15436 58507 106083 -264989 214254 27587 -36587 -89117 -300575
9583c00575j10216A14250a46753A2345a3252D60208A28092i5581I9770c22443
$$ -300575 -410791 114250 -146753 12345 -13252 460208 128092 -95581 99770 -322443
9572B9687q528a89910K9192j50836g1152H964K2504a25362L4990A49560a16375
$$ 29687 21159 -189910 -160718 -311554 -71152 8964 31468 -125362 -90372 149560 -116375
9560c98792P2543I3670a96525b0940q3330k10766a49357B17525g9616B23343m5760
$$ -398792 -326249 93670 -196525 -20940 -104270 -315036 -149357 217525 -79616 223343 177583
9549A77583b60376B7051K76882a8138o7809E3573a4538n9313A74783a4234B12752
$$ 177583 -260376 27051 303933 -18138 -85947 53573 -14538 -73851 174783 -14234 212752
9537c4899B486d22623A22136B2626a6233o3317I6676c08241g5924C979f0430B4920
$$ -34899 2486 -422623 122136 22626 -16233 -79550 96676 -308241 -75924 3979 -60430 24920
9524a21218C24592H0047a60029b5084A37226K74026a8815A05075a15955M8001
$$ -121218 324592 80047 -160029 -25084 137226 411252 -18815 105075 -115955 -67954
9514f7954k8459a1124k25499H5614j2640d3899F5327a32377A05772J12111B1373
$$ -67954 -96413 -11124 -236623 85614 72974 -43899 65327 -132377 105772 217883 21373
9502b39919J02146j48167h0745L6919K0492A37472b05039B2924e4013E2864Q987
$$ -239919 -137773 -285940 -80745 -43826 -23334 137472 -205039 22924 -54013 52864 61851
9491F1851d0861j43044k67639M9704B88053e00534B6950K29350g2623J2066A38416
$$ 61851 -40861 -183905 -451544 -401840 288053 -500534 26950 256300 -72623 -60557 138416
9479b770p5613A3860c7255J5111j55744D67468a19835F2853a76629k41062b3593
$$ -2770 -78383 13860 -37255 -22144 -177888 467468 -119835 62853 -176629 -417691 -23593
9467A21725c19154h5667K01l15703B09845H5243a49834B40469a41588M9932j42175
$$ 121725 -319154 -85667 -85466 -401169 209845 85243 -149834 240469 -141588 -91656 -233831
9456b33831A06259f7589r865p7385G4757P9109d7783A5453h6901B1968a3255C77532
$$ -233831 106259 -67589 -77454 -154839 74757 153866 -47783 15453 -86901 21968 -13255 377532
9443C7506c12893A53173J65197a16098B74168a65162E6683L3759M1407b32099
$$ 37506 -312893 153173 318370 -116098 274168 -165162 56683 90442 131849 -232099
9432A12633a95159C16506a35620a6115k15086j19237h3B51593g1665A62915a89829
$$ 112633 -195159 316506 -135620 -16115 -231201 -350438 -83 251593 -71665 162915 -189829
9420B4912a90545k11486h4994j70988a10561C02897D3023a71173k3936O5194j9183
$$ 24912 -190545 -402031 -84994 -255982 -110561 302897 43023 -171173 -195109 -129915 -149098
9409a49098j17621C5741J47776F7297a05273O793A48922f9508A10233L8056a12548
$$ -149098 -266719 35741 183517 67297 -105273 -98480 148922 -69508 110233 148289 -112548
9397c0883j73733i0087E2589c07932B48061r2898F5769f1770B75945G2864a71893
$$ -30883 -204616 -90087 52589 -307932 248061 155163 65769 -61770 275945 72864 -171893
9385a66674A7659a190p3953j52603P3248j60495J05205A36927d17321a47361H4221
$$ -166674 17659 -1190 -75143 -227746 -154498 -314993 -209788 136927 -417321 -147361 84221
9373e8386l917l8224l1014J2984r9835D0950g0543A22290K45837a00252B16118
$$ -58386 -62303 -100527 -131541 -118557 -218392 40950 -70543 122290 368127 -100252 216118
9361a50115B31986a07809n4260j99546D3288R0940g4949C3985a8782j38611j99313
$$ -150115 231986 -107809 -162069 -361615 43288 134228 -74949 33985 -18782 -157393 -356706
9350c56706j3995j07878a54535C11691b18696d4012p3055l0611L7011H0652f8761
$$ -356706 -370701 -478579 -154535 311691 -218696 -44012 -117067 -147678 -110667 80652 -68761
9338c35003A6248a53139C9611h7259M1274m5122G8381a32878o1344i3730B455
$$ -335003 16248 -153139 39611 -87259 -45985 -91107 78381 -132878 -194222 -93730 2455
9326D7008a47670A01368c7056a003k83762n0413f8485r0829A08961l1676b22049
$$ 47008 -147670 101368 -37056 -1003 -284765 -335178 -68485 -159314 108961 77285 -222049
9314b9550j37083J4803o1409A56543b21789j31829a592o0492j08556J2833e0873
$$ -29550 -166633 -151830 -213239 156543 -221789 -353618 -1592 -62084 -170640 -157807 -50873
9302b80135D01131g8667k7922j79122m0076h9781J3914J0755p290j24512B358
$$ -280135 401131 -78667 -106589 -285711 -325787 -89781 -75867 -65112 -72402 -196914 2358
9290E1695g9933j96978H1746r37K15894b37129k28406b4243A04149e7389K8531
$$ 51695 -79933 -276911 81746 80809 296703 -237129 -465535 -24243 104149 -57389 -28858
9279b8858D0820J14674a34933A86421b82981G0369c3335G486c29540J47944G0542
$$ -28858 40820 155494 -134933 186421 -282981 70369 -33335 7486 -329540 -181596 70542
9267a76450D11L3917J45289b6891n27077A10455P3949b33024R8223M914A00207
$$ -176450 411 34328 179617 -26891 -553968 110455 184404 -233024 -134801 -129887 100207
9255B90154B8659a27141M7271m7143j45492K7064F4938f1348C45989B4135J93535
$$ 290154 28659 -127141 -79870 -127013 -272505 -245441 64938 -61348 345989 24135 217670
9244B17670n8169P505c7889C9220J18937D0834b55396O1027g2214B88504a42379
$$ 217670 159501 167006 -37889 39220 158157 40834 -255396 -194369 -72214 288504 -142379
9232b27320p6563a39662A00299h5752A96541a29948p865K0033k165N1502B4650
$$ -227320 -303883 -139662 100299 -85752 196541 -129948 -137813 -117780 -119945 -68443 24650
9220b68490c1547C39828a07109j58934Q9384P6390A22794E0274i207A41590i9291
$$ -268490 -31547 339828 -107109 -266043 -176659 -100269 122794 50274 -9207 141590 -99291
9208A65619l5205a15385d9768A86141A0348L2448b41571f349A26887f7623J0083
$$ 165619 130414 -115385 -49768 186141 10348 42796 -241571 -6349 126887 -67623 -57540
9197e7540B8759b4251j15953K6163B36625a02618E0909b27967B51575a70230f9177
$$ -57540 28759 -24251 -140204 -114041 236625 -102618 50909 -227967 251575 -170230 -69177
9185G8341e8100B1258b17866h741l3628D1928b25643M6865a6225m6643m67337
$$ 78341 -58100 21258 -217866 -8741 -42369 41928 -225643 -178778 -16225 -62868 -530205
9174e30205J59850A69167a42082H7456c46290d9764f640A09824c37890b5470o6471
$$ -530205 -370355 169167 -142082 87456 -346290 -49764 -6640 109824 -337890 -25470 -91941
9163i1941m254A99947a6229k19468j99260b08951k2531j64870A23959b09066k6478
$$ -91941 -96195 199947 -16229 -235697 -434957 -208951 -231482 -396352 123959 -209066 -235544
9152b35544C11242b2233r3547a6229A07416a59352f9704j12166g7743o9765L4858
$$ -235544 311242 -22233 -115780 -16229 107416 -159352 -69704 -181870 -77743 -147508 -112650
9141a12650j68393B02825d1782l1669k96734D9957L522a41054d7518A26350b79855
$$ -112650 -281043 202825 -41782 -73451 -370185 49957 53479 -141054 -47518 126350 -279855
9129a31672a1257j43594h373D9543a52963I3960O6509b34866f1452j54927b7642
$$ -131672 -11257 -154851 -8373 49543 -152963 93960 160469 -234866 -61452 -216379 -27642
9117A98119J18998b5707p9100k8150H4298d11548A42060b78579c3446k92364O1073
$$ 198119 317117 -25707 -104807 -132957 84298 -411548 142060 -278579 -33446 -325810 -264737
9106b64737e3633j826k21656D878a24289r9748b4314H0643b51539c6573A98905
$$ -264737 -53633 -55459 -277115 4878 -124289 -224037 -24314 80643 -251539 -36573 198905
9094A79481a04678b9463m23688f9564H9093a75256D8357j5895J40124q680b92287
$$ 179481 -104678 -29463 -453151 -69564 89093 -175256 48357 32462 172586 163906 -292287
9082H2893K37009q2168a61677C5456b15931F8811K60421b27854p6209C1060g4975
$$ 82893 319902 237734 -161677 35456 -215931 68811 329232 -227854 -304063 31060 -74975
9070a00082k42468A71978J10970F9259i0790A97547N882G2411a41046F992f169
$$ -100082 -342550 171978 282948 69259 -90790 197547 203429 72411 -141046 6992 -6169
9058a42174p1559O4713n7665n4299c6656A76076i2979E9077d1961B17146L9175
$$ -142174 -213733 -149020 -206685 -260984 -36656 176076 -92979 59077 -41961 217146 256321
9047B56321c13953a24637A88412a73026J0480n404j63346a57975B83141b37934
$$ 256321 -313953 -124637 188412 -173026 -162546 -167950 -331296 -157975 283141 -237934
9036F3526g1844A28593c62403J46637A04709h3166E8255a93284A02631b27789
$$ 63526 -71844 128593 -362403 -215766 104709 -83166 58255 -193284 102631 -227789
9025c1550A83758A7804O2170J5079a24565j90589B45619j22261k3506D9544a30879
$$ -31550 183758 17804 79974 95053 -124565 -315154 245619 123358 99852 49544 -130879
9013d69875J04695d2438j37403A12516J64016a03732A93669a60995j39837A68181
$$ -469875 -365180 -42438 -179841 112516 276532 -103732 193669 -160995 -300832 168181
9002e3819k25426D53736I777J38891b25662P1904A28140A6835b61192F0370a89589
$$ -53819 -279245 453736 9777 148668 -225662 -153758 128140 16835 -261192 60370 -189589
8990d71284f4204J3474A1080d45821B2821b84040h9702l637k43323J67082P834
$$ -471284 -64204 -50730 11080 -445821 22821 -284040 -89702 -93339 -336662 -169580 -161746
8979a61746e6332k5109j03831F752J17456K6059h5153C4489i95j11019H111P0486
$$ -161746 -56332 -81441 -185272 6752 124208 150267 -85153 34489 -995 -112014 8111 78597
8967G8597c8559j79174A10626M1078d9842k12048A82448b64277a00846j28044
$$ 78597 -38559 -217733 110626 151704 -49842 -261890 182448 -264277 -100846 -228890
8957b28890e4723A30508b39498D9829c428k77035i7898d5617H2219b07161a756
$$ -228890 -54723 130508 -239498 49829 -3428 -280463 -97898 -45617 82219 -207161 -1756
8945b85262a26430K798D5605d6996J5558j09325D0302J16196Q2780a58672a6383
$$ -285262 -126430 -123632 45605 -46996 -31438 -140763 40302 156498 239278 -158672 -16383
8933C08728A46599o6932M1868J67451a1967o7628G2677l4715K28598N73776J073467
$$ 308728 146599 79667 121535 288986 -11967 -79595 72677 37962 266560 840336 1913803
8922A913803M714713N800832o066999A990697r80936D69399J10053A4309R893
$$ 1913803 6628516 12429348 6362349 1990697 1009761 469399 579452 14309 24202
8913B4202a10118F5654a67226I1764A6203L24239A62889m006a87929O8100B78212
$$ 24202 -110118 65654 -167226 91764 16203 340442 162889 158883 -187929 -119829 278212
8901A90684a79790C3836J19003a4661m6311K6479j83339H0347R4040c29411D819
$$ 190684 -179790 33836 152839 -14661 -60972 -34493 -217832 80347 174387 -329411 4819
8889c45419A89924D6457a60914K4105G8297a21860B53426a59611D35207a07307
$$ -345419 189924 46457 -160914 -136809 78297 -121860 253426 -159611 435207 -107307
8878b97402G5797J86655B4778a95208A88514a57103K9883A45841h427r9572B73960
$$ -297402 75797 262452 24778 -195208 188514 -157103 -127220 145841 -8427 -107999 273960
$$ [...]
##END NTUPLES=NMR SPECTRUM
##END=
