
##TITLE=AC1302_PERAH12114_7525498_Bu7zzF2CVs
##JCAMPDX= 6.0         $$ Bruker NMR JCAMP-DX V2.0
##DATA TYPE= NMR SPECTRUM
##DATA CLASS= NTUPLES
##ORIGIN= BRUKER
##OWNER= Administrator
$$ 1.72 TOPSPIN		Version 2.1
$$ 2013-02-21 00:12:10.319 -0500  Administrator@X
$$ Compression mode = diff/dup
##.OBSERVE FREQUENCY= 400.02188249412
##.OBSERVE NUCLEUS= ^1H
##.ACQUISITION MODE= SIMULTANEOUS (DQD)
##.ACQUISITION SCHEME= undefined
##.AVERAGES= 64
##.DIGITISER RES= 22
##SPECTROMETER/DATA SYSTEM= spect
##.PULSE SEQUENCE= noesygpps1d.comp
##.SOLVENT NAME= COFFEE_meoh
##.SHIFT REFERENCE= INTERNAL, COFFEE_meoh, 1, 14.96117
##AUDIT TRAIL= $$ (NUMBER, WHEN, WHO, WHERE, PROCESS, VERSION, WHAT)
$$ ##TITLE= Audit trail, TOPSPIN		Version 2.1
$$ ##JCAMPDX= 5.01
$$ ##ORIGIN= Bruker BioSpin GmbH
$$ ##OWNER= Administrator
$$ $$ E:\/data/COFFEE/nmr/AC1302_PERAH12114_7525498_Bu7zzF2CVs/52/pdata/1/auditp.txt
$$ ##AUDIT TRAIL=  $$ (NUMBER, WHEN, WHO, WHERE, PROCESS, VERSION, WHAT)
(   1,<2013-02-21 00:12:04.444 -0500>,<Administrator>,<X>,<go>,<TOPSPIN 2.1>,
      <created by zg
	started at 2013-02-21 00:00:33.206 -0500,
	POWCHK enabled, PULCHK disabled,
       configuration hash MD5:
       86 BA 57 50 F2 9D 5C 9B 26 00 A9 28 5F 66 2E 89
       data hash MD5: 64K
       FE F2 B1 A5 4C 39 E8 8F 27 55 5D 98 D8 6F 9C 97>)
(   2,<2013-02-21 00:12:07.553 -0500>,<Administrator>,<X>,<proc1d>,<TOPSPIN 2.1>,
      <Start of raw data processing
       efp LB = 0.3 FT_mod = 6 PKNL = 1 PHC0 = 0 PHC1 = 0 SI = 128K 
       data hash MD5: 128K
       D4 54 B6 72 12 B9 CC F3 43 3B C9 61 D2 B2 D3 FA>)
(   3,<2013-02-21 00:12:08.616 -0500>,<Administrator>,<X>,<proc1d>,<TOPSPIN 2.1>,
      <pk PHC0 = 252.8174 PHC1 = 0 
       data hash MD5: 128K
       EA 09 98 EE 33 E6 A9 54 CF 8F DE FC 55 98 96 50>)
(   4,<2013-02-21 00:12:09.319 -0500>,<Administrator>,<X>,<proc1d>,<TOPSPIN 2.1>,
      <abs ABSG = 1 
       data hash MD5: 128K
       91 0E AF F3 C6 8A FB FE B2 64 32 95 DA 9C 7B 05>)
(   5,<2013-02-21 00:12:09.491 -0500>,<Administrator>,<X>,<proc1d>,<TOPSPIN 2.1>,
      <abs ABSG = 2 
       data hash MD5: 128K
       51 EE 86 2C 1B 24 30 F2 FA 47 B8 26 1D C7 B9 9B>)
(   6,<2013-02-21 00:12:09.663 -0500>,<Administrator>,<X>,<proc1d>,<TOPSPIN 2.1>,
      <abs ABSG = 3 
       data hash MD5: 128K
       7E 2C AD 84 F8 B1 29 F0 BA EE C9 03 86 C1 32 9B>)
(   7,<2013-02-21 00:12:09.803 -0500>,<Administrator>,<X>,<proc1d>,<TOPSPIN 2.1>,
      <abs ABSG = 4 
       data hash MD5: 128K
       7F 0D 83 9F 6D 43 A7 3B 3A 94 C6 09 A5 27 DC 21>)
(   8,<2013-02-21 00:12:09.975 -0500>,<Administrator>,<X>,<proc1d>,<TOPSPIN 2.1>,
      <abs ABSG = 5 
       data hash MD5: 128K
       BA 96 5C 8F 66 87 E0 72 FA 9F DA 04 5C DB 67 CC>)
$$ ##END=
$$ 
$$ $$ hash MD5
$$ $$ DF 98 B3 9A C7 C9 B8 95 24 85 6B 40 50 1E AE 83
##$RELAX= 
##$RELAX= 
##$RELAX= 
##$RELAX= 
##$RELAX= 
##$RELAX= 
##$RELAX= 
##$RELAX= 
$$ Bruker specific parameters
$$ --------------------------
##$DU= <E:\>
##$EXPNO= 52
$$ [...]
150 150 150 150 150 150 150 150
##$TP07= 0
##$TPNAME0= <>
##$TPNAME1= <>
##$TPNAME2= <>
##$TPNAME3= <>
##$TPNAME4= <>
##$TPNAME5= <>
##$TPNAME6= <>
##$TPNAME7= <>
##$TPOAL= (0..7)
0.5 0.5 0.5 0.5 0.5 0.5 0.5 0.5
##$TPOFFS= (0..7)
0 0 0 0 0 0 0 0
##$TUNHIN= 0
##$TUNHOUT= 0
##$TUNXOUT= 0
##$USERA1= <user>
##$USERA2= <user>
##$USERA3= <user>
##$USERA4= <user>
##$USERA5= <user>
##$V9= 5
##$VALIST= <valist>
##$VCLIST= <CCCCCCCCCCCCCCC>
##$VD= 0
##$VDLIST= <DDDDDDDDDDDDDDD>
##$VPLIST= <PPPPPPPPPPPPPPP>
##$VTLIST= <TTTTTTTTTTTTTTT>
##$WBST= 1024
##$WBSW= 4
##$XGAIN= (0..3)
0 0 0 0
##$XL= 0
##$YL= 0
##$YMAX_a= 6177584
##$YMIN_a= -10409451
##$ZGOPTNS= <>
##$ZL1= 120
##$ZL2= 120
##$ZL3= 120
##$ZL4= 120
##$ABSF1= 14.96117
##$ABSF2= -5.597012
##$ABSG= 5
##$ABSL= 3
##$ALPHA= 0
##$AQORDER= 0
##$ASSFAC= 0
##$ASSFACI= 0
##$ASSFACX= 0
##$ASSWID= 0
##$AUNMP= <proc_prof1d_extract.lims>
##$AXLEFT= 0
##$AXNAME= <>
##$AXNUC= <1H>
##$AXRIGHT= 0
##$AXTYPE= 0
##$AXUNIT= <>
##$AZFE= 0.1
##$AZFW= 0.1
##$BCFW= 0
##$BC_mod= 0
##$BYTORDP= 0
##$COROFFS= 0
##$CY= 15
##$DATMOD= 1
##$DC= 0
##$DFILT= <>
##$DTYPP= 0
##$F1P= 0
##$F2P= 0
##$FCOR= 0.5
##$FTSIZE= 131072
##$FT_mod= 6
##$GAMMA= 0
##$GB= 0
##$INTBC= 1
##$INTSCL= 1
##$ISEN= 128
##$LB= 0.3
##$LEV0= 0
##$LPBIN= 0
##$MAXI= 10000
##$MC2= 0
##$MEAN= 0
##$ME_mod= 0
##$MI= 0
##$NCOEF= 0
##$NC_proc= -2
##$NLEV= 6
##$NOISF1= 0
##$NOISF2= 0
##$NSP= 0
##$NTH_PI= 0
##$NZP= 0
##$OFFSET= 14.96117
##$PC= 1
##$PHC0= 252.8174
##$PHC1= 0
##$PH_mod= 1
##$PKNL= yes
##$PPARMOD= 0
##$PPDIAG= 0
##$PPIPTYP= 0
##$PPMPNUM= 2147483647
##$PPRESOL= 1
##$PSCAL= 4
##$PSIGN= 0
##$PYNMP= <proc.py>
##$REVERSE= no
##$SF= 400.020009569091
##$SI= 131072
##$SIGF1= 0
##$SIGF2= 0
##$SINO= 400
##$SIOLD= 131072
##$SPECTYP= <>
##$SREGLST= <1H.CDCl3>
##$SSB= 0
##$STSI= 131072
##$STSR= 0
##$SW_p= 8223.68421052631
##$SYMM= 0
##$S_DEV= 0
##$TDeff= 65536
##$TDoff= 0
##$TI= <>
##$TILT= no
##$TM1= 0
##$TM2= 0
##$TOPLEV= 0
##$USERP1= <user>
##$USERP2= <user>
##$USERP3= <user>
##$USERP4= <user>
##$USERP5= <user>
##$WDW= 1
##$XDIM= 131072
##$YMAX_p= 423555258
##$YMIN_p= -10859
##$CURPLOT= <Network HP LaserJet P1505>
##$CURPRIN= <$Network HP LaserJet P1505>
##$DFORMAT= <normdp>
##$LAYOUT= <+/1D_H.xwp>
##$LFORMAT= <normlp>
##$PFORMAT= <normpl>
##$SURQMSG= 1
$$ End of Bruker specific parameters
$$ ---------------------------------
##NTUPLES= NMR SPECTRUM
##VAR_NAME=  FREQUENCY,     SPECTRUM/REAL,   SPECTRUM/IMAG
##SYMBOL=    X,             R,               I
##VAR_TYPE=  INDEPENDENT,   DEPENDENT,       DEPENDENT
##VAR_FORM=  AFFN,          ASDF,            ASDF
##VAR_DIM=   131072,        131072,          131072
##UNITS=     HZ,            ARBITRARY UNITS, ARBITRARY UNITS
##FACTOR=    0.0627417313425164, 1,          1
##FIRST=     8223.62146879497, 857,          -62323
##LAST=      0,             2318,            -62540
##MIN=       0,             -10859,          0
##MAX=       8223.62146879497, 423555258,    0
$$ Real data points
##PAGE= N=1
##DATA TABLE= (X++(R..R)), XYDATA
$$ [...]
67896 80210 81547 81695 81496 81779 82586 83562 84447 84881 84407 83150 82088 82111 83040 83929 84100 83470 82199 80545
67878 80545 79051 78330 78576 79424 80299 80769 80764 80756 81460 82998 84495 84955 84382 83580 82951 82166 81084 80269 80208
67859 80208 80546 80595 80257 79981 80047 80376 80926 81754 82647 83129 82932 82228 81318 80318 79234 78140 77213 76681 76703
67840 76703 77163 77658 77895 77983 78047 77729 76609 75125 74413 74894 75568 75196 73849 72771 72917 74195 75988 77829
67822 77829 79491 80919 82218 83346 83851 83357 82370 81988 82613 83497 83860 83903 84203 84615 84433 83425 82024
67805 82024 80555 78921 77108 75454 74237 73393 72783 72364 71941 71157 69922 68587 67528 66882 66771 67340
67789 67340 68241 68529 67564 65869 64630 64421 64808 65130 65200 65139 64964 64655 64466 64864 66081 67793 69297 70072
67771 70072 70269 70650 71932 74178 76801 79032 80269 80205 79001 77449 76681 77403 79374 81641 83259 83841
67755 83841 83643 83232 82993 82829 82360 81416 80278 79435 79240 79832 81113 82626 83642 83681 82928 81928 80972 80041
67737 80041 79302 79180 79712 80148 79571 77806 75508 73467 72092 71434 71322 71428 71500 71614 71969 72423 72566 72330
67719 72330 72109 72087 71805 70748 69056 67299 65770 64446 63430 62946 62879 62817 62599 62423 62374 62330 62412 63018 64122
67700 64122 65016 65149 64879 64984 65635 66320 66615 66590 66504 66487 66573 66733 66790 66488 65718 64600 63456 62807 63180 64599
67680 64599 66368 67651 68188 68192 67826 67264 67122 68075 69856 71240 71361 70600 69830 69282 68742 68418 68916 70360
67662 70360 72157 73683 74743 75247 75012 74151 73301 73089 73543 74184 74494 74113 72984 71604 70879 71232 72039
67645 72039 72381 72281 72630 73822 75083 75467 74992 74359 73943 73683 73747 74525 75858 76840 76731 75715 74529 73672
67627 73672 73276 73410 74091 75024 75697 75868 75846 76216 77281 78706 79753 80044 80038 80510 81570 82604 83265 83994
67609 83994 85219 86526 87113 86788 85967 84903 83512 81832 80075 78285 76504 75259 75187 76044 76760 76681 76156
67592 76156 75616 74755 73124 71075 69488 68817 68852 69178 69443 69383 69012 68671 68585 68565 68473 68657 69485 70670 71592
67573 71592 72075 72330 72304 71784 71064 70836 71231 71606 71539 71508 72202 73525 74674 75002 74489 73510 72473 71621 71002
67554 71002 70543 70176 69864 69617 69624 70187 71246 72106 71994 70899 69512 68409 67784 67922 69229 71461 73449
67537 73449 74068 73281 71968 71059 71064 72010 73350 74202 74106 73367 72394 71092 69357 67757 66973 66762 66211 65068
67519 65068 64112 64075 64839 65960 67325 68840 69957 70115 69525 69017 69053 69235 68871 67886 67002 66963 67657 68153 67753
67500 67753 66840 66409 66867 67673 68189 68389 68576 68834 69069 69321 69671 69989 70083 69966 69762 69464 69055 68716 68633 68686
67480 68686 68567 68136 67456 66656 65976 65789 66213 66763 66758 66059 65148 64541 64443 64861 65648 66425 66870 67182 67805 68638
67460 68638 68967 68405 67449 66854 66857 67324 68213 69431 70540 71133 71368 71666 71980 71834 71020 69806 68473 67128
67442 67128 66066 65828 66653 68168 69793 71232 72419 73259 73606 73380 72615 71591 70891 71013 71838 72763 73418
67425 73418 73849 73946 73240 71620 69809 68647 68196 68023 68133 69009 70736 72649 73946 74288 73762 72647 71384
67408 71384 70442 70070 70332 71379 73271 75434 76733 76379 74629 72400 70431 68994 68164 67970 68299 68837
67392 68837 69245 69396 69523 70075 71248 72635 73581 73910 74032 74270 74417 74167 73657 73237 73015 72969 73359 74515
67374 74515 76203 77596 78035 77607 76934 76591 76759 77227 77616 77746 77854 78345 79268 80163 80483 80105 79436 79075
67356 79075 79295 79754 79766 78984 77741 76605 75833 75465 75674 76491 77272 77105 75999 75135 75552 76982 78454 79644
67338 79644 80927 82226 82637 81616 79985 79266 80172 82127 84159 85798 87083 88119 88946 89645 90248 90559
67322 90559 90321 89614 88887 88479 88242 87814 87155 86632 86554 86830 87074 86934 86329 85564 85281 86054 87803 89685 90792
67303 90792 90997 90993 91487 92484 93428 93963 94375 95209 96527 97711 98069 97500 96452 95354 94313 93320 92424 91610
67285 91610 90759 89862 89069 88362 87464 86350 85621 85990 87419 89114 90348 90926 90945 90532 89995 89823 90266 91164
67267 91164 92369 93985 95972 97826 99022 99581 99860 100023 100060 100112 100253 100137 99449 98678 98842 100281 102250
67250 102250 103888 105002 105673 105714 105077 104333 104130 104433 104763 104966 105184 105291 104993 104399 103880 103434 102872 102671
67232 102671 103759 106123 108297 108810 107712 106277 105555 105732 106494 107342 107637 106907 105296 103476 102161 101838
67216 101838 102738 104657 106932 108986 110852 112783 114497 115303 115062 114536 114599 115406 116518 117548 118434 119232
67200 119232 119870 120112 119777 119024 118405 118437 119205 120474 122038 123712 125152 126059 126503 126699 126581 126061 125652 126194
67182 126194 127739 129311 130114 130514 131366 132744 133886 134275 134204 134244 134540 134757 134561 134015 133523 133327 133150 132580
67164 132580 131821 131686 132676 134379 136054 137435 138637 139631 140329 140984 141923 142940 143461 143366 143201 143519 144407
67147 144407 145717 147309 148858 149816 149859 149239 148540 148218 148405 148997 149814 150827 152210 154009 155832 157161
67131 157161 157972 158714 159659 160651 161597 162750 164248 165740 166794 167450 168087 168883 169705 170358 170718 170761 170712 171053
67113 171053 172089 173600 175139 176618 178246 179961 181283 181933 182383 183506 185665 188295 190459 191767 192673
67098 192673 193888 195659 197697 199621 201291 202756 204113 205391 206419 206888 206802 206754 207412 208689 209820 210299
67082 210299 210407 210739 211634 213212 215460 217990 220162 221799 223395 225250 226872 227788 228496 229940 232229
67067 232229 234628 236700 238748 241090 243556 245880 248038 250087 252156 254696 258070 261751 264512 265788
67053 265788 266261 266843 267686 268626 269948 272004 274447 276617 278508 280686 283337 286009 288327 290369 292296
67038 292296 294130 296090 298629 301910 305530 308990 312209 315404 318669 321811 324479 326434 327917 329773
67024 329773 332824 336969 341205 344737 347778 351006 354529 357831 360682 363652 367555 372561 377984 382846
67010 382846 386631 389592 392435 395672 399287 403042 407001 411512 416588 421540 425534 428605 431829 436311
66996 436311 442128 448432 454463 460102 465447 470378 474890 479517 484916 491127 497644 504192 510981 518151
66982 518151 525423 532528 539569 546688 553705 560393 566830 573140 579181 584928 591019 598339 607025 616329
66968 616329 625571 634806 644391 654340 664388 674399 684386 694271 703932 713387 722769 732212 741966 752409
66954 752409 763661 775327 786898 798315 809843 821560 833368 845516 858552 872598 887101
66943 887101 901589 916280 931596 947356 962977 978323 993933 1010362 1027710 1045819 1064509
66932 1064509 1083410 1101971 1119941 1137725 1156066 1175464 1195993 1217428 1239306 1261040 1282323
66921 1282323 1303449 1325044 1347449 1370479 1393695 1416799 1439836 1463224 1487489 1512717 1538328
66910 1538328 1563631 1588599 1613794 1639555 1665706 1692127 1719127 1746844 1774678 1801874 1828551
66899 1828551 1855572 1883318 1911098 1937962 1963728 1988932 2014069 2039168 2063859 2087560 2109785
66888 2109785 2130678 2151124 2171921 2192852 2212917 2231468 2248638 2264631 2279171 2291987 2303319
66877 2303319 2313407 2321787 2327760 2331465 2333902 2335850 2337318 2338122 2338347 2337858 2335959 2332077 2326507 2319839
66863 2319839 2311850 2301596 2288701 2273973 2258529 2242778 2226528 2209682 2192247 2173825 2153668
66852 2153668 2131441 2107620 2082968 2057802 2032041 2005804 1979612 1953888 1928453 1902718 1876308
66841 1876308 1849379 1822344 1795420 1768438 1740997 1712836 1684115 1655345 1626921 1598855 1571086
66830 1571086 1543905 1517696 1492272 1466888 1441113 1415293 1389932 1364977 1340156 1315727 1292308
66819 1292308 1270014 1248288 1226681 1205268 1184155 1163053 1141679 1120261 1099285 1078961 1059243
66808 1059243 1040165 1021764 1003771 985794 967884 950546 934047 917943 901552 884796 868362
66797 868362 852970 838639 824812 811093 797656 784808 772367 759778 746834 733959 721676
66786 721676 710032 698729 687624 676730 665865 654663 643126 631842 621417 611801 602409 592921
66774 592921 583691 575232 567514 560048 552575 545371 538752 532531 526165 519260 511818 504128 496654 489867
66760 489867 483836 477954 471327 463556 455037 446587 438928 432370 426653 421086 415165 409121 403633 398963
66746 398963 394666 390204 385470 380638 375907 371585 368049 365316 362878 360193 357071 353397 348845 343313
66732 343313 337377 331912 327305 323346 319705 316142 312370 308162 303701 299583 296370 294218 292797 291424
66718 291424 289468 286916 284394 282370 280499 278099 275093 272036 269326 266908 264743 263036 261752 260368
66704 260368 258321 255492 252082 248265 244198 240179 236569 233609 231388 229873 228902 228230 227617 226861 225767
66689 225767 224259 222454 220512 218450 216200 213766 211209 208630 206301 204528 203146 201441 199005 196421
66675 196421 194597 193548 192401 190553 188227 185878 183682 181764 180365 179449 178613 177664 176889 176554 176446 176111
66659 176111 175205 173536 171224 168958 167521 166831 166004 164627 163319 162619 161998 160616 158550 156498 154676
66644 154676 152830 151171 150418 150803 151669 152242 152329 152148 151875 151505 150866 149758 148332 147209 146852 146875 146441 145323
66626 145323 144137 143452 143170 142957 142808 142907 143158 143156 142513 141123 139257 137479 136299 135779 135551 135250 134827 134436
66608 134436 134155 133841 133216 132113 130716 129409 128324 127217 125919 124622 123524 122433 121083 119622 118424
66593 118424 117572 116895 116372 116113 116078 116221 116722 117639 118512 118846 118804 118784 118530 117538 116316 116185 117440 118669 118474
66574 118474 117149 115902 115051 113910 112196 110558 109604 109113 108463 107410 106204 105181 104473 104043 103888 104114
66558 104114 104631 104862 104173 102761 101692 101672 102093 101814 100610 99270 98401 97822 97237 96821 96789 96853 96570 96014
66540 96014 95735 96156 97229 98588 99776 100448 100605 100611 100755 100875 100635 100116 99823 100017 100366 100415 100137 99780 99334
66521 99334 98498 97086 95205 93095 91108 89792 89527 90001 90423 90404 90211 90042 89660 89088 89037 89949 91014 91034
66503 91034 90042 89222 89210 89362 88963 88265 87859 87734 87563 87383 87370 87299 86912 86573 86934 88021 89167 89879 90293
66484 90293 90797 91550 92347 92634 91759 89641 87177 85592 85318 85838 86567 87432 88505 89537 90139 90186 89785 89046
66466 89046 88032 86824 85472 83997 82571 81576 81338 81814 82556 82992 82778 82005 81069 80336 80001 80265 81340
66449 81340 82983 84242 84169 82893 81654 81567 82583 83791 84508 84844 85297 86063 86810 87067 86753 86248 85926 85744
66431 85744 85433 84981 84730 85015 85868 87029 87991 88130 87155 85526 84101 83226 82454 81318 80013 79060 78590
66414 78590 78371 78366 78776 79570 80355 80835 81017 80873 80131 78704 77081 76024 75899 76470 77251 77870 78169 78209 78197
66395 78197 78264 78342 78371 78577 79255 80264 80956 80762 79664 78003 76044 73964 72137 71109 71227 72353 73898
66378 73898 75123 75619 75666 76043 77200 78707 79713 79855 79490 79136 79020 79116 79259 79192 78815 78476 78638 79196 79501
66359 79501 79242 78854 78787 78765 78204 77120 76087 75349 74477 73047 71412 70521 71065 72820 74831 76169 76521
66342 76521 76068 75073 73861 73052 73204 74051 74548 74112 73475 73880 75567 77507 78539 78417 77730 77167 76960 76824
66324 76824 76416 75905 75981 77099 78860 80360 81002 80794 80082 79328 78980 79104 79225 78874 78220 77799 77736 77681 77430
66305 77430 77129 76892 76726 76858 77585 78654 79304 79096 78235 76974 75294 73459 72254 72105 72398 72239 71648
66288 71648 71386 71789 72385 72742 73147 74157 75751 77183 77654 77072 76165 75830 76341 77248 78024 78557 78942 79080
66270 79080 78763 78022 77159 76474 76174 76402 77070 77694 77635 76599 74821 72829 71181 70304 70278 70708 71017 70985 70875
66251 70875 70992 71291 71524 71640 71889 72555 73689 75043 76203 76803 76797 76566 76694 77493 78780 80139 81310 82200
66233 82200 82651 82506 81936 81358 80874 80115 78928 77915 77808 78450 78886 78503 77571 76572 75468 73961 72130
66216 72130 70490 69632 69978 71625 74107 76504 78098 78866 79132 78985 78373 77584 77158 77286 77658 78017 78562
66199 78562 79602 81053 82455 83377 83608 83095 81977 80703 79932 80114 81150 82472 83450 83730 83320 82488 81543
66182 81543 80603 79595 78547 77766 77536 77691 77852 78071 78833 80244 81652 82408 82660 82992 83600 84331 85246 86484
66164 86484 87710 88367 88477 88530 88549 87986 86764 85683 85458 85922 86541 87081 87320 86746 85236 83659 83060 83442
66146 83442 83886 83689 82814 81395 79479 77343 75589 74807 75335 77124 79436 80892 80508 78782 77315 77243
66130 77243 78411 80016 81507 82638 83174 82996 82406 82035 82442 83744 85526 87066 87784 87586 86761 85679
66114 85679 84631 83776 83086 82494 82239 82764 84075 85516 86531 87311 88240 89080 89364 89398 89995 91199 92040 91827
66096 91827 91040 90595 90790 91372 92151 93048 93866 94479 95084 95884 96672 97031 96880 96557 96436 96645 97044 97319 97201
66077 97201 96729 96183 95687 95069 94242 93490 93161 93288 93672 94133 94452 94342 93777 93206 93117 93434 93650 93536 93501 94164
66057 94164 95697 97533 98675 98463 97220 96102 96083 97128 98450 99432 100050 100496 100740 100617 100173 99745 99715
66040 99715 100248 101217 102332 103354 104218 104998 105791 106636 107484 108198 108630 108775 108866 109259 110110 111159 111888 112025
66022 112025 111869 111971 112498 113069 113253 112985 112472 111982 111937 112821 114592 116443 117628 118416 119734 121900 124255
66005 124255 126152 127765 129724 132325 135387 138580 141651 144553 147525 150790 154111 156953 159208 161323
65991 161323 163507 165280 166152 166310 166196 165742 164571 162711 160596 158417 155987 153223 150285 147264 144132
65976 144132 141084 138494 136418 134493 132483 130634 129213 127994 126502 124722 123266 122713 122891 122981 122385
65961 122385 121364 120708 120837 121427 121948 122293 122736 123451 124292 125028 125711 126790 128762 131534 134280 136253 137692
65944 137692 139489 141905 144234 145893 147203 148617 149805 150208 150133 150468 151457 152515 153280 154070 155182 156336
65928 156336 157143 157706 158562 160335 163441 167729 172328 176313 179619 182888 186411 189811 192837 195775 198771
65913 198771 201375 203158 204285 205060 205468 205619 206108 207296 208612 209202 208946 208248 207164 205552 203896 203000
65897 203000 202839 202520 201539 200252 198844 196678 193209 188916 184668 180587 176183 171355 166559 162065 157627
65882 157627 153037 148563 144728 141902 140158 139204 138403 137176 135563 134194 133547 133373 132971 131999 130924 130667
65866 130667 131709 133507 134884 135161 134759 134527 134665 134678 134252 133654 133165 132625 131787 130748 129716 128676 127667
65849 127667 127103 127400 128435 129749 131145 132599 133756 134102 133746 133515 134056 135215 136445 137447 138174 138652
65833 138652 139166 140285 142261 144599 146670 148646 151315 154965 158941 162489 165669 169101 172989 176765
65819 176765 179714 181659 182865 183476 183341 182411 181017 179492 177684 175135 171763 168123 164947 162608 161001
65804 161001 159672 157941 155274 151861 148686 146791 146473 147278 148549 149782 150675 151173 151476 151806 152199 152652
65788 152652 153356 154559 156315 158541 161219 164283 167464 170625 174169 178683 184000 188947 192266 193679
65774 193679 193960 194085 194359 194227 192811 189716 185397 180740 176368 172416 168811 165539 162692 160487 159243
65759 159243 159126 159931 161396 163712 167433 172784 179302 186291 193412 200783 208748 217664 227630 238176
65745 238176 248351 257290 264661 270548 275135 278559 280861 281823 280990 278017 272922 265949 257388 247640
65731 247640 237284 226819 216475 206384 196804 188007 180071 172957 166637 160935 155448 149920 144704
65718 144704 140571 137970 136582 135553 134054 131726 128837 126105 124177 123145 122524 121663 120227 118435 116977
65703 116977 116526 117135 118143 118848 119220 119783 120841 122056 122838 123011 123027 123610 125165 127393 129502 130920 131839
65686 131839 132957 134712 136918 139174 141424 143992 147139 150766 154637 158924 164364 171647 180599 190257
65672 190257 199900 209791 220655 232660 245283 257962 270361 281972 292087 300484 307723 314372
65660 314372 320155 324229 326147 326278 325479 324656 324498 325198 326380 327561 328706 330094 331763 333409 334781
65645 334781 335771 336023 334841 331675 326393 318974 309299 297526 284336 270480 256298 242034 228287
65632 228287 215678 204150 193178 182718 173414 165705 159191 153185 147534 142522 138208 134349 130948
65619 130948 128422 127046 126454 125834 124560 122541 120120 117813 116125 115409 115694 116593 117491 117967 118082 118229
65603 118229 118697 119422 120105 120496 120571 120502 120442 120377 120296 120506 121471 123166 124871 125970 126740 127854 129286 130464
65585 130464 131609 134045 138650 144666 150776 156925 164223 173190 183049 192939 203096 214350 226885
65572 226885 239882 252174 262943 271920 279174 284810 288871 291459 292660 292103 288953 282875 274817 266168
65558 266168 257159 246898 235160 223267 212711 203628 195279 187391 180138 173209 166018 158833 152764
65545 152764 148377 145086 142229 139987 138828 138671 139163 140299 142015 143504 143734 142699 141484 140982 141052 141130
65529 141130 141055 140882 140330 139008 137089 135244 133879 132738 131341 129474 127224 124807 122567 120910 120072
65514 120072 119967 120295 120642 120541 119723 118441 117307 116763 116876 117630 118957 120317 120796 120097 119130 119111 120257
65497 120257 121829 123273 124709 126296 127744 128692 129196 129642 130426 131804 133812 136248 138902 141709 144425
65482 144425 146386 147137 147203 147570 148288 148277 146792 144480 142588 141591 141003 140107 138417 135831 132860 130485 129331
65465 129331 129092 129004 128588 127680 126208 124425 123001 122285 121746 120712 119450 118909 119482 120642 121722 122503 123000
65448 123000 123212 123212 123171 123292 124010 125974 129213 132499 134266 134267 133694 133604 133914 134174 134545 135507 137070 138825 140452
65429 140452 141737 142277 141655 139918 137683 135770 134749 134651 135018 135407 135810 136412 137029 137243 137059 136927 136984 136837
65411 136837 136372 136162 136645 137354 137547 137338 137630 139003 141136 143314 145111 146552 147888 149310 150757 152063
65395 152063 153317 154851 156640 157996 158203 157301 155937 154602 153378 152355 151827 151937 152416 152814 152830 152368
65379 152368 151466 150274 149073 148251 148247 149363 151447 153868 155958 157485 158634 159695 160887 162361 164171
65364 164171 166364 169208 173113 178075 183395 188336 193003 198211 204466 211411 218353 225030 231676 238498
65350 238498 245252 251228 255602 257896 258175 256819 254196 250700 246893 243205 239365 234476 227940 220218
65336 220218 212491 205632 199669 194203 189084 184496 180560 177097 173882 170882 168060 165165 162040 159046
65322 159046 156767 155251 153963 152617 151545 150964 150276 148651 146073 143322 141043 139307 138013 137181 136795
65307 136795 136762 137094 137734 138162 137730 136585 135823 136414 138294 140724 143131 145236 146730 147414 147570 147718 147987
65290 147987 148125 148176 148721 150133 151867 152833 152482 151316 150273 149822 149785 149876 150045 150223 150076 149299 148043 146778
65272 146778 145763 144870 143880 142669 141175 139499 138035 137159 136674 135975 134909 134093 134163 135054 136276 137539
65256 137539 138697 139437 139573 139532 139933 140708 141167 141028 140834 141089 141457 141193 140111 138715 137513 136581 135789 135148
65238 135148 134819 134893 135239 135549 135560 135281 134929 134630 134298 133891 133612 133679 133948 133957 133324 132016 130305 128631 127395
65219 127395 126707 126340 126105 126169 126753 127596 128067 127899 127482 127279 127319 127467 127845 128579 129367 129775 129872 130128 130660 131048
65199 131048 131041 130980 131254 131639 131579 130966 130304 130100 130358 130769 131223 131985 133369 135265 137096 138341 139063 139753 140725
65180 140725 141906 143215 144741 146309 147195 146689 144854 142488 140474 139424 139685 141152 143056 144476 145280
65165 145280 146209 147864 149893 151466 152267 152661 153070 153585 154226 155254 156993 159488 162486 165781 169510 173989
65149 173989 179225 184682 189725 194341 199270 205315 212625 220748 229195 237707 246041 253832 260898 267538
65135 267538 274229 280986 287219 292395 296684 300695 304560 307558 308865 308447 307002 305140 302917 300147
65121 300147 296766 292742 287910 282168 275744 269062 262339 255415 247978 239887 231376 223013 215371 208650
65107 208650 202594 196841 191238 185833 180731 176149 172440 169755 167621 165188 162061 158759 156151 154595
65093 154595 153845 153628 153842 154156 153950 153073 152277 152367 153058 153307 152752 152081 151733 151027 149217 146878 145387 145256
65075 145256 145791 146371 147242 148770 150615 152065 152776 152803 152320 151690 151536 152307 153842 155603 157161 158270 158704
65058 158704 158347 157338 155986 154640 153744 153649 154145 154444 153925 152674 151166 149777 148892 148977 149955 150853 150719
65041 150719 149743 148854 148306 147410 145748 143913 142705 142135 141591 140625 139153 137182 134779 132308 130393 129589
65025 129589 130004 131118 131957 131790 130819 130004 130084 130908 131846 132545 133119 133813 134755 135936 137216 138399 139448
65008 139448 140603 142174 144207 146407 148332 149651 150375 150876 151559 152420 153076 153286 153290 153501 154003 154513 154740
64991 154740 154641 154367 154139 154259 155101 156889 159325 161628 163282 164756 167096 170543 173952 175907 176073 175030
64975 175030 173146 170422 167263 164508 162512 160898 159371 158074 156837 154954 152223 149556 147927 147237
64961 147237 146823 146531 146543 146637 146480 146330 146512 146411 145031 142616 140697 140249 140669 140963 141137 141781 142815 143434
64943 143434 143170 142438 141967 142010 142184 141976 141337 140728 140544 140676 140797 140867 140966 140842 140158 139186 138680 138903 139291 139317
64923 139317 139216 139556 140448 141476 142158 142282 142024 141914 142403 143342 144228 145019 146230 148073 150039 151582 152699
64906 152699 153535 153983 154165 154785 156428 158868 161610 164743 168678 173368 178423 183679 188997 193790 197581
64891 197581 200901 204770 209273 213380 216275 218106 219295 219827 219517 218316 216070 212538 208015 203433 199500
64876 199500 196142 193030 190184 187745 185658 183977 183041 182941 183153 183112 182803 182422 181878 181101 180421 180010 179221
64859 179221 177218 174186 171255 169094 167130 164388 160746 157060 154302 152781 152192 152198 152771 153838 154792 154804
64843 154804 153730 152284 151093 150025 148834 147957 148049 148924 149596 149327 148204 146831 145992 146431 148272 150591
64827 150591 152152 152626 152599 152499 152307 152414 153751 156609 160063 163150 165999 169201 172703 176101 179571 183622
64811 183622 188160 192664 197191 202271 207683 212202 214927 216217 216933 217293 216936 215655 213530 210559 206729
64796 206729 202403 198227 194565 191236 187860 184312 180874 178040 176164 175202 174859 174942 175357 175748 175519 174510
64780 174510 173363 172852 173008 173348 173822 175004 177232 180057 182804 185380 188301 192102 196877 202154 207091
64765 207091 211107 214515 218247 222685 227171 231030 234607 238662 243036 246794 249682 252552 256029 259551
64751 259551 262232 264020 265291 265799 264869 262480 259342 255811 251388 245536 238541 231355 224924 219779 215892
64736 215892 212639 209214 205356 201606 198758 197193 196757 196998 197395 197619 197755 198121 198813 199642 200579 201952
64720 201952 204012 206527 208965 210953 212475 213848 215578 217912 220422 222350 223495 224373 225266 225570 224470
64705 224470 222010 219075 216467 214301 212075 209073 204980 200427 196659 194235 192329 189732 186313 182973
64691 182973 180441 178698 177411 176330 175315 174583 174817 176408 178715 180779 182751 185737 190134 195010 199444
64676 199444 203613 208146 213182 218605 224456 230398 235293 238108 238868 238177 236241 233127 229506 226156 222846
64661 222846 218658 213567 208871 205771 204070 202614 200600 198202 196166 195079 194961 195463 196389 197757 199280
64646 199280 200263 200519 201041 203096 206796 211241 216010 221730 228962 237194 245314 252628 259114 265037 270588
64631 270588 275638 279621 281921 282485 281771 280113 277579 274482 271417 268534 265336 261482 257264 252939 248241
64616 248241 243088 238316 234987 233212 232229 231377 230431 229235 227798 226730 226851 228142 229585 230219 230034 229656
64600 229656 229550 229721 229911 229891 229669 229513 229620 229800 229655 229003 227872 226210 224047 221945 220850 221245 222732
64583 222732 224538 226186 227580 228805 230110 231828 234059 236525 238889 240986 242612 243373 243002 241710 239968
64568 239968 238057 236014 233871 231618 229021 225772 221888 217717 213480 209029 204200 199291 195044 192119
64554 192119 190558 189750 188934 187862 186975 186853 187485 188207 188422 188249 188337 189136 190521 192106 193675 195256 196884
64537 196884 198426 199508 199601 198390 196249 194111 192567 191306 189802 188339 187759 188169 188618 188295 187519 187112
64521 187112 187330 187932 188824 189914 190597 190204 189022 188191 188535 190001 192236 195028 198026 200757 203230 205981
64505 205981 209237 212625 216021 219996 224902 230101 234781 239031 243340 247395 250299 251806 252392 252104 250296
64490 250296 246828 242678 238956 235936 233479 231680 230450 229089 227141 225370 224969 225838 226466 225654 223590
64475 223590 220992 218057 214820 211921 210178 209614 209578 209725 210190 210848 211242 211529 212805 215831 219815 222994
64459 222994 224330 224217 223680 223383 223455 223799 224300 224864 225362 225593 225455 225239 225490 226316 227200 227884 229124 231879
64441 231879 235907 239933 243342 246900 251495 256883 262263 267551 273469 280727 289726 300837 314299 329885
64427 329885 347222 366493 388521 414158 443959 478377 517952 563319 615276 674600 741336
64416 741336 814285 891514 971161 1051391 1129963 1204696 1274436 1338789 1396724 1446185 1485390
64405 1485390 1513790 1531266 1537050 1530225 1510997 1480684 1440447 1390647 1331579 1264370 1190964 1113543
64393 1113543 1034183 954840 877343 803278 733902 670163 612788 562218 518389 480637 448084
64382 448084 420101 396178 375415 356658 339431 324341 312115 302434 294136 286472 279655 274076
64370 274076 269428 264855 259766 254265 248878 243995 239588 235361 231112 226859 222619 218278 213914 210129
64356 210129 207740 207089 207790 209217 211036 213313 216285 220093 224477 228687 231898 233838 234816 235092 234480
64341 234480 232765 230257 227608 225186 222898 220542 218092 215682 213598 212272 211960 212334 212708 212845 213329
64326 213329 214899 217538 220475 222990 224989 226767 228446 229750 230286 229945 229056 228117 227365 226651 225755 224666
64310 224666 223377 221579 218859 215289 211543 208272 205489 202643 199210 195160 191019 187554 185224 183793
64296 183793 182627 181439 180611 180681 181741 183504 185671 187963 189999 191627 193294 195670 198850 202306 205632
64281 205632 208871 211983 214559 216522 218715 222207 227038 232170 236655 240380 243514 245795 246807 246671
64267 246671 245951 244914 243423 241678 240602 241047 242810 244801 246170 246922 247457 247853 247718 246513 243902 240066
64251 240066 235783 231845 228225 224055 218732 212774 207321 203053 199971 197944 196846 196227 195511 194763 194759 195937
64235 195937 197643 198835 199380 200237 202224 204852 206580 206247 204150 201627 199721 198514 197690 197186 196966 196606
64219 196606 195669 194320 193018 191747 190146 188302 186753 185636 184561 183462 182846 182896 183005 182626 182006 181633
64203 181633 181571 181882 183121 185690 189064 192354 195320 198190 200833 203029 205367 208960 214144 220219 226630
64188 226630 233707 241951 251185 260695 269705 277452 283225 286692 287931 286978 283691 278211 271180 263312
64174 263312 255152 247394 240900 235925 231687 227153 222118 217199 212975 209583 206968 205055 203587 202157
64160 202157 200572 199030 197888 197323 197263 197543 198062 198834 199911 201309 203059 205207 207648 210027 211992 213508
64144 213508 214747 215756 216500 217186 218133 219212 219775 219380 218339 217350 216783 216516 216283 215923 215418 214857 214408
64127 214408 214217 214419 215187 216583 218352 220129 221923 224105 226874 230090 233753 238172 243368 248757 253850
64112 253850 258976 264754 271004 276694 281033 284216 286995 289897 292969 296049 299093 302279 305799 309556
64098 309556 313259 316964 321208 326211 331136 334683 336492 337526 338853 340364 340903 339483 336143 331812
64084 331812 327574 323999 320897 317574 313373 308126 302233 296346 290876 285745 280648 275592 271016 267291
64070 267291 264284 261628 259257 257392 256012 254681 253072 251503 250795 251516 253382 255482 257218 258964 261473
64055 261473 264655 267411 269031 270369 273014 277470 282742 287754 292577 298030 304684 312704 322280 333551
64041 333551 346066 358753 370668 381641 392058 402048 411051 418268 423436 426915 428965 429220 427092
64028 427092 422581 416435 409697 403326 398032 393959 390507 386829 382580 377930 372960 367494 361531 355295
64014 355295 348783 341825 334791 328597 323603 319092 314344 309792 306447 304433 302840 300967 299086 297837
64000 297837 297341 297087 296458 295302 294208 294172 295673 298085 300301 301891 303360 305364 308121 311569 315584
63985 315584 319897 324249 328808 334094 340308 347055 353895 360788 367824 374957 382312 390375 399438 409098
63971 409098 418753 428416 438621 449698 461672 474821 489757 506742 525318 544872 565405 587567
63959 587567 612145 639712 670669 705444 744711 789505 841103 900758 969616 1048848 1139634
63948 1139634 1242870 1359032 1488353 1631039 1787109 1956146 2137287 2329331 2530610
63939 2530610 2738809 2951072 3164282 3374987 3579062 3771739 3948263 4104552 4237283
63930 4237283 4343550 4420727 4466720 4480299 4461234 4410202 4328488 4217738 4080188 3919352
63920 3919352 3740267 3548573 3349049 3145162 2939933 2736768 2539096 2349457 2169363
63911 2169363 1999970 1842568 1698388 1568186 1451998 1348971 1257471 1175778 1102952 1038876
63901 1038876 983348 935360 893442 856490 824052 795872 771375 749645 729807 711293 693664
63890 693664 676326 658849 641766 626589 614357 604344 594931 585782 578340 573898 572092 571899 573320
63877 573320 577110 583398 591666 601933 614862 630607 648529 668238 689966 713531 737867 762206
63865 762206 787007 813026 839996 866958 893428 919437 944608 967975 988655 1006079 1019647
63854 1019647 1028892 1034108 1036232 1035814 1032497 1025622 1014993 1000883 983614 963355 940173 914162 885747
63841 885747 855844 825413 794722 763281 730659 697248 664210 632835 603866 577173 552025
63830 552025 527873 504884 483521 463757 445077 427224 410445 395002 380934 368420 357796
63819 357796 348863 340693 332541 324635 317602 311485 305802 300385 295551 291479 287920 284582 281392 278316
63805 278316 275294 272459 270042 267878 265291 261690 257146 252275 247793 244283 242120 241259 241103 240821 239929
63790 239929 238569 237212 236144 235236 234176 232858 231465 230141 228742 227079 225312 223865 222919 222253 221745
63775 221745 221761 222708 224268 225433 225451 224574 223697 223421 223635 223906 223949 223647 222889 221660 220169 218750 217682 217182
63757 217182 217392 218121 218731 218652 218012 217507 217613 218223 219096 220266 221793 223444 224946 226349 227857 229460 230986
63740 230986 232410 233834 235249 236591 237923 239342 240782 242150 243512 244932 246314 247750 249775 252767
63726 252767 256160 258910 260898 263301 267253 272612 278356 283752 288606 292753 295915 298077 299459 300042
63712 300042 299486 297627 294743 291282 287626 284211 281520 279739 278600 277783 277338 277542 278477 279948 281729
63697 281729 283701 285796 288021 290538 293512 296849 300249 303555 306893 310367 313793 316848 319373 321330
63683 321330 322600 323102 323067 322858 322406 321173 318944 316442 314757 314209 314193 314150 314242 314830 315748 316572 317371 318560
63665 318560 320009 320936 320937 320606 320623 320631 319644 317466 314936 312619 309909 305918 300846 295871 291904 288983 286796
63648 286796 285177 283859 282299 280169 277884 276319 276063 277054 278787 280746 282754 285093 288184 292009 296005
63633 296005 299678 303206 307184 311926 317300 323168 329630 336788 344617 353268 363251 375003 388380 402841
63619 402841 418169 434728 452871 472336 492591 513742 536703 562201 589848 618518 647503
63608 647503 676797 706237 734837 761198 784151 802747 816117 823988 827229 827298 825098 820748 814482
63595 814482 807241 800090 793339 786414 778339 768133 755049 738864 719985 699175 677192 654767
63583 654767 632698 611636 591733 572712 554449 537472 522757 510956 501830 494490 488238 483111
63571 483111 479598 477975 478081 479652 482675 487365 493878 502040 511298 521013 530944 541399 552758 564983
63557 564983 577781 591229 606012 623032 642937 665990 692135 721219 753274 788444 826212
63546 826212 864633 900616 931128 954130 968671 974765 973394 966187 954832 940962 926530 913462
63534 913462 902507 892864 883482 874371 865985 857629 847238 832853 813864 790911 765239 738265
63522 738265 711082 683876 656112 627579 599089 571904 546800 523928 503262 484708 467836
63511 467836 451998 436883 422769 410069 398800 388655 379474 371419 364659 359040 354279 350396 347637
63498 347637 345817 344003 341256 337707 334537 332648 331606 330162 327769 325305 324229 325194 327553 330110
63484 330110 332208 334164 336786 340498 344861 348899 351981 354390 357015 360388 364118 367326 369566 371060
63470 371060 372035 372122 370722 367858 364345 361046 358169 355457 352854 350684 349137 347862 346262 344148 341910
63455 341910 340000 338472 337175 336338 336727 339126 343726 350061 357450 365519 374394 384513 396263 409773
63441 409773 425117 442678 463136 486934 513797 542755 572477 601436 627986 650682 668796
63430 668796 682473 692393 699386 704483 709134 715078 723760 735846 751384 770384 793102 819719 849835
63417 849835 882433 916230 949875 981796 1010157 1033238 1049915 1059846 1063413 1061740 1056579 1049709
63405 1049709 1042122 1033786 1024329 1013840 1002785 991073 977512 960416 938794 912828 883407 851569
63393 851569 818402 785013 752232 720445 689942 661208 634624 610174 587884 568355 552322
63382 552322 539683 529484 520989 514293 509767 507381 506868 508074 510823 514831 520182 527539 537359 549100
63368 549100 561737 575013 589733 606880 626854 649568 674772 702120 731241 762019 794651
63357 794651 829272 865450 901985 937054 968662 995236 1015913 1030315 1038316 1040261 1037297 1031124
63345 1031124 1023309 1014862 1006253 997481 988160 977747 965740 951553 934412 913719 889507 862382
63333 862382 833131 802583 771671 741235 711888 684354 659770 639216 623022 610889 602432 597027
63321 597027 593236 589103 583146 574623 562985 547940 530257 511674 493507 475920 458877 443066
63309 443066 429343 417798 408021 399745 392614 385804 378786 372153 366869 362905 359422 356128 353453 351301
63295 351301 348707 345160 341424 338480 336199 333675 330408 326644 322872 319602 317405 316499 316285 315807 314797
63280 314797 313889 313692 314032 314252 313946 313121 311880 310270 308502 307095 306631 307311 308719 310068 310828 311216 311999
63263 311999 313735 316200 318662 320648 322333 324163 326306 328580 330769 332840 334947 337406 340573 344494
63249 344494 348709 352710 356624 361152 366721 373037 379699 386921 395277 404967 415759 427537 440447
63236 440447 454524 469602 485672 502944 521456 540992 561497 583112 605594 628186 650460
63225 650460 672904 696128 719778 742814 764785 786230 807788 829575 851622 874253 897540
63214 897540 920703 942551 962305 979616 993976 1004590 1010746 1011895 1007500 997302 981801 962083
63202 962083 939075 913353 885707 857370 829438 802460 776792 752947 731287 711826 694731
63191 694731 680669 670164 662932 658408 656713 658483 663839 672179 682997 696247 711758 728876 746949
63178 746949 765708 784913 804138 823211 842470 862215 882274 902378 922481 942271 960801
63167 960801 977229 991660 1004592 1015608 1023236 1026191 1024183 1017446 1006061 990115 970115 946811
63155 946811 920733 892194 861717 830187 798575 767628 737873 709748 683541 659147 636061
63144 636061 613871 592854 573894 557728 544437 533696 525157 518292 512153 505834 499229 493051 488036
63131 488036 484293 481421 478963 476734 474918 473902 473887 474747 476374 478894 482194 485494 487994 489960 492517
63116 492517 496192 500215 503560 506152 508604 511199 513733 516140 518617 521125 523254 524756 525930 527297
63102 527297 529035 530789 531920 532025 531335 530540 530087 529783 529268 528674 528383 528279 527796 526804 525965 525909 526467 527058
63084 527058 527544 528288 529578 531473 534074 537418 541049 544268 547065 550388 555126 561115 567558 574204 581564
63069 581564 589995 599141 608498 618158 628629 640183 652693 666111 680828 697542 716788 738564
63057 738564 762350 787690 814881 844908 878505 915427 954876 996491 1040589 1087509 1137064
63046 1137064 1188657 1241642 1295430 1349555 1403745 1457803 1511362 1563996 1615703 1667005 1718449
63035 1718449 1770160 1821989 1873740 1924907 1974317 2020387 2061771 2097566 2126913 2148614 2161260
63024 2161260 2163649 2155070 2135309 2104548 2063332 2012740 1954600 1891367 1825519 1758901 1692618 1627585
63012 1627585 1565180 1507279 1455570 1410831 1372978 1341794 1317357 1299651 1288140 1282201 1281849 1287565
63000 1287565 1299391 1316617 1338454 1364450 1394066 1426361 1460458 1495936 1532404 1569131 1605579
62989 1605579 1641942 1678515 1714794 1749814 1783154 1814758 1843713 1868070 1886160 1897490 1901965
62978 1901965 1898855 1887074 1866159 1836453 1798569 1753161 1701165 1643846 1582586 1518835 1454153
62967 1454153 1390014 1327519 1267384 1210125 1156149 1105804 1059435 1017216 978769 943207 909802
62956 909802 878433 849279 822348 797517 774632 753173 732239 711382 691241 672719 655699
62945 655699 639264 623143 608124 594802 582683 570945 559525 548951 539491 531035 523502 516802
62933 516802 510526 504254 498165 492926 488878 485695 482864 480206 477809 475780 474145 472804 471435 469673
62919 469673 467483 465270 463515 462365 461525 460437 458625 456185 453967 452954 453188 453482 452455 449841 446620
62904 446620 443882 441786 439726 437319 434965 433385 432803 432798 432824 432614 432007 430723 428626 426094 423845 422349
62888 422349 421590 421382 421668 422407 423316 423985 424289 424635 425633 427410 429323 430573 431110 431600 432323 432548 431430
62871 431430 429312 427480 426618 426110 425109 423717 422708 422464 422666 422882 422961 422871 422587 422280 422335 423018 424221 425669
62853 425669 427311 429388 432010 434686 436440 436665 435766 434768 434241 433969 433655 433446 433489 433419 432860 432169 432079 432609
62835 432609 432896 432177 430547 428593 426754 425230 424173 423669 423741 424534 426206 428391 430149 430884 431133 431979
62819 431979 433702 435532 436830 438079 440341 443959 448223 452303 456169 460450 465585 471369 477273 483044
62805 483044 488906 495265 502276 509707 517239 524898 533098 542162 551978 562271 573152 585095 598392
62792 598392 613026 629231 647789 669401 693989 721076 750818 784225 822284 865152 912415
62781 912415 963958 1020390 1082561 1150708 1224014 1301140 1381214 1464113 1549547 1636033 1721100
62770 1721100 1802305 1877604 1944870 2001782 2046563 2078372 2096673 2100658 2089775 2064577 2026628
62759 2026628 1977705 1919544 1854133 1783576 1709384 1632274 1552958 1472947 1394313 1318690 1246661
62748 1246661 1178142 1113279 1052840 997644 947727 902256 860313 821512 785844 753340 724156
62737 724156 698664 676922 658138 641168 625562 611733 600049 590217 581685 574228 567863 562531
62725 562531 558193 554993 553028 552076 551890 552629 554772 558655 564286 571500 580000 589393 599440 610310
62711 610310 622388 635923 651111 668406 688444 711649 738200 768304 802108 839394 879832
62700 879832 923768 972272 1026070 1084791 1147610 1214276 1284930 1358968 1434652 1509935 1583180
62689 1583180 1652843 1716874 1772892 1818941 1853851 1876917 1887466 1884869 1868931 1840255 1800198
62678 1800198 1750479 1692778 1628664 1559732 1487606 1413790 1339648 1266593 1196111 1129437 1067208
62667 1067208 1009470 955937 906216 859897 816726 776854 740823 709125 681627 657480 635735
62656 635735 616011 598422 582865 568693 555251 542457 530554 519488 508927 498914 489967 482394
62644 482394 475828 469714 463962 458848 454488 450814 447923 446034 445008 444246 443275 442212 441411 440713 439378
62629 439378 436933 433877 431335 429987 429589 429554 429650 429898 430129 430143 430215 430895 432259 433774 435119 436690 439050
62612 439050 442213 445827 449800 454410 459927 466401 473712 481587 489742 498244 507665 518712 531895 547668
62598 547668 566474 588307 612568 638860 667755 700252 736523 775642 816446 858173 900199
62587 900199 941619 981241 1017674 1049362 1074919 1093584 1105128 1109316 1105824 1094780 1077086 1054046
62575 1054046 1026825 996203 962597 926301 888021 849143 811130 774660 739698 706278 674768
62564 674768 645456 618518 594455 573832 556268 540335 524921 510298 497408 486515 477040 468401
62552 468401 460483 453440 447516 442960 439707 437103 434301 431038 427896 425793 425205 425726 426338 426311 425886 425806
62536 425806 426241 426634 426704 426978 427964 429367 430705 432301 435028 439314 444998 452016 460571 470626 481867
62521 481867 494303 508505 525101 544310 566046 590211 616814 646057 678316 713808 752286
62510 752286 793219 836050 879972 923643 965575 1004764 1040536 1071866 1097378 1116149 1128102
62499 1128102 1133459 1132255 1124605 1111142 1092908 1070948 1046184 1019547 992067 964874 939082 915532
62487 915532 894658 876783 862512 852594 847274 845903 847140 849530 852028 854238 856057 856990 856006 852314
62473 852314 845997 837484 826614 812791 795961 776852 756139 733954 710438 686239 662138 638528
62461 638528 615587 593720 573494 555265 539044 524607 511645 500020 489952 481771 475418 470421
62449 470421 466402 463315 461143 459762 459260 460049 462388 466050 470598 475664 480734 485080 488339 490955 493667
62434 493667 496594 499048 500114 499191 496164 491421 485748 479939 474403 469085 463669 457784 451219 444124
62420 444124 436958 430126 423768 417912 412597 407751 403126 398550 394145 390241 387196 385267 384378 383955 383347
62405 383347 382557 382256 382867 383970 384834 385230 385440 385744 386259 387113 388426 390223 392539 395416 398631 401718
62389 401718 404580 407719 411508 415499 418945 421812 424794 428501 433141 438830 445567 452863 459990 466803
62375 466803 473889 481831 490720 500488 511201 522790 534967 547672 561388 576797 594434 614732
62363 614732 638014 664227 693111 724938 760700 801224 846394 895588 948324 1003864 1060454
62352 1060454 1115831 1168555 1218191 1263999 1304129 1336623 1360800 1377203 1386372 1388175 1382261 1368743
62340 1368743 1348356 1322238 1291610 1257363 1219855 1179328 1136736 1093912 1052687 1013910 977468
62329 977468 943112 910980 881335 854128 829000 805575 783587 762811 743084 724363 706589
62318 706589 689379 671963 653687 634688 615927 598382 582264 567184 552980 539993 528398
62307 528398 517705 507297 497259 488313 480997 475269 470842 467477 464923 462975 461742 461504 462095 462771
62293 462771 462922 462697 462768 463727 465871 469225 473464 478031 482647 487547 492992 498858 505011 511810 519792
62278 519792 528997 539057 549812 561366 573621 586306 599540 613838 629323 645387 661397 677462
62266 677462 694254 712352 732048 753622 777510 804218 834162 867473 903901 943157 985443
62255 985443 1031354 1080980 1133272 1186486 1238966 1289213 1335476 1375900 1409181 1434737 1452180
62244 1452180 1461096 1461514 1454184 1439938 1418899 1390660 1355171 1313168 1265792 1214202 1159692 1103839
62232 1103839 1048185 993837 941544 892038 846049 803994 765893 731674 701369 674913 651852
62221 651852 631405 612795 595583 579814 565982 554640 545803 538605 531716 524309 516771 510382 506126
62208 506126 503691 501728 499191 496315 494105 493057 492764 492801 493445 495167 497728 500321 502648 505408 509535
62193 509535 515222 521960 529302 537191 545575 554118 562619 571450 581179 591729 602308 612372 622312
62180 622312 632859 643968 654622 663722 670952 676897 682731 689763 698902 710389 724238 740957 761544
62167 761544 786763 816748 851321 890167 932454 976661 1021109 1064433 1105347 1142378 1174268
62156 1174268 1200463 1220877 1235384 1243848 1246447 1243513 1235116 1221153 1201886 1178100 1150733 1120517
62144 1120517 1088017 1053876 1019076 984944 952722 923010 895850 871388 850050 831909 816386
62133 816386 802944 791696 782849 775874 769739 763738 757691 751721 746499 743392 743554 746830 752127 758712
62119 758712 766477 775037 783495 791276 798416 804746 809492 812046 812597 811701 809772 807193 804254 800548 794995
62104 794995 786946 776883 765703 753885 741836 730477 720780 713029 707172 703618 703014 705301 709559
62091 709559 714781 720460 726562 733406 741453 750723 760357 769234 777078 784686 793102 802934 814416 827617
62077 827617 842373 858331 875310 893551 913522 935533 959486 984857 1010886 1036940 1062806
62066 1062806 1088715 1115210 1142880 1171918 1201787 1231502 1260257 1287509 1312331 1333205 1348810
62055 1348810 1358761 1363315 1362738 1357390 1348022 1335344 1319380 1299756 1276495 1249921 1219854 1185648
62043 1185648 1147304 1106105 1063872 1021866 980572 940126 900628 862281 825563 791223 759921
62032 759921 731779 706298 682718 660612 640269 622376 607105 593669 581065 569082 558221
62021 558221 548714 540139 532052 524484 517603 511249 505058 498775 492296 485688 479391 474149 470419 467977
62007 467977 466271 465062 464554 465072 466783 469665 473549 478176 483172 487997 492070 495191 497697 499832 501028
61992 501028 500336 497663 494050 490420 486537 481592 475410 468542 461446 454184 446880 439891 433450 427586
61978 427586 422516 418604 415609 412375 407807 402169 397037 393769 392164 390820 388742 386325 384648 384080
61964 384080 383996 383787 383685 384316 385838 387902 390243 392825 395468 397858 400086 402780 406399 410695 415157
61949 415157 419780 425067 431431 439026 448105 459069 471945 486142 501011 516486 532899 550319
61937 550319 568420 586922 605799 624991 644250 663436 682634 701743 720154 737132 752345
61926 752345 765764 777131 785840 791302 793260 791860 787734 781983 775741 769608 763660 757886 752421 747536
61912 747536 743905 742820 745527 752049 761054 771161 782101 794292 807644 821086 833089 842350 848217
61899 848217 850768 850321 846690 839277 828210 814917 800973 786609 771060 754187 736904 719894
61887 719894 702822 685275 667831 651553 636781 623046 609912 597297 585068 572929 560835
61876 560835 549096 537985 527631 518381 510775 504851 499885 495266 491433 489490 489924 492156 495403 499484
61862 499484 504510 510292 516608 523919 533249 545219 559663 576274 595202 616701 640591 666548
61850 666548 694717 725551 759043 794439 830715 866924 902057 934958 964581 990106 1010781
61839 1010781 1025977 1035583 1040037 1039832 1035298 1027111 1016676 1005645 995217 986211 979511 975908 975553
61826 975553 978062 983259 991389 1002323 1014830 1026918 1036795 1043430 1046312 1044980 1038829 1027329 1010406
61813 1010406 988575 962682 933538 901904 868653 834727 800902 767796 736103 706596 679780
61802 679780 655743 634392 615575 598857 583505 569046 555733 544161 534488 526269 519021 512619
61790 512619 507048 502091 497481 493266 489778 487200 485280 483492 481494 479355 477397 475886 474955 474719 475228
61775 475228 476163 476772 476364 474925 473117 471606 470505 469494 468378 467405 467035 467451 468381 469424 470523 471963
61759 471963 473880 475969 477845 479579 481598 484064 486604 488731 490326 491483 492081 491776 490490 488702 487078
61744 487078 485833 484522 482566 479947 477290 475178 473540 471864 469975 468334 467491 467424 467599 467611 467558 467825
61728 467825 468648 469952 471550 473407 475703 478563 481696 484401 486159 487245 488579 490782 493506 495847
61714 495847 497308 498154 498841 499547 500353 501470 502833 503715 503266 501434 498929 496247 493234 489749 486200 483069
61698 483069 480314 477633 475033 472705 470583 468409 465999 463094 459331 454913 450905 448189 446345 444318
61684 444318 441979 440010 438371 436073 432795 429559 427207 425228 422866 420443 418559 416709 413947 410561
61670 410561 407867 406420 405559 404686 403916 403222 402038 400146 398190 396832 396037 395554 395463 395826 396405 397199 398695
61653 398695 401061 403566 405450 406902 408601 410618 412528 414471 417339 421818 427702 434157 440220 445033
61639 445033 448114 449655 450311 450569 450479 449944 449002 447707 445959 443502 440043 435440 429985 424406 419362 415010
61623 415010 411260 408228 406077 404464 402664 400406 398225 396805 396188 395871 395440 394880 394290 393486 391973 389307
61607 389307 385499 380995 376246 371421 366629 362173 358246 354548 350583 346344 342316 338717 335194 331460
61593 331460 327891 325111 323225 321777 320364 318941 317512 315827 313543 310677 307770 305523 304165 303262
61579 303262 302246 301097 300248 299892 299716 299448 299281 299462 299732 299510 298522 297044 295663 294984 295315 296312 297130
61562 297130 297309 297348 298018 299334 300713 301973 303400 304791 305330 304847 304450 305204 306647 307438 307200 306844 307035
61545 307035 307233 306670 305670 305380 306447 308490 310868 313513 316770 320597 324261 327011 328917 330726 332762
61530 332762 334370 334852 334689 335155 336636 337971 337840 336341 334727 333828 333280 332204 330203 327642 325282 323731
61514 323731 322978 322449 321696 321022 321122 322136 323334 323807 323250 322033 320760 319846 319274 318646 317623 316339 315249
61497 315249 314602 314336 314433 314959 315665 316030 315951 316066 317036 318785 320758 322677 324621 326508 327989 328892 329425
61480 329425 329876 330345 330839 331416 332150 333057 334056 334927 335468 335782 336234 336897 337299 337105 336851 337470 339151 341180
61462 341180 342947 344541 346143 347435 348010 347978 347700 347229 346433 345516 344941 344903 345261 345826 346325 346184 344937 343000
61444 343000 341514 341198 341665 342163 342664 343787 345816 348221 350255 351736 353074 354685 356608 358663 360807
61429 360807 363184 365853 368592 371112 373366 375602 378092 380925 383998 387049 389675 391549 392783 393931
61415 393931 395443 397052 397881 397235 395222 392592 390079 387986 386314 385033 384110 383397 382697 381959 381288 380654
61399 380654 379758 378333 376518 374777 373479 372698 372437 372778 373658 374544 374615 373420 371422 369841 369795 371451 373911
61382 373911 375976 377048 377390 377692 378553 380267 382783 385628 388022 389339 389631 389702 390624 393019 396664 400720
61366 400720 404429 407642 410686 413816 416981 420076 423133 426133 428899 431442 434288 438115 443056 448594
61352 448594 454218 459955 466089 472506 478596 483875 488562 493326 498410 503187 506847 509467 512095 515630
61338 515630 519873 523907 527150 529623 531296 531743 530647 528326 525462 522406 518919 514493 508857 502408
61324 502408 496311 491949 489929 489564 489488 488777 487441 485979 484822 484193 484240 485066 486717 489264 492855 497614
61308 497614 503536 510615 519015 528947 540285 552338 564105 574734 583702 590701 595584 598531 600077
61295 600077 600807 601064 601008 600801 600456 599565 597432 593633 588324 582049 575407 568942 563027 557688 552726 548191
61279 548191 544540 542045 540209 538204 535988 534598 534966 536664 538270 538991 539507 540949 543455 546293 549263
61264 549263 553212 558917 566011 573526 581137 589263 598084 607064 615496 623010 629467 634823 639246 642933
61250 642933 645669 646953 646678 645190 642522 638122 631762 624244 616751 609823 603380 597359 591794 586532
61236 586532 581458 576837 572927 569427 565906 562606 560235 558978 558362 558122 558547 559820 561607 563575 565807
61221 565807 568434 571272 574149 577242 580866 585202 590373 596368 602682 608510 613608 618516 623571 628186
61207 628186 631621 634090 636451 639063 641721 644707 649115 655814 664590 674673 685769 698213 712267
61194 712267 727624 743531 759181 773951 787457 799383 809268 816588 821254 823980 825878 827559 828694
61181 828694 828553 826822 823753 819670 814602 808454 801225 792940 783544 773127 762106 750996 740030
61168 740030 729128 718089 706659 694581 681876 668984 656318 643775 631036 618289 606268
61157 606268 595548 586200 578229 571901 567408 564539 562917 562322 562545 563208 563928 564461 564405 563073 559984 555358
61141 555358 549840 543878 537695 531730 526673 522942 520312 518215 516341 515023 515045 517046 521018 526502 533253
61126 533253 541466 551319 562582 574915 588266 602706 618041 633875 649960 666304 683095 700762
61114 700762 719835 740395 761776 783099 803974 824336 843811 861758 877916 892503 905601
61103 905601 916797 925544 931498 934411 934046 930304 923229 912912 899799 885069 870062 855092 839330
61090 839330 822199 804343 786797 769719 752624 735562 719244 704102 690029 677184 666269
61079 666269 657566 650209 642936 635369 628219 622498 618807 617169 617151 618204 620101 622890 626318 629748 633027
61064 633027 636957 642280 648536 654748 661108 668957 678966 690332 702176 714790 728801 743889 759308
61051 759308 775279 792873 812707 834559 858161 883513 910359 938162 966769 996523 1027602
61040 1027602 1059833 1093258 1128244 1164864 1202776 1241907 1282682 1325359 1369748 1415840 1464110
61029 1464110 1514818 1567535 1621785 1677745 1735924 1796628 1860186 1927429 1999579 2077950 2163884
61018 2163884 2258488 2362068 2474340 2595767 2728649 2876907 3045469 3240250 3468388 3738206
61008 3738206 4059394 4443419 4903712 5456659 6124782 6939179 7935196 9140871 10565591
60999 10565591 12193260 13973982 15811198 17559780 19057002 20181840 20904115 21287173
60991 21287173 21448219 21511981 21581654 21719103 21920978 22103188 22121168 21828749 21140597 20058213
60981 20058213 18652993 17031752 15309200 13590880 11960250 10470276 9144401 7985284
60973 7985284 6983848 6124881 5391113 4766827 4238922 3795154 3422718 3109043 2843179
60964 2843179 2616099 2420466 2250513 2101531 1969250 1850270 1743120 1647858 1564192 1490591
60954 1490591 1425361 1367614 1316637 1270999 1228856 1188735 1149755 1111708 1075195 1041077 1009360
60943 1009360 979122 949793 921848 895900 871765 848768 826377 804227 782252 761153 741942
60932 741942 724574 707861 691195 675412 661348 648577 636530 625822 617236 610118 603203 596551
60920 596551 591267 587531 584362 581252 578644 576626 574564 572394 571069 571086 571622 571747 571596 571638 571655 571258 570791
60903 570791 570811 571142 571358 571816 573137 574724 574865 572661 569044 565442 562027 557927 552765 547198 541960 537064
60887 537064 532226 527541 523244 519032 514195 508446 502219 496076 490149 484240 478130 471600 464488 457050
60873 457050 450033 444143 439546 436015 433313 431198 429337 427625 426522 426684 428230 430541 432883 435054
60859 435054 437345 439924 442396 444154 445253 446639 449162 452536 455763 458532 461510 465119 468761 471628
60845 471628 473674 475239 476308 476824 477307 478338 479571 479977 479051 477215 475091 472983 470993 469026 466566
60830 466566 463029 458526 453891 449886 446755 444534 443250 442648 442153 441309 439968 437988 435210 431832 428403
60815 428403 425222 422049 418560 414773 410841 406724 402285 397492 392425 387253 382321 377998 374328 371017
60801 371017 367797 364659 361743 359230 357353 356142 355135 353681 351603 349300 347219 345609 344849 345397 347081
60786 347081 348802 349408 348842 348140 348391 349830 351923 354104 356353 358987 361963 364686 366765 368676 371203
60771 371203 374289 377051 379029 380824 383171 385862 388084 389548 390797 392411 394283 395742 396165 395501 394294
60756 394294 393218 392477 391716 390518 388841 386887 384773 382601 380720 379658 379711 380691 382085 383269 383513 382033
60740 382033 378410 373122 367447 362468 358120 353518 348288 343211 339314 336653 334399 331894 329159 326451
60726 326451 323879 321572 319778 318587 317837 317430 317514 318137 318978 319644 320151 320918 322300 324181 326017 327368
60710 327368 328375 329624 331438 333507 335393 337147 339161 341608 344386 347379 350383 352933 354790 356531
60696 356531 359072 362499 365893 368457 370304 371893 373213 373881 373799 373346 373054 373253 373874 374464 374562 374125 373472
60679 373472 372842 372286 371898 371745 371639 371384 371288 371891 373066 373893 373634 372409 370730 368842 366790 364682 362551
60662 362551 360246 357731 355163 352576 349918 347582 346308 346237 346587 346675 346775 347489 348801 350323 352104 354472
60646 354472 357287 359951 362079 363635 364496 364344 363025 360685 357682 354605 352156 350589 349517 348573 347924
60631 347924 347642 347026 345330 342964 341179 340574 340680 341041 341826 343110 344330 344963 345207 345462 345587 345244 344716
60614 344716 344816 346000 347958 350047 351746 352726 352893 352608 352637 353591 355348 357074 357893 357601 356841 356586 357380
60597 357380 358997 360788 362322 363635 364914 366119 367074 367811 368522 369212 369727 370257 371375 373211 374937 375594
60581 375594 375262 374831 374688 374324 373385 372493 372673 374360 377235 380661 384072 387325 390987 395947 402492 410119
60565 410119 418414 427542 437491 447428 456383 464182 471081 476805 480676 482575 483131 482971 482221 480710 478284
60550 478284 475030 471603 469180 468635 469813 472036 475163 479634 485633 492763 500597 509098 518575 529632
60536 529632 543009 558789 575730 591883 605988 617834 627348 633996 637260 637153 634141 628966 622698
60523 622698 616392 610452 604675 598976 593619 588686 583950 579515 575997 573718 572227 571016 570258 570393 571388
60508 571388 573002 575520 579609 585468 592688 601124 611517 625001 642211 663127 687710 716238 748757
60495 748757 784444 822032 860920 901292 942843 983851 1021987 1055607 1083639 1104579 1116515
60484 1116515 1118210 1109459 1090513 1062030 1025795 984588 940826 895883 850933 807617 767220 729765
60472 729765 694610 661603 631153 603538 578798 557086 538538 522885 509579 498196 488328 479318
60460 479318 470604 462259 454817 448592 443379 438714 434214 429819 425885 422802 420344 417762 414747 411886
60446 411886 409785 408255 406849 405708 405146 404737 403674 401911 400185 398855 397468 395616 393544 391748 390503
60431 390503 389980 390205 390667 390515 389502 388348 387905 388313 389242 390437 391669 392503 392636 392286 391902 391644 391431
60414 391431 391310 391394 391622 391945 392696 394422 397256 400676 403913 406431 408090 409012 409439 409656 410052 411081 412936
60397 412936 415151 416837 417542 417809 418733 421103 425005 429909 434880 438983 441882 444019 445914 447493 448455
60382 448455 449068 450029 451563 453216 454641 456036 457634 459290 460918 462785 464952 466855 468063 469154 471152
60367 471152 474151 477109 479072 480066 480721 481559 482827 484585 486618 488648 490852 493910 498295 503855 510336
60352 510336 517900 526708 536276 545713 554476 562473 569474 574832 577821 578032 575518 570849 564934 558498
60338 558498 551754 544790 538107 532341 527545 523174 518809 514485 510273 506044 501807 497868 494403 491254
60324 491254 488356 486013 484407 483108 481436 479234 477003 475444 475172 476740 480501 486298 493501 501461
60310 501461 509911 518955 528745 539217 549996 560574 570564 579819 588363 596228 603339 609426 614051
60297 614051 616809 617406 615475 610519 602463 592209 581243 570472 559728 548574 537266 526601 517043
60284 517043 508387 500249 492610 485824 480235 475833 472233 469017 466068 463437 460938 458185 455159 452429
60270 452429 450558 449439 448488 447330 446054 444890 443923 443082 442218 441183 439970 438742 437592 436410 435149
60255 435149 434059 433414 433089 432738 432362 432417 433261 434663 435956 436607 436590 436350 436413 437017 438009 439022 439645 439577 438884
60236 438884 438104 437790 437835 437651 437167 437205 438464 440481 442145 443065 443874 445287 447423 450075 453084 456277 459500
60219 459500 462910 466864 471312 475693 479671 483624 488172 493485 499340 505521 511823 517883 523377 528259
60205 528259 532614 536418 539753 543028 546590 550229 553423 556009 558212 560074 561291 561699 561555 561184 560657
60190 560657 559967 559209 558398 557405 556249 555094 553717 551364 547622 543250 539582 537155 535383 533571 531709
60175 531709 530057 528592 527249 526348 526239 526655 526849 526282 524908 522955 520882 519446 519219 519893 520483 520396 519902
60158 519902 519413 518792 517738 516447 515421 514824 514500 514489 515020 516005 517006 517850 518855 520197 521386 521734 521278
60141 521278 520912 521553 523327 525660 528039 530588 533829 537920 542277 546075 549068 551728 554534 557360 559729
60126 559729 561550 563286 565343 567557 569489 571045 572513 573997 575121 575507 575346 575297 575864 577037 578398
60111 578398 579369 579435 578441 576774 575034 573438 571656 569258 566157 562619 559096 556115 554057 552867 552151
60096 552151 551683 551638 552241 553472 555276 557774 560972 564490 567928 571304 574787 578133 580838 582786 584275
60081 584275 585332 585443 584154 581640 578495 575159 571718 568007 563673 558349 552092 545535 539355 533579
60067 533579 527600 520941 513872 507251 501807 497564 493889 490115 486140 482397 479262 476590 473921 470991
60053 470991 467961 465255 463381 462771 463491 465022 466629 468117 470046 472988 476713 480441 483802 487145 490784
60038 490784 494281 496790 497900 497823 496936 495518 493906 492488 491321 490012 488145 485694 482932 480074 477144
60023 477144 474000 470401 466235 461818 457726 454123 450407 445790 440170 434241 428839 424392 420866 417992
60009 417992 415537 413541 412265 411722 411353 410468 408942 407279 406002 405313 405260 405812 406617 407129 407256 407558 408540
59992 408540 410037 411608 413250 415158 416974 417994 418285 418952 420886 423612 425903 427194 427883 428365 428468
59977 428468 427913 426750 425090 422892 420399 418342 417230 416688 415961 414903 413989 413490 413210 413054 413264 413913
59961 413913 414672 415351 416235 417522 418744 419215 418954 418769 419391 420714 421932 422296 421742 420863 420300 420174 420180 420072
59943 420072 419811 419287 418292 416897 415551 414573 413812 412963 412051 411386 411247 411732 412745 413977 415190 416670 419046
59926 419046 422430 426102 429392 432552 436265 440506 444423 447353 449502 451562 453944 456425 458298 458860
59912 458860 457965 456140 454114 452438 451612 452141 454023 456485 458804 461158 464085 467200 469238 469552 468890
59897 468890 468423 468544 469047 469978 471649 473957 476301 478331 480509 483647 487999 492950 497711 502189 506972
59882 506972 512445 518231 523761 529116 534896 541372 548218 555086 561908 568422 573802 577132 578143 577352
59868 577352 575621 573737 572188 571041 569949 568413 566189 563599 561468 560559 560838 561398 561324 560588 559989 560393
59852 560393 562309 565897 570889 576545 582181 587788 593714 599704 604762 608070 609606 609781 609075 608212 608048
59837 608048 608729 609369 608997 607536 605423 602663 598915 594328 589618 585336 581526 578148 575335 573134 571383
59822 571383 569938 568637 567008 564522 561327 558218 555514 552423 548039 542649 537420 532953 528842 524727
59808 524727 520972 517915 515081 511815 508331 505459 503456 501761 499908 497995 496102 493902 491203 488332
59794 488332 485621 482976 480329 478076 476569 475561 474682 474117 474197 474583 474529 473874 473136 472743 472776 473424 474941
59777 474941 477013 478814 479956 480867 482061 483538 485221 487487 490789 494973 499307 503106 506194 508907
59763 508907 511730 514799 517757 520274 522559 525003 527503 529604 531269 532914 534690 536382 538163 540729
59749 540729 544383 548593 552803 557105 561641 565929 569401 572288 575338 578861 582478 585718 588439 590759
59735 590759 592842 594721 596224 597298 598459 600427 603099 605437 606755 607636 609060 611039 612716 613519 613552
59720 613552 613082 612354 611854 612077 612902 613644 613796 613375 612556 611415 610121 608980 608142 607489 606912 606489 606391 606768
59702 606768 607660 608827 609793 610274 610504 610906 611621 612560 613703 614948 615767 615461 613793 611151 608196 605553
59686 605553 603683 602607 601790 600607 598885 596751 594115 590810 587133 583745 580868 577976 574426 570054
59672 570054 565093 559855 554693 549995 545994 542687 540009 537944 536384 535049 533644 532101 530699 530016
59658 530016 530543 532136 533991 535439 536665 538334 540636 543107 545326 547301 548982 549849 549312 547404 544773
59643 544773 541978 538905 534901 529555 523353 517542 513250 510778 509684 509295 508974 508186 506728 504874 503044
59628 503044 501292 499326 496990 494477 492056 489741 487324 484658 481913 479490 477523 475471 472523 468523
59614 468523 464238 460587 457929 456235 455438 455245 455099 454848 455084 456267 457841 458890 459395 460044 460921 461292
59598 461292 460844 460330 460686 462111 464331 467124 470176 472920 475024 476751 478384 479593 479792 479029 478091 477708
59582 477708 477893 478061 477604 476338 474523 472537 470575 468677 466893 465300 463873 462485 460951 458983 456312
59567 456312 453127 450258 448566 448126 448235 448178 447731 447013 446200 445475 445040 445070 445710 446947 448386 449502 450396
59550 450396 451932 454710 458248 461721 465186 469357 474443 480169 486943 495926 507606 521097 535346
59537 535346 550320 566380 582905 598110 609964 616985 618606 615502 609554 603051 597581 593540 590391
59524 590391 587409 584442 582090 580904 580474 579764 578274 576355 574256 571532 567671 562716 556910 550241 542772
59509 542772 535002 527492 520452 514006 508390 503509 498715 493547 488345 483732 479847 476566 474022 472367
59495 472367 471260 470255 469481 469406 470019 470754 471112 470978 470510 470177 470652 472101 473755 474717 475107 475889 477696
59478 477696 480425 483867 487997 492519 496789 500505 504019 507697 511326 514367 516496 517734 518300 518563 518912
59463 518912 519468 520100 520823 522041 524259 527658 532013 536951 542263 547995 554175 560480 566353 571565 576422
59448 576422 581218 585742 589549 592406 594104 594133 592087 588297 583572 578450 573102 567837 563035 558607 554154
59433 554154 549757 546054 543434 541732 540881 541177 542636 544719 547158 550547 555650 562590 571184 581587
59419 581587 593921 607691 622377 638454 656991 678187 700948 723986 746466 767203 783915
59408 783915 794060 796449 791844 782317 770404 758602 749016 743151 741874 745219 751780 758550 762026
59395 762026 759980 752185 739607 723350 704578 684967 666533 650747 637903 627410 618574 611085
59383 611085 604921 600043 596314 593665 592147 591713 592079 592994 594567 597123 600694 604826 608886 612359 614900
59368 614900 616439 617347 618186 619176 620190 621391 623393 626455 629926 632977 635701 639014 643635 649678 657114
59353 657114 666016 676229 687274 698772 710670 723009 735786 749024 762607 776005 788567 800115
59341 800115 810812 820414 828158 833546 836720 837835 836612 832859 827006 819740 811397 802053 791925 781271
59327 781271 770135 758552 746912 735837 725823 717085 709490 702393 694864 686384 677206 667885 658820
59314 658820 650398 643162 637346 632566 628380 624902 622469 621005 620342 621004 624030 629848 637767 646683 655849
59299 655849 664672 672034 676244 675884 670770 662018 651066 638726 625291 611314 597779 585471 574654
59286 574654 565522 558418 553352 549827 547506 546617 547303 549040 551218 553954 557820 563077 569603 577201 585472
59271 585472 593780 601966 610751 620725 631239 641037 649707 657628 664667 669951 673029 674318 674219 672636
59257 672636 669683 666009 661973 657175 651339 645120 639482 634663 630241 626013 622326 619697 618414 618443 619562
59242 619562 621644 624823 629132 634104 639123 644157 649632 655510 661067 665805 669958 673771 676779 678281
59228 678281 678181 676839 674370 670565 665430 659431 653223 647342 642008 637063 632161 627139 621986 616442
59214 616442 609978 602464 594608 587499 581805 577476 573938 570501 566930 563726 561505 559989 558192 555792
59200 555792 553737 552964 553095 553041 552548 552398 553238 554930 557115 559753 562848 566010 568635 570486 572069 574455
59184 574455 578517 584106 590128 595663 600768 605926 611079 615717 619742 623626 627714 631943 636326 641142
59170 641142 646433 651705 656378 660255 663452 666170 668656 671027 672922 673682 673062 671458 669164 665788 660795
59155 660795 654393 647380 640165 632340 623399 613647 604235 596337 590289 585434 580774 575800 570647 565517
59141 565517 560178 554245 547787 541400 535690 530862 526816 523374 520404 517913 516168 515528 515922 516628 516845
59126 516845 516536 516502 517534 519683 522493 525806 530021 535506 542016 548912 555851 563036 570810 579221 588052
59111 588052 597085 606191 615266 624201 632875 641115 648778 656002 663278 670979 678765 685601 690491 693175
59097 693175 694147 694149 693691 692921 691807 690430 689091 688066 687308 686504 685408 683930 681913 679074 675277 670696
59081 670696 665676 660559 655656 651043 646290 640748 634304 627519 620825 614089 607307 601230 596587 592975
59067 592975 589259 585029 580933 577524 574516 571411 568227 565247 562521 559901 557216 554158 550431 546299
59053 546299 542635 540140 538796 538172 537824 537195 535746 533591 531616 530567 530356 530509 530743 530752 530079 528805 527884
59036 527884 528099 529124 530262 531704 534163 537623 541392 545257 549588 554275 558619 562656 567784 575473
59022 575473 585789 597541 609490 621126 632519 643708 654117 662524 667932 670523 671440 671586 670950
59009 670950 669088 665870 661688 657401 654179 652945 653728 655823 658623 661959 665584 668915 671559 673746
58995 673746 675930 678205 680292 681864 682672 682514 681312 679198 676576 674148 672664 672286 672276 671641 670083 668055
58979 668055 666143 664827 664652 665989 668608 672101 676739 683271 691784 701389 711208 721126 731342 741800
58965 741800 752336 762873 773128 782585 791006 798566 805245 810544 814040 815752 815764 813957 810319 805008
58951 805008 797882 788598 777444 765470 753417 741185 728719 716660 705496 694789 684119 674256
58939 674256 666440 660699 655756 650605 645449 641046 637694 635013 632393 629614 627212 626001 625964 625912 624680
58924 624680 622382 620033 618221 616721 615175 613511 611753 610011 608639 607925 607645 607368 607085 607081 607378 607965
58908 607965 609493 612938 618348 624675 631175 638421 647359 657812 668487 678383 687720 697459 708221
58895 708221 719861 731806 743577 755046 766490 778539 791894 806787 822766 839179 855714
58884 855714 872071 887201 899555 908417 914571 919242 922669 924118 922988 919344 913477 905496 895509
58871 895509 883940 871540 859184 847574 836975 827331 818689 811343 805372 800298 795437 790365 784813
58858 784813 778419 770957 762710 754275 746060 738168 730571 723101 715455 707534 699646 692127 684905 677679
58844 677679 670310 662747 654852 646703 638852 631836 625528 619337 612927 606415 600070 594240 589373 585598
58830 585598 582377 579104 575987 573842 573037 573207 574015 575544 577716 579942 581827 583836 586752 590608 594602
58815 594602 598108 601368 604982 608934 612455 614856 616192 616905 617142 616788 616008 615228 614534 613593 612230 610636
58799 610636 608827 606476 603495 600249 596840 592763 587751 582456 577708 573478 569207 564879 561146 558545
58785 558545 557163 556890 557462 558383 559341 560631 562717 565518 568560 571610 574615 577213 578855 579276 578328 575546
58769 575546 570600 564090 557267 550958 545271 540239 536068 532723 529918 527578 525828 524557 523586 523255 524231
58754 524231 526642 529914 533428 536727 539241 540626 541466 542790 544741 546576 548185 550608 554484 558867
58740 558867 562405 565158 568404 572900 578145 583318 588275 593476 599338 605826 612516 618924 624845 630357
58726 630357 635516 640239 644487 648453 652438 656640 661086 665687 670356 675145 680181 685352 690223 694517
58712 694517 698525 702723 707051 710821 713302 714104 713125 710414 706062 700033 692163 682483 671265 658597
58698 658597 644330 628835 613353 599020 585889 573511 562068 552118 543475 535333 527416 520136
58686 520136 513619 507545 502051 497802 494855 492371 489833 487711 486425 485500 484359 483304 483056 483798 485294
58671 485294 487574 490883 495221 500490 506959 515077 524883 535902 547519 559200 570438 580700 589362
58658 589362 595741 599424 600629 599971 597896 594566 590164 584873 578640 571534 564314 558071 553208 549333
58644 549333 546146 543707 541740 539489 536652 533782 531445 529620 528280 527817 528394 529428 530240 530717 530907
58629 530907 530551 529567 528473 527762 527279 526762 526455 526622 526881 526757 526561 527016 528288 530089 532522 536014 540419
58612 540419 544885 548765 552159 555408 558478 561046 562921 564213 565215 566145 566936 567283 566955 565959 564372
58597 564372 562286 560048 558218 557059 556201 555110 553819 553101 553993 557124 562280 568503 574868 581255 588242
58582 588242 596327 605509 615503 625822 635630 644053 650915 656793 662269 667536 672827 678637 685260 692573
58568 692573 700521 709467 719856 731940 746008 762375 780897 800920 821882 843487 865131 885749
58556 885749 904545 921382 936096 947860 955559 958582 957266 953127 948597 945541 943607 940705 935439
58543 935439 928262 919966 910160 898169 884513 870311 855678 839815 822622 805245 788924 773963
58531 773963 760013 746932 735196 725625 718665 713837 710123 706920 704315 702338 700560 698619 696625
58518 696625 694750 692960 691406 690377 689542 687922 685134 681991 679411 677399 675612 674088 672693 670588
58504 670588 667185 663198 659905 657747 656359 655474 654885 653951 652125 649844 648118 647373 647335 647787 648744 650139
58488 650139 652088 655235 660152 666563 673787 681706 690629 700556 711340 723263 736568 750549 763931
58475 763931 776087 787048 796372 802889 805864 805831 803973 801025 796910 791224 784054 776345 769282 763269
58461 763269 758026 753797 751675 752277 754856 758457 763286 770057 778479 787346 795764 803372 809606 813747
58447 813747 815694 815930 814765 812236 808619 804405 799908 795465 791729 789083 787035 784953 783160 782520 783134
58432 783134 784266 785493 787183 789848 793689 798777 805076 812255 819915 827839 835614 842273 846891 849335
58418 849335 849999 849122 846798 843304 838865 833523 827691 822287 817696 813224 808270 803435 799599 796511 793230
58403 793230 789560 786089 783255 781333 780935 782453 785273 788489 792179 797016 802922 808984 814515 819374
58389 819374 823487 826970 830385 834106 837688 840644 843410 846689 850343 853740 856710 859262 860980 861736
58375 861736 862420 863933 866078 868445 871575 875976 880804 885077 889538 895718 903636 912091 920766 930306
58361 930306 940622 950891 961143 972135 983626 994305 1003464 1011386 1018185 1023720 1028508 1033279 1037781
58348 1037781 1041399 1044616 1048377 1052489 1056428 1061244 1068604 1078161 1087996 1097696 1108855 1122449 1137729
58335 1137729 1153861 1170594 1187066 1202134 1216258 1230984 1246124 1259524 1270102 1279039 1287427 1294872
58323 1294872 1301142 1307091 1313058 1318290 1322899 1328552 1336248 1345066 1353971 1363211 1373024 1382711 1392023 1401998
58309 1401998 1413439 1425842 1438563 1451771 1465624 1479895 1494926 1511507 1529362 1547234 1564760
58298 1564760 1582651 1600772 1618058 1634766 1652727 1672777 1693910 1715558 1738555 1763053 1787645
58287 1787645 1811526 1835597 1860537 1885753 1911156 1937990 1966910 1997108 2028236 2061288 2096686
58276 2096686 2133371 2170628 2209008 2248804 2289667 2332278 2378104 2426860 2476565 2526834 2579593
58265 2579593 2635764 2693949 2753320 2815070 2879846 2946440 3014118 3083568 3154505 3225235 3295735
58254 3295735 3368163 3443164 3518874 3594879 3673804 3757421 3844612 3934847 4030187 4131953 4238900
58243 4238900 4350714 4469781 4597415 4731889 4872374 5021146 5179610 5346038 5519806
58234 5519806 5703966 5900858 6109085 6327788 6560034 6808882 7073926 7354895 7654850
58225 7654850 7976736 8320736 8688082 9083290 9509643 9967193 10458567 10991795 11573880
58216 11573880 12206921 12894579 13646894 14474792 15385949 16390833 17506735 18751239 20138768
58207 20138768 21689446 23435041 25411921 27657962 30225310 33190968 36651500 40719478
58199 40719478 45533936 51264392 58098360 66241866 75949770 87554989 101478179 118245858
58191 118245858 138504469 162931853 191996055 225669392 263219679 303040035 342471808
58184 342471808 377846770 405096477 420871539 423555258 413555936 392857803 364298071
58177 364298071 330955559 295701536 260860498 228030717 198114635 171481807 148143847
58170 148143847 127900242 110461569 95529719 82817287 72039928 62923781 55221554
58163 55221554 48713128 43199201 38506953 34497494 31057913 28089085 25506988 23248423
58155 23248423 21264904 19512686 17953870 16561663 15316224 14197436 13186787 12272363
58147 12272363 11445697 10696251 10013750 9392496 8828111 8312698 7837903 7399872 6996578
58138 6996578 6622993 6273479 5946476 5642417 5359222 5093882 4846242 4617068 4404322
58129 4404322 4205121 4019465 3848346 3689945 3541240 3401652 3271803 3150362 3035416
58120 3035416 2927276 2826766 2732256 2641474 2554656 2472986 2395511 2320602 2248925 2181962 2118898
58109 2118898 2057816 1998647 1942206 1887667 1833865 1781888 1733620 1688712 1645563 1604193 1565590
58098 1565590 1529227 1493727 1459153 1426434 1395547 1366334 1339773 1316144 1293301 1269235 1245188
58087 1245188 1223758 1205056 1187222 1169602 1152706 1135975 1118287 1100006 1081977 1063179 1041986
58076 1041986 1019231 997472 977521 958099 938613 919869 902138 884760 867772 851967 837385
58065 837385 823396 810055 797747 785895 773773 762181 752464 744255 735989 727231 718604 709786 699707
58052 699707 688717 678622 670321 662957 655495 647785 640056 632667 626219 620772 615206 608438 600767 592911
58038 592911 584610 575656 567421 561475 557229 552785 547663 542787 538189 532753 526194 519356 512501 505006
58024 505006 496844 488775 481076 473587 466955 462204 459084 456289 453347 450821 448748 446485 444094 442380
58010 442380 441513 441042 441215 442721 445117 447042 448083 448978 449962 450441 450390 450563 451142 451543 451558 451215 449565 445260
57992 445260 438528 431017 423578 415851 408140 401823 397407 393861 390448 387615 385494 383115 379924 376624
57978 376624 373661 370200 365525 360349 355825 352196 349201 347007 345870 345544 345617 345920 346222 346232 346266 347168 349260
57961 349260 352021 354949 357893 360446 361952 362401 362387 362000 360713 358512 356044 353424 350120 346377 343474
57946 343474 341960 340779 338893 336806 335698 335865 336866 338655 341797 346803 353642 361644 369795 377605
57932 377605 385655 394693 404254 412967 420002 425158 427680 426449 421683 415132 408077 400284 391338 381794
57918 381794 372348 363064 354198 346707 341036 336262 331346 326533 322696 319920 317580 315435 313962 313883 315684
57903 315684 319170 323235 326612 328995 330784 331835 331534 330307 329761 330779 332603 334445 336806 340373 344713
57888 344713 349031 353345 357827 361765 364278 365582 366631 367945 369490 371099 372157 371511 368644 364530
57874 364530 360486 356645 352365 347635 343050 338757 334388 329878 325597 321842 318835 316929 316145 315915 315980
57859 315980 317153 320320 324979 329654 333603 337317 341460 346170 351362 356907 362356 367084 370825 373743
57845 373743 376045 377926 379687 381312 382080 381150 378590 375433 372781 371211 370792 371146 371529 371364 370750 370136
57829 370136 369593 368758 367425 365772 364030 362266 360579 359231 358501 358404 358535 358267 357299 356018 354985 354120
57813 354120 352717 350174 346254 340733 333495 325106 316533 308100 299435 290641 282669 276120 270525 265282
57799 265282 260459 256129 251918 248040 245872 246326 248256 249611 249760 249601 249756 249923 249990 250605 252308 254922
57783 254922 258042 261568 265588 270235 275713 282018 288646 295020 301098 307100 312861 318054 322852 327650
57769 327650 332148 335405 336912 337027 336349 335229 333991 332976 332114 330849 328734 325911 322951 320441 318638
57754 318638 317241 315573 313275 310703 308380 306318 304317 302684 301990 302128 302167 301281 299453 297206 295033
57739 295033 293203 291737 290420 288989 287412 285875 284537 283369 282198 280896 279683 279204 279958 281581 283113
57724 283113 284097 284985 286326 288129 290291 292947 295911 298313 299442 299657 299989 301130 303124 305495 307279
57709 307279 307480 306094 304161 302302 299883 296299 292326 289219 287030 284848 282335 279940 277863 275880
57695 275880 274077 272763 271712 270361 268667 266911 264898 262288 259551 257519 256094 254515 252881 252239
57681 252239 253034 254609 256491 259047 262632 267179 273084 281491 293221 308238 326594 348997 376002
57668 376002 407489 443355 483650 527131 570176 607763 635257 649288 648208 632804 606199 572301
57656 572301 534353 494998 456765 421658 390581 363693 340981 322108 306237 292633 281115
57645 281115 271541 263314 255926 249554 244589 240922 238234 236581 236097 236363 236632 236608 236569 236880 237681 238840
57629 238840 239893 240217 239548 238167 236463 234672 233142 232340 232266 232295 231950 231285 230224 228219 225253 222659
57613 222659 222031 223460 225517 226937 227769 228895 230966 233883 236923 239302 240788 241724 242370 242529 242046 241293
57597 241293 240778 240541 240271 239770 238872 237226 234629 231399 228039 224752 221672 219170 217403 215870 214089
57582 214089 212474 211784 211776 211238 209490 207135 205021 203183 201221 199249 197851 197330 197438 197737 197847 197415 196295
57565 196295 194840 193685 193069 192548 191611 190397 189517 189251 189284 189291 189411 189890 190612 191343 192153 193141 193996 194400 194774
57546 194774 195959 198129 200681 203274 206204 209452 212229 214064 215725 218284 221604 224493 226108 226466
57532 226466 225672 223514 220122 216430 213569 211960 211234 210894 210863 211458 212929 215083 217419 219623 221750 223893
57516 223893 225908 227692 229476 231570 233896 236091 238041 240036 242297 244534 246191 247116 247852 249048 250624
57501 250624 251851 252447 253159 254712 256434 256694 254874 252185 250227 249302 248565 247279 245368 243138 241110
57486 241110 239947 239900 240369 240490 240184 240195 241061 242433 243575 244242 244871 246001 247673 249399 250610 251021 250536
57469 250536 249150 247215 245600 245085 245607 246536 247644 249213 251153 252722 253511 254124 255412 257402 259373
57454 259373 260654 261023 260727 260504 261188 262924 265063 267130 269379 272055 274680 276696 278298 280010 281818
57439 281818 283393 284807 286328 287850 289265 291107 293968 297449 300523 302841 304880 306896 308675 310344
57425 310344 312475 315109 317487 319082 320267 321643 323359 325389 327851 330606 333029 334651 335715 336749
57411 336749 337967 339385 341173 343479 346110 348702 351017 352898 354222 355171 356311 358057 360195 362234
57397 362234 364107 366250 369046 372460 376206 380076 383974 387737 391076 393823 396220 398824 402045 405904
57383 405904 410225 414862 419590 424032 427987 431674 435437 439360 443388 447591 451993 456264 459960 462998
57369 462998 465683 468395 471471 475136 479229 483229 486937 490804 495179 499592 503426 507066 511542 517102
57355 517102 522938 528432 533836 539481 545090 550335 555467 560889 566503 571964 577308 582837 588593 594349
57341 594349 600025 605769 611689 617734 623843 630026 636271 642453 648368 653896 659154 664399 669733 675070
57327 675070 680477 686251 692426 698556 704367 710302 716908 723981 731007 738255 746666 756570 767253 777906
57313 777906 788289 798283 807558 816108 824527 833304 842298 851250 860392 870074 880192 890379 900524
57300 900524 910766 921281 932375 944416 957281 970226 982712 995081 1008046 1021814 1036212
57289 1036212 1051301 1067206 1083425 1099006 1113629 1128069 1143306 1159541 1176352 1193586 1211621
57278 1211621 1230700 1250396 1270030 1289442 1308961 1328648 1348079 1367148 1386588 1407218 1428938
57267 1428938 1450970 1472887 1494840 1516920 1538989 1561123 1583538 1605904 1627423 1647824 1667700
57256 1667700 1687560 1707167 1726272 1745418 1765450 1786491 1807969 1829552 1851561 1874452 1898176
57245 1898176 1922182 1946011 1969892 1994653 2020772 2047699 2074492 2101017 2127928 2155442 2182869
57234 2182869 2209676 2236302 2263370 2290564 2316945 2342133 2366676 2391429 2417061 2444016 2472371
57223 2472371 2501681 2531354 2561250 2591685 2622770 2654059 2684975 2715499 2746211 2777489 2808701
57212 2808701 2838561 2866523 2893575 2921253 2950124 2979793 3010182 3041897 3075149 3109174 3143202
57201 3143202 3177369 3212110 3247142 3281692 3315482 3348879 3382195 3415389 3448487 3481895 3516135
57190 3516135 3551383 3587343 3623613 3660308 3698223 3738063 3779541 3821558 3863318 3904884 3946591
57179 3946591 3988381 4029816 4070354 4109510 4147189 4183994 4220697 4257293 4293045 4327589 4361395
57168 4361395 4394988 4428317 4461062 4492864 4523062 4551015 4577111 4602668 4628342 4653364 4676973
57157 4676973 4699907 4723662 4748749 4774463 4800007 4825123 4849794 4873930 4897177 4918700 4937461
57146 4937461 4953054 4965778 4975561 4981478 4982948 4980796 4976381 4970104 4961508 4950379 4936895 4921009 4902575
57133 4902575 4882089 4860733 4839775 4820357 4803561 4790129 4780393 4774937 4774980 4781559 4794659 4813558
57121 4813558 4837493 4865345 4895218 4925177 4954316 4982774 5011386 5042125 5078441 5124299 5182945
57110 5182945 5256826 5347936 5457553 5586390 5736116 5910696 6116054 6359419 6650026 7000009
57100 7000009 7424140 7939723 8567836 9334050 10267061 11396959 12754356 14368450 16263427
57091 16263427 18456560 20959207 23776689 26905778 30333774 34036947 37966955 42026359
57083 42026359 46059958 49884921 53340836 56314621 58725683 60503948 61592456 61963880
57075 61963880 61622463 60590580 58903707 56621932 53839447 50675913 47256259 43694059
57067 43694059 40083595 36498110 32993103 29613458 26399485 23387928 20609608 18087051
57059 18087051 15832627 13846908 12118871 10628905 9352831 8264903 7339812 6554029
57051 6554029 5886032 5315935 4825981 4401606 4031308 3705388 3415671 3156383 2923908
57042 2923908 2714929 2525458 2351943 2192333 2045369 1909548 1783551 1667202 1561382
57033 1561382 1467288 1386220 1319740 1269405 1236155 1219615 1217098 1222731 1228065 1224618 1206621 1172123
57021 1172123 1122362 1060478 990403 916272 842294 772375 709033 652559 601756 555687 514367
57010 514367 477929 445970 418000 393845 373088 354581 337074 320099 303868 288565 274083
56999 274083 260287 247134 234689 223277 213511 205882 200395 196693 194482 193710 194549 197322 202311 209463
56985 209463 218486 229287 242042 256565 271671 285302 295204 299680 298206 291708 282043 270870 259041
56972 259041 247041 235663 225857 218110 212271 208005 205175 203882 204367 206908 211676 218721 228213 240592
56958 240592 256162 274424 293887 312560 328578 340441 346959 347317 341328 329694 313931 295918
56946 295918 277327 259314 242606 227725 215096 205028 197736 193452 192481 195115 201551 211944 226545
56933 226545 245642 269231 296678 326568 356680 383979 404949 416587 417548 408460 391225 368189
56921 368189 341881 314883 289287 266168 245763 228047 212865 199671 187689 176581 166656 158270
56909 158270 151285 145349 140412 136574 133541 130766 128260 126855 127288 129187 131300 132690 133524 134682 136902
56894 136902 140387 144982 150531 157154 165335 175703 188708 204473 222788 242840 262908 280767
56882 280767 294670 303806 307814 306408 299915 289763 277862 265613 253897 243673 235883 230837 228377
56869 228377 228738 232727 240996 253693 270925 293028 320243 352690 390782 434893 484046 535073
56857 535073 583289 623776 652340 666345 665484 651621 627657 596766 562527 528658 497809 470992
56845 470992 448660 431808 421507 418009 421223 431786 450918 479426 517673 566339 626246 697011
56833 697011 776056 858548 937606 1004870 1052346 1074975 1071858 1045459 1000243 941932 876815 810534
56821 810534 747111 689003 637693 594027 558278 530345 510057 497413 492797 497082 511334 536272
56809 536272 571979 617859 672258 731636 790180 840664 876387 893082 889734 868049 831266 783294
56797 783294 728404 670896 614473 561764 514410 473343 438873 410796 388767 372634 362415
56786 362415 358220 360274 368758 383424 403574 428435 456975 486911 514245 534426 544174 542360
56774 542360 529655 507858 479277 446164 410557 374544 340183 308733 280265 254447 231472
56763 231472 211867 195707 182500 171584 162194 153495 145174 137796 132022 127658 123960 120619 117700
56750 117700 114875 111560 107857 104588 102234 100444 98730 97018 95399 93908 92709 92005 91615 91119 90527
56735 90527 90218 90127 89598 88276 86675 85586 85374 85997 87209 88444 89021 88825 88509 88771 89737 91167 92857
56718 92857 94597 96123 97406 98672 99965 100988 101563 101906 102268 102619 102881 103155 103594 104371 105884 108538
56702 108538 112121 115767 118692 120614 121384 120868 119534 118638 119245 121284 123891 126386 128523 130111 130921
56687 130921 130998 130756 130702 131105 131804 132341 132501 132735 133664 135159 136409 137009 137419 138102 138815 139178 139362 139634 139701
56668 139701 139212 138584 138588 139209 139648 139489 139208 139378 139955 140591 141120 141462 141445 141104 140952 141574 143001 144703 146155
56649 146155 147187 147858 148243 148388 148320 148028 147617 147543 148453 150488 152861 154431 154756 154303 153642 152864 151901 150921
56631 150921 149980 148645 146455 143566 140498 137473 134487 131828 129886 128461 126897 124984 123198 121919
56617 121919 120975 120105 119353 118779 118313 118107 118517 119433 120183 120412 120601 121298 122328 123250 124148 125359 126714 127661
56599 127661 128018 128016 127704 126902 125782 124942 124743 125045 125709 126932 128741 130542 131628 132077 132694 133943 135253
56582 135253 135655 134934 133833 133135 132946 133038 133474 134529 136288 138714 141909 145736 149334 151658 152740 153834
56566 153834 156029 159179 162490 165720 169310 173634 178683 184369 190666 197298 203721 209611 215216 221012
56552 221012 227082 233012 238386 243167 247508 251358 254551 257171 259475 261351 262255 261879 260540 258650 256167
56537 256167 252903 249026 244809 240183 235032 229721 224760 220096 215309 210329 205374 200363 195140 190224
56523 190224 186558 184354 182859 181440 180251 179714 179952 180949 182583 184226 184960 184526 183541 182509 181243 179546
56507 179546 177849 176644 175740 174551 172806 170634 168342 166358 165027 164206 163500 163043 163416 164525 165315 165132
56491 165132 164684 164987 165853 166208 165557 164395 163370 162749 162631 163037 163637 163867 163434 162582 161906 162016 163126 164719
56473 164719 165846 166004 165498 164805 163974 163013 162478 163118 165024 167479 169557 170693 170878 170587 170385 170433 170473 170332
56455 170332 170085 169694 169010 168371 168661 170343 172803 175035 176659 177926 179070 180080 180830 181079 180623 179732
56439 179732 179166 179396 180082 180581 180713 180772 181119 181991 183343 184656 185340 185587 186325 187958 189689 190510 190411 190128
56421 190128 190136 190411 190841 191349 191767 191930 191714 190902 189527 188452 188895 190984 193517 195546 197368 199300 200461
56404 200461 199843 198021 196686 196681 197484 198404 199332 200307 201161 201777 202140 202206 202218 202915 204834 207447 209572 210579
56386 210579 210745 210625 210603 210883 211362 211643 211621 211871 212969 214670 216239 217364 218214 218890 219403 220003 220975 222238
56368 222238 223565 224917 226151 226806 226799 226904 227910 229593 231163 232382 233561 234785 235921 237189 238931
56353 238931 240951 242703 243941 244627 244593 243971 243614 244237 245391 246093 246230 246487 247187 248102 249209 250676 252201
56336 252201 253353 254493 256390 258895 260950 262054 262789 263748 264796 265688 266658 268055 269884 271936 273929
56321 273929 275528 276672 277880 279723 282148 284792 287720 291118 294504 297002 298324 298774 298473 297498 296703
56306 296703 297391 299940 303499 307208 311011 315147 319484 323597 327095 329876 332413 335588 339715 344020
56292 344020 347751 351375 355841 361009 365852 370092 374587 380056 386333 392928 399488 405668 411382 417197
56278 417197 423794 431183 439111 447830 457470 467176 476193 485541 497086 510997 525632 540052 555009
56265 555009 571137 587896 605015 623546 644547 667987 693850 723243 757393 796383 839874
56254 839874 888428 943190 1004778 1073292 1148936 1231879 1321821 1418369 1521594 1631689 1748231
56243 1748231 1870008 1995172 2121248 2245307 2364438 2475869 2576722 2664194 2736106 2790811
56233 2790811 2826607 2841957 2836504 2811339 2768255 2709289 2636899 2553667 2461627 2362479 2258454
56222 2258454 2152150 2045461 1939507 1835671 1735694 1640525 1550038 1464197 1383637 1308766
56212 1308766 1239172 1174294 1113935 1057862 1005734 957754 914558 876061 841167 808973 779512
56201 779512 752995 729091 707388 687937 670845 655874 642678 631018 620633 611400 603557 597117
56189 597117 591232 584968 578598 573198 569041 565415 561960 559031 556632 554180 551598 549590 548577 548303
56175 548303 548586 549479 550647 551664 552948 555233 558157 560701 563079 566658 571838 577528 583044 589005 595870
56160 595870 603136 610588 618935 628531 638699 648893 659408 670548 682335 695388 710737 728423
56148 728423 747736 769109 794195 823761 857379 895646 940705 993751 1053962 1120747 1194829
56137 1194829 1275700 1359884 1443292 1523841 1600384 1670745 1732765 1786339 1832981 1874202 1911357
56126 1911357 1945680 1976892 2002613 2020486 2030175 2032492 2027846 2016756 2000636 1980558 1955851 1924853
56114 1924853 1886146 1838373 1780315 1712521 1637932 1559972 1481082 1403726 1331015 1264905 1205162
56103 1205162 1151459 1105087 1067167 1036588 1011362 990857 975126 963173 953595 946141 941148 938218
56091 938218 936742 936844 938611 941277 944261 947966 952567 957321 962188 968624 977387 987004 995927 1004794
56077 1004794 1014995 1026339 1037875 1049759 1062521 1075560 1088098 1100637 1113926 1127464 1140483
56066 1140483 1153404 1166949 1180981 1195460 1211180 1228174 1244837 1260127 1275100 1290836 1306574
56055 1306574 1321612 1337218 1354657 1372961 1390705 1408440 1427203 1446199 1464282 1482406 1502338
56044 1502338 1524150 1547038 1571312 1597437 1624357 1650959 1678031 1706818 1736965 1767819 1800252
56033 1800252 1835181 1871807 1909310 1948655 1990711 2034383 2078610 2124185 2171468 2218655 2264829
56022 2264829 2312361 2363479 2416761 2470049 2524484 2582309 2642814 2704131 2767229 2834573 2906327
56011 2906327 2981231 3059633 3142432 3228744 3317790 3411223 3510471 3613997 3720465 3832135 3951519
56000 3951519 4077370 4207942 4345445 4492839 4648804 4810550 4979276 5158160 5347396
55991 5347396 5546058 5756477 5981751 6221282 6473718 6741808 7029345 7336269 7662186
55982 7662186 8011582 8389866 8797635 9234943 9707620 10222798 10782147 11386933 12046021
55973 12046021 12771209 13568768 14444147 15411194 16488105 17688902 19029057 20535964 22244949
55964 22244949 24191344 26419374 28995861 32006076 35544826 39726433 44697235 50625074
55956 50625074 57688790 66101768 76146211 88180722 102645645 120088239 141125164
55949 141125164 166249788 195556859 228541620 263968127 299693424 332579212 358888633
55942 358888633 375291053 379950002 372967528 356012834 331597679 302478770 271265151
55935 271265151 240117063 210552707 183449492 159193579 137842441 119247526 103163309
55928 103163309 89333298 77515161 67465005 58937897 51710074 45585894 40387033
55921 40387033 35953616 32156760 28895879 26082906 23639367 21505355 19637261 17995240
55913 17995240 16541577 15248844 14098260 13069613 12141346 11299383 10536736 9844490 9211035
55904 9211035 8629369 8097129 7609555 7159508 6743915 6363127 6014104 5690796 5390840
55895 5390840 5115455 4862893 4628194 4409388 4208060 4023757 3853312 3695781 3552658
55886 3552658 3422892 3302473 3189102 3082746 2981778 2883146 2786309 2692709 2601592 2510702
55876 2510702 2420862 2335439 2255238 2178055 2103144 2031924 1964205 1897952 1833144 1772108 1715673
55865 1715673 1662447 1612020 1565434 1522316 1480888 1440902 1403463 1368097 1333208 1299272 1268311
55854 1268311 1240274 1213177 1186616 1161811 1138373 1114442 1090056 1066997 1045117 1022225 997888
55843 997888 974072 951600 929154 906254 884172 863308 842587 822070 803422 787127 771785
55832 771785 756682 742586 729623 716886 704571 694053 685383 677078 668625 660769 653120 644148 633947
55819 633947 624381 615860 606559 595511 584037 573312 562886 552523 543317 535986 529883 524542 520498
55806 520498 517999 516579 516374 518133 521581 525572 530087 536109 543121 548852 552086 553789 554846 554601 552339
55791 552339 548414 543197 536487 528660 520873 513589 506263 498749 491458 483935 475089 465238 456237 449165
55777 449165 443590 439446 437817 439349 443597 450392 460049 471520 481950 488747 490908 488199 480816 470140
55763 470140 458033 444907 430179 414785 401125 389993 379682 368927 358573 349339 340008 329238
55751 329238 317529 306084 295147 284775 275912 269334 264487 260478 257355 255505 254742 254713 255263 255694
55737 255694 254768 252190 249099 246433 243842 240854 237987 235928 234584 233567 232648 231236 228587 225123 222386
55722 222386 220994 219790 217660 215033 212820 211027 209355 208197 208232 209751 212959 217994 224034 229376 233042
55707 233042 235438 236996 237288 236046 233908 231419 228360 224708 221143 217867 213965 208751 202729 196635
55693 196635 190642 185222 181494 179737 178648 177136 175859 175930 177068 178212 179216 180697 182792 185160 187810
55678 187810 190977 194470 197845 200846 203075 203778 202638 200362 197946 195842 194217 193271 192751 191860 190289
55663 190289 188729 187878 187700 188082 189305 191162 192548 192781 192627 193210 194617 196351 198376 200738 202749 203570
55647 203570 203259 202476 201483 200162 198599 196897 194725 191615 187460 182342 176357 170028 164264 159394 154849
55632 154849 150304 146414 143776 141839 139664 137198 135012 133233 131577 130084 129055 128429 127819 127028 126093
55617 126093 125081 124102 123192 121944 119816 117096 114921 113913 113435 112576 111184 109432 107218 104710 102787
55602 102787 102049 101806 100858 99014 97254 96620 97378 98877 99810 99032 96621 93835 91816 90796 90721 91788
55586 91788 93824 95882 97091 97426 97215 96573 95786 95471 95692 95628 94833 94169 94712 96325 98058 99433 100571
55569 100571 101583 102654 104309 106743 109194 110647 110904 110362 109186 107390 105382 103693 102396 101306 100464
55554 100464 99952 99638 99529 99926 100711 101032 100340 99213 98548 98427 98432 98549 99007 99657 100312 101304 102937 104691
55536 104691 105801 106377 107166 108312 109070 108732 107313 105365 103566 102375 101774 101388 100997 100616 99988 98601
55520 98601 96525 94609 93464 92795 92063 91184 90107 88455 86212 84157 82992 82547 82330 82269 82319 82005 81004
55503 81004 79681 78473 77326 76229 75546 75222 74486 73050 71808 71512 71589 71219 70783 71133 72074 72703 72784 72739
55485 72739 72713 72660 72900 73647 74433 74908 75603 76825 77503 76502 74587 73688 74437 75759 76668 77132 77265 76999
55467 76999 76634 76520 76204 75001 73342 72332 72053 71617 70971 71194 72631 74033 74164 73239 72223 71532 71002
55450 71002 70467 69880 69332 69142 69458 69727 69238 68227 67706 68117 68921 69674 70642 72124 73883 75506 76709
55433 76709 77101 76378 74952 73786 73291 72977 72320 71469 70914 70988 71743 72794 73313 72827 72029 72110 73307 74845
55415 74845 76288 78000 80101 81924 82991 83758 84861 86113 86698 86047 84237 81876 79761 78326 77257
55400 77257 75882 73916 71604 69388 67879 67758 68978 70260 70246 69086 68136 68120 68452 68394 67963 67498 67161
55383 67161 67120 67502 67925 67722 66831 65834 65066 64440 64213 65039 66911 68897 70294 71439 73042 75323 78057
55366 78057 80880 83290 85002 86465 88379 90545 91885 91819 90839 89524 87832 85715 83573 81679 79938
55351 79938 78636 78578 79865 81330 81866 81731 81810 82170 82125 81378 80345 79553 79210 79231 79243 78799 77919 77199 77053
55332 77053 77124 76772 75847 74741 73953 73847 74535 75711 76866 77785 78519 78875 78527 77728 77217 77102 76550 75036
55314 75036 73296 72477 72779 73508 74057 74295 74284 74159 74098 74096 73987 73945 74535 75905 77324 77961 77811 77470 77308 77333
55294 77333 77561 77973 78248 77929 76828 75101 73160 71668 71219 71683 72194 72149 71917 72244 73259 74436 75245
55277 75245 75415 74856 73801 72945 73031 74288 76376 78632 80230 80483 79389 77729 76389 75760 75904 76818 78164
55260 78164 79182 79400 79194 79212 79429 79260 78520 77740 77519 77908 78518 78979 79196 79270 79266 79066 78522 77740 77033 76619
55240 76619 76581 77007 77808 78441 78324 77696 77520 78305 79499 80373 81000 81873 82943 83608 83513 82838 81893 80884 80075
55221 80075 79736 79871 80240 80748 81589 82889 84335 85339 85572 85299 85035 84891 84513 83779 83274 83668 84830 85960
55203 85960 86492 86378 85631 84216 82527 81368 81228 81952 83244 84969 86769 87903 87874 86844 85232 83273
55187 83273 81232 79582 78609 78090 77645 77124 76470 75527 74279 73023 72126 71822 72309 73624 75320 76753 77889
55170 77889 79305 81137 82572 82840 82246 81760 81885 82398 82972 83545 84137 84702 85204 85728 86480 87591 88781
55153 88781 89371 88964 88002 87194 86579 85761 84964 84981 85964 87083 87629 87629 87076 85560 83287 81611 81646 82864 83855
55134 83855 84073 84078 84448 85269 86482 87963 89229 89712 89398 88862 88673 89004 89655 90183 90227 89954 89938 90405 90963
55115 90963 91307 91662 92133 92152 91149 89477 88092 87529 87645 88116 88752 89482 90344 91341 92117 92142 91422 90574 89959
55096 89959 89278 88340 87601 87520 87944 88591 89530 90620 91140 90688 89849 89306 88893 88317 88145 89086 90745 92087
55078 92087 92815 93286 93427 92863 91968 91618 91904 92073 91871 91954 92800 94078 95328 96462 97354 97675 97463 97299
55060 97299 97574 98059 98360 98353 98047 97485 96963 96951 97614 98667 99660 100130 99662 98277 96674 95653 95385 95604 96188
55041 96188 96967 97268 96432 94765 93322 92732 92800 93132 93487 93637 93494 93389 93598 93772 93472 93088 93415 94440
55023 94440 95379 95831 95946 95510 93956 91504 89239 87734 86519 85261 84555 85003 86269 87601 88700 89601
55007 89601 90287 90874 91657 92598 93198 93251 93177 93337 93580 93781 94194 94852 95256 95145 95030 95473 96286 96944 97343 97658
54987 97658 97870 97909 97959 98233 98730 99495 100685 102057 102949 103154 103293 103910 104718 105242 105626 106176 106608 106528 106293
54968 106293 106618 107493 108207 108288 107841 107124 106475 106539 107808 109868 111697 112795 113475 114010 114123 113591 112761 112020
54950 112020 111079 109283 106653 104292 103572 104858 107088 108747 109236 109144 109166 109158 108588 107581 106979 107327 108248 108953
54932 108953 109139 109191 109732 111092 113165 115563 117926 120130 122320 124851 128161 132526 137763 143228 148155
54917 148155 152045 154712 156115 156229 155027 152600 149384 146166 143582 141489 139066 135730 131810 128249
54903 128249 125741 124316 123522 122778 121591 119749 117449 115198 113515 112663 112582 113011 113681 114423 115105 115606 115973
54886 115973 116530 117668 119451 121558 123618 125519 127420 129556 132115 135228 139012 143482 148280 152525
54872 152525 155262 156203 155840 154704 152782 149879 146216 142353 138700 135455 132721 130291 127502 123877 119803
54857 119803 116142 113285 111091 109582 108979 108983 108799 108142 107600 107677 107994 107882 107315 106783 106502 106230 105714 104918
54839 104918 103884 102713 101653 100949 100554 100148 99494 98730 98303 98583 99491 100526 101206 101395 101184 100684 100101
54822 100101 99801 99951 100318 100649 101025 101510 101749 101484 101240 101852 103312 104725 105409 105498 105384 105203 105008 104874
54804 104874 104666 104218 103846 104074 104739 105054 104788 104721 105548 106971 108325 109535 110896 112307 113302 113638 113460
54787 113460 113074 112819 112879 113003 112714 112016 111552 111878 112921 114328 115838 117128 117866 118308 119300 121282 123764
54770 123764 126214 128949 132633 137336 142628 148228 153989 159492 164186 167732 169895 170461 169630 168051 166018
54755 166018 163119 159189 155062 151669 148836 145795 142540 139797 137814 136106 134447 133263 132815 132653 132168
54740 132168 131262 130303 129767 129988 130871 131752 131890 131162 130054 129071 128473 128457 129180 130610 132669 135401 138682
54723 138682 142015 145122 148573 153183 158698 163619 166493 167026 165872 163736 160892 157325 153153 148897
54709 148897 145222 142325 139839 137496 135516 134043 132680 131126 129831 129330 129247 128769 127925 127440 127364 126872
54693 126872 125657 124542 124178 123905 122611 120230 117801 116303 115945 116355 116985 117392 117507 117574 117682 117556 117008
54676 117008 116343 115973 115789 115276 114250 113203 112868 113601 115176 117007 118456 119049 118647 117589 116605 116330 116749
54659 116749 117232 117242 116814 116202 115364 114162 112924 112362 112884 114254 115924 117432 118552 119359 120135 120929 121255
54642 121255 120601 119243 118102 117705 117636 117142 115949 114342 112815 111891 111936 112773 113636 113851 113561 113536 114205 115089
54624 115089 115260 114327 112811 111588 111091 111177 111549 111977 112117 111588 110517 109744 110130 111722 113776 115428 116140
54607 116140 115753 114523 113101 112172 112041 112605 113534 114350 114610 114287 113778 113370 113032 112940 113676 115408 117262 118160
54589 118160 118063 117732 117493 117010 116200 115583 115549 115911 116308 116517 116300 115500 114457 113739 113341 112719 111769 111163 111436
54570 111436 112280 113029 113436 113725 114249 115311 116885 118376 119101 119158 119301 119874 120491 120902 121432 122182 122617 122517
54552 122517 122639 123741 125435 126752 127460 128134 129194 130589 132172 133706 134649 134623 134030 133572 133278 132651 131698
54535 131698 131070 131080 131274 131214 131026 130908 130660 130114 129609 129533 129664 129407 128607 127766 127439 127709 128218 128512 128308 127686
54515 127686 127100 127066 127654 128331 128435 127803 126840 126001 125422 125170 125531 126681 128126 128918 128568 127482 126378 125595
54497 125595 125152 125138 125605 126258 126641 126683 126738 127064 127514 127855 128147 128674 129600 130820 132092 133194 133949 134258 134195
54478 134195 134046 134072 134222 134239 134110 134193 134718 135394 135845 136272 137242 138845 140588 142212 144043 146233 148122 148892
54460 148892 148566 147901 147401 146921 146248 145605 145385 145583 145654 144887 142998 140496 138434 137574 137764 138182 138098 137316
54442 137316 136103 135005 134617 135115 135920 136148 135555 134834 134858 135810 137174 138347 139018 139134 138889 138782 139303 140337
54424 140337 141149 141258 141181 141903 143548 145024 145232 144310 143263 142589 141806 140387 138642 137373 136977 137266 138042
54407 138042 139443 141621 144295 146813 148665 149886 150893 151931 152825 153273 153261 153008 152659 152234 151807 151456
54391 151456 151061 150466 149877 149749 150199 150783 151025 150920 150711 150469 150113 149724 149553 149765 150356 151236 152244 153166
54373 153166 153886 154509 155287 156390 157782 159211 160371 161225 162163 163685 165945 168730 171790 174929 177850
54358 177850 180272 182210 183742 184525 184039 182455 180660 179171 177558 175317 172736 170349 168008 165290 162500
54343 162500 160437 159147 157703 155464 152947 151117 150236 149811 149349 148777 148234 147794 147506 147569 148297 149788 151583
54326 151583 152844 153083 152584 151910 151112 149811 148004 146337 145430 145200 145070 144639 143939 143209 142620 142176 141776
54309 141776 141369 141073 141067 141382 141926 142706 143853 145347 146874 148049 148678 148748 148297 147454 146480 145620 144928 144364
54291 144364 144042 144238 145081 146274 147271 147784 148082 148687 149743 150795 151285 151168 150899 150881 151108 151365 151545 151652
54273 151652 151651 151485 151205 150907 150588 150235 150078 150502 151557 152759 153610 154269 155341 156981 158555 159377 159529 159652
54255 159652 160170 161031 162075 163192 164097 164344 163751 162579 161195 159800 158517 157512 156837 156324 155777 155152
54239 155152 154529 154082 154000 154199 154136 153279 151874 150854 150819 151387 151731 151455 150788 150260 150337 151042 151745 151736 151197 151115
54219 151115 151867 152508 151944 150350 148809 147949 147693 147956 148659 149140 148543 146959 145426 144636 144372 144394 144983 146143
54201 146143 147055 146983 146202 145420 144745 143907 143193 143315 144384 145648 146332 146250 145543 144348 142988 142076 142067 142836 143894
54182 143894 144964 146164 147636 149115 149954 149666 148449 147098 146357 146440 147138 148144 149148 149867 150279 150692
54166 150692 151278 151681 151425 150713 150416 151168 152764 154488 155712 156008 155062 152882 150013 147284 145341 144513
54150 144513 144884 146187 147734 148856 149418 149733 149969 149998 149872 150039 150846 152032 153008 153506 153765 154111 154614 155150
54132 155150 155630 156078 156482 156597 156010 154616 153106 152669 153989 156595 159325 161297 162263 162334 161790 161092 160692
54115 160692 160719 161041 161588 162364 163202 163886 164543 165539 166889 168148 169063 169980 171380 173299 175522 178031 180895
54098 180895 183865 186554 189095 192262 196705 202135 207327 210940 212354 211842 210031 207320 203888 200070
54084 200070 196405 193183 190195 187168 184284 182129 181176 181437 182533 183989 185515 187151 189146 191638 194444
54069 194444 197096 199080 200148 200540 200756 200918 200470 198796 196041 192908 189781 186546 183322 180701 178920
54054 178920 177344 175281 172972 171337 170971 171847 173754 176491 179621 182556 185023 187271 189818 193081 197146
54039 197146 201644 205953 209758 213347 217212 221528 226119 230706 234947 238518 241491 244390 247528 250511
54025 250511 252748 254262 255560 256934 258317 259636 260742 261119 260274 258467 256524 254860 253130 250931 248345
54010 248345 245641 242887 240022 237004 233755 230318 227112 224621 222701 220652 218059 215183 212336 209461
53996 209461 206570 204106 202389 201131 199976 199195 199216 199599 199168 197325 194779 192739 191682 191197 190763 190276
53980 190276 189842 189434 188984 188574 188292 188019 187686 187685 188526 189970 190953 190773 189998 189838 190869 192877 195761 199873
53962 199873 205366 211755 218517 225858 234628 245543 258446 272082 284516 294019 299738 301578 299740
53949 299740 294708 287537 279607 271933 264913 258713 253508 249338 246119 243864 242604 242129 242246 243274 245688
53934 245688 249158 252539 255082 257172 259514 262087 264366 266202 268018 270311 273349 277112 281154 284711
53920 284711 287352 289451 291805 294940 299001 304030 309920 316264 322649 328988 335227 340884 345283 348202
53906 348202 349913 350637 350401 349444 348264 347046 345408 343003 340171 337637 335643 333657 331007 327567 323618
53891 323618 319173 313794 307167 299648 292046 285005 278786 273454 268853 264445 259623 254373 249326 245053
53877 245053 241589 238709 236307 234275 232331 230283 228239 226349 224576 222935 221649 220683 219404 217117
53863 217117 213903 210548 207737 205611 204047 202918 201977 200875 199458 197933 196579 195461 194453 193424
53849 193424 192347 191303 190428 189778 189292 188940 188831 189020 189272 189211 188728 188102 187686 187555 187554 187597 187810 188357 189139
53830 189139 189810 190125 190239 190511 191085 191823 192630 193610 194872 196391 198093 199833 201236 201861 201716 201329 201091
53813 201091 200839 200372 200140 200972 203186 206348 209892 213631 217578 221602 225480 229172 232884 236930 241539
53798 241539 246670 251889 256535 260124 262648 264514 266285 268409 271041 273924 276467 278113 278772 278848 278727
53783 278727 278300 277065 274698 271377 267587 263819 260481 257713 255143 252087 248236 243933 239614 235384
53769 235384 231415 228257 226127 224301 221960 219389 217401 215719 213100 209335 205955 204297 203803 203090 201939
53754 201939 201217 201296 201699 202089 202551 202836 202330 201079 200056 199962 200348 200334 199751 199064 198492 197764 196754 195972 196212
53735 196212 197781 200127 202235 203405 203687 203606 203666 204168 205262 206929 208837 210433 211303 211489 211539 212121 213388
53718 213388 214718 215343 215323 215549 216718 218710 221181 224166 227587 230641 232432 233144 233945 235698 238298 241258
53702 241258 244301 247247 249898 252381 255176 258482 261870 264862 267550 270325 273187 275712 277619 279004
53688 279004 279991 280483 280441 280284 280775 282323 284417 285912 286072 285318 284752 284960 285436 285322 284495 283664 283464 283730
53670 283730 283877 283743 283725 284093 284583 284835 284842 284601 283680 281720 279257 277388 276546 276224 276035 276356 277493 278827
53652 278827 279404 279041 278333 277794 277513 277452 277526 277450 276983 276369 276186 276746 277922 279462 281156 282741 283988 284907
53634 284907 285801 287169 289553 293096 297119 300600 303344 306151 309457 312553 314826 317215 321347 327499
53620 327499 334346 340593 345861 350011 352818 354624 356339 358261 359727 360431 361325 363510 366819 370182 373051
53605 373051 375814 378984 382562 386138 389256 391736 393832 395943 398057 399772 400965 402053 403349 404606
53591 404606 405569 406532 407836 409099 409460 408518 406661 404550 402657 401150 399861 398346 396270 393735 391067
53576 391067 388440 385949 383876 382478 381599 380839 380076 379483 379006 378231 376927 375456 374404 373881 373425 372559
53560 372559 371313 370104 369281 368897 368889 369217 369756 370249 370522 370643 370708 370685 370607 370718 371141 371615 371951 372585 374206
53541 374206 376831 379747 382417 384979 387727 390638 393616 396834 400527 404720 409416 414856 421424 429421
53527 429421 438898 449431 460058 469936 479183 488715 499178 510508 522605 535729 549896 564552
53515 564552 579441 595277 612917 632165 652049 672100 692697 714277 736865 760443 785116
53504 785116 810601 835935 860054 882640 904301 925955 948058 970349 992321 1013815 1035008
53493 1035008 1055917 1076333 1096339 1116489 1137157 1157993 1178364 1198144 1217755 1237594 1257682
53482 1257682 1277695 1297087 1315367 1332577 1349376 1366366 1383403 1399710 1414530 1427509 1438757
53471 1438757 1448743 1457842 1465664 1471131 1473552 1473265 1470865 1466231 1458926 1449232 1438094 1426062 1412952
53458 1412952 1398552 1383098 1366915 1350155 1332968 1315485 1297467 1278403 1258194 1237430 1216858
53447 1216858 1196879 1177553 1158764 1140226 1121635 1102946 1084333 1065909 1047887 1030996 1016310
53436 1016310 1004477 995348 988374 982976 978502 974423 970858 968491 967716 968239 969772 972692 977565 984301
53422 984301 992301 1001355 1011874 1024184 1037966 1052603 1067922 1084413 1102752 1123155 1145204 1168266
53410 1168266 1191989 1216346 1241372 1267141 1293978 1322390 1352647 1384673 1418470 1454431 1493000
53399 1493000 1534126 1577317 1622206 1668862 1717473 1767881 1819524 1871919 1925140 1979727 2036060
53388 2036060 2093870 2152458 2211201 2269632 2327112 2382817 2436226 2487400 2536633 2583929 2628949
53377 2628949 2671330 2710842 2747233 2780062 2808818 2833245 2853442 2869433 2880624 2885975 2884936 2877956
53365 2877956 2865659 2847743 2823230 2791848 2754606 2712831 2667247 2618345 2567092 2514562 2461093
53354 2461093 2406423 2350713 2294905 2240044 2186654 2134880 2084784 2036306 1989244 1943544 1899326
53343 1899326 1856431 1814165 1771812 1729299 1687187 1646209 1607075 1570477 1536758 1505499 1475846
53332 1475846 1447497 1421125 1397634 1377166 1359052 1342568 1327457 1313731 1301181 1289171 1276863
53321 1276863 1263742 1250003 1236346 1223290 1210824 1198827 1187560 1177420 1168410 1160271 1153062 1147117
53309 1147117 1142428 1138625 1135762 1134566 1135531 1138197 1141800 1146272 1152106 1159435 1167865 1177199 1187772 1200095
53295 1200095 1214600 1231755 1251769 1273969 1297033 1320212 1343958 1368897 1394603 1419943 1444439
53284 1444439 1468638 1493042 1517226 1540255 1561590 1581215 1599087 1614840 1628005 1638273 1645556
53273 1645556 1649968 1651742 1650924 1647147 1639954 1629437 1616306 1601153 1583874 1564062 1541756 1517480
53261 1517480 1491575 1463955 1434631 1404238 1373781 1343938 1314698 1285610 1256317 1226884 1197633
53250 1197633 1168697 1139943 1111454 1083826 1057632 1032661 1008083 983322 958354 933158 907529
53239 907529 881711 856698 833372 811643 790835 770658 751341 733011 715547 699076 684132
53228 684132 671146 660042 650387 641741 633786 626282 618959 611349 602828 592982 581874 569810 557009
53215 557009 543700 530347 517458 505277 493840 483157 473027 462949 452666 442714 433907 426281
53203 426281 418983 411260 403162 395176 387637 380606 373996 367645 361499 355716 350271 344576 338005 330850
53189 330850 324109 318166 312330 306068 300017 295158 291467 288087 284588 281257 278219 275046 271470 267863
53175 267863 264730 262107 259782 257749 256078 254498 252506 249931 247177 244929 243692 243521 244002 244478 244480 244015
53159 244015 243454 243188 243415 244083 244804 244921 243976 242217 240455 239300 238731 238468 238417 238499 238316 237493 236258 235238
53141 235238 234634 234017 233037 231870 230815 229916 229313 229566 231182 233932 237002 239660 241523 242430 242538 242401
53125 242401 242567 243079 243682 244381 245345 246406 247182 247795 248903 250779 252774 254000 254259 253954 253340 252308 250858
53108 250858 249399 248409 247926 247533 246835 245796 244585 243217 241591 239895 238719 238568 239374 240586 241548 241781
53092 241781 241180 240193 239593 239727 240135 240127 239527 238628 237664 236740 236082 235897 236069 236348 236697 237052 236994 236164 234909
53073 234909 234004 233779 234016 234532 235223 235634 235289 234546 234323 234763 234921 234094 232773 231830 231412 231105 230627 229840
53055 229840 228547 226849 225332 224445 224035 223948 224636 226558 229306 231937 233936 235277 235803 235237 233795 232195
53039 232195 230951 230035 229185 228189 226988 225871 225464 226115 227426 228775 230110 231734 233480 234739 235286 235478
53023 235478 235557 235351 234801 234264 234047 234141 234613 235799 237717 239616 240549 240277 239400 238743 238776 239450 240322 240877 240930
53004 240930 240692 240410 240062 239534 238943 238615 238749 239167 239409 239062 238141 237162 236740 237045 237734 238411 239051 239900 241076
52985 241076 242374 243425 243976 244067 243985 244088 244579 245361 246035 246151 245611 244905 244795 245734 247602 249948 252260 254050
52967 254050 255009 255347 255766 256886 258753 260970 263014 264288 264261 262999 261347 260141 259335 258278 256770 255303
52951 255303 254255 253393 252419 251503 250913 250421 249537 248238 247112 246671 246755 246703 246003 244718 243361 242481 242306 242679
52933 242679 243178 243340 242902 241971 240950 240221 239926 240015 240406 241005 241680 242287 242720 242884 242732 242366 241977 241678 241515
52914 241515 241688 242486 243799 244877 244845 243474 241390 239591 238782 238962 239480 239623 239268 238836 238618 238499 238465 238880
52896 238880 239862 240748 240708 239758 238706 238238 238511 239470 240962 242558 243833 244896 246141 247388 247867 247251 246147
52879 246147 245283 244677 243948 243020 242129 241461 241177 241561 242746 244477 246455 248686 251151 253384 254831 255523
52863 255523 255923 256166 255885 254840 253274 251502 249549 247413 245376 243690 242109 240074 237467 234911 233150
52848 233150 232239 231480 230153 228173 226000 224084 222526 221196 219972 218839 217895 217306 217123 217091 216818 216211
52832 216211 215643 215635 216452 218007 219937 221635 222470 222306 221764 221734 222583 223963 225308 226350 227138 227853 228672 229647
52814 229647 230628 231534 232744 234876 237888 240620 241707 240930 239246 237456 235387 232665 229762 227607 226302
52799 226302 224919 222742 220161 218071 216757 215749 214595 213348 212386 212003 212216 212774 213363 213911 214594 215472
52783 215472 216259 216638 216631 216453 216145 215691 215374 215610 216339 216900 216670 215680 214491 213639 213305 213340 213466 213470 213296 212983
52763 212983 212643 212561 213091 214189 215177 215339 214810 214530 215189 216506 217708 218406 218793 219253 220114 221588 223589
52746 223589 225588 226936 227418 227389 227408 227903 229061 230754 232575 234237 235951 238139 240668 242787 244053 244952
52730 244952 246137 247292 247341 245885 243862 242558 242301 242445 242278 241572 240433 239064 237636 236070 234050 231532
52714 231532 229168 227816 227704 228440 229698 231356 232997 233949 234034 233769 233612 233540 233641 234438 236100 237815 238606
52697 238606 238491 238260 238341 238485 238479 238544 238989 239888 241087 242165 242473 241710 240436 239566 239351 239253 238787 238000 237118
52678 237118 236275 235673 235483 235390 234730 233339 231873 231010 230698 230525 230481 230900 231775 232499 232403 231461 230539 230904 233237
52659 233237 236973 240768 243698 245856 247761 249526 250853 251561 251763 251589 251037 250150 249119 248139 247230 246323
52643 246323 245418 244607 243917 243294 242833 242833 243401 244053 244108 243522 242955 242890 243179 243735 245176 248097 251941 255198 256703
52624 256703 256345 254682 252461 250472 249205 248449 247582 246358 244982 243506 241704 239695 238138 237573 237926
52609 237926 238813 239939 241077 242025 242743 243267 243454 243201 242833 242779 242910 242829 242751 243304 244288 244585 243734 242822 243196
52590 243196 244905 247008 248824 250204 251052 251412 251781 252679 253980 255175 256135 257071 257940 258401 258261 257585 256494
52573 256494 255274 254434 254193 254102 253634 252921 252433 252126 251482 250287 248824 247441 246451 246294 247150 248377 249014
52556 249014 248908 248810 249195 249581 249289 248423 247734 247763 248407 249188 249715 249936 250057 250229 250396 250473 250500 250471 250216 249705
52536 249705 249256 249180 249414 249797 250454 251491 252485 252818 252448 251937 251749 251929 252382 252931 253133 252616 251697 251184 251426
52517 251426 252006 252558 253347 254755 256629 258522 260361 262429 264754 266842 268171 268823 269464 270530 271494 271211
52501 271211 269151 266059 263242 261447 260673 260612 260740 260245 258615 256309 254345 253235 252790 252832 253344 253873 253678
52484 253678 252827 252436 253304 254852 255980 256548 257389 259085 261283 263162 264172 264374 264371 264818 265697 266199 265640
52467 265640 264414 263703 264296 265984 268012 269747 270840 271172 270892 270383 269948 269590 269160 268634 268110 267575 266863
52450 266863 265928 264963 264101 263158 261927 260701 260086 260150 260153 259421 258157 257006 256075 254959 253628 252656 252456 252739
52432 252739 252925 252736 252228 251620 251272 251511 252267 253093 253679 254097 254508 254983 255700 256840 258091 258774 258803 259111
52414 259111 260616 263125 265831 268722 272851 279108 287179 295943 304613 313264 322269 331369 339338 344729
52400 344729 346937 346375 343610 338788 332190 324910 318343 312962 308093 302951 297519 292307 287735 284069
52386 284069 281610 280482 280304 280437 280627 281174 282423 284281 286390 288555 290815 293188 295575 297970 300593
52371 300593 303718 307438 311605 315835 319577 322369 324166 325309 326105 326609 326879 327155 327573 327965 328219 328581
52355 328581 329232 329794 329798 329574 330066 331668 333731 335465 336895 338634 341076 344117 347391 350464 352987 355023
52339 355023 357174 360148 364226 369203 374692 380384 386254 392716 400266 408729 417143 424863 432631 442054
52325 442054 453925 467458 481355 495213 509557 524723 540245 555460 570377 585632 601725
52314 601725 618629 636107 653992 672011 689724 706934 723972 741265 758848 776605 794696
52303 794696 813208 831487 848471 863757 877819 891034 903049 913385 922141 929687 936023 940818
52291 940818 943833 944928 943896 940721 935896 930177 924037 917591 910982 904583 898830 893928 889730 885960
52277 885960 882743 880787 880709 882164 884112 886056 888561 892401 897708 904248 911932 920561 929503 938254 947126
52262 947126 956902 967985 980244 993400 1007067 1020697 1034049 1047547 1061655 1076025 1089769 1102410
52250 1102410 1113983 1124362 1133146 1140189 1145612 1149243 1150690 1150013 1147692 1143814 1138008 1130460 1122268 1114383
52236 1114383 1106684 1098588 1090044 1081425 1072796 1063955 1055032 1046504 1038509 1030585 1022220 1013478 1005058 997794
52222 997794 992061 987504 983395 979390 975851 973351 972000 971454 971500 972444 974773 978493 982846 986752 989675
52207 989675 992077 994918 998651 1002844 1006799 1010394 1014198 1018861 1024485 1030548 1036394 1041781 1046937 1052159
52193 1052159 1057507 1062964 1068570 1074082 1078648 1081284 1081783 1080820 1079010 1076177 1071798 1065934 1059390 1052993
52179 1052993 1046942 1040939 1034840 1029012 1023906 1019345 1014544 1009083 1003560 998864 994938 990868 986305 982236
52165 982236 979972 979674 980256 980491 979966 979215 979279 980967 984130 987667 990526 992612 994496 996446 998163 999399
52149 999399 1000270 1000813 1000723 999874 998797 998240 998361 998679 998738 998495 998004 997143 995871 994558 993759 993763 994601 996468 999859
52130 999859 1005212 1012618 1021885 1032720 1044836 1058184 1073158 1090268 1109401 1129739 1150676 1172455
52118 1172455 1195508 1219429 1243211 1266406 1289406 1312503 1335278 1357215 1378404 1399198 1419419
52107 1419419 1438350 1455380 1470382 1483558 1495157 1505342 1514116 1521430 1527406 1532288 1536018 1538004
52095 1538004 1537449 1533822 1526991 1517158 1504904 1491054 1476283 1460964 1445500 1430549 1416612 1403624
52083 1403624 1391257 1379542 1368877 1359517 1351388 1344338 1338299 1333270 1329441 1327275 1327143 1328857 1331902
52070 1331902 1336108 1341802 1349275 1358474 1369274 1381633 1395252 1409403 1423450 1437349 1451418 1465744
52058 1465744 1480063 1494131 1507897 1521203 1533438 1543630 1551005 1555557 1558039 1559156 1558721 1555778 1549623
52045 1549623 1540557 1529471 1516909 1502805 1487061 1470155 1453043 1436549 1420849 1405525 1390128
52034 1390128 1374749 1359886 1345737 1331762 1317125 1301485 1285133 1268443 1251499 1234367 1217446
52023 1217446 1201263 1185921 1170898 1155480 1139448 1123401 1108455 1095459 1084396 1074509 1065018 1055614
52011 1055614 1046213 1036468 1025856 1014243 1002009 989399 976003 961232 945190 928680 912310 896093
51999 896093 880161 865376 852651 841768 831463 820752 809662 798514 787033 774651 761379
51988 761379 747815 734326 720685 706542 691892 676939 661795 646493 631129 615852 600842
51977 600842 586358 572691 560130 549114 540320 534226 530541 528426 527363 527439 528661 530502 532482 534717
51963 534717 537406 540106 542132 543467 544538 545119 544244 541488 537707 534084 530876 527561 523918 520428 517784
51948 517784 516453 516709 518646 522057 526524 531812 538081 545718 555100 566464 579820 594922 611362
51935 611362 628734 646694 665003 683616 702666 722160 741596 759770 774869 784799 787780 782990
51923 782990 770777 752293 729043 702711 674977 647124 619894 593879 569905 548716 530410
51912 530410 514517 500680 489058 480032 473706 469703 467298 465773 464786 464310 464097 463403 461539 458577
51898 458577 455152 451556 447369 442050 435558 428341 421032 414338 408838 404614 401194 398064 395177 392921
51884 392921 391740 391897 393475 396416 400600 405891 412079 418783 425602 432368 439093 445656 451601 456231
51870 456231 458787 458805 456613 453276 449644 445588 440721 435749 432263 430981 430983 431068 431176 431858 433035 434145
51854 434145 435141 436341 437417 437371 435660 432609 428612 423656 417949 412326 407541 403532 399789 396189 393049
51839 393049 390571 388548 386578 384412 382225 380643 380290 381137 382464 383508 384005 384076 383969 384029 384532 385260 385554
51822 385554 385027 383907 382485 380679 378560 376914 376650 377749 379312 380575 381407 381895 382045 381988 381990 382051 381831
51805 381831 381101 379995 378755 377599 376898 377032 377897 378926 379768 380532 381178 381158 380004 377889 375293 372522
51789 372522 369930 368119 367307 366784 365714 364346 363774 364497 365943 367484 369256 371648 374552 377551 380565
51774 380565 383961 388212 393601 399974 406556 412361 417051 421137 425109 428700 431261 432492 432322 430380
51760 430380 426232 420188 413353 406738 400545 394364 387824 381023 374544 369107 364976 361764 359017 356879
51746 356879 355868 356044 356766 357336 357563 357647 357882 358661 360391 363120 366351 369469 372261 374895 377481 379818
51730 379818 381549 382535 383104 383877 385187 386729 387962 388750 389261 389347 388559 386966 385466 384862 384964 385010 384733
51713 384733 384531 384707 385020 385105 384961 384964 385640 387424 390375 393994 397517 400437 402594 403862 404075 403404 402511
51696 402511 402123 402518 403459 404458 405022 404846 403962 402528 400509 397692 394122 390199 386217 382070 377716 373702
51680 373702 370856 369517 369340 369756 370314 370649 370599 370471 370843 371882 373181 374464 376139 378798 382417 386422
51664 386422 390410 394278 397666 399856 400538 400321 400050 399842 399206 398109 397508 398634 401938 406888 412547 418104
51648 418104 422903 426294 427645 426533 422920 417281 410522 403560 396822 390271 384004 378625 374744 372238
51634 372238 370423 368977 368262 368522 369251 369783 370163 370831 371570 371454 370015 367947 366321 365420 364648 363285 361041
51617 361041 358080 354872 351926 349421 347115 344823 342855 341758 341694 342262 342858 343029 342623 341916 341624 342496
51601 342496 344832 348445 353111 358868 365884 374116 383069 391824 399380 405126 408930 410707 410153 407208
51587 407208 402653 397905 394089 391566 390358 390725 393019 397117 402318 408053 414662 423219 434383 447552
51573 447552 461385 475037 488507 501800 514307 525288 534515 542144 548401 553889 559894 567865 578745
51560 578745 593176 611863 634934 661006 687673 713046 736284 756741 773423 785592 793247 796549
51548 796549 795177 788601 776716 760026 739526 716600 692583 668115 643171 617906 593202 570286
51536 570286 550159 533455 520325 510197 502089 495443 490193 485850 481166 475281 468706 462531 456981
51523 456981 451377 445324 439264 433794 428964 424328 419355 413793 407967 402775 399036 396623 394362 390906
51509 390906 385842 380057 375017 371518 369071 366628 363772 360891 358405 356455 355295 355226 355855 356196 355903
51494 355903 355734 356222 356713 356438 355889 356160 357329 358501 359186 359589 359673 358991 357578 356106 354986 354068 353324
51477 353324 352887 352322 350772 348255 345952 344769 344375 344134 344157 344629 344740 343253 339981 335999 332429 329566
51461 329566 327177 325154 323733 323274 323834 324888 325698 326145 326975 328999 332299 336505 341532 347633 354869
51446 354869 362999 371884 381655 392367 403685 414904 425164 433698 440122 444494 447094 448272 448542
51433 448542 448537 448489 447824 445496 440802 433807 425143 415642 406114 397211 389318 382523 376693 371664 367513 364567
51417 364567 362952 362117 361119 359519 357779 356627 356238 356180 355937 355264 354278 353455 353386 354319 355997 358057 360384
51400 360384 362893 365239 367018 368163 368895 369481 370320 372057 375226 379791 385315 391510 398413 406206 415244
51385 415244 426155 439484 455203 472997 493068 516159 542640 572017 603593 637176 672647
51374 672647 709111 744956 778710 809372 835916 856967 871277 878288 878031 870661 856433 836046
51362 836046 810676 781570 749745 716123 681700 647426 614036 582173 552524 525603 501429
51351 501429 479650 460025 442602 427432 414338 403074 393484 385306 378033 371223 364922 359563 355455
51338 355455 352567 350753 349936 349918 350234 350397 350318 350353 350901 352057 353653 355474 357309 358785 359367 358652 356722
51321 356722 354137 351569 349391 347591 345994 344522 343264 342368 341919 341861 341976 341970 341699 341356 341287 341551 341776 341544
51303 341544 340805 339774 338595 337366 336353 335840 335723 335595 335248 334811 334348 333716 332913 332218 331820 331675 331893
51286 331893 332837 334603 336849 339521 343206 348263 353890 358686 361922 363758 364530 364505 364195 364135 364333 364510
51270 364510 364865 365911 367539 369021 370100 371326 373012 374576 375338 375350 374901 373764 371539 368450 365236
51255 365236 362420 360078 358090 356138 353698 350560 347316 344900 343617 342957 342378 341927 341998 342657 343393 343564
51239 343564 343079 342534 342531 342961 343251 343275 343593 344692 346395 348246 350092 351960 353627 354711 355126 355218 355538 356492
51221 356492 357969 359235 359495 358803 358088 358113 358723 359303 359594 359726 359778 359715 359627 359780 360526 362258 365109 368556
51203 368556 371714 374231 376518 378853 380856 382164 383150 384365 385730 386834 387687 388571 389378 389690 389305 388256
51187 388256 386622 384839 383739 383595 383462 382289 380462 379324 379349 379783 380038 380363 380861 380915 380148 379217 379022
51170 379022 379628 380465 381156 381654 381889 381794 381514 381232 380915 380409 379660 378700 377651 376795 376291 375747 374460 372283
51152 372283 369861 367790 365931 363875 361712 359933 358767 358006 357366 356736 356139 355637 355309 355190 355294 355686
51136 355686 356376 357105 357472 357369 357170 357422 358455 360262 362550 364962 367484 370478 373987 377137 378842 379163
51120 379163 379395 380570 382405 384043 385358 387050 389661 392945 396127 398525 399957 400773 401429 402025 402407
51105 402407 402689 403316 404527 406076 407687 409415 411309 413044 414213 414758 414869 414640 414121 413526 413151 413136 413481
51088 413481 414158 415087 416159 417420 419056 421046 422967 424210 424357 423416 421974 421043 421326 422569 424043 425672
51072 425672 428140 431693 435446 438307 440187 441892 444214 447539 451987 457430 463546 470250 477912 486860
51058 486860 496868 507386 517989 528335 538062 547186 556316 566012 576100 585896 594822 602444 608294
51045 608294 612150 614171 614302 611952 606919 600284 593637 587591 581810 576270 571472 567308 562686 556730
51031 556730 549744 542580 535585 528633 521746 515276 509649 505275 502477 501256 501256 502101 503634 505789 508580
51016 508580 512288 517312 523677 530989 539034 548046 558139 568836 579548 590335 601764 614084 626810
51003 626810 639140 650485 660539 669084 675985 681333 685431 688517 690600 691674 691966 691742 690998 689675
50989 689675 688268 687743 688720 691167 695157 701372 710342 721616 734222 747592 761405 774946 787606
50976 787606 799948 813344 828453 844988 863276 885112 912424 945607 983612 1025197 1069718
50965 1069718 1117216 1168215 1223147 1281574 1342323 1404577 1468285 1533089 1597442 1659381 1717726
50954 1717726 1771900 1821070 1864345 1901693 1933905 1961607 1984880 2003798 2018782 2030366 2039120
50943 2039120 2045855 2051373 2055827 2058657 2059173 2056955 2051818 2043831 2033332 2020504 2005004 1986541 1965720
50930 1965720 1943575 1920015 1893370 1861899 1825258 1784156 1739079 1690064 1637531 1582659 1526800
50919 1526800 1470857 1415437 1361288 1309342 1260307 1214408 1171556 1131704 1094928 1061241 1030593
50908 1030593 1003101 978899 957443 937344 917496 898315 881252 866987 854737 843546 833576
50897 833576 825512 819194 813597 808092 803008 798878 795707 793202 791306 790099 789431 789047 789008 789761 791734
50882 791734 795001 799361 804599 810601 817276 824504 832164 840212 848713 857926 868364 880590 894750
50869 894750 910367 926840 944220 963270 984693 1008508 1034343 1062135 1092369 1125761 1162957
50858 1162957 1204400 1250256 1300513 1355472 1416177 1484146 1560541 1645656 1739174 1840690 1949935
50847 1949935 2066666 2190475 2320710 2456545 2597040 2740918 2886057 3029351 3167385
50838 3167385 3297293 3416812 3523700 3615581 3690543 3747669 3786933 3809041 3815617 3809228 3792844
50827 3792844 3769348 3741655 3712899 3685970 3662928 3645117 3633555 3628553 3628777 3631126 3631881 3627921 3616935
50814 3616935 3596934 3565945 3522179 3464390 3392162 3305971 3206923 3096452 2976386 2849250 2718190
50803 2718190 2586335 2456243 2329981 2209522 2096854 1993586 1900446 1817177 1743062 1677689
50793 1677689 1621158 1573451 1533865 1501409 1475580 1456223 1442565 1432974 1425903 1420649 1416863 1413842
50781 1413842 1410818 1407588 1404204 1400215 1394825 1387786 1379555 1370471 1360311 1348794 1335946 1321642 1305282
50768 1305282 1286420 1265541 1243721 1221609 1199062 1175810 1152159 1128973 1107136 1087117 1068941
50757 1068941 1052523 1038017 1025815 1016167 1008951 1003952 1001305 1001494 1004889 1011422 1020809 1032980 1048205
50744 1048205 1066798 1088829 1114165 1142832 1175266 1212103 1253669 1299656 1349347 1402199 1458196
50733 1458196 1517629 1580538 1646485 1714927 1785680 1858748 1933694 2009454 2084885 2159204 2231597
50722 2231597 2300522 2363704 2418836 2464145 2498500 2521343 2532604 2532471 2521317 2500178 2471258 2437605
50710 2437605 2402178 2367422 2335526 2308414 2287199 2272078 2262947 2259626 2261155 2265451 2270183 2273599
50698 2273599 2274005 2268932 2255703 2232835 2200230 2158146 2106828 2047322 1981862 1913074 1843170 1774071
50686 1774071 1707593 1645055 1587202 1534913 1489492 1451754 1421375 1397765 1381196 1372256 1370570 1375044
50674 1375044 1385473 1402842 1427582 1458172 1491994 1527111 1562742 1598380 1633170 1666123 1696499
50663 1696499 1723881 1748157 1769430 1787849 1803583 1817074 1829108 1840341 1850870 1860479 1869193 1877307
50651 1877307 1885065 1892737 1900999 1910801 1922743 1936986 1953901 1974361 1999096 2028036 2060561 2096205
50639 2096205 2134718 2175583 2217865 2260608 2303121 2344825 2385111 2423515 2459968 2494779 2528397
50628 2528397 2561128 2592777 2622298 2647597 2665643 2672960 2666537 2645005 2609425 2563112 2510619 2456611
50616 2456611 2405114 2359063 2320072 2288618 2264564 2247600 2237264 2232729 2232767 2235907 2240653 2245498 2248687
50603 2248687 2247942 2240718 2225087 2200460 2167200 2125638 2075935 2019037 1957129 1892596 1826814 1760447
50591 1760447 1694575 1630737 1569782 1511483 1455544 1402447 1352932 1307179 1264968 1226252 1191087
50580 1191087 1159316 1130912 1106414 1086459 1071007 1059545 1051819 1047680 1046342 1046741 1048824 1053658 1061880
50567 1061880 1072699 1084913 1098180 1112741 1128529 1145499 1164462 1186669 1212551 1241453 1272537
50556 1272537 1305275 1339206 1374053 1410170 1448036 1487082 1525713 1562847 1598800 1634249 1668953
50545 1668953 1702087 1733438 1763732 1794081 1825622 1859434 1896286 1936493 1980290 2028198 2080793
50534 2080793 2138395 2201261 2269799 2344319 2424926 2512022 2606447 2708576 2817600 2932264 3051876
50523 3051876 3175781 3302108 3427979 3550858 3668783 3779213 3878782 3964661 4035310 4089413
50513 4089413 4124912 4139885 4133849 4107537 4061820 3997716 3917214 3823298 3719127 3607763 3492715
50502 3492715 3378179 3268463 3167291 3077482 3000913 2938858 2892626 2863713 2852857 2859066 2880034
50491 2880034 2913329 2956435 3005523 3054982 3098699 3131524 3149410 3148930 3127574 3084500 3020571 2937738
50479 2937738 2838884 2728111 2610340 2489982 2369960 2252070 2137936 2029298 1927480 1832964
50469 1832964 1745622 1665191 1591452 1524127 1462799 1406941 1355994 1309542 1267564 1230459 1198649
50458 1198649 1172124 1150451 1133115 1119704 1109813 1103118 1099555 1099070 1101003 1104174 1108004 1113314 1121444
50445 1121444 1132609 1145599 1159194 1173317 1188482 1204517 1220309 1234670 1247057 1257507 1266332
50434 1266332 1274001 1281007 1287551 1293423 1298335 1302348 1305915 1309609 1314001 1319740 1327477 1337521 1349651
50421 1349651 1363536 1379367 1397947 1420082 1446103 1476150 1510706 1550458 1595644 1645870 1700692
50410 1700692 1760058 1823918 1891578 1961666 2032617 2102953 2171259 2236229 2296873 2352418 2401932
50399 2401932 2444139 2477628 2501084 2513305 2513276 2500437 2474855 2437078 2387959 2328779 2261446 2188405
50387 2188405 2112320 2035852 1961564 1891755 1828220 1772199 1724566 1686064 1657325 1638694 1630031
50376 1630031 1630542 1638731 1652580 1669996 1689223 1708708 1726486 1739897 1746291 1744122 1733119 1713376
50364 1713376 1684777 1647668 1603736 1555557 1505255 1454014 1402842 1353089 1305928 1261895 1221381
50353 1221381 1185171 1153898 1127219 1104098 1083817 1066100 1050199 1034446 1017052 997159 975048
50342 975048 951710 928393 906272 886132 868302 852873 839847 829128 820576 814141 809770 807151
50330 807151 805757 805194 805323 806140 807812 810743 815149 820587 826386 832593 839829 847985 855745 861992 867117
50315 867117 872246 877550 882179 885681 888653 891823 895258 898778 902560 906837 911326 915374 918595 921113
50301 921113 923287 925385 927494 929594 931727 934090 936921 940361 944417 948877 953124 956290 958016 958947
50287 958947 960144 962040 964343 966760 969294 971725 973533 974673 975986 978417 982060 986327 990838 995779
50273 995779 1001504 1008068 1015115 1022009 1028194 1033647 1038944 1044780 1051482 1059087 1067674 1077493 1088936 1102536
50259 1102536 1118822 1137982 1159763 1183686 1209068 1234730 1259249 1282019 1303846 1325981 1348584
50248 1348584 1370561 1390897 1409690 1427730 1445352 1461961 1476370 1487312 1493581 1494043 1487886 1475109
50236 1475109 1456700 1434175 1408954 1382336 1355915 1331418 1309771 1290494 1272255 1253809 1234224
50225 1234224 1212555 1187917 1159978 1129214 1096651 1063425 1030390 997963 966459 936646 909621
50214 909621 885950 865322 847311 831941 819013 807418 795991 784816 774819 766193 758250 750837
50202 750837 744744 740204 736029 731019 725531 720764 717004 713495 709818 706424 703725 701407 698829 695559
50188 695559 691400 686420 681130 676192 671751 667430 663143 659443 656802 654955 653374 652104 651672 652264 653420
50173 653420 654545 655411 656131 656974 658306 660431 663251 666209 668744 670723 672389 674114 676449 680225 686148
50158 686148 694136 703371 713174 723672 735472 748944 764056 780606 798216 816289 834497 853371
50146 853371 873946 896774 921706 948855 979246 1014135 1053994 1098480 1147036 1199005 1253329
50135 1253329 1308671 1363851 1417920 1470038 1519876 1568091 1615760 1663017 1708469 1749940 1785294
50124 1785294 1812492 1829562 1835056 1828391 1809527 1778738 1737101 1686922 1631121 1572186 1511854 1451466
50112 1451466 1392204 1335125 1281355 1232052 1187685 1147461 1109988 1074556 1041394 1010800 982580
50101 982580 956407 932117 909540 888616 869874 854155 841512 830919 821422 813087 806377 801249
50089 801249 797538 795707 796227 798336 800364 801452 802309 804187 807680 812642 818588 824861 830925 836793 842813
50074 842813 848912 854582 859780 865109 870730 875702 879005 880768 881871 882645 882627 881372 878872 875265 870844
50059 870844 866352 862616 859646 856513 852390 847441 842562 838491 835271 832417 829597 827365 827081 829772
50045 829772 835083 841737 849028 857409 867515 879158 891602 904418 917650 931388 945622 960383
50033 960383 975658 991127 1006294 1020977 1035487 1050225 1065251 1080378 1095663 1111679 1129134
50022 1129134 1148282 1168831 1190485 1213237 1236881 1260510 1282999 1303985 1323951 1343264 1361626
50011 1361626 1378682 1394694 1410177 1425039 1438452 1449469 1457315 1461046 1459270 1450513 1433939 1409767
49999 1409767 1379027 1342966 1302762 1259788 1215858 1172779 1131610 1092619 1055934 1021777 989960
49988 989960 959726 930556 902779 876932 852852 829995 808453 788952 771800 756481 742447
49977 742447 729701 718279 707675 697342 687456 678678 671278 664971 659582 655350 652348 650005 647587
49964 647587 644996 642774 641255 640097 638842 637768 637844 639832 643664 648797 654853 661656 668831 675792 682152
49949 682152 687885 693041 697557 701397 704552 706767 707567 706779 704745 701731 697394 691266 683617 675295 666662
49934 666662 657204 646404 634578 622598 611112 600433 590943 583093 576981 572231 568379 565183 562680
49921 562680 561203 561262 562977 565642 568243 570472 572801 575427 577793 579526 581356 584421 588890 593944 599084
49906 599084 604806 611806 620081 629114 638513 648074 657414 665964 673301 679259 683740 686566 687588 686828
49892 686828 684542 681052 676412 670290 662436 653313 643964 635123 626645 617985 608968 599894 591100 582740
49878 582740 574914 567771 561430 555900 550947 546010 540567 534881 530162 527635 527451 528772 530750 533130
49864 533130 536088 540019 545512 553004 562216 572192 582066 591568 600798 609917 619174 628707 637977 645784
49850 645784 651387 655384 658953 662243 664063 663256 659943 655160 649668 643482 636322 628099 618961 609324
49836 609324 600057 592333 586864 583224 580212 577068 574223 572685 572779 573737 574598 575297 576722 579793 584634
49821 584634 590621 597117 603998 611490 619609 627968 636186 644290 652474 660522 667723 673380 677246 679482
49807 679482 680477 680724 680482 679344 676420 671321 664773 658002 651669 645664 639715 633755 627787 621848 616212
49792 616212 611296 607272 604013 601372 599204 597177 595048 593180 592216 592095 591923 591161 590372 590372 591085 591827 592424
49775 592424 593424 595356 598342 602363 607336 612860 618286 623030 626554 628326 628459 628164 628710 629807 629752
49760 629752 627445 623503 619122 614590 609469 603545 596880 589368 581055 572623 564857 557780 550988 544691
49746 544691 539699 536312 533913 531865 530206 529199 528698 528313 527941 527757 527846 528057 528192 528218 528410 529290 531315
49729 531315 534570 538822 543806 549322 555172 561249 567597 574223 581026 588129 595935 604334 612068 617640
49715 617640 620877 622923 624539 625180 624096 621582 618477 614928 610411 604753 598455 592048 585740 579810
49701 579810 574793 571042 568393 566460 565124 564570 564938 566011 567341 568752 570673 573700 577779 582230 586739
49686 586739 591891 598218 605107 611377 616901 622930 630581 639619 649081 658655 668864 680030 691517
49673 691517 702028 710403 716169 719602 721365 722008 721777 720837 719462 717758 715424 712185 708459 705184 702747
49658 702747 700329 696638 691145 684361 676985 669154 660601 651261 641537 632155 623881 617186 611988 607821
49644 607821 604427 602085 601204 601745 603210 605076 606974 608589 609659 610116 609968 609078 607293 604773 601910
49629 601910 598895 595608 591961 588074 584118 580255 576762 573911 571673 569862 568580 568119 568339 568643 568799
49614 568799 569321 570637 572301 573517 574174 574854 575943 577270 578558 579744 580748 581323 581417 581438 581971 583228
49598 583228 584780 585832 585863 585125 584417 584278 584604 585201 586424 588816 592170 595394 597448 598197 598281 598316 598382 598199
49580 598199 597715 597421 597945 599329 600927 602184 603247 604591 606346 608409 611004 614641 619454 625020 630909
49565 630909 637124 643879 651188 658820 666459 673844 680804 687077 692047 694983 695841 695548 694934 693555 690295
49550 690295 685133 679628 675390 672736 671182 670484 670564 670900 670859 670484 670337 670621 671090 671797 673229 675522 678167
49533 678167 680803 683839 687907 693168 699693 708172 719509 733647 749450 765980 783329 801782 820478
49520 820478 837442 850908 860197 865429 866986 865511 862106 858050 854324 851441 849509 848219 846904 844876
49506 844876 841753 837413 831744 824642 816204 806783 796864 786959 777506 768742 760704 753386 746775 740768
49492 740768 735307 730654 727180 724659 722217 719396 716945 716015 716670 717828 718667 719488 720966 723075 725132
49477 725132 726607 727538 728292 729204 730397 731786 733264 734892 736753 738644 740191 741374 742661 744407 746312
49462 746312 747697 748163 747751 746578 744660 742191 739765 738006 736924 735728 733493 730096 726357 723165 720608
49447 720608 718137 715401 712627 710193 708211 706632 705524 705033 705276 706401 708639 712123 716704 722099 728178
49432 728178 734982 742424 750059 757296 763969 770618 778007 786287 794880 803241 811343 819059 825358 828699
49418 828699 828331 824871 819654 813885 808416 803806 800243 797633 795999 795734 797322 800953 806440 813422 821570
49403 821570 830744 840951 852130 864121 876965 890900 905720 920436 934130 947002 959902 972804
49391 972804 984487 993964 1001508 1007850 1012997 1016396 1017877 1017756 1016159 1012819 1007641 1001093 993971 986912
49377 986912 980143 973552 967088 961075 956029 952181 949469 948021 948225 950198 953510 957562 961844 965760
49363 965760 968804 971179 973590 975913 976724 974862 971040 967030 963564 959971 955784 951648 948283 945475
49349 945475 942686 940105 938420 937785 937647 937557 937709 938508 939874 941164 941673 941110 939639 937635 935511 933714
49333 933714 932682 932598 933190 933788 933672 932589 931210 930994 933247 938149 944936 953088 962956 974984 988634
49318 988634 1002421 1014817 1024805 1031833 1035795 1037076 1036208 1033370 1028455 1021682 1013818 1005630 997288 988436
49304 988436 978769 968414 957815 947390 937501 928715 921824 917239 914408 912151 909611 906598 903133
49291 903133 899197 895078 891373 888237 885013 880989 876221 871284 866526 861974 857655 853610 849927 847171
49277 847171 846381 848001 851142 854539 858022 862355 867809 873715 879331 884292 888120 890233 890868 891264 892432
49262 892432 894180 895762 897066 898756 901544 905724 911193 917592 924556 932018 940000 947935 954480 958311
49248 958311 958918 956472 951267 943712 934676 925318 916461 908282 900634 893453 886783 880599 874847 869817
49234 869817 866308 865147 866395 869195 872588 876278 880487 885477 891556 899183 908378 918147 927180 935225
49220 935225 943221 951961 961225 970349 979044 987277 994890 1001712 1007666 1012517 1016030 1018755 1022184 1027631
49206 1027631 1035304 1044927 1056758 1071135 1087228 1103229 1118115 1132688 1148476 1165917 1183948 1201158
49194 1201158 1216937 1231538 1245391 1258604 1271042 1282534 1292901 1302019 1310115 1317913 1326221 1335441
49182 1335441 1345694 1357201 1370049 1383722 1397589 1412126 1429092 1450074 1475271 1503949 1535445
49171 1535445 1569006 1602918 1634647 1661996 1683838 1699975 1710996 1718320 1723734 1728393 1732448 1735710
49159 1735710 1738333 1740650 1742669 1744115 1744930 1745545 1746645 1748764 1752136 1756838 1763014 1770824 1780167 1790635
49145 1790635 1801912 1814124 1827580 1842197 1857416 1872738 1888108 1903711 1919569 1935558 1951730
49134 1951730 1968384 1985707 2003413 2020845 2037481 2053308 2068736 2084215 2099932 2115750 2131309
49123 2131309 2146305 2160836 2175451 2190646 2206325 2221963 2237398 2253317 2270855 2290801 2313282
49112 2313282 2338210 2366102 2398410 2436803 2481772 2531885 2584496 2637146 2688340 2737557 2784963
49101 2784963 2830574 2872663 2906932 2928334 2934467 2926927 2909159 2883615 2851287 2813023 2770212 2724401
49089 2724401 2677100 2630056 2585067 2543438 2505939 2473170 2445475 2422561 2403687 2388275 2375985
49078 2375985 2366316 2358643 2352575 2347708 2343068 2337440 2330471 2322980 2315969 2309799 2304401 2299745 2295736 2292059
49064 2292059 2288472 2284959 2281360 2277247 2272492 2267584 2262989 2258539 2253908 2249448 2245973 2243786 2242467 2241652
49050 2241652 2241512 2242376 2244382 2247779 2253185 2260972 2270374 2279517 2286459 2290223 2290947 2289376 2286283 2282224 2277595
49035 2277595 2272925 2269104 2267133 2267411 2269340 2271913 2274698 2277946 2281707 2285282 2287891 2289573 2290947 2292231
49021 2292231 2293092 2293569 2294514 2296744 2300127 2303993 2308256 2313616 2320615 2328931 2337824 2346939 2356408 2366386 2376847
49006 2376847 2387848 2399662 2412498 2426168 2440134 2453709 2466172 2476934 2485881 2493535 2500626 2507401
48994 2507401 2513477 2518315 2521651 2523444 2523713 2522571 2520286 2517175 2513584 2509944 2506527 2503014 2498651 2493171
48980 2493171 2487286 2481872 2476860 2471330 2464617 2456917 2448785 2440520 2432117 2423464 2414413 2404954 2395500 2386711
48966 2386711 2378889 2371831 2365438 2360177 2356664 2355000 2354868 2356157 2359165 2364130 2370773 2378401 2386488 2395198
48952 2395198 2405282 2417266 2430682 2444396 2457821 2471478 2486143 2501789 2517851 2534373 2552283
48941 2552283 2572465 2595062 2619894 2647064 2676734 2708595 2742075 2777106 2814345 2854514 2897707
48930 2897707 2943446 2991246 3041011 3093002 3147480 3204369 3263178 3323278 3384300 3446225 3509102
48919 3509102 3572743 3636763 3700815 3764606 3827636 3889081 3948184 4004833 4059630 4113294 4166022
48908 4166022 4217503 4267438 4315847 4362806 4408159 4451724 4493733 4534835 4575549 4615730 4654530
48897 4654530 4690819 4723700 4752746 4777883 4799102 4816429 4830201 4841183 4850063 4856913 4861343 4863222
48885 4863222 4862885 4860523 4855677 4847615 4836094 4821535 4804532 4785269 4763209 4737241 4706337 4670340
48873 4670340 4629998 4586065 4538626 4487604 4433592 4377738 4320950 4263711 4206514 4149783 4093229
48862 4093229 4036018 3977972 3920248 3864420 3811212 3760440 3711780 3665134 3620466 3577882 3537894
48851 3537894 3501196 3468072 3438295 3411611 3388031 3367636 3350393 3336301 3325466 3317911 3313408 3311597
48839 3311597 3312146 3314764 3319279 3325834 3334849 3346568 3360625 3376220 3392777 3410342 3429270 3449547
48827 3449547 3470521 3491299 3511362 3530825 3550216 3570060 3590532 3611317 3631829 3651704 3671096
48816 3671096 3690517 3710453 3731173 3752620 3774287 3795427 3815792 3836054 3857103 3878926 3900718
48805 3900718 3922138 3943940 3967114 3991866 4017796 4044615 4072140 4099814 4126789 4152502 4176893
48794 4176893 4200102 4222302 4243697 4264295 4283713 4301551 4317978 4333553 4348409 4361968 4373646
48783 4373646 4383481 4391720 4397958 4401052 4400019 4394806 4385984 4373815 4357974 4338336 4315649 4290966 4264446
48770 4264446 4235203 4202418 4166118 4126708 4084299 4038987 3991440 3942674 3893354 3843693 3793875
48759 3793875 3744099 3694366 3644757 3595959 3548998 3504334 3461620 3420414 3380666 3342333 3305006
48748 3305006 3268310 3232468 3198148 3165896 3135995 3108681 3084160 3062365 3043019 3025973 3011341
48737 3011341 2999180 2989209 2980980 2974203 2968747 2964395 2960840 2958004 2956087 2955134 2954801 2954826 2955551 2957583 2960984
48722 2960984 2965151 2969509 2973837 2977938 2981524 2984638 2987687 2990719 2993119 2994418 2995049 2995818 2996933 2998022
48708 2998022 2998945 3000071 3001864 3004525 3007948 3011633 3014764 3016743 3017655 3018009 3018165 3018243 3018355 3018594 3018981 3019607
$$ [...]
##END NTUPLES=NMR SPECTRUM
##END=
