
##TITLE=AC1303_PERAH12115_6528332_5mPQnOYvMW
##JCAMPDX= 6.0         $$ Bruker NMR JCAMP-DX V2.0
##DATA TYPE= NMR SPECTRUM
##DATA CLASS= NTUPLES
##ORIGIN= BRUKER
##OWNER= Administrator
$$ 1.72 TOPSPIN		Version 2.1
$$ 2012-07-15 13:13:00.718 -0500  Administrator@TOPSPIN
$$ Compression mode = diff/dup
##.OBSERVE FREQUENCY= 400.02188249412
##.OBSERVE NUCLEUS= ^1H
##.ACQUISITION MODE= SIMULTANEOUS (DQD)
##.ACQUISITION SCHEME= undefined
##.AVERAGES= 64
##.DIGITISER RES= 22
##SPECTROMETER/DATA SYSTEM= spect
##.PULSE SEQUENCE= noesygpps1d.comp
##.SOLVENT NAME= COFFEE_meoh
##.SHIFT REFERENCE= INTERNAL, COFFEE_meoh, 1, 14.961
##AUDIT TRAIL= $$ (NUMBER, WHEN, WHO, WHERE, PROCESS, VERSION, WHAT)
$$ ##TITLE= Audit trail, TOPSPIN		Version 2.1
$$ ##JCAMPDX= 5.01
$$ ##ORIGIN= Bruker BioSpin GmbH
$$ ##OWNER= Administrator
$$ $$ C:\Bruker\TOPSPIN/data/COFFEE/nmr/AC1303_PERAH12115_6528332_5mPQnOYvMW/12/pdata/1/auditp.txt
$$ ##AUDIT TRAIL=  $$ (NUMBER, WHEN, WHO, WHERE, PROCESS, VERSION, WHAT)
(   1,<2012-07-15 13:12:55.578 -0500>,<Administrator>,<TOPSPIN>,<go>,<TOPSPIN 2.1>,
      <created by zg
	started at 2012-07-15 13:01:25.312 -0500,
	POWCHK enabled, PULCHK disabled,
       configuration hash MD5:
       6B 1B 68 BB D9 2E 58 E2 7F 35 AD 54 07 DF 0E 41
       data hash MD5: 64K
       E0 4C E7 67 0A 31 3E 7D 4F EE 50 8E 35 0D 7B B0>)
(   2,<2012-07-15 13:12:58.656 -0500>,<Administrator>,<TOPSPIN>,<proc1d>,<TOPSPIN 2.1>,
      <Start of raw data processing
       efp LB = 0.3 FT_mod = 6 PKNL = 1 PHC0 = 0 PHC1 = 0 SI = 128K 
       data hash MD5: 128K
       2C 84 B0 AC 92 99 44 88 B4 2E 6C B7 60 61 26 06>)
(   3,<2012-07-15 13:12:59.765 -0500>,<Administrator>,<TOPSPIN>,<proc1d>,<TOPSPIN 2.1>,
      <pk PHC0 = 1.115112 PHC1 = 0 
       data hash MD5: 128K
       39 84 DA 06 16 10 5D 54 F2 92 79 0B 3F A7 29 CA>)
(   4,<2012-07-15 13:13:00.343 -0500>,<Administrator>,<TOPSPIN>,<proc1d>,<TOPSPIN 2.1>,
      <abs ABSG = 1 
       data hash MD5: 128K
       39 09 28 6C ED 31 B7 B6 6D C1 0B 05 AD 10 7B C7>)
(   5,<2012-07-15 13:13:00.437 -0500>,<Administrator>,<TOPSPIN>,<proc1d>,<TOPSPIN 2.1>,
      <abs ABSG = 2 
       data hash MD5: 128K
       F9 D7 C0 77 C3 ED 8D F5 66 92 78 03 8E C7 3A 34>)
(   6,<2012-07-15 13:13:00.484 -0500>,<Administrator>,<TOPSPIN>,<proc1d>,<TOPSPIN 2.1>,
      <abs ABSG = 3 
       data hash MD5: 128K
       E0 4A 90 BA 5F 59 F1 9B C7 90 80 7C D5 CF 91 4C>)
(   7,<2012-07-15 13:13:00.546 -0500>,<Administrator>,<TOPSPIN>,<proc1d>,<TOPSPIN 2.1>,
      <abs ABSG = 4 
       data hash MD5: 128K
       DB 97 6A 81 B5 20 92 C9 29 BE 68 C7 6F 39 D5 05>)
(   8,<2012-07-15 13:13:00.593 -0500>,<Administrator>,<TOPSPIN>,<proc1d>,<TOPSPIN 2.1>,
      <abs ABSG = 5 
       data hash MD5: 128K
       60 0A FD 6F A8 43 B3 E2 1E 7E 77 8B 5E B3 EE B3>)
$$ ##END=
$$ 
$$ $$ hash MD5
$$ $$ 0C 28 85 54 D2 D1 01 E9 B1 E6 C8 0B 12 72 16 0A
##$RELAX= 
##$RELAX= 
##$RELAX= 
##$RELAX= 
##$RELAX= 
##$RELAX= 
##$RELAX= 
##$RELAX= 
$$ Bruker specific parameters
$$ [...]
150 150 150 150 150 150 150 150
##$TP07= 0
##$TPNAME0= <>
##$TPNAME1= <>
##$TPNAME2= <>
##$TPNAME3= <>
##$TPNAME4= <>
##$TPNAME5= <>
##$TPNAME6= <>
##$TPNAME7= <>
##$TPOAL= (0..7)
0.5 0.5 0.5 0.5 0.5 0.5 0.5 0.5
##$TPOFFS= (0..7)
0 0 0 0 0 0 0 0
##$TUNHIN= 0
##$TUNHOUT= 0
##$TUNXOUT= 0
##$USERA1= <user>
##$USERA2= <user>
##$USERA3= <user>
##$USERA4= <user>
##$USERA5= <user>
##$V9= 5
##$VALIST= <valist>
##$VCLIST= <CCCCCCCCCCCCCCC>
##$VD= 0
##$VDLIST= <DDDDDDDDDDDDDDD>
##$VPLIST= <PPPPPPPPPPPPPPP>
##$VTLIST= <TTTTTTTTTTTTTTT>
##$WBST= 2048
##$WBSW= 25
##$XGAIN= (0..3)
0 0 0 0
##$XL= 0
##$YL= 0
##$YMAX_a= 12007399
##$YMIN_a= -9400882
##$ZGOPTNS= <>
##$ZL1= 120
##$ZL2= 120
##$ZL3= 120
##$ZL4= 120
##$ABSF1= 14.961
##$ABSF2= -5.597181
##$ABSG= 5
##$ABSL= 3
##$ALPHA= 0
##$AQORDER= 0
##$ASSFAC= 0
##$ASSFACI= 0
##$ASSFACX= 0
##$ASSWID= 0
##$AUNMP= <proc_prof1d_extract.lims>
##$AXLEFT= 0
##$AXNAME= <>
##$AXNUC= <1H>
##$AXRIGHT= 0
##$AXTYPE= 0
##$AXUNIT= <>
##$AZFE= 0.1
##$AZFW= 0.1
##$BCFW= 0
##$BC_mod= 0
##$BYTORDP= 0
##$COROFFS= 0
##$CY= 15
##$DATMOD= 1
##$DC= 0
##$DFILT= <>
##$DTYPP= 0
##$F1P= 0
##$F2P= 0
##$FCOR= 0.5
##$FTSIZE= 131072
##$FT_mod= 6
##$GAMMA= 0
##$GB= 0
##$INTBC= 1
##$INTSCL= 1
##$ISEN= 128
##$LB= 0.3
##$LEV0= 0
##$LPBIN= 0
##$MAXI= 10000
##$MC2= 0
##$MEAN= 0
##$ME_mod= 0
##$MI= 0
##$NCOEF= 0
##$NC_proc= -2
##$NLEV= 6
##$NOISF1= 0
##$NOISF2= 0
##$NSP= 0
##$NTH_PI= 0
##$NZP= 0
##$OFFSET= 14.961
##$PC= 1
##$PHC0= 1.115112
##$PHC1= 0
##$PH_mod= 1
##$PKNL= yes
##$PPARMOD= 0
##$PPDIAG= 0
##$PPIPTYP= 0
##$PPMPNUM= 2147483647
##$PPRESOL= 1
##$PSCAL= 4
##$PSIGN= 0
##$PYNMP= <proc.py>
##$REVERSE= no
##$SF= 400.020009636244
##$SI= 131072
##$SIGF1= 0
##$SIGF2= 0
##$SINO= 400
##$SIOLD= 131072
##$SPECTYP= <>
##$SREGLST= <1H.CDCl3>
##$SSB= 0
##$STSI= 131072
##$STSR= 0
##$SW_p= 8223.68421052631
##$SYMM= 0
##$S_DEV= 0
##$TDeff= 65536
##$TDoff= 0
##$TI= <>
##$TILT= no
##$TM1= 0
##$TM2= 0
##$TOPLEV= 0
##$USERP1= <user>
##$USERP2= <user>
##$USERP3= <user>
##$USERP4= <user>
##$USERP5= <user>
##$WDW= 1
##$XDIM= 131072
##$YMAX_p= 371265489
##$YMIN_p= -11867
##$CURPLOT= <Network HP LaserJet P1505>
##$CURPRIN= <$Network HP LaserJet P1505>
##$DFORMAT= <normdp>
##$LAYOUT= <+/1D_H.xwp>
##$LFORMAT= <normlp>
##$PFORMAT= <normpl>
##$SURQMSG= 1
$$ End of Bruker specific parameters
$$ ---------------------------------
##NTUPLES= NMR SPECTRUM
##VAR_NAME=  FREQUENCY,     SPECTRUM/REAL,   SPECTRUM/IMAG
##SYMBOL=    X,             R,               I
##VAR_TYPE=  INDEPENDENT,   DEPENDENT,       DEPENDENT
##VAR_FORM=  AFFN,          ASDF,            ASDF
##VAR_DIM=   131072,        131072,          131072
##UNITS=     HZ,            ARBITRARY UNITS, ARBITRARY UNITS
##FACTOR=    0.0627417313425164, 1,          1
##FIRST=     8223.62146879497, 4638,         -59328
##LAST=      0,             5190,            -58979
##MIN=       0,             -11867,          0
##MAX=       8223.62146879497, 371265489,    0
$$ Real data points
##PAGE= N=1
##DATA TABLE= (X++(R..R)), XYDATA
$$ [...]
$$ plain form
63920 4173732 4075223 3953157 3809417 3646170 3467242 3277600 3081723 2883231 2685734 2492905
63910 2492905 2307537 2131290 1965524 1811723 1670838 1542796 1426981 1322866 1230028 1148022
63900 1148022 1076517 1015192 963228 919179 881596 849551 822366 799070 778453 759592 742169
63889 742169 726270 711908 698705 686073 673787 662259 652086 643502 636538 631542 629079 629328 632000
63876 632000 636935 644338 654338 666777 681631 699093 718830 739592 760184 780704 802265 825485
63864 825485 849663 873552 896587 919159 941921 965030 987953 1009808 1029889 1047905 1063710
63853 1063710 1076800 1086258 1091326 1092030 1089051 1082980 1073837 1061397 1045753 1027262 1006018 981789 954628
63840 954628 925267 894626 863143 830830 797820 764473 731062 697748 664926 633236 603106
$$ packed form
63920D173732r8509j22066j43740j63247j78928j89642j95877j98492j97497j92829
63910B492905j85368j76247j65766j53801j40885j28042j15815j04115r2838q2006
63900A148022p1505o1325n1964m4049l7583l2045k7185k3296k0617j8861j7423
63889G42169j5899j4362j3203j2632j2286j1528j0173q584o964m996k463K49K672
63876F32000M935P403J0000J2439J4854J7462J9737K0762K0592K0520K1561K3220
63864H25485K4178K3889K3035K2572K2762K3109K2923K1855K0081J8016J5805
63853A063710J3090R458N068P04k979o071r143j2440j5644j8491k1244k4229k7161
63840I54628k9361l0641l1483l2313l3010l3347l3411l3314l2822l1690l0130
$$ plain form
63829 603106 574526 547372 521714 497671 475214 454285 434957 417375 401596 387537 374889
63818 374889 363125 351860 341306 332074 324355 317520 310746 303846 297217 291173 285686 280734 276519
63805 276519 273118 270094 266705 262596 258185 254303 251450 249461 247844 246235 244479 242521 240477 238670
63791 238670 237348 236378 235434 234333 232956 231019 228380 225561 223466 222408 221773 220810 219443 218113 217159
63776 217159 216639 216473 216487 216397 216010 215394 214732 214121 213500 212670 211377 209653 208026 207023 206474 205702 204522 203566
63758 203566 203434 203982 204697 205288 205581 205337 204702 204460 205230 206602 207601 207897 208088 208819 210127 211653 213116
63741 213116 214449 215697 216900 218039 219225 220891 223468 226723 229854 232474 235053 238079 241255 244034
63727 244034 246479 249041 251903 255137 259047 263574 267710 270469 272327 274804 278668 283339 287943 291984
$$ packed form
63829F03106k8580k7154k5658k4043k2457k0929j9328j7582j5779j4059j2648
63818C74889j1764j1265j0554r232p719o835o774o900o629o044n487m952m215
63805B76519l401l024l389m109m411l882k853j989j617j609j756j958k044j807
63791B38670j322r70r44j101j377j937k639k819k095j058o35r63j367j330r54
63776B17159n20j66J4r0l87o16o62o11o21q30j293j724j627j003n49p72j180r56
63758B03566j32N48P15N91K93k44o35k42P70J372R99K96J91P31J308J526J463
63741B13116J333J248J203J139J186J666K577L255L131K620K579L026L176K779
63727B44034K445K562K862L234L910M527M136K759J858K477L864M671M604M041
$$ plain form
63713 291984 294990 296534 296903 296859 296491 295217 293137 291334 290339 289338 287567 285590 284374 283846 283291 282521
63697 282521 281755 280886 279937 279843 281674 285170 289001 292426 295807 299487 303109 306287 309125 311780 314176
63682 314176 316392 318704 320897 322187 322252 321884 322137 323197 324489 325544 326244 326407 325726 324216 322457 321244
63666 321244 321059 321805 322948 323988 324851 325665 326078 325156 322271 318013 313805 310590 308113 305543 302505 299299
63650 299299 296302 293466 290447 287085 283684 280876 279186 278615 278621 278588 278359 278266 278668 279656 281246 283603 286807
63633 286807 290479 293938 296851 299582 302827 306969 311841 317081 322688 329135 336818 345466 354368 363282
63619 363282 372758 383378 395085 407664 421464 437033 454251 472527 491793 512582 535051 558707
63607 558707 583301 609270 636920 665781 695130 724473 753062 779569 802862 822620 838617
$$ packed form
63713B91984L006J544L69m4l68j274k080j803r95j001j771j977j216n28n55p70
63697B82521p66q69r49r4J831L496L831L425L381L680L622L178K838K655K396
63682C14176K216K312K193J290O5l68K53J060J292J055P00J63o81j510j759j213
63666C21244j85P46J143J040Q63Q14M13r22k885m258m208l215k477k570l038l206
63650B99299k997k836l019l362l401k808j690n71Ol3k29r3M02R88J590K357L204
63633B86807L672L459K913K731L245M142M872N240N607O447P683Q648Q902Q914
63619C63282R476J0620J1707J2579J3800J5569J7218J8276J9266K0789K2469K3656
63607E58707K4594K5969K7650K8861K9349K9343K8589K6507K3293J9758J5997
$$ plain form
63596 838617 850019 856155 857585 855558 850726 843198 833593 823035 812146 800849 789133 777051 763872
63583 763872 748223 729520 708580 686547 663909 640945 618375 596947 576837 558016 540894
63572 540894 526083 513787 503805 495940 490102 486225 484335 484471 486337 489395 493494 498995 505973 513841
63558 513841 522192 531487 542289 554198 566365 578837 592609 608331 625792 644866 666179 690425
63546 690425 717507 746810 777958 810827 845005 879626 913588 945541 973678 995977 1010907
63535 1010907 1017935 1017540 1011045 1000432 987854 974842 961862 948732 935417 922250 909356 896042
63523 896042 880913 862582 840297 814062 784409 752162 718290 683816 649730 616845 585698
63512 585698 556641 530051 506305 485393 466677 449314 433009 418200 405415 394565 384958 375945
$$ packed form
63596H38617J1402O136J430k027m832p528r605j0558j0889j1297j1716j2082j3179
63583G63872j5649j8703k0940k2033k2638k2964k2570k1428k0110j8821j7122
63572E40894j4811j2296r982p865n838l877j890J36J866L058M099N501O978P868
63558E13841Q351R295J0802J1909J2167J2472J3772J5722J7461J9074K1313K4246
63546F90425K7082K9303L1148L2869L4178L4621L3962L1953K8137K2299J4930
63535A010907P028l95o495j0613j2578j3012j2980j3130j3315j3167j2894j3314
63523H96042j5129j8331k2285k6235k9653l2247l3872l4474l4086l2885l1147
63512E85698k9057k6590k3746k0912j8716j7363j6305j4809j2785j0850r607r013
$$ plain form
63500 375945 367413 359672 353016 347524 343216 340148 338086 336289 333992 331252 328956 327751 327251 326638 325783
63485 325783 325300 325618 326518 327669 329140 331148 333628 336330 339154 342219 345713 349741 354149 358405 361851
63470 361851 364182 365579 366315 366404 365663 363931 361190 357624 353589 349385 345146 341099 337697 335109 332841
63455 332841 330455 328508 327993 328822 329765 330224 331216 333982 338355 343245 348162 353399 359173 365620 373439
63440 373439 383569 396100 410243 425451 441852 459576 478457 498599 520454 544066 568915
63429 568915 594815 622068 650134 676810 699542 717385 731160 742053 750836 758380 766207 776179
63417 776179 789766 807537 829066 853399 879913 908621 939384 970984 1001421 1029067 1053086
63406 1053086 1072796 1087245 1095749 1098446 1095966 1088837 1077557 1063107 1046939 1030336 1013842 997195
$$ packed form
63500C75945q532p741o656n492m308l068k062j797k297k740k296j205n00o13q55
63485C25783m83L18R00J151J471K008K480K702K824L065L494M028M408M256L446
63470C61851K331J397P36Q9p41j732k741l566m035m204m239m047l402k588k268
63455C32841k386j947n15Q29R43M59R92K766M373M890M917N237N774O447P819
63440C73439J0130J2531J4143J5208J6401J7724J8881K0142K1855K3612K4849
63429E68915K5900K7253K8066K6676K2732J7843J3775J0893Q783P544P827R972
63417G76179J3587J7771K1529K4333K6514K8708L0763L1600L0437K7646K4019
63406A053086J9710J4449Q504K697k480p129j1280j4450j6168j6603j6494j6647
$$ plain form
63394 997195 979582 959986 937575 911977 883276 851889 818549 784244 749901 716131 683473
63383 683473 652808 625149 600842 579261 559578 541707 526318 514019 504805 498278 494119 492241
63371 492241 492635 495183 499622 505695 513385 522960 534672 548471 564030 580984 599121 618623 640323
63358 640323 665376 694148 725490 757608 789690 822258 855862 889991 923474 955381 985136
63347 985136 1012096 1035505 1054662 1068783 1076970 1078758 1074650 1065851 1053648 1039302 1024080 1008764
63335 1008764 993157 976508 958293 938256 915930 890859 863250 833841 803036 770889 738150
63324 738150 706697 678443 654050 632943 614283 597736 583573 572315 564039 557885 552424 546473
63312 546473 539176 529389 515866 498579 479335 460374 442580 425557 409184 394365 382193 372868
$$ packed form
63394I97195j7613j9596k2411k5598k8701l1387l3340l4305l4343l3770l2658
63383F83473l0665k7659k4307k1581j9683j7871j5389j2299r214o527m159j878
63371D92241L94K548M439O073P690R575J1712J3799J5559J6954J8137J9502K1700
63358F40323K5053K8772L1342L2118L2082L2568L3604L4129L3483L1907K9755
63347I85136K6960K3409J9157J4121Q187J788m108q799j2203j4346j5222j5316
63335A008764j5607j6649j8215k0037k2326k5071k7609k9409l0805l2147l2739
63324G38150l1453k8254k4393k1107j8660j6547j4163j1258q276o154n461n951
63312E46473p297r787j3523j7287j9244j8961j7794j7023j6373j4819j2172r325
$$ plain form
63300 372868 365609 359344 353386 347652 342344 337444 332706 328157 324209 320991 317953 314652 311615 309774
63286 309774 309133 308716 307878 306932 306219 305274 303467 301080 299133 298284 298323 298664 298933 299051 299130 299399 299985 300651
63268 300651 300922 300621 300194 300374 301530 303413 305527 307610 309657 311630 313407 315094 317092 319636 322466
63253 322466 325295 328424 332478 337540 343005 348404 353911 359824 366063 372522 379541 387543 396442 405907
63239 405907 416008 427021 438687 450412 462346 475647 491268 508874 527323 545885 564627
63228 564627 583825 603480 623376 643286 663141 683185 703874 725348 747069 768264 788642
63217 788642 808430 827796 846606 864764 882426 899683 916145 930865 942521 949833 952192 949931
63205 949931 943699 933560 919128 900612 879238 856400 832865 809114 785988 764507 745311 728759
$$ packed form
63300C72868p259o265n958n734n308m900m738m549l948l218l038l301l037j841
63286C09774o41m17q38r46p13r45j807k387j947q49L9L41K69J18P9K69N86O66
63268C00651K71l01m27J80J156J883K114K083K047J973J777J687J998K544K830
63253C22466K829L129M054N062N465N399N507N913O239O459P019Q002Q899R465
63239D05907J0101J1013J1666J1725J1934J3301J5621J7606J8449J8562J8742
63228E64627J9198J9655J9896J9910J9855K0044K0689K1474K1721K1195K0378
63217G88642J9788J9366J8810J8158J7662J7257J6462J4720J1656P312K359k261
63205I49931o232j0139j4432j8516k1374k2838k3535k3751k3126k1481j9196j6552
$$ plain form
63193 728759 715283 705119 697908 693239 691573 693953 700630 710556 722514 736333 752691 772096 794367
63180 794367 818845 844727 871342 898380 925835 953535 980910 1007376 1032807 1057435 1081375
63169 1081375 1104393 1125999 1145574 1162570 1176706 1187781 1195077 1197192 1192846 1181791 1164703 1142318
63157 1142318 1115001 1083038 1046922 1007319 965171 921887 879016 837454 797289 758657 722414
63146 722414 689566 660233 633658 609285 587388 568460 552307 538038 524865 512692 501950
63135 501950 493011 485731 479454 473490 467746 462851 459497 457691 456815 456423 456658 457787 459652 461898 464491
63120 464491 467607 471102 474541 477855 481479 485618 489711 493021 495581 498171 501360 504923 508355 511606
63106 511606 515002 518565 521834 524519 527072 530212 533952 537412 539708 540745 540970 540699 540026 539171 538454
$$ packed form
63193G28759j3476j0164p211m669j666K380O677R926J1958J3819J6358J9405K2271
63180G94367K4478K5882K6615K7038K7455K7700K7375K6466K5431K4628K3940
63169A081375K3018K1606J9575J6996J4136J1075P296K115m346j1055j7088k2385
63157A142318k7317l1963l6116l9603m2148m3284m2871m1562m0165l8632l6243
63146G22414l2848k9333k6575k4373k1897j8928j6153j4269j3173j2173j0742
63135E01950q939p280o277n964n744m895l354j806q76l92K35J129J865K246K593
63120D64491L116L495L439L314L624M139M093L310K560K590L189L563L432L251
63106E11606L396L563L269K685K553L140L740L460K296J037K25k71o73q55p17
$$ plain form
63091 538454 537964 537673 537867 538938 540646 542016 542343 542034 542184 543516 545887 548621 551042 552858 554278 555749
63075 555749 557502 559584 562384 566700 572944 580582 588764 597322 606692 617053 628055 639458 651616
63062 651616 665172 680548 697787 716616 736629 757687 780234 804994 832348 862272 894895
63051 894895 930690 969878 1011902 1055762 1100786 1146951 1194615 1244037 1295052 1347006 1399105
63040 1399105 1450900 1502375 1553592 1604472 1654971 1705166 1754877 1803344 1849615 1893195 1934058
63029 1934058 1971913 2005679 2033789 2054865 2067949 2072263 2067157 2052465 2028716 1996760 1957248 1910768
63017 1910768 1858496 1802469 1745088 1688458 1634273 1583990 1538801 1499451 1466291 1439543 1419483
63006 1419483 1406475 1400885 1402836 1412020 1427932 1450333 1479161 1513793 1552793 1594749 1639112 1685845
$$ packed form
63091E38454m90k91J94J071J708J370L27l09J50J332K371K734K421J816J420J471
63075E55749J753K082K800M316O244P638Q182Q558R370J0361J1002J1403J2158
63062F51616J3556J5376J7239J8829K0013K1058K2547K4760K7354K9924L2623
63051H94895L5795L9188M2024M3860M5024M6165M7664M9422N1015N1954N2099
63040A399105N1795N1475N1217N0880N0499N0195M9711M8467M6271M3580M0863
63029A934058L7855L3766K8110K1076J3084M314n106j4692k3749l1956l9512m6480
63017A910768n2272n6027n7381n6630n4185n0283m5189l9350l3160k6748k0060
63006A419483j3008n590J951R184J5912K2401K8828L4632L9000M1956M4363M6733
$$ plain form
62994 1685845 1734545 1784435 1835061 1886335 1937779 1988296 2036882 2083200 2127220 2168593 2206484
62983 2206484 2239687 2266745 2286244 2297156 2298760 2290253 2270791 2239988 2198085 2145614 2083393 2012965
62971 2012965 1936515 1856044 1772942 1688556 1604695 1523224 1445472 1372355 1304664 1242788 1186447
62960 1186447 1135152 1088755 1047098 1009314 974100 940758 909623 881319 855840 832405 810075
62949 810075 788463 767849 748525 730123 711870 693566 675841 659217 643363 627695 612372
62938 612372 598175 585623 574645 564942 556189 548080 540670 534558 530165 526908 523646 519919 516204
62925 516204 513002 510328 508155 506626 505482 503895 501315 498215 495585 493941 493070 492503 491951 491379 490844
62910 490844 490174 488836 486351 482836 478834 474668 470425 466536 463688 461900 460296 458223 456045 454357
$$ packed form
62994A685845M8700M9890N0626N1274N1444N0517M8586M6318M4020M1373L7891
62983B206484L3203K7058J9499J0912J604q507j9462l0803m1903n2471o2221p0428
62971B012965p6450q0471q3102q4386q3861q1471p7752p3117o7691o1876n6341
62960A186447n1295m6397m1657l7784l5214l3342l1135k8304k5479k3435k2330
62949H10075k1612k0614j9324j8402j8253j8304j7725j6624j5854j5668j5323
62938F12372j4197j2552j0978r703q753q109p410o112m393l257l262l727l715
62925E16204l202k674k173j529j144j587k580l100k630j644q71n67n52n72n35
62910D90844o70j338k485l515m002m166m243l889k848j788j604k073k178j688
$$ plain form
62896 454357 452982 451432 449962 449322 449562 449930 450029 450382 451627 453692 456028 458198 459928 460931 461043 460431
62880 460431 459455 458497 457913 457867 458036 457827 457150 456661 456910 457463 457316 456103 454473 453245 452556 451964 451096 449943
62862 449943 448726 447656 446768 445870 444741 443522 442773 443010 444265 446198 448456 450680 452339 452998 452809 452407
62846 452407 452227 452186 452151 452302 452835 453641 454580 455704 456813 457125 456080 454341 453269 453234 453093 451723 449548
62829 449548 448028 447936 448686 449303 449571 450066 451291 452967 454273 454841 455384 457018 459947 463219 465955 468369
62813 468369 471166 474379 477379 479884 482261 484834 487547 490535 494480 500033 507126 515203 523804 532639
62799 532639 541340 549602 557632 566169 575922 587068 599337 612486 626624 642100 659119 677606
62787 677606 697630 719877 745470 775209 809176 847184 889392 936243 987941 1044266 1104874
$$ packed form
62896D54357j375j550j470o40K40L68R9L53J245K065K336K170J730J003J12o12
62880D60431r76r58n84m6J69k09o77m89K49N53j47j213j630j228o89n92q68j153
62862D49943j217j070q88q98j129j219p49K37J255J933K258K224J659O59j89m02
62846D52407j80m1l5J51N33Q06R39J124J109L12j045j739j072l5j41j370k175
62829D49548j520r2P50O17K68M95J225J676J306N68N43J634K929L272K736K414
62813D68369K797L213L000K505K377K573K713K988L945N553P093Q077Q601Q835
62799E32639Q701Q262Q030Q537R753J1146J2269J3149J4138J5476J7019J8487
62787F77606K0024K2247K5593K9739L3967L8008M2208M6851N1698N6325O0608
$$ plain form
62776 1104874 1169500 1237760 1308924 1382003 1455989 1529928 1602724 1672839 1738154 1796257 1845103
62765 1845103 1883504 1910918 1926811 1930402 1921146 1899267 1865679 1821532 1768080 1706940 1640062 1569238
62753 1569238 1495839 1421204 1347038 1275010 1205995 1140083 1077418 1018675 964548 915076 869797
62742 869797 828389 790801 756881 726284 698793 674379 652852 633753 616731 601821 589126
62731 589126 578400 569111 560855 553604 547647 543397 541116 540631 541373 542806 544774 547408 550880 555361
62717 555361 561047 568091 576624 587036 599996 615888 634339 654659 676786 701442 729288 760290
62705 760290 794118 830934 871519 916727 967047 1022678 1083790 1150620 1223290 1301504 1384451
62694 1384451 1471110 1560630 1652266 1744904 1836840 1926122 2010919 2089389 2159436 2218877 2265782
$$ packed form
62776A104874O4626O8260P1164P3079P3986P3939P2796P0115O5315N8103M8846
62765A845103L8401K7414J5893L591r256k1879l3588m4147n3452o1140o6878p0824
62753A569238p3399p4635p4166p2028o9015o5912o2665n8743n4127m9472m5279
62742H69797m1408l7588l3920l0597k7491k4414k1527j9099j7022j4910j2695
62731E89126j0726r289q256p251n957m250k281m85P42J433J968K634L472M481
62717E55361N686P044Q533J0412J2960J5892J8451K0320K2127K4656K7846L1002
62705G60290L3828L6816M0585M5208N0320N5631O1112O6830P2670P8214Q2947
62694A384451Q6659Q9520R1636R2638R1936Q9282Q4797P8470P0047N9441M6905
$$ plain form
62683 2265782 2298449 2315210 2314764 2296837 2262260 2212343 2148489 2072612 1987516 1896348 1801640 1705116
62671 1705116 1608334 1513104 1421104 1333318 1250055 1171451 1097900 1030056 968525 913415 864089
62660 864089 819462 778713 741721 708753 679838 654541 632201 612176 593883 576929 561312
62649 561312 547324 535054 524060 513623 503240 492826 482618 473070 464658 457537 451434 446106
62637 446106 441830 439054 437556 436407 435010 433815 433612 434364 435203 435500 435371 435021 434191 432632 430760 429351
62621 429351 428708 428541 428639 429178 430274 431627 432881 434125 435784 438166 441364 445452 450451 456107 462043
62606 462043 468290 475471 484264 494762 506495 519015 532307 546729 562732 580675 600714 622847
62594 622847 647174 674110 704084 736856 771289 806090 840669 875055 909016 941571 971401
$$ packed form
62683B265782L2667J6761m46j7927l4577m9917o3854p5877q5096r1168r4708r6524
62671A705116r6782r5230r2000q7786q3263p8604p3551o7844o1531n5110m9326
62660H64089m4627m0749l6992l2968k8915k5297k2340k0025j8293j6954j5617
62649E61312j3988j2270j0994j0437j0383j0414j0208r548q412p121o103n328
62637D46106m276k776j498j149j397j195k03P52Q39K97j29l50q30j559j872j409
62621D29351o43j67R8N39J096J353J254J244J659K382L198M088M999N656N936
62606D62043O247P181Q793J0498J1733J2520J3292J4422J6003J7943K0039K2133
62594F22847K4327K6936K9974L2772L4433L4801L4579L4386L3961L2555K9830
$$ plain form
62583 971401 997417 1018739 1034461 1043823 1046559 1042863 1033081 1017682 997412 973146 945527 915012
62571 915012 882247 848141 813489 778894 745110 713095 683434 656005 630498 607042 585958
62560 585958 567150 550150 534691 520828 508575 497844 488774 481559 475815 470581 465237 460086 455694
62547 455694 451987 448401 444761 441585 439563 439039 439925 441801 444059 446240 448295 450393 452577 454794 457169
62532 457169 459965 463317 467283 472106 478058 485024 492631 500850 510118 520804 533014 547138 564105
62519 564105 584653 608595 635246 664425 696601 732138 770832 812279 856420 903567 953918
62508 953918 1006965 1061242 1114756 1165883 1213803 1257968 1297323 1330339 1355665 1372451 1380203 1378836
62496 1378836 1368955 1351779 1328613 1300608 1268999 1235250 1200828 1167028 1135041 1105923 1080436
$$ packed form
62583I71401K6016K1322J5722R362K736l696r782j5399k0270k4266k7619l0515
62571I15012l2765l4106l4652l4595l3784l2015k9661k7429k5507k3456k1084
62560E85958j8808j7000j5459j3863j2253j0731r070p215n744n234n344n151m392
62547D55694l707l586l640l176k022n24Q86J876K258K181K055K098K184K217K375
62532D57169K796L352L966M823N952O966P607Q219R268J0686J2210J4124J6967
62519E64105K0548K3942K6651K9179L2176L5537L8694M1447M4141M7147N0351
62508I53918N3047N4277N3514N1127M7920M4165L9355L3016K5326J6786P752j367
62496A378836r881j7176k3166k8005l1609l3749l4422l3800l1987k9118k5487
$$ plain form
62485 1080436 1059179 1042920 1032475 1028145 1029543 1035992 1046774 1060948 1077448 1095631 1115340 1136152
62473 1136152 1156914 1176297 1193373 1207266 1216676 1220370 1217946 1209535 1194955 1173830 1146551 1114373
62461 1114373 1078316 1038511 995028 948944 902159 856270 811952 769418 729197 692287 659567
62450 659567 631177 606611 585436 567736 553741 543278 535864 531060 528345 526757 525276 523726 522881
62437 522881 523458 525285 527673 530269 533210 536536 539770 542134 543076 542523 540607 537160 531745 524400 516099
62422 516099 508025 500375 492332 483273 473581 464132 455469 447734 440986 435168 429950 424936 419939 414965
62408 414965 410216 406254 403690 402366 401186 399221 396756 394826 393990 394025 394572 395437 396289 396740 396920 397528
62392 397528 399108 401573 404463 407309 409712 411513 413055 414912 417126 419111 420580 422213 425082 429606
$$ packed form
62485A080436k1257j6259j0445m330J398O449J0782J4174J6500J8183J9709K0812
62473A136152K0762J9383J7076J3893R410L694k424q411j4580k1125k7279l2178
62461A114373l6057l9805m3483m6084m6785m5889m4318m2534m0221l6910l2720
62450F59567k8390k4566k1175j7700j3995j0463p414m804k715j588j481j550q45
62437E22881N77J827K388K596K941L326L234K364R42n53j916l447n415p345q301
62422E16099q074p650q043r059r692r449q663p735o748n818n218n014m997m974
62408D14965m749l962k564j324j180j965k465j930q36L5N47Q65Q52M51J80O08
62392C97528J580K465K890K846K403J801J542J857K214J985J469J633K869M524
$$ plain form
62378 429606 435391 441884 448819 456147 463903 472248 481380 491308 501815 512695 523983 535930 548788
62365 548788 562591 577159 592501 609308 628878 652328 679880 711017 745211 782344 822540
62354 822540 865988 912961 963664 1017624 1073247 1128202 1180385 1228447 1271550 1308873 1339562
62343 1339562 1362934 1378516 1385931 1384996 1376021 1359888 1337735 1310614 1279306 1244299 1205980 1165078
62331 1165078 1122930 1081009 1040118 1000373 962063 926135 893537 864340 837889 813634 791406
62320 791406 771043 752104 733975 715973 697504 678485 659497 641097 623069 604796 586346
62309 586346 568663 552576 538130 525028 513096 502042 491336 480822 471162 463233 457317 453212
62297 453212 450686 449303 448129 446375 444339 443095 443167 444079 445320 447072 449638 452710 455783 458997 462878
$$ packed form
62378D29606N785O493O935P328P756Q345R132R928J0507J0880J1288J1947J2858
62365E48788J3803J4568J5342J6807J9570K3450K7552L1137L4194L7133M0196
62354H22540M3448M6973N0703N3960N5623N4955N2183M8062M3103L7323L0689
62343A339562K3372J5582P415r35q975j6133k2153k7121l1308l5007l8319m0902
62331A165078m2148m1921m0891l9745l8310l5928l2598k9197k6451k4255k2228
62320G91406k0363j8939j8129j8002j8469j9019j8988j8400j8028j8273j8450
62309E86346j7683j6087j4446j3102j1932j1054j0706j0514r660p929n916m105
62297D53212k526j383j174j754k036j244P2R12J241J752K566L072L073L214L881
$$ plain form
62282 462878 467368 471725 475566 479433 483948 488826 493268 497192 501432 506587 512245 517763 523414 530123
62268 530123 538240 547207 556649 567213 579974 595327 612880 632313 654007 678869 707803 741302
62256 741302 779250 820997 865816 913402 963929 1017565 1073873 1131569 1188812 1243800 1295082
62245 1295082 1341238 1380487 1411068 1432174 1444108 1447312 1441603 1426702 1403124 1372062 1334540 1291215
62233 1291215 1242857 1190475 1134983 1077339 1019064 962054 907652 856352 808599 765283 727070
62222 727070 693726 664540 639058 616890 597184 578992 562127 547103 534214 523133 513429 504925
62210 504925 497427 490597 484365 479074 474923 471630 468880 466838 465869 466016 467099 469111 472055 475547 479073
62195 479073 482716 487165 492879 499601 506892 514837 523928 534417 546085 558633 572113 586899 603210
$$ packed form
62282D62878M490M357L841L867M515M878M442L924M240N155N658N518N651O709
62268E30123Q117Q967R442J0564J2761J5353J7553J9433K1694K4862K8934L3499
62256G41302L7948M1747M4819M7586N0527N3636N6308N7696N7243N4988N1282
62245A295082M6156L9249L0581K1106J1934L204n709j4901k3578l1062l7522m3325
62233A291215m8358n2382n5492n7644n8275n7010n4402n1300m7753m3316l8213
62222G27070l3344k9186k5482k2168j9706j8192j6865j5024j2889j1081r704q504
62210E04925p498o830o232n291m151l293k750k042r69J47J083K012K944L492L526
62195D79073L643M449N714O722P291P945R091J0489J1668J2548J3480J4786J6311
$$ plain form
62182 603210 620630 638139 654806 670462 685547 700306 714456 727698 740176 752106 763284
62171 763284 773358 782574 791947 802738 815938 832067 851076 872493 896046 922156 951508 984082
62159 984082 1018878 1054603 1090219 1124734 1156838 1184994 1207741 1223860 1232662 1234348 1229863 1220145
62147 1220145 1205668 1186756 1163975 1137972 1109216 1078139 1045315 1011272 976457 941682 908318
62136 908318 877574 849761 824639 802332 783439 768302 756654 747957 741691 737295 734254 732382
62124 732382 731690 731942 732680 733805 735750 738980 743558 749264 755691 762129 767789 772401 776195 779054 780115
62109 780115 778691 775256 771000 766520 761513 755696 749475 743458 737670 731560 724670 717126 709611 703040
62095 703040 698153 695312 694595 696026 699569 704934 711605 719153 727382 736053 744718 753108 761646 771235
$$ packed form
62182F03210J7420J7509J6667J5656J5085J4759J4150J3242J2478J1930J1178
62171G63284J0074R216R373J0791J3200J6129J9009K1417K3553K6110K9352L2574
62159I84082L4796L5725L5616L4515L2104K8156K2747J6119Q802J686m485r718
62147A220145j4477j8912k2781k6003k8756l1077l2824l4043l4815l4775l3364
62136I08318l0744k7813k5122k2307j8893j5137j1648q697o266m396l041j872
62124G32382o92K52P38J125J945L230M578N706O427O438N660M612L794K859J061
62109G80115j424l435m256m480n007n817o221o017n788o110o890p544p515o571
62095G03040m887k841p17J431L543N365O671P548Q229Q671Q665Q390Q538R589
$$ plain form
62081 771235 782420 794956 808383 822876 839199 857763 877976 898741 919504 940572 962464
62070 962464 985179 1008260 1031335 1054361 1077375 1100335 1123293 1146494 1170090 1193901 1217779
62059 1217779 1242107 1267473 1293664 1319299 1342833 1363680 1381903 1396922 1407186 1411370 1409474 1402405
62047 1402405 1390777 1374518 1353470 1327869 1298198 1264932 1228533 1189418 1147801 1103844 1058187
62036 1058187 1012203 967472 924918 884552 846081 809711 776198 746107 719202 694812 672710
62025 672710 653254 636569 621935 608319 595275 582982 571530 560592 549774 538982 528380
62014 528380 518293 509156 501239 494291 487700 481141 474900 469539 465461 462843 461733 462036 463515 465856
62000 465856 468641 471367 473792 476216 479064 482122 484604 486115 487079 487949 488437 487948 486491 484592 482422
$$ packed form
62081G71235J1185J2536J3427J4493J6323J8564K0213K0765K0763K1068K1892
62070I62464K2715K3081K3075K3026K3014K2960K2958K3201K3596K3811K3878
62059A217779K4328K5366K6191K5635K3534K0847J8223J5019J0264M184j896p069
62047A402405j1628j6259k1048k5601k9671l3266l6399l9115m1617m3957m5657
62036A058187m5984m4731m2554m0366l8471l6370l3513l0091k6905k4390k2102
62025F72710j9456j6685j4634j3616j3044j2293j1452j0938j0818j0792j0602
62014E28380j0087r137p917o948o591o559o241n361m078k618j110L03J479K341
62000D65856K785K726K425K424K848L058K482J511R64Q70M88m89j457j899k170
$$ plain form
61985 482422 479523 475473 470432 464899 459168 453136 446478 438982 430917 423087 416329 410821 406055 401509
61971 401509 397164 393316 390057 387201 384585 382299 380522 379239 378174 377063 375984 375369 375590 376498 377522
61956 377522 378234 378761 379532 380791 382549 384943 388355 392939 398258 403725 409379 415902 423768 432669 441935
61941 441935 451259 460809 470896 481833 493926 507195 521175 535309 549448 563594 577294 589849
61929 589849 601144 611715 621747 630572 637519 642867 647512 651887 655596 657910 658319 656739 653605 649683
61915 649683 645532 641209 636759 632820 630345 629754 630713 632834 636284 641506 648559 656932 665999 675482 685337
61900 685337 695211 704274 711816 717867 722837 726502 727811 725916 721056 714236 706355 697864 688827 678914
61886 678914 667716 655567 643805 633636 624931 616599 607982 599263 590685 582044 573077 563724 553924
$$ packed form
61985D82422k899m050n041n533n731o032o658p496q065p830o758n508m766m546
61971D01509m345l848l259k856k616k286j777j283j065j111j079o15K21R08J024
61956C77522P12N27P71J259J758K394L412M584N319N467N654O523P866Q901R266
61941D41935R324R550J0087J0937J2093J3269J3980J4134J4139J4146J3700J2555
61929E89849J1295J0571J0032Q825O947N348M645M375L709K314M09j580l134l922
61915F49683m151m323m450l939k475n91R59K121L450N222P053Q373R067R483R855
61900F85337R874R063P542O051M970L665J309j895m860o820p881q491r037r913
61886F78914j1198j2149j1762j0169q705q332q617q719q578q641q967r353r800
$$ plain form
61873 553924 543693 533498 523985 515196 506670 498491 491567 486538 483054 480582 479301 479561 480923 482564
61859 482564 484434 487366 492089 498758 507375 517977 530269 543697 558185 574364 592716 612820
61847 612820 633788 655160 677039 699450 721960 743855 764408 782924 798873 812151 823048
61836 823048 831778 838078 841315 840961 836983 830030 821438 812884 805679 800296 796685 794958 795444 798117 802467
61821 802467 808151 815395 824255 833752 842203 848412 852103 853182 851102 845210 835386 822133 806202 788373
61807 788373 769366 749684 729543 709082 688628 668743 650148 633585 619500 607617 596972
61796 596972 586634 576457 567040 558942 552021 545547 538925 532221 525946 520413 515561 511388 508113 505573
61782 505573 502794 498775 493710 488883 485249 482596 480306 478366 477204 476835 476635 475897 474326 472119 469785
$$ packed form
61873E53924j0231j0195r513q789q526q179o924n029l484k472j281K60J362J641
61859D82564J870K932M723O669Q617J0602J2292J3428J4488J6179J8352K0104
61847F12820K0968K1372K1879K2411K2510K1895K0553J8516J5949J3278J0897
61836H23048Q730O300L237l54l978o953q592q554p205n383l611j727M86K673M350
61821H02467N684P244Q860R497Q451O209L691J079k080n892r824j3253j5931j7829
61807G88373j9007j9682k0141k0461k0454j9885j8595j6563j4085j1883j0645
61796E96972j0338j0177r417q098o921o474o622o704o275n533m852m173l275k540
61782E05573k779m019n065m827l634k653k290j940j162l69k00p38j571k207k334
$$ plain form
61767 469785 467789 466159 464589 463024 461907 461634 462039 462719 463605 464860 466425 468058 469725 471581 473682
61752 473682 476045 478792 481757 484085 484843 484148 483184 482886 483004 482683 481540 479878 478106 476306 474249 471615
61736 471615 468288 464614 461259 458656 456735 455277 454318 453984 454133 454445 454795 455316 456151 457396 459258 461928
61720 461928 465162 468205 470357 471569 472360 473222 474258 475375 476583 477927 479253 480266 480810 480963 480804
61705 480804 480324 479613 478900 478184 477064 475212 472924 470756 468640 465863 462186 458556 456182 455012 453645
61690 453645 450919 447228 443983 441973 440573 438623 435809 432992 431248 430731 430542 429650 427843 425769 424114
61675 424114 422890 421591 419938 418268 417135 416677 416461 415869 414569 412720 410829 409327 408131 406708 404681
61660 404681 402277 400048 398316 397158 396719 397078 397780 398054 397685 397320 397639 398572 399625 400582 401477 402182 402533
$$ packed form
61767D69785j996j630j570j565j117k73M05O80Q86J255J565J633J667J856K101
61752D73682K363K747K965K328P58o95r64k98J18l21j143j662j772j800k057k634
61736D71615l327l674l355k603j921j458r59l34J49L12L50N21Q35J245J862K670
61720D61928L234L043K152J212P91Q62J036J117J208J344J326J013N44J53j59
61705D80804m80p11p13p16j120j852k288k168k116k777l677l630k374j170j367
61690D53645k726l691l245k010j400j950k814k817j744n17j89q92j807k074j655
61675D24114j224j299j653j670j133m58k16n92j300j849j891j502j196j423k027
61660D04681k404k229j732j158m39L59P02K74l69l65L19R33J053R57Q95P05L51
$$ plain form
61643 402533 402791 403499 404906 406898 409424 412496 415776 418680 420993 422917 424337 424593 423391 421515 420126
61628 420126 419499 418908 417665 415776 413497 410775 407482 403953 400834 398290 395705 392427 388644 385211 382639
61613 382639 380688 379032 377842 377276 376732 375272 372753 369911 367187 364036 359706 354261 348450 342912 337959
61598 337959 333910 331046 329151 327483 325401 322906 320560 318923 317970 316940 314881 311563 307729 304308
61584 304308 301612 299562 298342 298196 298608 298355 296724 294265 292021 290336 288818 287215 285808 284879 284279
61569 284279 283682 283023 282405 281757 280845 279680 278706 278453 279078 280328 281919 283762 285741 287440 288340 288362 288079
61552 288079 288236 289092 290280 291275 291872 292214 292528 292955 293547 294235 294743 294714 294134 293555 293672 294610 295797 296635
61534 296635 297060 297283 297173 296369 295010 293992 294239 295820 297978 299888 301181 301848 301915 301334 300076 298228
$$ packed form
61643D02533K58P08J407J992K526L072L280K904K313J924J420K56j202j876j389
61628D20126o27n91j243j889k279k722l293l529l119k544k585l278l783l433k572
61613C82639j951j656j190n66n44j460k519k842k724l151m330n445n811n538m953
61598C37959m049k864j895j668k082k495k346j637r53j030k059l318l834l421
61584C04308k696k050j220j46M12k53j631k459k244j685j518j603j407r29o00
61569B84279n97o59o18o48r12j165r74k53O25J250J591J843J979J699R00K2k83
61552B88079J57Q56J188R95N97L42L14M27N92O88N08k9n80n79J17R38J187Q38
61534B96635M25K23j10q04j359j018K47J581K158J910J293O67O7n81j258j848
$$ plain form
61518 298228 296086 294107 292626 291566 290546 289358 288195 287326 286746 286304 286085 286376 287278 288574 290011 291455
61502 291455 292686 293333 293221 292571 291629 290287 288379 286222 284441 283235 282279 281469 281366 282481 284324 285632
61486 285632 285620 284761 284232 284733 285914 286818 286774 285923 285043 284972 286150 288446 291214 293613 295239 296537 298327
61469 298327 300786 303177 304741 305464 305650 305229 304121 303013 302902 303729 304251 303591 302303 301474 301431 301871 302694
61452 302694 303892 304942 305234 305079 305510 306965 308811 310283 311226 311757 311971 312285 313326 314923 315877 315417
61436 315417 314463 314655 316439 318908 321298 323713 326299 328603 330165 331113 331779 332182 332303 332513 333261 334527
61420 334527 335955 337359 338765 340110 341278 342459 344153 346674 349746 352590 354433 355087 355103 355255 355751
61405 355751 356039 355479 354033 352192 350372 348598 346672 344474 342150 340072 338534 337396 336177 334661 333282
$$ packed form
61518B98228k142j979j481j060j020j188j163q69n80m42k19K91R02J296J437J444
61502B91455J231O47j12o50r42j342j908k157j781j206r56q10j03J115J843J308
61486B85632j2q59n29N01J181R04m4q51q80p1J178K296K768K399J626J298J790
61469B98327K459K391J564P23J86m21j108j108j11Q27N22o60j288q29m3M40Q23
61452C02694J198J050K92j55M31J455J846J472R43N31K14L14J041J597R54m60
61436C15417r54J92J784K469K390K415K586K304J562R48O66M03J21K10P48J266
61420C34527J428J404J406J345J168J181J694K521L072K844J843O54J6J52M96
61405C55751K88n60j446j841j820j774j926k198k324k078j538j138j219j516j379
$$ plain form
61390 333282 332747 333343 334743 336382 337892 339277 340780 342506 344148 345274 345983 346938 348545 350381 351780
61375 351780 352767 353998 355931 358461 361348 364478 367567 370038 371439 371825 371584 371052 370435 369953 369947 370801 372670
61358 372670 375129 377267 378441 378998 380010 382247 385657 389845 394649 400088 406024 412201 418475 424768
61344 424768 430832 436256 440745 444368 447524 450670 454000 457373 460542 463344 465632 467259 468324 469287
61330 469287 470524 471825 472670 472945 473044 473269 473537 473752 474046 474475 474757 474552 473782 472662 471747 471956 474078 477979
61312 477979 482657 487335 492167 497728 504341 512237 521751 532724 544144 555109 565909 577421 589610
61299 589610 601419 612091 621696 630155 636676 640690 642624 643113 641927 638410 632693 625749 618355 610687
61285 610687 602894 595361 588168 580886 573252 565622 558483 551904 545815 540417 535873 531949 528615 526695
$$ packed form
61390C33282n35N96J400J639J510J385J503J726J642J126P09R55J607J836J399
61375C51780R87J231J933K530K887L130L089K471J401L86k41n32o17m82oQ54J869
61358C72670K459K138J174N57J012K237L410M188M804N439N936O177O274O293
61344D24768O064N424M489L623L156L146L330L373L169K802K288J627J065R63
61330D69287J237J301Q45K75R9K25K68K15K94M29K82k05p70j120r15K09K122L901
61312D77979M678M678M832N561O613P896R514J0973J1420J0965J0800J1512J2189
61299E89610J1809J0672R605Q459O521M014J934M89j186l517n717o944p394p668
61285F10687p793p533p193p282p634p630p139o579o089n398m544l924l334j920
$$ plain form
61271 526695 527105 529349 531610 532682 533174 534299 536143 537826 539037 540422 542500 544989 547541 550491 554423
61256 554423 559336 564639 569855 574959 580055 584911 588897 591430 592577 593166 594078 595391 596390 596407 595406
61241 595406 593797 592041 590504 589338 588324 587055 585418 583689 582154 580911 580050 579698 579849 580529 582126
61226 582126 584995 588697 592299 595724 600060 606099 613236 620437 627681 635587 644041 652124 659348 666119
61212 666119 672976 680097 687605 695618 703799 711426 718145 724215 729929 735322 740495 745636 750520 754598
61198 754598 757949 761670 766983 774253 783164 793353 804469 815940 827282 838553 850123 861944
61186 861944 873302 883299 891414 897623 902068 904678 905211 903746 901000 897876 894699 891110 886658 881211
61172 881211 874856 867790 860324 852590 844198 834603 823909 812839 801812 790526 778648 766377 754005
$$ packed form
61271E26695M10K244K261J072M92J125J844J683J211J385K078K489K552K950L932
61256E54423M913N303N216N104N096M856L986K533J147N89R12J313R99J7j001
61241E95406j609j756j537j166j014j269j637j729j535j243q61l52J51O80J597
61226E82126K869L702L602L425M336O039P137P201P244P906Q454Q083P224O771
61212F66119O857P121P508Q013Q181P627O719O070N714N393N173N141M884M078
61198G54598L351L721N313P270Q911J0189J1116J1471J1342J1271J1570J1821
61186H61944J1358R997Q115O209M445K610N33j465k746l124l177l589m452n447
61172H81211o355p066p466p734q392r595j0694j1070j1027j1286j1878j2271j2372
$$ plain form
61159 754005 741401 728358 715063 701812 688646 675708 663570 652636 642527 632732 623741 616826
61147 616826 612556 610102 608195 606330 604775 603699 602620 600654 597209 592476 587267 582271 577500 572546
61133 572546 567328 562408 558611 556508 556276 557875 561263 566404 573076 580814 589357 599142 611006 625187
61119 625187 640990 657728 675617 695266 716543 738583 760898 783928 808343 834271 861353
61108 861353 889088 916777 943491 968531 991854 1013718 1033956 1051931 1067288 1080375 1091601
61097 1091601 1100490 1105813 1106825 1104019 1098302 1089691 1077410 1061225 1042065 1021133 999040 976111
61085 976111 952849 929478 905533 880777 856206 833273 812159 791724 771319 751738 733994
61074 733994 717985 702993 688923 676256 665087 654989 645829 638050 632004 627459 623989 621575 620534
$$ packed form
61159G54005j2604j3043j3295j3251j3166j2938j2138j0934j0109r795q991o915
61147F16826m270k454j907j865j555j076j079j966l445m733n209m996m771m954
61133E72546n218m920l797k103k32J599L388N141O672P738Q543R785J1864J4181
61119F25187J5803J6738J7889J9649K1277K2040K2315K3030K4415K5928K7082
61108H61353K7735K7689K6714K5040K3323K1864K0238J7975J5357J3087J1226
61097A091601Q889N323J012k806n717q611j2281j6185j9160k0932k2093k2929
61085I76111k3262k3371k3945k4756k4571k2933k1114k0435k0405j9581j7744
61074G33994j6009j4992j4070j2667j1169j0098r160p779o046m545l470k414j041
$$ plain form
61061 620534 620979 622527 624569 626782 629395 632985 638008 644494 652125 660535 669628 679722 691365 704828
61047 704828 719736 735375 751432 768287 786531 806428 827936 851026 875747 902119 930205
61036 930205 960199 992248 1026227 1061926 1099470 1139313 1181677 1226136 1271938 1318728 1366815
61025 1366815 1416707 1468611 1522556 1578856 1638149 1700977 1767702 1839120 1917011 2003878 2102247
61014 2102247 2214459 2343098 2491457 2663804 2865540 3103160 3384033 3716463 4110419
61005 4110419 4578329 5135001 5796129 6575157 7479062 8506080 9649150 10903160 12266562
60996 12266562 13730617 15263840 16807294 18284552 19613174 20708209 21489262 21907527
60988 21907527 21982314 21810271 21525409 21234140 20973470 20714092 20387423 19907429 19185573
$$ packed form
61061F20534M45J548K042K213K613L590N023O486P631Q410R093J0094J1643J3463
61047G04828J4908J5639J6057J6855J8244J9897K1508K3090K4721K6372K8086
61036I30205K9994L2049L3979L5699L7544L9843M2364M4459M5802M6790M8087
61025A366815M9892N1904N3945N6300N9293O2828O6725P1418P7891Q6867R8369
61014B102247J12212J28639J48359J72347K01736K37620K80873L32430L93956
61005D110419M67910N56672O61128P79028R03905J027018J143070J254010J363402
60996A2266562J464055J533223J543454J477258J328622J095035P81053M18265
60988B1907527P4787j72043k84862k91269k60670k59378l26669m79994p21856
$$ plain form
60979 19185573 18155817 16809554 15214143 13493282 11780462 10178613 8746735 7507423
60971 7507423 6458973 5584703 4860902 4263595 3771653 3366505 3031718 2753581 2521085
60962 2521085 2324891 2156974 2011261 1883574 1770509 1668993 1577073 1494256 1420531 1355507
60952 1355507 1298652 1249499 1207001 1169196 1134167 1101100 1070047 1041026 1013753 987897 963201
60941 963201 939586 917434 897329 879172 861995 845040 828530 812899 797854 782900 768342
60930 768342 754887 742463 730316 718197 706583 695701 685163 674692 664434 654418 644544 635406
60918 635406 628189 623203 619220 614896 610312 606374 603266 600338 597309 594647 592722 591306 590178 589663
60904 589663 590233 591928 594423 597426 600743 604092 607160 609908 612729 616229 620759 626069 631492 636509
$$ packed form
60979A9185573j029756j346263j595411j720861j712820j601849j431878j239312
60971G507423j048450q74270p23801n97307m91942m05148l34787k78137k32496
60962B521085j96194j67917j45713j27687j13065j01516r1920q2817p3725o5024
60952A355507n6855m9153m2498l7805l5029l3067l1053k9021k7273k5856k4696
60941I63201k3615k2152k0105j8157j7177j6955j6510j5631j5045j4954j4558
60930G68342j3455j2424j2147j2119j1614j0882j0538j0471j0258j0016r874r138
60918F35406p217m986l983m324m584l938l108k928l029k662j925j416j128n15
60904E89663N70J695K495L003L317L349L068K748K821L500M530N310N423N017
$$ plain form
60890 636509 641135 645678 650316 655069 660058 665521 671529 677877 684251 690330 695818 700665 705414 711076
60876 711076 718396 727245 736849 746640 756703 767403 778689 790043 801155 812434 824543 837425
60864 837425 850103 861580 871741 881179 890378 899301 907604 914816 920345 923740 925165 925331 924748 923192
60850 923192 920114 915439 909645 903071 895401 885975 874471 861157 846533 830957 814664 797965 781250
60837 781250 764805 748697 732804 716864 700604 684081 667877 652715 638778 625629 612928
60826 612928 600997 590443 581332 572990 564580 555748 546778 538290 530777 524310 518675 513762 509593 505919
60812 505919 502176 498113 494207 491056 488570 486207 483868 481956 480538 479113 477457 476118 475583 475377 474544
60797 474544 472896 471216 470201 469646 468848 467510 465995 464893 464538 464818 465174 464805 463199 460623 457944 455764
$$ packed form
60890F36509M626M543M638M753M989N463O008O348O374O079N488M847M749N662
60876G11076P320Q849R604R791J0063J0700J1286J1354J1112J1279J2109J2882
60864H37425J2678J1477J0161R438R199Q923Q303P212N529L395J425J66n83j556
60850I23192l078m675n794o574p670r426j1504j3314j4624j5576j6293j6699j6715
60837G81250j6445j6108j5893j5940j6260j6523j6204j5162j3937j3149j2701
60826F12928j1931j0554r111q342q410q832q970q488p513o467n635m913m169l674
60812E05919l743m063l906l151k486k363k339j912j418j425j656j339n35k06q33
60797D74544j648j680j015n55p98j338j515j102l55K80L56l69j606k576k679k180
$$ plain form
60781 455764 453860 451697 449298 447226 445715 444292 442445 440240 438042 436017 434245 432871 431664 429797
60767 429797 426776 423363 420802 419141 417111 413815 409777 406038 402917 400161 397732 395831 394395 393135
60753 393135 391924 390859 390089 389819 390203 390958 391404 391242 391034 391601 393202 395579 398413 401264 403382 404201
60737 404201 403922 403197 402350 401298 399961 398310 396167 393525 390892 388754 386866 384664 382311 380600 379760
60722 379760 379033 377623 375526 373267 371332 369955 368879 367132 363755 359095 354821 352191 350781 349338
60708 349338 347397 345517 344279 343666 343227 342316 340366 337538 334986 333877 334089 334364 333818 332786 332066 331843
60692 331843 331705 331384 331037 330894 330986 331237 331628 332178 332921 333947 335432 337566 340440 343957 347832 351738 355530
60675 355530 359309 363145 366753 369640 371726 373632 376105 379191 382208 384569 386308 387742 388940 389807
$$ packed form
60781D55764j904k163k399k072j511j423j847k205k198k025j772j374j207j867
60767D29797l021l413k561j661k030l296m038l739l121k756k429j901j436j260
60753C93135j211j065p70k70L84P55M46j62k08N67J601K377K834K851K118Q19
60737D04201k79p25q47j052j337j651k143k642k633k138j888k202k353j711q40
60722C79760p27j410k097k259j935j377j076j747l377m660m274k630j410j443
60708C49338j941j880j238o13m39r11j950k828k552j109K12K75n46j032p20k23
60692C31843j38l21l47j43R2K51L91N50P43J026J485K134K874L517L875L906L792
60675C55530L779L836L608K887K086J906K473L086L017K361J739J434J198Q67
$$ plain form
60661 389807 390427 391007 391605 392186 392825 393608 394460 395334 396427 397901 399552 401136 402869 405097 407516 409270
60645 409270 409972 410177 410627 411344 411644 410765 408362 404715 400608 396760 393277 389844 386387 383146 380190 377388
60629 377388 374889 372985 371386 369332 366781 364753 364027 364148 364300 364521 365207 365884 365540 364156 362991 363101
60613 363101 364178 365101 365202 364761 364517 364871 365448 365505 364896 364377 364686 365623 366424 366757 366909 367228 367970 369421
60595 369421 371500 373380 374244 374361 374693 375542 376378 377031 378002 379379 380378 380439 379928 379288 378343 377060 376261 376751
60577 376751 378354 380521 383312 386880 390580 393735 397028 401979 409013 417094 425375 434220 444239 455255
60563 455255 466637 477928 488602 497894 505469 511764 517041 520500 521013 518480 513923 508390 502412 496381
60549 496381 490790 485996 482213 479887 479663 481730 485563 490507 496411 503546 512173 522448 534524 548375
$$ packed form
60661C89807O20N80N98N81O39P83Q52Q74J093J474J651J584J733K228K419J754
60645D09270P02K05M50P17L00q79k403l647m107l848l483l433l457l241k956k802
60629C77388k499j904j599k054k551k028p26J21J52K21O86O77l44j384j165J10
60613C63101J077R23J01m41k44L54N77N7o09n19L09R37Q01L33J52L19P42J451
60595C69421K079J880Q64J17L32Q49Q36O53R71J377R99O1n11o40r45j283p99M90
60577C76751J603K167K791L568L700L155L293M951P034Q081Q281Q845J0019J1016
60563D55255J1382J1291J0674R292P575O295N277L459N13k533m557n533n978o031
60549D96381n591m794l783k326k24K067L833M944N904P135Q627J0275J2076J3851
$$ plain form
60535 548375 563454 578687 592957 605577 616358 625229 631850 635686 636572 635128 632358 628813 624294
60522 624294 618545 611949 605328 599092 592972 586715 580831 576364 573866 572823 572236 571705 571701 572819 575096
60507 575096 578247 582281 587493 594001 601850 611682 624762 641980 663087 687268 714172 744007 776834
60494 776834 812318 850111 889936 931136 972500 1012704 1050531 1084576 1113157 1134823 1148638
60483 1148638 1153762 1149185 1134399 1110216 1078412 1040582 997679 950679 901286 851706 803875 759004
60471 759004 717682 680178 646608 616892 590696 567597 547350 529853 514808 501632 489918
60460 489918 479804 471557 464831 458663 452311 445878 440006 435106 431038 427418 424030 420856 417862 414902
60446 414902 411911 409062 406535 404207 401796 399325 397172 395582 394448 393665 393354 393449 393520 393393 393595 394630
$$ packed form
60535E48375J5079J5233J4270J2620J0781Q871O621L836Q86j444k770l545m519
60522F24294n749o596o621o236o120o257n884m467k498j043n87n31mJ118K277
60507E75096L151M034N212O508P849R832J3080J7218K1107K4181K6904K9835L2827
60494G76834L5484L7793L9825M1200M1364M0204L7827L4045K8581K1666J3815
60483A148638N124m577j4786k4183l1804l7830m2903m7000m9393m9580m7831m4871
60471G59004m1322l7504l3570k9716k6196k3099k0247j7497j5045j3176j1714
60460D89918j0114q247o726o168o352o433n872m900m068l620l388l174k994k960
60446D14902k991k849k527k328k411k471k153j590j134p83l11R5P1j27K02J035
$$ plain form
60430 394630 396026 396755 396477 395759 395069 394301 393420 392842 392789 392866 392701 392489 392472 392409 392097 392005 392717 393959 394852 395046
60410 395046 395031 395330 395960 396769 397792 399065 400492 402105 404180 406877 409949 412889 415180 416430 416568 416121
60394 416121 416050 417096 419254 421895 424331 426325 428200 430455 433169 435912 438410 441043 444293 447794 450469
60379 450469 451700 451998 452410 453630 455769 458529 461280 463365 464721 466040 468111 471120 474727 478432 481632
60364 481632 483699 484491 484577 484568 484384 483559 482128 480745 480020 480178 481353 483735 487298 491731 496706 501932 506960
60347 506960 511376 515333 519538 524461 529793 534794 538942 542106 544353 545780 546353 545780 543720 540211 535701
60332 535701 530612 525170 519707 514757 510646 507309 504651 502631 500757 498072 494174 489908 486376 483554
60318 483554 480550 477119 474133 472405 471789 471786 472455 474318 477690 482530 488706 496042 504327 513648 524569
$$ packed form
60430C94630J396P29k78p18o90p68q81n78n3P7j65k12j7o3l12r2P12J242Q93J94
60410C95046j5K99O30Q09J023J273J427J613K075K697L072K940K291J250J38m47
60394D16121p1J046K158K641K436J994J875K255K714K743K498K633L250L501K675
60379D50469J231K98M12J220K139K760K751K085J356J319K071L009L607L705L200
60364D81632K067P92Q6rj84q25j431j383p25J58J175K382L563M433M975N226N028
60347E06960M416L957M205M923N332N001M148L164K247J427N73n73k060l509m510
60332E35701n089n442n463m950m111l337k658k020j874k685l898m266l532k822
60318D83554l004l431k986j728o16lO69J863L372M840O176P336Q285R321J0921
$$ plain form
60303 524569 537629 552643 568787 585367 602224 619309 635996 650914 662405 669283 671280 668788
60291 668788 662133 651257 636277 618211 598887 580024 562513 546594 532487 520629 511301 504240
60279 504240 498740 494167 490283 487085 484484 482249 480146 477988 475588 472826 469713 466322 462750 459328
60265 459328 456697 455288 454746 454175 452980 451171 448872 446118 443330 441399 440762 440741 440314 439353 438535 438225
60249 438225 438124 438066 438429 439399 440372 440613 440252 440140 440784 441855 442829 443687 444737 445975 446922 447172 446884 446682
60231 446682 447170 448582 450692 452898 454569 455616 456659 458379 460721 463030 464975 466871 469012 471196
60217 471196 473252 475581 478711 482539 486511 490378 494307 498366 502459 506759 511697 517409 523648 530279
60203 530279 537377 544695 551568 557583 562997 568196 573153 577662 581756 585525 588831 591630 594367 597596
$$ packed form
60303E24569J3060J5014J6144J6580J6857J7085J6687J4918J1491O878J997k492
60291F68788o655j0876j4980j8066j9324j8863j7511j5919j4107j1858r328p061
60279E04240n500m573l884l198k601k235k103k158k400k762l113l391l572l422
60265D59328k631j409n42n71j195j809k299k754k788j931o37k1m27r61q18l10
60249D38225j01n8L63R70R73K41l61j12O44J071R74Q58J050J238R47K50k88k02
60231D46682M88J412K110K206J671J047J043J720K342K309J945J896K141K184
60217D71196K056K329L130L828L972L867L929M059M093M300M938N712O239O631
60203E30279P098P318O873O015N414N199M957M509M094L769L306K799K737L229
$$ plain form
60189 597596 601290 604845 607676 609410 609642 608030 604828 600989 597447 594383 591257 587441 582739 577461
60175 577461 572173 567377 563317 559992 557242 554781 552278 549509 546441 543118 539580 536030 532962 530866
60161 530866 529734 529005 528083 526815 525452 524255 523342 522792 522688 522940 523227 523283 523191 523257 523665 524464 525865 528219
60143 528219 531490 535050 538267 541168 544213 547589 551126 554867 559159 564003 568731 572697 576030 579308
60129 579308 582622 585382 587127 588250 589661 591801 594163 595850 596532 596713 597043 597632 598176 598593 599173 600201
60113 600201 601777 604047 607210 611095 615018 618248 620462 621659 621936 621515 620708 619549 617718 615139 612437
60098 612437 610468 609428 608714 607610 605879 603775 601793 600407 599812 599800 599986 600109 600121 600204 600839 602578 605385
60081 605385 608355 610472 611612 612446 613372 613954 613536 612011 609782 607168 604076 600097 594774 587900 579811
$$ packed form
60189E97596L694L555K831J734K32j612l202l839l542l064l126l816m702n278
60175E77461n288m796m060l325k750k461k503k769l068l323l538l550l068k096
60161E30866j132p29r22j268j363j197r13n50j04K52K87N6r2O6M08P99J401K354
60143E28219L271L560L217K901L045L376L537L741M292M844M728L966L333L278
60129E79308L314K760J745J123J411K140K362J687O82J81L30N89N44M17N80J028
60113F00201J576K270L163L885L923L230K214J197K77m21q07j159j831k579k702
60098F12437j969j040p14j104j731k104j982j386n95j2J86J23J2Q3O35J739K807
60081F05385K970K117J140Q34R26N82m18j525k229k614l092l979n323o874q089
$$ plain form
60066 579811 571328 563270 555932 548994 541914 534434 526827 519675 513354 507760 502600 497868 493880 490802
60052 490802 488311 485844 483185 480742 479236 479033 479738 480554 481113 481910 483845 487376 492158 497337 502100
60037 502100 506102 509601 513193 517236 521539 525597 528964 531313 532384 532188 531174 529850 528217 525797
60023 525797 522173 517321 511483 505018 498349 491779 485315 478929 472969 467969 463966 460370 456651 452829
60009 452829 449102 445346 441354 437356 433889 431202 429114 427537 426764 427058 428126 429285 430088 430558 430798
59994 430798 430699 430267 430012 430647 432395 434961 438154 442085 446589 450940 454540 457511 460202 462478 464067
59979 464067 465303 466771 468306 469132 469086 468878 468890 468432 466753 464186 461679 459621 457791 456148 454841 453543
59963 453543 451611 449184 447529 447875 450172 453321 456335 458940 461223 463169 464741 466105 467494 468895
$$ packed form
60066E79811q483q058p338o938p080p480p607p152o321n594n160m732l988l078
60052D90802k491k467k659k443j506k03P05Q16N59P97J935L531M782N179M763
60037E02100M002L499L592M043M303M058L367K349J071j96j014j324j633k420
60023E25797l624m852n838o465o669o570o464o386n960n000m003l596l719l822
60009D52829l727l756l992l998l467k687k088j577p73K94J068J159Q03M70K40
59994D30798r9m32k55O35J748K566L193L931M504M351L600K971K691K276J589
59979D64067J236J468J535Q26m6k08J2m58j679k567k507k058j830j643j307j298
59963D53543j932k427j655L46K297L149L014K605K283J946J572J364J389J401
$$ plain form
59949 468895 470065 470905 471659 472611 473749 474843 475762 476531 477172 477718 478269 478728 478556 477157 474597 471602 468778
59932 468778 466170 463710 461633 460155 459093 458128 457196 456267 455082 453555 452230 451854 452605 454233 456821
59917 456821 460739 465724 470582 474220 476715 479161 482660 487614 493676 500102 506227 511835 517032 521764
59903 521764 525678 528558 530668 532435 533934 534860 534923 534113 532678 530978 529324 527874 526779 526445 527344 529384
59887 529384 531747 533694 535424 537746 540970 544552 547949 551367 555299 559581 563372 566106 568133 570215
59873 570215 572592 574767 576143 576609 576431 575779 574570 572664 569996 566534 562400 558145 554593 552129 550316
59858 550316 548470 546551 545126 544564 544673 545247 546504 548772 552082 556394 561932 568822 576568 584361 591887
59843 591887 599308 606353 611900 614810 614932 613129 610524 607927 605744 604044 602609 601057 598876 595459
$$ packed form
59949D68895J170Q40P54R52J138J094R19P69O41N46N51M59j72j399k560k995k824
59932D68778k608k460k077j478j062r65r32r29j185j527j325l76P51J628K588
59917D56821L918M985M858L638K495K446L499M954O062O426O125N608N197M732
59903E21764L914K880K110J767J499R26O3q10j435j700j654j450j095l34Q99K040
59887E29384K363J947J730K322L224L582L397L418L932M282L791K734K027K082
59873E70215K377K175J376M66j78o52j209j906k668l462m134m255l552k464j813
59858E50316j846j919j425n62J09N74J257K268L310M312N538O890P746P793P526
59843E91887P421P045N547K910J22j803k605k597k183j700j435j552k181l417
$$ plain form
59829 595459 590411 584001 577126 570577 564533 558864 553700 549315 545591 541981 538024 533692 529296 525295
59815 525295 522089 519654 517365 514515 511146 508106 506245 505743 506271 507415 508755 509812 510237 510006 509281
59800 509281 508143 506603 504750 502693 500337 497424 493894 490176 487015 484891 483613 482524 481072 479110
59786 479110 476697 473927 471059 468554 466687 465244 463861 462532 461533 460977 460734 460674 460616 460115 458775 456843
59770 456843 455084 453957 453268 452735 452493 452846 453861 455424 457447 459792 462279 464892 467741 470639 473082
59755 473082 474906 476718 479385 483247 488044 493324 498689 503834 508721 513602 518676 523819 528796 533523
59741 533523 537984 542147 546146 550235 554215 557257 558712 558957 559078 559847 561299 563052 564582 565369 565320 565060
59725 565060 565357 566229 567028 567388 567678 568423 569687 571171 572568 573669 574353 574638 574612 574263 573585 572802 572246 572053
$$ packed form
59829E95459n048o410o875o549o044n669n164m385l724l610l957m332m396m001
59815E25295l206k435k289k850l369l040j861n02N28J144J340J057M25k31p25
59800E09281j138j540j853k057k356k913l530l718l161k124j278j089j452j962
59786D79110k413k770k868k505j867j443j383j329r99n56k43o0n8n01j340j932
59770D56843j759j127o89n33k42L53J015J563K023K345K487K613K849K898K443
59755D73082J824J812K667L862M797N280N365N145M887M881N074N143M977M727
59741E33523M461M163L999M089L980L042J455K45J21P69J452J753J530P87m9k60
59725E65060K97Q72P99L60K90P45J264J484J397J101O84K85k6l49o78p83n56j93
$$ plain form
59707 572053 572259 573094 574744 576775 578300 578951 579252 579809 580572 581314 582443 584644 587680 590232 591243 591172
59691 591172 591470 592904 594766 595883 595999 595809 595817 595744 595160 594209 593377 592857 592496 592122 591571 590567 588952 586841
59673 586841 584199 580513 575412 569487 563883 559046 554440 549533 544501 539795 535627 532151 529654 528223
59659 528223 527550 527315 527415 527644 527668 527638 528355 530326 532972 535241 536751 537900 539113 540543 542334 544573
59643 544573 546890 548466 548578 546949 543796 539796 535841 532337 528796 524534 519759 515563 512818 511460
59629 511460 510863 510439 509760 508566 506955 505300 503756 502067 500010 497786 495742 493916 492109 490211 488204
59614 488204 485943 483229 480163 477245 475024 473642 472796 472180 471912 472404 473729 475316 476517 477324 478170 479058
59598 479058 479339 478558 477188 476307 476647 478124 480016 481376 481503 480387 478689 477119 475853 474659 473377
$$ packed form
59707E72053K06Q35J650K031J525O51L01N57P63P42J129K201L036K552J011p1
59691E91172K98J434J862J117J16j90Qp3n84r51q32n20l61l74n51j004j615k111
59673E86841k642l686n101n925n604m837m606m907n032m706m168l476k497j431
59659E28223o73k35J00K29K4l0P17J971K646K269J510J149J213J430J791K239
59643E44573K317J576J12j629l153m000l955l504l541m262m775m196k745j358
59629E11460n97m24o79j194j611j655j544j689k057k224k044j826j807j898k007
59614D88204k261k714l066k918k221j382q46o16k68M92J325J587J201Q07Q46Q88
59598D79058K81p81j370q81L40J477J892J360J27j116j698j570j266j194j282
$$ plain form
59583 473377 472094 470992 470297 470189 470464 470361 469071 466470 463173 459971 457456 455982 455523 455519 455230 454335 452888
59566 452888 450881 448407 446253 445543 446424 447703 448273 448371 448831 449624 449966 449670 449491 450074 451349 453192 455957
59549 455957 459860 464314 468329 471384 473675 475832 478679 483014 489222 497134 506350 516525 527318 538425
59535 538425 549847 561776 574056 586033 597055 606600 613643 616607 614682 608916 601449 593950 587355
59522 587355 582635 580638 581017 582272 583301 584343 585987 587858 588813 588075 585648 581810 576695 570415 563290
59507 563290 555895 548851 542355 535863 528552 520274 511768 503802 496543 490042 484833 481349 478954 476299
59493 476299 472854 469555 467687 467479 468103 468795 469517 470553 471778 472664 472968 473189 474160 476191 478843 481595
59477 481595 484500 487976 492125 496569 500990 505533 510580 516257 522237 527894 532577 535872 537788 538726
$$ packed form
59583D73377j283j102o95j08K75j03j290k601l297l202k515j474m59mk89q95j447
59566D52888k007k474k154p10Q81J279N70R8M60P93L42k96j79N83J275J843K765
59549D55957L903M454M015L055K291K157K847M335O208P912R216J0175J0793J1107
59535E38425J1422J1929J2280J1977J1022R545P043K964j925n766p467p499o595
59522E87355m720j997L79J255J029J042J644J871R55p38k427l838n115o280p125
59507E63290p395p044o496o492p311q278q506p966p259o501n209l484k395k655
59493D76299l445l299j868k08O24O92P22J036J225Q86L04K21R71K031K652K752
59477D81595K905L476M149M444M421M543N047N677N980N657M683L295J916R38
$$ plain form
59463 538726 539234 539735 540391 541156 541974 543019 544741 547550 551512 556451 562300 569118 576732 584649 592517
59448 592517 600462 608697 616909 624375 630618 635602 639241 641169 641180 639523 636402 631532 624684 616456 607986
59433 607986 599944 592353 585350 579366 574314 569391 564238 559807 557428 557347 558808 561347 565245 570830 578134
59418 578134 587360 598964 612935 628559 645197 662884 681820 701759 722235 742928 763186 781471
59406 781471 795919 805448 809889 809159 802951 791577 776786 761341 747697 737048 729384 724128 720564
59393 720564 717794 714541 709227 700303 686721 668443 646857 624462 603629 585405 569650 556241
59381 556241 545659 538291 533642 530663 528677 527695 527984 529621 532362 535662 538884 541690 544182 546613
59367 546613 549157 552083 555828 560505 565504 569945 573600 577184 581787 588122 596105 604917 613652 622205
$$ packed form
59463E38726N08N01O56P65Q18J045J722K809L962M939N849O818P614P917P868
59448E92517P945Q235Q212P466O243M984L639J928J1j657l121m870o848q228q470
59433F07986q042p591p003n984n052m923n153m431k379q1J461K539L898N585P304
59418E78134R226J1604J3971J5624J6638J7687J8936J9939K0476K0693K0258J8285
59406G81471J4448R529M441p30o208j1374j4791j5445j3644j0649p664n256l564
59393G20564k770l253n314q924j3582j8278k1586k2395k0833j8224j5755j3409
59381E56241j0582p368m649k979j986r82K89J637K741L300L222K806K492K431
59367E46613K544K926L745M677M999M441L655L584M603O335P983Q812Q735Q553
$$ plain form
59353 622205 631373 641844 653342 665107 676936 689205 702094 715474 729562 744887 761294 777611
59341 777611 792751 806688 819895 832206 842780 850975 856706 860056 861141 860363 858208 854487 848217
59328 848217 838700 826547 813276 799926 786443 772430 758067 743959 730404 717333 704906 693628
59316 693628 683602 674197 664934 656429 649844 645449 642330 639658 637697 637229 638503 641194 645153 650568
59302 650568 657431 665330 673893 683050 692686 702302 711194 718756 724389 727306 726656 721919 713191 701322
59288 701322 687862 674536 662325 651098 640399 630516 622401 616526 612370 609310 607541 607604 609261
59275 609261 611522 613857 616835 621323 627520 635107 643909 653837 664301 674204 682778 690130 696872 703372
59261 703372 709411 714340 717461 718395 717229 714271 709659 703399 695845 687798 679834 671666 662555 652447
$$ packed form
59353F22205R168J0471J1498J1765J1829J2269J2889J3380J4088J5325J6407J6317
59341G77611J5140J3937J3207J2311J0574Q195N731L350J085p78k155l721o270
59328H48217r517j2153j3271j3350j3483j4013j4363j4108j3555j3071j2427j1278
59316F93628j0026r405r263q505o585m395l119k672j961m68J274K691L959N415
59302F50568O863P899Q563R157R636R616Q892P562N633K917o50m737q728j1869
59288G01322j3460j3326j2211j1227j0699r883q115n875m156l060j769O3J657
59275F09261K261K335K978M488O197P587Q802R928J0464R903Q574P352O742O500
59261G03372O039M929L121R34j166k958m612o260p554q047p964q168r111j0108
$$ plain form
59247 652447 642426 633856 627264 622217 618093 614673 612050 610361 609774 610475 612387 614985 617624 620049
59233 620049 622454 625070 627878 630721 633510 636162 638435 639984 640574 640197 638906 636574 632930 627973 622277
59218 622277 616630 611246 605581 599148 592372 586333 581721 578330 575549 573082 571064 569744 569242 569536 570583
59203 570583 572400 574922 577743 580176 581826 583021 584437 586320 588340 590071 591279 591797 591598 591064 590776
59188 590776 590895 591194 591801 593365 596147 599396 602090 604010 605644 607327 608985 610635 612532 614720 616824
59173 616824 618511 619977 621802 624453 627932 631897 636088 640653 645939 652031 658705 665827 673453 681376
59159 681376 688935 695591 701386 706472 710391 712239 711526 708559 704117 698979 693710 688491 683122 677371
59145 677371 671260 664879 658148 651112 644324 638498 633710 629229 624182 618260 611829 605612 600193 595568
$$ packed form
59247F52447j0021q570o592n047m124l420k623j689n87P01J912K598K639K425
59233F20049K405K616K808K843K789K652K273J549N90l77j291k332l644m957n696
59218F22277n647n384n665o433o776o039m612l391k781k467k018j320n02K94J047
59203E70583J817K522K821K433J650J195J416J883K020J731J208N18j99n34k88
59188E90776J19K99O07J564K782L249K694J920J634J683J658J650J897K188K104
59173F16824J687J466J825K651L479L965M191M565N286O092O674P122P626P923
59159F81376P559O656N795N086L919J848p13k967m442n138n269n219n369n751
59145F77371o111o381o731p036o788n826m788m481n047n922o431o217n419m625
$$ plain form
59131 595568 591187 586589 581937 577810 574647 572551 571389 570819 570457 570403 571362 573851 577487 581505 585780
59116 585780 590804 596765 603305 610227 617833 626363 635534 644820 653807 662187 669764 676606 682830 688239
59102 688239 692587 696237 699983 704024 707596 709937 711166 711905 712387 712285 711188 708925 705647 701884 698391
59087 698391 695691 693797 692373 690935 688927 686007 682462 678933 675550 671611 666397 659922 652633 644769
59073 644769 636434 628043 620193 613180 606980 601596 597050 593063 589141 585040 580974 577280 574034 571022
59059 571022 567940 564621 561185 557952 555165 552823 550844 549272 548199 547460 546544 544929 542641 540461 539349
59044 539349 539512 540212 540674 540960 541605 542570 543068 542491 541095 539693 539043 539587 541354 543898 546668 549628 553193
59027 553193 557461 561919 566115 570208 574632 579580 585150 591627 599253 607913 617330 627288 637363 646772
$$ packed form
59131E95568m381m598m652m127l163k096j162n70l62n4R59K489L636M018M275
59116E85780N024N961O540O922P606Q530R171R286Q987Q380P577O842O224N409
59102F88239M348L650L746M041L572K341J229P39M82j02j097k263l278l763l493
59087F98391k700j894j424j438k008k920l545l529l383l939n214o475p289p864
59073F44769q335q391p850p013o200n384m546l987l922m101m066l694l246l012
59059E71022l082l319l436l233k787k342j979j572j073p39r16j615k288k180j112
59044E39349J63P00M62K86O45R65M98n77j396j402o50N44J767K544K770K960L565
59027E53193M268M458M196M093M424M948N570O477P626Q660R417R958J0075R409
$$ plain form
59013 646772 654909 661869 668030 673269 676947 678634 678557 677410 675926 674529 673214 671807 670507 669985 670805
58998 670805 672979 676230 680407 685344 690565 695478 699788 703558 707030 710508 714058 717117 718820 719056
58984 719056 718777 718827 718811 717696 715194 711919 708446 705038 702273 701121 702078 704795 708799 714124 720967 729191
58968 729191 738560 749144 761095 774121 787471 800430 812764 824721 836638 848418 859430 868999
58956 868999 876894 883107 887311 888938 887828 884338 878679 870598 859980 847417 833763 819346 804035
58943 804035 788051 772226 757378 743745 731173 719598 709089 699637 691295 684422 679382 675864
58931 675864 672903 669842 666962 664828 663258 661528 659479 657810 657060 656785 656081 654587 652689 650955 649651
58916 649651 648673 647761 646942 646810 648022 650417 653003 655053 656845 659076 662021 665639 670048 675358 681427
$$ packed form
59013F46772Q137O960O161N239L678J687p7j147j484j397j315j407j300n22Q20
58998F70805K174L251M177M937N221M913M310L770L472L478L550L059J703K36
58984G19056k79N0j6j115k502l275l473l408k765j152R57K717M004N325O843Q224
58968G29191R369J0584J1951J3026J3350J2959J2334J1957J1917J1780J1012R569
58956H68999P895O213M204J627j110l490n659q081j0618j2563j3654j4417j5311
58943H04035j5984j5825j4848j3633j2572j1575j0509r452q342o873n040l518
58931F75864k961l061k880k134j570j730k049j669p50k75p04j494j898j734j304
58916F49651r78r12q19j32J212K395K586K050J792K231K945L618M409N310O069
$$ plain form
58901 681427 688397 697162 708587 722320 737057 751920 766912 782024 796697 810482 823632 836749
58889 836749 850260 864542 880097 897203 915633 934973 954961 975228 995010 1013407 1029745
58878 1029745 1043478 1054011 1061000 1064716 1065712 1064088 1059370 1051226 1040132 1027189 1013311 998652 982869
58865 982869 965954 948706 932309 917494 904200 891949 880315 869066 858112 847468 837126
58854 837126 826870 816325 805277 793803 782077 770222 758486 747388 737409 728572 720502 712897
58842 712897 705706 698827 691916 684757 677703 671393 666002 661014 655829 650321 644670 638972 633344 628136
58828 628136 623634 619706 616158 613310 611742 611512 612130 613273 614931 616834 618545 620404 623640 628885 635123
58813 635123 640702 645086 648994 653087 657184 660748 663605 666036 668437 670847 672660 672986 671573 669144
$$ packed form
58901F81427O970Q765J1425J3733J4737J4863J4992J5112J4673J3785J3150J3117
58889H36749J3511J4282J5555J7106J8430J9340J9988K0267J9782J8397J6338
58878A029745J3733J0533O989L716R96j624m718q144j1094j2943j3878j4659j5783
58865I82869j6915j7248j6397j4815j3294j2251j1634j1249j0954j0644j0342
58854H37126j0256j0545j1048j1474j1726j1855j1736j1098r979q837q070p605
58842G12897p191o879o911p159p054o310n391m988n185n508n651n698n628n208
58828F28136m502l928l548k848j568k30O18J143J658J903J711J859L236N245O238
58813F35123N579M384L908M093M097L564K857K431K401K410J813L26j413k429
$$ plain form
58799 669144 666610 664175 661454 658086 653876 648719 642902 637185 632020 626898 621016 614484 608370 603624
58785 603624 600363 598094 596191 594324 592844 592613 594065 596677 599689 602928 606348 609214 610622 610647 610156
58770 610156 609610 608746 607270 604971 601285 595722 588887 582188 576351 570989 565709 560752 556356 552454 549309
58755 549309 547543 547113 547201 547595 549298 553051 557979 562464 565799 568308 570407 572365 574623 577540 581013
58740 581013 584922 589704 595850 603043 610354 617183 623517 629466 635106 640684 646450 652333 658163 664068
58726 664068 670194 676131 681116 684870 687898 691008 694812 699601 705232 711072 716336 720643 724218 727694
58712 727694 731855 737299 743897 750641 756342 760553 763626 765944 767338 767270 765332 761498 755976 748836 739734
58697 739734 728182 714220 698715 682773 666873 650758 634164 617518 601800 587744 575278
$$ packed form
58799F69144k534k435k721l368m210n157n817n717n165n122n882o532o114m746
58785F03624l261k269j903j867j480k31J452K612L012L239L420K866J408K5m91
58770F10156n46q64j476k299l686n563o835o699n837n362n280m957m396l902l145
58755E49309j766m30Q8L94J703L753M928M485L335K509K099J958K258K917L473
58740E81013L909M782O146P193P311O829O334N949N640N578N766N883N830N905
58726F64068O126N937M985L754L028L110L804M789N631N840N264M307L575L476
58712G27694M161N444O598O744N701M211L073K318J394o8j938l834n522p140r102
58697G39734j1552j3962j5505j5942j5900j6115j6594j6646j5718j4056j2466
$$ plain form
58686 575278 563905 553668 545424 539904 536659 534294 531735 528887 526040 523128 519851 516263 512903 510375
58672 510375 508880 508161 507934 508363 509966 512932 516888 521520 527039 533603 540703 547776 555072 563054 571080
58657 571080 577679 582163 585015 586489 585949 583154 579227 575506 572028 567928 562934 557768 553310 549908
58643 549908 547317 544830 541693 537798 533806 530401 527753 525926 525228 525751 527053 528769 531053 533882 536438
58628 536438 537887 538480 539249 540709 542385 543436 543347 542259 541120 541196 542987 545787 548749 551951 555939 560614
58612 560614 565361 570047 575163 580949 587016 592795 597820 601585 603721 604433 604339 603772 602554 600459 597630
58597 597630 594549 591839 589948 588769 587694 586305 584838 583722 583028 582746 583347 585581 589790 595733 602892
58582 602892 610671 618597 626700 635455 645014 654865 664589 674512 685107 696207 707444 718916 730578
$$ packed form
58686E75278j1373j0237q244n520l245k365k559k848k847k912l277l588l360k528
58672E10375j495p19k27M29J603K966L956M632N519O564P100P073P296P982Q026
58657E71080O599M484K852J474n40k795l927l721l478m100m994n166m458l402
58643E49908k591k487l137l895l992l405k648j827o98N23J302J716K284K829K556
58628E36438J449N93P69J460J676J051q9j088j139P6J791K800K962L202L988M675
58612E60614M747M686N116N786O067N779N025L765K136P12r4n67j218k095k829
58597E97630l081k710j891j179j075j389j467j116o94k82O01K234M209N943P159
58582F02892P779P926Q103Q755R559R851R724R923J0595J1100J1237J1472J1662
$$ plain form
58569 730578 741325 749778 756137 762467 770987 782600 797043 813699 831964 851376 871698 892677
58557 892677 913706 934069 953417 971616 988167 1002214 1013156 1020863 1025337 1026601 1024859 1020459
58545 1020459 1013781 1005480 996562 987708 978669 968856 958283 947364 935923 923181 908738 892907
58533 892907 876054 858248 839728 821164 803266 786600 771880 759870 750706 743657 737808 732837
58521 732837 729067 726977 726607 727225 727705 727538 727318 727907 729316 730760 731593 731685 731089 729883 728358 726839 725271
58504 725271 723276 720587 717191 713284 709396 706265 704159 702539 700762 698797 696879 694966 693120 691896
58490 691896 691644 691852 691991 692549 694358 697325 700838 705103 710930 718308 726359 734767 744156 754967 766903
58475 766903 779579 792707 805535 817084 827096 835845 842952 847465 849254 849226 847806 844358 838497
$$ packed form
58569G30578J0747Q453O359O330Q520J1613J4443J6656J8265J9412K0322K0979
58557H92677K1029K0363J9348J8199J6551J4047J0942P707M474J264j742m400
58545A020459o678q301q918q854r039r813j0573j0919j1441j2742j4443j5831
58533H92907j6853j7806j8520j8564j7898j6666j4720j2010r164p049n849m971
58521G32837l770k090l70O18M80j67k20N89J409J444Q33R2n96j206j525j519j568
58504G25271j995k689l396l907l888l131k106j620j777j965j918j913j846j224
58490F91896k52K08J39N58J809K967L513M265N827P378Q051Q408R389J0811J1936
58475G66903J2676J3128J2828J1549J0012Q749P107M513J789k8j420l448n861
$$ plain form
58462 838497 831035 823176 815682 809224 804561 801837 800545 800615 802707 807033 812821 819420 826969 835442 844011
58447 844011 852023 859593 866416 870934 871712 869063 864469 858949 852797 846282 839589 832447 824783 817588
58433 817588 812444 810268 810950 813780 817643 821269 824121 826944 830934 836526 843385 851136 859448 867748
58419 867748 875484 882612 889262 895121 899576 902309 903353 902759 900619 897182 892619 886905 880248 873322
58405 873322 866689 860292 853897 847721 842243 837710 834246 832108 831350 831415 831499 831249 830916 831078 832461 835566
58389 835566 840059 844737 848543 851500 854387 857714 861329 864817 868021 871251 875126 880042 885720 891498
58375 891498 897032 902409 907697 912881 918282 924432 931439 938957 946878 955450 964689 974349 984561 995771
58361 995771 1007872 1020227 1032780 1046256 1060854 1075619 1089627 1102998 1116132 1128635 1139687
$$ packed form
58462H38497p462p859p494o458m663k724j292P0K092M326N788O599P549Q473Q569
58447H44011Q012P570O823M518P78k649m594n520o152o515o693p142p664p195
58433H17588n144k176O82K830L863L626K852K823L990N592O859P751Q312Q300
58419H67748P736P128O650N859M455K733J044n94k140l437m563n714o657o926
58405H73322o633o397o395o176n478m533l464k138p58O5Q4k50l33J62J383L105
58389H35566M493M678L806K957K887L327L615L488L204L230L875M916N678N778
58375H91498N534N377N288N184N401O150P007P518P921Q572R239R660J0212J1210
58361I95771J2101J2355J2553J3476J4598J4765J4008J3371J3134J2503J1052
$$ plain form
58350 1139687 1148950 1156484 1162252 1166366 1169531 1172747 1176694 1181578 1187194 1193011 1198768 1205115 1212992 1222320
58336 1222320 1232134 1242236 1253690 1267276 1282408 1298137 1314282 1330966 1347927 1364984 1382361
58325 1382361 1399871 1416521 1431670 1445780 1459321 1471674 1481945 1490214 1497239 1503592 1509809 1516691
58313 1516691 1524654 1533347 1542644 1553310 1565945 1579925 1594256 1608866 1624246 1640414 1657062 1674280
58301 1674280 1692360 1711296 1731019 1751588 1772672 1793629 1814659 1836933 1860900 1885367 1909164
58290 1909164 1932815 1957707 1984441 2012971 2043450 2075775 2108983 2142213 2175754 2210294 2245861
58279 2245861 2282435 2320685 2361038 2402731 2444916 2488022 2532938 2579583 2627453 2676982 2729132
58268 2729132 2784133 2841573 2901179 2962607 3025287 3089449 3156546 3227582 3301857 3378377 3457542
$$ packed form
58350A139687R263P534N768M114L165L216L947M884N616N817N757O347P877R328
58336A222320R814J0102J1454J3586J5132J5729J6145J6684J6961J7057J7377
58325A382361J7510J6650J5149J4110J3541J2353J0271Q269P025O353O217O882
58313A516691P963Q693R297J0666J2635J3980J4331J4610J5380J6168J6648J7218
58301A674280J8080J8936J9723K0569K1084K0957K1030K2274K3967K4467K3797
58290A909164K3651K4892K6734K8530L0479L2325L3208L3230L3541L4540L5567
58279B245861L6574L8250M0353M1693M2185M3106M4916M6645M7870M9529N2150
58268B729132N5001N7440N9606O1428O2680O4162O7097P1036P4275P6520P9165
$$ plain form
58257 3457542 3540228 3626106 3714271 3804803 3898387 3994965 4093926 4195074 4298506 4404359 4513469
58246 4513469 4627212 4745935 4868935 4996986 5133070 5279174 5434086 5596107 5766239
58237 5766239 5946774 6138354 6340664 6554559 6781204 7020475 7272636 7540423 7827079
58228 7827079 8133448 8459377 8806686 9178186 9575069 9998216 10451196 10939245 11466242
58219 11466242 12035433 12652184 13323234 14054252 14851205 15723461 16682839 17740772 18909651
58210 18909651 20206423 21652482 23271899 25093805 27156404 29506736 32199540 35302026
58202 35302026 38900705 43101859 48027527 53814042 60611272 68579033 77889210 88740928
58194 88740928 101371635 116033915 132931010 152140205 173567906 196962737 221965006
$$ packed form
58257C457542Q2686Q5878Q8165R0532R3584R6578R8961J01148J03432J05853J09110
58246D513469J13743J18723J23000J28051J36084J46104J54912J62021J70132
58237E766239J80535J91580K02310K13895K26645K39271K52161K67787K86656
58228G827079L06369L25929L47309L71500L96883M23147M52980M88049N26997
58219A1466242N69191O16751O71050P31018P96953Q72256R59378J057933J168879
58210A8909651J296772J446059J619417J821906K062599K350332K692804L102486
58202C5302026L598679M201154M925668N786515O797230P967761R310177J0851718
58194H8740928J2630707J4662280J6897095J9209195K1427701K3394831K5002269
$$ plain form
58187 221965006 248117494 274774244 300954764 325289373 346136277 361781840 370606495
58180 370606495 371265489 363017598 346128586 322025880 292980834 261490197 229750127
58173 229750127 199430347 171655748 147042407 125763998 107678416 92476165 79783195
58166 79783195 69212558 60400541 53033866 46852543 41637697 37207774 33421082 30168057
58158 30168057 27357360 24911885 22771875 20891059 19228294 17747057 16420176 15228142
58150 15228142 14152982 13178084 12292158 11487879 10757022 10090742 9483249 8930805 8427788
58141 8427788 7967404 7545248 7158520 6802585 6471784 6162832 5874171 5602863 5345398
58132 5345398 5100936 4870725 4654856 4452166 4262421 4085714 3920394 3764281 3617318
$$ packed form
58187B21965006K6152488K6656750K6180520K4334609K0846904J5645563Q824655
58180C70606495O58994q247891j6889012k4102706k9045046l1490637l1740070
58173B29750127l0319780k7774599k4613341k1278409j8085582j5202251j2692970
58166G9783195j0570637q812017p366675o181323n214846m429923l786692l253025
58158C0168057k810697k445475k140010j880816j662765j481237j326881j192034
58150A5228142j075160r74898q85926q04279p30857o66280o07493n52444n03017
58141H427788m60384m22156l86728l55935l30801l08952k88661k71308k57465
58132E345398k44462k30211k15869k02690j89745j76707j65320j56113j46963
$$ plain form
58123 3617318 3480488 3352877 3232411 3118750 3012750 2913559 2818886 2727891 2641417 2559722
58113 2559722 2482192 2408909 2340237 2275123 2211978 2150994 2093686 2040418 1990201 1942407 1896804
58102 1896804 1852427 1808441 1765648 1725242 1686556 1648001 1609591 1572401 1536107 1499416 1462635
58091 1462635 1427490 1394531 1362970 1333010 1306010 1282093 1259688 1237789 1216807 1196923 1177502
58080 1177502 1158407 1140130 1122324 1103867 1084675 1065799 1047478 1028736 1009204 989685 970619
58069 970619 951699 933315 916640 901677 886804 870979 854990 839888 825594 811769 798793
58058 798793 787041 776260 766343 757777 750557 743552 735582 726528 716956 707364 698135 689519 681320 673260
58044 673260 665708 659244 653470 647293 640561 634330 629154 624221 618568 612187 605432 598352 591192 584638
$$ packed form
58123C617318j36830j27611j20466j13661j06000r9191r4673r0995q6474q1695
58113B559722p7530p3283o8672o5114o3145o0984n7308n3268n0217m7794m5603
58102A896804m4377m3986m2793m0406l8686l8555l8410l7190l6294l6691l6781
58091A462635l5145l2959l1561k9960k7000k3917k2405k1899k0982j9884j9421
58080A177502j9095j8277j7806j8457j9192j8876j8321j8742j9532j9519j9066
58069I70619j8920j8384j6675j4963j4873j5825j5989j5102j4294j3825j2976
58058G98793j1752j0781r917q566p220p005p970r054r572r592r229q616q199q060
58044F73260p552o464n774o177o732o231n176m933n653o381o755p080p160o554
$$ plain form
58030 584638 578790 572517 564520 554680 543921 533216 523091 513649 504668 495957 487824 480847 475110
58017 475110 470115 465448 461054 456838 452623 448540 444873 441492 438013 434518 431498 429126 427270 426104
58003 426104 425911 426301 426519 426592 427262 428683 430075 430892 431413 431874 431907 431239 430171 428949 427338 425213 422963
57986 422963 420969 419271 417984 417415 417444 417373 416676 415362 413420 410563 406788 402597 398426 394408 390795 387892
57970 387892 385384 382545 379420 377029 376027 375914 375989 376331 377280 378582 379711 380558 381259 381710 381788 381779 382160 383127
57952 383127 384464 385599 385725 384466 382599 381572 382051 383485 385223 387361 390151 393349 396698 400477 405043
57937 405043 410292 416085 422732 430473 438854 447139 455060 462723 470054 476762 482614 487345 490531 491857
57923 491857 491299 488880 484567 478610 471616 464075 456189 448288 440792 433532 425730 417101 408443 400630
$$ packed form
58030E84638n848o273p997r840j0759j0705j0125r442q981q711q133o977n737
58017D75110m995m667m394m216m215m083l667l381l479l495l020k372j856j166
58003D26104j93L90K18P3O70J421J392Q17N21M61L3o68j068j222j611k125k250
57986D22963j994j698j287n69K9p1o97j314j942k857l775m191m171m018l613k903
57970C87892k508k839l125k391j002j13P5L42R49J302J129Q47P01M51P8rL81R67
57952C83127J337J135J26j259j867j027M79J434J738K138K790L198L349L779M566
57937D05043N249N793O647P741Q381Q285P921P663P331O708N852M731L186J326
57923D91857n58k419m313n957o994p541p886p901p496p260p802q629q658p813
$$ plain form
57909 400630 393578 386786 380392 374997 370784 367446 364723 362394 359968 357106 354250 352164 350919 349912
57895 349912 348941 348542 349016 349726 349818 349383 349386 350501 352437 354582 356979 360208 364299 368294 371212 373120 374771
57878 374771 376358 377178 376523 374433 371509 368395 365530 362974 360310 357071 353301 349394 345480 341488 337753
57863 337753 334838 332596 330120 326963 323812 321590 320439 320049 320462 321943 324312 326958 329410 331627 333811
57848 333811 336185 338822 341527 343980 346026 347590 348488 348707 348756 349159 349597 349236 347964 346517 345255 343706
57832 343706 341691 339972 339213 339034 338845 338926 339886 341545 343157 344443 345680 347055 348647 350745 353546 356734
57816 356734 359986 363564 367729 371791 374565 375674 375691 375044 373527 370911 367332 362896 357495 351315 345114
57801 345114 339697 335310 331580 327898 323903 319817 316279 313733 312099 311128 310677 310426 309789 308623 307627
$$ packed form
57909D00630p052o792o394n395m213l338k723k329k426k862k856k086j245j007
57895C49912r71l99M74P10R2m35LJ115J936K145K397L229M091L995K918J908J651
57878C74771J587Q20o55k090k924l114k865k556k664l239l770l907l914l992l735
57863C37753k915k242k476l157l151k222j151l90M13J481K369K646K452K217K184
57848C33811K374K637K705K453K046J564Q98K19M9M03M38l61j272j447j262j549
57832C43706k015j719p59j79j89Q1R60J659J612J286J237J375J592K098K801L188
57816C56734L252L578M165M062K774J109J7o47j517k616l579m436n401o180o201
57801C45114n417m387l730l682l995m086l538k546j634r71m51k51o37j166r96
$$ plain form
57786 307627 307481 307891 308169 308466 309629 311872 314396 316496 318397 320740 323793 327428 331509 336001 340908
57771 340908 346227 351789 357150 361858 365748 368740 370554 371053 370769 370513 370379 369592 367474 364255 360860
57756 360860 358167 356463 355274 353773 351666 349633 348515 348197 347893 347444 347616 348851 350424 351227 350877 349611
57740 349611 347555 344737 341620 339000 337254 336043 334803 333249 331385 329343 327447 326237 326168 327223 328895
57725 328895 330549 331768 332361 332351 332062 332012 332351 332504 331739 330144 328636 327877 327618 327261 326575 325521 323856
57708 323856 321505 319064 317239 315897 314270 312136 310172 308994 308401 307907 307618 308116 309559 311286 312450
57693 312450 312939 313454 314610 316083 316875 316426 315112 313533 311750 309537 307068 305004 304102 305117 308774
57678 308774 315278 323933 333773 344646 357442 373417 393619 418609 448053 480660 515175 551565
$$ packed form
57786C07627j46M10K78K97J163K243K524K100J901K343L053L635M081M492M907
57771C40908N319N562N361M708L890K992J814M99k84k56j34p87k118l219l395
57756C60860k693j704j189j501k107k033j118l18l04m49J72J235J573Q03l50j266
57740C49611k056k818l117k620j746j211j240j554j864k042j896j210o9J055J672
57725C28895J654J219N93j0k89n0L39J53p65j595j508p59k59l57o86j054j665
57708C23856k351k441j825j342j627k134j964j178n93m94k89M98J443J727J164
57693C12450M89N15J156J473P92m49j314j579j783k213k469k064r02J015L657
57678C08774O504Q655R840J0873J2796J5975K0202K4990K9444L2607L4515L6390
$$ plain form
57666 551565 590589 631963 673399 711528 743217 765730 776389 772979 754742 722993 681007 633386
57654 633386 584969 539545 499116 464121 434186 408800 387733 371047 358637 349758 343219 338067
57642 338067 333906 330652 328383 327426 328117 330215 332822 335111 336871 338255 339298 339976 340484 341150 342073 343036
57626 343036 343745 344116 344368 344746 345094 344854 343752 342300 341178 340243 338707 336358 334010 332482 331643 330874
57610 330874 330013 329383 329096 328828 328220 327214 326083 325337 325393 325999 326181 325198 323514 322442 322749 323895 324682
57593 324682 324376 323069 321211 319090 316817 314673 313195 312691 312674 312151 310698 309058 308330 308688 309276 309381
57577 309381 309259 309549 310180 310288 309195 307109 304791 302854 301576 301146 301637 302688 303544 303593 302855 301862 301171
57560 301171 301012 301295 301878 302879 304606 307067 309654 311608 312790 313672 314634 315741 317246 319648 322872
$$ packed form
57666E51565L9024M1374M1436L8129L1689K2513J0659l410j8237l1749m1986m7621
57654F33386m8417m5424m0429l4995k9935k5386k1067j6686j2410q879o539n152
57642C38067m161l254k269r57O91K098K607K289J760J384J043O78N08O66R23R63
57626C43036P09L71K52L78L48k40j102j452j122r35j536k349k348j528q39p69
57610C30874q61o30k87k68o08j006j131p46N6O06J82r83j684j072L07J146P87
57593C24682l06j307j858k121k273k144j478n04j7n23j453j640p28L58N88J05
57577C09381j22K90O31J08j093k086k318j937j278m30M91J051Q56M9p38r93o91
57560C01171j59K83N83J001J727K461K587J954J182Q82R62J107J505K402L224
$$ plain form
57545 322872 325988 328320 330450 333439 337318 341067 344004 346420 348798 351146 353327 355467 357642 359542
57531 359542 360787 361363 361556 361675 361951 362421 362786 362686 362247 362017 362277 362758 363202 363819 364958 366654 368771
57514 368771 371298 374217 377263 380101 382559 384492 385616 385814 385553 385749 387158 389919 393543 397178 400026
57499 400026 401765 402742 403760 405542 408143 410773 412358 412475 411604 410422 409197 408138 407845 408751 410393
57484 410393 411994 413684 416338 420138 424177 427816 431569 436145 441306 446303 450908 455289 459233 462249
57470 462249 464319 465952 467551 469188 470970 473129 475754 478717 481793 484630 486804 488320 489836 491964
57456 491964 494457 496604 498356 500455 503363 506610 509519 512146 515133 518814 522851 526706 530189 533461
57442 533461 536728 540124 543848 548209 553438 559481 566014 572551 578562 583799 588625 593734 599237 604364
$$ packed form
57545C22872L116K332K130K989L879L749K937K416K378K348K181K140K175J900
57531C59542J245N76J93J19K76M70L65j00m39k30K60M81M44O17J139J696K117
57514C68771K527K919L046K838K458J933J124J98k61J96J409K761L624L635K848
57499D00026J739R77J018J782K601K630J585J17q71j182j225j059k93R06J642
57484D10393J601J690K654L800M039L639L753M576N161M997M605M381L944L016
57470D62249K070J633J599J637J782K159K625K963L076K837K174J516J516K128
57456D91964K493K147J752K099K908L247K909K627K987L681M037L855L483L272
57442E33461L267L396L724M361N229O043O533O537O011N237M826N109N503N127
$$ plain form
57428 604364 608503 612216 616568 621589 626253 630054 633727 638028 642671 647067 651425 656368 661892 667579
57414 667579 673568 680422 688033 695464 702068 708212 714666 721711 729063 736341 743323 749935 756147 761863
57400 761863 766884 771160 775077 779323 784399 790241 796326 802133 807648 813436 820073 827482 835080 842586
57386 842586 850312 858606 867440 876723 886504 896528 906109 914982 923914 933879 944852 955945 966505
57373 966505 976501 985968 994753 1002885 1010694 1018449 1026265 1034316 1042785 1051501 1059974 1067886 1075407 1083114
57359 1083114 1091721 1101527 1111862 1121439 1129757 1137893 1147396 1158616 1170632 1182471 1193738 1204310
57347 1204310 1214314 1224379 1235100 1246230 1257135 1268007 1279668 1292056 1303934 1314528 1324615
57336 1324615 1335483 1347609 1360820 1374932 1389517 1403718 1417190 1430781 1445440 1460771 1475488
$$ packed form
57428F04364M139L713M352N021M664L801L673M301M643M396M358M943N524N687
57414F67579N989O854P611P431O604O144O454P045P352P278O982O612O212N716
57400G61863N021M276L917M246N076N842O085N807N515N788O637P409P598P506
57386H42586P726Q294Q834R283R781J0024R581Q873Q932R965J0973J1093J0560
57373I66505R996R467Q785Q132P809P755P816Q051Q469Q716Q473P912P521P707
57359A083114Q607R806J0335R577Q318Q136R503J1220J2016J1839J1267J0572
57347A204310J0004J0065J0721J1130J0905J0872J1661J2388J1878J0594J0087
57336A324615J0868J2126J3211J4112J4585J4201J3472J3591J4659J5331J4717
$$ plain form
57325 1475488 1489137 1502514 1516448 1530963 1545776 1560934 1576592 1592604 1608670 1624717 1640897
57314 1640897 1657330 1673942 1690549 1707131 1724052 1741822 1760483 1779448 1798190 1816886 1836048
57303 1836048 1855739 1875639 1895821 1916856 1939003 1961708 1984214 2006361 2028489 2050773 2072985
57292 2072985 2094880 2116586 2138608 2161565 2185857 2211382 2237541 2263614 2289189 2314195 2338623
57281 2338623 2362436 2385816 2409298 2433448 2458404 2483829 2509255 2534374 2559120 2583712 2608670
57270 2608670 2634562 2661572 2689442 2717819 2746501 2775312 2804040 2832727 2861795 2891635 2922195
57259 2922195 2953191 2984553 3016362 3048479 3080626 3112816 3145396 3178639 3212555 3247115 3282403
57248 3282403 3318485 3355415 3393379 3432540 3472673 3513224 3553939 3595136 3637166 3679774 3722218
$$ packed form
57325A475488J3649J3377J3934J4515J4813J5158J5658J6012J6066J6047J6180
57314A640897J6433J6612J6607J6582J6921J7770J8661J8965J8742J8696J9162
57303A836048J9691J9900K0182K1035K2147K2705K2506K2147K2128K2284K2212
57292B072985K1895K1706K2022K2957K4292K5525K6159K6073K5575K5006K4428
57281B338623K3813K3380K3482K4150K4956K5425K5426K5119K4746K4592K4958
57270B608670K5892K7010K7870K8377K8682K8811K8728K8687K9068K9840L0560
57259B922195L0996L1362L1809L2117L2147L2190L2580L3243L3916L4560L5288
57248C282403L6082L6930L7964L9161M0133M0551M0715M1197M2030M2608M2444
$$ plain form
57237 3722218 3763906 3804701 3844635 3883650 3921737 3959157 3996257 4032977 4068781 4103209 4136403
57226 4136403 4168841 4200676 4231668 4261703 4290917 4319190 4346045 4371369 4395823 4420146 4444413
57215 4444413 4468395 4492314 4516742 4542021 4568307 4595924 4625054 4655208 4685550 4715642 4745289
57204 4745289 4773930 4800967 4826651 4851764 4876287 4899174 4919653 4937959 4954547 4969471 4983029
57193 4983029 4996206 5009725 5023137 5035491 5046574 5056927 5067006 5076944 5086947 5097249 5107737
57182 5107737 5118013 5127846 5137240 5146182 5154690 5163057 5171753 5181080 5191077 5201595 5212314 5222922 5233498
57169 5233498 5244507 5256222 5268377 5280688 5293454 5307317 5322548 5338807 5355465 5371923 5387769
57158 5387769 5402814 5416867 5429355 5439460 5446777 5451548 5454044 5454103 5451494 5446343 5438745 5428260 5414184
$$ packed form
57237C722218M1688M0795L9934L9015L8087L7420L7100L6720L5804L4428L3194
57226D136403L2438L1835L0992L0035K9214K8273K6855K5324K4454K4323K4267
57215D444413K3982K3919K4428K5279K6286K7617K9130L0154L0342L0092K9647
57204D745289K8641K7037K5684K5113K4523K2887K0479J8306J6588J4924J3558
57193D983029J3177J3519J3412J2354J1083J0353J0079R938J0003J0302J0488
57182E107737J0276R833R394Q942Q508Q367Q696R327R997J0518J0719J0608J0576
57169E233498J1009J1715J2155J2311J2766J3863J5231J6259J6658J6458J5846
57158E387769J5045J4053J2488J0105P317M771K496N9k609n151p598j0485j4076
$$ plain form
57145 5414184 5396141 5374065 5347896 5317779 5284436 5248996 5212552 5176166 5141033 5108165 5077965
57134 5077965 5050406 5025503 5003328 4983748 4966473 4951187 4937237 4923403 4908407 4891629 4873043
57123 4873043 4852652 4830437 4806851 4782997 4760287 4740112 4723720 4712059 4705569 4704201 4707579 4715323
57111 4715323 4727663 4745988 4772593 4809888 4860331 4927285 5015319 5129216 5273089 5450975 5668140
57100 5668140 5931754 6250914 6636493 7100435 7654557 8309859 9076436 9962764 10974442
57091 10974442 12114043 13381837 14774795 16284328 17896675 19595969 21364090 23176366
57083 23176366 25002874 26821393 28629041 30433461 32226155 33963573 35573322 36973934
57075 36973934 38086497 38835198 39151051 38985633 38324647 37189709 35629573 33710176 31508823
$$ packed form
57145E414184j8043k2076k6169l0117l3343l5440l6444l6386l5133l2868l0200
57134E077965k7559k4903k2175j9580j7275j5286j3950j3834j4996j6778j8586
57123D873043k0391k2215k3586k3854k2710k0175j6392j1661o490j368L378P744
57111D715323J2340J8325K6605L7295N0443O6954Q8034J13897J43873J77886K17165
57100E668140K63614L19160L85579M63942N54122O55302P66577Q86328J011678
57091A0974442J139601J267794J392958J509533J612347J699294J768121J812276
57083B3176366J826508J818519J807648J804420J792694J737418J609749J400612
57075C6973934J112563P48701L15853j65418o60986j134938j560136j919397k201353
$$ plain form
57066 31508823 29110914 26605779 24080319 21611764 19262140 17076212 15082169 13293216
57058 13293216 11709697 10322447 9116681 8074753 7177489 6405534 5741005 5168267 4673470
57049 4673470 4244183 3869802 3541734 3252701 2996186 2766903 2561428 2377720 2213925
57040 2213925 2067796 1937080 1820016 1715336 1622026 1539396 1467292 1405987 1355609 1315695
57030 1315695 1285428 1264365 1252768 1251195 1259729 1277288 1300991 1325768 1344735 1350462 1336643 1299652
57018 1299652 1239833 1161885 1073481 982540 895067 814803 743786 682567 630309 585553 547153
57007 547153 514352 486252 461767 440122 421021 404328 389888 377598 367268 358426 350606 343783
56995 343783 338182 333706 330001 327063 325331 325099 326277 328838 333018 338826 345828 353722 362664 372613
$$ packed form
57066C1508823k397909k505135k525460k468555k349624k185928j994043j788953
57058A3293216j583519j387250j205766j041928q97264p71955o64529n72738m94797
57049D673470m29287l74381l28068k89033k56515k29283k05475j83708j63795
57040B213925j46129j30716j17064j04680r3310q2630p2104o1305n0378l9914
57030A315695l0267k1063j1597j573Q534J7559K3703K4777J8967N727j3819l6991
57018A299652n9819p7948q8404r0941q7473q0264p1017o1219n2258m4756l8400
57007E47153l2801k8100k4485k1645j9101j6693j4440j2290j0330q842p820o823
56995C43783n601m476l705k938j732k32J178K561M180N808P002P894Q942R949
$$ plain form
56981 372613 382618 391292 397802 401871 402938 399945 392280 380541 366202 350843 335950 322940 312672
56968 312672 304886 298631 293504 290148 289383 291248 295266 301323 309677 320161 331941 344265 357014
56955 357014 370187 383115 394465 402860 407274 406968 401516 391056 376516 359566 342199 326096
56943 326096 312168 300691 291767 285485 281801 280741 282834 288861 298854 311671 325966 341324 358051
56930 358051 376023 394212 411233 425842 436717 442164 440490 430866 414005 392053 367658 342827
56918 342827 318564 295419 274026 254934 238268 223946 212001 202377 194594 187999 182309 177603
56906 177603 173936 171293 169763 169319 169537 169941 170618 172076 174558 177914 182053 187013 192623 198700 205654
56891 205654 214268 224693 236290 248699 262407 277792 294167 310357 325746 339987 351941 359760
$$ packed form
56981C72613J0005Q674O510M069J067k993p665j1739j4339j5359j4893j3010j0268
56968C12672p786o255n127l356p65J865M018O057Q354J0484J1780J2324J2749
56955C57014J3173J2928J1350Q395M414l06n452j0460j4540j6950j7367j6103
56943C26096j3928j1477q924o282l684j060K093O027R993J2817J4295J5358J6727
56930C58051J7972J8189J7021J4609J0875N447j674r624j6861k1952k4395k4831
56918C42827k4263k3145k1393j9092j6666j4322j1945r624p783o595n690m706
56906A77603l667k643j530m44K18M04O77J458K482L356M139M960N610O077O954
56891B05654Q614J0425J1597J2409J3708J5385J6375J6190J5389J4241J1954P819
$$ plain form
56879 359760 362286 359892 353838 345344 335545 325838 317673 311941 308811 308265 310606 316365 325873 339142
56865 339142 356153 377026 401776 430140 461842 496840 534814 574277 612525 646631 674290
56854 674290 693599 702540 699447 684306 659515 629198 597605 567877 541924 521099 506682 499627
56842 499627 500158 507999 522998 545261 574690 610786 653082 701386 755266 813394 873435 932228
56830 932228 985822 1029668 1059332 1071314 1063481 1035537 989773 931237 866413 801218 739965 685553
56818 685553 639825 603575 576807 559374 551240 552052 560884 576662 598642 626208 658424 694050
56806 694050 731794 770081 806450 837413 859102 868196 862489 841168 805140 757368 702585 646028
56794 646028 591874 542594 499596 464015 436555 416887 403853 396502 394535 397642 404904 415321
$$ packed form
56879C59760K526k394o054q494r799r707q165n732l130n46K341N759R508J3269
56865C39142J7011K0873K4750K8364L1702L4998L7974L9463L8248L4106K7659
56854F74290J9309Q941l093j5141k4791l0317l1593k9728k5953k0825j4417p055
56842D99627N31P841J4999K2263K9429L6096M2296M8304N3880N8128O0041N8793
56830I32228N3594M3846K9664J1982p833k7944m5764n8536o4824o5195o1253n4412
56818F85553m5728l6250k6768j7433q134Q12Q832J5778K1980K7566L2216L5626
56806F94050L7744L8287L6369L0963K1689R094n707k1321l6028m7772n4783n6557
56794F46028n4154m9280m2998l5581k7460j9668j3034p351j967L107P262J0417
$$ plain form
56782 415321 428628 444986 463786 483166 500847 515125 524845 528648 524725 511591 489200 459386
56770 459386 425216 389805 355506 323773 295318 270186 247956 228247 211038 196339 183669
56759 183669 172251 161791 152744 145639 140344 136233 132846 130077 127778 125565 123218 121088 119817 119563
56745 119563 119636 119080 117705 116333 115872 116247 116545 116216 115777 116068 117119 118069 118143 117337 116190 115213 114662 114568
56727 114568 114750 114913 114929 114987 115384 116183 117160 118038 118708 119252 119801 120393 120941 121314 121437 121311 121081 121129 121959 123767
56707 123767 126056 127874 128569 128278 127692 127436 127711 128357 129060 129505 129536 129335 129395 130117 131264 131996 131728 130941
56689 130941 130774 131682 132822 133091 132440 131762 131634 131759 131663 131388 131261 131300 131143 130393 128919 127008 125330 124464
56671 124464 124336 124346 124088 123640 123044 122052 120693 119649 119545 120127 120720 121367 122925 125934 129870 133714 136907
$$ packed form
56782D15321J3307J6358J8800J9380J7681J4278R720L803l923j3134k2391k9814
56770D59386l4170l5411l4299l1733k8455k5132k2230j9709j7209j4699j2670
56759A83669j1418j0460r047p105n295m111l387k769k299k213k347k130j271k54
56745A19563P3n56j375j372m61L75K98l29m39K91J051R50P4q06j147r77n51r4
56727A14568J82J63J6N8L97P99R77Q78O70N44N49N92N48L73J23j26k30M8Q30J808
56707A23767K289J818O95k91n86k56K75O46P03M45L1k01O0P22J147P32k68p87
56689A30941j67R08J140K69o51o78j28J25r6k75j27L9j57p50j474j911j678q66
56671A24464j28J0k58m48n96r92j359j044j04N82N93O47J558L009L936L844L193
$$ plain form
56654 136907 139589 142210 145190 148777 152904 157138 160915 163929 166288 168350 170399 172527 174699 176736
56640 176736 178217 178637 177960 176937 176500 176807 177193 177145 176926 177059 177541 177866 177545 176328 174267 171930 170314
56623 170314 169991 170407 170376 169243 167288 165186 163429 162202 161309 160218 158572 156704 155294 154455 153531 151917
56607 151917 149743 147602 145865 144431 143032 141635 140585 140257 140562 140985 141265 141688 142399 142829 142404 141592
56591 141592 141501 142455 143691 144551 145202 145892 146298 146185 146168 147130 149110 151276 152891 153895 154653 155517 156642
56574 156642 157959 159313 160741 162501 164720 167245 170014 173313 177440 182360 187947 194295 201431 208867
56560 208867 215899 222410 229132 237023 246474 257087 268007 278414 287666 295103 300016 302213 302582 302583
56546 302583 302980 303374 303048 301847 299971 297406 294089 290342 286597 282812 278616 273974 269341 265114 261233
$$ packed form
56654A36907K682K621K980L587M127M234L777L014K359K062K049K128K172K037
56640A76736J481M20o77j023m37L07L86m8k19J33M82L25l21j217k061k337j616
56623A70314l23M16l1j133j955k102j757j227q93j091j646j868j410q39r24j614
56607A51917k174k141j737j434j399j397j050l28L05M23K80M23P11M30m25q12
56591A41592r1R54J236Q60O51O90M06j13j7R62J980K166J615J004P58Q64J125
56574A56642J317J354J428J760K219K525K769L299M127M920N587O348P136P436
56560B08867P032O511O722P891R451J0613J0920J0407R252P437M913K197L69J
56546C02583L97L94l26j201j876k565l317l747l745l785m196m642m633m227l881
$$ plain form
56531 261233 257275 252749 247421 241635 236216 231704 227792 223794 219567 215575 212145 209156 206502 204399
56517 204399 202964 201816 200356 198359 196147 194226 192799 191628 190387 189172 188418 188261 188264 188063 187947 188349
56501 188349 188959 188973 188223 187431 187168 187133 186776 186185 185866 185981 186274 186613 187137 187863 188497 188731 188510 187993 187517
56482 187517 187570 188495 189982 191116 191205 190491 189824 189616 189458 188907 188379 188853 190684 193040 194681 195113 194868 194818
56464 194818 195394 196390 197329 198034 198893 200413 202428 203946 204029 202758 201157 200248 200437 201631 203443 205156
56448 205156 205946 205556 204613 203948 203709 203433 202991 202939 203693 204705 205026 204618 204507 205357 206402 206308 204872 203205
56430 203205 202301 202063 201981 202087 202747 203779 204389 203995 202822 201730 201627 202860 204874 206556 207230 207258 207434
56413 207434 207942 208256 207998 207431 207000 206747 206433 206004 205701 205790 206338 207180 208012 208578 208851 209077 209554 210370 211337
$$ packed form
56531B61233l958m526n328n786n419m512l912l998m227l992l430k989k654k103
56517B04399j435j148j460j997k212j921j427j171j241j215p54j57Lk01j16M02
56501A88349O10J4p50p92k63l5l57n91l19J15K93L39N24P26O34K34k21n17m76
56482A87517N3R25J487J134Q9p14o67k08j58n51n28M74J831K356J641M32k45n0
56464A94818N76R96R39P05Q59J520K015J518Q3j271j601r09J89J194J812J713
56448B05156P90l90r43o65k39k76m42n2P54J012L21m08j11Q50J045r4j436j667
56430B03205r04k38q2J06O60J032O10l94j173j092j03J233K014J682O74K8J76
56413B07434N08L14k58n67m31k53l14m29l03Q9N48Q42Q32N66K73K26M77Q16R67
$$ plain form
56394 211337 212199 212905 213636 214546 215577 216629 217755 218926 219691 219468 218304 216966 216125 215805 215844 216419 217650
56377 217650 219012 219769 219926 220222 221160 222515 223900 225350 227058 228877 230387 231391 232128 233011 234232 235572
56361 235572 236618 237179 237464 237762 238035 238010 237647 237359 237711 238915 240589 241980 242570 242553 242606 243167 244085 244976
56343 244976 245661 246177 246749 247896 250160 253420 256826 259740 262413 265420 268844 272511 276507 280827 284861
56328 284861 288010 290564 293207 295883 298070 300047 302797 306420 309722 311751 312821 313534 313698 312957 311757
56313 311757 310847 310315 309924 309978 310990 312673 314180 315302 316686 318783 321278 323758 326367 329474 333113
56298 333113 337094 341373 346009 350857 355503 359565 363042 366484 370728 376253 382679 389078 394868 400345
56284 400345 406244 412858 419719 426199 432357 439069 447190 456697 466828 477057 487683 499326 512114
$$ packed form
56394B11337Q62P06P31R10J031J052J126J171P65k23j164j338q41l20L9N75J231
56377B17650J362P57J57K96R38J355J385J450J708J819J510J004P37Q83J221J340
56361B35572J046N61K85K98K73k5l63k88L52J204J674J391N90j7N3N61R18Q91
56343B44976O85N16N72J147K264L260L406K914K673L007L424L667L996M320M034
56328B84861L149K554K643K676K187J977K750L623L302K029J070P13J64p41j200
56313C11757r10n32l91N4J012J683J507J122J384K097K495K480K609L107L639
56298C33113L981M279M636M848M646M062L477L442M244N525O426O399N790N477
56284D00345N899O614O861O480O158O712Q121R507J0131J0229J0626J1643J2788
$$ plain form
56271 512114 525638 539621 554294 570060 587010 605008 624173 645040 668113 693420 720779
56260 720779 750482 783411 820323 861318 906296 955712 1010463 1071184 1138121 1211791 1293310
56249 1293310 1383799 1483750 1593111 1711706 1839286 1975249 2118476 2267358 2419865 2573682
56239 2573682 2726323 2875099 3017049 3149170 3268641 3372628 3457989 3521658 3561522 3576647
56229 3576647 3566714 3531748 3472653 3391582 3291381 3174984 3045685 2907557 2764857 2620750
56219 2620750 2476906 2334381 2194661 2059807 1931762 1811671 1699808 1596054 1500349 1412621
56209 1412621 1332437 1258989 1191502 1129471 1072553 1020558 973626 931951 895041 861553 830267
56198 830267 801065 774574 750973 729627 709928 692017 676407 663124 651571 641161 631754 623412
$$ packed form
56271E12114J3524J3983J4673J5766J6950J7998J9165K0867K3073K5307K7359
56260G20779K9703L2929L6912M0995M4978M9416N4751O0721O6937P3670Q1519
56249A293310R0489R9951J09361J18595J27580J35963J43227J48882J52507J53817
56239B573682J52641J48776J41950J32121J19471J03987Q5361O3669L9864J5125
56229C576647r933l4966n9095q1071j00201j16397j29299j38128j42700j44107
56219B620750j43844j42525j39720j34854j28045j20091j11863j03754r5705q7728
56209A412621q0184p3448o7487o2031n6918n1995m6932m1675l6910l3488l1286
56198H30267k9202k6491k3601k1346j9699j7911j5610j3283j1553j0410r407q342
$$ plain form
56186 623412 616067 609595 604010 599224 594739 590086 585627 582440 581072 580795 580503 580023 579986 580650 581494 582014
56170 582014 582296 582676 583327 584488 586659 590256 595185 600924 606911 612801 618580 624544 631036 638285 646550
56155 646550 656202 667233 678945 690722 703063 717250 733917 752565 772693 794808 820042 849279
56143 849279 883064 921951 966469 1016865 1073085 1134865 1201772 1273326 1349062 1428089 1508601
56132 1508601 1588245 1665019 1737401 1803822 1862851 1914152 1958536 1996840 2029388 2056730 2079821
56121 2079821 2098678 2111489 2115944 2111205 2098090 2077747 2050854 2017773 1978650 1933311 1881555 1823598
56109 1823598 1759972 1691278 1618627 1544308 1471528 1403254 1341313 1286361 1238389 1197228 1162768
56098 1162768 1134737 1112406 1094779 1081099 1070908 1063671 1058776 1055931 1055069 1055779 1057345 1059489 1062562
$$ packed form
56186F23412p345o472n585m786m485m653m459l187j368k77k92m80l7O64Q44N20
56170E82014K82L80O51J161K171L597M929N739N987N890N779N964O492P249Q265
56155F46550R652J1031J1712J1777J2341J4187J6667J8648K0128K2115K5234K9237
56143H49279L3785L8887M4518N0396N6220O1780O6907P1554P5736P9027Q0512
56132A508601P9644P6774P2382O6421N9029N1301M4384L8304L2548K7342K3091
56121B079821J8857J2811M455m739j3115k0343k6893l3081l9123m5339n1756n7957
56109A823598o3626o8694p2651p4319p2780o8274o1941n4952m7972m1161l4460
56098A162768k8031k2331j7627j3680j0191p237m895k845q62P10J566K144L073
$$ plain form
56085 1062562 1066813 1072022 1077974 1084661 1091808 1098888 1105991 1114090 1123992 1135488 1147762 1160109 1171986
56072 1171986 1183144 1194143 1206175 1219899 1234958 1250842 1267558 1285110 1303145 1321593 1340942
56061 1340942 1361389 1382363 1403283 1424118 1444897 1465563 1486716 1509497 1534115 1559416 1584433
56050 1584433 1609382 1634568 1659543 1684094 1708815 1733843 1758359 1782497 1808340 1837523 1868951
56039 1868951 1900440 1931729 1964258 1998835 2035295 2073821 2114828 2157824 2201909 2247042 2293522
56028 2293522 2340870 2388728 2438212 2490734 2546042 2603165 2662594 2725455 2790972 2857097 2923724
56017 2923724 2993155 3067091 3145065 3226168 3310437 3398099 3489120 3584067 3683981 3788960 3898191
56006 3898191 4011665 4130479 4255189 4385359 4521072 4663571 4814033 4972848 5140240
$$ packed form
56085A062562M251N209N952O687P147P080P103Q099R902J1496J2274J2347J1877
56072A171986J1158J0999J2032J3724J5059J5884J6716J7552J8035J8448J9349
56061A340942K0447K0974K0920K0835K0779K0666K1153K2781K4618K5301K5017
56050A584433K4949K5186K4975K4551K4721K5028K4516K4138K5843K9183L1428
56039A868951L1489L1289L2529L4577L6460L8526M1007M2996M4085M5133M6480
56028B293522M7348M7858M9484N2522N5308N7123N9429O2861O5517O6125O6627
56017B923724O9431P3936P7974Q1103Q4269Q7662R1021R4947R9914J04979J09231
56006C898191J13474J18814J24710J30170J35713J42499J50462J58815J67392
$$ plain form
55997 5140240 5316416 5501180 5694762 5898939 6115826 6345624 6587164 6840639 7108203
55988 7108203 7391979 7693364 8014376 8357846 8726031 9120741 9544895 10002301 10496018
55979 10496018 11028889 11605731 12233009 12916482 13661478 14475701 15369652 16354391 17441589
55970 17441589 18646499 19989096 21492704 23184611 25099331 27280307 29780124 32663719
55962 32663719 36013595 39931286 44534951 49957948 56347520 63860321 72661543 82936823
55954 82936823 94905353 108803812 124826489 143046419 163366001 185530225 209185034
55947 209185034 233906935 259129219 283985171 307203344 327176334 342172283 350561973
55940 350561973 351028764 342851980 326261912 302632680 274255262 243734822 213361755
$$ packed form
55997E140240J76176J84764J93582K04177K16887K29798K41540K53475K67564
55988G108203K83776L01385L21012L43470L68185L94710M24154M57406M93717
55979A0496018N32871N76842O27278O83473P44996Q14223Q93951R84739J087198
55970A7441589J204910J342597J503608J691907J914720K180976K499817K883595
55962C2663719L349876L917691M603665N422997O389572P512801Q801222J0275280
55954H2936823J1968530J3898459J6022677J8219930K0319582K2164224K3654809
55947B09185034K4721901K5222284K4855952K3218173J9972990J4995949Q389690
55940C50561973M66791q176784j6590068k3629232k8377418l0520440l0373067
$$ plain form
55933 213361755 184772777 158930516 136254769 116773983 100268669 86399759 74796642
55926 74796642 65099551 56980866 50160179 44406546 39528552 35367075 31794996 28713251
55918 28713251 26040872 23709301 21663601 19861502 18267658 16850908 15586443 14455601
55910 14455601 13441674 12528460 11702991 10955981 10278540 9661207 9096660 8580296 8107257
55901 8107257 7671448 7268171 6895119 6549981 6229280 5930343 5652229 5393846 5152997
55892 5152997 4927995 4718488 4523926 4342641 4173084 4014709 3867174 3729802 3602034
55883 3602034 3483312 3372466 3268245 3170241 3078009 2989631 2902686 2816535 2732165 2650055 2569830
55872 2569830 2491802 2416967 2345249 2275342 2206532 2139265 2073905 2010438 1949431 1891684 1836786
$$ packed form
55933B13361755k8588978k5842261k2675747j9480786j6505314j3868910j1603117
55926G4796642r697091q118685o820687n753633m877994m161477l572079l081745
55918B8713251k672379k331571k045700j802099j593844j416750j264465j130842
55910A4455601j013927r13214q25469p47010o77441o17333n64547n16364m73039
55901H107257m35809m03277l73052l45138l20701k98937k78114k58383k40849
55892E152997k25002k09507j94562j81285j69557j58375j47535j37372j27768
55883C602034j18722j10846j04221r8004r2232q8378q6945q6151q4370q2110q0225
55872B569830p8028p4835p1718o9907o8810o7267o5360o3467o1007n7747n4898
$$ plain form
55861 1836786 1783627 1732467 1684745 1640587 1598271 1556718 1516812 1479556 1444410 1410268 1376848
55850 1376848 1344314 1312612 1281928 1252849 1225424 1198792 1172224 1145842 1120154 1095716 1073285
55839 1073285 1053149 1034105 1014290 993350 972709 953506 935585 918786 903657 890191 877214
55828 877214 863887 850686 838130 825748 813156 800985 789647 778163 765445 752056 739528
55817 739528 728391 717912 707383 696732 686132 675873 666382 657710 649276 640790 633126 627519 624072
55804 624072 621740 619699 618090 617467 618050 619638 621845 624272 626632 628774 630641 632294 633901 635364 636028
55789 636028 635282 633466 631647 630263 628564 625648 621514 616678 611238 604753 596679 586505 573821 558761
55775 558761 542292 525735 510131 496204 484605 475749 469511 465311 462457 460339 458499 456715 454939
$$ packed form
55861A836786n3159n1160m7722m4158m2316m1553l9906l7256l5146l4142l3420
55850A376848l2534l1702l0684k9079k7425k6632k6568k6382k5688k4438k2431
55839A073285k0136j9044j9815k0940k0641j9203j7921j6799j5129j3466j2977
55828H77214j3327j3201j2556j2382j2592j2171j1338j1484j2718j3389j2528
55817G39528j1137j0479j0529j0651j0600j0259r491q672q434q486p664n607l447
55804F24072k332k041j609o23N83J588K207K427K360K142J867J653J607J463O64
55789F36028p46j816j819j384j699k916m134m836n440o485q074j0174j2684j5060
55775E58761j6469j6557j5604j3927j1599q856o238m200k854k118j840j784j776
$$ plain form
55762 454939 453060 450784 447736 443588 438262 432191 426155 420546 415049 409411 404109 399611 395322 390202
55748 390202 384316 378699 373541 367611 360050 351828 344673 339097 334211 329114 323822 318991 315254 312797
55734 312797 311244 309929 308376 306423 303966 300950 297621 294357 291154 287656 283792 279914 276238 272608
55720 272608 268889 265113 261244 257416 254427 253212 253579 254243 254438 254808 256322 259038 262413 266087 269755
55705 269755 272863 275101 276791 278192 278881 278299 276476 273645 269694 264686 259467 254969 251203 247624 244243
55690 244243 241576 239641 237750 235443 233081 231438 231063 231963 233543 234931 235697 236166 236833 237850 239390
55675 239390 241968 245683 249429 251633 251769 250588 248926 246954 244602 242079 239779 238059 237225 237337 238008
55660 238008 238738 239455 240336 241187 241513 241279 241070 241338 241944 242631 243460 244461 245218 245234 244536 243560 242479 241026
$$ packed form
55762D54939j879k276l048m148n326o071o036n609n497n638n302m498m289n120
55748C90202n886n617n158n930p561q222p155n576m886n097n292m831l737k457
55734C12797j553j315j553j953k457l016l329l264l203l498l864l878l676l630
55720B72608l719l776l869l828k989j215L67O64J95L70J514K716L375L674L668
55705B69755L108K238J690J401O89n82j823k831l951n008n219m498l766l579l381
55690B44243k667j935j891k307k362j643l75R00J580J388P66M69O67J017J540
55675B39390K578L715L746K204J36j181j662j972k352k523k300j720q34J12O71
55660B38008P30P17Q81Q51L26k34k09K68O06O87Q29J001P57J6o98r76j081j453
$$ plain form
55642 241026 239031 236882 235164 233906 232405 229915 226352 222131 217514 212473 207159 202058 197436 192972
55628 192972 188225 183345 179005 175708 173355 171422 169477 167629 166497 166572 167551 168468 168490 167393 165380 162847
55612 162847 160398 158543 157126 155469 153245 150803 148478 146182 144008 142570 142163 142120 141612 140711 140001 139551
55596 139551 139018 138457 138218 138167 137831 137234 136811 136485 135675 134386 133489 133661 134676 136023 137542 139126 140471
55579 140471 141647 143407 146338 150014 153583 156976 160955 165976 171509 176577 180658 183955 187021 190272
55565 190272 193690 196839 199073 199817 198833 196388 193162 189756 186161 181762 176001 168980 161492 154551 148956
55550 148956 145027 142527 140813 139305 137949 137178 137346 138283 139526 140918 142696 144877 146918 148320 149345
55535 149345 150661 152363 153912 155066 156222 157561 158468 158298 157293 156169 155109 153784 152167 150633 149204
$$ packed form
55642B41026j995k149j718j258j501k490l563m221m617n041n314n101m622m464
55628A92972m747m880m340l297k353j933j945j848j132P5R79R17K2j097k013k533
55612A62847k449j855j417j657k224k442k325k296k174j438m07m3n08r01p10m50
55596A39551n33n61k39n1l36n97m23l26q10j289q97J72J015J347J519J584J345
55579A40471J176J760K931L676L569L393L979N021N533N068M081L297L066L251
55565A90272L418L149K234P44r84k445l226l406l595m399n761p021p488o941n595
55550A48956l929k500j714j508j356p71J68R37J243J392J778K181K041J402J025
55535A49345J316J702J549J154J156J339R07j70j005j124j060j325j617j534j429
$$ plain form
55520 149204 147306 144398 140470 135866 131066 126754 123664 122057 121581 121726 122178 122665 122808 122318 121143 119330
55504 119330 116977 114399 112064 110180 108582 107114 105894 105009 104184 102987 101337 99622 98376 97889 98051
55489 98051 98484 98876 99138 99187 98704 97462 95888 94937 95130 95953 96489 96480 96436 96784 97329 97677 97835 98072 98349 98319
55469 98319 97891 97424 97171 96855 96080 94933 93796 92743 91591 90447 89688 89285 88727 87828 87095 86977 87197
55452 87197 87260 87200 87337 87621 87808 88053 88724 89706 90445 90675 90608 90419 90063 89656 89510 89632 89598 89062 88051 86685
55432 86685 85047 83490 82621 82733 83607 85049 87151 89689 91750 92555 92492 92718 93736 94812 94955 94074 92913
55415 92913 92144 91887 92026 92556 93504 94766 96243 97892 99415 100089 99329 97360 94940 92497 90053 87993
55399 87993 87157 87695 88442 88091 86678 85297 84616 84424 84531 85239 86634 88061 88701 88343 87334 86127 85159
$$ packed form
55520A49204j898k908l928m604m800m312l090j607m76J45M52M87J43m90j175j813
55504A19330k353k578k335j884j598j468j220q85q25j197j650j715j246m87J62
55489I8051M33L92K62M9m83j242j574r51J93Q23N36rm4L48N45L48J58K37K77l0
55469I8319m28m67k53l16p75j147j137j053j152j144p59m03n58q99p33j18K20
55452H7197O3o0J37K84J87K45O71R82P39K30o7j89l56m07j46J22l4n36j011j366
55432H6685j638j557q69J12Q74J442K102K538K061Q05o3K26J018J076J43q81j161
55415I2913p69k57J39N30R48J262J477J649J523O74p60j969k420k443k444k060
55399H7993q36N38P47l51j413j381o81j92J07P08J395J427O40l58j009j207r68
$$ plain form
55382 85159 84917 85752 87642 90192 92740 94481 94870 94133 93184 92792 92934 93060 92754 91995 90933 89727 88624
55365 88624 87973 87977 88394 88629 88275 87552 87047 87050 87379 87877 88707 89932 91177 92029 92481 92631 92250 91101 89494
55346 89494 88072 87191 86957 87548 88893 90206 90584 90105 89699 89900 90345 90587 90646 90558 90046 88983 87628 86121
55328 86121 84317 82397 81049 80668 80867 81191 81761 82748 83681 83911 83430 82729 82133 81767 81838 82327 82594 81946
55310 81946 80590 79498 79280 79593 79667 79046 77772 76249 75057 74663 75148 76293 77833 79545 81244 82928
55294 82928 84850 87151 89425 90883 91080 90399 89791 90026 91083 92284 93039 93392 93696 93964 93948 93745 93778 94105
55276 94105 94303 94237 94311 94626 94490 93359 91821 91012 91285 92036 92663 93067 93277 93171 92668 91837 90790 89797 89377
55257 89377 89850 90802 91412 91345 90980 90784 90864 91140 91548 91916 91975 91630 91091 90673 90638 91129 92035 92948 93475 93571 93368
$$ packed form
55382H5159k42Q35J890K550K548J741L89p37r49l92J42J26l06p59j062j206j103
55365H8624o51MM17K35l54p23n05LL29M98Q30J225J245Q52M52J50l81j149j607
55346H9494j422q81k34N91J345J313L78m79m06K01M45K42N9q8n12j063j355j507
55328H6121j804j920j348l81J99L24N70R87R33K30m81p01n96l66P1M89K67o48
55310H1946j356j092k18L13P4o21j274j523j192l94M85J145J540J712J699J684
55294H2928J922K301K274J458J97o81o08K35J057J201P55L53L04K68j6k03L3L27
55276I4105J98o6P4L15j36j131j538q09K73P51O27M04K10j06n03q31j047r93m20
55257H9377M73R52O10o7l65j96Q0K76M08L68N9l45n39m18l5M91R06R13N27R6k03
$$ plain form
55236 93368 92856 92004 91041 90253 89628 89080 88825 89030 89172 88452 86986 85995 86451 87913 89066 89151 88595 88418
55218 88418 89255 90810 92093 92294 91544 90703 90430 90640 90845 90649 89861 88528 87139 86478 86955 88200 89486
55201 89486 90405 91028 91619 92441 93626 94998 96116 96656 96651 96227 95353 94051 92675 91628 90945 90384 89808 89182
55183 89182 88315 87060 85798 85311 85958 87206 88133 88244 87673 86875 86361 86573 87659 89303 90955 92265 93182
55166 93182 93705 93752 93347 92775 92460 92725 93579 94583 95043 94716 94318 94880 96399 97602 97391 96178 95266 95194
55148 95194 95321 94896 93842 92484 91227 90642 91167 92357 93057 92720 92002 91656 91457 90848 90070 89846 90297 91053
55130 91053 92215 94210 96654 98331 98633 98243 98033 97998 97779 97590 97904 98579 99001 98978 98892 98942 98797 98161 97291
55111 97291 96721 96655 96756 96473 95540 94299 93552 93937 95320 96879 97848 98089 97955 97738 97451 97081 96793 96749 96874
$$ packed form
55236I3368n12q52r63p88o25n48k55K05J42p20j466r91M56J462J153Q5n56j77
55218H8418Q37J555J283K01p50q41k73K10K05j96p88j333j389o61M77J245J286
55201H9486R19O23N91Q22J185J372J118N40nm24q74j302j376j047o83n61n76o26
55183H9182q67j255j262m87O47J248R27J11n71p98n14K12J086J644J652J310R17
55166I3182N23M7m05n72l15K65Q54J004M60l27l98N62J519J203k11j213r12p2
55148I5194J27m25j054j358j257n85N25J190P00l37p18l46j99o09p78k24M51P56
55130I1053J162J995K444J677L02l90k10l5k19j89L14O75M22k3q6N0j45o36q70
55111I7291n70o6J01k83r33j241p47L85J383J559R69K41j34k17k87l70k88m4J25
$$ plain form
55092 96874 96985 97146 97699 98904 100647 102542 104201 105372 105939 105926 105462 104739 104071 103864 104292 104980 105308 105164
55074 105164 105098 105585 106444 107243 108003 109076 110408 111277 110836 108861 106076 103826 103129 103785 104584 104594 103944 103161
55056 103161 102306 101322 100800 101489 103121 104568 105222 105490 105752 105686 105013 104238 104097 104689 105599 106446 106894 106563
55038 106563 105488 104391 103968 104137 104439 104898 105912 107388 108615 109003 108531 107436 105931 104320 103005 102227
55022 102227 102046 102542 103667 104856 105230 104433 103021 101797 101032 100537 100326 100811 102241 104141 105509 105689
55006 105689 105004 104412 104475 104849 104898 104607 104538 104996 105664 106166 106688 107765 109602 111798 113660 114646 114626 113887 112901
54987 112901 111976 111103 110131 109049 108078 107537 107602 108141 108753 109098 109192 109287 109514 109837 110383 111489 113209 114943
54969 114943 115844 115579 114496 113205 112265 112179 113206 114956 116490 117120 117043 116920 116977 116804 116049 114953 114016 113346
$$ packed form
55092I6874J11J61N53J205J743J895J659J171N67j3m64p23o68k07M28O88L28j44
55074A05164o6M87Q59P99P60J073J332Q69m41j975k785k250o97O56P99J0o50p83
55056A03161q55r84n22O89J632J447O54K68K62o6o73p75j41N92R10Q47M48l31
55038A06563j075j097m23J69L02M59J014J476J227L88m72j095j505j611j315p78
55022A02227j81M96J125J189L74p97j412j224p65m95k11M85J430J900J368J80
55006A05689o85n92O3L74M9k91o9M58O68N02N22J077J837K196J862R86k0p39r86
54987A12901r25q73r72j082r71n41O5N39O12L45R4R5K27L23N46J106J720J734
54969A14943R01k65j083j291r40q6J027J750J534O30p7j23N7j73p55j096r37o70
$$ plain form
54951 113346 112600 111607 110825 110973 112220 113875 115032 115461 115702 116286 117116 117727 117938 117979 118087 118230 118230 117950 117357
54932 117357 116596 116042 116088 116849 118177 119886 121725 123258 124194 124924 126307 128724 131724 134858 138464 143116
54916 143116 148509 153520 157448 160748 164306 168299 172030 174708 176109 176500 176161 175108 173136 169987 165510
54901 165510 159881 153784 148163 143589 139908 136717 133979 131855 130111 128287 126539 125712 126182 127119 127387
54886 127387 126862 126358 126494 127190 128176 129373 130615 131490 131764 131773 132200 133564 135981 139300 143378 148125 153265
54869 153265 158187 162352 165917 169557 173438 176728 178411 178236 176580 173781 170101 165958 161589 156737
54855 156737 151245 145683 140786 136490 132310 128513 125973 124848 124230 123275 121896 120167 117940 115390 113150
54840 113150 111459 109875 108259 107321 107613 108598 109289 109303 108737 107587 106015 104773 104607 105458 106755 108162
$$ packed form
54951A13346p46r93p82J48J247J655J157M29K41N84Q30O11K11M1J08J43%k80n93
54932A17357p61n54M6P61J328J709J839J533R36P30J383K417L000L134L606M652
54916A43116N393N011L928L300L558L993L731K678J401L91l39j053j972l149m477
54901A65510n629o097n621m574l681l191k738k124j744j824j748q27M70R37K68
54886A27387n25n04J36O96R86J197J242Q75K74RM27J364K417L319M078M747N140
54869A53265M922M165L565L640L881L290J683j75j656k799l680m143m369m852
54855A56737n492n562m897m296m180l797k540j125o18r55j379j729k227k550k240
54840A13150j691j584j616r38K92R85O91J4n66j150j572j242j66Q51J297J407
$$ plain form
54824 108162 109491 110268 110169 109617 109269 109118 108764 108356 108446 109044 109588 109902 110407 111278 112080 112443 112474 112303 111820
54805 111820 111140 110778 111017 111528 111908 112217 112639 112969 112878 112500 112386 112917 113957 115057 115839 116216 116372 116574
54787 116574 116991 117636 118316 118657 118435 118084 118558 120299 122553 124137 124782 125256 126243 127696 129345 131218 133383
54770 133383 135602 137607 139474 141501 143994 147315 151791 157266 163012 168393 173445 178544 183690 188417
54756 188417 192259 195014 196581 196802 195525 192767 188758 183851 178309 172226 165821 159740 154752 151054
54742 151054 148162 145573 143234 141164 139028 136535 134037 132266 131454 131067 130510 129750 129102 128659 128252 127947
54726 127947 128257 129676 132100 134924 137785 140923 144615 148514 151925 154647 157116 159695 162323 164992
54712 164992 167990 171232 173792 174654 173783 171965 169734 167003 163645 159798 155448 150397 144982 140300 137173
$$ packed form
54824A08162J329P77r9n52l48j51l54m08R0N98N44L14N05Q71Q02L63L1j71m83
54805A11820o80l62K39N11L80L09M22L30r1l78j14N31J040J100P82L77J56K02
54787A16574M17O45O80L41k22l51M74J741K254J584O45M74R87J453J649J873K165
54770A33383K219K005J867K027K493L321M476N475N746N381N052N099N146M727
54756A88417L842K755J567K21j277k758m009m907n542o083o405o081m988l698
54742A51054k892k589k339k070k136k493k498j771q12l87n57p60o48m43m07l05
54726A27947L10J419K424K824K861L138L692L899L411K722K469K579K628K669
54712A64992K998L242K560Q62q71j818k231k731l358l847m350n051n415m682l127
$$ plain form
54697 137173 135171 133231 131105 129671 129739 130965 132130 132158 130741 128325 125819 124112 123481 123402 123091 122292
54681 122292 121459 121201 121650 122403 122964 123157 123059 122590 121373 119235 116743 114864 113960 113516 113054 112916 113708 115268
54663 115268 116785 117755 118243 118245 117581 116561 116027 116307 116724 116587 116145 115943 115717 114713 112933 111272 110432 110315
54645 110315 110562 111055 111703 112246 112569 112879 113390 114128 115106 116355 117607 118350 118372 117951 117364 116570 115555 114587
54627 114587 113841 113157 112465 112097 112290 112645 112581 112137 111916 112339 113352 114713 116146 117309 118122 119041 120496
54610 120496 122025 122649 122253 121937 122568 123574 123755 122863 121631 120490 119148 117564 116424 116238 116531 116516 116152
54593 116152 115962 116084 116184 116192 116415 116761 116539 115409 114114 113821 114891 116617 117990 118478 118200 117730 117749 118609
54575 118609 120052 121349 121755 120977 119451 118190 118080 119117 120478 121404 121837 122172 122703 123460 124230 124530 123937
$$ packed form
54697A37173k002j940k126j434O8J226J165K8j417k416k506j707o31p9l11p99
54681A22292q33k58M49P53N61J93r8m69j217k138k492j879r04m44m62j38P92J560
54663A15268J517R70M88Ko64j020n34K80M17j37m42k02k26j004j780j661q40j17
54645A10315K47M93O48N43L23L10N11P38R78J249J252P43K2m21n87p94j015r68
54627A14587p46o84o92l68J93L55o4m44k21M23J013J361J433J163Q13R19J455
54610A20496J529O24l96l16O31J006J81q92j232j141j342j584j140j86K93j5l64
54593A16152j90J22J00QK23L46k22j130j295k93J070J726J373M88k78m70J9Q60
54575A18609J443J297M06p78j526j261j10J037J361R26M33L35N31P57P70L00n93
$$ plain form
54558 123937 122747 121942 122121 122807 123215 123346 123736 124453 125049 125393 125776 126199 126252 125901 125724 126132 126945 127983
54540 127983 129504 131650 133909 135549 136285 136252 135692 135012 134764 135156 135836 136425 136991 137636 137989 137617 136703 135793
54522 135793 135058 134273 133453 132916 132631 132041 130763 129165 127988 127535 127411 127004 126101 125026 124208 123721 123387
54505 123387 123230 123504 124149 124608 124490 124144 124217 124840 125682 126614 127801 129099 129969 130183 130154 130280 130294 129664 128445
54486 128445 127384 127193 128021 129591 131476 133057 133563 132544 130387 128110 126539 125838 125839 126528 127872 129433
54470 129433 130681 131717 133147 135055 136571 136863 136225 135693 135818 136335 136959 137829 139009 140100 140696 140889
54454 140889 140939 140747 140065 139120 138556 138662 139029 139184 139269 139778 140690 141250 140704 139059 136968 135098 133831 133424
54436 133424 133986 135199 136371 137021 137255 137414 137546 137527 137529 137976 138910 139767 139972 139606 139230 139178 139319 139559 140282
$$ packed form
54558A23937j190q05J79O86M08J31L90P17N96L44L83M23N3l51j77M08Q13J038
54540A27983J521K146K259J640P36l3n60o80k48L92O80N89N66O45L53l72r14r10
54522A35793p35p85q20n37k85n90j278j598j177m53j24m07r03j075q18m87l34
54505A23387j57K74O45M59j18l46P3O23Q42R32J187J298Q70K14k9J26J4o30j219
54486A28445j061j91Q28J570J885J581N06j019k157k277j571p01JO89J344J561
54470A29433J248J036J430J908J516K92o38n32J25N17O24Q70J180J091N96J93
54454A40889N0j92o82r45n64J06L67J55Q5N09R12N60n46j645k091j870j267m07
54436A33424N62J213J172O50K34J59J32j9KM47R34Q57K05l66l76n2J41K40P23
$$ plain form
54417 140282 141967 144451 146829 148229 148492 148009 147120 145956 144709 143624 142657 141512 140232 139479 139864 141074
54401 141074 142026 141982 141298 140968 141534 142594 143378 143643 143879 144623 145757 146694 147202 147818 149277 151607 153940
54384 153940 155235 155176 154351 153579 153094 152493 151522 150668 150680 151616 152696 153201 153198 153215 153438 153537 153202 152571 152081 152000
54364 152000 152231 152567 153037 153778 154546 154690 153942 153038 153095 154380 156116 157543 158677 159868 161105 162080 162618
54347 162618 162749 162639 162668 163289 164585 166291 168425 171438 175339 179205 182075 184024 185737 187351 188389
54332 188389 188580 187995 186466 183717 180172 176873 174329 172042 169402 166474 163568 160654 157664 154960 153007
54317 153007 151815 151114 150831 150984 151260 151127 150336 149145 148119 147847 148571 149750 150235 149285 147391 145747 144989
54300 144989 144787 144610 144395 144253 143934 142996 141452 139929 139098 139120 139759 140895 142642 144918 147181 148858 149957
$$ packed form
54417A40282J685K484K378J400K63m83q89j164j247j085r67j145j280p53L85J210
54401A41074R52m4o84l30N66J060P84K65K36P44J134R37N08O16J459K330K333
54384A53940J295n9q25p72m85o01r71q54J2R36J080N05lJ7K23R9l35o31m90q1
54364A52000K31L36M70P41P68J44p48r04N7J285J736J427J134J191J237R75N38
54347A62618J31j10K9O21J296J706K134L013L901L866K870J949J713J614J038
54332A88389J91n85j529k749l545l299k544k287k640k928k906k914k990k704j953
54317A53007j192p01k83J53K76j33p91j191j026k72P24J179M85r50j894j644p58
54300A44989k02j77k15j42l19r38j544j523q31K2O39J136J747K276K263J677J099
$$ plain form
54283 149957 151009 152320 153542 154050 153578 152389 151049 150168 150126 150773 151467 151678 151492 151358 151398 151271 150727 150010
54265 150010 149535 149367 149271 149194 149417 150202 151467 152963 154596 156347 157934 158847 158867 158371 157960 157893 158020 158177
54247 158177 158379 158678 159042 159442 159868 160183 160149 159631 158672 157290 155438 153235 151080 149360 148184 147555 147584
54230 147584 148239 148981 149087 148419 147594 147206 147115 146846 146502 146746 147743 148536 147951 146042 144223 143849 144924 146342
54212 146342 147142 147286 147337 147719 148396 149089 149653 150193 150893 151791 152750 153548 153901 153529 152483 151384 150999 151423
54194 151423 151955 151972 151659 151655 152192 152944 153499 153594 152991 151582 149689 147929 146686 145978 145791 146148 146792 147231 147368
54175 147368 147717 148722 150053 150897 150847 150234 149689 149615 150078 150952 152021 152978 153394 152845 151249 149157 147486
54158 147486 146817 146965 147301 147433 147463 147687 148190 148722 148930 148712 148377 148345 148709 149172 149432 149492 149491 149445 149280 149041 148868
$$ packed form
54283A49957J052J311J222N08m72j189j340q81m2O47O94K11j86j34M0j27n44p17
54265A50010m75j68r6p7K23P85J265J496J633J751J587R13K0m96m11o7J27J57
54247A58177K02K99L64M00M26L15l4n18r59j382j852k203k155j720j176o29K9
54230A47584O55P42J06o68q25l88r1k69l44K44R97P93n85j909j819l74J075J418
54212A46342Q00J44N1L82O77O93N64N40P00Q98R59P98L53l72j046j099l85M24
54194A51423N32J7l13mN37P52N55R5o03j409j893j760j243p08j87L57O44M39J37
54175A47368L49J005J331Q44n0o13n45p4M63Q74J069R57M16n49j596k092j671
54158A47486o69J48L36J32L0K24N03N32K08k18l35l2L64M63K60O0jm6j65k39j73
$$ plain form
54137 148868 148766 148615 148383 148214 148218 148326 148467 148815 149653 150856 151743 151770 151343 151599 153177 155479 157415 158607
54119 158607 159480 160356 161048 161379 161574 161924 162489 163355 164738 166457 167659 167608 166581 165503 164769 163883 162285
54102 162285 160045 157613 155339 153452 152169 151515 151261 151300 151842 152917 154005 154614 155090 156210 157918 159105
54086 159105 159029 158423 158676 160190 162154 163743 164848 165597 165872 165661 165424 165707 166651 168124 170011 172071 173804
54069 173804 174891 175598 176432 177568 178878 180248 181459 182060 181910 181740 182593 184678 187256 189666 191914 194120
54053 194120 196005 197303 198366 200003 202869 207139 212574 218727 225267 232257 239995 248564 257737 267278
54039 267278 277009 286528 295217 302672 308819 313528 316542 317982 318518 318756 318695 318131 317277 316628 316394 316406 316453
54022 316453 316450 316355 316174 316001 315805 315250 313908 311665 308767 305552 302194 298628 294584 289843 284486 278831
$$ packed form
54137A48868j02j51k32j69MJ08J41L48Q38J203Q87K7m27K56J578K302J936J192
54119A58607Q73Q76O92L31J95L50N65Q66J383J719J202n1j027j078p34q86j598
54102A62285k240k432k274j887j283o54k54L9N42J075J088O09M76J120J708J187
54086A59105p6o06K53J514J964J589J105P49K75k11k37K83R44J473J887K060J733
54069A73804J087P07Q34J136J310J370J211O01j50j70Q53K085K578K410K248K206
54053A94120J885J298J063J637K866M270N435O153O540O990P738Q569R173R541
54039B67278R731R519Q689P455O147M709L014J440N36K38o1n64q54o49k34J2M7
54022C16453lr5j81j73j96n55j342k243k898l215l358l566m044m741n357n655
$$ plain form
54006 278831 273075 267260 261601 256511 252101 247956 243680 239439 235693 232576 229802 227030 224126 221192
53992 221192 218555 216567 215188 213905 212298 210543 209088 207997 206882 205475 203967 202804 202239 202020 201450
53977 201450 199995 198006 196599 196512 197254 197664 197156 196128 195275 194896 194836 194764 194471 194138 194295 195291 196815 198148
53959 198148 198889 199250 199652 200308 201165 202094 203107 204485 206649 209708 213178 216325 218803 220871 223117 226048
53943 226048 229862 234396 239295 244269 249120 253618 257677 261788 266835 273187 280210 286970 293173 299124
53929 299124 305138 311457 318492 326517 335116 343442 351117 358482 365941 373447 380717 387572 393986 400031
53915 400031 405834 411375 416379 420714 424791 429206 433960 438456 442284 445620 448758 451617 453884 455341
53901 455341 455895 455573 454612 453400 452193 451069 450164 449765 450177 451697 454635 458961 463913 468335 471431 472828
$$ packed form
54006B78831n756n815n659n090m410m145m276m241l746l117k774k772k904k934
53992B21192k637j988j379j283j607j755j455j091j115j407j508j163n65k19n70
53977B01450j455j989j407q7P42M10n08j028q53l79o0p2k93l33J57R96J524J333
53959A98148P41L61M02O56Q57R29J013J378K164L059L470L147K478K068K246K931
53943B26048L814M534M899M974M851M498M059M111N047O352P023O760O203N951
53929B99124O014O319P035Q025Q599Q326P675P365P459P506P270O855O414O045
53915D00031N803N541N004M335M077M415M754M496L828L336L138K859K267J457
53901D55341N54l22r61j212j207j124r05l99M12J520K938M326M952M422L096J397
$$ plain form
53885 472828 471924 467758 459798 448386 434111 417206 398077 378081 359081 342124 326967 313022
53873 313022 300439 289961 281842 275244 268907 262343 256167 251244 247693 244856 242038 239023 236033 233434
53859 233434 231456 229908 228221 225996 223521 221474 220151 219232 218287 217225 216177 215165 214050 212710 211256
53844 211256 210043 209249 208408 206774 204400 202399 201610 201448 200834 199939 200028 201534 203265 203829 203057 201649 200220
53827 200220 199193 198951 199440 200107 200775 202113 204631 207675 210095 211618 212820 214014 214962 215656 216546 217813
53811 217813 219021 219778 220397 221696 224347 228459 233478 238516 243095 247617 252756 258418 263762 268340 272702
53796 272702 277570 282827 287774 292124 296230 300347 304200 307455 310229 312745 314693 315373 314593 313060 311684
53781 311684 310716 309790 308567 306981 304991 302489 299482 296025 291974 287153 281830 276615 271740 266831 261655
$$ packed form
53885D72828r04m166p960j1412j4275j6905j9129j9996j9000j6957j5157j3945
53873C13022j2583j0478q119o598o337o564o176m923l551k837k818l015k990k599
53859B33434j978j548j687k225k475k047j323r19r45j062j048j012j115j340j454
53844B11256j213p94q41j634k374k001p89j62o14q95Q9J506J731N64p72j408j429
53827B00220j027k42M89O67O68J338K518L044K420J523J202J194R48O94Q90J267
53811B17813J208P57O19J299K651M112N019N038M579M522N139N662N344M578M362
53796B72702M868N257M947M350M106M117L853L255K774K516J948O80p80j533j376
53781C11684r68r26j223j586j990k502l007l457m051m821n323n215m875m909n176
$$ plain form
53766 261655 256748 252942 250397 248402 246033 242833 239005 235162 231869 229297 227299 225719 224414 222967
53752 222967 220821 217863 214649 211873 209844 208564 207896 207443 206650 205435 204442 204367 205185 206309 207201 207557
53736 207557 207200 206312 205557 205517 206089 206781 207484 208521 210010 211580 212729 213154 212889 212460 212810 214544 217189
53719 217189 219580 221066 222006 223090 224544 226183 227883 229764 232003 234595 237235 239502 241278 242928
53705 242928 244896 247213 249645 252169 254932 257772 260167 261818 263039 264435 266403 268968 271921 275027
53691 275027 278238 281741 285646 289588 292774 294502 294599 293417 291533 289496 287705 286450 285898 285864 285728 284899
53675 284899 283491 282185 281293 280399 279170 278036 277582 277614 277389 276625 275794 275444 275695 276285 276728 276542 275743 274980
53657 274980 274794 274936 274808 274278 273485 272244 270491 269079 269083 270209 270922 270421 269605 269673 270645 271777 272652 273249
$$ packed form
53766B61655m907l806k545j995k369l200l828l843l293k572j998j580j305j447
53752B22967k146k958l214k776k029j280o68m53p93j215r93p5Q18J124Q92L56
53736B07557l57q88p55m0N72O92P03J037J489J570J149M25k65m29L50J734K645
53719B17189K391J486R40J084J454J639J700J881K239K592K640K267J776J650
53705B42928J968K317K432K524K763K840K395J651J221J396J968K565K953L106
53691B75027L211L503L905L942L186J728R7j182j884k037j791j255n52l4j36q29
53675B84899j408j306q92q94j229j134m54L2k25p64q31l50K51N90M43j86p99p63
53657B74980j86J42j28n30p93j241j753j412MJ126P13n01q16O8R72J132Q75N97
$$ plain form
53639 273249 273533 273661 274155 275254 276539 277706 279195 281435 283900 285683 286692 287530 288440 289189 289893 291170
53623 291170 293377 296263 299484 302903 306347 309589 312667 315795 318983 322163 325648 329856 334592 339191
53609 339191 343456 347786 352219 356107 359169 362145 365847 370005 373739 376830 379803 382883 385676 388006
53595 388006 390370 393169 395919 397680 398096 397638 396929 396254 395798 395945 397019 398779 400466 401409 401464 400861 399871
53578 399871 398745 397787 397121 396374 394866 392261 388859 385129 381169 376903 372607 368824 365668 362587 359117
53563 359117 355627 353001 351684 351402 351741 352529 353510 354133 354134 354085 354872 356657 358783 360751 362848 365568 368741
53546 368741 371646 373965 376259 379319 383182 387048 390205 392888 396002 400128 405131 410788 417353 425168
53532 425168 434012 443264 452581 462019 471694 481813 492987 505831 520038 534422 548164 561596
$$ packed form
53639B73249K84J28M94J099J285J167J489K240K465J783J009Q38R10P49P04J277
53623B91170K207K886L221L419L444L242L078L128L188L180L485M208M736M599
53609C39191M265M330M433L888L062K976L702M158L734L091K973L080K793K330
53595C88006K364K799K750J761M16m58p09o75m56J47J074J760J687R43N5o03r90
53578C99871j126r58o66p47j508k605l402l730l960m266m296l783l156l081l470
53563C59117l490k626j317k82L39P88R81O23Jm9P87J785K126J968K097K720L173
53546C68741K905K319K294L060L863L866L157K683L114M126N003N657O565P815
53532D25168Q844R252R317R438R675J0119J1174J2844J4207J4384J3742J3432
$$ plain form
53520 561596 575500 590103 605182 620756 637142 654539 673057 692999 714603 737557 761199
53509 761199 785197 809661 834643 859926 885329 910779 935993 960522 984273 1007616 1030758
53498 1030758 1053328 1074901 1095721 1116534 1137743 1158968 1179488 1198933 1217485 1235528 1253266
53487 1253266 1270699 1287865 1304916 1321929 1338812 1355554 1372459 1389842 1407482 1424522 1440051
53476 1440051 1453667 1465450 1475511 1483728 1489877 1493887 1495825 1495602 1492862 1487329 1479277 1469363 1457921
53463 1457921 1444718 1429614 1413226 1396517 1379794 1362496 1344113 1325037 1306324 1288660 1271618
53452 1271618 1253867 1234237 1212773 1190804 1169804 1150185 1131317 1112556 1093957 1076082 1059606
53441 1059606 1045166 1033123 1023121 1014272 1006151 999385 994818 992246 990502 988798 987469 987219 988120 989822
$$ packed form
53520E61596J3904J4603J5079J5574J6386J7397J8518J9942K1604K2954K3642
53509G61199K3998K4464K4982K5283K5403K5450K5214K4529K3751K3343K3142
53498A030758K2570K1573K0820K0813K1209K1225K0520J9445J8552J8043J7738
53487A253266J7433J7166J7051J7013J6883J6742J6905J7383J7640J7040J5529
53476A440051J3616J1783J0061Q217O149M010J938k23k740n533q052r914j1442
53463A457921j3203j5104j6388j6709j6723j7298j8383j9076j8713j7664j7042
53452A271618j7751j9630k1464k1969k1000j9619j8868j8761j8599j7875j6476
53441A059606j4440j2043j0002q849q121o766m567k572j744j704j329k50R01J702
$$ plain form
53427 989822 992460 996729 1002976 1010680 1019169 1028618 1039918 1053633 1069411 1086501 1104571 1123843 1144731
53414 1144731 1167582 1192608 1219713 1248405 1278144 1308805 1340667 1374037 1409140 1446294 1485811
53403 1485811 1527573 1570988 1615497 1660992 1707662 1755746 1805543 1857320 1910875 1965398 2020084
53392 2020084 2074831 2130106 2186232 2243001 2299837 2355959 2410474 2462714 2512623 2560540 2606521
53381 2606521 2650127 2690900 2728665 2763138 2793602 2819350 2840281 2856617 2868175 2874367 2875010 2870663
53369 2870663 2861867 2848372 2829431 2804682 2774361 2738759 2697958 2652286 2602701 2550473 2496619
53358 2496619 2441828 2386702 2331783 2277423 2223844 2171318 2120083 2070182 2021656 1974831 1930032
53347 1930032 1886968 1844774 1802873 1761506 1721128 1681542 1641993 1602158 1562790 1525350 1491059
$$ packed form
53427I89822K638M269O247P704Q489R449J1300J3715J5778J7090J8070J9272K0888
53414A144731K2851K5026K7105K8692K9739L0661L1862L3370L5103L7154L9517
53403A485811M1762M3415M4509M5495M6670M8084M9797N1777N3555N4523N4686
53392B020084N4747N5275N6126N6769N6836N6122N4515N2240M9909M7917M5981
53381B606521M3606M0773L7765L4473L0464K5748K0931J6336J1558O192O43m347
53369B870663q796j3495j8941k4749l0321l5602m0801m5672m9585n2228n3854
53358B496619n4791n5126n4919n4360n3579n2526n1235m9901m8526m6825m4799
53347A930032m3064m2194m1901m1367m0378l9586l9549l9835l9368l7440l4291
$$ plain form
53336 1491059 1460152 1431811 1404921 1379067 1354800 1332807 1312986 1294594 1277055 1260259 1244152
53325 1244152 1228568 1213531 1199276 1185752 1172548 1159483 1146891 1135063 1123828 1113131 1103624
53314 1103624 1096138 1090788 1087113 1084945 1084523 1085819 1088432 1092305 1097931 1105594 1114920 1125522 1137620 1151623
53300 1151623 1167434 1184631 1203016 1222537 1242897 1263851 1285773 1309392 1334913 1361779 1389305
53289 1389305 1417077 1444656 1471414 1496888 1520941 1543346 1563631 1581617 1597817 1612872 1626755
53278 1626755 1638859 1648597 1655478 1658737 1657582 1652065 1643304 1632492 1619894 1605116 1588116 1569484
53266 1569484 1549713 1528649 1505873 1481378 1455606 1428985 1401706 1373863 1345514 1316605 1287170
53255 1287170 1257633 1228610 1200238 1172043 1143695 1115632 1088581 1062674 1037383 1012219 987054
$$ packed form
53336A491059l0907k8341k6890k5854k4267k1993j9821j8392j7539j6796j6107
53325A244152j5584j5037j4255j3524j3204j3065j2592j1828j1235j0697r507
53314A103624p486n350l675k168m22J296K613L873N626P663R326J0602J2098J4003
53300A151623J5811J7197J8385J9521K0360K0954K1922K3619K5521K6866K7526
53289A389305K7772K7579K6758K5474K4053K2405K0285J7986J6200J5055J3883
53278A626755J2104R738O881L259j155n517q761j0812j2598j4778j7000j8632
53266A569484j9771k1064k2776k4495k5772k6621k7279k7843k8349k8909k9435
53255A287170k9537k9023k8372k8195k8348k8063k7051k5907k5291k5164k5165
$$ plain form
53244 987054 961803 936377 911132 886916 864311 843060 822500 802330 782562 763011 743412
53233 743412 724144 706369 691121 678444 667616 657972 649199 640929 632497 623252 612911 601469
53221 601469 589026 575909 562768 550165 538035 525800 513052 499934 486870 474237 462352
53210 462352 451412 441278 431576 422230 413601 405943 399048 392673 386892 381595 376054 369589 362452 355462
53196 355462 348919 342493 336074 329980 324294 318771 313581 309314 305952 302608 298743 294937 291853 289115
53182 289115 285990 282700 280125 278444 276945 275169 273463 272264 271559 271232 271390 271976 272475 272374 271695 270829
53166 270829 269928 268687 266738 264281 262210 261410 261754 262088 261427 259897 258248 256837 255605 254744 254638 255140
53150 255140 255541 255340 254538 253165 251180 248976 247327 246541 246193 245935 245985 246480 246904 246707 246020 245280 244478 243321
$$ packed form
53244I87054k5251k5426k5245k4216k2605k1251k0560k0170j9768j9551j9599
53233G43412j9268j7775j5248j2677j0828r644q773q270q432r245j0341j1442
53221F01469j2443j3117j3141j2603j2130j2235j2748j3118j3064j2633j1885
53210D62352j0940j0134r702r346q629p658o895o375n781n297n541o465p137o990
53196C55462o543o426o419o094n686n523n190m267l362l344l865l806l084k738
53182B89115l125l290k575j681j499j776j706j199p05l27J58N86M99j01o79q66
53166B70829r01j241j949k457k071q00L44L34o61j530j649j411j232q61j06N02
53150B55140M01k01q02j373j985k204j649p86l48k58N0M95M24j97o87p40q02j157
$$ plain form
53132 243321 241911 240736 240168 240307 241116 242296 243298 243927 244650 245799 246756 246645 245692 245087 245429 246110 246523
53115 246523 247058 248382 250251 251676 252082 251779 251433 251507 252147 253157 253999 254115 253335 251838 249846 247605 245554
53098 245554 244040 242762 240963 238423 235957 234541 234189 234137 234043 234440 235812 237716 239234 240061 240687 241512
53082 241512 242212 242123 241008 239263 237578 236511 236237 236458 236652 236562 236458 236824 237793 238955 239635 239353 238171
53065 238171 236781 236118 236596 237640 238138 237452 235977 234698 234291 234653 235170 235372 235315 235358 235609 235752 235529 235242
53047 235242 235431 236040 236307 235750 234986 235066 236089 236943 236615 235292 233901 232909 232135 231515 231382 231833 232330 232307
53029 232307 231782 231088 230326 229548 229175 229702 230997 232418 233624 234778 235876 236420 236035 234956 233662 232431
53013 232431 231529 231411 232194 233209 233627 233405 233164 233311 233803 234651 235967 237401 238230 238317 238397 239001 239601 239336
$$ packed form
53132B43321j410j175n68J39Q09J180J002O29P23J149R57j11r53o05L42O81M13
53115B46523N35J324J869J425M06l03l46P4O40J010Q42J16p80j497j992k241k051
53098B45554j514j278j799k540k466j416l52n2r4L97J372J904J518Q27O26Q25
53082B41512P00q9j115j745j685j067k74K21J94r0j04L66R69J162O80k82j182
53065B38171j390o63M78J044M98o86j475j279m07L62N17K02n7M3K51J43k23k87
53047B35242J89O09K67n57p64Q0J023Q54l28j323j391r92p74o20j33M51M97k3
53029B32307n25o94p62p78l73N27J295J421J206J154J098N44l85j079j294j231
53013B32431r02j18P83J015M18k22k41J47M92Q48J316J434Q29Q7Q0O04O00k65
$$ plain form
52995 239336 238244 237142 236507 236146 235934 236205 237167 238497 239798 241090 242465 243604 244055 243914 243899 244718 246570
52978 246570 249132 251796 253955 255392 256434 257590 259026 260587 262271 264396 267191 270476 273851 277025
52964 277025 279817 282042 283630 284761 285626 286098 285791 284540 282661 280662 278740 276670 274215 271551 269172
52949 269172 267398 266141 265176 264373 263500 262091 259947 257673 256223 255804 255651 255022 253958 252829 251629 250198
52933 250198 248810 247914 247312 246203 244167 241729 239807 238886 238849 239273 239691 239714 239149 238009 236385 234474 232695
52916 232695 231569 231305 231614 232007 232281 232633 233349 234380 235241 235450 235133 235043 235729 236796 237211 236346 234534 232684
52898 232684 231559 231445 232180 233323 234378 235004 235109 234852 234620 234807 235465 236252 236890 237389 237705 237490 236634 235746
52880 235746 235560 235957 236129 235703 235158 235125 235844 237308 239336 241345 242727 243703 245190 247474 249614 250641
$$ packed form
52995B39336j092j102o35l61k12K71R62J330J301J292J375J139M51j41j5Q19J852
52978B46570K562K664K159J437J042J156J436J561J684K125K795L285L375L174
52964B77025K792K225J588J131Q65M72l07j251j879j999j922k070k455k664k379
52949B69172j774j257r65q03q73j409k144k274j450m19j53o29j064j129j200j431
52933B50198j388q96o02j109k036k438j922r21l7M24M18K3n65j140j624j911j779
52916B32695j126k64L09L93K74L52P16J031Q61K09l17r0O86J067M15q65j812j850
52898B32684j125j14P35J143J055O26J05k57k32J87O58P87O38M99L16k15q56q88
52880B35746j86L97J72m26n45l3P19J464K028K009J382R76J487K284K140J027
$$ plain form
52864 250641 250780 250974 251650 252521 253283 253870 254229 254362 254467 254558 254134 252744 250767 249103 248086 247127 245473
52847 245473 242991 240223 237944 236581 235818 234800 232979 230603 228220 226004 223895 222036 220586 219382
52833 219382 218338 217946 218734 220297 221517 221751 221290 220669 220078 219494 218853 217994 216917 216063 215856 216000 215853
52816 215853 215475 215597 216441 217358 217887 218420 219395 220585 221648 222776 224139 225239 225496 225147 224931 225111 225360
52799 225360 225393 225105 224271 222718 220776 219052 217794 216880 216312 216230 216441 216468 216076 215389 214480 213358 212372 212112
52781 212112 212732 213765 214754 215647 216437 216929 217209 217916 219560 221751 223547 224541 225174 225956 226781 227170 226956
52764 226956 226447 226040 225852 225716 225312 224331 222733 220959 219718 219392 219718 220191 220645 221224 221891 222271 222056 221347
52746 221347 220522 219983 220115 221245 223343 225837 227934 229198 229834 230422 231388 232698 234069 235473 237195 239271
$$ packed form
52864B50641J39J94O76Q71P62N87L59J33J05R1m24j390j977j664j017r59j654
52847B45473k482k768k279j363p63j018j821k376k383k216k109j859j450j204
52833B19382j044l92P88J563J220K34m61o21n91n84o41q59j077q54k07J44j47
52816B15853l78J22Q44R17N29N33R75J190J063J128J363J100K57l49k16J80K49
52799B25360L3k88q34j553j942j724j258r14n68q2K11K7l92o87r09j122r86k60
52781B12112O20J033R89Q93P90M92K80P07J644K191J796R94O33P82Q25L89k14
52764B26956n09m07j88j36m04r81j598j774j241l26L26M73M54N79O67L80k15p09
52746B21347q25n39J32J130K098K494K097J264O36N88R66J310J371J404J722K076
$$ plain form
52730 239271 241131 242258 243043 244396 246490 248488 249762 250695 251857 252926 253102 252247 250964 249739 248671
52715 248671 247862 247375 246780 245492 243708 242347 241788 241356 240396 239276 238725 238639 238262 237430 236920 237375 238382
52698 238382 238909 238437 237459 236966 237581 239094 240644 241329 240836 239642 238657 238511 239072 239664 239808 239720 239992 240862
52680 240862 241959 242684 242704 242115 241391 241181 241821 242859 243228 242175 240012 237859 236674 236546 236847 236903 236544
52663 236544 236089 235890 235945 236063 236289 237015 238600 240996 243736 246180 247820 248613 249140 250197 252064 254229
52647 254229 255955 256928 257210 256771 255377 252969 249976 247207 245471 245174 246023 247124 247639 247486 247357 248017
52631 248017 249583 251552 253344 254733 255803 256739 257787 259283 261378 263663 265312 265867 265696 265399 264877
52616 264877 263438 260869 257935 255559 253912 252606 251502 250863 250863 251375 252190 253097 253758 253924 253867 254256 255411
$$ packed form
52730B39271J860J127P85J353K094J998J274R33J162J069J76q55j283j225j068
52715B48671q09m87n95j288j784j361n59m32r60j120n51q6l77q32n10M55J007
52698B38382N27m72r78m93O15J513J550O85m93j194r85j46N61N92J44q8K72Q70
52680B40862J097P25K0n89p24k10O40J038L69j053k163k153j185j28L01N6l59
52663B36544m55j99N5J18K26P26J585K396K740K444J640P93N27J057J867K165
52647B54229J726R73K82m39j394k408k993k769j736k97Q49J101N15j53j29O60
52631B48017J566J969J792J389J070R36J048J496K095K285J649N55j71k97n22
52616B64877j439k569k934k376j647j306j104o39%N12Q15R07O61J66n7L89J155
$$ plain form
52599 255411 256895 257997 258414 258343 258075 257675 257011 256079 255290 255291 256271 257564 258334 258627 259290 260760 262477 263779
52581 263779 264847 266195 267648 268510 268683 268824 269294 269595 269225 268556 268318 268514 268433 267675 266610 265708 264905 263914
52563 263914 262852 262093 261637 261029 260019 258937 258211 257814 257469 257260 257594 258503 259359 259552 259242 259169 259799 260890
52545 260890 261889 262530 262913 263122 262948 262104 260683 259242 258245 257531 256577 255275 254084 253309 252656 251851 251330
52528 251330 251772 253023 254063 254148 253568 253137 253289 253896 254621 255180 255430 255462 255586 256050 256892 258116 259814 261977
52510 261977 264320 266503 268470 270495 272962 276068 279517 282470 284085 284298 283802 283122 281996 279910 276938
52495 276938 273672 270561 267714 265222 263184 261390 259382 257016 254730 253153 252456 252150 251493 250299 249366
52480 249366 249758 251478 253335 254551 255972 258845 262723 265670 266694 266944 267964 269679 270885 271107 271010
$$ packed form
52599B55411J484J102M17p1k68m00o64r32p89JR80J293P70K93O63J470J717J302
52581B63779J068J348J453Q62J73J41M70L01l70o69k38J96q1p58j065r02q03r91
52563B63914j062p59m56o08j010j082p26l97l45k09L34R09Q56J93l10p3O30J091
52545B60890R99O41L83K09j74q44j421j441r97p14r54j302j191p75o53q05n21
52528B51330M42J251J040Q5n80m31J52O07P25N59K50L2J24M64Q42J224J698K163
52510B61977K343K183J967K025K467L106L449K953J615K13m96o80j126k086k972
52495B76938l266l111k847k492k038j794k008k366k286j577o97l06o57j194r33
52480B49366L92J720J857J216J421K873L878K947J024K50J020J715J206K22r7
$$ plain form
52465 271010 271217 271657 272222 273361 275676 279221 283335 286960 289210 289969 290004 290169 290444 290042 288495 286233
52449 286233 283987 281953 279770 277128 274125 271127 268413 265986 263710 261653 260168 259444 259049 258230 256731
52434 256731 255035 253729 252912 252388 252122 252188 252477 252772 253079 253593 254411 255528 257050 259043 261107 262469 262783
52417 262783 262615 262850 263717 264760 265774 267329 270116 274068 278566 283388 288989 295667 302924 309979 316685
52402 316685 323450 330354 336794 342069 345881 348070 348220 345952 341493 335676 329364 323104 317191 311764
52388 311764 306804 302340 298769 296700 296290 296896 297595 297949 298140 298521 299350 300852 303141 305901 308458 310468
52372 310468 312401 315073 318729 322818 326739 330536 334756 339734 345112 349949 353259 354677 354789 354671 354877
52357 354877 354945 354117 352478 351029 350588 350910 351170 351104 351375 352808 355529 358932 362302 365354 368254 371329
$$ packed form
52465B71010K07M40N65J139K315L545M114L625K250P59L5J65K75m02j547k262
52449B86233k246k034k183k642l003k998k714k427k276k057j485p24l95q19j499
52434B56731j696j306q17n24k66O6K89K95L07N14Q18J117J522J993K064J362L14
52417B62783j68K35Q67J043J014J555K787L952M498M822N601O678P257P055O706
52402C16685O765O904O440N275L812K189J50k268m459n817o312o260n913n427
52388C11764m960m464l571k069m10O06O99L54J91L81Q29J502K289K760K557K010
52372C10468J933K672L656M089L921L797M220M978N378M837L310J418J12j18K06
52357C54877O8q28j639j449m41L22K60o6K71J433K721L403L370L052K900L075
$$ plain form
52341 371329 374822 378868 383573 388986 395008 401435 408199 415501 423614 432643 442587 453558 465666 478729
52327 478729 492439 506980 523079 541085 560188 579109 597528 616380 636516 657588 678589
52316 678589 699085 719360 739472 758841 776965 794068 810661 826724 841795 855831 869560
52305 869560 883710 898042 911469 923227 933685 943790 953794 962894 970201 975747 980251 984143
52293 984143 987174 988860 988839 986804 982592 976581 969661 962509 955158 947491 939916 933154 927540 922948 919402
52278 919402 917380 917344 919201 922378 926348 931118 937343 945886 957026 970012 983631 997262 1011199
52265 1011199 1025877 1041101 1056248 1070925 1085071 1098538 1111019 1122464 1133219 1143605 1153619
52254 1153619 1163269 1172904 1182841 1192746 1201774 1209370 1215632 1220779 1224598 1226646 1226764 1225125 1221934 1217333
$$ packed form
52341C71329L493M046M705N413O022O427O764P302Q113R029R944J0971J2108J3063
52327D78729J3710J4541J6099J8006J9103J8921J8419J8852K0136K1072K1001
52316F78589K0496K0275K0112J9369J8124J7103J6593J6063J5071J4036J3729
52305H69560J4150J4332J3427J1758J0458J0105J0004R100P307N546M504L892
52293I84143L031J686k1k035m212o011o920p152p351p667p575o762n614m592l546
52278I19402k022l6J857L177L970M770O225Q543J1140J2986J3619J3631J3937
52265A011199J4678J5224J5147J4677J4146J3467J2481J1445J0755J0386J0014
52254A153619R650R635R937R905R028P596O262N147L819K048J18j639l191m601
$$ plain form
52240 1217333 1211552 1204865 1197410 1189242 1180472 1171225 1161581 1151925 1143239 1136633 1132392 1129685 1127286 1124441
52226 1124441 1121073 1117557 1114465 1112285 1111211 1111295 1112675 1115258 1118211 1120409 1121689 1123276 1126583 1131920
52212 1131920 1138612 1145919 1153336 1160416 1167050 1173857 1181656 1190475 1199467 1207755 1215020 1221362 1227227 1233431
52198 1233431 1240614 1248420 1255677 1261678 1266892 1272198 1277804 1283227 1288033 1292278 1296365 1300677 1305130 1308935
52184 1308935 1311026 1310939 1309073 1305999 1301856 1296594 1290415 1283542 1275827 1267030 1257404 1247628 1238229 1229371
52170 1229371 1221130 1213641 1207008 1201318 1196777 1193527 1191358 1189848 1188807 1188344 1188543 1189367 1190827 1192906 1195272
52155 1195272 1197432 1199294 1201246 1203465 1205481 1206653 1206826 1206221 1205010 1203424 1202050 1201382 1201045 1200058 1198114
52140 1198114 1196117 1195129 1195206 1195696 1196304 1197194 1198313 1199396 1200737 1203256 1207517 1213324 1220633 1230217 1242814
$$ packed form
52240A217333n781o687p455q168q770r247r644r656q686o606m241k707k399k845
52226A124441l368l516l092k180j074Q4J380K583K953K198J280J587L307N337
52212A131920O692P307P417P080O634O807P799Q819Q992Q288P265O342N865O204
52198A233431P183P806P257O001N214N306N606N423M806M245M087M312M453L805
52184A308935K091q7j866l074m143n262o179o873p715q797r626r776r399q858
52170A229371q241p489o633n690m541l250k169j510j041m63J99Q24J460K079K366
52155A195272K160J862J952K219K016J172J73o05j211j586j374o68l37r87j944
52140A198114j997r88P7M90O08Q90J119J083J341K519M261N807P309R584J2597
$$ plain form
52125 1242814 1258050 1274933 1293206 1313522 1336390 1361591 1388604 1416910 1445754 1474261 1502039
52114 1502039 1529163 1555378 1579911 1602360 1623159 1642748 1660784 1676634 1690217 1701764 1711153
52103 1711153 1718124 1722984 1726408 1728618 1729329 1728483 1726510 1723830 1720573 1716835 1712652 1707620 1701056 1692750
$$ packed form
52125A242814J5236J6883J8273K0316K2868K5201K7013K8306K8844K8507K7778
52114A502039K7124K6215K4533K2449K0799J9589J8036J5850J3583J1547R389
52103A711153O971M860L424K210P11q46j973k680l257l738m183n032o564q306
$$ [...]
##END NTUPLES=NMR SPECTRUM
##END=
