
##TITLE=AC1303_PERAH12115_6641754_p1tBAZZZUx
##JCAMPDX= 6.0         $$ Bruker NMR JCAMP-DX V2.0
##DATA TYPE= NMR SPECTRUM
##DATA CLASS= NTUPLES
##ORIGIN= BRUKER
##OWNER= Administrator
$$ 1.72 TOPSPIN		Version 2.1
$$ 2012-08-13 15:40:58.234 -0500  Administrator@TOPSPIN
$$ Compression mode = diff/dup
##.OBSERVE FREQUENCY= 400.02188249412
##.OBSERVE NUCLEUS= ^1H
##.ACQUISITION MODE= SIMULTANEOUS (DQD)
##.ACQUISITION SCHEME= undefined
##.AVERAGES= 8
##.DIGITISER RES= 22
##SPECTROMETER/DATA SYSTEM= spect
##.PULSE SEQUENCE= zg30
##.SOLVENT NAME= COFFEE_meoh
##.SHIFT REFERENCE= INTERNAL, COFFEE_meoh, 1, 14.98509
##AUDIT TRAIL= $$ (NUMBER, WHEN, WHO, WHERE, PROCESS, VERSION, WHAT)
$$ ##TITLE= Audit trail, TOPSPIN		Version 2.1
$$ ##JCAMPDX= 5.01
$$ ##ORIGIN= Bruker BioSpin GmbH
$$ ##OWNER= Administrator
$$ $$ C:\Bruker\TOPSPIN/data/COFFEE/nmr/AC1303_PERAH12115_6641754_p1tBAZZZUx/50/pdata/1/auditp.txt
$$ ##AUDIT TRAIL=  $$ (NUMBER, WHEN, WHO, WHERE, PROCESS, VERSION, WHAT)
(   1,<2012-08-13 15:40:49.468 -0500>,<Administrator>,<TOPSPIN>,<go>,<TOPSPIN 2.1>,
      <created by zg
	started at 2012-08-13 15:39:42.718 -0500,
	POWCHK enabled, PULCHK disabled,
       configuration hash MD5:
       6B 1B 68 BB D9 2E 58 E2 7F 35 AD 54 07 DF 0E 41
       data hash MD5: 64K
       33 FD A8 0D BF 1B 97 AB A0 8B BA 9A F4 0E E0 F8>)
(   2,<2012-08-13 15:40:52.937 -0500>,<Administrator>,<TOPSPIN>,<proc1d>,<TOPSPIN 2.1>,
      <Start of raw data processing
       efp LB = 0 FT_mod = 6 PKNL = 1 PHC0 = 0 PHC1 = 0 SI = 32K 
       data hash MD5: 32K
       AD D4 36 05 67 20 B1 C1 75 5D C1 61 8E 87 C4 2B>)
(   3,<2012-08-13 15:40:53.328 -0500>,<Administrator>,<TOPSPIN>,<proc1d>,<TOPSPIN 2.1>,
      <pk PHC0 = 183.1366 PHC1 = 0 
       data hash MD5: 32K
       76 4D DF F4 68 3D 22 BC C8 96 3D B0 73 9A 80 D7>)
(   4,<2012-08-13 15:40:53.437 -0500>,<Administrator>,<TOPSPIN>,<proc1d>,<TOPSPIN 2.1>,
      <abs ABSG = 1 
       data hash MD5: 32K
       B6 36 10 63 0F F6 AA FC C0 67 12 DE C2 43 30 C2>)
(   5,<2012-08-13 15:40:53.531 -0500>,<Administrator>,<TOPSPIN>,<proc1d>,<TOPSPIN 2.1>,
      <abs ABSG = 2 
       data hash MD5: 32K
       51 65 97 6E B1 98 DE 36 6E 28 35 B5 9F 9E 30 FB>)
(   6,<2012-08-13 15:40:53.593 -0500>,<Administrator>,<TOPSPIN>,<proc1d>,<TOPSPIN 2.1>,
      <abs ABSG = 3 
       data hash MD5: 32K
       C2 2C B7 C3 49 90 CE 85 E4 17 1B C8 11 14 9E AB>)
(   7,<2012-08-13 15:40:53.625 -0500>,<Administrator>,<TOPSPIN>,<proc1d>,<TOPSPIN 2.1>,
      <abs ABSG = 4 
       data hash MD5: 32K
       FA FE B5 21 74 80 3D 16 A7 99 1A FD 20 A2 8C 73>)
(   8,<2012-08-13 15:40:53.671 -0500>,<Administrator>,<TOPSPIN>,<proc1d>,<TOPSPIN 2.1>,
      <abs ABSG = 5 
       data hash MD5: 32K
       11 3A 0A 0B 31 28 BB B5 F8 17 A9 26 3C 0E EA 72>)
$$ ##END=
$$ 
$$ $$ hash MD5
$$ $$ 02 01 C2 92 64 38 D3 66 15 E7 69 10 32 9B 79 A3
##$RELAX= 
##$RELAX= 
##$RELAX= 
##$RELAX= 
##$RELAX= 
##$RELAX= 
##$RELAX= 
$$ Bruker specific parameters
$$ --------------------------
$$ [...]
150 150 150 150 150 150 150 150
##$TP07= 0
##$TPNAME0= <>
##$TPNAME1= <>
##$TPNAME2= <>
##$TPNAME3= <>
##$TPNAME4= <>
##$TPNAME5= <>
##$TPNAME6= <>
##$TPNAME7= <>
##$TPOAL= (0..7)
0.5 0.5 0.5 0.5 0.5 0.5 0.5 0.5
##$TPOFFS= (0..7)
0 0 0 0 0 0 0 0
##$TUNHIN= 0
##$TUNHOUT= 0
##$TUNXOUT= 0
##$USERA1= <user>
##$USERA2= <user>
##$USERA3= <user>
##$USERA4= <user>
##$USERA5= <user>
##$V9= 5
##$VALIST= <valist>
##$VCLIST= <CCCCCCCCCCCCCCC>
##$VD= 0
##$VDLIST= <DDDDDDDDDDDDDDD>
##$VPLIST= <PPPPPPPPPPPPPPP>
##$VTLIST= <TTTTTTTTTTTTTTT>
##$WBST= 1024
##$WBSW= 4
##$XGAIN= (0..3)
0 0 0 0
##$XL= 0
##$YL= 0
##$YMAX_a= 491691
##$YMIN_a= -620528
##$ZGOPTNS= <>
##$ZL1= 120
##$ZL2= 120
##$ZL3= 120
##$ZL4= 120
##$ABSF1= 14.98509
##$ABSF2= -5.573092
##$ABSG= 5
##$ABSL= 3
##$ALPHA= 0
##$AQORDER= 0
##$ASSFAC= 0
##$ASSFACI= 0
##$ASSFACX= 0
##$ASSWID= 0
##$AUNMP= <proc_prof1d_extract_pilot.lims>
##$AXLEFT= 0
##$AXNAME= <>
##$AXNUC= <1H>
##$AXRIGHT= 0
##$AXTYPE= 0
##$AXUNIT= <>
##$AZFE= 0.1
##$AZFW= 0.1
##$BCFW= 0
##$BC_mod= 0
##$BYTORDP= 0
##$COROFFS= 0
##$CY= 15
##$DATMOD= 1
##$DC= 0
##$DFILT= <>
##$DTYPP= 0
##$F1P= 0
##$F2P= 0
##$FCOR= 0.5
##$FTSIZE= 32768
##$FT_mod= 6
##$GAMMA= 0
##$GB= 0
##$INTBC= 1
##$INTSCL= 1
##$ISEN= 128
##$LB= 0
##$LEV0= 0
##$LPBIN= 0
##$MAXI= 10000
##$MC2= 0
##$MEAN= 0
##$ME_mod= 0
##$MI= 0
##$NCOEF= 0
##$NC_proc= -8
##$NLEV= 6
##$NOISF1= 0
##$NOISF2= 0
##$NSP= 0
##$NTH_PI= 0
##$NZP= 0
##$OFFSET= 14.98509
##$PC= 1
##$PHC0= 183.1366
##$PHC1= 0
##$PH_mod= 1
##$PKNL= yes
##$PPARMOD= 0
##$PPDIAG= 0
##$PPIPTYP= 0
##$PPMPNUM= 2147483647
##$PPRESOL= 1
##$PSCAL= 4
##$PSIGN= 0
##$PYNMP= <proc.py>
##$REVERSE= no
##$SF= 400.02
##$SI= 32768
##$SIGF1= 0
##$SIGF2= 0
##$SINO= 400
##$SIOLD= 32768
##$SPECTYP= <>
##$SREGLST= <1H.CDCl3>
##$SSB= 0
##$STSI= 32768
##$STSR= 0
##$SW_p= 8223.68421052631
##$SYMM= 0
##$S_DEV= 0
##$TDeff= 65536
##$TDoff= 0
##$TI= <>
##$TILT= no
##$TM1= 0
##$TM2= 0
##$TOPLEV= 0
##$USERP1= <user>
##$USERP2= <user>
##$USERP3= <user>
##$USERP4= <user>
##$USERP5= <user>
##$WDW= 1
##$XDIM= 32768
##$YMAX_p= 489102027
##$YMIN_p= -819573
##$CURPLOT= <Network HP LaserJet P1505>
##$CURPRIN= <$Network HP LaserJet P1505>
##$DFORMAT= <normdp>
##$LAYOUT= <+/1D_H.xwp>
##$LFORMAT= <normlp>
##$PFORMAT= <normpl>
##$SURQMSG= 1
$$ End of Bruker specific parameters
$$ ---------------------------------
##NTUPLES= NMR SPECTRUM
##VAR_NAME=  FREQUENCY,     SPECTRUM/REAL,   SPECTRUM/IMAG
##SYMBOL=    X,             R,               I
##VAR_TYPE=  INDEPENDENT,   DEPENDENT,       DEPENDENT
##VAR_FORM=  AFFN,          ASDF,            ASDF
##VAR_DIM=   32768,         32768,           32768
##UNITS=     HZ,            ARBITRARY UNITS, ARBITRARY UNITS
##FACTOR=    0.250966925370066, 1,           1
##FIRST=     8223.43324360094, 155944,       -226232
##LAST=      0,             67284,           -20606
##MIN=       0,             -819573,         0
##MAX=       8223.43324360094, 489102027,    0
$$ Real data points
##PAGE= N=1
##DATA TABLE= (X++(R..R)), XYDATA
$$ [...]
19559E2763J75753a70800D2483J45914b1344A54361b38758g4156k58415B57981
19548h4563B91688b77848q173B4259a08195b763k4287q8356G4964d5607K1414
19537b4193N575o1506A16580d7840l59349O6363J60326F4532g8408k3583H0236
19525g5952L2002m05493e6969k30053N4021R4912j26235a13569j43741A78253
19514D4933J09152d78764b20601P3355o187A24690b61381O8299M7223M8945d4098
19502a53365N8328P132F7645c51148b9980q4152j10366A85874g0598J8310a0850
19490C276h7159K3031A13013d42714i5603A6174c30080J31395G5000e5142K3572
19479c1570j48774I5554j6296m08h2966K7075j46309L8808D43806b21802C7083
$$ y = [52763, 228516, -170800, 42483, 188397, -21344, 154361, -238758, -74156, -332571, 257981, -84563, 291688, -277848, -286021, 24259, -108195, -2763, -27050, -115406, 74964, -45607, -24193, -18618, -80124, 116580, -47840, -407189, -340826, -180500, 64532, -78408, -101991, 80236, -75952, -43950, -449443, -56969, -287022, -233001, -138089, -264324, -113569, -257310, 178253, 44933, 154085, -478764, -220601, -147246, -153433, 124690, -261381, -193082, -145859, -96914, -44098, -153365, -95037, -87905, 67645, -351148, -29980, -114132, -224498, 185874, -70598, -52288, -10850, 3276, -87159, -64128, 113013, -442714, -95603, 16174, -330080, -198685, 75000, -55142, -31570, -180344, 95554, 79258, 78850, -82966, -55891, -202200, -163392, 443806, -221802, 37083]
19467b7093j39423P2269l1454o6901F0171L0784b7365G5631a72273m1934j18320
19456c32527a09146m03135K33164d8655I4343k455L6126a84219A06671f4100n7474
19445a21574o8758f1380B05991d8015B08469a62980A5994P718n895J48543a41073
19433a99395O2578l55295C8557g7666C1166c47433Q2868R9159b9216j18348q0035
19422b27599B38685a16407j12657p1859J43151j31151C4395f0172j65452A86173
19411b39336B12820a79496h6788j69153A09166g7601D8677a58702j06754A9276
19400H1552J09281d56443a25487A49896i741B13030J65858c8551B3793P7666O0240
19389A61699P562M6032a94890n1721A77080K02580c71697i6423d3050A33078c55462
$$ y = [-27093, -166516, -94247, -125701, -192602, 60171, 90955, -27365, 75631, -172273, -214207, -332527, -109146, -512281, -279117, -48655, 94343, 91888, 128014, -184219, 106671, -64100, -121574, -190332, -61380, 205991, -48015, 208469, -162980, 15994, 23712, 17817, 166360, -141073, -199395, -136817, -492112, 38557, -77666, 31166, -347433, -264565, -165406, -29216, -147564, -227599, 238685, -116407, -229064, -300923, -157772, -288923, 34395, -60172, -225624, 186173, -239336, 212820, -179496, -86788, -255941, 109166, -77601, 48677, -158702, -265456, 19276, 81552, 190833, -456443, -125487, 149896, -9741, 213030, 378888, -38551, 23793, 101459, 161699, 169261, 215293, -194890, -246611, 177080, 379660, -371697, -96423, -43050, 133078, -355462]
19377f3344E7058m258c05811R9273P2718B97286n5673b61426g8429E1759b63335
19365a09057B42835a62715k225e90l14677A97667d5532b1568l38506A94005C5485
19353a63115D7725J96360L83102b27908J0982J5666k47995b17303k47048i2717
19342b12343A4754J46400a93280m7842l02455A36920b04160A73964d3875C12497
19331a19391n36418a75013l1605N9552d9237b0604j75071d2316j59069I2193D339
19319D3566c02344O8593c1451j48303K7713j4451n9901C4474M3359K8224f2751
19307a91678D4228a16273C8470g3671D6078J08769b39322k23037G9912k5381k0752
19296C3779b1538o1285l67065a02964a9154l83995a95902B1532a08012J4723j2378
$$ y = [-63344, 57058, 52800, -305811, -206538, -133820, 297286, 241613, -261426, -78429, 51759, -263335, -109057, 242835, -162715, -164940, -590, -315267, 197667, -45532, -21568, -360074, 194005, 35485, -163115, 47725, 244085, 627187, -227908, -216926, -201260, -449255, -217303, -464351, -92717, -212343, 14754, 161154, -193280, -241122, -543577, 136920, -204160, 173964, -43875, 312497, -119391, -655809, -175013, -206618, -147066, -49237, -20604, -195675, -42316, -201385, 92193, 4339, 43566, -302344, -233751, -31451, -179754, -152041, -166492, -226393, 34474, 77833, 106057, -62751, -191678, 44228, -116273, 38470, -73671, 46078, 154847, -239322, -462359, 79912, 54531, 33779, -21538, -82823, -449888, -102964, -19154, -403149, -195902, 21532, -108012, -93289, -105667]
19285a05667R452C21708G7291J5638h2565A70714B8803b75246a08233q4700B3103
19273b7149r5776q3204B3673a87769c2278G1089a4717k83309A0582e4995J9941
19262c5054B08999b57659a9681j11568B95162A4599b5977m87782A58005Q8908
19252B46913a79194I5830a32227j68775B74843a68651A03051N1710j8893b36827
19241A9198K85089j42435c1804k92974D1367J11915a38586B9300e016j55375f8653
19229a57130K8169j96320B14270O548I3741m0708a21651B32254a60267J3146e8580
19217d2511A47874l859c42196k0410J30866G9140l5714m084J54226P5015k3758
19206B44825h1752k3272I2725a09337r050A59192A1437a07529k27348A30188M1347
$$ y = [-105667, -96215, 321708, 77291, 92929, -82565, 170714, 28803, -275246, -108233, -192933, 23103, -27149, -122925, -206129, 23673, -187769, -32278, 71089, -14717, -298026, 10582, -54995, -35054, 208999, -257659, -19681, -131249, 295162, 14599, -25977, -513759, 158005, 246913, -179194, 95830, -132227, -301002, 274843, -168651, 103051, 154761, 135868, -236827, 19198, 304287, 161852, -31804, -324778, 41367, 153282, -138586, 29300, -5016, -160391, -68653, -157130, -128961, -325281, 214270, 220818, 93741, 53033, -121651, 232254, -160267, -147121, -58580, -42511, 147874, 144015, -342196, -362606, -231740, 79140, 43426, 39342, 193568, 268583, 244825, -81752, -105024, 92725, -109337, -118387, 159192, 11437, -107529, -334877, 130188, 171535]
19195A71535a52622e5109D4067K1119l0716J98055a65073k1664b8178n37864b3582
19183b6188r4680l0180G8878b74837R3052k34718J73175h6530l7719A08141a25104
19171a74191I6287Q0382d73315G4664d01089g681m3678k49755I7110d0212O760
19160c3452C17741a54493B2868a13096E6594N6176h004m9901J2380J3116r2161
19149a24570A55885a31873A37953L8811h576A49174c0871C84993a37803e0948
19138c42768B02254d28144B50872F9152c65207h0172j68759A38671c7366D3453
19127B8353K70375B1700M349a59792L5222G1316a00595I9423c82054a40769j7883
19116a58652l8549F931O6254b42089I6836a65050N5395k3486K2726F4517J9217
$$ y = [171535, -152622, -55109, 44067, 65186, 34470, 232525, -165073, -186737, -28178, -566042, -23582, -26188, -120868, -151048, 78878, -274837, -181785, -416503, -243328, -86530, -124249, 108141, -125104, -174191, 96287, 176669, -473315, 74664, -401089, -7681, -51359, -301114, 97110, -40212, -33452, 317741, -154493, 22868, -113096, 56594, 112770, -8004, -57905, -45525, -32409, -124570, 155885, -131873, 137953, 176764, -8576, 149174, -30871, 384993, -137803, -50948, -342768, 202254, -428144, 250872, 69152, -365207, -80172, -248931, 138671, -37366, 43453, 28353, 298728, 21700, 26049, -159792, -124570, 71316, -100595, 99423, -382054, -140769, -158652, -197201, 6931, 73185, -242089, 96836, -165050, -109655, -133141, -110415, 64517, 83734]
19105H3734J11034h8127d3834p4012l0820L1999A10861c48593h9128n8858B38939
19093a98870A56387K61542g1087q9813k07890M8337a43064A81755c44900a01558
19082f8347K0993A16413d11879a16941c623k28957K3508j83567a69977B43321
19071a26497A02391J55428c78857J16301A73488o971a55422l0865B18349b8946
19060c50288J63380B4011d72984f1643q8733m5052I0610D2430a29594B04003e6547
19048B7655a0285r2002j9609A30899b67999A59708c26484e5783A43887M898C9133
19036f3763k49197R0587E0190b7606A88310a79699k0561B09278b72708i5230n4538
19025a49768e3035H9642j1203b5443n1245A38358a37766K5307k1879A81554A0058
$$ y = [83734, 194768, -88127, -43834, -117846, -148666, -116667, 110861, -348593, -89128, -147986, 238939, -198870, 156387, 417929, -71087, -160900, -368790, -320453, -143064, 181755, -344900, -101558, -68347, -47354, 116413, -411879, -116941, -3623, -232580, -209072, -392639, -169977, 243321, -126497, 102391, 257819, -378857, -262556, 173488, 166517, -155422, -186287, 218349, -28946, -350288, -186908, 24011, -472984, -61643, -150376, -195428, 90610, 42430, -129594, 204003, -56547, 27655, -10285, -102287, -121896, 130899, -267999, 159708, -326484, -55783, 143887, 148785, 39133, -63763, -312960, -222373, 50190, -27606, 188310, -179699, -200260, 209278, -272708, -95230, -149768, -53035, 89642, 78439, -25443, -76688, 138358, -137766, -112459, -134338, 181554, 10058]
19013d06053N9231A56496a2116r532I8033c4682l7974k72486A95660a53891P1827
19002h2064C69009c68524B0592a07322q1123L9827c0221A7761P3319a66696B60861
18990B49129G274M7425b92903a2876B08202k228i4010k4619n3437B25000a9197
18978b50092F0880K5345a7670j85247A70534a56160E8408a83930B0076e7615j07499
18967a65114A35143C2124M2334j4170K85885c00122A07943n1543c76724j11163
18957d87887b36081g7840K3626k43312c4495A57259K20295A67079b78887P8490
18947b00397C3457L41181a83727m3828Q8837A19364J5514M1024g7090b9181A55336
18935a20140B82693b63407B04582r651H97a4924k25721A7972b81262B9347b07029
$$ y = [-406053, -346822, 156496, -12116, -21648, 98033, -34682, -72656, -345142, 195660, -153891, -82064, 369009, -368524, 20592, -107322, -188445, -148618, -30221, 17761, 91080, -166696, 260861, 249129, 7274, 54699, -292903, -12876, 208202, 205974, -94010, -118629, -172066, 225000, -19197, -250092, 60880, 86225, -17670, -202917, 170534, -156160, 58408, -183930, 20076, -57615, -165114, 135143, 32124, 74458, 60288, 346173, -300122, 107943, 56400, -376724, -487887, -236081, -77840, -54214, -297526, -34495, 157259, 377554, 167079, -278887, -200397, 33457, 374638, -183727, -227555, -138718, 119364, 134878, 175902, -77090, -29181, 155336, -120140, 282693, -263407, 204582, 194931, 897, -14924, -240645, 17972, -281262, 29347, -207029]
18923d449k84741P2571l6415n1381N1044c216A44944C1468a26627a5870k27754
18912b43624h7048c8539k57028G8033a60975c8784A49597c4146A7622g0077F7572
18900I9653m9825a22009b6000k46350B54054A5643b32341f172M77k23022M6151
18889a82566A69782N7619a03452K1746L7394p7920o4612F6498b32384e9705j23682
18878a83387A53346b3964k03842B18143n7550b04602f966k15447G3734K5565A3554
18866e0916j72653j1849A88383k1393A3821h1496D8412c78405a61015N1766m4871
18855a54120n758k63272C33128h9901j58112C19482A8998a03294d3039A43282
18844e417D03688j88104a88672O4260C41917A60232a34404j26552J0967A4625
$$ y = [-4449, -289190, -216619, -253034, -304415, -253371, -3216, 144944, 31468, -126627, -15870, -243624, -87048, -38539, -295567, 78033, -160975, -38784, 149597, -34146, 17622, -70077, 67572, 99653, 49828, -122009, -26000, -272350, 254054, 15643, -232341, -6172, -5695, -228717, -182566, 169782, 227401, -103452, -81706, -44312, -122232, -186844, 66498, -232384, -59705, -183387, 153346, -23964, -227806, 218143, 160593, -204602, -6966, -222413, 73734, 99299, 13554, -50916, -223569, -235418, 188383, 166990, 13821, -81496, 48412, -378405, -161015, -109249, -154120, -159878, -423150, 333128, -89901, -248013, 319482, 18998, -103294, -43039, 143282, -5417, 403688, 215584, -188672, -124412, 341917, 160232, -134404, -260956, -249989, 14625]
18833b77287E558b10817C9587M6303K34082a03082B55081b17974h5343c8926A7798
18821e6805j08815B86054j28113c03925G3438d45094B29943a78079G213K23394
18811B30607O315l4762C9910K46868a52038A09976K6277b87919J27435j15131
18801b75615J03116a9797M29E1851a85892g3007l1000K6315F8495c39146A44094
18789a34234A11436D4330K26514e6191H1080L5900m7111a6952p8155n81k2596
18778a18284A63033e3987j68632f3242E3484a41749l78392g1288E6322K16474
18768B72796l8743G3856A6835a66462c2504A08735a61410q3535D0648P5632l3257
18757H3023k7779B327f1324B46629a45896A76488d53662K26003l3905G2239h9192
$$ y = [-277287, 5558, -210817, 39587, 85890, 319972, -103082, 255081, -217974, -85343, -38926, 17798, -56805, -165620, 286054, 157941, -303925, 73438, -445094, 229943, -178079, 7213, 230607, 236922, 202160, 39910, 286778, -152038, 109976, 136253, -287919, -160484, -275615, -172499, -19797, -19368, 51851, -185892, -73007, -104007, -77692, 68495, -339146, 144094, -134234, 111436, 44330, 270844, -56191, 81080, 116980, 69869, -16952, -95107, -95688, -118284, 163033, -53987, -222619, -63242, 53484, -141749, -520141, -71288, 56322, 272796, 234053, 73856, 16835, -166462, -32504, 108735, -161410, -244945, 40648, 116280, 83023, 55244, 2327, -61324, 246629, -145896, 176488, -453662, -227659, -261564, 72239, -89192]
18745B1811A984a27128d6227j54732g5836K2353I0834c3111j07396L3076k06557
18734c13988l2053g2896j22565I9323k1999R890b45331c1535h319j57652C30629
18722b5639l94597g6478n4924J9094J4926n7923j3101B13869K279A7859g8392
18710a68870B30405b11709f2671k80341f236A63498b08108P9704K5815E7247f2107
18698b08238c6178l36471J21951G7810b10691E306J28519c7044m21790a8165j5795
18687c3960r7227a5998A00229N9530g0689j14941H3524a13341d7634A7825b41653
18675a55933o9534e4026a252j87301E7697J19319B0635h0236A52056a44615M7986
18664i6629p0484C35229a47018l05295a74034D4675J24335J15718a61308G7777
$$ y = [21811, 1984, -127128, -46227, -200959, -75836, -53483, 90834, -33111, -140507, -107431, -313988, -346041, -72896, -195461, 99323, 77324, 87214, -245331, -31535, -8319, -165971, 330629, -25639, -420236, -76478, -131402, -112308, -97382, -155305, -168406, 213869, 216148, 17859, -78392, -168870, 230405, -211709, -62671, -343012, -6236, 163498, -208108, -128404, -102589, 57247, -62107, -208238, -36178, -372649, -250698, 77810, -210691, 5306, 133825, -37044, -458834, -18165, -33960, -131187, -15998, 100229, 159759, -70689, -185630, 83524, -113341, -47634, 17825, -241653, -155933, -225467, -54026, -1252, -188553, 57697, 177016, 20635, -80236, 152056, -144615, -96629, -167113, 335229, -147018, -452313, -174034, 44675, 169010, 284728, -161308, 77777]
18653f5640k26743a37723B849a64860J5718d8422b3719A57855E817R9376b0466
18641f2514D7597c76011E9157c74114d5503A0264L82058d80153h0539l37966a0300
18629a11939r6952B68269a21119j78602J27436O2678L6137E4588a90602o8459
18619b59061r7420a2321p026q6921n5820M0192o2024P2516m19156J91478F1871
18607f9121k05145f433p0956M846b7257l64246B14288b3372A70457d4418B33380
18595F1626b7650A05421a69975l33284A23875a70289A33865e0901j44647A26808
18584H3289F734J16593N0946J30515D3390M771b38055B98069d04489j1757j3014
18573d29260B17345E5944a63025o7769B25370a61355r8175A36463l9564c3908
$$ y = [-65640, -292383, -137723, 2849, -164860, -149142, -48422, -23719, 157855, 5817, 105193, -20466, -62514, 47597, -376011, 59157, -374114, -45503, 10264, 392322, -480153, -80539, -418505, -10300, -111939, -208891, 268269, -121119, -299721, -172285, -109607, -73470, 54588, -190602, -259061, -356481, -12321, -19347, -106268, -162088, -121896, -183920, -111404, -530560, -339082, 61871, -69121, -274266, -6433, -77389, -72543, -27257, -391503, 214288, -23372, 170457, -44418, 233380, 61626, -27650, 105421, -169975, -503259, 123875, -170289, 133865, -50901, -195548, 126808, 83289, 6734, 123327, 174273, 304788, 43390, 48161, -238055, 298069, -404489, -416246, -429260, 217345, 55944, -163025, -230794, 225370, -161355, -259530, 136463, 96899, -33908]
18562d50946B08997b44776M2748i4449F3923b31772p4445a52063A07324c5769
18551c5949B2333K48305g2141b9267j55631M337j08567a07432B18651g1615r6529
18540a68144L3418f6126j26307B20266c22182A75065i9624A78296J99573h9992
18529B20768E5016c37781A88194p8204a79107i971n2908m9442m5911B14236o5850
18518A48386b35962I3745M93326a37136L7050l4871o0428a7088j66792e7538D713
18506B274Q292O6089A7655b38019h2214l74622f9783P903B09801b64887J2661
18495b52226a09709k9115H6988L9535a38136a3532E5142K12649e3583k99596a0755
18483a50580A24934a5656j39553j74302g7437o6905N8829A32031b8453H6639R7618
$$ y = [-450946, 208997, -244776, -202028, -94449, 63923, -231772, -306217, -152063, 107324, -35769, -35949, 22333, 270638, -72141, -29267, -184898, -180561, -289128, -107432, 218651, -71615, -168144, -134726, -66126, -192433, 220266, -322182, 175065, -99624, 178296, 377869, -89992, 220768, 55016, -337781, 188194, 109990, -179107, -9971, -62879, -112321, -158232, 214236, 148386, -235962, 93745, 587071, -137136, -100086, -134957, -195385, -17088, -183880, -57538, 4713, 2274, 10566, 76655, 17655, -238019, -82214, -456836, -69783, -61880, 209801, -264887, -252226, -109709, -138824, 86988, 126523, -138136, -13532, 55142, 267791, -53583, -353179, -10755, -150580, 124934, -15656, -155209, -329511, -77437, -144342, -85513, 132031, -28453, 86639, 184257]
18472A84257I369J29900a58568B8807c92087A45634F7960A4871a44765j45372
18462b90137G8120c3296j68439j01097c8828k671f912j2005k54872a1727j96639
18451b08366L0554c56D4171e56124c3418F2097h5541B5659P0655b16987j38317
18440c55304A39416a81516O2846A1192a36841n1984B92687K176a54828F1502j1648
18429D9854f7333l60835a93873A68288n2673a03941j25637B73784A5051f7285
18418b22974d5561D90433b62795P2341A37486J87140G8153b6502I2864A2753L4495
18407D7248J05126h366r4003A20800a56779A13580J094C8120M7746N2824b11235
18395c4198j8658B92191J3925a6636k13204C8659a30059j37615f2683B66694C6977
$$ y = [184257, 9369, 139269, -158568, 28807, -392087, 145634, 67960, 14871, -144765, -290137, 78120, -33296, -201735, -302832, -38828, -41499, -6912, -18917, -273789, -11727, -208366, -177812, -356, 44171, -556124, -33418, 62097, -85541, 25659, 96314, -216987, -355304, 139416, -181516, -118670, 11192, -136841, -188825, 292687, 294863, -154828, 61502, 49854, -67333, -428168, -193873, 168288, 115615, -103941, -229578, 273784, 15051, -67285, -222974, -45561, 490433, -262795, -190454, 137486, 324626, 78153, -26502, 92864, 12753, 47248, 152374, -8366, -102369, 120800, -156779, 113580, 114674, 38120, 85866, 138690, -211235, -34198, -52856, 292191, 306116, -16636, -229840, 38659, -130059, -267674, -62683, 266694, 36977]
18383A7585a86616N0555N4607d782A04417k0346g4801G4986g5648k3068D5159
18371b60648m5230g6207a9319F6076d8005n0114B69016B3380c03394O7412K0250
18360b15732C07684c70227F1740b2151C7661c80420H6759a62398A25246N8487
18350A83733p2649a47836K7337r6964E4589A4880P7451e3560k26220B04755a24117
18338a34263l2982l01963a67357A04303d19359P0855f2567j4301A27415b76226
18327c1711B16062g9481m2459j41006Q3030k28337A56185b2710e868j47589O3951
18316h9506C8987J6296a13661j14962A23774k8689a34656B31144c6660l03576
18306c40236B2967O7003A151i8040F0899a10804B6113d44768A3856M4265J63067
$$ y = [17585, -186616, -136061, -81454, -4782, 104417, 84071, -74801, 74986, -75648, -98716, 45159, -260648, -305878, -76207, -19319, 66076, -48005, -98119, 269016, 23380, -303394, -235982, -215732, 307684, -370227, 61740, -22151, 37661, -380420, 86759, -162398, 125246, 183733, 111084, -147836, -120499, -217463, 54589, 14880, 92331, -53560, -279780, 204755, -124117, -134263, -167245, -469208, -167357, 104303, -419359, -348504, -62567, -76868, 127415, -276226, -31711, 216062, -79481, -121940, -262946, -179916, -408253, 156185, -22710, -5868, -153457, -89506, 38987, 55283, -113661, -228623, 123774, 95085, -134656, 231144, -36660, -340236, 22967, 89970, 1151, -98040, 60899, -110804, 26113, -444768, 13856, 58121, 221188]
18295B21188D850a17955B2677i8995A4523a16200q6567k22636N2485d0593j64120
18284b04713i346B2694J88082E8172b3552o9706k3353k52322a62261q8843B41894
18272b03219i2072F4938f1397j92305n3029E9908J87434b94710l5559a2139C29743
18260C7064i9351n0723b3544D2839i3709a4989F2065c32161J29798D4309J95247
18249B39556a31672C2720a84621h4958C7556e4765I2095b959j22060J1570C8602
18237C20008a77744I4781h2639A17760A7312c8782j33019B8696R9260b25201N7635
18226a67566A25848L0856i2003F8417b97751A34352F28a8075k58108A82901b8478
18214a60621A62516a19274q5234A29942b6450C6698g2710A85255c02187B29511
$$ y = [221188, 4850, -117955, 22677, -98995, 14523, -116200, -202767, -425403, -372918, -40593, -204713, -9346, 22694, 210776, 58172, -23552, -93258, -116611, -368933, -162261, -251104, 241894, -203219, -92072, 64938, -61397, -253702, -306731, 59908, 247342, -294710, -330269, -12139, 329743, 37064, -99351, -150074, -23544, 42839, -93709, -14989, 62065, -332161, -202363, 44309, 239556, -131672, 32720, -184621, -84958, 37556, -54765, 92095, -2959, -125019, -113449, 38602, 320008, -177744, 94781, -82639, 117760, 17312, -38782, -171801, 28696, 127956, -225201, -167566, 125848, 156704, -92003, 68417, -297751, 134352, 628, -18075, -276183, 182901, -28478, -160621, 162516, -119274, -204508, 129942, -26450, 36698, -72710, 185255, -302187, 229511]
18203F410c40226e4035j04243f9706M431h382o7582n8326j64374B05085d2439
18191A63392d8202j21235j49788A95945M7749c11290B38851B413a02981A31916
18180b08004D0557a61351j87966f9487B11368r4569c52713d9216j85324K268a5316
18168a27303A05727B6107K67972j34297c29842a26783p0193b1875C0283M814a55836
18156E6839c9703A99146G0677O2860f4314H7863b14295b5079D5728b67605J13361
18145a54244b5632k45921J7153A79154a59382p2522l7222Q1741j64678c6009A27039
18133i5241j45788C78319j05687a78360L4787a1839A58357F0196J04395e9783
18122a22535o4032j02757r9562B1904a72302h343B35063c44464P882i3407A79778
$$ y = [6410, -340226, -54035, -158278, -69706, -65275, -8382, -75964, -134290, -298664, 205085, -42439, 163392, -48202, -169437, -319225, 195945, 243694, -311290, 238851, 2413, -102981, 131916, -208004, 40557, -161351, -349317, -69487, 211368, 116799, -352713, -49216, -234540, -232272, -15316, -127303, 105727, 26107, 294079, 159782, -329842, -126783, -196976, -21875, 30283, 35097, -155836, 56839, -39703, 199146, 70677, 133537, -64314, 87863, -214295, -25079, 45728, -267605, -154244, -25632, -271553, -254400, 179154, -159382, -231904, -269126, -187385, -352063, -36009, 127039, -95241, -241029, 378319, 272632, -178360, -143573, -11839, 158357, 60196, 164591, -59783, -122535, -186567, -289324, -388886, 21904, -172302, -8343, 235063, -344464, -336582, -93407, 179778]
18110f7661q419J4705b1711q4401p0738k242A75965H578J22740b2196A09200J71494
18098B80694G989K34477d078j75877P5694C9615b2481k60566c6605B99971b21373
18086F3109I928P4555L89693g5764j7060C09202l8261g3213j88236O8834B04220
18074B97767a60367m4346k2567h3671A27276c29936E4562b58764l0339D9745J5993
18063F5738a55844G1746g3390B4954b00251A65939a34434j1906j54539i3431A80614
18051a03416m7323A52528k0988c39537H471K15596P169G0163d77173a383j64642
18040a66025j90994b2570H9943b41526Q0341C4695h871G2470k3582B3969J29153
18029A53122n587P997a18686n135G0867a44542j07336F9336J41892B130e0294
$$ y = [-67661, -76080, -61375, -21711, -106112, -176850, -179092, 175965, 8578, 131318, -22196, 109200, 280694, 7989, 242466, -4078, -179955, -104261, 39615, -22481, -283047, -36605, 299971, -221373, 63109, 9928, 84483, 474176, -75764, -92824, 309202, 270941, -73213, -261449, -192615, 204220, 297767, -160367, -204713, -227280, -83671, 127276, -329936, 54562, -258764, -289103, 49745, 65738, -155844, 71746, -73390, 24954, -200251, 165939, -134434, -146340, -300879, -93431, 180614, -103416, -150739, 152528, 131540, -339537, 8471, 224067, 231236, 70163, -477173, -1383, -166025, -357019, -22570, 89943, -241526, -161185, 34695, -8871, 72470, 48888, 23969, 153122, 147535, 155532, -118686, -123821, 70867, -144542, -251878, 69336, 211228, 2130, -50294]
18017A50658B176K5917L1646A0560a01393k4835I4207a74989A36784D5237O2514
18006A07751d08978A29884a42746B1868a83950I7179R5446E2162b17723O2377
17996a55346j77131N2211J08859L5222j26319A2947c01189E0802K13975d41025
17985a90174n0468R8242C00536a35461B9201O6852a20469a826k35676Q1365j25147
17974b81284B55171a2962j89304A2188a70072k2139K1960B37769b3857A47855
17963A25659c84800h7935L7302A01635K20643a9672j93924B8307K65894c80866
17952a8958k80855h6093H0464l7932G554L3611N9030h2020k0714D914J4366a76696
17939b10915f0147a1164a917B94345f7844k54873B45536g9827K3106A26098a26977
$$ y = [150658, 2176, 28093, 59739, 10560, -101393, -126228, 94207, -174989, 136784, 45237, 107751, -408978, 129884, -142746, 21868, -183950, 97179, 192625, 52162, -217723, -155346, -332477, -280266, -171407, -136185, -262504, 12947, -301189, 50802, 264777, -441025, -190174, -240642, -142400, 300536, -135461, 29201, 96053, -120469, -1826, -237502, -156137, -281284, 255171, -12962, -202266, 12188, -170072, -192211, -170251, 237769, -23857, 147855, 125659, -384800, -87935, -50633, 101635, 322278, -19672, -213596, 28307, 294201, -380866, -18958, -299813, -86093, 80464, 42532, 7554, 41165, 100195, -82020, -102734, 4914, 19280, -176696, -210915, -60147, -11164, -1917, 294345, -67844, -322717, 245536, -79827, -56721, 126098, -126977]
17927B01000E8238c3650D2362J02105b25359A37576c1205k97188B42532a17699
17916B94088g8226n4994J9314P037b9582j34763B50886n3826b21055C7204K3101
17905F0305b44459J17289m8692O5494B63177h3234j90297P2485N0334C35751i8082
17893a34185d3312k60976E5832k1005J15864f3848k03053M4457A87308D2761r925
17882C2836M1674J8773e374l87242A0438i023B6966E132b55137p800M0096G0055
17869b04331b356k39630h4409G6249K04288m0151C4423P0391c46460a4993B2784
17857B37091b40151A76355f3740b7972R167j44820A72883c7188A46388b24675
17846B04840b14228E2189J22740f8019n970j10272A4614f7768B9529J67671p6116
$$ y = [201000, 58238, -33650, 42362, 144467, -225359, 137576, -31205, -328393, 242532, -117699, 294088, -78226, -133220, -113906, -106869, -29582, -164345, 250886, 197060, -221055, 37204, 60305, -244459, -127170, -175862, -110368, 263177, -83234, -273531, -201046, -150712, 335751, -98082, -134185, -43312, -304288, 55832, 34827, 150691, -63848, -266901, -222444, 187308, 42761, 32836, 74510, 93283, -5374, -392616, 10438, -9023, 26966, 5132, -255137, -262937, -222841, 70055, -204331, -2356, -241986, -84409, 76249, 280537, 240386, 34423, 104814, -346460, -14993, 22784, 237091, -240151, 176355, -63740, -27972, -18805, -163625, 172883, -37188, 146388, -224675, 204840, -214228, 52189, 174929, -68019, -73989, -184261, 14614, -67768, 29529, 197200, 121084]
17835A21084a68019E1233b22092K2824A87508O1663b49627c5951a523j14239b6805
17823B93809A9431J77159b13222a9794E93578b6054h892k00706Q2282H8526C7619
17811a57916c3424A19924a86830Q4074j8991b8223G2041K3898b9450k82207B87082
17799a81936C08925m2050j22523b88332G2519g2898k16512C897J22406j7444b26110
17787a9546A60410a13022D0809a46220D2517b08240F7502f8414D6110J97607k5294
17776B18423b83891D441c64930b9955A85808a43610D7184c44115g8553A49420
17765a41398f9573d000j70686H5355N5378J9724n4261J86704g5669L1640A66548
17753b3851P363j00703e3202j0397F483a20957H084K42114e2730A410J83059k3988
$$ y = [121084, -168019, 51233, -222092, -199268, 187508, 249171, -249627, -35951, -1523, -115762, -26805, 293809, 19431, 196590, -213222, -19794, 593578, -26054, -8892, -209598, -127316, 88526, 37619, -157916, -33424, 119924, -186830, -102756, -121747, -28223, 72041, 95939, -29450, -311657, 287082, -181936, 308925, 266875, 144352, -288332, 72519, -72898, -289410, 3897, 126303, 108859, -226110, -19546, 160410, -113022, 40809, -146220, 42517, -208240, 67502, -68414, 46110, 243717, 218423, -283891, 4441, -364930, -29955, 185808, -143610, 47184, -344115, -78553, 149420, -141398, -69573, -4000, -174686, 85355, 140733, 160457, 106196, 292900, -75669, -44029, 166548, -23851, -16488, -117191, -53202, -63599, 6483, -120957, 8084, 250198, -52730, 1410, 184469, 160481]
17741A60481J18718j12228m9541f0120o3057e3251A66800b590B49438a7526I268
17729b1532j51983c0464G5933c4074G9911p23a23242A82194b87674C7284b15870
17717a80268Q1197j7058j5467A39655a44509l1353j52605D1376P9131b59222A40410
17705C77907C1980R7991J19335a51968A1823N9934A3657P0988J45774o3571a47432
17693A53632B2055f4274e584k78508b8512j65504I9414J44776g9855j20592j03987
17682c04434B3394a06387r1951e0401k76571d8722D7023Q428L8232h4252H6693
17670A84389b28971h9365C20622b4506I3500j6944a96327j94713A93149r6527
17660I6622e2186A5519o668B055N5276b06771d4851k81903A91598H1161g8722
$$ y = [160481, 279199, 166971, 117430, -60120, -123177, -53251, 166800, -2590, 249438, -17526, 9268, -21532, -173515, -30464, 75933, -34074, 79911, 79188, -123242, 182194, -287674, 37284, -215870, -180268, -99071, -116129, -131596, 139655, -144509, -175862, -328467, 41376, 120507, -259222, 140410, 377907, 31980, 129971, 249306, -151968, 11823, 71757, 13657, 84645, 230419, 166848, -147432, 153632, 22055, -64274, -5584, -284092, -28512, -194016, 99414, 244190, -79855, -200447, -304434, 23394, -106387, -198338, -50401, -326972, -48722, 47023, 55451, 93683, -84252, 86693, 184389, -228971, -89365, 320622, -24506, 93500, 76556, -196327, -391040, 193149, 96622, -52186, 15519, 8851, 2055, 57331, -206771, -44851, -326754, 191598, 81161, -78722]
17648A41061J6448E005a34449j13322c6357j04897c5560D572K56775A24121h5741
17636g3176J7471A58420a77732B0419O2160d15257B5609J72776r7288f5730A35769
17624c8490G427h4457I143K6440d3457j59217c2843l15249e2239B52588E4330
17612b26295B56304a38573N4173n8067e5661I1089a82380A70369k1412P7795a48700
17600g7222q4963B1997J1228L46926a04248L4989A12244K58038A14807c97090
17589a34284a506k2383l79347a01992B41251a40877j4804P4567C50838j56759
17579A94079L4340C614K6593J02906a02647F69c02461c4480l9012j07353A2868
17567d9878A84169a72513A53304O9617F5647M2390k6418N5172K95787b13180E73203
$$ y = [141061, 157509, 5005, -134449, -247771, -36357, -141254, -35560, 4572, 261347, 124121, -85741, -73176, -55705, 158420, -177732, 20419, 82579, -415257, 25609, 198385, 101097, -65730, 135769, -38490, 7427, -84457, 9143, 35583, -43457, -202674, -32843, -348092, -52239, 252588, 54330, -226295, 256304, -138573, -84400, -142467, -55661, 91089, -182380, 170369, 148957, 226752, -148700, -77222, -162185, 21997, 33225, 380151, -104248, -69259, 112244, 370282, 114807, -397090, -134284, -1506, -23889, -403236, -101992, 241251, -140877, -155681, -81114, 350838, 194079, 228419, 3614, 30207, 133113, -102647, 669, -302461, -34480, -73492, -180845, 12868, -49878, 184169, -172513, 153304, 222921, 65647, 108037, 81619, 136791, 432578, -213180, 573203]
17555a25189H9296J86197c28653B02967q8499C1243J34090J54230a08658b9862
17544a13279r7962A5457E009P3368A8344c4651A13016n0906i1850l649A85434
17532c2212k58400J43418H1693b1030m7328B82176F0108N8205K8894C3966a03245
17520A41543Q9051a30941R034B51433a2847A10292R8526G9697b03047A38388e9264
17508a13888L8237A26912J21925H698J85667J70704j41722D3968j0393c24568
17497B59802h0139A24182R099A5476D33J48812d5596B5137J13353b4073n2268
17486g6341E6790L66752E6483F327M22030f3167A5462K57056q5868H0230J35132
17475B15362f7757C8223L4290e623C98840g0013q177B49613b69903J24870E8150
$$ y = [-125189, 89296, 275493, -328653, 202967, 114468, 31243, 165333, 319563, -108658, -29862, -113279, -211241, 15457, 5009, 78377, 18344, -34651, 113016, 62110, -91850, -95499, 185434, -32212, -290612, -147194, 81693, -21030, -68358, 282176, 60108, 118313, 147207, 33966, -103245, 141543, 230594, -130941, -121907, 251433, -12847, 110292, 208818, 79697, -203047, 138388, -59264, -113888, -75651, 126912, 248837, 8698, 194365, 365069, 223347, 43968, 33575, -324568, 259802, -80139, 124182, 133281, 15476, 433, 149245, -45596, 25137, 138490, -24073, -76341, 56790, 423542, 56483, 6327, 428357, -63167, 15462, 272518, 186650, 80230, 215362, -67757, 38223, 72513, -5623, 398840, -70013, -78190, 249613, -269903, -145033, 58150]
17463F5882K44318a88321j31953E46136A90620e9124p16C43363G6777C7667J0356
17452D8023J95047J12485O6232j0339j28084A19129d7977D67102l3954C515J10710
17441A14225P8395a40371K2645d3611C98424E3278K08742J14883q8076a75549
17430C08025A33986m4574L29818j99529e452F07158B48846C189N13776B12134
17419A26374j3046M59994A64381J13353B0708J06856K52568a90920c1621j68132
17409a99753D9661N04216A63915M77859a70377b0899d300A08472h4865I256J04782
17398A14038a37386b2714k6454B995L42718h787l2324A70299J61710H7656K28076
17387C15732N0967A20456k8304e4461B46727L2815j28795Q932a84347A98512R1461
$$ y = [65882, 310200, -188321, -320274, 546136, 190620, -59124, -59840, 343363, 76777, 37667, 48023, 243070, 355555, 421787, 411448, 283364, 119129, -47977, 467102, 433148, 3515, 114225, 192620, -140371, -117726, -43611, 398424, 53278, 262020, 376903, 288827, -175549, 308025, 133986, 89412, 419230, 219701, -5452, 607158, 248846, 3189, 516965, 212134, 126374, 113328, 573322, 164381, 277734, 20708, 127564, 380132, -190920, -31621, -199753, 49661, 553877, 163915, 641774, -170377, -20899, -4300, 108472, -84865, 9256, 114038, -137386, -22714, -49168, 2995, 345713, -8787, -41111, 170299, 332009, 87656, 315732, 366699, 120456, 92152, -54461, 246727, 279542, 150747, 159679, -184347, 198512, 289973]
17376B89973j19696J66726g7609C51451a10943C25378j56632K96666a20046c9352
17365a10636r6674B04603h0804A21429c4971F4101M84559f0643j1894B32104f6857
17353B49863A12009J43615J57f8510C01107G1908I861P6330b16188B52658E9732
17341A17565d07108C13835A34279J03338J6565a13500B61303c6894p1823F9457
17330b15014E5614A3962K68826R9937j4285D1451K22902j25804J8391b68280C3073
17318B08233H294a19504m8983A80823f532C67657G1715c3854I9704K75441j34552
17307B40593J06140A68795J50347F7526f749A53812l1845R684Q4235d4073C30271
17295A54630o1569K24194G8554L19888a34400B56436A10437a26407A86123b32642
$$ y = [289973, 170277, 337003, -77609, 351451, -110943, 325378, 168746, 465412, -120046, -39352, -110636, -207310, 204603, -80804, 121429, -34971, 64101, 548660, -60643, -72537, 232104, -66857, 249863, 112009, 255624, 255781, -68510, 301107, 71908, 9861, 86191, -216188, 252658, 59732, 117565, -407108, 313835, 134279, 237617, 254182, -113500, 261303, -36894, -108717, 69457, -215014, 55614, 13962, 282788, 382725, 368440, 41451, 264353, 138549, 156940, -268280, 33073, 208233, 8294, -119504, -168487, 180823, -6532, 367657, 71715, -33854, 99704, 375145, 240593, 346733, 168795, 319142, 67526, -6749, 153812, 121967, 131651, 215886, -44073, 330271, 154630, 93061, 317255, 78554, 398442, -134400, 256436, 110437, -126407, 186123, -232642]
17284C20876d2566B94685a72659C70195A61541f9613A3552O4558j4452K72886
17274C36544a29549J8788D8435N957Q955a19206C56888H6970J40236a31286F3447
17262B96963B5709j347q534J44392L45873A67266a8871E4786a2961r285B96043
17250B116M05065A29365J086D3038K71710A00672J72465j01497a158l8325I9022
17238d28012C72141j29713J60293a10654A39454K76839A41651E1758J16713M66079
17228F34550H2133k6045J720J36235M4943J21372c11735b5686G5455J09486q60
17217A84081C9317Q553K03386l0163A05160J65095G7891K0587M2709K83923d9163
17205a53711B76918L5938Q5232j52716E6718q916A7465J10031Q6080J62514J02113
$$ y = [320876, -42566, 294685, -172659, 370195, 161541, -69613, 13552, 78110, 63658, 336544, -129549, -110761, 48435, 54392, 63347, -119206, 356888, 86970, 227206, -131286, 63447, 296963, 25709, 24362, 15828, 160220, 506093, 167266, -18871, 54786, -12961, -22246, 296043, 2116, 407181, 129365, 130451, 43038, 314748, 100672, 273137, 171640, -1158, -39483, 99022, -428012, 372141, 242428, 402721, -110654, 139454, 416293, 141651, 51758, 168471, 634550, 82133, 56088, 57808, 194043, 238986, 360358, -311735, -25686, 75455, 184941, 184081, 39317, 47870, 251256, 221093, 105160, 270255, 77891, 98478, 141187, 425110, -49163, -153711, 276918, 312856, 398088, 245372, 56718, 47802, 17465, 127496, 213576, 376090, 478203]
17194D78203r1801A28470k149J83343n111L2372a23929A05347L42385A51766D3142
17182H3605L54569n9815B8201a8291A51832N8457H3864M87446j49157A83992J48757
17171C32749k9347Q1028p31C3316M2941K94745q7529P2015j27530m2391P9138
17160B64705j04296K07203j04640J01847A45830J90267j01705G4956J79320B3328
17149E81587k35511Q8549j31515j32577Q3736K19338A53456K02750p3254J99905
17139D82857G0714K21397Q8110A22527J25870J10794p0962l4460K54003A12215
17128C35989J55289j56101L2497i5243A93938l1630K81049N2389A52188p5354
17118G6834M03202A8814P9489K18270b63912C32233j64997J8833K73634j6495
$$ y = [478203, 386402, 128470, 126321, 309664, 304553, 336925, -123929, 105347, 447732, 151766, 43142, 83605, 438174, 378359, 28201, -18291, 151832, 210289, 83864, 571310, 422153, 183992, 332749, 303402, 384430, 383699, 33316, 76257, 371002, 283473, 355488, 227958, 185567, 264705, 160409, 367612, 262972, 364819, 145830, 336097, 234392, 74956, 254276, 23328, 581587, 346076, 434625, 303110, 170533, 254269, 473607, 153456, 356206, 282952, 482857, 70714, 292111, 380221, 122527, 248397, 359191, 288229, 253769, 507772, 112215, 335989, 491278, 335177, 367674, -95243, 193938, 162308, 443357, 495746, 152188, 76834, 480036, 18814, 98303, 316573, -263912, 332233, 167236, 186069, 459703, 443208]
17108D43208A28306K29368j60645J70046j61194K59066R152m0306k14651j01019
17098A18123K90846J11460A19039l2147J88474C7512b3361D83900B35813M3598
17088B79411l2220A09285J13005L37245D7447j6113K60262A12220L84237k42626
17078B53831L16036L0127k29459E6725M14766A02886M56403k16494p2381R7990
17068C68404A46283M30312R8023r0857B4516N23890A56297L5934R8667K9839K55295
17057E76032K9773k50680K09203a6004C1643L71488K818J49607j34630r968l3329
17046C77629J33660L5029k61251K65122j46981M55742B56408O4122K95275j47056
17036D68749K15212J2936j18623j9350P6639m578B61623K43720k12127K41457
$$ y = [443208, 128306, 357674, 197029, 367075, 205881, 464947, 474099, 433793, 219142, 118123, 408969, 520429, 119039, 86892, 275366, 37512, -23361, 483900, 235813, 279411, 247191, 109285, 222290, 559535, 47447, 31334, 291596, 112220, 496457, 253831, 569867, 599994, 370535, 56725, 471491, 102886, 559289, 342795, 270414, 368404, 146283, 576595, 674618, 583761, 24516, 548406, 156297, 192231, 290898, 320737, 576032, 605805, 355125, 564328, -16004, 31643, 403131, 405949, 555556, 420926, 410958, 377629, 511289, 546318, 285067, 550189, 403208, 858950, 256408, 320530, 615805, 468749, 683961, 696897, 578274, 558924, 635563, 630985, 261623, 505343, 293216, 534673]
17026E34673n7850A85660K5431K74908k17218L03228O516j24772K52244B82412
17015E56032J75836k71366J75089K8724l14275L19827J08353B96261L59344m978
17005F50627j30392K78542J3371l21815N5085K85501l93536R6255k5017M21349
16995I29970l87151k49808L05525J96762l25954j4261N08992k81479K39418j06952
16985H15062J5117k16539J6198J53460A94674O27888l99979N72241l06597J7321
16975G05548k64484j28036L26171j17145L45080j72617n3234l20114M93069k45274
16965E68964J84170J83551j32542P5092k3530J38122Q316j43171J06571j6552
16955I48991l57775K61541K88897m17990K38517L9587j99341K00335j4799k72844
$$ y = [534673, 476823, 185660, 211091, 485999, 268781, 572009, 578525, 453753, 705997, 282412, 556032, 731868, 460502, 635591, 664315, 350040, 669867, 778220, 296261, 655605, 650627, 520235, 798777, 812148, 490333, 545418, 830919, 437383, 533638, 508621, 929970, 542819, 293011, 598536, 795298, 469344, 455083, 964075, 682596, 922014, 815062, 830179, 613640, 629838, 783298, 194674, 822562, 422583, 994824, 688227, 705548, 441064, 313028, 639199, 522054, 867134, 694517, 641283, 321169, 814238, 568964, 753134, 936685, 804143, 879235, 855705, 993827, 1002143, 858972, 965543, 948991, 591216, 852757, 1141654, 723664, 962181, 1001768, 802427, 1002762, 987963, 715119]
16945G15119K86941m7048Q1997o692p8593J45360M3068j6339K0950K4103j01707
16934A067159l89675N94961r3334l1097j83672Q3973J8845J06481O0433k88409
16924I45665N04998o15177l1928M10892n2980j1033J84683j07704l6107j24721
16914A066588L52064j39835K01230k10491j61479K85795N7852J81882N7628m2077
16904A649157n5090J14286k53334m6514j23024J87608K15626J0695M7267j88299
16894A558378k33795M54541l00183J05979j38692N46224l56436K03637j58328
16885A681325J49952k13264K44110j62919L09993m41216L53243N0172J24000l80426
16875A714970N57607k19093k8617N03874l32288J10876N5448k33945j38799K35360
$$ y = [715119, 1002060, 955012, 1037009, 1030317, 951724, 1097084, 1140152, 1123813, 1144763, 1168866, 1067159, 677484, 1272445, 1179111, 1148014, 964342, 1048315, 1067160, 1173641, 1234074, 945665, 1450663, 835486, 803558, 1214450, 1161470, 1150437, 1335120, 1227416, 1191309, 1066588, 1418652, 1278817, 1480047, 1269556, 1108077, 1393872, 1451724, 1633606, 1691234, 1649157, 1594067, 1708353, 1455019, 1408505, 1285481, 1473089, 1688715, 1699410, 1746677, 1558378, 1324583, 1779124, 1478941, 1584920, 1446228, 1992452, 1636016, 1839653, 1681325, 1831277, 1618013, 1862123, 1699204, 2009197, 1567981, 1921224, 1971396, 2095396, 1714970, 2272577, 2053484, 2024867, 2528741, 2196453, 2307329, 2362777, 2128832, 1990033, 2225393]
16865B225393J75326P1495j15516J49155J40876k74560N28440q5322R7607J3175
16855B926069m2764R6681M778l72864M47334J13162j05064j2687k17705M03920
16845C240860J02418j04070K3131q2506L00810K54405k71573J15268L96024k24550
16835C750217j06743o311J17511L07545m2774N7783K70385K12351L7997k43951
16825D354010R0073K25056K05881j1987M94330p9265j80947j8802J99812k0460
16815E257701l0055Q08416l23137K72024k6140N00116k74568N83779l33313J35504
16805F570327L27001J96190J38160K53737J92294j47194M45176J17304J24991
16796H217986L32512P162O17596K28520n0676M44379J56121N66103k14621L33017
$$ y = [2225393, 2400719, 2472214, 2356698, 2505853, 2646729, 2372169, 2900609, 2815287, 2912894, 2926069, 2883305, 2979986, 2984764, 2611900, 3059234, 3172396, 3067332, 3054645, 2836940, 3240860, 3343278, 3239208, 3262339, 3179833, 3480643, 3735048, 3463475, 3578743, 3974767, 3750217, 3643474, 3637163, 3754674, 4062219, 4019445, 4077228, 4347613, 4559964, 4597961, 4354010, 4444083, 4669139, 4875020, 4863033, 5357363, 5278098, 5097151, 5078349, 5278161, 5257701, 5227646, 6036062, 5712925, 5984949, 5958809, 6458925, 6184357, 6768136, 6434823, 6570327, 6897328, 7093518, 7231678, 7485415, 7677709, 7530515, 7975691, 8092995, 8217986, 8550498, 8557660, 9175256, 9403776, 9353100, 9797479, 9953600, 10519703, 10305082, 10638099]
16786A0638099M349L61020J049529J91967L29845K54051M51762L47527M06146
16777A4034295R17862L00969N67772J3519Q67072M55248P70896P37693O00049
16768A9265375Q76676O94274L40947J097188Q47585J041073O98749J134848J331615
16759B7328330J046072J355652J582591J301318J332045J184661K370206J255051
16751C8755926K302010J738986K468331K005131K661538K903748K797709L181664
16743E8815043L095196L799762L723360M023786M390713N067936M854232N647953
16735I3417981N438738N903899O566903O856043P217509P161639P577625Q069057
16727A48209394P542128P350182P602367O693549O005384N483606M081851K936305
$$ y = [10638099, 10642448, 11003468, 12052997, 12244964, 12574809, 12828860, 13280622, 13628149, 14034295, 14952157, 15253126, 15820898, 15834417, 16701489, 17156737, 17927633, 18665326, 19265375, 20142051, 20836325, 21177272, 22274460, 23122045, 24163118, 24861867, 25996715, 27328330, 28374402, 29730054, 31312645, 32613963, 33946008, 35130669, 37500875, 38755926, 41057936, 42796922, 45265253, 47270384, 49931922, 52835670, 55633379, 58815043, 61910239, 65710001, 69433361, 73457147, 77847860, 82915796, 87770028, 93417981, 98856719, 104760618, 111327521, 118183564, 125401073, 132562712, 140140337, 148209394, 155751522, 163101704, 170704071, 177397620, 183403004, 188886610, 192968461, 195904766]
16719A95904766J198586K25032j533083l015307m544887n092471o586784p185183
16711A69370669p938706p843725q400910p775941q450642p567451p012578p339128
16703A07041588p081180o053173n832731n283734n486211m609045m198002m092350
16695F4405162l998599l132287l210912l121467k845513k879544k217611k594638
16687D0404591j800365j598586k125699j560757j725754j192596j341305j484815
16679B7574714j429322p89042j181006j109894o60162j073713o74339r68307p87885
16670A8901044n64543o86455o67928o65739l36243q40945l97407p81826l45109
16661A3614849l04495m86024l40725m46006o68106k02645l77875o2121l85386
$$ y = [195904766, 197103352, 197328384, 195795301, 192779994, 188235107, 183142636, 176555852, 169370669, 161431963, 153588238, 145187328, 137411387, 128960745, 121393294, 114380716, 107041588, 99960408, 93907235, 88074504, 82790770, 77304559, 72695514, 68497512, 64405162, 60406563, 57274276, 54063364, 50941897, 48096384, 45216840, 42999229, 40404591, 38604226, 37005640, 34879941, 33319184, 31593430, 30400834, 29059529, 27574714, 26145392, 25356350, 24175344, 23065450, 22405288, 21331575, 20657236, 19688929, 18901044, 18336501, 17650046, 16982118, 16316379, 15980136, 15139191, 14741784, 13959958, 13614849, 13310354, 12824330, 12483605, 12037599, 11369493, 11166848, 10788973, 10726852, 10341466]
16652A0341466k42580j45710m50929m12287m96635K25279n58291J74859n17288
16643G917884q0979m6713m32408L6422k04161m51933l9836j38101L0002n97617
16633E992560J11741j90041k801q309k63911j83788m57967J23616r736k64915
16623D846449J1093m7970l11229K68415m70631L14981k79225j50265l74963m6254
16613C760401N7009J37663l12433p3625j51463q6684k21687L47615n8526k4388
16603C373882J75159p52228L60058r3264m6158J88638m50205J8517K18914k35399
16593B757914K11195n17244N7724J81551J01911j59788j56663q2761l13577J8920
16583B099182M92133P2081k4245n30673q2681l1708J58048j56510K32407j91929
$$ y = [10341466, 10098886, 9953176, 9502247, 9089960, 8593325, 8818604, 8260313, 8435172, 7917884, 7836905, 7790192, 7357784, 7394206, 7190045, 6738112, 6698276, 6560175, 6590177, 5992560, 6104301, 5914260, 5911459, 5903150, 5639239, 5455451, 4997484, 5121100, 5111364, 4846449, 4857542, 4809572, 4498343, 4766758, 4296127, 4611108, 4331883, 4181618, 3806655, 3760401, 3817410, 3955073, 3642640, 3569015, 3417552, 3330868, 3109181, 3456796, 3398270, 3373882, 3549041, 2796813, 3156871, 3063607, 3017449, 3206087, 2755882, 2774399, 2993313, 2757914, 2969109, 2451865, 2509589, 2691140, 2793051, 2633263, 2476600, 2393839, 2080262, 2099182, 2591315, 2663396, 2639151, 2108478, 2025797, 1994089, 2152137, 1995627, 2228034, 2036105]
16573B036105j46285J58692k92194J41113k57474O23392j87189k37817r9593P5503
16563A814253J99907N9973k02773j46978J91324j59708k13422J81498j86005M8884
16553A586953M6667M2069J75854l65301q941J6343L46822j80365k37260r2780
16543A330061J82764j40874R8274k50016j57707J26682k8025L73845l12315J58094
16533A380783k11867O3984K15368l73991K01959r1337K70223k57221J36118l01230
16523A032789J04224l10165M30107k47132J47942K75130n33523q6114K18576j26698
16513I05136N5861N3631M1487q5767k07580R4862P0890j88719m9456R2485K28649
16502A011479q4199j95387J9985N08074F01701K94411J63820j02793j77403J16240
$$ y = [2036105, 1889820, 2048512, 1756318, 1897431, 1639957, 2263349, 2076160, 1838343, 1738750, 1814253, 2014160, 2074133, 1871360, 1724382, 1915706, 1755998, 1542576, 1724074, 1538069, 1586953, 1633620, 1675689, 1851543, 1486242, 1477301, 1493644, 1840466, 1660101, 1422841, 1330061, 1512825, 1371951, 1470225, 1220209, 1062502, 1189184, 1161159, 1535004, 1222689, 1380783, 1168916, 1232900, 1448268, 1074277, 1276236, 1184899, 1455122, 1197901, 1334019, 1032789, 1137013, 826848, 1256955, 1009823, 1157765, 1432895, 899372, 813258, 1031834, 905136, 960997, 1014628, 1056115, 970348, 762768, 857630, 928520, 739801, 690345, 782830, 1011479, 927280, 731893, 751878, 1259952, 601701, 896112, 1059932, 957139, 779736, 895976]
16492H95976j12778L8582M1003j886k49842Q8543j00044j05210N24518m03162
16482F15700J59781q7000k96473L16432j34355L25728l51833O2065j72553K82304
16472G19796J47186l70298P355L17530l80266l5789N19196l44773M6826J25927
16462G52690P4278D06049K01498Q8324B97959J47023J75928o6293A82869M16344
16452E99213J16428B35120N58730j49292j93584k917A46848K97842N15565A78007
16441E56771n8677B43907L51629k58550Q1155J89025J20555k59177J04619B33034
16430G06784k73260K4246j00035L8161J58125Q4684B10786K43713O1614J42830
16420F58943g5715C86640J10136M081J30941j86583J8852A69648L02657n4384
$$ y = [895976, 783198, 821780, 862783, 860897, 611055, 699598, 599554, 494344, 1018862, 615700, 775481, 688481, 392008, 708440, 574085, 899813, 547980, 610045, 437492, 719796, 866982, 496684, 504039, 821569, 441303, 405514, 924710, 579937, 626763, 752690, 826968, 406049, 607547, 695871, 297959, 444982, 620910, 554617, 182869, 599213, 715641, 235120, 793850, 644558, 450974, 448057, 146848, 444690, 960255, 178007, 556771, 498094, 243907, 595536, 336986, 418141, 607166, 727721, 468544, 573163, 233034, 706784, 433524, 457770, 357735, 395896, 554021, 638705, 210786, 454499, 516113, 658943, -75715, 386640, 496776, 500857, 631798, 445215, 464067, 169648, 472305, 417921]
16410D17921j47458k4954L77856k25281J38753k39411R1900H3302L31403d7796
16399D87513K4155B53457j4003J8522K92786j61285o1374J56352k7505k20958
16389B35992k9557L87680B33723r6032N1807R0355q0703L46456j90255J2368j939
16378C65780p9339j42130M77525A27852l3614K6134D7087K70158A07422O44024
16368G51446B72032K67551k24114A40816M24293j28937j33663j03326N6527j11942
16358A43768m8199K21407j57437o5492a8060C62549J83035H0667P4564i2038B53516
16346D33492j94842J98731A82444J07825L6796N5533j43491C6960K3877c9107
16335A4165L36486O04299f667C0289P5129M36838A57871P1410L8564J64411a59402
$$ y = [417921, 270463, 245509, 623365, 398084, 536837, 297426, 389326, 83302, 414705, -47796, 487513, 511668, 253457, 239454, 257976, 550762, 389477, 328103, 484455, 456950, 235992, 206435, 594115, 233723, 137691, 189498, 279853, 199150, 545606, 355351, 367719, 365780, 286441, 144311, 621836, 127852, 94238, 120372, 47087, 317245, 107422, 751446, 272032, 539583, 315469, 140816, 565109, 436172, 302509, 199183, 255710, 143768, 95569, 316976, 159539, 94047, -18060, 362549, 545584, 80667, 155231, -92038, 253516, 433492, 238650, 437381, 182444, 290269, 327065, 382598, 239107, 36960, 60837, -39107, 14165, 350651, 954950, -6667, 30289, 105418, 542256, 157871, 229281, 267845, 432256, -159402]
16323D36368A76528J39574A53851K10388A37327n4161R7244J31359G2908K85511
16313C58419J06525D0372J0826g2444B68406I3988M5073K9239H2324J33563n6978
16302A58909J97185J10881j87155j02570L655K7491P1768o965a57618D21947j28939
16291B93008N7365o3260L10784J6908B73200H8922K67829F6140J80141I9562K00812
16280C00374Q4475a45824C88376c7545A51516L06230k05759M5150p9862K7834
16270B45109r9110B0500g4653E47046A81621L13310A52505Q6347C9488J85183
16260B24671b42800A30184e1414A72110c3769B66041j24609K9291J44094f8527
16249d1132l2865A45202a07057l9772G4348J39890J79690d0982B68232B5145K45261
$$ y = [436368, 176528, 316102, 153851, 364239, 137327, 83166, 180410, 311769, 72908, 358419, 464944, 40372, 51198, -72444, 268406, 93988, 139061, 168300, 82324, 215887, 158909, 356094, 466975, 279820, 177250, 180905, 208396, 280164, 273199, -157618, 421947, 293008, 350373, 287113, 597897, 614805, 273200, 88922, 356751, 66140, 246281, 99562, 300374, 384849, -145824, 388376, -37545, 151516, 457746, 251987, 297137, 217275, 245109, 145999, 20500, -74653, 547046, 181621, 494931, 152505, 238852, 39488, 224671, -242800, 130184, -51414, 172110, -33769, 266041, 141432, 170723, 314817, -68527, -41132, -73997, 145202, -107057, -146829, 74348, 214238, 393928, -40982, 268232, 25145, 270406]
16238B70406A0533a68907B24529d2934q6019d7934B11332J49345b55300B41262
16227A940d7483A34418J18900G6075i0137A0893Q6614f334B45380E8871b52062
16215b38570j04915J66752L5852d7422A28692a22885C8835Q7319K15819D2368
16204A88230J58731Q0796g6586C41812A65401M3316B3260N6172c74063A50980
16193b4931l4091a4664j07761N5488P196D14386h1293q8771B69629I4874P8468
16182A73342J14650D9472i8565B66712C9594j5073J5804c20462C81930B7831J35134
16171A62965a49661C7828M9g6913A46419A035J53920a97427A05213m7489a90193
16159c609A81467A2040Q1279J86141C1650c59606B36573I3383K98728A77783f8420
$$ y = [270406, 10533, -168907, 224529, -42934, -128953, -47934, 211332, 360677, -255300, 241262, 1940, -47483, 134418, 253318, 76075, -90137, 10893, 97507, -6334, 245380, 58871, -252062, -238570, -343485, -176733, -140881, -47422, 128692, -122885, 38835, 126154, 341973, 42368, 188230, 346961, 427757, -76586, 341812, 165401, 208717, 23260, 79432, -374063, 150980, -24931, -59022, -14664, -122425, -66937, -59741, 414386, -81293, -170064, 269629, 94874, 173342, 287992, 49472, -98565, 266712, 39594, 24521, 40325, -320462, 381930, 27831, 162965, -149661, 37828, 37877, -76913, 146419, 1035, 154955, -197427, 105213, 57724, -190193, -3609, 181467, 12040, 93319, 279460, 31650, -359606, 236573, 93383, 392111, 177783, -68420]
16147A9362b60507A11877A205L10413a45316G2358a0651k68362f5487r9828A32307
16135A18712J12209A04301g4590F4097a803A67158q0296b59812D4676f3137A00858
16123A88134f1703J6759l3568l84552c3422k66364A49901i0723d4579G6767a62986
16111a10994D754P6574N6881D3187h3741A30246b1877I5906M2786O219d0065A62233
16098a1756C9970P7155P0362I859j433a68126A54406M1839b37463J18432A15841
16086i0878A24883a73306G8424b98294E5902e67351D027L99924d6633p2887A78283
16074c2j77046B6159d702A92884K2540b20427P9283p9870A44442b09857I8672
16062a37467F0223P5979f10l312o5794B40455I5666J44778c844r3572C49511q3892
$$ y = [19362, -260507, 111877, 1205, 311618, -145316, 72358, -10651, -279013, -65487, -165315, 132307, 118712, 230921, 104301, -74590, 64097, -1803, 167158, 86862, -259812, 44676, -63137, 100858, 188134, -61703, -44944, -78512, -463064, -33422, -299786, 149901, -90723, -44579, 76767, -162986, -110994, 4754, 81328, 138209, 43187, -83741, 130246, -21877, 95906, 138692, 144911, -40065, 162233, -11756, 39970, 117125, 187487, 9859, 8426, -168126, 154406, 196245, -237463, -119031, 115841, -90878, 124883, -173306, 78424, -298294, 55902, -567351, 4027, 403951, -46633, -119520, 178283, -32, -177078, 26159, -4702, 192884, 215424, -220427, -141144, -221014, 144442, -209857, 98672, -137467, 60223, 136202, -610, -3922, -69716, 240455, 95666, 240444, -3844, -97416, 349511, 265619]
16050B65619b29704k11630k7096c6196B3218g706A14842j7648k9323J61247l1827
16039A97291e6746j09499A617J13932L9812i170j57936g2431C86623j05106r1005
16028A90512F2714L4470N6056a88410E574J0703L47374B5685g9412C0637a32251
16016a84269b5286a1285j39592l7851g3393j36422P8283b3988k9162B83573B1084
16004C7932c54975B93226F754J5656R3263a32444k51903c2789k59356A8451b76629
15992C5855J50130c50510c0619I7048b43146A59432J70089A61098F0939A1966
15981F1666L00412j40233b1064o1837q1847M6574C05480d92780C750R8358F841
15969a19253b3159B62219a04534n973A05081b9992B42015C8834c7731A32854e3440
$$ y = [265619, -229704, -441334, -468430, -36196, 23218, -7706, 114842, 97194, 67871, 229118, 197291, -56746, -166245, 1617, 115549, 155361, -9170, -167106, -72431, 386623, 281517, 190512, 62714, 97184, 153240, -188410, 5574, 16277, 363651, 25685, -79412, 30637, -132251, -184269, -25286, -11285, -150877, -188728, -73393, -209815, -131532, -23988, -53150, 283573, 21084, 37932, -354975, 293226, 6754, 22410, 115673, -132444, -384347, -32789, -292145, 18451, -276629, 35855, 185985, -350510, -30619, 97048, -243146, 159432, 329521, 161098, 60939, 11966, 61666, 362078, 221845, -21064, -82901, -164748, -118174, 305480, -492780, 3750, 102108, 6841, -119253, -23159, 262219, -104534, -110507, 105081, -29992, 242015, 38834, -37731, 132854, -53440]
15957A69540a07801k36333i9331n313q8355B2035J54795a18152q1258d6713I1477
15945b20279A29832e2166A14414D0161d8616C82745a52923A77041b9573A09085
15934a47794B826a4443l40748I1295i75A59053a48299q8973A59521d62271a74559
15922C25525j15359l8807a0526H7564c83029a20844q7044K1209C42324I8380b0622
15910b85545K6723a05053j39293D2694b90478f2782C766O4219b88561A21094J54482
15899B75576N1433a30178A89125b64812a27203j93226a21791e5594i149C22814
15888B1113J18367E9707b5619l52803A81050F2120l283a36222c3981A70220b66980
15876g163j40631M6120A32641c15964J21000d6455j3077b206j45950A73305p2001
$$ y = [169540, -107801, -344134, -99331, -104644, -192999, 22035, 176830, -118152, -199410, -46713, 91477, -220279, 129832, -52166, 114414, 40161, -48616, 382745, -152923, 177041, -29573, 109085, -147794, 2826, -14443, -355191, 91295, -975, 159053, -148299, -237272, 159521, -462271, -174559, 325525, 210166, 171359, -10526, 87564, -383029, -120844, -207888, -186679, 342324, 98380, -20622, -285545, -258822, -105053, -244346, 42694, -290478, -62782, 3766, 67985, -288561, 121094, 275576, 327009, -130178, 189125, -264812, -127203, -320429, -121791, -55594, -9149, 322814, 21113, 139480, 59707, -25619, -378422, 181050, 62120, 58837, -136222, -33981, 170220, -266980, -7163, -147794, -101674, 132641, -315964, -194964, -46455, -59532, -2206, -148156, 173305, 101304]
15865A01304c9761B4409O9698J31580a95703P2890m6714c7115q3936r8041A62182
15853A45543A5897K97076H1066L02718K06837c23990m902A46401j8679n3109O0892
15842A35505b8510A58811d87527b27861a12989I9418g4559k1251A34122L4010
15832A68132F770M5296f147k80230J19690a1290H7519a63705b7905b694A22618
15820A52250o5547a05651A20045C5726c26803c0635j43641A50910c77822A99174
15809A01508a85811k33497F024J14648P9206b0383A07229J64696b15554f9876
15798A72755a26852B37522H4053A6127Q1576a26659n3696j46271a60780f0595
15787a74425C19987b07482h7726A76880Q1918a82924j86788a58992O260n7717
$$ y = [101304, -39761, 24409, 94107, 225687, -195703, -122813, -169527, -37115, -121051, -219092, 162182, 145543, 15897, 312973, 81066, 383784, 590621, -323990, -328892, 146401, 127722, 74613, 135505, -28510, 158811, -487527, -227861, -112989, 99418, -74559, -95810, 134122, 168132, 6770, 52066, -6147, -286377, -166687, -11290, 87519, -163705, -27905, -2694, 122618, 152250, 86703, -105651, 120045, 35726, -326803, -30635, -174276, 150910, -377822, 199174, 101508, -185811, -419308, 6024, 120672, 199878, -20383, 107229, 271925, -215554, -69876, 172755, -126852, 237522, 84053, 16127, 97703, -126659, -180355, -326626, -160780, -60595, -174425, 319987, -207482, -87726, 176880, 258798, -182924, -369712, -158992, -152732, -210449]
15777b10449A12480b34650A88247h6399l82566h9834B47195a72073c0849p8484
15767a09333b1752B30931b31263k93281B2590j535J20991C3059a69896d6709A23904
15755c35049L2136a03156C1996f8364o8164A07917n3673b1666C1341m371K68231
15744B95201d7757B6211a17918B74146a93988e0130B32611I2337J77207F6000
15733b15785l8983H4158C7770J94743a4638k83741B12840c66174A33064a77914
15722a37977J7242d5303B57216c15405A0709J49378J21631a31956k64839C15765
15711A73874L2939F8532a75424r3542j95778a7671j30627A35832e1192A3976e06838
15699H9377k5283c53043i1888A06197m8472b60754a8990A86199j8940c8767k28694
$$ y = [-210449, 112480, -234650, 188247, -86399, -468965, -89834, 247195, -172073, -30849, -109333, -21752, 230931, -231263, -524544, 22590, 21055, 142046, 33059, -169896, -46709, 123904, -335049, -302913, -103156, 31996, -68364, -136528, 107917, 54244, -21666, 31341, 26970, 295201, -47757, 26211, -117918, 274146, -193988, -50130, 232611, 92337, 269544, 66000, -215785, -254768, 84158, 37770, 232513, -14638, -298379, 212840, -366174, 133064, -177914, -137977, -120735, -45303, 257216, -315405, 10709, 160087, 281718, -131956, -396795, 315765, 173874, 206813, 68532, -175424, -268966, -464744, -17671, -148298, 135832, -51192, 13976, -506838, 89377, 64094, -353043, -91888, 106197, 57725, -260754, -18990, 186199, 167259, -38767, -267461]
15688b67461A61380k3802a35544q580k0106B49665F2628i1940A56110F260J52384
15677A58644o2310J17116F8797d834B01617N0785K48G6106q552J33922G9362M035
15665H3397c08446F5756a32937a777E0006J30891c7880j26253j83016A90856b3340
15653b82365f8695A06258L47453A44939J3600b07456C2347b31824A89346c60605
15642h0725E112c69156i7258o5733c3095o6903M0030K8369j88359d1216j25400
15631a66616r7170C0265K74512c3564A48908b00488A25072C0322N6798i0325d1528
15619c99959C9667F721N6209a4380j31554B18378b09023A91157a15397D9838K89127
15608C38965e58585b40661c1073A52268a37165C23893b41388j16624a52514m32088
$$ y = [-267461, 161380, 137578, -135544, -144124, -164230, 249665, 62628, -91940, 156110, 6260, 158644, 96334, 213450, 68797, -4834, 201617, 252402, 252650, 76106, 67554, 201476, 79362, 83397, -308446, 65756, -132937, -1777, 50006, 180897, -37880, -164133, -347149, 190856, -23340, -282365, -68695, 106258, 453711, 144939, 158539, -207456, 32347, -231824, 189346, -360605, -80725, 5112, -369156, -97258, -162991, -33095, -99998, -59968, -31599, -219958, -41216, -166616, -263786, 30265, 304777, -33564, 148908, -200488, 125072, 30322, 87120, -90325, -41528, -399959, 39667, 6721, 62930, -14380, -145934, 218378, -209023, 191157, -115397, 49838, 338965, -558585, -240661, -31073, 152268, -137165, 323893, -241388, -358012, -152514, -584602]
15598e84602F771K5633c18969a10368l0441e6966j15397B57246C0455g838A33716
15586f4923E7390K7688J68827A25471e5227j11390A21114C0176g8297j27736B52870
15574A91241i6432I6862b12666L3545G8347j948i1939j00701A34876J07264a38290
15562d7224k92875A0871P180b10901A13281a18654e6627E7450d6798j34256j6086
15551a97140B39410c13472M6589l8314a11833L4245k8001I6326B4073b11309A45382
15539d72107A64998J33363C7618g5585K6021D0962c1794q0293A26879I166R9465
15528A08631g9128j45779Q746K7251Q3499d631B11650J10645a21072l11387C60577
15516b55899m2301A86410c51467B0025K34446a04957m1703N2499A0255c25771
$$ y = [-584602, 6771, 32404, -318969, -110368, -140809, -56966, -172363, 257246, 30455, -7838, 133716, -64923, 57390, 85078, 253905, 125471, -55227, -166617, 121114, 30176, -78297, -206033, 252870, 191241, -96432, 96862, -212666, -179121, 78347, 76399, -91939, -192640, 134876, 242140, -138290, -47224, -340099, 10871, 18051, -210901, 113281, -118654, -56627, 57450, -46798, -181054, -197140, 239410, -313472, -266883, -305197, -111833, -77588, -105589, 96326, 24073, -211309, 145382, -472107, 164998, 298361, 37618, -75585, -49564, 40962, -31794, -112087, 126879, 9166, 108631, -79128, -224907, -216161, -188910, -105411, -4631, 211650, 322295, -121072, -432459, 360577, -255899, -298200, 186410, -351467, 20025, 254471, -104957, -146660, -94161, 10255, -325771]
15505A54465d4249o8315G1414Q2297J197b73493h1455H527a59067d4470G8073
15493B14639a15915H0445a91316g1457o182q0603c7395B4272a65990B95059b25333
15481i4385A99392a50946C49287C2842b14295a00932a8634o4971K03D89754a40327
15469b237j6407A90021b63499J7109B41746q5892n5353N4093J27308b68488k4384
15458b92872a31217A02002b6876E7572i9860K3903A60647M6427g5011r2476I8944
15446i9024j95977c9338j67096H4514b18325o5989J20542e4061j13717l26222
15436d94000b22885m9123K6654L0354G7441b88754b6923B68234a16676B85553
15425A10651K34439a12404n258j14898f1328e813F7152j2512J33777k2299b9955
$$ y = [154465, -44249, -112564, 71414, 153711, 154908, -273493, -81455, 8527, -159067, -44470, 78073, 214639, -115915, 80445, -191316, -71457, -77639, -158242, -37395, 24272, -165990, 295059, -225333, -94385, 199392, -150946, 349287, 32842, -214295, -100932, -18634, -83605, -83402, 489754, -140327, -2237, -18644, 190021, -263499, -246390, 241746, 155854, 100501, 154594, 281902, -268488, -292872, -131217, 102002, -26876, 57572, -99860, -75957, 160647, 207074, -75011, -167487, 98944, -99024, -295001, -39338, -206434, 84514, -218325, -284314, -163772, -54061, -167778, -494000, -222885, -272008, -245354, -215000, 77441, -288754, -26923, 268234, -116676, 285553, 110651, 345090, -112404, -117662, -232560, -61328, -5813, 67152, 54640, 188417, 166118, -29955]
15413D9542b99630F4387a45607B83051g3285d363k01343j00883D584i1530C1789
15401a38264A4803b82402I8474l0571c204j19907A61987m2949b89996b9707I2228
15389a01711j40580P6848D43877D3618b8300G2433a40456j30408o9675a52336
15378i20p252k09594k95973J54068d1389m17053b8730j2552J4919B67037E889
15366c93496I0337o66c4811A57751l5552i3062b8446B58594J6784b52757F5657
15354a23139H7487a48499H7565K2035k1903R8146D4043b31984h6408r1486h2615
15342a52723E6239Q9499m5133a291j78462A56215a73154f9168j20617L0354b9177
15330G695c5478F7120c5259k05069J19762D11043f1598D00687b19072B24111a29299
$$ y = [49542, -299630, 64387, -145607, 283051, -73285, -4363, -205706, -306589, 4584, -91530, 31789, -138264, 14803, -282402, 98474, 67903, -3204, -123111, 161987, 119038, -289996, -29707, 92228, -101711, -242291, -165443, 443877, 43618, -28300, 72433, -140456, -270864, -340539, -152336, -920, -8172, -217766, -513739, -359671, -41389, -458442, -28730, -41282, -26363, 267037, 5889, -393496, 90337, 89671, -34811, 157751, 122199, -93062, -28446, 258594, 275378, -252757, 65657, -123139, 87487, -148499, 87565, 109600, 87697, 185843, 44043, -231984, -86408, -177894, -82615, -152723, 56239, 145738, 100605, -1291, -179753, 156215, -173154, -69168, -189785, -159431, -29177, 7695, -35478, 67120, -35259, -240328, -120566, 411043, -61598, 400687, -219072, 224111, -129299]
15318A7596a22687H9326a70479A5376P7758J26148B4360K01210a36640J3732C78058
15306A2307J00973h9372L6404m6743N668d0291a1099c720B78858a3264B31287
15294A29308d764A44654K9686n6519c23709B0550J15979i2999A26616a04583D8123
15282a19151k21373e8347j31162h5268a0952E678J92355a34095d7922a673n6767
15271e8440j43620C34085q7363d2918l66372a16666G8612l8404J63927b9879p1127
15260a01006j48137A17506L20286k14803e650I9570P9066E8350A7454O29361A32446
15248E63492N10661N3616L0600J75882C88233K89893C13383J36850B21190m8752
15238A72438F9640i2818A75416J19869f3944m004A9187c8666p3338B87082b32536
$$ y = [17596, -122687, 89326, -170479, 15376, 93134, 219282, 24360, 225570, -136640, -122908, 378058, 12307, 113280, -89372, -52968, -99711, -94043, -40291, -11099, -3720, 278858, -13264, 231287, 129308, -4764, 144654, 174340, 117821, -323709, 20550, 136529, -92999, 126616, -104583, 48123, -119151, -340524, -58347, -189509, -85268, -10952, 5678, 198033, -134095, -47922, -1673, -58440, -202060, 334085, 246722, -42918, -409290, -116666, 78612, 40208, 204135, -29879, -101006, -249143, 117506, 437792, 222989, -5650, 99570, 178636, 58350, 17454, 646815, 132446, 563492, 1074153, 1127769, 1158369, 1334251, 388233, 678126, 313383, 450233, 221190, 172438, 69640, -92818, 175416, 295285, -63944, -67948, 19187, -38666, -112004, 287082, -232536]
15226a78595C23344b58412a26233A16059a1735A00980h9020m9809A39549C7723
15215D6290n176d9982n7624B74452g7629J9075H2363a88483k67251e7310a4771
15203F8748h07F7880a20393C60864j62357a35374n0241B43707a83410B08399b2416
15191A71449a73063m6236o871A66098a67095I3267C7220J55698c27893J41215
15181a86678g0713B13496p8942M2730E9230K39940g7542B48442a26665G7311J5583
15170I2894r506c4581C76083a51717j8085e2583k6336A43876K38426i5626B78242
15158I6712O7047j8519J82952j48518b35812D39008b79855I3733J60111i092p7717
15147h6809B15495J4924M8080C2222L0282P8406L1846J63877j17010a91416A62921
$$ y = [-178595, 323344, -258412, -126233, 116059, -11735, 100980, -89020, -138829, 139549, 37723, 46290, 41114, -49982, -107606, 274452, -77629, -58554, 82363, -188483, -455734, -57310, -14771, 68748, -807, 67880, -120393, 360864, 198507, -135374, -185615, 243707, -183410, 208399, -22416, 171449, -173063, -219299, -226170, 166098, -167095, 93267, 37220, 192918, -327893, -186678, -70713, 213496, 134554, 177284, 59230, 299170, -77542, 248442, -126665, 77311, 92894, 83388, -34581, 376083, -151717, -169802, -52583, -78919, 143876, 382302, -95626, 278242, 96712, 163759, 145240, 328192, 179674, -235812, 439008, -279855, 93733, 253844, -9092, -86809, 215495, 230419, 278499, 32222, 62504, 140910, 172756, 336633, 219623, -191416, 162921]
15135I7156b63658D3557K64657j52910a06488j07540D31567j68683J0340j17049
15125A56175J34050e7712C54067a4527C5869K57833i2195B82803a18736J2924
15115a05812B01710B6001R921f3129h822B06668C8624d1908l26378J33800J14762
15104a19724g94A99114a05090C70487b19596o3906A86743a5985B69131G8397O4206
15093A42603A9135h9582A3111P2093L99437A19064J21718q1941b87503K3149C79510
15081B78094j10734R1364r6642H0874K03659L5168a77582A15765a16196B36539
15070B01092a49143h230C94190e9601a6912B19999E9937K51643j00273D8049A7998
15058d3132B88661a63652k7631A57302a37263J3400G901R0214f313H1202d5991
$$ y = [97156, -263658, 43557, 308214, 155304, -106488, -214028, 431567, 262884, 273224, 156175, 290225, -57712, 354067, -14527, 35869, 293702, -92195, 282803, -118736, -105812, 201710, 26001, 35922, -63129, -8822, 206668, 38624, -41908, -368286, -234486, -119724, -794, 199114, -105090, 370487, -219596, -283502, 186743, -15985, 269131, 78397, 142603, 19135, -89582, 13111, 85204, 484641, 119064, 240782, 158841, -287503, -264354, 379510, 278094, 167360, 258724, 162082, 80874, 284533, 319701, -177582, 115765, -116196, 236539, 201092, -149143, -8230, 394190, -59601, -16912, 219999, 59937, 311580, 211307, 48049, 17998, -43132, 288661, -163652, -191283, 157302, -137263, -123863, 7901, 98115, -6313, 81202, -45991]
15046F1218k6987f1754B44579e298k31060B42092C177J88797D6137a16162B73398
15034A24000c06888A87738J50716a37243j86403A09942Q8090e530A08448D8728
15023I9472P1001b0944B96485A6014J69602L42704k33454i7968B18215a64761
15012B18798K16570f4902d886D9203R1009c94987A33744R057R3659k965B8460
15000A43458a42512B18156M711H735L78134C273J21994E4948k5238J52247B9834
14988C48621n9450J28027p2527j07688p4085k180L25401A59838M9518I5569a44159
14976C77510J4593j65671G8114J47555j1614K26494b13507A32702J66495P3547
14966C72744A32805L4682J2506i4459A26033e12B89677Q5297r7391g1799A84463
$$ y = [61218, 34231, -61754, 244579, -5298, -236358, 242092, 3177, 191974, 46137, -116162, 273398, 124000, -306888, 187738, 338454, -137243, -323646, 109942, 198032, -5530, 108448, 48728, 99472, 170473, -20944, 296485, 16014, 185616, 528320, 294866, -97968, 218215, -164761, 218798, 435368, -64902, -4886, 49203, 140212, -394987, 133744, 142801, 236460, 233495, 28460, 143458, -142512, 218156, 222867, 8735, 386869, 3273, 125267, 54948, 29710, 181957, 29834, 348621, 289171, 417198, 344671, 236983, 162898, 160718, 486119, 159838, 209356, 95569, -144159, 377510, 392103, 226432, 78114, 225669, 214055, 440549, -213507, 132702, 299197, 372744, 132805, 167487, 179993, -94459, 126033, -512, 289677, 374974, 277583, -71799, 184463]
14954D53177n6272c5436B07667J17644o5150N1089A4652O458O2429J38666A06509
14942B57228l9689j06878L97670j80677g4166k7215c826H4326M2268N3109Q5632
14931B65335M9999i5734B20276J46755k3710E9908J65337K00300c7259A31482
14920C59541j63477J06663Q6218A42214M88878A76413J31577e2704B19847K4851
14910B44698K80839A35836L58427A01001M8753L96248j62318j82508L33641B00289
14899B38351J66196r8799o8578J12114A12954N7979J12871K1029b5934A98238
14888B95072J45135B20080B5827J62786J40597A29949K87988j19131O1506j75299
14878A85013n3270R4671j7496K63833j54048l0781m3452J03674H0544K16867K44570
$$ y = [453177, 396905, -35436, 207667, 325311, 260161, 311250, 14652, 21110, 83539, 222205, 106509, 257228, 217539, 110661, 508331, 327654, -74166, -101381, -3826, 84326, 126594, 179703, 265335, 315334, -95734, 220276, 367031, 343321, 59908, 225245, 425545, -37259, 131482, 359541, 196064, 302727, 388945, 142214, 631092, 176413, 307990, -52704, 219847, 244698, 525537, 135836, 494263, 101001, 149754, 546002, 383684, 201176, 534817, 200289, 238351, 404547, 305748, 237170, 349284, 112954, 170933, 283804, 304833, -25934, 198238, 295072, 440207, 220080, 25827, 188613, 329210, 129949, 417937, 298806, 360312, 185013, 131743, 226414, 208918, 472751, 318703, 287922, 244470, 348144, 80544, 297411, 541981]
14867E41981j56200j28733P1916p8763j5817K40032F6237K74480j9101G4243K01427
14856B75670J0266K64306j83968J60497A28470N8794M31015l07348K499K63654
14846E77084D4060N29101j84180A69773Q2893k8758P2710k644G4655N22257j12196
14835D84716J5778B42827m6827J80605O0540M7161l578A58115K18643K48025B01819
14823A17951K68960J5238k1239m7287R1545p1496R2581j35822J27262A78530K41121
14812D19651L59616k28843j45477n3969j64182J05342k389J19129p6238M38970
14802G71610A97866J83928A80559R2546j09799L47560j96613G1654L38192j43204
14792B66642K41733J2386j58538K32370j06123J51742B75109J00783K07115k1714
$$ y = [541981, 385781, 257048, 328964, 250201, 234384, 474416, 66237, 340717, 321616, 74243, 275670, 285936, 550242, 366274, 526771, 128470, 187264, 618279, 310931, 313430, 577084, 44060, 573161, 388981, 169773, 252666, 223908, 296618, 293974, 74655, 596912, 484716, 500494, 242827, 196000, 376605, 437145, 484306, 480728, 158115, 376758, 624783, 201819, 117951, 386911, 402149, 380910, 333623, 425168, 353672, 446253, 310431, 437693, 178530, 419651, 779267, 550424, 404947, 350978, 186796, 292138, 289749, 408878, 332640, 771610, 197866, 381794, 180559, 273105, 163306, 510866, 314253, 71654, 409846, 266642, 508375, 520761, 362223, 594593, 488470, 640212, 275109, 375892, 583007, 561293]
14782E61293q065K87824C13706L44147k06557j7697k09898O03203m07709J02479
14772E21674A15552J04503j01839K42971K67760k71118J68025A98336R8410K38494
14762E35240Q5907r296j65109O3326j1283f9889G27661k50449N3459j20129Q4194
14751D94736r2698K64854K27125o8392k73756o8684k4684L40800l13813o7261
14741D18227L11036C34594J88604J10930K10185m15531J34336p1545K09703j78786
14731E22490K42340k8691p4055j03974K15368l21077N3762K38809j28643N56465
14721A172794n65575j56093J86596B68797N74625j37950k48398Q117K61612j00668
14711F26135L20693j99549j1087k12570L61129r8122j88787K50108k96914J04687
$$ y = [561293, 553228, 841052, 313706, 657853, 451296, 433599, 223701, 826904, 419195, 521674, 115552, 220055, 118216, 361187, 628947, 357829, 525854, 198336, 296746, 535240, 621147, 611851, 446742, 510068, 498785, -69889, 727661, 477212, 530671, 410542, 494736, 402038, 666892, 894017, 825625, 551869, 483185, 458501, 799301, 485488, 418227, 729263, 334594, 523198, 634128, 844313, 428782, 563118, 491573, 701276, 522490, 764830, 736139, 662084, 558110, 773478, 452401, 506163, 744972, 616329, 1172794, 607219, 451126, 637722, 268797, 843422, 705472, 457074, 465191, 726803, 626135, 946828, 747279, 736192, 523622, 884751, 786629, 597842, 847950, 551036, 655723]
14701F55723K12636j39706A80245O84726j63125j53616J47283K79632D76759K45846
14691G22605M5864j19931K34247o8492l6943k80564p6930K62752K50339K293l94041
14680E41199M66713l7795j27149N6699m0470j33511J28055j35335L4550j03992
14670F48964K47161R2812l71749L41497J20909J12374j74317L6744o7966k86902
14660F99527M37428l17259J93615o1840J71445l62364j1342L6286M05973k44901
14650I46568M3255j92999O0857K5795k09033L13304p8394N9410l3374C30248O07768
14639I38016K97372m37936L15403k9140k6680N0120O3528j91016J41633J33366
14629A254666K40799j75685Q8703j48443m10546L46210j02955L77306j46244p3579
$$ y = [655723, 868359, 728653, 180245, 864971, 701846, 548230, 695513, 975145, 476759, 722605, 768469, 648538, 882785, 814293, 777350, 496786, 419856, 682608, 932947, 935240, 541199, 1007912, 970117, 842968, 899667, 859197, 725686, 853741, 718406, 752956, 648964, 896125, 988937, 617188, 958685, 1079594, 1191968, 1017651, 1054395, 986429, 699527, 1136955, 819696, 1013311, 951471, 1122916, 760552, 749210, 785496, 1191469, 946568, 989823, 796824, 857681, 883476, 674443, 987747, 909353, 968763, 935389, 330248, 938016, 1235388, 797452, 1112855, 1083715, 1057035, 1107155, 1170683, 979667, 1121300, 1254666, 1495465, 1319780, 1408483, 1260040, 849494, 1195704, 1092749, 1470055, 1323811, 1250232]
14619A250232P513L74337m03509J03249k71507N33994l31215j61119Q3008L71526
14609A556509m93950M36474P032n2162K02662j79716p8856k7977k16592P7984
14599A231408K91016k63618J30033o1698O6946k55182O58813j59939j39384J28308
14589A626703j42508O4372j04766o3358k10525l9021N46069K8749J5048J48892
14579A869655j02736j23962L44395M98l63207Q3381Q7991K18631l0773J14452
14569B098325j14518J98110R0787k00459J12963J09516j99139j74141M31219J97059
14559B549722O6183J73039J35967l44465O90130J17345L33108N46635M53491O65169
14549E386324J922559M078320R344392J3519107J907217j3548599j1073450E313605
$$ y = [1250232, 1257745, 1632082, 1228573, 1331822, 1060315, 1594309, 1263094, 1101975, 1184983, 1556509, 1062559, 1499033, 1506065, 1453903, 1656565, 1476849, 1397993, 1370016, 1153424, 1231408, 1522424, 1258806, 1388839, 1327141, 1394087, 1138905, 1797718, 1637779, 1498395, 1626703, 1484195, 1548567, 1443801, 1380443, 1169918, 1130897, 1676966, 1705715, 1720763, 1869655, 1766919, 1642957, 1987352, 1987850, 1624643, 1708024, 1796015, 2014646, 1983873, 2098325, 1983807, 2181917, 2272704, 2072245, 2185208, 2294724, 2095585, 1921444, 2352663, 2549722, 2615905, 2788944, 2924911, 2580446, 3270576, 3387921, 3721029, 4267664, 4721155, 5386324, 7308883, 11387203, 20731595, 34250702, 36157919, 22609320, 11535870, 5313605]
14540C080935m96342o86002j7393j9742j33547j08518J39445J65457j46064M02881
14530B181110l16846J42279K91034m62754J54358m0324L47921l45489j62818K4880
14520A813351k2345M44681K0425J7256m34962M48159j82677J15502K7963J34582
14510B381935K06497n08069N37583r2848O2636K31523l23910K23012J5668k1610
14500B712417J3391O7877j27106R9390K01730k37177J66346k03901O5635J53537
14490B912139J21530l4553R1263j19934J31155R0712j4729K07836k94848L24322
14480C414893l42166L06762m849K70053j49151L34782r6246l26133L68372j788
14470C774529k58690j3660N79533n67368M53963j82807J90127K10123l01900M80719
$$ y = [3080935, 2584593, 1898591, 1881198, 1861456, 1727909, 1619391, 1758836, 1924293, 1778229, 2181110, 1864264, 2006543, 2297577, 1834823, 1989181, 1948857, 2296778, 1951289, 1788471, 1813351, 1791006, 2235687, 2256112, 2273368, 1838406, 2286565, 2103888, 2219390, 2247353, 2381935, 2588432, 2080363, 2617946, 2525098, 2587734, 2819257, 2495347, 2718359, 2734027, 2712417, 2725808, 2793685, 2666579, 2765969, 2967699, 2730522, 2896868, 2692967, 2758602, 2912139, 3033669, 2999116, 3090379, 2970445, 3101600, 3192312, 3177583, 3385419, 3090571, 3414893, 3072727, 3379489, 3374640, 3644693, 3495542, 3830324, 3734078, 3407945, 3776317, 3774529, 3515839, 3502179, 4081712, 3514344, 3968307, 3785500, 3975627, 4185750, 3883850, 4364569]
14460D364569j18790k40200L90253j97414K21279r7633l1410O0603M1517K29546
14450D622320o599L03185j38854L37260k00052L26459n69395O99811j25139J01563
14440E350559L43144k6709M3791l4416j53562K66638K7940l77622N19892n7250
14430E902405K21828L6716j53836K20156J95442J99984n60547M57368L30571p2221
14420F777866K00139L9562J6898N74789K9722J24667k27905J27991K37814M83197
14410H384740k67077j88300L80535r9340L17925J2450K2816R67781m36350M40157
14400I535337l29947P13465j1681r9214O59184l12900N29773j59472M62626K22685
14390A1209856l4773K23969p4402O68891j94694M64754j33169O36104J23749L68938
$$ y = [4364569, 4245779, 4005579, 4395832, 4198418, 4419697, 4322064, 4290654, 4351257, 4392774, 4622320, 4615721, 4918906, 4780052, 5117312, 4917260, 5243719, 4674324, 5374135, 5248996, 5350559, 5693703, 5666994, 5710785, 5676369, 5522807, 5789445, 5817385, 5439763, 5959655, 5902405, 6124233, 6160949, 6007113, 6227269, 6422711, 6622695, 6062148, 6519516, 6850087, 6777866, 6978005, 7017567, 7034465, 7609254, 7638976, 7763643, 7535738, 7663729, 7901543, 8384740, 8117663, 7929363, 8309898, 8210558, 8528483, 8540933, 8563749, 9531530, 9095180, 9535337, 9205390, 9918855, 9907174, 9807960, 10467144, 10154244, 10684017, 10524545, 10987171, 11209856, 11175083, 11399052, 11324650, 11993541, 11798847, 12263601, 12130432, 12766536, 12890285, 13259223]
14380A3259223O92496k98666L70391J65576J47813N23906L77271K07873R5022
14371A5540905K50193L36882O57047K6104M46806M62718J85667J000207j63031
14362A8743498L66208M94258L13868Q87778M3708R23753J25949M79140N30170
14353B2908330Q01952M80935P22250O25812L07695J077163O47497M68154O87702
14344B8727490P55140P44496J138595N21737J119114Q29360Q59724N68019J520402
14335C6784077J063777J741472O35192J472504J200356J425577J087549J764127
14327D7174631J319675J826917J490600J482000K386900J716337K430006K000407
14319F1827473J642736K802532K264871K804208L227328K547995L056521L356025
$$ y = [13259223, 13951719, 13653053, 14023444, 14189020, 14336833, 14860739, 15238010, 15445883, 15540905, 15791098, 16127980, 16785027, 16811131, 17257937, 17720655, 17906322, 18906529, 18743498, 19109706, 19603964, 19917832, 20805610, 20849318, 21773071, 21899020, 22378160, 22908330, 23710282, 24191217, 24913467, 25539279, 25846974, 26924137, 27571634, 28039788, 28727490, 29482630, 30227126, 31365721, 31887458, 33006572, 33835932, 34695656, 35263675, 36784077, 37847854, 39589326, 40224518, 41697022, 42897378, 44322955, 45410504, 47174631, 48494306, 50321223, 51811823, 53293823, 55680723, 57397060, 59827066, 61827473, 63470209, 66272741, 68537612, 71341820, 74569148, 77117143, 80173664, 83529689]
14311H3529689L257813M049384L744364L769835M368315M961436M646236N066244
14303A17393316N726074N448325N906935P005117O974111P406227P242537Q246126
14295A71348768R067316R277067J0015511J0337315J1474057J1315245J2624347
14288B45459626J2767963J3532650J4124847J5191334J5171581J6035608J5927677
14281C48211286J6501723J5899482J6263102J5999976J5714047J5101555J4980810
14274D58671981J3260669J1004313N819711L45353j278320l324298k994222j887447
14266D79617740l710078q067074j3574728j5990789j7726341j8405388j8580958
14259C83562384j8683670j8333538j8491119j7162466j6323283j6127839j5146768
$$ y = [83529689, 86787502, 90836886, 94581250, 98351085, 102719400, 107680836, 112327072, 117393316, 123119390, 128567715, 134474650, 141479767, 148453878, 155860105, 163102642, 171348768, 180416084, 189693151, 199708662, 210045977, 221520034, 232835279, 245459626, 258227589, 271760239, 285885086, 301076420, 316248001, 332283609, 348211286, 364713009, 380612491, 396875593, 412875569, 428589616, 443691171, 458671981, 471932650, 482936963, 488756674, 489102027, 487823707, 484499409, 481505187, 479617740, 475907662, 467840588, 454265860, 438275071, 420548730, 402143342, 383562384, 364878714, 346545176, 328054057, 310891591, 294568308, 278440469, 263293701]
14252B63293701j4471741j3599689j3175615j2174304j1265882j0474642r942865
14245A78188963r439317q260522p917912p811438p202868o657074o167902n833777
14237A18898153n431912n018815n103527m434842m161532l626421m237561l458043
14229H3425500l440448l411625k831343l155869k444293k723189k525912j902340
14221F0990481k360074j862710j968460j845882j538597k061387j471291j261502
14213D6620578j432230j515194j367932j332807j015467j037790j107857j182705
14205C6628596o09743j422734j177763r69951m26714m08098j230652j280306n47888
14196B8554747p71482q54741k97970p73093o40266j130845l16565n34511p39113
$$ y = [263293701, 248821960, 235222271, 222046656, 209872352, 198606470, 188131828, 178188963, 168749646, 160489124, 152571212, 144759774, 137556906, 130899832, 124731930, 118898153, 113466241, 108447426, 103343899, 98909057, 94747525, 91121104, 86883543, 83425500, 79985052, 76573427, 73742084, 70586215, 68141922, 65418733, 62892821, 60990481, 58630407, 56767697, 54799237, 52953355, 51414758, 49353371, 47882080, 46620578, 45188348, 43673154, 42305222, 40972415, 39956948, 38919158, 37811301, 36628596, 36018853, 34596119, 33418356, 32448405, 32021691, 31613593, 30382941, 29102635, 28554747, 27783265, 26928524, 26630554, 25857461, 25217195, 24086350, 23769785, 23235274, 22496161]
14187B2496161p987r35343l83566n46587m70695k17506m14398n15230m21789j84958
14177A8398102q43354k93421j33530p89356k53485j04019p04568L62953q04961
14168A4834361k14865K6334m56137j99216m09178m27134j20283l4925O6522o77347
14158A2388132j32621l35454o2304l48682J36921m86862K8068l34347r0692l34732
14148A0427427j03177q7383Q2109o1037K17066j105847l4366K36579k71088J7982
14138I318265l63138J3804R0236n11115k47829J09087m22384L26424l35945J70686
14128H148091m00767J05075j88252k57498p8195j60175P6303k67840j43107M05954
14118G239589k23375k46957M2913j45658l00478k78764K195R1267r2010M2536
$$ y = [22496161, 22488174, 21552831, 21169265, 20622678, 20151983, 19934477, 19520079, 19004849, 18583060, 18398102, 17554748, 17261327, 17127797, 16338441, 16084956, 15980937, 15276369, 15639322, 14834361, 14619496, 14645830, 14189693, 13990477, 13581299, 13154165, 13033882, 12998957, 13065479, 12388132, 12255511, 11920057, 11857753, 11509071, 11645992, 11159130, 11187198, 10852851, 10762159, 10427427, 10324250, 10236867, 10318976, 10257939, 10475005, 9369158, 9334792, 9571371, 9300283, 9318265, 8955127, 8968931, 9059167, 8548052, 8300223, 8409310, 7986926, 8313350, 7977405, 8148091, 7747324, 7852399, 7664147, 7406649, 7328454, 7168279, 7244582, 6976742, 6833635, 7239589, 7016214, 6769257, 6812170, 6666512, 6366034, 6087270, 6089465, 6180732, 6088722, 6131258]
14108F131258l11804J13134L32711n32921L90613o13905M22430o04932K27166
14099E553750l18338J32597j10210m60223L57030k12017n4439p7245K23319j79104
14089D855120p3680Q6047l06776l4312j14237j2357O3177l010k74462L7133N1461
14078D274104K8353o0345l51781J68505j24408J91440K8837j16696j16451l11444
14068C610114M3885L03745j33867k82517J29012l63126N03644p6858j14044K7033
14058C647021K59693M481n35673J26810K00317l22453J55333J1843l59602N631
14048C193401K77329l68778K38174j56014M767J24259l46967M4462j11926N0665
14038B949372p977J40343n21608J71365m3845n0921K52417j00288l1236J67390
$$ y = [6131258, 5819454, 5932588, 6265299, 5732378, 6122991, 5509086, 5931516, 5326584, 5553750, 5235412, 5368009, 5257799, 4797576, 5154606, 4942589, 4888150, 4810905, 5034224, 4855120, 4781440, 4867487, 4560711, 4526399, 4412162, 4399805, 4462982, 4459972, 4185510, 4222643, 4274104, 4302457, 4242112, 3890331, 4058836, 3934428, 4125868, 4154705, 4038009, 3921558, 3610114, 3653999, 3957744, 3823877, 3541360, 3670372, 3307246, 3810890, 3734032, 3619988, 3647021, 3906714, 3911195, 3375522, 3502332, 3702649, 3380196, 3535529, 3547372, 3187770, 3193401, 3470730, 3101952, 3340126, 3184112, 3188879, 3313138, 2966171, 3010633, 2898707, 2949372, 2941395, 3081738, 2560130, 2731495, 2687650, 2636729, 2889146, 2788858, 2757622, 2925012]
14028B925012j97888k91411r2316K6918o851K42031K7717P1839m87371m8431J57261
14017B326510L4572j09068K65048K71677q25151P54782n87481J86097k12419j78006
14007A926561K25941J65274m13337o8291R8092K10676l06305K96332N4427k27107
13997A962263L91349l7627J87518q6851k38697L04354J87175K26638J070518K847589
13987F814229Q005477J4541683O976285j1235745j0281071o078112l238022r14379
13979D590345o54957l87872o95735J50424l53198p7320j38462l57297J79864J22709
13969B378501l79927K78569k85925N9839K26108j42931l6052J16003k23407l7545
13959A953233n5880P5355M572n0395J2369k32685M5427j2546J99796m93308k52858
$$ y = [2925012, 2727124, 2435713, 2343397, 2370315, 2363464, 2605495, 2633212, 2705051, 2217680, 2169249, 2326510, 2361082, 2252014, 2517062, 2788739, 1963588, 2718370, 2130889, 2316986, 2104567, 1926561, 2152502, 2317776, 1904439, 1836148, 1934240, 2144916, 1838611, 2134943, 2189370, 1962263, 2353612, 2315985, 2503503, 2416652, 2177955, 2482309, 2669484, 2896122, 3966640, 6814229, 14819706, 29361389, 36337674, 25101929, 14820858, 8742746, 5504724, 4590345, 3935388, 3547516, 2851781, 3002205, 2649007, 2571687, 2433225, 2075928, 2255792, 2378501, 1998574, 2277143, 1991218, 2051057, 2277165, 2134234, 2098182, 2214185, 1990778, 1953233, 1897353, 1972708, 1977280, 1926885, 1939254, 1706569, 1751996, 1739450, 1939246, 1445938, 1193080]
13948A193080N45286k52484L87729j59325j06434L05541p32982M03787j82284
13939A401914P19242k13598j51673m47152L99980L12812n95878Q3545J76380r8930
13929A586642R498l84384L06559J7603k35302J4667O7520Q4488j74165L01480
13919A594606j69499j50219K30653j70556L8932K09309l42959J90472k86816K39063
13909A382986k53596p8641L00847j15785L73769j79883o6789J77106k38303l24397
13899I77314O356K56249J46792k49783K84958k23009J94531r7803l96493L72848
13889A271960j54790L21193j72824l77588M71994k73267j86018O4488O2626l6871
13879I90903P568j41815p863K35422K64321l32953M4587m5215L45332q9936l32561
$$ y = [1193080, 1738366, 1485882, 1873611, 1714286, 1607852, 1913393, 1180411, 1584198, 1401914, 2121156, 1907558, 1755885, 1308733, 1708713, 2021525, 1425647, 1509192, 1685572, 1586642, 1596140, 1211756, 1518315, 1535918, 1300616, 1315283, 1382803, 1467291, 1293126, 1594606, 1425107, 1274888, 1505541, 1334985, 1373917, 1583226, 1240267, 1430739, 1143923, 1382986, 1129390, 1050749, 1351596, 1235811, 1609580, 1429697, 1362908, 1540014, 1301711, 977314, 983670, 1239919, 1386711, 1136928, 1421886, 1198877, 1393408, 1295605, 899112, 1271960, 1117170, 1438363, 1265539, 887951, 1359945, 1086678, 900660, 965148, 1027774, 990903, 998471, 856656, 848793, 1084215, 1348536, 1015583, 1060170, 1014955, 1360287, 1270351, 937790]
13868I37790J21572j05746K55299j50546j13845J22565j58191j0677K35979l02402
13858H31798j03360N16058m81908J59700K50987k36087K24905j40095J80959m12772
13848G90185L93620m36902K49227L1212C29141O07397k99474K91201o6825K5227
13838H86667j7923N02212l88687k60042K11702J53904j89395r8349L57725k54431
13828I03383L8287k54749M22165j76089J07147k54864n7362J76901L29543l73507
13818H60855l99344M54028j85319j07556j70393J03852p5056K03565L49982m95604
13808E39010K84380j7608k34012j23025L09317J04011k35071K25277j73951J75611
13798H53939j77315P1672J50346k00877p3100N8717J17337l28670Q9469l5128
$$ y = [937790, 1059362, 953616, 1208915, 1058369, 944524, 1067089, 908898, 898221, 1134200, 831798, 728438, 1244496, 762588, 922288, 1173275, 937188, 1162093, 1021998, 1202957, 790185, 1183805, 746903, 996130, 1027342, 329141, 936538, 637064, 928265, 861440, 886667, 868744, 1370956, 982269, 722227, 933929, 1087833, 898438, 800089, 1157814, 903383, 941670, 686921, 1109086, 932997, 1040144, 785280, 727918, 904819, 1234362, 860855, 461511, 915539, 730220, 622664, 452271, 556123, 481067, 684632, 1034614, 539010, 823390, 805782, 571770, 448745, 758062, 862073, 627002, 852279, 678328, 853939, 676624, 748296, 898642, 697765, 624665, 683382, 800719, 472049, 561518, 526390]
13788E26390M57380m01338J62218k21920n6564O33982k95492k41808M09491m24058
13778E48281J90791k049k43816J13384j76913L76755J40104l85076K02080Q6326
13768H49867C81641M49139k00299k18113K01396Q2624j11681K38421l60708A73746
13757F27770j62763J61003p038l4160k33057M04347k59846j3754M05514k21488
13747F66528k0029K56423l51077J85698O8401l86446K66688k356B79962K42619
13737E22581Q1897q4884l4805K25946m308J67123k07860j0453j77130K94833j51410
13726F21530j02562L98191n5122l65383L24737C28235J97610k17938K90710J1080
13716F09697q7840j9772J28821o7462J19511P2448l32785j69551L51350A79924
$$ y = [526390, 983770, 582432, 744650, 522730, 466166, 1100148, 804656, 562848, 972339, 548281, 739072, 737023, 493207, 606591, 429678, 806433, 946537, 561461, 763541, 849867, 381641, 830780, 630481, 412368, 613764, 696388, 584707, 823128, 462420, 173746, 627770, 465007, 626010, 618972, 584812, 351755, 756102, 496256, 482502, 888016, 666528, 646499, 902922, 551845, 737543, 805944, 419498, 686186, 683830, 279962, 522581, 604478, 519594, 484789, 710735, 706427, 873550, 665690, 655237, 478107, 772940, 621530, 518968, 917159, 862037, 496654, 821391, 328235, 525845, 307907, 598617, 609697, 521857, 502085, 630906, 563444, 682955, 755403, 422618, 253067, 604417, 179924]
13705E17244k50733K7418J14901K3988K15712r0791B64034k3297M51686A49118
13694B23869R8751N04539j09267l17027L49725B42630L98544J67808B54182J59502
13684D13684K08155j12065j46517J70274k26988K13845j21135A30128L09949A42836
13673E44194k55288j0730J52309A07277N57344J79948C68518K4037M262O5308
13663D62125m4845K72846k2971j85882A94425K87399j48362M03899k29602L17918
13653H25677k78480A775O14851k83303J32232J80441B53540J8539q9551J01244
13643B83772J73125A56993K82199R4484k05462J88442p7491A67018K33954o457
13633C94515o9309Q0757j46130D1770K66465L97366B61551K34962m1467K2561
$$ y = [517244, 266511, 293929, 408830, 432818, 648530, 557739, 264034, 240737, 692423, 149118, 223869, 322620, 827159, 717892, 400865, 750590, 242630, 641174, 808982, 254182, 413684, 621839, 509774, 363257, 533531, 306543, 520388, 399253, 130128, 440077, 142836, 544194, 288906, 278176, 430485, 107277, 664621, 844569, 368518, 392555, 396817, 462125, 417280, 690126, 667155, 481273, 194425, 481824, 333462, 737361, 507759, 825677, 547197, 1775, 616626, 333323, 465555, 645996, 253540, 272079, 182528, 283772, 456897, 156993, 439192, 533676, 328214, 516656, 439165, 167018, 400972, 394515, 325206, 405963, 259833, 41770, 308235, 705601, 261551, 496513, 455046, 477607]
13623D77607B03628J02014E7924M62243j74986j41465K38274J5365A89067O57491
13613H46558B91833r8249J4649j3354J35905J2717q2J68505L7940j98065A00806
13601D99619k37727A18867J84771K98656j78937j83584j13889Q9700c543A97040
13590A63736J70292k4790j51851L33756j83084K40876k64811L3383N0794p4647
13580B93654j38235K28857Q151M0827q1556j19131J0175F1190Q6930N1199K13598
13569D12917I5228J43105M58743l07227j9031j51358Q8053j00026K79118J04982
13559E91587f5927C51252q39A70135K55007j60956J42534K5708j64994K04537
13549D71971A30351r683L07672P1552B0167O1655K03301m8611J94939L4690A61782
$$ y = [477607, 203628, 305642, 57924, 520167, 345181, 203716, 441990, 457355, 189067, 846558, 291833, 193584, 208233, 194879, 330784, 343501, 343419, 511924, 549864, 351799, 100806, 499619, 261892, 118867, 303638, 602294, 423357, 239773, 125884, 215584, -3543, 197040, 163736, 334028, 309238, 157387, 491143, 308059, 548935, 284124, 317507, 368301, 293654, 155419, 384276, 392427, 433254, 351698, 232567, 242742, 61190, 148120, 199319, 412917, 95228, 238333, 697076, 389849, 370818, 219460, 307513, 207487, 486605, 591587, -65927, 351252, 350413, 170135, 425142, 264186, 406720, 432428, 267434, 471971, 130351, 120668, 428340, 499892, 20167, 81822, 285123, 236512, 431451, 466141, 161782]
13537A87377L89271A00441K55877I8631J26516P1929e9160A99545p0058L72243
13527E01730d4305A5221J83846j7488l0954N89920A07266L67950J45461A94643
13516D51808k20284A486R465K58764L922j22104J42476k2484j09931a6170G6995
13504B77170D7848a82943D46008A68380P2717K34569A92918J8964J56379a63304
13493C15619A5770N25603A40893I437K9054O683K04332a91367A5843K86706J45903
13482D48452k14361J17813a06209B23825a20990A05201K21715P2711j80368j02012
13472A17247J5757K16840j30739O0787b2217A50309J35714B1228Q8038K15094
13462C24360d7230B76673a2100A26051M07715k50396b62443C43884o9168f6714
$$ y = [187377, 576648, 100441, 356318, 98631, 225147, 297076, -59160, 199545, 129487, 501730, -44305, 15221, 199067, 181579, 150625, 740545, 107266, 475216, 620677, 194643, 451808, 231524, 1486, 10951, 269715, 273637, 151533, 294009, 271525, 161594, -16170, 76995, 277170, 47848, -182943, 446008, 168380, 241097, 475666, 192918, 211882, 368261, -163304, 315619, 15770, 541373, 140893, 9437, 38491, 45174, 249506, -191367, 15843, 302549, 448452, 234091, 351904, -106209, 223825, -120990, 105201, 326916, 399627, 219259, 117247, 133004, 349844, 219105, 279892, -22217, 150309, 286023, 21228, 109266, 324360, -47230, 276673, -12100, 126051, 533766, 283370, -262443, 343884, 274716, -66714]
13451a3094B62896r1265L48478D1045N36374F7407K89294o3489J39950j05709
13441C27453F4207M08104j53243G049B330R7622J16064J41489G6170B2461Q3316
13430A05777K98085Q6183A80962D7920L85495C2666L3208L81034r9130A07623
13419A10902a9959D85711A95017k2023P1466K82869k60468J60315j09601J34410
13409D51985k17647N57088A92873D3291J88489a08374A50714J33553b18710F1057
13398B18708J96385o3257c1831C72831f7313B55337K36291B45404O8150A50529
13387C94805j4512E3229c2486j38789A69260N48562G4450J26301q9498M39558
13377E50811j59955C2155J16440L12995A07300K94144J90930H3805L49981H731
$$ y = [-13094, 262896, 171631, 520109, 41045, 577419, 67407, 356701, 293212, 433162, 327453, 64207, 472311, 319068, 7049, 2330, 99952, 216016, 357505, 76170, 22461, 105777, 403862, 490045, 180962, 47920, 433415, 32666, 65874, 446908, 347778, 107623, 110902, -19959, 485711, 195017, 172994, 244460, 527329, 266861, 427176, 317575, 451985, 234338, 791426, 192873, 43291, 231780, -108374, 150714, 284267, -218710, 61057, 218708, 415093, 351836, -31831, 372831, -67313, 255337, 491628, 245404, 313554, 150529, 394805, 380293, 53229, -32486, -171275, 169260, 717822, 74450, 200751, 111253, 550811, 390856, 32155, 148595, 461590, 107300, 401444, 592374, 83805, 433786, 8731]
13366D35655I5721L79234r5720j29693J6554A19285R7651a58217j3549B50392
13355H3309M5626M09265A34988O2485O4610J34424F5591J02934M23590A88568
13344H4191M08465B42762O2115o1680J68481r3098A41401J55764j0105a29824
13333A47546L25575r1836j77186I1740P1664N4168m998N4906J19200j67729r7918
13322A21033b34773G2960E164J10700n1621Q0315c9733j7191j70945b3870A10017
13310C32582n6275n1234P2062A40310K07741a68189d9367H9104a75654A01835
13299C88516g5980A8962L72550j82674r5769K79073D383K05254o8643j8745m3191
13288G9058K88224a52371B55873H2501L7318J72254d0688B6383J26849f8747n0783
$$ y = [435655, 95721, 474955, 379235, 249542, 266096, 119285, 216936, -158217, -171766, 250392, 83309, 128935, 538200, 134988, 197473, 262083, 396507, 65591, 168525, 592115, 188568, 84191, 492656, 242762, 304877, 243197, 411678, 318580, 141401, 297165, 287060, -129824, 147546, 473121, 381285, 204099, 91740, 163404, 217572, 212574, 267480, 386680, 218951, 121033, -234773, 72960, 5164, 115864, 64243, 144558, -39733, -56924, -227869, -23870, 110017, 332582, 276307, 225073, 297135, 140310, 348051, -168189, -49367, 89104, -175654, 101835, 388516, -75980, 18962, 391512, 208838, 113069, 392142, 4383, 209637, 140994, 122249, 79058, 367282, -152371, 255873, 82501, 119819, 292073, -40688, 26383, 153232, -68747, -119530]
13277a19530C38700j09465a77589B64769p3124G094a86011A92310B1217R0792
13267A12009r283K36424k6697k1024i9934A19871B6427L52538c79244d9050p238
13256e6288A80747k1540f8095B2504P6396a1423j18506B79085A1333a64957C38163
13244B57175e3714A2860a182A07383e1732A67178J4808G4698O7K83821D4562a17729
13231B7132J75597J30797h3745L6785H6343m1141Q6483a7568A58987F4473J48670
13220B13143J0988a4618I4115a85182G7928L83785j01585r5168D3553a24026B17789
13208B77588r9968J08786A04361D8296a47423A67351e3752A05524J3845M0209
13198A59578e1906B7646K8002J44169K4492b96839D4575b6828C24147r9062D5795
$$ y = [-119530, 338700, 229235, -177589, 264769, 191645, 7094, -186011, 192310, 21217, 112009, 102726, 339150, 312453, 291429, -99934, 119871, 26427, 378965, -379244, -49050, -56288, 180747, 159207, -68095, 22504, 98900, -11423, -129929, 279085, 11333, -164957, 338163, 257175, -53714, 12860, -1182, 107383, -51732, 167178, 181986, 74698, 74765, 358586, 44562, -117729, 27132, 202729, 333526, -83745, -46960, 86343, 45202, 131685, -17568, 158987, 64473, 213143, 224131, -14618, 94115, -185182, 77928, 461713, 360128, 264960, 43553, -124026, 217789, 277588, 177620, 286406, 104361, 48296, -147423, 167351, -53752, 105524, 119369, 159578, -51906, 27646, 55648, 199817, 224309, -296839, 44575, -26828, 324147, 225085, 45795]
13186b30087l4791D43222A14637M1051j2468d4390A84181l994n4654J95980A35584
13174A2688K98470c4321a0030C18317g2792m7323G8382A2082Q1455a8076D0238
13162A22518c6840F9913L91002I1743B0883a63816f5933a0891E01258H4125J22627
13151B06752C5039N1486R2610a47048C3397K886O7788K55820E5701K40617Q6878
13140C83196L1751g844A90624f0530B14187d03427C77781e9871f053k7908B0957
13128A12408K27242o6075r2602p8323L8910K3515a93047E03959I7139J27771N2187
13117B77097o9493n6158K24391A40710d08493C3775L44680A59845h2749j0776
13107i3525A47672l9860M3880a92314A40858a36249e6518A94146J0055h2322C8755
$$ y = [-230087, -264878, 443222, 114637, 155688, 143220, -44390, 184181, 180187, 125533, 321513, 135584, 12688, 311158, -34321, -10030, 318317, -72792, -120115, 78382, 12082, 93537, -18076, 40238, 122518, -36840, 69913, 460915, 91743, 20883, -163816, -65933, -10891, 501258, 84125, 206752, 35039, 86525, 179135, -147048, 33397, 36283, 104071, 359891, 55701, 296318, 383196, 414947, -7844, 190624, -60530, 214187, -403427, 377781, -59871, -6053, -33961, 20957, 112408, 339650, 273575, 180973, 102650, 141560, 165075, -193047, 503959, 97139, 224910, 277097, 207604, 151446, 375837, 140710, -408493, 33775, 378455, 159845, -82749, -93525, 147672, 107812, 151692, -192314, 140858, -136249, -56518, 194146, 204201, -82322, 38755]
13095B18235j5732a57534g3744A29583i7090C10411E9229j8162g3180C95510c9823
13083b9147p322r8235d0023k26413C12754j19777m3357k17m1497P1499b09581
13071C29986j37234o9305a21767l5730E49366D6554J46181g8225c1975A30446
13060B68109g4065B21672J70386P6961F2457A0081L48120j2506j9686A31584b8648
13048A96114F5997K4536D111d6863l0647A20614C6155J68668N5452H8798C5916
13036c0597k23127B35056e399A94568F1152L5740b00627B55984o7922L27275D95
13024B56337o2043c32745h0429E29661q0486B06967e6498C99815A66083C5903
13013a52000A61245J8596J58471B2286q667J76011J14600a4226E07730a10874
$$ y = [218235, 202503, -157534, -73744, 129583, -97090, 310411, 59229, 41067, -73180, 395510, -39823, -29147, -36469, -134704, -40023, -266436, 312754, 192977, 149620, 149403, 107906, 179405, -209581, 329986, 192752, 123447, -121767, -157497, 549366, 46554, 192735, -78225, -31975, 130446, 268109, -74065, 221672, 392058, 469019, 62457, 10081, 358201, 345695, 326009, 131584, -28648, 196114, 65997, 90533, 4111, -46863, -77510, 120614, 36155, 204823, 260275, 88798, 35916, -30597, -253724, 235056, -5399, 194568, 61152, 96892, -200627, 255984, 188062, 515337, 495, 256337, 194294, -332745, -80429, 529661, 449175, 206967, -56498, 399815, 166083, 35903, -152000, 161245, 179841, 338312, 22286, 13619, 189630, 304230, -14226, 507730, -110874]
13002I9347k0120J61528b78495A66875J31103n642J6193a00545A3380J74687b08404
12990A38979d1839M131D45622c6799m7025A84220l2221i615A62689R6500r591
12979B49598m9979J6584B7236b4935C0424e9948G77a46804A00350A7154b19451
12967a30847A56169a79017H2024b2854C18230B5623L7969a38653j60412B48374
12956C50632J5986H0705Q5217N84B934L35218c35743H7282a1966C6924d1786e347
12943A65311a75640I6685O2027L55734a69786D02973b5133A46016a25986B801
12932A5630J84358O7731i735q2507A19721a07309c6140n176B07600G5526O8493
12921A44019g7152A19525O5698b23856F5568M0305a53778N4086a5904D63415g2923
$$ y = [99347, 79227, 240755, -278495, 166875, 297978, 292336, 308529, -100545, 13380, 188067, -208404, 138979, -41839, -37708, 445622, -36799, -83824, 184220, 151999, -9615, 162689, 259189, 249598, 199619, 216203, 27236, -24935, 30424, -59948, 777, -146804, 100350, 17154, -219451, -130847, 156169, -179017, 82024, -22854, 318230, 25623, 63592, -138653, -299065, 248374, 350632, 366618, 80705, 165922, 166506, 2934, 338152, -335743, 87282, -11966, 36924, -41786, -5347, 165311, -175640, 96685, 158712, 514446, -169786, 402973, -25133, 146016, -125986, 2801, 15630, 199988, 267719, -9735, -92242, 119721, -107309, -36140, -41316, 207600, 75526, 144019, -77152, 119525, 185223, -223856, 65568, 105873, -153778, -99692, -15904, 463415, -72923]
12909A50139b97144B25649n0554N3081J9956h637A85901N6193f3149E5412k4242
12898C1170b25098Q764A27582a20464A8507R7866i2045l697q6283I9464a21785
12886i0052H9770K58232i663j45398A8712K09336o3348h656j73819B82241a0039
12874b56848D9946h6012q2088g2745C2016J56567a31484E7697R099J99902j8980
12863B47718b08561h7164m3337f5015A48035P0901G3019j5834b2374j01132k672
12852a26178L26E4613d3581o70C46217n3035O1733b8689B50371b59464N4085A33194
12839B85561A36181d0169a8390j13012A60617J85585A16954E1934J18743J8969
12829A89646a999j81197G2107a35897h272B45138m5561E0886D443d8160A51696
$$ y = [150139, -297144, 225649, 175095, 228176, 248132, -8637, 185901, 242094, -63149, 55412, 31170, -225098, -216334, 127582, -120464, 18507, 116373, -92045, -95742, -182025, 99464, -121785, -90052, 89770, 348002, -9663, -155061, 18712, 228048, 164700, -8656, -182475, 282241, -10039, -256848, 49946, -86012, -168100, -72745, 32016, 188583, -131484, 57697, 66796, 266698, 247718, -208561, -87164, -130501, -65015, 148035, 218936, 73019, 57185, -22374, -123506, -126178, -125852, 54613, -43581, -44251, 346217, 293182, 354915, -28689, 250371, -259464, -205379, 133194, 285561, 136181, -40169, -18390, -131402, 160617, 346202, 116954, 51934, 170677, 189646, -1999, -183196, 72107, -135897, -8272, 245138, 199577, 50886, 4443, -48160, 151696]
12817A27438R5900a37495I9480L78156k30304c4486A19969E9259J54885n5975
12807A58169L7921H0763C6860Q5774a05218j80377j19106G0267K06448A11262
12796A0834K14734C9261J53591R348a12541l54018d5409q9900f0410D8410a46102
12784i8453j103k50196a25966e7803F4156O3096e3284r2265b4258B22306a85437
12772A78750E1014b6624A77279g5766K3936A39533b03469R0926B69144o4433K14613
12761D19324D454a03877P154J5645A9254K2251f0610j28149D04981a8408G0832
12749A78896c41929F7745a09011G0017a47043A86300l6907K95790g6798G7284
12738B1746K87547A34318J06453i204A53301b915B01761b2325B8868J26090i9412
$$ y = [127438, 223338, -137495, 99480, 477636, 247332, -34486, 119969, 59259, 214144, 158169, 196090, 80763, 36860, 122634, -105218, -285595, -404701, 70267, 276715, 111262, 10834, 225568, 39261, 192852, 202200, -112541, -466559, -45409, -135309, -60410, 48410, -146102, -98453, -99556, -349752, -125966, -57803, 64156, 127252, -53284, -145549, -24258, 222306, -185437, 178750, 51014, -26624, 177279, -75766, -51830, 139533, -203469, -112543, 269144, 204711, 419324, 4454, -103877, -96723, -81078, 19254, 41505, -60610, -188759, 404981, -18408, 70832, 178896, -341929, 67745, -109011, 70017, -147043, 186300, 149393, 445183, -76798, 77284, 21746, 309293, 134318, 240771, -9204, 153301, -2915, 201761, -22325, 28868, 154958, -99412]
12726B43381a47575O4399A35680J3132L0898R9596H061g5254L7337A39246m9584
12715H9662M6987d5105j32150j12939e872B80622D8252Q2083O9108D1599L00074
12704C41673A25019M7047D4777h1273b3420C6349L3380d1773B05970b23755K4359
12693a99396B07906k7764a1679A28888i7709C11144b4829B43915o7109q4096J75200
12682B67910b70534a2163j9748J0832H681a18713j44049A0140h0661G4129e6297
12670a18963B95270H3813K92456p7604c5288C956J00110J32305b46169G9786J17976
12659A97762N0670H673c3079A03499J01042a9643j34425B0321L06496j44387J17778
12648C00208A04523J56288b04874R4409j07756C1445M4761J65482A3135c8255
$$ y = [243381, -147575, -83176, 135680, 148812, 179710, 279306, 8061, -75254, -37917, 139246, 89662, 136649, -45105, -177255, -290194, -5872, 280622, 48252, 130335, 199443, 41599, 341673, 125019, 172066, 44777, -81273, -23420, 36349, 69729, -41773, 205970, -223755, -199396, 207906, 180142, -11679, 128888, -97709, 311144, -24829, 243915, 176806, 92710, 267910, -270534, -12163, -31911, -21079, 8681, -118713, -262762, 10140, -80661, 74129, -56297, -118963, 295270, 83813, 376269, 298665, -35288, 3956, 104066, 236371, -246169, 79786, 197762, 248432, 8673, -33079, 103499, 204541, -19643, -154068, 20321, 326817, 182430, 300208, 104523, 260811, -204874, -110465, -218221, 31445, 76206, 241688, 13135, -38255]
12637A39341j400m7218J03962J1695r4617m7334a19229E1324K15150k0629l5439
12626B10406N6268j08634P2619Q0356b1564A42504Q7542J98740D1464c6890A94188
12614c07625d1598A35310c3436C2092R7391F4661K29753g4652A52070D5915a63889
12602e0379D4487K41125K9072a04049F4522N2967b434H5912a39225e9316L695
12591e5621C6662K7275b43490B27911P1099P1161H9668b44756K7818i8652i623
12579C3910R1293h9290d951l80199a06563d2662E4956b4874B1006O3465r634R5652
12567A70489b85240A41688J5814K02045j42056b15349A59692a9029k05936O3862
12557a61103N5828b1892B45433b772H6541m222b9688p8299a5781r9816A74723
$$ y = [139341, 137941, 90723, 194685, 206380, 111763, 64429, -119229, 51324, 266474, 245845, 210406, 266674, 158040, 230659, 311015, -21564, 142504, 230046, 428786, 41464, -36890, 194188, -307625, -41598, 135310, -33436, 32092, 129483, 64661, 294414, -74652, 152070, 45915, -163889, -50379, 44487, 285612, 314684, -104049, 64522, 117489, -2434, 85912, -139225, -59316, -55621, 36662, 63937, -243490, 227911, 299010, 370171, 89668, -244756, -216938, -98652, -9623, 33910, 125203, -89290, -4951, -385150, -106563, -42662, 54956, -24874, 21006, 84471, 74837, 170489, -285240, 141688, 157502, 359547, 217491, -215349, 159692, -19029, -224965, -161103, -105275, -21892, 245433, -2772, 86541, 82319, -29688, -107987, -15781, -115597, 174723]
12545G4968K3918J44676c03863J14437B76637A11913b92607B85650k8396a56499
12534a03509b986I6792b09737M9204c1780C2916J93521C587N72J82368M6146k3462
12522B09211f4012G6858L8644c10781D69087a63052B30082I652L34488E1323a03697
12510a11233A91840i3061H2168a4057p7634A10528Q436a2132H6771a2854k22777
12499b35631C5681J69732I2162g657j06988k06577f3679B80032A00748K3063J03674
12488B27485G5560P6065C2885K88386A13275d0987H0351a69237A00088b69484
12477F8222c46130A79233J38482a70437A89792N1882j7563K0650b02473A36371
12466a23447k1869G1593e8113j9433a6514j36681g4703k23762A49713c77044i5764
$$ y = [74968, 98886, 243562, -303863, -189426, 276637, 111913, -292607, 285650, 257254, -156499, -103509, -2986, 96792, -209737, -160533, -31780, 32916, 226437, 3587, 4159, 186527, 232673, 209211, -64012, 76858, 115502, -310781, 469087, -163052, 230082, 9652, 344140, 51323, -103697, -111233, 191840, -93061, 82168, -14057, -91691, 110528, 118964, -12132, 86771, -12854, -235631, 35681, 205413, 92162, -7657, -114645, -321222, -63679, 280032, 100748, 123811, 227485, 75560, 151625, 32885, 321271, 113275, -40987, 80351, -169237, 100088, -269484, 68222, -346130, 179233, 317715, -170437, 189792, 241674, 224111, 244761, -202473, 136371, -123447, -145316, 71593, -58113, -77546, -16514, -153195, -74703, -298465, 149713, -377044, -95764]
12454b61930E37254a40444B38843c96746B7210N6452b90441a6884I5393a32072
12443B68966G2642A1959L3230K72535a95406B35857F9694b14384E23106B31904
12432A8891L92359a08995D6748a72871B78527A14647m9525a49010b3902k007C2434
12420G7625k1695O1034B3484a23132a1283p8152a3569j21673L3457j94678B9582
12408A74405p5560c91940D6165g7399A49385O2137B9097K53220j29369c303C1549
12396a78661Q0421D9706b12420D07476A2942K33193J02087N321E7723c76168A12117
12384D4838K47210c8982m9391C0962J4762N2459d2943H3901A3295a13548k12542
12373c26090N6801L9379b1569B62471b63193O8789O810I2676N0517a11556m4371
$$ y = [-261930, 537254, -140444, 238843, -396746, 27210, 83662, -290441, -16884, 95393, -132072, 268966, 72642, 11959, 45189, 317724, -195406, 235857, 69694, -214384, 523106, 231904, 18891, 411250, -108995, 46748, -172871, 278527, 114647, 65122, -149010, -23902, -25909, 32434, 77625, 55930, 116964, 23484, -123132, -11283, -89435, -13569, -135242, -101785, -296463, 29582, 174405, 98845, -391940, 46165, -77399, 149385, 211522, 29097, 282317, 152948, -3303, 31549, -178661, -98240, 49706, -212420, 407476, 12942, 246135, 348222, 353543, 57723, -376168, 112117, 44838, 292048, -38982, -88373, 30962, 45724, 98183, -42943, 83901, 13295, -113548, -326090, -269289, -229910, -21569, 262471, -263193, -194404, -187594, 92676, 143193, -111556, -155927]
12362a55927B64592c6352j66513A12511J82240h7609L4575G6871l4280b79970
12351a24177N4682J2871F514d9963B31012A09732a91573B52698I790e36434A28732
12339H0090h8625C6397c59526A05017b0754B19317q2021f9799r1550j28082A23648
12327H7107b46144n8453E0434a87642A62125n7756m2170d88870b1334j07015j97239
12316c25588g6882j22342A41761a63862C0114L46698A36277J63980j11673g6970
12305C55362b6802k6881j56874A63385R8156c01195D8055J02690b81298A31463
12294C81055A12509K51940a20513B9404K18713a31190j89565R5656m977B69988
12283A55937G5787a98939A65224L22429h784j31424A12534a45400B90111f728
$$ y = [-155927, 264592, -36352, -202865, 112511, 294751, -87609, -53034, 76871, 42591, -279970, -124177, -69495, -56624, 6514, -49963, 231012, 109732, -191573, 252698, 9790, -536434, 128732, 80090, -88625, 36397, -359526, 105017, -20754, 219317, 137296, -69799, -161349, -289431, 123648, 87107, -246144, -304597, 50434, -187642, 162125, 104369, 62199, -488870, -21334, -128349, -325588, -76882, -199224, 141761, -163862, 30114, 376812, 136277, 300257, 188584, -76970, 355362, -26802, -53683, -210557, 163385, 261541, -301195, 48055, 150745, -281298, 131463, 381055, 112509, 364449, -120513, 29404, 248117, -131190, -320755, -225099, -230076, 269988, 155937, 75787, -198939, 165224, 487653, -8784, -140208, 112534, -145400, 290111, -6728]
12272d737D50665b41947B54575i4077A10335Q4219L2345f5978r9763B07109j9987
12261A87122r087b9424j5995m4902A7246K39099C0246L5059g4885q5269O5506
12250i4648C91679a17076A43457O578b14228D50909j94967o6237Q5546J60458
12240D35709i2046C72101E1684K99170j30602A7034b64008A79122j7715J71070
12230C32477o5092O487I5566J29932j0362b1857j09427p0891B99202D9654n205
12219D4449K51271d9851l6518M2386H1044K64186R492e4042j23612H6737a5556
12207B22433N3464j6984M4439R3736j1733A26243E6652K13425a1760M442A67648
12195E41860D7592J21370a32647B23059a282H6070a2723B14553p1777b1814o8858
$$ y = [-4737, 450665, -241947, 254575, -94077, 110335, 194554, 226899, -65978, -165741, 207109, 187122, 178035, -29424, -45419, -90321, 17246, 256345, 30246, 65305, -74885, -160154, -94648, 391679, -117076, 143457, 150035, -214228, 450909, 255942, 189705, 275251, 435709, -92046, 372101, 51684, 350854, 220252, 17034, -264008, 179122, 161407, 332477, 267385, 273872, 95566, 225498, 215136, -21857, -131284, -202175, 299202, 49654, 44449, 295720, -49851, -86369, -43983, 81044, 345230, 354722, -54042, -177654, 86737, -15556, 222433, 275897, 258913, 303352, 397088, 385355, 126243, 56652, 270077, -11760, -7318, 167648, 541860, 47592, 168962, -132647, 223059, -1282, 86070, -12723, 214553, 142776, -21814, -90672]
12184i0672q2739e6103B71883c7111A13237R8267K1356Q009E1462M87266d0706
12172D71737j33437n5352N1986p2937q5193m5103k2996P7346N1459b74621a22821
12160H9326a91458D819e2221C43094j52380O9875J8131A6644b40245C23196A19812
12148B06545a17979p5343A89649b03617M1462b3599i131C3573h0866C84683f7310
12136A73663D7676J22928c7367p3553B146J11669J09678e4938B0851d60766A34501
12124c0568D6239C423b43626a18972A88142q2346L3274b71680A19647b36924j1784
12113b48708A36065N0581E4076J09656E5905a71909H5965N6968a53402q1990C13488
12101A67511e6873A4242a67665B18431H9706b9692D5348a53731l54263B36850
$$ y = [-90672, -173411, -56103, 271883, -37111, 113237, 211504, 232860, 240869, 51462, 538728, -40706, 471737, 338300, 282948, 334934, 261997, 176804, 131701, 108705, 186051, 237510, -274621, -122821, 89326, -191458, 4819, -52221, 343094, 190714, 260589, 278720, 16644, -240245, 323196, 119812, 206545, -117979, -193322, 189649, -203617, -162155, -23599, -9131, 33573, -80866, 384683, -67310, 173663, 47676, 170604, -37367, -110920, 2146, 113815, 223493, -54938, 20851, -460766, 134501, -30568, 46239, 3423, -243626, -118972, 188142, 105796, 139070, -271680, 119647, -236924, -248708, 136065, 186646, 54076, 163732, 55905, -171909, 85965, 142933, -153402, -235392, 313488, 167511, -56873, 14242, -167665, 218431, 89706, -29692, 45348, -153731, -507994, 236850]
12090A82579H0418e6138f009B40316f2232J5451o1982C14280a71850A49602a11294
12078b9553B60980g8012B6206h4111D7363L6630Q867i218A89835P05356L50674
12067A245865k73334m75060j44980b77947D7111R9068J40170A18255b61774G172
12056c50303E9358c5603M433C43574I0050b35006A84484a36193N9245A14733C5183
12044D5512f0315l1994A7033a95128k0919E8a98027C7961K04148B7495J43216
12033A70711h8776L2746j61674F0637a77907M710H6032h4968k34357E8169h4637
12021b70625B841J33034N3110a89481f5039B1276K37181R3537j75875H5244b8870
12009D6457a86181G0210a53496k6528D0706K06522n2024m3472P5069b62504f5265
$$ y = [182579, 80418, -56138, -6009, 240316, -62232, -46781, -108763, 314280, -171850, 149602, -111294, -29553, 260980, -78012, 26206, -84111, 47363, 83993, 92860, -9218, 189835, 895191, 1245865, 972531, 497471, 352491, -277947, 47111, 146179, 286349, 118255, -261774, 7172, -350303, 59358, -35603, -31170, 343574, 90050, -235006, 184484, -136193, -76948, 114733, 35183, 45512, -60315, -92309, 17033, -195128, -216047, 58, -198027, 37961, 242109, 27495, 170711, -88776, -56030, -217704, 60637, -177907, -173197, 86032, -84968, -319325, 58169, -84637, -270625, 2841, 135875, 188985, -189481, -65039, 21276, 258457, 351994, 176119, 85244, -28870, 46457, -186181, 70210, -153496, -180024, 40706, 247228, 195204, 151732, 226801, -262504, -65265]
11997b96966a07148J2902B12881b9042A16032a10878M1498J9925j50570A87142
11986A00916h0162G7331a82618H940J11320O425g6156C8875J47679k3900b06626
11974a76088n0976D6016a64997N2783k12498B53935c02924Q8692J2524N8145A14694
11962c53427a60766I3008Q9938K4288a78097B7736d34322a20186p492E3847a84561
11950C9221J9106J19234c53057a03393b0934j5723H1153b00177N4321j50858a21270
11938a90936i09m20253A3314R0084B2994O3779C4248R9145D2881c12595h621A9961
11925A51846h9848j08743D25488a62486E1450a00646B8545L3739i3002A23694
11914B65815A24755A7074b22870A92347n7443i7046J2705k53129B97064J38085
$$ y = [-296966, -107148, -94246, 212881, -29042, 116032, -110878, -69380, -49455, -200025, 187142, 100916, -80162, 77331, -182618, 8940, 120260, 126685, -76156, 38875, 186554, 162654, -206626, -176088, -227064, 46016, -164997, -112214, -324712, 253935, -302924, -214232, -201708, -143563, 114694, -353427, -160766, 93008, 182946, 207234, -178097, 27736, -434322, -120186, -127678, 53847, -184561, 39221, 58327, 177561, -353057, -103393, -20934, -36657, 81153, -200177, -145856, -296714, -121270, -190936, -909, -421162, 13314, 103398, 22994, 86773, 34248, 133393, 42881, -312595, -8621, 19961, 151846, -89848, -198591, 425488, -162486, 51450, -100646, 28545, 62284, -93002, 123694, 265815, 124755, 17074, -222870, 192347, 134904, -97046, -84341, -337470, 297064, 435149]
11904D35149A89908e4153A29027n4709b40529F5838a48831K3509A64061h1601
11893A97541L3866j01041J45277a38427D3560d6982k46567H7119d82401g2861
11882e04540J09073i2868B72166a41050C7451J11773A4487Q524J00390k45b95169
11870i7706q469B49379C3598R2514C978J60454M5442a50114m5538j64522g8507
11858b21630j04922B4525g707B21518J25759b43179A3417c53228a71799O7920
11848a03879j07670r9253c8737G5670b99276B07067k0532b84962B9672g7233F9179
11836c24504J00142c9018B60630i7001e175A49540e6646A03417K11340b550j91499
11825a94049F6294K94835J01085B274h3115A9223P1019b41105B08640F262g1087
$$ y = [435149, 189908, -54153, 129027, 74318, -240529, 65838, -148831, -125322, 164061, -81601, 197541, 231407, 130366, 275643, -138427, 43560, -46982, -293549, 87119, -482401, -72861, -504540, -395467, -92868, 272166, -141050, 37451, 149224, 14487, 23011, 123401, 123156, -295169, -97706, -106175, 249379, 33598, 126112, 3978, 164432, 209874, -150114, -195652, -360174, -78507, -221630, -326552, 24525, -7707, 221518, 347277, -243179, 13417, -353228, -171799, -103879, -211549, -310802, -38737, 75670, -299276, 207067, 186535, -284962, 29672, -77233, 69179, -324504, -224362, -39018, 260630, -97001, -5175, 149540, -56646, 103417, 314757, -2550, -194049, 66294, 361129, 462214, 2274, -83115, 19223, 90242, -241105, 208640, 6262, -71087]
11813A92437a54196A5583c4697k88254J54591A86978C3056c00700N6120h4564
11802b32997j00466N4956A54053o3079B5545h1803b784n8579k21740D2778Q0999
11791A23777B0740c8951I6757c04108C15687c21794f3358p2320k19617d42I5190
11779A96153b5464j38775A15993K49746e6162B08925c2943A02462c52280I349
11768d9752j66513C4917b37672f9636I8438b5236q7941A61529Q9491m3497l5821
11757A71702l1947m0658c14018a9279j70926G0223a93228l61308B58143a99747
11746a09720J4542r6072B56139b18030k6836a1646A06352a00022A45324a94183
11735D4609i9109A8474a74788C20252i029B76060A13221B9104j3454c8854A20564
$$ y = [192437, -154196, 15583, -34697, -322951, -168360, 186978, 33056, -300700, -244580, -84564, -232997, -333463, -278507, 154053, 90974, 25545, -81803, -2784, -61363, -283103, 42778, 123777, 20740, -38951, 96757, -304108, 315687, -321794, -63358, -135678, -355295, -442, 95190, 196153, -25464, -164239, 115993, 365739, -56162, 208925, -32943, 102462, -352280, 9349, -49752, -216265, 34917, -237672, -69636, 98438, -25236, -113177, 161529, 251020, 207523, 171702, 139755, 99097, -314018, -19279, -190205, 70223, -193228, -554536, 258143, -199747, -109720, -95178, -191250, 256139, -218030, -244866, -11646, 106352, -100022, 145324, -194183, 44609, -99109, 18474, -174788, 320252, -9029, 276060, 113221, 29104, 15650, -38854, 120564]
11723a53505o8595o6640e4162l0690k754o3297m8922C65815p2988E7454J82924
11712B40378o7857o9003A5302J65639b244A12310a07184M5731B8086J90661q6901
11701A31846b12762e7717j65923A87689a71369I949i7336A84588c91412E4115
11690H0825a55439B10840j8170h9410g800j09851m5154L4190C02544L8105B8568
11678C3111L81762c1365A5763J31448a53853C04774D4695K7223b4610A31186e6864
11666B4769J64358h3163a7C14778E3586a49846A99823o3757h5503M0402r9254
11655a44355A80533I67b60322B32923a15805A34010L7940C6630N5076i2762F7208
11643d1048l37307D9144j3632e9520k4227A03093J27876b3128l7316p9694J3823
$$ y = [-153505, -222100, -288740, -54162, -84852, -87606, -150903, -199825, 365815, 292827, 57454, 240378, 172521, 103518, 15302, 180941, -2244, 112310, -107184, -61453, 28086, 218747, 131846, -212762, -57717, -223640, 187689, -171369, 9949, -97336, 184588, -391412, 54115, 80825, -155439, 210840, 192670, -89410, -7800, -117651, -162805, -128615, 302544, 340649, 28568, 33111, 414873, -31365, 15763, 147211, -153853, 304774, 44695, 71918, -24610, 131186, -56864, 24769, 189127, -83163, -17, 314778, 53586, -149846, 199823, 136066, -85503, -45101, -144355, 180533, 967, -260322, 232923, -115805, 134010, 171950, 36630, 91706, -92762, 67208, -41048, -378355, 49144, 35512, -59520, -83747, 103093, 230969, -23128, -60444, -140138, -126315]
11632a26315C2107O4202B957J01167B3869a19684C1941R638a94857C01986a74888
11620D5280h0245A70631B980d1688B9889b13474D49971A73348d2683b0127H3201
11608e0316C24789b44173d4982B5456N5196e0057B98836d54C699L12391h1541
11596B39520o810E9586J23901a0661k05555D29913A78885c55614C1675e511B6969
11584D6080N2382c510n5447k26162A85178f5452q1875e2188B59383n7932b52726
11572f4245A81052b4379r9514A40858K999n2030g6580B75531c1480C35074A56169
11560A22845K46394A06662N6783i8922m6274B06410m0544b73773J35350e1731
11549A04961i4409B82394L4071d14129B06318a75390B03451i1394I9857k9555
$$ y = [-126315, 32107, 96309, 2957, 104124, 23869, -119684, 31941, 41579, -194857, 301986, -174888, 45280, -80245, 170631, 2980, -41688, 29889, -213474, 449971, 173348, -42683, -20127, 83201, -50316, 324789, -244173, -44982, 25456, 80652, -50057, 298836, -454, 3699, 316090, -81541, 239520, 232710, 59586, 183487, -10661, -216216, 429913, 178885, -355614, 31675, -5511, 26969, 46080, 98462, -3510, -58957, -285119, 185178, -65452, -147327, -52188, 259383, 201451, -252726, -64245, 181052, -24379, -123893, 140858, 143857, 91827, -76580, 275531, -31480, 335074, 156169, 122845, 369239, 106662, 163445, -98922, -145196, 206410, 165866, -273773, -138423, -51731, 104961, -94409, 282394, 316465, -414129, 206318, -175390, 203451, -91394, 99857, 70302]
11539G0302L84964h1120A87150r697b3478B05727H9017R4245a77008A84335b49950
11527C05857a5883n4831j91925B72042r4540H7275K8156O5396A6850K30684h3766
11515a28459p9854P663A37949J99641a69742j36407h1358K18j60839B71972l0355
11504B41617K865G8403J32798I0846k6573N0297M0011K2474L17944a4238j38620
11493a52858g2444k6166A19731c32650B23340J80698a25663C72254A43316L23279
11483D66595j73072n9074F2845K362J38562J53600M0869A53482N6879J34600m8703
11472B96258i4350A87054J83196a2649A14998K6307Q076K37860c84084C64068
11461a30111G4704P6646D1420K17819I0659K01987J3268A25064Q0512J6645D1862
$$ y = [70302, 455266, -81120, 187150, 177453, -23478, 205727, 89017, 183262, -177008, 184335, -249950, 305857, -15883, -70714, -262639, 272042, 177502, 87275, 115431, 180827, 16850, 247534, -83766, -128459, -208313, -200650, 137949, 337590, -169742, -306149, -81358, -81140, -241979, 271972, 241617, 244482, 78403, 211201, 90846, 64273, 114570, 154581, 177055, 494999, -14238, -152858, -72444, -98610, 119731, -332650, 223340, 404038, -125663, 372254, 143316, 466595, 293523, 234449, 62845, 65207, 203769, 357369, 398238, 153482, 210361, 344961, 296258, -94350, 187054, 370250, -12649, 114998, 141305, 149381, 387241, -384084, 364068, -130111, 74704, 151350, 41420, 259239, 90659, 292646, 305914, 125064, 205576, 222221, 41862]
11449A61363J7858L13078j03842A92487a33432j44474D29273A45697a42780A63728
11438C85362h7199j63494e1253q5216N740c5520D8359c61293R9757g019F8616
11426C38428j17611r1104J92180J6463r7407A818J45399c76804A6475O829a76261
11414a7681C28294B3066M6995k9281J05753k8074K48936c16851O8097A07510l2675
11403G4835a78019B3860i199D27418D2569d33843E9325a92477f8002A89217b03263
11391A34307c742E6874a15332m202B36275h808B82085a81731r4781b971r7689
11380a00660j12774B36956b06021h5761b4287L855A05764M9612b27145A56364
11369A42333a71817B824b99233J31047f4544j72555d7176j04333d5258j15037
$$ y = [161363, 179221, 492299, 388457, 192487, -133432, -277906, 429273, 145697, -142780, 163728, 385362, -87199, -250693, -51253, -136469, -130729, -35520, 48359, -361293, -261536, -7019, 68616, 338428, 220817, 129713, 321893, 338356, 240949, 1818, 147217, -376804, 16475, 23304, -176261, -17681, 328294, 23066, 70061, 40780, 146533, 118459, 367395, -316851, -248754, 107510, 74835, -178019, 23860, -9199, 427418, 42569, -433843, 59325, -192477, -68002, 189217, -203263, 134307, -3742, 56874, -115332, -119534, 236275, -8808, 282085, -181731, -276512, -2971, -100660, -213434, 236956, -206021, -85761, -24287, -20432, 105764, 155376, -227145, 156364, 142333, -171817, 2824, -299233, -168186, -64544, -237099, -47176, -151509, -45258, -160295]
11359a60295A65780k6855b231o5215E4382e100k67997a09910H936L43876a72925
11347G1914e35145J94765B65876b40712H5970N9296J94361a6026E42234D9477
11336H771P3940B6912c36058j44959a2758j76450A54172J00006a33467f2249j6402
11325g8651j09148A31799O8634n1890L2917a84811b5473k778j49992I2509g5446
11313A67612a16273C32066A7517d3620l9096l8424l64029a66830L3982N727N2848
11302g4273G1890A1034o75i2009I7190a05288D6720a22951k9918k23644C68594
11290A35827a61567g8028B82626B6112e673r8649G521Q8415M3755i7679d6406
11278G293b14213A92598b11691e8553j28022f3577H8522B3168c19653A89777a85389
$$ y = [-160295, 165780, 138925, -2231, -67446, 54382, -5100, -273097, -109910, 8936, 352812, -172925, 71914, -535145, -340380, 265876, -240712, 85970, 145266, 339627, -16026, 542234, 49477, 8771, 82711, 26912, -336058, -481017, -12758, -189208, 154172, 254178, -133467, -62249, -78651, -187799, 131799, 200433, 148543, 181460, -184811, -25473, -28251, -178243, 92509, -75446, 167612, -116273, 332066, 17517, -43620, -82716, -121140, -485169, -166830, -132848, -127121, -74273, 71890, 11034, 10359, -92009, 97190, -105288, 46720, -122951, -152869, -376513, 368594, 135827, -161567, -78028, 282626, 26112, -5673, -104322, 7521, 95936, 139691, -97679, -46406, 7293, -214213, 192598, -211691, -58553, -186575, -63577, 88522, 23168, -319653, 189777, -185389]
11266b4376n3972F186i2769A28931a16375L8728B32642f5768H1263b07777D9640
11254a05310M1981q0409A66268F6974d11349b9382A14957c18313a01310F371c5379
11242c75272F1775N2659J77954H0745a19439a0866o3534A89661a17545B44746
11231E9090J23924a53769r0026d6716a9645p7819A06417l0792b23841Q6227d0267
11219B0016J42597b01265b7920j53188N4455D12572a25868q8141F0375c7255j23503
11208a60758A85555a03643K5061j11409P2168A23388E7273c33113a37087N9573
11198g7514p5272J1411N8270A13478M8211g7111o8532B48011A13670b94875A07167
11186A02940d9511B37626b00426A9678a64521d0255j30372e1161A1609b94542
$$ y = [-24376, -78348, 6186, -92769, 128931, -116375, -77647, 232642, -65768, 81263, -207777, 49640, -105310, -63329, -143738, 166268, 66974, -411349, -29382, 114957, -318313, -101310, 6371, -35379, -375272, 61775, 114434, 292388, 80745, -119439, -10866, -74400, 189661, -117545, 244746, 59090, 183014, -153769, -243795, -46716, -19645, -97464, 106417, 75625, -223841, -137614, -40267, 20016, 162613, -201265, -27920, -181108, -126653, 412572, -125868, -214009, 60375, -37255, -160758, 185555, -103643, -78582, -189991, -117823, 123388, 57273, -333113, -137087, -77514, -152786, -141375, -83105, 113478, 161689, -77111, -145643, 248011, 113670, -294875, 107167, 102940, -49511, 237626, -200426, 19678, -164521, -40255, -170627, -51161, 11609, -294542]
11175b42154h0701k11568A34619a96839A70754j7269b77206a15179B23800E1673
11164a0655G1996e43266c7644R056q1363l0758G4640b07283B61535A16784h3159
11152c1973m16368b10176L3726j45169n5482a10116L1230A47287J11057a70153
11141a44902J8135A49382b16373D61445A9409P4643k4128h7335K4841K6698D76741
11129A79942J34814A8258N1423d61596A1148c1993C89317A75591a00604q3267
11119a83871D4744d10940i7146B67933e4746D7322g6248A06709B3865K60117m8177
11108B35805e1863D256L00984A24552a2166A05079D3827a92671B09112D0205K04722
11097B44927A19833J40416B0699J51474o81m2435K1330m7236J1802N527J60918
$$ y = [-242154, -80701, -292269, 134619, -196839, 170754, 153485, -277206, -115179, 223800, 51673, -10655, 71996, -543266, -37644, -28588, -109951, -140709, 74640, -207283, 261535, 116784, -83159, -31973, -448341, -210176, -176450, -321619, -377101, -110116, -78886, 147287, 258344, -170153, -144902, -126767, 149382, -216373, 461445, 19409, 94052, 69924, -87335, -62494, -35796, 476741, 179942, 314756, 18258, 69681, -461596, 11148, -31993, 389317, 175591, -100604, -183871, 44744, -410940, -97146, 267933, -54746, 47322, -76248, 106709, 23865, 283982, 235805, -51863, 4256, 305240, 124552, -12166, 105079, 43827, -192671, 209112, 40205, 244927, 119833, 260249, 20699, 172173, 171492, 129057, 150387, 103151, 114953, 120480, 281398]
11086B81398A07166J75921j22182a8384A41031i583F3364i0834A55632K7933K97716
11075D81281j12714q846j29242J79532A98301L36412A17894J73905J42723q4688
11065C49834C2274N87758m4577k01921L3586J5295K9929J95414n3640o5104j9393
11054E09621o3596J14082I4287P35412k56287K42941k96068O9314K18114C03529
11043E70095L16612j93810B17720L34820M89328n02505Q4721J28157n738P5571
11033H22074k76306k16840K54686J09989B86974L50949R9225J09848k61057K54811
11023H40750j31587J75576j29326k27390P4456J94336k36074B67144M62206M4861
11013G74211k70794K90350J4775j09146k61264K24408B30473K9731L48210j8908
$$ y = [281398, 107166, 283087, 160905, -18384, 141031, -9583, 63364, -90834, 155632, 183565, 481281, 368567, 359721, 230479, 410011, 198301, 534713, 117894, 291799, 434522, 349834, 32274, 620032, 575455, 373534, 407120, 422415, 452344, 647758, 594118, 529014, 509621, 446025, 560107, 94287, 829699, 573412, 816353, 520285, 589599, 807713, 303529, 570095, 886707, 692897, 217720, 552540, 1041868, 539363, 624084, 752241, 746503, 822074, 545768, 328928, 583614, 693603, 286974, 637923, 737148, 846996, 585939, 840750, 709163, 884739, 755413, 528023, 602479, 796815, 560741, 267144, 729350, 774211, 503417, 793767, 808542, 699396, 438132, 662540, 230473, 260204, 608414, 589506]
11003E89506K01840m1697K8038q4086k34001K52056J14060p9951m3629q1290J12446
10992G33292l47175M80704O6831j80491L03515l99010K90762j05899J87107K44118
10982A273754j85491J55418N44346m32034J99682L22177M2491N6818J14354N56463
10972B647978M0886k04314N34666l68466k63433k10964m95000j564J0071l9423
10962A650437P993r0757J64534k79547L02596J44135l522m08096j85050m47896
10952H54827M11797n60505K54966l15729B92037K44939m1093k08548J14021q1686
10942C19670M398K72932A15411i9531A38180Q7746p1078J04885a2072A37424a54555
10930E41874A73675J33498e8367B89326H7669j5562n012L7545K47553A27870c73993
$$ y = [589506, 791346, 749649, 777687, 693601, 459600, 711656, 825716, 745765, 702136, 620846, 733292, 386117, 866821, 933652, 753161, 1056676, 657666, 948428, 842529, 1029636, 1273754, 1088263, 1243681, 1788027, 1355993, 1555675, 1877852, 1920343, 1977161, 2091515, 2647978, 2688864, 2484550, 3019216, 2650750, 2387317, 2176353, 1681353, 1679789, 1689860, 1650437, 1658430, 1567673, 1732207, 1452660, 1755256, 1899391, 1895869, 1487773, 1302723, 854827, 1266624, 706119, 961085, 645356, 292037, 536976, 495883, 287335, 401356, 319670, 324068, 597000, 115411, -99531, 138180, 225926, 154848, 259733, -12072, 137424, -154555, 541874, 173675, 307173, -58367, 289326, 87669, 72107, 67095, 104640, 352193, 127870, -373993]
10918A70950K7324J05492K7157D3877e0240E3910B2514c0741A85637J19449F8829
10906C01064a87808D1655R3834b43812A89054C8302b0397q3864k26411O9089A45457
10894c45k10212D4575A9528i1316j75652A95843B187N5562K35918G9343J08445
10883A87788d9247k71308B07693c31285f6670B02937a35053E320d78375A93377
10872A57734F3211o65a53038I7739L11915a27427r756H8151b01797d480j8762
10861b3242A32283B6717J08161b87555i4497q1005A03141J12060c00534h2022
10850A95050a36167j31788d0869l44376a17568A34272d5954k0891j4581k5450
10840a06876c3819B59888a0329j24538j2761L9072B73871J24616c3942i766D40428
$$ y = [170950, 198274, 303766, 330923, 43877, -50240, 53910, 22514, -30741, 185637, 305086, 68829, 301064, -187808, 41655, 135489, -243812, 189054, 38302, -20397, -104261, -330672, -261583, 145457, -345, -210557, 44575, 19528, -91316, -266968, 195843, 2187, 57749, 293667, 79343, 187788, -49247, -320555, 207693, -331285, -66670, 202937, -135053, 5320, -478375, 193377, 157734, 63211, 62546, -153038, 97739, 409654, -127427, -137183, 88151, -201797, -4480, -23242, 132283, 26717, 134878, -287555, -94497, -175502, 103141, 215201, -300534, -82022, 195050, -136167, -267955, -40869, -385245, -117568, 134272, -45954, -66845, -81426, -106876, -33819, 259888, -10329, -134867, -147628, -108556, 273871, 398487, -33942, -9766, 440428]
10828b79328A73756N7323b4695B52397j17232E9940e8810j6231A04588Q276a95971
10816G5134c05676Q2604f0840k98177d2333A6691b18616e746B781O9505k5490
10805D6796h4162D87620b42920e8447j72377b9368l5637A92632a41488f9705h037
10793B3356e2604a0319A91496b6960m6011F7731B5253J47440d07168f6669j04123
10782a70792D865K3351P7132F505J36468A2047j389g7266k07597A21099M12738
10771E33837a35010k1191H4230d06891D5769j7431J44587a08118B55966b22128
10760a38441N4690l522r6878K4600F5267b70327n2315a28630N9347j77335P338
10749b39280C16787b76063N9141C4846P1230a49341j09678N0406B94237e4670
$$ y = [-279328, 173756, 231079, -24695, 252397, 135165, 59940, -58810, -75041, 104588, 112864, -195971, 75134, -305676, -223072, -60840, -359017, -42333, 16691, -218616, -5746, 2781, 72286, 46796, -84162, 487620, -242920, -58447, -230824, -29368, -65005, 192632, -141488, -69705, -8037, 23356, -52604, -10319, 191496, -26960, -72971, 67731, 25253, 172693, -407168, -66669, -170792, 4865, 28216, 105348, 6505, 142973, 12047, 10658, -77266, -284863, 121099, 533837, -135010, -156201, 84230, -406891, 45769, 28338, 172925, -108118, 255966, -222128, -138441, -83751, -87273, -184151, -159551, 65267, -270327, -322642, -128630, -69283, -246618, -239280, 316787, -276063, -216922, 34846, 106076, -149341, -259019, -208613, 294237, -54670]
10738B61854E0624a57514c0434l82893B06826c04105B24365m2289j1880b79924
10727C4196A5098J34694P9906e0678m4221k4145A50097B9473O6320b75437J17117
10716a58320D3969c49449E6723k5060O1231d2900l29704a34290L3198B79450b52528
10704B86863b22872I9012N2033a00586G2377m90h2062r1187E3045a91365H3493
10692B1913b9938A06530g0214A9596a03853j36194Q6209L3143B82875J6147b78913
10680a71005P9426k69821J76855j46364B16503G2734M7774d3649k67328e6461
10669E3306a79653A24362R7151b85667A79649R4588d0828A5115a34457d4172p9048
10658a23220k43616H9719a24419l9144j74405A8872d65152A6621K230Q9608a04751
$$ y = [261854, 50624, -157514, -30434, -413327, 206826, -304105, 224365, 182076, 170196, -279924, 34196, 15098, 149792, 229698, -50678, -94899, -119044, 150097, 29473, 95793, -275437, -158320, 43969, -349449, 56723, 31663, 92894, -42900, -372604, -134290, -101092, 279450, -252528, 286863, -222872, 99012, 151045, -100586, 72377, 71887, -82062, -173249, 53045, -191365, 83493, 21913, -29938, 106530, -70214, 19596, -103853, -240047, -153838, -120695, 282875, 299022, -278913, -171005, -91579, -361400, -184545, -330909, 216503, 72734, 120508, -43649, -310977, -56461, 53306, -179653, 124362, 221513, -285667, 179649, 274237, -40828, 15115, -134457, -44172, -123220, -366836, 89719, -124419, -163563, -337968, 18872, -465152, 16621, 18851, 108459, -104751]
10646g6028A24381a80051P1749k10366B3623a00711l27692A11739c31964g112
10635A00149b87866A47906A4955K31394o7740a30810o477A48174i8926A11740
10624A09248E199J10037a07489G9802f3575C51809g1568O784K5840J8153k85611
10613c06402a34158j05277c1878k08699B20607j09097c26171j93651F0082d29938
10602i6163D6497b56984B62884j7418a81402A52472n8843a77990j88634A54660
10591c28892J17339H220b53653E9363O8587a99792L8557A4779M1772b34234a7645
10579A28563a102o9681A04555b88252f7350m085j84669A42901a1703n8778C5062
10567B5772h2115A7349a55377l41024a64943b8776E8963G299d0158A18918M9563
$$ y = [-76028, 124381, -180051, -108302, -318668, 23623, -100711, -428403, 111739, -331964, -7112, 100149, -287866, 147906, 14955, 246349, 178609, -130810, -137287, 148174, -98926, 111740, 109248, 5199, 115236, -107489, 79802, -63575, 351809, -71568, -64784, -38944, -20791, -306402, -134158, -239435, -31878, -240577, 220607, 111510, -326171, -519822, 60082, -429938, -96163, 46497, -256984, 262884, 245466, -181402, 152472, 93629, -177990, -366624, 154660, -328892, -211553, 8220, -253653, 59363, 127950, -199792, -161235, 14779, 56551, -234234, -17645, 128563, -1102, -70783, 104555, -288252, -67350, -71435, -256104, 142901, -11703, -70481, 35062, 25772, -82115, 17349, -155377, -496401, -164943, -28776, 58963, 7299, -40158, 118918, 168481]
10556A68481a58203A43700l9465J24888e7258j88975e7967D302L98844i8442J9809
10545g8633a9999B21405j04125b51012a19791D0808h4932I5520O2417J28116f7339
10533b28079d1126D5222a90881R0900k0180N3280o7107P948b0583C21741I4437
10521c54787A6948J10214b8279k09316d6427C24994A53756a10032k75131a85560
10510A77197C04b67163B79318b15645C83990E6131a66908A05369a16688B35930
10499A31491b7366C170K9024J25969a07082F7148b34748g5790b9532l9092A12744
10487B18653a62936A50275n1150N0074m5867K9672J21470N91939H3907M6749K16995
10476C47651F7585C2322h2502A94136a85278k3263j58823a81987n1047B31145
$$ y = [168481, -158203, 143700, 104235, 229123, -57258, -246233, -57967, 4302, 403146, -98442, -78633, -19999, 221405, 117280, -251012, -119791, 40808, -84932, 95520, 157937, 286053, -67339, -228079, -41126, 45222, -190881, -99981, -120161, -66881, -133988, -126040, -20583, 321741, 94437, -354787, 16948, 127162, -28279, -237595, -46427, 324994, 153756, -110032, -385163, -185560, 177197, 304, -267163, 279318, -215645, 383990, 56131, -166908, 105369, -116688, 235930, 131491, -27366, 3170, 32194, 158163, -107082, 67148, -234748, -75790, -29532, -68624, 112744, 218653, -162936, 150275, 99125, 149199, 103332, 133004, 254474, 846413, 83907, 130656, 347651, 67585, 32322, -82502, 194136, -185278, -208541, -367364, -181987, -233034, 231145]
10465A5338L5340d5386F79K5409b60469A05967m0443K71427I0486b68479C69097
10453e0714p2811j23267P8539d3506A58349a60796B10481a47175B26438a58797
10442C17440A34919c91657J25563H2067J37203l0868l0468a22040l868K6090F5671
10430b41949A75637k7270a51605n1133F5309a47039M5547j90379I0131J22939
10420B13070J19127G671R7157P6532H9910a60310g8307n2368A00281R8700F0718
10408c4311A80593c01227b9293B03773b8646F4142i3266C5973P2683k3228O0930
10397A46358a57924a3793B02244a42645I1531b3653A43376R9810A759a53678A72504
10385A68742p5612a25812k657I9181h5377L9292A08420n3496K60305A19067J5249
$$ y = [15338, 50678, -45386, 679, 26088, -260469, 105967, 65524, 336951, 90486, -268479, 369097, -50714, -123525, -246792, -168253, -43506, 158349, -160796, 210481, -147175, 226438, -158797, 317440, 134919, -391657, -266094, 82067, 219270, 188402, 157934, -122040, -125908, -99818, 65671, -241949, 175637, 148367, -151605, -202738, 65309, -147039, -101492, -291871, 90131, 213070, 332197, 7671, 104828, 181360, 89910, -160310, -78307, -130675, 100281, 198981, 60718, -34311, 180593, -301227, -29293, 203773, -28646, 64142, -93266, 35973, 108656, 85428, 146358, -157924, -13793, 202244, -142645, 91531, -23653, 143376, 243186, 1759, -153678, 172504, 168742, 93130, -125812, -128469, 99181, -85377, -46085, 108420, 54924, 315229, 119067, 134316]
10374A34316J59454i9498B13606q3566L74697J2179f1797C17822N1023j04317
10364B64528K88745A12617j641K27353p1650f5391C07079j10065R9881Q4715q9888
10353B91722F290N58955a63829F15194b301C41733j0950P8297H9050M75713j92420
10342C72343A18303R8923Q3509o6396A13109A145L32123p5635N2998j20737N3767
10331B43661E6774L7500b35129A94191g9977q1494B43140A12535L42093F2255
10320i2172c2896B12749r0612A0548R4848L172c1988j09791A54999o2445B6364
10308e3759E6858a63712P5876h470A49869a07086B14969h1093G5670a29798B3595
10296g6488b6314F727b29390A07742d68962C8760N0760M3059E3366e7192i901
$$ y = [134316, 293770, -99498, 213606, 130040, 504737, 516916, -61797, 317822, 368845, 264528, 553273, 112617, 110976, 338329, 266679, -65391, 307079, 197014, 296895, 381610, 291722, 6290, 565245, -163829, 615194, -2301, 341733, 330783, 409080, 89050, 564763, 372343, 118303, 217226, 300735, 234339, 113109, 1145, 333268, 257633, 310631, 189894, 243661, 56774, 94274, -235129, 194191, -79977, -161471, 243140, 112535, 454628, 62255, -92172, -32896, 212749, 122137, 10548, 105396, 108568, -31988, -141779, 154999, 92554, 26364, -53759, 56858, -163712, -87836, -8470, 149869, -107086, 214969, -81093, 75670, -129798, 23595, -76488, -26314, 6727, -229390, 107742, -468962, 38760, 89520, 132579, 53366, -57192, -9901]
10284I349D377L2664j1734a47124m4451P846j77052A08244h5207l6228O697j81534
10272b96272C69479A14621D6838J28494a03832C26303A10921i2174D8973a15827
10261C45765G8905J29457J80357m6903A11913a8357B11593H752c7637G7869a02275
10249a93842j08505k7996g0701m75572J95479O1451g347I6434h4349j29775M5306
10238a68818E5109J90466a25107E4456J06594b40952d4654n9578l3431k74986
10228d12649p730B50790c6703A80428c72567h5786B08094F0032a64279B759a06712
10216a94866q0098a10199n6543o0898q8998B55051K64617a29605q316j32803d9364
10204a70459f0307b3536j67591a3452C91019D811L026L1449a0965p7255E417K97037
$$ y = [9349, 4377, 37041, 25307, -147124, -191575, -183729, -360781, 108244, -85207, -121435, -114738, -296272, 369479, 114621, 46838, 175332, -103832, 326303, 110921, -92174, 48973, -115827, 345765, 78905, 208362, 388719, 341816, 111913, -18357, 211593, 8752, -37637, 77869, -102275, -193842, -302347, -330343, -70701, -546273, -350794, -289343, -7347, 96434, -84349, -214124, -168818, 55109, 245575, -125107, 54456, 161050, -240952, -44654, -104232, -137663, -412649, -420379, 250790, -36703, 180428, -372567, -85786, 208094, 60032, -164279, 2759, -106712, -194866, -274964, -110199, -166742, -227640, -316638, 255051, 519668, -129605, -137921, -270724, -49364, -170459, -60307, -23536, -191127, -13452, 391019, 4811, 7837, 39286, -10965, -88220, 5417, 302454]
10192C02454a01773C36200b53979K8304h3792j55618F1095h6098k6958m368I1444
10180h52A8799b27515A15006c84298C7004b56220A7428b356r5586k30646N0842
10169b77746N797e4668G3537d20830a79826j09917e4633A41830f7386F3368a58824
10157B78531i8903l280j85335A6472N1311b54809a3774j22609K55f4911J0343
10146e4568B38131G137a57235j86958B1641e8210B1368i2637L1217n2177j13909
10135b27506F5076c9933k97051B4888H909N4425a47685E1101J01092A4819b83751
10123c3692p585D8462a45145g469j75974j30627d3842B0507J7779M02704A43637
10111e9814A80764a21510G0202a0852A31243k5349m8304c49291B65889c63009
$$ y = [302454, -101773, 336200, -253979, -225675, -83792, -239410, 61095, -86098, -113056, -117424, 91444, -852, 18799, -227515, 115006, -384298, 37004, -256220, 17428, -2356, -97942, -328588, -277746, -271949, -54668, 73537, -420830, -179826, -289743, -54633, 141830, -67386, 63368, -158824, 278531, -98903, -102183, -287518, 16472, 67783, -254809, -13774, -136383, -136128, -64911, -54568, 238131, 7137, -157235, -344193, 21641, -58210, 21368, -92637, -61420, -113597, -227506, 65076, -39933, -336984, 24888, 8909, 63334, -147685, 51101, 152193, 14819, -283751, -33692, -41277, 48462, -145145, -7469, -183443, -314070, -43842, 20507, 38286, 440990, 143637, -59814, 180764, -121510, 70202, -10852, 131243, 105894, 57590, -349291, 265889, -363009]
10100b65393b7535k03171B672J3856J02320b40615A80361p6221b19424E2811G23
10088e7850i343k02350O6049j77751e9713I6734b1600k43076F2782K3905c97227
10076a38853C81348b26222G4433c17789D9189Q7987B3205a09005j307A95588a15458
10064A32600a41082N7086D6406d03838J53042R9564f2846A25358D6741f9265b3097
10052a77091d142l67251a66317N9107j99801B37863g5243K5552l47434J80132
10042b16993P4439D3061L7086a93203G3444l5509o037b1041B49515a44554j41887
10031b86441G5595f9636j51312P3057C9981R5824l8346a13034D14970a4624j06700
10020a21324C52457c73551a36091b7564H7297j6812a85929R092M5052k27668A47992
$$ y = [-265393, -27535, -230706, 2672, 16528, 118848, -240615, 180361, 104140, -219424, 52811, 723, -57850, -9343, -211693, -145644, -323395, -59713, 96734, -21600, -264676, 62782, 86687, -397227, -138853, 381348, -226222, 74433, -317789, 49189, 137176, 23205, -109005, -110312, 195588, -115458, 132600, -141082, -83996, 46406, -403838, -250796, -151232, -62846, 125358, 46741, -69265, -23097, -177091, -4142, -371393, -166317, -107210, -307011, 237863, -75243, -49691, -397125, -216993, -142554, 43061, 80147, -193203, 73444, 37935, 31898, -21041, 249515, -144554, -286441, 75595, -69636, -220948, -147891, 39981, 135805, 97459, -113034, 414970, -14624, -121324, 352457, -373551, -136091, -27564, 87297, 70485, -185929, -176837, -131785, -359453, 147992]
10008A47197b10327J02747G1399d1106i854o7307j21014o190o2561O9828A80580
9996b65r4671q681D6087c01865L9097i9693A71095a60025H0622B8706a26515G4395
9983A26036F2248a79147K2596I1225c8685I577a33954p5486B09010c29016A19959
9971E5318g5074K0061F1420b99983o2317J71651A9428b82217R8064L2025A4367
9959A30925l2120b26809c2890h543A39141c77295B04313b54644I2587a54262r4583
9948b48845a9443j27157r2457J05283k82685K06016q420j45542n4659C6151a52607
9936c89059A70044b17879a405o099r0062j02793E042d2821A8188b24905A24869
9924d024B48499d2171A49670D8817f5674A02385i9503B38833a28307a0472j9780
$$ y = [147197, -210327, -107580, 71399, -41106, -9854, -77161, -198175, -204365, -266926, -197098, 180580, -265, -94936, -103617, 46087, -301865, -262768, -99693, 171095, -160025, 80622, 28706, -126515, 74395, 126036, 62248, -179147, -156551, 91225, -38685, 9577, -133954, -209440, 209010, -329016, 119959, 55318, -75074, -55013, 61420, -299983, -362300, -190649, 19428, -282217, -184153, -152128, 14367, 130925, 98805, -226809, -32890, -8543, 139141, -377295, 204313, -254644, 92587, -154262, -248845, -19443, -146600, -239057, -133774, -416459, -210443, -218863, -364405, -419064, 36151, -152607, -389059, 170044, -217879, -1405, -7504, -97566, -200359, 5042, -42821, 18188, -224905, 124869, -4024, 248499, -42171, 149670, 48817, -65674, 102385, -99503, 238833, -128307, -10472, -30252]
9913c0252B95685b9133l94l1828r7360o0501J07355F10a17374k10719K1709C6401
9900B7796c28231c1409k45557R2532F3492g197A27622E2611i8925j05175I9921
9888a7009A42614l3019a12932B69874j18251i5441H8007c4014l52802i5313L575
9877i1738A06527c95928A39367b82457i2619j54047j07178d2084j16734A57096
9866d01690K00218A69482p9672f977E8600c03156e3404B07004g2402j4980B47411
9854B29477d15662h1103L1410C5001f4709G5020b39094B01885C308L1516c06064
9842F4768h185k66185A24379b46729c976A30497n671e0849f000j28787o3268B62244
9829c4830k5176G0967a47234C718c22928J28618Q8800H8448i3590c0697j45196
$$ y = [-30252, 295685, -29133, -29527, -61355, -158715, -219216, -111861, 610, -117374, -328093, -306384, 36401, 27796, -328231, -31409, -276966, -184434, 63492, -7197, 127622, 52611, -98925, -204100, 99921, -17009, 142614, 109595, -112932, 269874, 151623, -95441, 88007, -34014, -386816, -95313, -91738, 106527, -395928, 139367, -282457, -92619, -246666, -353844, -42084, -158818, 157096, -401690, -201472, 169482, 89810, -6977, 58600, -303156, -53404, 207004, -72402, -87382, 247411, 229477, -415662, -81103, -49693, 35001, -64709, 75020, -239094, 201885, 3308, 34824, -306064, 64768, -8185, -274370, 124379, -246729, -3976, 130497, 124826, -50849, -6000, -134787, -198055, 262244, -34830, -60006, 70967, -147234, 3718, -322928, -194310, -105510, 88448, -93590, -30697, -175893]
9818a75893k2615N6420i246n1456b6559E3969B5472a61768A38839m9293g8087
9806a85755C03025A14163N4972d3724J6810r249j14060d4863j71515a089j06804
9795a07893p7186A92503J1307p2090c86423f4631m8992A07397C787O7230g6347
9783A79216e46722b21581M3282A07863m2847b35669J04826A66442c00990J08151
9773a92839d6214H0757e3052B4764a6742B27624a09453d7432i96C3933a26870
9761g3128j41229A59251a1017n7128B32648F5581a82394b9155j33582B1112J52749
9750A73861c16718b0787j77425h8520B44477a90271j7285A00407L6479b80497
9739a66119A59616a12949p0094D6145J45769a2446m75839a56420P3236j8957m5748
$$ y = [-175893, -198508, -142088, -9246, -60702, -26559, 53969, 25472, -161768, 138839, 89546, -78087, -185755, 303025, 114163, 169135, -43724, -26914, -36163, -150223, -44863, -216378, -1089, -107893, -185079, 192503, 203810, 131720, -386423, -64631, -113623, 107397, 3787, 71017, -76347, 179216, -546722, -221581, -178299, 107863, 65016, -235669, -130843, 166442, -300990, -192839, -46214, 80757, -53052, 24764, -16742, 227624, -109453, -47432, -996, 33933, -126870, -73128, -214357, 159251, -11017, -68145, 232648, 65581, -182394, -29155, -162737, 21112, 173861, -316718, -20787, -198212, -88520, 244477, -190271, -207556, 100407, 136886, -280497, -166119, 159616, -112949, -183043, 46145, 191914, -12446, -488285, -156420, -83184, -102141, -147889]
9728a47889A72380m0518P6717b10028P0487b2158B35530h3055A28927a74260E9826
9716b9153B41811b42479A5926n566O2238f5601B906J02762a23589E5111b80340
9704c2869B80724b07500N6514O5263l16716a38787j52693j07106H1346P765Q9076
9693A78187c9504A6613K48633a71351A21267C1917J47900d06192A8837p196K00421
9682B12062D163c71677B13761b04514k4586C79996j01186H5069a78643l6917a02503
9670c4741j51581L8505N9981n5530j42420D3271N9642J35107d12917g2958E1030
9658a39565F7636A352a5485k7991B79178c36565i9132k23789R1019Q0879B77886
9646A74325a58900j9331c7352j76663d4072B62672c69830c8279a6849A16116d2458
$$ y = [-147889, 172380, 131862, 208579, -210028, -139541, -22158, 235530, -83055, 128927, -174260, 59826, -29153, 241811, -242479, 15926, 10360, 72598, -65601, 2906, 105668, -123589, 55111, -280340, -32869, 280724, -207500, -150986, -85723, -402439, -138787, -291480, -398586, 81346, 89111, 178187, -39504, 16613, 265246, -171351, 121267, 31917, 179817, -406192, 18837, 11641, 212062, 4163, -371677, 213761, -204514, -229100, 379996, 278810, 85069, -178643, -215560, -102503, -34741, -186322, -147817, -87836, -143366, -285786, 43271, 102913, 238020, -412917, -72958, 51030, -139565, 67636, 1352, -15485, -43476, 279178, -336565, -99132, -322921, -231902, -151023, 277886, 174325, -158900, -178231, -37352, -214015, -44072, 262672, -369830, -38279, -16849, 116116, -42458]
9634d1530F4794d4554k24016A71103a03051j3929J8404p9574A23615h2055k5749
9623a07804B32445a38201E5308b4145A13770c0431K883j66814e4448i078L999
9612e079l04821g7085a461j46496j44666J34768d8102J5951j81032Q4963C1696
9600e0879j17473j29538e5607A35432K48145j82373q8073m4408e7970j88176F0750
9588B0562h5788B9409c1051A75586k4608G0831Q0126a08351c1473k34373a19635
9576a29761k89107a1452j90683B90022B6137c0536A7182l191J81173a13092k4125
9565a37217N106r6080I3970K5273c3964n4054L1968C8490J35782a93639M2729
9554a50910L4882k19949a31292l6570P2883m12562D7483c8480j7912j0827j55270
$$ y = [-41530, 64794, -44554, -268570, 171103, -103051, -116980, -98576, -178150, 123615, -82055, -107804, 232445, -138201, 55308, -24145, 113770, -30431, -27548, -194362, -54448, -9078, -5079, -309900, -77085, -1461, -147957, -292623, -157855, -48102, -32151, -213183, -128220, 31696, -50879, -168352, -297890, -55607, 135432, 383577, 201204, 113131, 68723, -57970, -246146, 60750, 20562, -85788, 29409, -31051, 175586, 150978, 70831, 150957, -108351, -31473, -265846, -119635, -129761, -418868, -11452, -202135, 290022, 26137, -30536, 17182, 13991, 195164, -113092, -137217, -132111, -228191, 93970, 119243, -33964, -88018, -56050, 38490, 174272, -193639, -150910, -116028, -335977, -131292, -167862, -94979, -507541, 47483, -38480, -56392, -67219, -222489]
9543b22489N6789d1175j88574k2079j7464c8483A59415a40817j46179A08768c33878
9531e4180p0527B9635c44679a8623j19020a2383j99606L3163E5805a93577m5417
9520b38994l5695B60707c81454B53546n5321C36d9459r0025k5096E4375J03373
9509A57748a02994N779k07456C505b66357g6680B06683B1498c9771j17870a6396
9497a15083j15925a07956m1314A48983c05810C91794C8087i6986j29179a08305
9486f9419c4463N059l85935a78798A42051d05o7865I4233D3515d08019A55079
9474A32474C2563N6730d0226j62489B78278a69105l18755e4911j79469k30134
9464d64514A06155c0026l16633a18181j7226e4083o248j466B69585h9873o04835
$$ y = [-222489, -165700, -41175, -229749, -251828, -269292, -38483, 159415, -140817, -286996, 108768, -333878, -54180, -124707, 29635, -344679, -18623, -137643, -12383, -211989, -178826, 55805, -193577, -238994, -274689, 260707, -381454, 253546, 198225, 336, -49459, -139484, -164580, 54375, 157748, -102994, -97215, -304671, 3505, -266357, -76680, 206683, 21498, -39771, -157641, -16396, -115083, -231008, -107956, -149270, 148983, -305810, 391794, 38087, -96986, -226165, -108305, -69419, -34463, -29404, -415339, -178798, 142051, -405, -68270, 94233, 43515, -408019, 155079, 132474, 32563, 89293, -40226, -202715, 278278, -169105, -487860, -54911, -234380, -464514, 106155, -30026, -346659, -118181, -135407, -54083, -60331, -61797, 269585, -89873, -694708]
9453f94708C253b70168F2160c8777j62212g93A28632a98662B45532a2473k6535
9442c9008j03639j0714A43528a13870l12650b7774B06486B0351M9098J31450k7449
9431A73450m9286b41131A7448Q9799K18584e8439k13736I1802c82312A75410a42253
9419a63405A02663C772K16657J5360c15822H2442P3207h5680F8668K5509b03112
9407A02433B3727J5045J02713b26248H2502c60930a44141C51645b08342R8030
9397a10312r5229A43580b4361n59648G8411k7741P2342a12027J9529E2193b20697
9385a23065A10820J14253I8408K4174d71404K27993E3241a58594c3087r0587j54067
9374b77741R4533D7938Q1062J25455d8663a2658A18880b94534h9134l25753c1990
$$ y = [-694708, 3253, -270168, 62160, -38777, -200989, -793, 128632, -198662, 245532, -12473, -39008, -142647, -153361, 143528, -113870, -426520, -27774, 206486, 20351, 69449, 200899, 173450, 124164, -241131, 17448, 107247, 325831, -58439, -272175, 91802, -382312, 175410, -142253, -163405, 102663, 3772, 220429, 235789, -315822, 82442, 155649, -85680, 68668, 94177, -203112, 102433, 23727, 38772, 141485, -226248, 82502, -360930, -144141, 351645, -208342, -110312, -205541, 143580, -24361, -584009, 78411, 50670, 123012, -112027, -92498, 52193, -220697, -123065, 110820, 225073, 98408, 122582, -471404, -243411, 53241, -158594, -33087, -123674, -277741, -183208, 47938, 129000, 254455, -48663, -12658, 118880, -294534, -89134, -414887, -31990]
9362a09122D1151c3227j91366B10057l7536B8928c2008n3401A09017a60676k95931
9351d56607i3538G7631a27694B1779b37519j00732a53246D6761J62759i572E9269
9339c3154k14290j64306C14734A32648L754o0682d7143A41935c38367d7941j81381
9328b29322N9565J1890q1187M6506j09388J24788E5960a37195A42945c84852Q1889
9317c02963e6968m3389p0509f4940A26270c02302j56160i8461k02503a38324G4045
9305c62307b8235B0161i4933A49671b78769P2198H8409a64336G116a19605k82527
9294d02132J65824d5872c098r4839B19816B5880n607g2764j60560A44641b85587
9282B92750A14906c51536E0331i788B56548a52415B2772Q4600C7164A2995b24392
$$ y = [-109122, 41151, -33227, -224593, 210057, 172521, 28928, -32008, -85409, 109017, -160676, -456607, -93538, 77631, -127694, 21779, -237519, -338251, -153246, 46761, 209520, -9572, 59269, -33154, -247444, -411750, 314734, 132648, 136402, 75720, -47143, 141935, -338367, -47941, -229322, -169757, -157867, -239054, -192548, -301936, -177148, 55960, -137195, 142945, -384852, -302963, -56968, -100357, -170866, -64940, 126270, -302302, -458462, -98461, -300964, -138324, 74045, -362307, -28235, 20161, -94933, 149671, -278769, -206571, 88409, -164336, 7116, -119605, -402132, -236308, -45872, -3098, -97937, 219816, 25880, 20273, -72764, -233324, 144641, -285587, 292750, 114906, -351536, 50331, -9788, 256548, -152415, 22772, 107372, 37164, 12995, -224392]
9270d13724F3981k2922N0277A0662r19a5095o1822C0785b03248A98665J3159B2494
9257a88251A431M9769J17133p2809d16545H725a97982B13382h313G1059i6940
9245G4928b50070b4175l28748J30657c8294H9145e9532k01291J19914j09049m16245
9234f66203E6036o401j3386a21876k54787C41708f1989P574j30836j6701F731
9222e7172A43994c6267B35942f1621n2144a9433j31391g5084k88951P4763h0043
9210d6582a1852B3622R0699e3821k0707j01791k2697b1009A22362K27621a21603
9198a78621C9543j4186O4991b80557B0037c4277j96286C42190c10561D9885a474
9186A9000J37870a45262B00384a05206j04025M2532B34952a80261H702a6692A54491
$$ y = [-413724, 63981, 41059, 91336, 10662, 9743, -15095, -76917, 30785, -203248, 198665, 211824, 22494, -188251, 1431, 51200, 168333, 95524, -416545, 8725, -197982, 213382, -8313, 71059, -96940, 74928, -250070, -24175, -352923, -222266, -38294, 89145, -59532, -260823, -140909, -249958, -666203, 56036, 49635, 36249, -121876, -376663, 341708, -61989, -54415, -185251, -201952, 6731, -57172, 143994, -36267, 235942, -61621, -113765, -19433, -150824, -75084, -364035, -289272, -80043, -46582, -11852, 23622, 114321, -53821, -74528, -176319, -199016, -21009, 122362, 349983, -121603, -178621, 39543, 25357, 90348, -280557, 20037, -34277, -230563, 342190, -310561, 49885, -1474, 19000, 156870, -145262, 200384, -105206, -209231, -166699, 234952, -180261, 8702, -16692, 154491]
9174A7472J18253A9296P5442d16193A12728a47776A17398i5621j410b3530G082
9162A6909J44517b63049a30261A45146Q8181j06519o0268a79242A01157e2741
9151b31502E7533c81520a1766j20725p476e3415A94854b48661f6269j90906f1917
9139b43271G0749g754F633d57683A8546b44920O9711j88036A77501A1853J17254
9128A29107J04455A4573a51993f5086j7678B2721c302F5852K7943L971J92946
9117B90712b80233b1306j12412j9774j95386a13460P597A38248c46824B92931
9106a697B56760a9063j16487j86811F8465g2801B2834a13206j33541g4170J4017
9095f0153N017k37603e1540k54220c0374B61542a95303l7240I7898r497b21861
$$ y = [17472, 135725, 19296, 94738, -416193, 112728, -147776, 117398, -95621, -97031, -23530, 7082, 16909, 161426, -263049, -130261, 145146, 233327, 126808, 66540, -179242, 101157, -52741, -231502, 57533, -381520, -11766, -132491, -139967, -53415, 194854, -248661, -66269, -257175, -61917, -243271, 70749, -7754, 6633, -457683, 18546, -244920, -175209, -363245, 177501, 11853, 129107, 233562, 14573, -151993, -65086, -82764, 22721, -3302, 65852, 93795, 97766, 290712, -280233, -21306, -133718, -153492, -348878, -113460, -105863, 138248, -346824, 292931, -1697, 256760, -19063, -135550, -322361, 68465, -72801, 22834, -113206, -246747, -74170, -60153, -55136, -292739, -51540, -305760, -30374, 261542, -195303, -232543, 97898, 88401, -221861]
9083A08092a44189A11004D5884a34772k01303C9859J14273i5719m6990A09105
9072b84374C055d5070B03881K5257b51363g8784j1025j65806G6801P6870b9754
9060D01456d0711l2424l50909B52037d8249A58949e41109a76731e5893k16598
9050b72491A32779c6213F9764Q1275f49147C95842b3447j20826A71957C7602d5167
9038A5350K56121c80952g4830A55200g878A5240a63075M556D383a46218K6428
9027a19790o1802F303R1577B1863A0031g3436A07528n0888a67128P0334B85621
9015c92340G696b44690H649P2726a39187o0001o6001G3884a15342k49834g2274
9003a58170j16923F9111A5429Q1340m7559K4297k6379M2124e1118j0190l54171
$$ y = [108092, -144189, 111004, 45884, -134772, -336075, 39859, 154132, -95719, -142709, 109105, -284374, 3055, -45070, 203881, 229138, -251363, -78784, -89809, -255615, 76801, 153671, -29754, 401456, -40711, -73135, -424044, 252037, -48249, 158949, -541109, -176731, -55893, -272491, 132779, -36213, 69764, 151039, -649147, 395842, -23447, -144273, 171957, 37602, -45167, 15350, 271471, -380952, -74830, 155200, -7878, 15240, -163075, -158519, 4383, -146218, -119790, -181592, 6303, 97880, 21863, 10031, -73436, 107528, 56640, -167128, -96794, 285621, -392340, 7696, -244690, 8649, 81375, -139187, -199188, -265189, 73884, -115342, -365176, -72274, -158170, -275093, 69111, 15429, 96769, 49210, 73507, 47128, 89252, -51118, -61308, -415479]
8992d15479h0109A37021B6198J27117b22496j68313J49696f7489E615a02771N1255
8981e1516j15349A97024a67238j5329p5283M2360j36808g6107l47301a85049b1614
8969c25827H4516B9020a30797j33724j75171a04374j18091l7202g8323l0387C16938
8957a00919L8552A11282J65937A17300A0725a37125B20004J62744h9275b7202
8946c28253m345A09427a52017O6090Q702k48085i7114I912K07219d05699d1689
8934F92814a4215B29137J69400A7751a62510F0448K72551J52091O3449N14791
8924A063330R74794L465557P414363m946975C338042I97919l81777j81829A16159
8914A3367a20785L075C77075C4996M60435A14491K56755j04646a07310G4885k3942
$$ y = [-415479, -80109, 137021, 26198, 153315, -222496, -390809, -241113, -67489, 5615, -102771, -51516, -166865, 197024, -167238, -182567, -257850, -215490, -352298, -76107, -423408, -185049, -21614, -325827, 84516, 29020, -130797, -264521, -439692, -104374, -222465, -259667, -78323, -108710, 316938, -100919, -62367, 111282, 277219, 117300, 10725, -137125, 220004, 382748, -89275, -27202, -328253, -332598, 109427, -152017, -85927, -77225, -325310, -97114, 9912, 217131, -405699, -41689, 692814, -14215, 229137, 398537, 17751, -162510, 60448, 332999, 485090, 548539, 1063330, 2038124, 5503681, 12918044, 7971069, 3338042, 997919, 616142, 434313, 116159, 13367, -120785, -117710, 377075, 34996, 495431, 114491, 371246, 266600, -107310, 74885, 50943]
8903E0943A545K18972N2507a16554J7162j02356A31166d16857G8987c0722A53015
8891d8129A48806g7011D6340j3911Q0770a43982A465J9507J0318a1010A49986
8879a63299A62073p5103a27792j2646j62498d4627k36041c0719n0019C9635c11776
8867a24734K577b8754n207l35866J35399j30605a45582j26121f6638j53181E5016
8855a87568o9432c583j90376N862k46321I0889L1401J3864f5663j34914Q3726
$$ y = [50943, 1545, 220517, 273024, -116554, -99392, -201748, 131166, -416857, 78987, -30722, 153015, -48129, 148806, -77011, 46340, 32429, 113199, -143982, 1465, 20972, 31290, -11010, 149986, -163299, 162073, 86970, -127792, -140438, -302936, -44627, -280668, -30719, -80738, 39635, -311776, -124734, -122157, -28754, -33961, -369827, -234428, -365033, -145582, -271703, -66638, -219819, 55016, -187568, -257000, -3583, -193959, -188097, -434418, 90889, 122290, 136154, -65663, -200577, -116851]
$$ [...]
##END NTUPLES=NMR SPECTRUM
##END=
