
##TITLE=AC1304_DOMAH11116_6534465_bocw5Zzm92
##JCAMPDX= 6.0         $$ Bruker NMR JCAMP-DX V2.0
##DATA TYPE= NMR SPECTRUM
##DATA CLASS= NTUPLES
##ORIGIN= BRUKER
##OWNER= Administrator
$$ 1.72 TOPSPIN		Version 2.1
$$ 2012-07-17 01:16:44.218 -0500  Administrator@TOPSPIN
$$ Compression mode = diff/dup
##.OBSERVE FREQUENCY= 400.02188249412
##.OBSERVE NUCLEUS= ^1H
##.ACQUISITION MODE= SIMULTANEOUS (DQD)
##.ACQUISITION SCHEME= undefined
##.AVERAGES= 64
##.DIGITISER RES= 22
##SPECTROMETER/DATA SYSTEM= spect
##.PULSE SEQUENCE= noesygpps1d.comp
##.SOLVENT NAME= COFFEE_meoh
##.SHIFT REFERENCE= INTERNAL, COFFEE_meoh, 1, 14.96084
##AUDIT TRAIL= $$ (NUMBER, WHEN, WHO, WHERE, PROCESS, VERSION, WHAT)
$$ ##TITLE= Audit trail, TOPSPIN		Version 2.1
$$ ##JCAMPDX= 5.01
$$ ##ORIGIN= Bruker BioSpin GmbH
$$ ##OWNER= Administrator
$$ $$ C:\Bruker\TOPSPIN/data/COFFEE/nmr/AC1304_DOMAH11116_6534465_bocw5Zzm92/12/pdata/1/auditp.txt
$$ ##AUDIT TRAIL=  $$ (NUMBER, WHEN, WHO, WHERE, PROCESS, VERSION, WHAT)
(   1,<2012-07-17 01:16:39.484 -0500>,<Administrator>,<TOPSPIN>,<go>,<TOPSPIN 2.1>,
      <created by zg
	started at 2012-07-17 01:05:09.109 -0500,
	POWCHK enabled, PULCHK disabled,
       configuration hash MD5:
       6B 1B 68 BB D9 2E 58 E2 7F 35 AD 54 07 DF 0E 41
       data hash MD5: 64K
       0C 56 FE 78 D3 EB A3 44 9B 47 E1 0B 37 FD 31 88>)
(   2,<2012-07-17 01:16:42.390 -0500>,<Administrator>,<TOPSPIN>,<proc1d>,<TOPSPIN 2.1>,
      <Start of raw data processing
       efp LB = 0.3 FT_mod = 6 PKNL = 1 PHC0 = 0 PHC1 = 0 SI = 128K 
       data hash MD5: 128K
       8C E8 D0 DF 6D E3 85 14 20 F9 62 B3 46 DF DA EB>)
(   3,<2012-07-17 01:16:43.453 -0500>,<Administrator>,<TOPSPIN>,<proc1d>,<TOPSPIN 2.1>,
      <pk PHC0 = 1.071167 PHC1 = 0 
       data hash MD5: 128K
       93 AE 16 41 44 F8 CC B5 C4 8C 7B 90 0A 9E 3F 1A>)
(   4,<2012-07-17 01:16:43.687 -0500>,<Administrator>,<TOPSPIN>,<proc1d>,<TOPSPIN 2.1>,
      <abs ABSG = 1 
       data hash MD5: 128K
       BF EB A7 D2 59 F3 93 7C 52 42 D4 9A 2B AD 3A C2>)
(   5,<2012-07-17 01:16:43.828 -0500>,<Administrator>,<TOPSPIN>,<proc1d>,<TOPSPIN 2.1>,
      <abs ABSG = 2 
       data hash MD5: 128K
       AD C5 6F E3 B3 6C E5 E5 02 55 35 D5 80 EC 6C 97>)
(   6,<2012-07-17 01:16:44.015 -0500>,<Administrator>,<TOPSPIN>,<proc1d>,<TOPSPIN 2.1>,
      <abs ABSG = 3 
       data hash MD5: 128K
       BE 89 60 47 6A B8 84 9E 5F 02 46 BA 3C 88 A2 72>)
(   7,<2012-07-17 01:16:44.062 -0500>,<Administrator>,<TOPSPIN>,<proc1d>,<TOPSPIN 2.1>,
      <abs ABSG = 4 
       data hash MD5: 128K
       CD C6 F8 F1 BB 9A 7C 83 A1 F2 EB 21 F8 E9 11 DD>)
(   8,<2012-07-17 01:16:44.125 -0500>,<Administrator>,<TOPSPIN>,<proc1d>,<TOPSPIN 2.1>,
      <abs ABSG = 5 
       data hash MD5: 128K
       F3 D7 E5 9E 85 69 A6 79 AD 66 5E 29 70 47 5D 50>)
$$ ##END=
$$ 
$$ $$ hash MD5
$$ $$ 4D 43 AA 86 CC BF 39 FD DB B5 13 64 59 EB E4 3B
##$RELAX= 
##$RELAX= 
##$RELAX= 
##$RELAX= 
##$RELAX= 
##$RELAX= 
##$RELAX= 
##$RELAX= 
$$ Bruker specific parameters
$$ [...]
##$TP07= 0
##$TPNAME0= <>
##$TPNAME1= <>
##$TPNAME2= <>
##$TPNAME3= <>
##$TPNAME4= <>
##$TPNAME5= <>
##$TPNAME6= <>
##$TPNAME7= <>
##$TPOAL= (0..7)
0.5 0.5 0.5 0.5 0.5 0.5 0.5 0.5
##$TPOFFS= (0..7)
0 0 0 0 0 0 0 0
##$TUNHIN= 0
##$TUNHOUT= 0
##$TUNXOUT= 0
##$USERA1= <user>
##$USERA2= <user>
##$USERA3= <user>
##$USERA4= <user>
##$USERA5= <user>
##$V9= 5
##$VALIST= <valist>
##$VCLIST= <CCCCCCCCCCCCCCC>
##$VD= 0
##$VDLIST= <DDDDDDDDDDDDDDD>
##$VPLIST= <PPPPPPPPPPPPPPP>
##$VTLIST= <TTTTTTTTTTTTTTT>
##$WBST= 2048
##$WBSW= 25
##$XGAIN= (0..3)
0 0 0 0
##$XL= 0
##$YL= 0
##$YMAX_a= 11541003
##$YMIN_a= -8956281
##$ZGOPTNS= <>
##$ZL1= 120
##$ZL2= 120
##$ZL3= 120
##$ZL4= 120
##$ABSF1= 14.96084
##$ABSF2= -5.597342
##$ABSG= 5
##$ABSL= 3
##$ALPHA= 0
##$AQORDER= 0
##$ASSFAC= 0
##$ASSFACI= 0
##$ASSFACX= 0
##$ASSWID= 0
##$AUNMP= <proc_prof1d_extract.lims>
##$AXLEFT= 0
##$AXNAME= <>
##$AXNUC= <1H>
##$AXRIGHT= 0
##$AXTYPE= 0
##$AXUNIT= <>
##$AZFE= 0.1
##$AZFW= 0.1
##$BCFW= 0
##$BC_mod= 0
##$BYTORDP= 0
##$COROFFS= 0
##$CY= 15
##$DATMOD= 1
##$DC= 0
##$DFILT= <>
##$DTYPP= 0
##$F1P= 0
##$F2P= 0
##$FCOR= 0.5
##$FTSIZE= 131072
##$FT_mod= 6
##$GAMMA= 0
##$GB= 0
##$INTBC= 1
##$INTSCL= 1
##$ISEN= 128
##$LB= 0.3
##$LEV0= 0
##$LPBIN= 0
##$MAXI= 10000
##$MC2= 0
##$MEAN= 0
##$ME_mod= 0
##$MI= 0
##$NCOEF= 0
##$NC_proc= -2
##$NLEV= 6
##$NOISF1= 0
##$NOISF2= 0
##$NSP= 0
##$NTH_PI= 0
##$NZP= 0
##$OFFSET= 14.96084
##$PC= 1
##$PHC0= 1.071167
##$PHC1= 0
##$PH_mod= 1
##$PKNL= yes
##$PPARMOD= 0
##$PPDIAG= 0
##$PPIPTYP= 0
##$PPMPNUM= 2147483647
##$PPRESOL= 1
##$PSCAL= 4
##$PSIGN= 0
##$PYNMP= <proc.py>
##$REVERSE= no
##$SF= 400.020009700946
##$SI= 131072
##$SIGF1= 0
##$SIGF2= 0
##$SINO= 400
##$SIOLD= 131072
##$SPECTYP= <>
##$SREGLST= <1H.CDCl3>
##$SSB= 0
##$STSI= 131072
##$STSR= 0
##$SW_p= 8223.68421052631
##$SYMM= 0
##$S_DEV= 0
##$TDeff= 65536
##$TDoff= 0
##$TI= <>
##$TILT= no
##$TM1= 0
##$TM2= 0
##$TOPLEV= 0
##$USERP1= <user>
##$USERP2= <user>
##$USERP3= <user>
##$USERP4= <user>
##$USERP5= <user>
##$WDW= 1
##$XDIM= 131072
##$YMAX_p= 391892108
##$YMIN_p= -10767
##$CURPLOT= <Network HP LaserJet P1505>
##$CURPRIN= <$Network HP LaserJet P1505>
##$DFORMAT= <normdp>
##$LAYOUT= <+/1D_H.xwp>
##$LFORMAT= <normlp>
##$PFORMAT= <normpl>
##$SURQMSG= 1
$$ End of Bruker specific parameters
$$ ---------------------------------
##NTUPLES= NMR SPECTRUM
##VAR_NAME=  FREQUENCY,     SPECTRUM/REAL,   SPECTRUM/IMAG
##SYMBOL=    X,             R,               I
##VAR_TYPE=  INDEPENDENT,   DEPENDENT,       DEPENDENT
##VAR_FORM=  AFFN,          ASDF,            ASDF
##VAR_DIM=   131072,        131072,          131072
##UNITS=     HZ,            ARBITRARY UNITS, ARBITRARY UNITS
##FACTOR=    0.0627417313425164, 1,          1
##FIRST=     8223.62146879497, 689,          -57016
##LAST=      0,             2153,            -56748
##MIN=       0,             -10767,          0
##MAX=       8223.62146879497, 391892108,    0
$$ Real data points
##PAGE= N=1
##DATA TABLE= (X++(R..R)), XYDATA
$$ [...]
$$ plain form
63978 339985 346498 352807 359626 367490 376327 385709 395428 405670 416614 428077 439714 451463 463618
63965 463618 476549 490607 506279 524048 543958 565544 588463 613089 640281 670691 704623
63954 704623 742619 785865 835893 894009 961296 1039085 1129164 1233348 1352932 1488537 1640326
63943 1640326 1808143 1991483 2189505 2401086 2624643 2857760 3097035 3338299 3576801
63934 3576801 3807165 4023569 4220522 4393681 4539914 4656738 4741979 4793925 4811466 4793980
63924 4793980 4741333 4654280 4534855 4386407 4213366 4020900 3814366 3598673 3378043 3156276
63914 3156276 2936995 2723508 2518624 2324780 2144135 1978191 1827376 1691255 1569170
63905 1569170 1460482 1364229 1278979 1203305 1136314 1077510 1026229 981440 942109 907484 876867
$$ packed form
63978C39985O513O309O819P864Q837R382R719J0242J0944J1463J1637J1749J2155
63965D63618J2931J4058J5672J7769J9910K1586K2919K4626K7192L0410L3932
63954G04623L7996M3246N0028N8116O7287P7789R0079J04184J19584J35605J51789
63943A640326J67817J83340J98022K11581K23557K33117K39275K41264K38502
63934C576801K30364K16404J96953J73159J46233J16824Q5241N1946J7541j7486
63924D793980n2647q7053j19425j48448j73041j92466k06534k15693k20630k21767
63914C156276k19281k13487k04884j93844j80645j65944j50815j36121j22085
63905A569170j08688r6253q5250p5674o6991n8804n1281m4789l9331l4625l0617
$$ plain form
63894 876867 849287 823691 799534 776966 756273 737249 719237 701739 684724 668352 652601
63883 652601 637350 622727 609213 597387 587648 580221 575302 573093 573624 576588 581508 588131 596599
63870 596599 607105 619393 632753 646566 660708 675341 690373 705296 719548 732915 745493
63859 745493 757357 768364 778201 786430 792434 795595 795781 793602 789883 784876 778225 769712 759686 748542
63845 748542 736109 721924 705970 688720 670546 651472 631581 611278 590890 570248 548938
63834 548938 526979 505022 483857 463837 444905 427075 410551 395205 380250 365006 349995
63823 349995 336701 325958 317079 308943 301428 295104 289882 284841 279387 273797 268479 263396 258503 254142
63809 254142 250598 247645 244889 242238 239814 237804 236576 236457 237032 237078 235626 232826 229489 226228 223415
$$ packed form
63894H76867k7580k5596k4157k2568k0693j9024j8012j7498j7015j6372j5751
63883F52601j5251j4623j3514j1826r739p427m919k209N31K964M920O623Q468
63870E96599J0506J2288J3360J3813J4142J4633J5032J4923J4252J3367J2578
63859G45493J1864J1007R837Q229O004L161J86k179l719n007o651q513j0026j1144
63845G48542j2433j4185j5954j7250j8174j9074j9891k0303k0388k0642k1310
63834E48938k1959k1957k1165k0020j8932j7830j6524j5346j4955j5244j5011
63823C49995j3294j0743q879q136p515o324n222n041n454n590n318n083m893m361
63809B54142l544k953k756k651k424k010j228j19N75M6j452k800l337l261k813
$$ plain form
63794 223415 221471 220504 219883 218756 216921 214759 212532 210298 208353 207069 206265 205340 204109 202976 202168
63779 202168 201343 200182 198887 197837 197108 196626 196473 196672 196934 196941 196784 196829 197265 198001 198928 199930 200595 200279
63761 200279 198739 196679 195376 195564 196733 197635 197524 196758 196265 196603 197585 198626 199331 199887 200864 202445 203859
63744 203859 203989 202701 201174 200637 201108 201768 202306 203361 205718 209393 213539 217020 219213 220537 222003
63729 222003 223986 225763 226628 227093 228373 230903 234042 237155 240230 243402 246622 250009 253839 257911 261493
63714 261493 264174 266199 267713 268335 267916 267081 266394 265487 263706 261296 259209 257822 256553 254799 252737
63699 252737 251025 250089 249872 250063 250431 251021 252017 253422 255052 256946 259467 262729 266187 269163 271585 273829
63683 273829 276009 277885 279402 280807 282169 283226 283838 284180 284312 283961 282988 281788 280966 280783 281164 282031
$$ packed form
63794B23415j944r67o21j127j835k162k227k234j945j284q04r25j231j133q08
63779B02168q25j161j295j050p29m82j53J99K62Pj57M5M36P36R27J002O65l16
63761B00279j540k060j303J88J169R02j11p66m93L38R82J041P05N56R77J581J414
63744B03859J30j288j527n37M71O60N38J055K357L675M146L481K193J324J466
63729B22003J983J777Q65M65J280K530L139L113L075L172L220L387L830M072L582
63714B61493K681K025J514O22m19q35o87r07j781k410k087j387j269j754k062
63699B52737j712r36k17J91L68N90R96J405J630J894K521L262L458K976K422K244
63683B73829K180J876J517J405J362J057O12L42J32l51r73j200q22j83L81Q67
$$ plain form
63667 282031 283310 284738 286010 287087 288102 288974 289448 289523 289488 289287 288250 285890 282780 280137 278468 277094
63651 277094 275125 272431 269348 265974 262355 259043 256766 255497 254459 253122 251746 250866 250810 251843 254139
63636 254139 257237 260055 261917 263224 264767 266734 268799 270816 272957 275528 279178 284912 293149 302895
63622 302895 312499 321224 329533 338075 347185 357391 369432 383403 398564 414423 431443 450278
63610 450278 470980 493502 518439 546444 577133 609293 641984 674710 706498 735598 760432
63599 760432 780394 795444 805411 810150 810179 806737 801208 794637 787653 780540 773275 765571 756851 746211
63585 746211 732612 715419 694819 671693 647091 621885 596792 572476 549524 528349 509130
63574 509130 491827 476331 462693 451210 442187 435638 431286 428792 427896 428407 430242 433488 438228 444293
$$ packed form
63667B82031J279J428J272J077J015Q72M74P5l5k01j037k360l110k643j669j374
63651B77094j969k694l083l374l619l312k277j269j038j337j376q80n6J033K296
63636B54139L098K818J862J307J543J967K065K017K141K571L650N734Q237R746
63622C02895R604Q725Q309Q542R110J0206J2041J3971J5161J5859J7020J8835
63610D50278K0702K2522K4937K8005L0689L2160L2691L2726L1788K9100K4834
63599G60432J9962J5050R967M739K9l442n529o571o984p113p265p704q720j0640
63585G46211j3599j7193k0600k3126k4602k5206k5093k4316k2952k1175j9219
63574E09130j7303j5496j3638j1483r023o549m352k494q96N11J835L246M740O065
$$ plain form
63560 444293 451260 458694 466276 473793 481286 489298 498685 510039 523399 538567 555468 574227 595322
63547 595322 619814 648847 682392 718716 755530 791412 825574 856522 881934 900130 911114
63536 911114 915953 915778 911730 905280 897826 890110 882425 875137 868412 861488 852843 841301 826655 809097
63522 809097 788413 764074 736010 705044 672573 639970 608262 578086 549695 522974 497722
63511 497722 474134 452916 434681 419243 405696 393186 381383 370279 359891 350320 341800 334463
63499 334463 328214 322962 318707 315231 311990 308601 305292 302604 300791 299733 299233 299086 298968 298610 298091
63484 298091 297741 297781 298196 298911 299901 301215 303068 305784 309421 313519 317454 320939 324042 326817 329140 330749
63468 330749 331252 330225 327653 324135 320362 316483 312290 307886 303769 300337 297674 295799 294705 294137 293729
$$ packed form
63560D44293O967P434P582P517P493Q012R387J1354J3360J5168J6901J8759K1095
63547E95322K4492K9033L3545L6324L6814L5882L4162L0948K5412J8196J0984
63536I11114M839j75m048o450p454p716p685p288o725o924q645j1542j4646j7558
63522H09097k0684k4339k8064l0966l2471l2603l1708l0176k8391k6721k5252
63511D97722k3588k1218j8235j5438j3547j2510j1803j1104j0388r571q520p337
63499C34463o249n252m255l476l241l389l309k688j813j058n00j47j18l58n19
63484B98091l50M0M15P15R90J314J853K716L637M098L935L485L103K775K323J609
63468C30749N03j027k572l518l773l879m193m404m117l432k663j875j094n68m08
$$ plain form
63453 293729 293456 293629 294378 295448 296590 297842 299456 301868 305712 311359 318327 325571 332605 339964 348453
63438 348453 358372 369744 382831 397944 414962 433458 453184 474072 495743 517269 537423 555141
63426 555141 569927 582099 592665 602877 613863 626500 641349 658627 678577 701932 729713
63415 729713 762353 799180 838798 879561 919550 956620 988961 1015452 1035246 1047481 1052041 1050405
63403 1050405 1045137 1038309 1030673 1022197 1012893 1002925 992130 979600 963732 942983 917011 887083
63391 887083 855070 822058 788118 753274 718219 684048 651762 622167 595838 572833 552618
63380 552618 534501 518140 503618 491224 481218 473643 468358 465384 465072 467568 472188 477835 484145
63367 484145 491700 500915 511301 522265 534179 548071 564516 583419 604687 628501 654923 683890
$$ packed form
63453B93729k73J73P49J070J142J252J614K412L844N647O968P244P034P359Q489
63438C48453R919J1372J3087J5113J7018J8496J9726K0888K1671K1526K0154J7718
63426E55141J4786J2172J0566J0212J0986J2637J4849J7278J9950K3355K7781
63415G29713L2640L6827L9618M0763L9989L7070L2341K6491J9794J2235M560j636
63403A050405n268o828p636q476r304r968j0795j2530j5868k0749k5972k9928
63391H87083l2013l3012l3940l4844l5055l4171l2286k9595k6329k3005k0215
63380E52618j8117j6361j4522j2394j0006p575n285k974l12K496M620N647O310
63367D84145P555R215J0386J0964J1914J3892J6445J8903K1268K3814K6422K8967
$$ plain form
63355 683890 715589 750283 787527 826054 864531 901890 936658 966657 989993 1006157 1015723 1019346
63343 1019346 1017625 1011731 1003444 994296 984943 975328 965021 953344 939491 922728 902393 877969
63331 877969 849626 818613 786585 754426 722194 690251 659769 631830 606670 584288 565203
63320 565203 549913 537891 527812 518642 509835 500567 489662 476663 462469 448482 435285 422448
63308 422448 409459 396496 384294 373471 364159 356232 349666 344405 339938 335492 330825 326491 323014
63295 323014 320102 317122 314055 311379 309093 306484 302992 298776 294333 290056 286368 283784 282446 281847
63281 281847 281279 280357 279061 277563 276188 275208 274511 273747 272964 272681 273091 273598 273486 272829 272392 272845 274333
63264 274333 276607 279260 282003 284949 288439 292345 295809 298026 299134 300042 301523 303838 307086 311444
$$ packed form
63355F83890L1699L4694L7244L8527L8477L7359L4768K9999K3336J6164R566L623
63343A019346j721n894q287r148r353r615j0307j1677j3853j6763k0335k4424
63331H77969k8343l1013l2028l2159l2232l1943l0482k7939k5160k2382j9085
63320E65203j5290j2022j0079r170q807r268j0905j2999j4194j3987j3197j2837
63308D22448j2989j2963j2202j0823r312p927o566n261m467m446m667m334l477
63295C23014k912k980l067k676k286k609l492m216m443m277l688k584j338n99
63281B81847n68r22j296j498j375r80o97p64p83k83M10N07j12o57m37M53J488
63264B74333K274K653K743K946L490L906L464K217J108R08J481K315L248M358
$$ plain form
63250 311444 316954 323354 330269 337464 344859 352394 359958 367483 375228 383847 393982 405785 419006
63237 419006 433431 448902 465098 481900 499940 520084 542180 565091 588246 612290 637634
63226 637634 663216 687607 710775 733760 757058 780374 803718 827588 852032 876527 900959
63215 900959 925799 951049 975748 998679 1018837 1035087 1046304 1052194 1053131 1048855 1038251 1021045
63203 1021045 998918 974185 947891 919889 890291 860039 830338 802258 776737 754364 735175
63192 735175 719019 705945 695941 688670 684054 682756 685449 691753 700581 711421 724576 740142 757444
63179 757444 775734 794935 815387 837165 859879 882907 905684 927934 949695 970941 991235
63168 991235 1010017 1027175 1042901 1056865 1067809 1074184 1075018 1070147 1059863 1044550 1024540 1000145
$$ packed form
63250C11444N510O400O915P195P395P535P564P525P745Q619J0135J1803J3221
63237D19006J4425J5471J6196J6802J8040K0144K2096K2911K3155K4044K5344
63226F37634K5582K4391K3168K2985K3298K3316K3344K3870K4444K4495K4432
63215I00959K4840K5250K4699K2931K0158J6250J1217N890R37m276j0604j7206
63203A021045k2127k4733k6294k8002k9598l0252k9701k8080k5521k2373j9189
63192G35175j6156j3074j0004p271m616j298K693O304Q828J0840J3155J5566J7302
63179G57444J8290J9201K0452K1778K2714K3028K2777K2250K1761K1246K0294
63168I91235J8782J7158J5726J3964J0944O375Q34m871j0284j5313k0010k4395
$$ plain form
63156 1000145 971832 940376 906793 872066 836929 801842 767160 733464 701746 672989 647347
63145 647347 623969 601953 581281 562573 546137 531724 519103 508329 499344 491735 484991 478761
63133 478761 472851 467334 462683 459397 457322 455734 454207 453112 453115 454554 457408 461413 465919 470072 473599
63118 473599 477163 481602 486971 492674 498207 503310 507575 510550 512352 513674 515062 516507 517908 519509
63104 519509 521609 524098 526592 528847 530741 531983 532273 531812 531288 531114 530930 530124 528679 527163 525929 524773
63088 524773 523548 522730 522949 524109 525394 526141 526400 526602 527113 528325 530829 535058 540728 546895 552672 557868
63072 557868 563033 568952 576078 584291 593244 602919 613771 626233 640152 654829 669682 684903 701500
63059 701500 720658 742933 767996 795241 824636 856872 892732 932438 975637 1021781 1070431
$$ packed form
63156A000145k8313l1456l3583l4727l5137l5087l4682l3696l1718k8757k5642
63145F47347k3378k2016k0672j8708j6436j4413j2621j0774q985p609o744o230
63133D78761n910n517m651l286k075j588j527j095LJ439K854M005M506M153L527
63118D73599L564M439N369N703N533N103M265K975J802J322J388J445J401J601
63104E19509K100K489K494K255J894J242K90m61n24j74j84q06j445j516j234j156
63088E24773j225q18K19J160J285P47K59K02N11J212K504M229N670O167N777N196
63072E57868N165N919P126Q213Q953R675J0852J2462J3919J4677J4853J5221J6597
63059G01500J9158K2275K5063K7245K9395L2236L5860L9706M3199M6144M8650
$$ plain form
63048 1070431 1121359 1174519 1229835 1286961 1345265 1404066 1462755 1520839 1578166 1635189 1692638
63037 1692638 1750777 1809240 1867672 1926114 1984493 2042066 2097716 2150416 2198979 2241638 2276447
63026 2276447 2301974 2317095 2320317 2310028 2285738 2248686 2201136 2145374 2083344 2016669 1946663
63015 1946663 1874692 1802735 1733274 1668414 1609322 1556634 1510948 1472660 1441698 1417809 1400955
63004 1400955 1391174 1388337 1392244 1402593 1418537 1438693 1462113 1488954 1519575 1553211 1588255 1623839
62992 1623839 1660353 1698180 1736664 1774875 1812848 1851305 1890174 1927922 1962392 1991914 2015482
62981 2015482 2032259 2041316 2041790 2032980 2014290 1985338 1946392 1898627 1843747 1783370 1718852 1651567
62969 1651567 1582993 1514425 1446894 1381536 1319709 1262370 1209441 1160125 1113853 1070704 1031026
$$ packed form
63048A070431N0928N3160N5316N7126N8304N8801N8689N8084N7327N7023N7449
63037A692638N8139N8463N8432N8442N8379N7573N5650N2700M8563M2659L4809
63026B276447K5527J5121L222j0289k4290l7052m7550n5762o2030o6675p0006
63015A946663p1971p1957o9461o4860n9092n2688m5686l8288l0962k3889j6854
63004A400955r781k837L907J0349J5944K0156K3420K6841L0621L3636L5044L5584
62992A623839L6514L7827L8484L8211L7973L8457L8869L7748L4470K9522K3568
62981B015482J6777R057M74q810j8690k8952l8946m7765n4880o0377o4518o7285
62969A651567o8574o8568o7531o5358o1827n7339n2929m9316m6272m3149l9678
$$ plain form
62958 1031026 994981 962412 932747 904920 877804 851051 825347 801640 780175 760386 741493
62947 741493 723047 705066 687909 671959 657171 642979 628766 614500 600712 587867 575935
62936 575935 564691 554256 545078 537255 530109 522779 515304 508848 504530 502139 500293 497856 494926 492405
62922 492405 490967 490602 490841 491081 490863 490178 489441 488931 488345 487142 485271 483174 481065 478595 475393 471582
62906 471582 467487 463169 458658 454445 451165 448729 446301 443377 440456 438281 436784 435265 433411 431558
62892 431558 430000 428677 427647 427204 427196 426784 425410 423649 422582 422574 423153 423836 424458 424859 424966 425226 426255 427926
62874 427926 429413 430329 431116 431987 432262 431347 429853 428965 429005 429302 429331 429220 429116 428791 428123 427493 427426 428145 429604
62855 429604 431561 433453 434651 435195 435984 437807 440369 442609 443865 444339 444412 444016 442908 441314 439929 439247
$$ packed form
62958A031026l6045l2569k9665k7827k7116k6753k5704k3707k1465j9789j8893
62947G41493j8446j7981j7157j5950j4788j4192j4213j4266j3788j2845j1932
62936E75935j1244j0435r178p823p146p330p475o456m318k391j846k437k930k521
62922D92405j438l65K39K40k18o85p37n10n86j203j871k097k109k470l202l811
62906D71582m095m318m511m213l280k436k428k924k921k175j497j519j854j853
62892D31558j558j323j030m43qm12j374j761j067qN79O83O22M01J07K60J029J671
62874D27926J487R16P87Q71K75r15j494q88M0K97K9j11j04l25o68o30o7P19J459
62855D29604J957J892J198N44P89J823K562K240J256M74P3l96j108j594j385o82
$$ plain form
62839 439247 439087 438837 438019 436544 434556 432280 430038 428209 426981 426157 425349 424419 423676 423619 424502 426106 427863
62822 427863 429230 430087 430829 432064 434073 436553 438946 441132 443693 447328 452008 456948 461505 465844 470491
62807 470491 475497 480482 485387 490629 496378 502213 507848 513880 521388 530877 541900 553629 565546
62794 565546 577658 590368 604151 619213 635516 653269 673292 696683 724216 756242 793005
62783 793005 834683 881186 932338 988387 1050082 1118042 1192243 1272170 1357277 1447047 1540617
62772 1540617 1636433 1732246 1825471 1913564 1994148 2064838 2123174 2166955 2194714 2205915 2200822
62761 2200822 2180246 2145270 2097043 2036925 1966918 1889727 1808083 1723949 1638516 1552759 1467827
62750 1467827 1385017 1305672 1230973 1161438 1096641 1035814 978787 926075 878000 834179 794042
$$ packed form
62839D39247j60k50q18j475j988k276k242j829j228q24q08r30p43n7Q83J604J757
62822D27863J367Q57P42J235K009K480K393K186K561L635M680M940M557M339M647
62807D70491N006M985M905N242N749N835N635O032P508R489J1023J1729J1917
62794E65546J2112J2710J3783J5062J6303J7753K0023K3391K7533L2026L6763
62783G93005M1678M6503N1152N6049O1695O7960P4201P9927Q5107Q9770R3570
62772A540617R5816R5813R3225Q8093Q0584P0690N8336M3781K7759J1201n093
62761B200822k0576l4976m8227o0118p0007p7191q1644q4134q5433q5757q4932
62750A467827q2810p9345p4699o9535o4797o0827n7027n2712m8075m3821m0137
$$ plain form
62739 794042 757505 724799 695817 669941 646549 625480 606939 590976 577161 564853 553849
62728 553849 544580 537527 532536 528866 525822 523172 521087 519965 520198 521828 524447 527674 531640 536734
62714 536734 543050 550566 559767 571478 585978 602797 621623 642878 667144 694485 724801 758506
62702 758506 796445 839242 887051 939768 997213 1059251 1125942 1197419 1273416 1353086 1435422
62691 1435422 1519506 1603998 1686605 1764454 1834888 1895733 1945067 1981234 2003089 2010015 2001843 1979055
62679 1979055 1942850 1894634 1835557 1766963 1691145 1611107 1529387 1447459 1366314 1287179 1211357
62668 1211357 1139636 1072180 1008990 950262 896265 846972 801964 760847 723694 690763 661687
62657 661687 635325 610788 588382 568984 552573 537884 523590 509373 495663 482849 471099
$$ packed form
62739G94042l6537l2706k8982k5876k3392k1069j8541j5963j3815j2308j1004
62728E53849r269p053m991l670l044k650k085j122K33J630K619L227L966N094
62714E36734O316P516R201J1711J4500J6819J8826K1255K4266K7341L0316L3705
62702G58506L7939M2797M7809N2717N7445O2038O6691P1477P5997P9670Q2336
62691A435422Q4084Q4492Q2607P7849P0434O0845M9334L6167K1855O926q172k2788
62679A979055l6205m8216n9077o8594p5818q0038q1720q1928q1145p9135p5822
62668A211357p1721o7456o3190n8728n3997m9293m5008m1117l7153l2931k9076
62657F61687k6362k4537k2406j9398j6411j4689j4294j4217j3710j2814j1750
$$ plain form
62646 471099 460646 451725 444231 437710 431766 426359 421725 418100 415462 413398 411332 408969 406510 404352
62632 404352 402715 401648 401199 401273 401397 400983 399931 398728 397799 396990 395889 394460 393058 391986 391441 391832
62616 391832 393691 397038 401219 405643 410373 415691 421450 427360 433673 440966 449239 457830 466384 475409
62602 475409 485723 497840 512150 529163 549149 571871 597133 625329 657024 692190 730296
62591 730296 770969 814116 859427 906126 953138 999057 1041946 1079653 1110542 1133831 1149277
62580 1149277 1156808 1156463 1148329 1132492 1109315 1079879 1045890 1009000 970325 930587 890446 850525
62568 850525 811298 773184 736679 702323 670485 641195 614243 589515 567254 547798 531012
62557 531012 516211 502790 490659 479856 470020 460685 451908 444095 437297 431213 425924 422067 420032
$$ packed form
62646D71099j0453q921p494o521n944n407m634l625k638k064k066k363k459k158
62632D04352j637j067m49P4J24m14j052j203r29q09j101j429j402j072n45L91
62616C91832J859L347M181M424M730N318N759N910O313P293Q273Q591Q554R025
62602D75409J0314J2117J4310J7013J9986K2722K5262K8196L1695L5166L8106
62591G30296M0673M3147M5311M6699M7012M5919M2889L7707L0889K3289J5446
62580A149277P531l45q134j5837k3177k9436l3989l6890l8675l9738m0141l9921
62568H50525l9227l8114l6505l4356l1838k9290k6952k4728k2261j9456j6786
62557E31012j4801j3421j2131j0803r836r335q777p813o798o084n289l857k035
$$ plain form
62544 420032 419404 419433 419689 419996 420117 419973 419957 420538 421544 422273 422371 422282 422604 423331 424091 425044 427083 430911 436209
62525 436209 442087 448289 455541 464708 476035 489446 505169 523678 545193 569627 596975 627449
62513 627449 661324 698855 740219 785183 832873 882111 931794 980709 1027237 1069824 1107701
62502 1107701 1140589 1167700 1187602 1199282 1202865 1199075 1188423 1171307 1148591 1121724 1092369 1062110
62490 1062110 1032347 1004222 978674 956522 938353 924384 914764 909994 910636 916505 926621 940215
62478 940215 957406 978474 1002733 1028441 1053639 1076785 1096828 1113156 1125450 1133288 1135830 1132070
62466 1132070 1121490 1104387 1081616 1054100 1022487 987254 949198 909716 870298 831704 793936
62455 793936 757142 722162 689999 661132 635613 613416 594313 577741 563344 551444 542429 535814
$$ packed form
62544D20032o28K9K56L07J21j44j6N81J006P29R8q9L22P27P60R53K039L828N298
62525D36209N878O202P252R167J1327J3411J5723J8509K1515K4434K7348L0474
62513F27449L3875L7531M1364M4964M7690M9238M9683M8915M6528M2587L7877
62502A107701L2888K7111J9902J1680L583l790j0652j7116k2716k6867k9355l0259
62490A062110k9763k8125k5548k2152j8169j3969r620m770O42N869J0116J3594
62478I40215J7191K1068K4259K5708K5198K3146K0043J6328J2294P838K542l760
62466A132070j0580j7103k2771k7516l1613l5233l8056l9482l9418l8594l7768
62455G93936l6794l4980l2163k8867k5519k2197j9103j6572j4397j1900r015o615
$$ plain form
62443 535814 530521 526146 523306 522574 523633 525836 529099 533692 539360 545225 550597 555370 559498 562472
62429 562472 563640 562831 560260 555996 549911 542181 533361 523803 513351 501920 490078 478699 468204
62416 468204 458491 449406 440885 432766 424916 417563 411132 405727 401109 397104 393660 390585 387693 385151
62402 385151 383218 381710 380295 379246 379168 379886 380444 380462 380672 381721 383253 384741 386390 388479 390430 391403
62386 391403 391435 391225 391262 391914 393923 397778 402813 407906 412972 418835 425675 432595 438888 444909 451478 459191
62370 459191 468372 478902 489861 500234 510286 521507 534955 550519 568190 589049 614194 643403
62358 643403 675728 710992 749922 793119 840649 892389 947923 1006029 1064743 1121960 1175697
62347 1175697 1224042 1265469 1299209 1324938 1342276 1351016 1351695 1345359 1332701 1313854 1288974 1258614
$$ packed form
62443E35814n293m375k840p32J059K203L263M593N668N865N372M773M128K974
62429E62472J168q09k571m264o085p730q820r558j0452j1431j1842j1379j0495
62416D68204r713r085q521q119p850p353o431n405m618m005l444l075k892k542
62402C85151j933j508j415j049p8P18N58J8K10J049J532J488J649K089J951R73
62386C91403L2k10L7O52K009L855N035N093N066N863O840O920O293O021O569P713
62370D59191R181J0530J0959J0373J0052J1221J3448J5564J7671K0859K5145K9209
62358F43403L2325L5264L8930M3197M7530N1740N5534N8106N8714N7217N3737
62347A175697M8345M1427L3740K5729J7338Q740O79o336j2658j8847k4880l0360
$$ plain form
62335 1258614 1223588 1185011 1144515 1103898 1064329 1026210 989877 955992 925118 897324 872412
62324 872412 850188 830308 812152 795116 778751 762474 745438 727090 707669 687926 668438
62313 668438 649343 630475 611478 592085 572712 554616 538975 525766 513897 502414 491237
62302 491237 480768 471375 463386 457046 452082 447694 443337 439277 435999 433415 431148 429373 428704 429269
62288 429269 430508 432006 433983 436715 439977 443398 446961 450812 454876 459068 463609 468731 474217 479617
62274 479617 484777 489862 495030 500494 506774 514464 523778 534620 546992 560998 576547 593487 612011
62261 612011 632587 655642 681776 712146 747954 789429 835875 886874 942793 1003790 1068829
62250 1068829 1135984 1203266 1268746 1330374 1386215 1434715 1474510 1504407 1524033 1534119 1535555
$$ packed form
62335A258614l5026l8577m0496m0617l9569l8119l6333l3885l0874k7794k4912
62324H72412k2224j9880j8156j7036j6365j6277j7036j8348j9421j9743j9488
62313F68438j9095j8868j8997j9393j9373j8096j5641j3209j1869j1483j1177
62302D91237j0469r393p989o340m964m388m357m060l278k584k267j775o69N65
62288D29269J239J498J977K732L262L421L563L851M064M192M541N122N486N400
62274D79617N160N085N168N464O280P690R314J0842J2372J4006J5549J6940J8524
62261F12011K0576K3055K6134L0370L5808M1475M6446N0999N5919O0997O5039
62250A068829O7155O7282O5480O1628N5841M8500L9795K9897J9626J0086J436
$$ plain form
62239 1535555 1528344 1511983 1486615 1453150 1412368 1364676 1310937 1253002 1193092 1132938 1073631
62228 1073631 1015988 960852 909159 861770 819018 780464 745391 713639 685699 661974 642175
62217 642175 625406 610497 596331 582334 568895 556958 547068 539088 532826 528277 524941 521550 517146
62204 517146 512174 507924 505045 503199 502076 501953 503039 504864 506794 508840 511526 515078 519131 523307
62190 523307 527853 533566 541078 550213 560033 569629 578890 588391 598547 609072 619384 629319 639193
62177 639193 649179 658927 667851 675676 682636 689237 696012 703536 712607 724264 739428 758537 781625
62164 781625 808773 840292 876350 916460 959401 1003456 1046653 1087058 1123225 1154391 1180005
62153 1180005 1199220 1211290 1216467 1215998 1210903 1201074 1185890 1165446 1140682 1112499 1081349 1047879
$$ packed form
62239A535555p211j6361k5368l3465m0782m7692n3739n7935n9910o0154n9307
62228A073631n7643n5136n1693m7389m2752l8554l5073l1752k7940k3725j9799
62217F42175j6769j4909j4166j3997j3439j1937r890p980o262m549l336l391m404
62204E17146m972m250k879j846j123j23J086J825J930K046K686L552M053M176
62190E23307M546N713P512R135R820R596R261R501J0156J0525J0312R935R874
62177F39193R986R748Q924P825O960O601O775P524R071J1657J5164J9109K3088
62164G81625K7148L1519L6058M0110M2941M4055M3197M0405L6167L1166K5614
62153A180005J9215J2070N177m69n095r829j5184k0444k4764k8183l1150l3470
$$ plain form
62141 1047879 1013482 979807 947875 917937 890109 864819 842615 823816 808464 796446 787465
62130 787465 780985 776352 772967 770285 767782 765179 762758 761172 760854 761811 764027 767633 772280 776658 779263
62115 779263 779681 778620 776683 773678 769391 764377 759465 754782 749750 743820 736765 728466 718982 708751
62101 708751 698294 687731 677034 666637 657262 649130 641938 635699 630972 628043 626503 625991 626757 628900
62087 628900 631596 633868 635969 639176 644171 650324 656830 663896 672291 682175 693038 704693 717710
62074 717710 732672 749453 767506 786526 806431 826873 847313 867682 888605 910815 934637
62063 934637 960211 987788 1017425 1048557 1080281 1111908 1142831 1171893 1197435 1218129 1233581
62052 1233581 1244033 1249831 1251212 1248147 1240156 1226541 1207129 1182655 1154228 1122585 1088029 1050941
$$ packed form
62141A047879l4397l3675l1932k9938k7828k5290k2204j8799j5352j2018q981
62130G87465o480m633l385k682k503k603k421j586l18R57K216L606M647M378K605
62115G79263M18j061j937l005m287n014m912m683n032n930p055q299r484j0231
62101G08751j0457j0563j0697j0397r375q132p192o239m727k929j540n12P66K143
62087F28900K696K272K101L207M995O153O506P066Q395R884J0863J1655J3017
62074G17710J4962J6781J8053J9020J9905K0442K0440K0369K0923K2210K3822
62063I34637K5574K7577K9637L1132L1724L1627L0923K9062K5542K0694J5452
62052A233581J0452N798J381l065p991j3615j9412k4474k8427l1643l4556l7088
$$ plain form
62040 1050941 1012062 972289 932320 892544 853289 815156 778961 745199 713740 684297 657022
62029 657022 632272 609982 589802 571732 555895 541627 527705 513886 501417 491378 483144 475170
62017 475170 466779 458321 450026 441699 433448 425764 418801 412422 406983 403190 400923 399036 396701 394340
62003 394340 392873 392729 393961 396615 400375 404397 408231 412501 417984 424285 430178 435066 439355 443371
61989 443371 446700 448835 449883 450200 449663 447659 443685 437820 430748 423410 416395 409579 402548 395463 389274
61974 389274 384829 381908 379306 375864 371378 366635 362675 359928 357937 355944 353703 351614 350052 348887
61960 348887 347827 346983 346714 346956 347068 346506 345476 344711 344699 345268 345907 346367 346884 347918 349769 352454 355861
61943 355861 359978 364971 371087 378485 387062 396435 406151 415975 425971 436289 446895 457529 467854
$$ packed form
62040A050941l8879l9773l9969l9776l9255l8133l6195l3762l1459k9443k7275
62029F57022k4750k2290k0180j8070j5837j4268j3922j3819j2469j0039q234p974
62017D75170q391q458q295q327q251p684o963o379n439l793k267j887k335k361
62003C94340j467j44J232K654L760M022L834M270N483O301N893M888M289M016
61989D43371L329K135J048L17n37k004l974n865p072p338p015o816p031p085o189
61974C89274m445k921k602l442m486m743l960k747j991j993k241k089j562j165
61960C48887j060q44k69K42J12n62j030p65j2N69O39M60N17J034J851K685L407
61943C55861M117M993O116P398Q577R373R716R824R996J0318J0606J0634J0325
$$ plain form
61930 467854 477607 486710 495321 503758 512211 520510 528157 534569 539235 541841 542472 541684 540129 538017 535123
61915 535123 531362 527155 523127 519651 516911 515282 515395 517829 522890 530532 540260 551115 562070 572621
61901 572621 582863 592873 602072 609339 613853 615815 616222 615776 614075 610186 604060 596970 590221 583810
61887 583810 576875 569233 561670 554683 547668 539886 531685 524155 517760 511860 505527 498347 490358 481726
61873 481726 472739 463915 455832 448908 443373 439303 436483 434318 432156 429849 427927 427101 427632 429279 431788
61858 431788 435157 439353 444120 449407 455802 464123 474587 486752 500266 515245 531806 549625 568184
61845 568184 587080 605893 624112 641513 658248 674149 688212 699251 706907 711608 713684 713043
61833 713043 709725 704282 697456 689851 682048 674809 668991 665430 664855 667597 673226 680652 688701 696543
$$ packed form
61930D67854R753R103Q611Q437Q453Q299P647O412M666K606O31p88j555k112k894
61915E35123l761m207m028l476k740j629J13K434N061P642R728J0855J0955J0551
61901E72621J0242J0010R199P267M514J962M07m46j701l889o126p090o749o411
61887E83810o935p642p563o987p015p782q201p530o395n900o333p180p989q632
61873D81726q987q824q083o924n535m070k820k165k162k307j922q26N31J647K509
61858D31788L369M196M767N287O395Q321J0464J2165J3514J4979J6561J7819J8559
61845E68184J8896J8813J8219J7401J6735J5901J4063J1039P656M701K076o41
61833G13043l318n443o826p605p803p239n818l561n75K742N629P426Q049P842
$$ plain form
61819 696543 703659 709733 714647 718290 720227 719727 716256 709792 700629 689084 675534 660556 644843
61806 644843 629011 613502 598571 584334 570889 558409 547017 536635 527082 518257 509990 501772
61794 501772 493010 483708 474681 466884 460656 455696 451597 448205 445501 443353 441487 439676 437911 436220
61780 436220 434322 431666 428054 424088 420682 418190 416286 414651 413368 412501 411683 410432 408720 407032 405945
61765 405945 405739 406235 406923 407441 408054 409431 411813 414645 417258 419648 422275 425284 428325 431058 433442
61750 433442 435436 436781 437257 436914 435835 433869 430873 427093 423070 419144 415378 411997 409502 408047 406954
61735 406954 405372 403384 401943 401563 401567 400983 399833 399103 399599 401256 403471 405683 407640 409444 411374 413463
61719 413463 415316 416635 417728 419113 420817 422592 424678 427591 431005 433606 434410 433702 432326 430589 428326
$$ packed form
61819F96543P116O074M914L643J937n00l471o464r163j1545j3550j4978j5713
61806F44843j5832j5509j4931j4237j3445j2480j1392j0382r553q825q267q218
61794E01772q762r302r027p797o228m960m099l392k704k148j866j811j765j691
61780D36220j898k656l612l966l406k492j904j635j283q67q18j251j712j688j087
61765D05945k06M96O88N18O13J377K382K832K613K390K627L009L041K733K384
61750D33442J994J345M76l43j079j966k996l780m023l926l766l381k495j455j093
61735D06954j582j988j441l80Mn84j150p30M96J657K215K212J957J804J930K089
61719D13463J853J319J093J385J704J775K086K913L414K601Q04p08j376j737k263
$$ plain form
61704 428326 425587 422642 419581 416404 413323 410518 407757 404673 401326 398075 395032 391988 388756 385216
61690 385216 381230 376910 372764 369090 365425 361174 356675 352907 350062 347164 343444 339465 336440 334827
61676 334827 334094 333536 332799 331766 330487 329274 328451 327899 327154 326042 324925 324168 323687 323295 323224 323844 324927
61659 324927 325694 325779 325731 326206 327009 327513 327850 328983 331445 334570 337294 339266 340747 341825 342349 342462 342627
61642 342627 343065 343608 344211 345221 346988 349434 352116 354521 356240 357079 357104 356519 355472 354121 352794 351806
61626 351806 351056 350008 348092 345088 341263 337385 334374 332530 331091 329046 326427 324367 323674 323862 323894
61611 323894 323486 323191 323437 323927 323864 322402 319039 314085 308717 304095 300252 296323 291958 287976 285252 283432
61595 283432 281394 278753 276249 274601 273639 272804 271946 271143 270184 268838 267414 266435 265821 264969 263718 262607
$$ packed form
61704D28326k739k945l061l177l081k805k761l084l347l251l043l044l232l540
61690C85216l986m320m146l674l665m251m499l768k845k898l720l979l025j613
61676C34827p33n58p37j033j279j213q23n52p45j112j117p57m81l92p1O20J083
61659C24927P67Q5m8M75Q03N04L37J133K462L125K724J972J481J078N24J13J65
61642C42627M38N43O03J010J767K446K682K405J719Q39K5n85j047j351j327r88
61626C51806p50j048j916l004l825l878l011j844j439k045k619k060o93J88L2
61611C23894m08k95K46M90o3j462l363m954n368m622l843l929m365l982k724j820
61595B83432k038k641k504j648r62q35q58q03r59j346j424r79o14q52j251j111
$$ plain form
61579 262607 262014 261576 260796 259770 258912 258329 257876 257596 257628 257859 258034 258139 258304 258472 258498 258476 258593 258805 258972
61560 258972 259189 259615 260133 260612 261363 262836 264932 267165 269430 271906 274179 275270 274981 274582 275583 278065
61544 278065 280666 282022 281881 281048 280638 281284 282737 284166 284961 285144 285004 284643 284116 283690 283649 283995 284553 285185
61526 285185 285661 285569 284696 283388 282215 281362 280614 279784 278921 278130 277495 277062 276711 276134 275255 274507 274375 274736
61508 274736 275036 275041 274999 275006 274741 274046 273431 273615 274680 275926 276523 276145 275053 273820 273048 273202 274435 276466
61490 276466 278663 280422 281527 282123 282432 282655 283098 284054 285425 286744 287744 288691 289906 291220 292225 292843
61474 292843 293283 293566 293592 293587 293965 294619 294839 294118 292703 291153 289780 288804 288590 289219 290001 289953 288851 287552
61456 287552 287177 288139 289956 291745 292873 293348 293722 294541 295758 296695 296669 295701 294647 294628 296198 298982 302055
$$ packed form
61579B62607n93m38p80j026q58n83m53k80L2K31J75J05J65J68K6k2J17K12J67
61560B58972K17M26N18M79P51J473K096K233K265K476K273J091k89l99J001K482
61544B78065K601J356j41q33m10O46J453J429P95J83j40l61n27m26m1L46N58O32
61526B85185M76r2q73j308j173q53p48q30q63p91o35m33l51n77q79p48j32L61
61508B74736L00Nm2Pk65o95o15J84J065J246N97l78j092j233p72J54J233K031
61490B76466K197J759J105N96L09K23M43R56J371J319J000R47J215J314J005O18
61474B92843M40K83K6nL78O54K20p21j415j550j373r76k14O29P82m8j102j299
61456B87552l75R62J817J789J128M75L74Q19J217R37k6r68j054j9J570K784L073
$$ plain form
61439 302055 304643 306455 307552 308180 308786 309829 311347 312901 314197 315537 317316 319205 320297 320168 319384
61424 319384 318799 318647 318586 318339 317940 317463 316924 316457 316323 316642 317304 318242 319554 321231 322904 324080 324595 324697
61406 324697 324719 324784 324836 324814 324713 324509 324057 323178 321891 320520 319359 318213 316532 314191 311958 310802 310805 311145
61388 311145 311248 311542 312788 314963 317220 318867 319934 320769 321494 322137 322997 324513 326745 329221 331375 333074
61372 333074 334654 336485 338572 340603 342334 343822 345254 346683 348090 349570 351198 352770 353980 354918
61358 354918 356064 357665 359498 361465 364014 367469 371238 374375 376931 380081 384715 390440 396256 401671
61344 401671 406680 411100 414578 417116 419041 420488 421422 422147 423305 425216 427584 429885 431713 432742 432827
61329 432827 432315 431831 431565 431151 430372 429472 428616 427611 426580 426303 427227 428578 429253 429380 430173 432240 434917
$$ packed form
61439C02055K588J812J097O28O06J043J518J554J296J340J779J889J092j29p84
61424C19384n85j52o1k47l99m77n39m67j34L19O62R38J312J677J673J176N15J02
61406C24697K2O5N2k2j01k04m52q79j287j371j161j146j681k341k233j156LL40
61388C11145J03K94J246K175K257J647J067Q35P25O43Q60J516K232K476K154J699
61372C33074J580J831K087K031J731J488J432J429J407J480J628J572J210R38
61358C54918J146J601J833J967K549L455L769L137K556L150M634N725N816N415
61344D01671N009M420L478K538J925J447R34P25J158J911K368K301J828J029Q5
61329D32827n12m84k66m14p79r00q56j005j031k77R24J351O75J27P93K067K677
$$ plain form
61312 434917 437532 440582 445110 451339 458499 465885 473651 482538 493029 504804 516993 528887 540261
61299 540261 550883 560016 566872 571496 574728 577177 578683 578867 577635 574946 570634 564940 558771 552896
61285 552896 547174 540973 534113 526898 519547 512211 505382 499593 494749 490367 486565 484173 483625 484255 484997
61270 484997 485399 485699 486266 487276 488673 490157 491402 492500 493962 496058 498457 500820 503437 506817 510770
61255 510770 514392 516964 518524 519414 519732 519525 519322 519993 521947 524626 527009 528581 529621 530538 531228 531344
61239 531344 530972 530558 530180 529394 528033 526677 525913 525458 524521 522917 521332 520519 520747 522097 524724 528538
61223 528538 532983 537552 542319 547689 553763 560240 566850 573637 580808 588454 596371 603992 610651 616153
61209 616153 621045 626071 631309 636067 639690 642317 644726 647634 651241 655397 659960 664909 670217 675865
$$ packed form
61312D34917K615L050M528O229P160P386P766Q887J0491J1775J2189J1894J1374
61299E40261J0622R133O856M624L232K449J506J84j232k689m312n694o169n875
61285E52896n722o201o860p215p351p336o829n789m844m382l802k392n48O30P42
61270D84997M02L00N67J010J397J484J245J098J462K096K399K363K617L380L953
61255E10770L622K572J560Q90L18k07k03O71J954K679K383J572J040R17O90J16
61239E31344l72m14l78p86j361j356p64m55r37j604j585q13K28J350K627L814
61223E28538M445M569M767N370O074O477O610O787P171P646P917P621O659N502
61209F16153M892N026N238M758L623K627K409K908L607M156M563M949N308N648
$$ plain form
61195 675865 682149 689806 699456 710784 722525 733444 743075 751337 757897 762483 765667 768537 771345
61182 771345 772999 772257 769137 764814 760398 756195 751947 747343 742243 736704 730882 724842 718509 711885
61168 711885 705160 698428 691457 683930 675762 667002 657608 647580 637142 626516 615676 604602 593632
61155 593632 583235 573610 564930 557791 552834 549952 548398 547655 547559 547463 546143 543001 538777 534475 529965
61140 529965 524328 517346 509979 503359 497885 493414 489843 487246 485666 485028 485163 485875 487085 488968 491898
61125 491898 496245 502271 510070 519463 529997 541214 552910 565097 577936 591885 607676 625811
61113 625811 646069 667695 689991 712541 735070 757480 780010 802907 825782 847533 867011
61102 867011 883609 897249 908149 916711 923291 927810 929736 928650 924728 918494 910209 899715 886815
$$ packed form
61195F75865O284P657R650J1328J1741J0919R631Q262O560M586L184K870K808
61182G71345J654p42l120m323m416m203m248m604n100n539n822o040o333o624
61168G11885o725o732o971p527q168q760r394j0028j0438j0626j0840j1074j0970
61155E93632j0397r625q680p139m957k882j554p43r6r6j320l142m224m302m510
61140E29965n637o982p367o620n474m471l571k597j580o38J35P12J210J883K930
61125D91898M347O026P799R393J0534J1217J1696J2187J2839J3949J5791J8135
61113F25811K0258K1626K2296K2550K2529K2410K2530K2897K2875K1751J9478
61102H67011J6598J3640J0900Q562O580M519J926j086l922o234q285j0494j2900
$$ plain form
61089 886815 871751 855257 838209 821109 803836 785921 767131 747817 728717 710551 693796
61078 693796 678699 665346 653659 643343 633951 625161 617044 609934 603929 598713 593981 589815 586389
61065 586389 583626 581539 580721 581889 584865 588610 592437 596736 602238 609057 616795 625155 634012 643220
61051 643220 652878 663599 675999 690109 705693 722914 742070 762773 784134 805918 828924 853989
61039 853989 881151 910019 940418 972285 1005420 1039856 1076155 1114839 1155809 1198804 1244121
61028 1244121 1292159 1342347 1393299 1444191 1495462 1548098 1602958 1661162 1724512 1794899 1873493
61017 1873493 1960816 2057263 2163178 2279063 2406628 2549825 2714561 2907897 3138494 3417922
61007 3417922 3760594 4182082 4698227 5326439 6087770 7008730 8123151 9470140 11078111
$$ packed form
61089H86815j5064j6494j7048j7100j7273j7915j8790j9314j9100j8166j6755
61078F93796j5097j3353j1687j0316r392q790q117p110o005n216m732m166l426
61065E86389k763k087q18J168K976L745L827M299N502O819P738Q360Q857R208
61051F43220R658J0721J2400J4110J5584J7221J9156K0703K1361K1784K3006K5065
61039H53989K7162K8868L0399L1867L3135L4436L6299L8684M0970M2995M5317
61028A244121M8038N0188N0952N0892N1271N2636N4860N8204O3350P0387P8594
61017A873493Q7323R6447J05915J15885J27565J43197J64736J93336K30597K79428
61007C417922L42672M21488N16145O28212P61331R20960J114421J346989J607971
$$ plain form
60998 11078111 12930725 14932092 16904309 18635520 19957272 20804333 21225621 21353487
60990 21353487 21358282 21402599 21593306 21937430 22327325 22576772 22496474 21967713 20976699 19602011
60980 19602011 17973631 16228492 14480033 12807666 11261088 9868457 8641230 7576953
60972 7576953 6663947 5886910 5229606 4674711 4204637 3804255 3462209 3169180 2915940
60963 2915940 2693938 2497023 2321566 2165038 2025076 1899650 1787384 1687393 1598829 1520439
60953 1520439 1450467 1387119 1329125 1275537 1225173 1176941 1130842 1087847 1048321 1011280 975757
60942 975757 942261 912016 885197 860803 838050 816842 796883 777333 757751 738623 720560
60931 720560 703506 687083 671230 656054 641526 627799 615481 605001 595953 587564 579662 572622
$$ packed form
60998A1078111J852614K001367J972217J731211J321752Q47061M21288J27866
60990B1353487M795M4317J90707L44124L89895K49447q0298n28761r91014j374688
60980A9602011j628380j745139j748459j672367j546578j392631j227227j064277
60972G576953r13006p77037o57304n54895m70074m00382l42046k93029k53240
60963B915940k22002j96915j75457j56528j39962j25426j12266r9991q8564p8390
60953A520439o9972o3348n7994n3588n0364m8232m6099m2995l9526l7041l5523
60942I75757l3496l0245k6819k4394k2753k1208j9959j9550j9582j9128j8063
60931G20560j7054j6423j5853j5176j4528j3727j2318j0480r048q389p902p040
$$ plain form
60919 572622 566432 560471 554389 548638 543780 539680 535844 532353 529907 528860 528540 527838 526318 524554 523345
60904 523345 522739 521961 520330 518110 516301 515600 515799 516275 516831 517731 519024 520169 520471 519629 517879 515836
60888 515836 514204 513247 512351 510454 507145 503003 498582 493471 486882 478878 470444 462450 455129 448475 442415
60873 442415 436540 430347 424034 418459 414040 410304 406844 404013 402138 400714 399226 398321 399170 401679 404226
60858 404226 405416 405497 405792 407246 409787 412663 415006 416379 417117 418118 420072 422901 425940 428517 430328
60843 430328 431471 432252 432901 433462 433960 434462 434745 434185 432412 429940 427677 425779 423567 420684 417733 415479
60827 415479 413887 412411 410873 409573 408746 408380 408390 408531 408199 406820 404545 402232 400614 399615 398515 396568
60811 396568 393472 389548 385488 381746 378111 374021 369363 364702 360673 357350 354316 351141 347618 343735
$$ packed form
60919E72622o190n961o082n751m858m100l836l491k446j047l20p02j520j764j209
60904E23345o06p78j631k220j809p01J99M76N56R00J293J145L02q42j750k043
60888E15836j632r57q96j897l309m142m421n111o589q004q434p994p321o654o060
60873D42415n875o193o313n575m419l736l460k831j875j424j488r05Q49K509K547
60858D04226J190Q1K95J454K541K876K343J373P38J001J954K829L039K577J811
60843D30328J143P81O49N61M98N02K83n60j773k472k263j898k212k883k951k254
60827D15479j592j476j538j300q27l66J0J41l32j379k275k313j618r99j100j947
60811C96568l096l924m060l742l635m090m658m661m029l323l034l175l523l883
$$ plain form
60797 343735 339710 336058 333300 331444 329854 327814 325201 322494 320133 318073 316132 314520 313700 313781 314407
60782 314407 315344 316760 318654 320369 321146 321050 320863 321071 321403 321507 321624 322311 323801 326016 329027 333061 338014
60765 338014 343215 347793 351188 353362 354713 355844 357247 359057 361019 362593 363132 362235 360190 357900 356047
60750 356047 354367 352098 349163 346480 344926 344398 344208 344052 344101 344279 344040 342978 341227 339040 336326 332896
60734 332896 328956 325043 321509 318300 315183 312011 308776 305591 302647 300073 297823 295772 293907 292346
60720 292346 291220 290649 290743 291466 292482 293340 293836 294089 294213 294130 293776 293385 293336 293760 294423 295043 295620 296391 297517
60701 297517 298947 300622 302724 305521 308914 312363 315413 318255 321452 325079 328376 330497 331516 332411
60687 332411 334023 336185 338001 338876 339118 339588 340909 343013 345314 347230 348615 349781 351061 352358 353219
$$ packed form
60797C43735m025l652k758j856j590k040k613k707k361k060j941j612q20Q1O26
60782C14407R37J416J894J715P77r6j87K08L32J04J17O87J490K215L011M034M953
60765C38014N201M578L395K174J351J131J403J810J962J574N39q97k045k290j853
60750C56047j680k269k935k683j554n28j90j56M9J78k39j062j751k187k714l430
60734C32896l940l913l534l209l117l172l235l185k944k574k250k051j865j561
60720B92346j126n71R4P23J016Q58M96K53J24q3l54l91m9M24O63O20N77P71J126
60701B97517J430J675K102K797L393L449L050K842L197L627L297K121J019Q95
60687C32411J612K162J816Q75K42M70J321K104K301J916J385J166J280J297Q61
$$ plain form
60672 353219 353459 353517 353976 354804 355295 354788 353244 351096 348782 346502 344197 341636 338696 335675 333055 330847
60656 330847 328457 325498 322515 320569 320250 321425 323740 326869 330288 333333 335667 337317 338211 338147 337438
60641 337438 337027 337503 338241 338001 336227 333391 330195 326917 323567 320283 317366 315132 313830 313528 313971 314757
60625 314757 315702 316906 318386 319823 320855 321484 322069 322933 324095 325304 326229 326664 326680 326602 326751 327160 327539
60608 327539 327531 326977 325983 324803 323704 322871 322366 322170 322274 322701 323360 323948 324172 324185 324632 326056 328284 330630
60590 330630 332639 334384 335973 337156 337666 337708 337780 338064 338297 338252 338066 338067 338487 339377 340617 341956 343265 344830
60572 344830 347252 350949 355900 361860 368568 375711 383056 390870 399904 410536 422021 432883 442009
60559 442009 449064 454013 456724 457162 455496 451852 446340 439576 432846 427279 423046 419732 417355 416493 417406
$$ packed form
60672C53219K40N8M59Q28M91n07j544k148k314k280k305k561k940l021k620k208
60656C30847k390k959k983j946l19J175K315L129L419L045K334J650Q94o4p09
60641C37438m11M76P38k40j774k836l196l278l350l284k917k234j302l02M43P86
60625C14757R45J204J480J437J032O29N85Q64J162J209R25M35J6p8J49M09L79
60608C27539qn54r94j180j099q33n05j96J04M27O59N88K24J3M47J424K228K346
60590C30630K009J745J589J183N10M2P2K84K33m5j86JM20Q90J240J339J309J565
60572C44830K422L697M951N960O708P143P345P814R034J0632J1485J0862R126
60559D42009P055M949K711M38j666l644n512o764o730n567m233l314k377q62R13
$$ plain form
60544 417406 419567 422327 425700 430161 435964 443041 451511 461870 474509 489215 505269 521947 538811
60531 538811 555530 571508 585790 597385 605642 610291 611251 608686 603271 596138 588345 580404 572405
60518 572405 564309 556005 547336 538571 530782 525297 522554 521696 521478 521336 521421 521888 522619 523695 525787 529793
60502 529793 536211 545158 556973 572489 592416 616617 644293 674796 707831 742795 778448 813641
60490 813641 847950 881061 911784 938423 960258 978072 992928 1004810 1012660 1015353 1012337 1003691
60478 1003691 989804 970827 946288 915705 879852 840998 801458 762316 723968 687333 653580
60467 653580 622820 594069 566768 541658 519823 501458 485942 472611 460983 450582 441084 432575
60455 432575 425331 419390 414490 410257 406277 402231 398214 394719 392044 389927 387997 386313 385058 383862
$$ packed form
60544D17406K161K760L373M461N803P077Q470J0359J2639J4706J6054J6678J6864
60531E38811J6719J5978J4282J1595Q257M649R60k565n415p133p793p941p999
60518E72405q096q304q669q765p789n485k743q58k18j42Q5M67P31J076K092M006
60502E29793O418Q947J1815J5516J9927K4201K7676L0503L3035L4964L5653L5193
60490H13641L4309L3111L0723K6639K1835J7814J4856J1882P850K693l016q646
60478A003691j3887j8977k4539l0583l5853l8854l9540l9142l8348l6635l3753
60467F53580l0760k8751k7301k5110k1835j8365j5516j3331j1628j0401r498q509
60455D32575p244n941m900m233l980m046m017l495k675k117j930j684j255j196
$$ plain form
60441 383862 381902 378715 374631 370432 366864 364354 362776 361438 359697 357715 356349 356192 356964 357864 358235
60426 358235 357836 356864 355943 355783 356501 357417 357720 357245 356492 356089 356399 357382 358531 359157 359146 359356 360818 363510
60408 363510 366292 368229 369547 371052 372913 374513 375397 375844 376345 376949 377488 378221 379742 382230 385175 388030
60392 388030 390807 393744 396647 398945 400325 401020 401570 402635 404965 408985 414110 418833 421887 423275 424018
60377 424018 425111 426871 429093 431466 433872 436497 439598 442983 445862 447469 447813 447596 447468 447632 448161
60362 448161 449294 451156 453399 455349 456639 457615 459068 461554 465099 469620 475443 482920 491528 499953
60348 499953 507413 514448 521840 529102 534768 538035 539329 539170 537331 533467 527928 521412 514352 507118
60334 507118 500403 494752 489915 485236 480564 476280 472495 468778 464798 460813 457342 454571 452164 449490
$$ packed form
60441C83862j960l187m084m199l568k510j578j338j741j982j366j57P72R00L71
60426C58235l99r72r21j60P18R16L03m75p53m03L10R83J149O26j1K10J462K692
60408C63510K782J937J318J505J861J600Q84M47N01O04N39P33J521K488K945K855
60392C88030K777K937K903K298J380O95N50J065K330M020N125M723L054J388P43
60377D24018J093J760K222K373K406K625L101L385K879J607L44k17j28J64N29
60362D48161J133J862K243J950J290R76J453K486L545M521N823P477Q608Q425
60348D99953P460P035P392P262N666L267J294j59j839l864n539o516p060p234
60334E07118o715n651m837m679m672m284l785l717l980l985l471k771k407k674
$$ plain form
60320 449490 446077 442129 438587 436407 435716 435846 436231 437055 438977 442474 447546 453951 461644 471001 482522
60305 482522 496185 511196 526528 541599 556185 569843 581725 590905 596585 598067 594909 587248
60293 587248 575790 561515 545613 529543 514612 501351 489634 479438 471056 464469 459034 454176
60281 454176 449988 446790 444363 442034 439371 436407 433355 430458 428071 426390 425044 423257 420559 417136
60267 417136 413458 409810 406350 403361 401111 399425 397673 395370 392714 390403 388911 388111 387578 387035 386384
60252 386384 385567 384664 383991 383767 383769 383684 383764 384725 386862 389612 392109 393895 395017 395780 396609 397834 399311 400489
60234 400489 401088 401505 402370 403964 406251 409084 412025 414276 415324 415545 415767 416323 416958 417579 418601 420428
60218 420428 422950 425734 428485 431271 434452 438403 443111 448058 452671 456890 461157 465921 471358 477421
$$ packed form
60320D49490l413l948l542k180o91J30L85Q24J922L497N072O405P693R357J1521
60305D82522J3663J5011J5332J5071J4586J3658J1882R180N680J482l158p661
60293E87248j1458j4275j5902j6070j4931j3261j1717j0196q382o587n435m858
60281D54176m188l198k427k329k663k964l052k897k387j681j346j787k698l423
60267D17136l678l648l460k989k250j686j752k303k656k311j492q00n33n43o51
60252C86384q17r03o73k24Kq5Q0R61K137K750K497J786J122P63Q29J225J477J178
60234D00489N99M17Q65J594K287K833K941K251J048K21K22N56O35O21J022J827
60218D20428K522K784K751K786L181L951M708M947M613M219M267M764N437O063
$$ plain form
60204 477421 483833 490108 495901 501360 506814 512255 517519 522944 529273 536615 543908 549711 553364 555249
60190 555249 556206 556977 557930 558972 559732 559969 559716 558948 557315 554406 550205 545128 539756 534611 530041 526081
60174 526081 522460 518912 515439 512217 509321 506647 504044 501414 498781 496358 494412 492953 491616 489984
60160 489984 488016 486068 484580 483761 483472 483273 482666 481420 479734 478096 477049 477024 478184 480195 482210 483238
60144 483238 482718 480897 478752 477432 477503 478669 480272 481975 483818 485817 487997 490847 495168 501084 507503
60129 507503 512962 516888 519771 522293 524654 526675 528169 529190 530094 531361 533155 535145 537023 539101
60115 539101 542035 545893 549874 553128 555633 558046 560805 563578 565614 566532 566721 566925 567413 567689 567094 565518
60099 565518 563337 560802 557889 554752 551903 549685 547872 546086 544399 543162 542288 541169 539453 537566
$$ packed form
60204D77421O412O275N793N459N454N441N264N425O329P342P293N803L653J885
60190E55249R57P71R53J042P60K37k53p68j633k909m201n077n372n145m570l960
60174E26081l621l548l473l222k896k674k603k630k633k423j946j459j337j632
60160D89984j968j948j488q19k89j99o07j246j686j638j047k5J160K011K015J028
60144D83238n20j821k145j320P1J166J603J703J843J999K180K850M321N916O419
60129E07503N459L926K883K522K361K021J494J021R04J267J794J990J878K078
60115E39101K934L858L981L254K505K413K759K773K036R18J89K04M88K76n95j576
60099E65518k181k535k913l137k849k218j813j786j687j237q74j119j716j887
$$ plain form
60085 537566 536184 535328 534362 532858 531105 529610 528418 527213 525841 524287 522229 519136 514987 510489 506290
60070 506290 502274 497926 493095 488045 483006 478112 473652 469870 466524 463096 459507 456199 453360 450516
60056 450516 447187 443655 440781 439129 438515 438299 437983 437524 437198 437186 437413 437887 438941 440809 443055 445009
60040 445009 446838 449601 453937 459191 464273 468919 473560 478200 482150 484851 486391 487076 486993 486165 484790
60025 484790 483118 481290 479404 477522 475551 473286 470588 467267 462881 457102 450326 443471 436986 430505
60011 430505 423747 417344 412262 408633 405637 402465 399064 395956 393679 392444 391996 391650 390674 388836 386662
59996 386662 385119 384983 386251 388042 389279 389684 390015 391125 392951 394679 395736 396268 396754 397622 399280 401983
59980 401983 405392 408565 410712 411780 412087 411722 410621 409066 407623 406556 405594 404388 402970 401654 400649
$$ packed form
60085E37566j382q56r66j504j753j495j192j205j372j554k058l093m149m498m199
60070E06290m016m348m831n050n039m894m460l782l346l428l589l308k839k844
60056D50516l329l532k874j652o14k16l16m59l26j2K27M74J054J868K246J954
60040D45009J829K763M336N254N082M646M641M640L950K701J540O85q3q28j375
60025D84790j672j828j886j882j971k265k698l321m386n779o776o855o485o481
60011D30505o758o403n082l629k996l172l401l108k277j235m48l46r76j838k174
59996C86662j543j36J268J791J237M05L31J110J826J728J057N32M86Q68J658K703
59980D01983L409L173K147J068L07l65j101j555j443j067r62j206j418j316j005
$$ plain form
59965 400649 399841 398873 397453 395711 394192 393295 392752 391961 390843 390004 389873 390067 389915 389321 388652 388021 387286
59948 387286 386796 387377 389239 391360 392471 392408 392021 391977 392203 392408 392531 392512 392153 391515 391096 391310 392051 392984 393972
59929 393972 394908 395486 395625 396013 397674 400940 405229 409953 415191 421259 427884 434175 439342 443179 445825
59914 445825 447283 447410 446401 445053 444305 444433 444915 445140 445041 444893 444800 444718 444845 445575 447022 448879 450804 452685
59896 452685 454535 456389 458401 460824 463831 467515 472038 477469 483413 489139 494223 498874 503510 508252
59882 508252 512958 517502 521814 525840 529662 533543 537670 541914 545919 549268 551518 552250 551264 548651 544703
59867 544703 539905 535001 530709 527245 524329 521726 519521 517763 516230 514792 513709 513387 514089 516108 519848
59852 519848 525389 532165 539436 546904 554636 562596 570537 578149 584975 590368 593901 595765 596543 596715 596539
$$ packed form
59965D00649q08r68j420j742j519q97n43p91j118q39j31J94j52n94o69o31p35
59948C87286m90N81J862K121J111o3l87m4K26K05J23j9l59o38m19K14P41R33R88
59929C93972R36N78J39L88J661L266M289M724N238O068O625O291N167L837K646
59914D45825J458J27j009j348p48J28M82K25r9j48r3q2J27P30J447J857J925J881
59896D52685J850J854K012K423L007L684M523N431N944N726N084M651M636M742
59882E08252M706M544M312M026L822L881M127M244M005L349K250P32r86k613l948
59867E44703m798m904m292l464k916k603k205j758j533j438j083l22P02K019L740
59852E19848N541O776P271P468P732P960P941P612O826N393L533J864P78J72j76
$$ plain form
59837 596539 596078 595037 592866 589373 584962 579905 573772 566147 557609 549351 542027 535597 530065 525567
59823 525567 521747 517881 513802 510030 506858 503970 501091 498312 495549 492456 489209 486610 484877 482992
59809 482992 479916 476024 472742 471006 470617 470822 470952 470616 469784 468699 467502 466096 464573 463385 462753 462301
59793 462301 461712 461394 461864 462692 462738 461525 459826 458819 459004 459984 460936 461223 460803 460108 459381 458309 456556
59776 456556 454502 453017 452596 453007 453699 454159 454029 453349 452699 452646 453052 453321 453369 453824 455175 457197 459380 461546
59758 461546 463863 466660 470386 475346 481206 487132 492674 498203 504243 510689 517049 523144 529175 535318
59744 535318 541667 548403 555554 562621 568776 573526 576976 579511 581479 583102 584389 585164 585476 585902 587010
59729 587010 588456 589115 588322 586614 584970 583706 582549 581478 580826 580541 579963 578571 576520 574186 571555
$$ packed form
59837E96539m61j041k171l493m411n057o133p625q538q258p324o430n532m498
59823E25567l820l866m079l772l172k888k879k779k763l093l247k599j733j885
59809D82992l076l892l282j736l89K05J30l36q32j085j197j406j523j188o32m52
59793D62301n89l18M70Q28M6j213j699j007J85R80R52K87m20o95p27j072j753
59776D56556k054j485m21M11O92M60j30o80o50n3M06K69M8M55J351K022K183K166
59758D61546K317K797L726M960N860N926N542N529O040O446O360O095O031O143
59744E35318O349O736P151P067O155M750L450K535J968J623J287P75L12M26J108
59729E87010J446O59p93j708j644j264j157j071o52k85n78j392k051k334k631
$$ plain form
59714 571555 568519 565452 562938 560956 558814 556068 553128 550848 549783 550032 551456 553694 556115 558132
59700 558132 559675 561203 563198 565664 568124 570102 571683 573579 576485 580346 584385 587843 590395 591872
59686 591872 592057 591087 589674 588432 587128 585082 582282 579575 577661 576306 574811 572858 570575 567935 564542
59671 564542 560103 554896 549588 544630 539959 535337 530835 526832 523541 520794 518383 516437 515282 515044
59657 515044 515542 516483 517630 518934 520654 523176 526487 529961 532947 535389 537613 539675 541348 542556 543283
59642 543283 543053 541147 537518 532978 528193 522983 517041 510897 505542 501274 497473 493569 489751 486543
59628 486543 484024 481749 479352 476999 475161 473973 472949 471425 469251 466859 464671 462633 460386 457619
59614 457619 454140 449952 445512 441693 439079 437354 435688 433705 431804 430607 430367 430958 432086 433446 434862
$$ packed form
59714E71555l036l067k514j982k142k746k940k280j065K49J424K238K421K017
59700E58132J543J528J995K466K460J978J581J896K906L861M039L458K552J477
59686E91872J85r70j413j242j304k046k800k707j914j355j495j953k283k640l393
59671E64542m439n207n308m958m671m622m502m003l291k747k411j946j155k38
59657E15044M98R41J147J304J720K522L311L474K986K442K224K062J673J208P27
59642E43283k30j906l629m540m785n210n942o144n355m268l801l904l818l208
59628D86543k519k275k397k353j838j188j024j524k174k392k188k038k247k767
59614D57619l479m188m440l819k614j725j666j983j901j197k40N91J128J360J416
$$ plain form
59599 434862 436386 438033 439437 440118 440185 440411 441313 442435 442918 442694 442698 443793 445746 447427 447910 447271 446353
59582 446353 445857 445670 445090 443658 441657 439686 437929 436093 433976 431749 429625 427602 425754 424431 423808
59567 423808 423440 422690 421522 420430 419615 418780 417866 417358 417458 417450 416566 415236 414709 415396 416284 416339 415902 416207 417797
59548 417797 419944 421595 422494 423338 425136 428518 433448 439483 446373 454453 464421 476853 492007 509777
59534 509777 529239 548100 563134 571803 573694 570367 563994 556288 548405 541218 535321 530911 527876
59521 527876 526002 525068 524833 525058 525491 525855 525959 525767 525154 523565 520298 515363 509809 504823 500598 496334
59505 496334 491219 485096 478282 471274 464708 459170 454821 451384 448587 446306 444236 441858 439007 436104
59491 436104 433540 431232 429120 427775 427939 429604 431990 434387 436553 438385 439771 440898 442294 444355
$$ packed form
59599D34862J524J647J404O81O7K26R02J122M83k24MJ095J953J681M83o39r18
59582D46353m96j87n80j432k001j971j757j836k117k227k124k023j848j323o23
59567D23808l68p50j168j092q15q35r14n08J00qq84j330n27O87Q88N5m37L05J590
59548D17797K147J651Q99Q44J798L382M930O035O890Q080R968J2432J5154J7770
59534E09777J9462J8861J5034Q669J891l327o373p706p883p187n897m410l035
59521E27876j874r34k35K25M33L64J04j92o13j589l267m935n554m986m225m264
59505D96334n115o123o814p008o566n538m349l437k797k281k070k378k851k903
59491D36104k564k308k112j345J64J665K386K397K166J832J386J127J396K061
$$ plain form
59477 444355 447072 450336 454165 458477 462917 467100 470891 474374 477719 481131 484646 487855 490086 491086
59463 491086 491315 491442 491776 492311 493035 493903 494752 495615 497045 499796 504157 509779 516121 522778 529414 535732
59447 535732 541666 547425 553147 558602 563331 566964 569241 569885 568724 565986 562266 558052 553457 548526
59433 548526 543610 539134 535072 531058 527097 523790 521601 520262 519306 518992 520191 523334 527996 533689 540664
59418 540664 549587 560660 573510 587889 604134 622866 644499 669111 696266 724396 750347 770187
59406 770187 781162 783127 778127 768787 757330 745738 736110 730444 730146 735546 745240 755683 762263
59393 762263 761729 753860 740699 724572 707124 689534 672605 656604 641722 628796 618865 611875
59381 611875 606575 602028 598664 597367 598019 599457 600583 601042 600998 600741 600509 600413 600460 600724 601340 602262 603253 604215
$$ packed form
59477D44355K717L264L829M312M440M183L791L483L345L412L515L209K231J000
59463D91086K29J27L34N35P24Q68Q49Q63J430K751M361N622O342O657O636O318
59447E35732N934N759N722N455M729L633K277O44j161k738l720m214m595m931
59433E48526m916m476m062m014l961l307k189j339r56l14J199L143M662N693O975
59418E40664Q923J1073J2850J4379J6245J8732K1633K4612K7155K8130K5951J9840
59406G70187J0975J965n000r340j1457j1592r628n666k98N400R694J0443O580
59393G62263n34p869j3161j6127j7448j7590j6929j6001j4882j2926r931o990
59381F11875n300m547l364j297O52J438J126M59m4k57k32r6M7K64O16R22R91R62
$$ plain form
59363 604215 605236 606173 606514 605987 605050 604476 604667 605676 607682 611005 615735 621660 628531 636130 644196 652609
59347 652609 661642 671746 683097 695525 708789 722656 736692 750235 762680 773725 783368 791754
59335 791754 798923 804538 807982 808917 807688 805009 801297 796488 790360 782814 773860 763624 752414 740651
59321 740651 728724 716940 705527 694536 683820 673258 662949 653090 643762 634931 626541 618552
59309 618552 611097 604745 600332 598191 597786 598433 600280 604184 610705 619539 629771 640122 648827 653859
59295 653859 653746 648228 638136 624929 610360 596070 582967 570975 559644 549014 539723 532370
59283 532370 527023 523408 521350 520803 521497 522804 524178 525720 528208 532482 538784 546636 555273 564210 573504
59268 573504 583510 594300 605364 615989 625875 635204 644122 652369 659451 664908 668412 669900 669773
$$ packed form
59363F04215J021R37L41n27r37n74J91J009K006L323M730N925O871P599Q066Q413
59347F52609R033J0104J1351J2428J3264J3867J4036J3543J2445J1045R643Q386
59335G91754P169N615L444R35j229k679l712m809o128p546q954j0236j1210j1763
59321G40651j1927j1784j1413j0991j0716j0562j0309r859r328q831q390p989
59309F18552p455o352m413k141m05O47J847L904O521Q834J0232J0351Q705N032
59295F53859j13n518j0092j3207j4569j4290j3103j1992j1331j0630r291p353
59283E32370n347l615k058n47O94J307J374J542K488M274O302P852Q637Q937R294
59268E73504J0006J0790J1064J0625R886R329Q918Q247P082N457L504J488j27
$$ plain form
59255 669773 668678 666843 663867 659373 653678 647581 641668 636139 631140 626899 623584 621264 619991 619720
59241 619720 620209 621227 622812 625130 628162 631746 635815 640341 645114 649838 654430 658960 663292 667013
59227 667013 669742 671301 671558 670351 667660 663726 658853 653144 646446 638616 629858 620777 611937 603475
59213 603475 595344 587864 581591 576537 571951 567129 562034 556865 551525 546018 540983 537198 534758 533309
59199 533309 532877 533713 535355 536680 537187 537620 538975 541320 543954 546406 548853 551686 555002 558531 561971
59184 561971 565341 568974 573052 577318 581468 585692 590425 595595 600543 604741 608191 611008 613084 614462
59170 614462 615630 617102 618798 620189 620959 621284 621520 621899 622588 623830 625755 627975 629574 629773 628628 626775
59154 626775 624453 621135 616347 610454 604221 597861 591028 583588 575836 568042 560319 552990 546504 540811
$$ packed form
59255F69773j095j835k976m494n695o097n913n529m999m241l315k320j273k71
59241F19720M89J018J585K318L032L584M069M526M773M724M592M530M332L721
59227F67013K729J559K57j207k691l934m873n709o698p830q758r081q840q462
59213F03475q131p480o273n054m586m822n095n169n340n507n035l785k440j449
59199E33309m32Q36J642J325N07M33J355K345K634K452K447K833L316L529L440
59184E61971L370L633M078M266M150M224M733N170M948M198L450K817K076J378
59170F14462J168J472J696J391P70L25K36L79O89J242J925K220J599J99j145j853
59154F26775k322l318m788n893o233o360o833p440p752p794p723p329o486n693
$$ plain form
59140 540811 535257 529302 523035 516825 510854 505170 499906 495191 491006 487168 483335 479172 474888 471516
59126 471516 470175 470943 472910 475326 478208 481747 485793 490294 495730 502637 510974 520223 529824 539305
59112 539305 548345 557020 565673 574267 582208 589089 595205 601036 606605 611762 616710 621662 626214 629600
59098 629600 631529 632299 632189 631236 629665 628064 626883 625974 624805 623064 620991 619202 618175 617886 617918 617877
59082 617877 617526 616493 614138 610004 604359 598112 592121 586601 581155 575420 569638 564413 559835 555228
59068 555228 550102 544986 540729 537188 533443 529301 525708 523369 521746 519929 517802 515783 513945 512082
59054 512082 510233 508413 506161 503079 499709 497118 495676 494808 493965 493219 492776 492459 491999 491502 491318 491558
59038 491558 491906 491898 491401 490803 490627 490921 491272 491502 492031 493349 495408 497824 500365 503003 505809 509222 514095
$$ packed form
59140E40811n554n955o267o210n971n684n264m715m185l838l833m163m284l372
59126D71516j341P68J967K416K882L539M046M501N436O907Q337R249R601R481
59112E39305R040Q675Q653Q594P941O881O116N831N569N157M948M952M552L386
59098F29600J929P70j10r53j571j601j181r09j169j741k073j789j027k89L2m1
59082F17877l51j033k355m134n645o247n991n520n446n735n782n225m578m607
59068E55228n126n116m257l541l745m142l593k339j623j817k127k019j838j863
59054E12082j849j820k252l082l370k591j442q68q43p46m43l17m60m97j84K40
59038D91558L48qm97n98j76K94L51K30N29J318K059K416K541K638K806L413M873
$$ plain form
59021 514095 521010 529690 539407 549709 560254 570315 579151 586786 593746 600012 604873 607925 609581
59008 609581 610364 610227 609005 607163 605641 605028 605170 605587 606120 607135 609139 612290 616321 620863 625544 629769
58992 629769 632843 634575 635448 635871 635588 634217 632113 630160 628866 628099 627592 627269 627142 627381 628397 630471
58976 630471 633418 637077 641921 648535 656625 665255 674096 683713 694460 705896 717568 729650 742320
58963 742320 755102 767320 778801 789595 799341 807449 813664 817984 820202 820021 817501 812972 806578
58950 806578 798266 788175 776687 764085 750525 736365 722228 708606 695576 683076 671330 660887
58938 660887 652186 645081 638848 632796 626971 622156 619081 617671 617099 616500 615577 614642 614200 614484 615262 616063
58922 616063 616543 616603 616228 615372 614026 612258 610171 607974 606102 605026 604806 604933 604815 604420 604343 605311 607707
$$ packed form
59021E14095O915Q680R717J0302J0545J0061Q836P635O960O266M861L052J656
59008F09581P83j37j222j842j522o13J42M17N33J015K004L151M031M542M681M225
58992F29769L074J732Q73M23k83j371k104j953j294p67n07l23j27K39J016K074
58976F30471K947L659M844O614Q090Q630Q841R617J0747J1436J1672J2082J2670
58963G42320J2782J2218J1481J0794R746Q108O215M320K218j81k520m529o394
58950H06578q312j0091j1488j2602j3560j4160j4137j3622j3030j2500j1746j0443
58938F60887q701p105o233o052n825m815l075j410n72n99r23r35m42K84P78Q01
58922F16063M80O0l75q56j346j768k087k197j872j076k20J27j18l95p7R68K396
$$ plain form
58905 607707 611504 616489 622483 629434 637399 646485 656744 668033 679963 692017 703774 715035 725784
58892 725784 736113 746163 756056 765886 775890 786586 798541 811896 826227 840866 855211 868745
58880 868745 880973 891503 900067 906442 910472 912137 911430 908278 902907 896158 888894 881057 871968 861743
58866 861743 851720 843119 835928 829594 824083 819417 814737 808903 801868 794523 787288 779747 771648 763228
58852 763228 754322 744152 732555 720703 710018 700837 692562 684633 676809 668886 660793 652925 645951
58839 645951 640259 635697 631675 627340 621925 615251 607846 600413 593340 586840 581280 577086 574386 572948
58825 572948 572470 572806 573961 575899 578386 581159 584316 588312 593239 598301 602437 605433 608031 610965 614375
58810 614375 618136 622152 626121 629541 632228 634399 635997 636401 635173 632728 629844 626813 623438 619551
$$ packed form
58905F07707L797M985N994O951P965R086J0259J1289J1930J2054J1757J1261J0749
58892G25784J0329J0050R893R830J0004J0696J1955J3355J4331J4639J4345J3534
58880H68745J2228J0530Q564O375M030J665p07l152n371o749p264p837r089j0225
58866H61743j0023q601p191o334n511m666m680n834p035p345p235p541q099q420
58852G63228q906j0170j1597j1852j0685r181q275p929p824p923q093p868o974
58839F45951n692m562m022m335n415o674p405p433p073o500n560m194k700j438
58825E72948m78L36J155J938K487K773L157L996M927N062M136K996K598K934L410
58810F14375L761M016L969L420K687K171J598M04j228k445k884l031l375l887
$$ plain form
58796 619551 615071 609714 603166 595646 588008 581140 575322 570114 564818 559177 553684 549151 546034 544318
58782 544318 543892 544586 545871 547122 548375 550386 553570 557317 560645 563187 565067 566177 566123 564817 562596
58767 562596 559716 556060 551473 546181 540798 535921 531607 527260 522269 516866 512033 508371 505453 502628
58753 502628 500136 498855 499055 499938 500556 500792 501266 502513 504467 506662 508711 510577 512528 514939 518172
58738 518172 522438 527553 532858 537638 541759 545774 550358 555752 561694 567615 572893 577219 580939 584812
58724 584812 589237 593778 597563 600065 601433 602233 602954 603667 604175 604609 605836 608967 614398 621459 628982
58709 628982 635977 641845 646363 649577 651467 651641 649694 645878 641008 635551 629167 621324 612061 601932
58695 601932 591474 580855 569826 557999 545494 533360 522938 514642 507728 501361 495465 490327
$$ packed form
58796F19551m480n357o548p520p638o868n818n208n296n641n493m533l117j716
58782E44318m26O94J285J251J253K011L184L747L328K542J880J110n4j306k221
58767E62596k880l656m587n292n383m877m314m347m991n403m833l662k918k825
58753E02628k492j281K00Q83O18K36M74J247J954K195K049J866J951K411L233
58738E18172M266N115N305M780M121M015M584N394N942N921N278M326L720L873
58724E84812M425M541L785K502J368Q00P21P13N08M34J227L131N431P061P523
58709F28982O995N868M518L214J890J74j947l816m870n457o384p843r263j0129
58695F01932j0458j0619j1029j1827j2505j2134j0422q296o914o367n896n138
$$ plain form
58683 490327 485890 481798 477847 474077 470632 467688 465242 462832 459865 456407 453284 451273 450569 451145 452990
58668 452990 455758 458805 461991 465988 471393 478025 485426 493417 501607 508978 514653 518739 521760 523682
58654 523682 524104 523049 520791 517239 512282 506592 501243 496571 492159 487902 484312 481636 479458 477382
58640 477382 475506 473896 472218 470344 468966 469050 470705 472934 474566 475269 475549 475896 476186 476101 475824 475918 476512
58623 476512 477145 477503 477839 478407 479028 479546 480302 481750 483931 486683 489952 493491 496675 499170 501478 504330
58607 504330 507772 511304 514580 517476 519820 521704 523768 526541 529637 532156 533661 534179 533564 531650 528985
58592 528985 526694 525483 525289 525862 527092 528828 530927 533576 537098 541531 546812 553222 560984 569477 577483
58577 577483 584309 590166 595526 600712 606070 611841 617794 623591 629659 637050 646267 656813 668122 680351
$$ packed form
58683D90327m437m092l951l770l445k944k446k410k967l458l123k011p04N76J845
58668D52990K768L047L186L997N405O632P401P991Q190P371N675M086L021J922
58654E23682M22j055k258l552m957n690n349m672m412m257l590k676k178k076
58640D77382j876j610j678j874j378Q4J655K229J632P03K80L47K90q5k77R4N94
58623D76512O33L58L36N68O21N18P56J448K181K752L269L539L184K495K308K852
58607E04330L442L532L276K896K344J884K064K773L096K519J505N18o15j914k665
58592E28985k291j211j94N73J230J736K099K649L522M433N281O410P762Q493Q006
58577E77483O826N857N360N186N358N771N953N797O068P391R217J0546J1309J2229
$$ plain form
58563 680351 693969 709042 725343 742821 761605 781605 802277 822681 841750 858685 873130
58552 873130 884926 893880 899937 903350 904454 903502 901017 897877 894628 890981 886420 880922 874615 867175
58538 867175 858251 848111 837116 824867 810796 795351 779690 764360 749258 734821 722111 711462
58526 711462 702033 693084 684920 678279 673388 669856 666818 663101 658052 652414 647683 644381 641672 638808
58512 638808 636010 633606 631326 628992 627141 626292 626148 626073 625844 625500 625027 624634 624822 625666 626461 626562 626125
58495 626125 625639 625202 624708 624289 624125 624241 624889 626705 630003 634277 638876 643822 649527 655981 662727 669491
58479 669491 676547 684622 694565 706746 720542 734718 748454 761615 773920 784433 792212 796992
58467 796992 798922 798096 794703 789300 782622 775417 768572 762926 758799 756173 755421 757167 761253 766663 772862
$$ packed form
58563F80351J3618J5073J6301J7478J8784K0000K0672K0404J9069J6935J4445
58552H73130J1796Q954O057L413J104r52k485l140l249l647m561n498o307p440
58538H67175q924j0140j0995j2249j4071j5445j5661j5330j5102j4437j2710j0649
58526G11462r429q949q164o641m891l532l038l717n049n638m731l302k709k864
58512F38808k798k404k280k334j851q49j44p5k29l44m73l93J88Q44P95J01m37
58495F26125m86m37m94m19j64J16O48J816L298M274M599M946N705O454O746O764
58479F69491P056Q075R943J2181J3796J4176J3736J3161J2305J0513P779M780
58467G96992J930q26l393n403o678p205o845n646m127k626p52J746M086N410O199
$$ plain form
58452 772862 780438 789826 800115 809773 818002 824706 829649 832468 833245 832351 829870 825715 820110 813512
58438 813512 806325 799180 793148 789022 786470 784427 782323 780567 779895 780611 782490 785197 788770 793627 799935
58423 799935 807021 813836 819989 825904 831914 837770 843090 847620 850833 851934 850657 847549 843251 838133
58409 838133 832800 828019 823674 818645 812394 805927 800518 796190 792320 789074 787231 786883 787316 788092 789458
58394 789458 791684 794662 798170 802086 806326 810838 815506 819868 823341 826012 828701 831762 834338 835403
58380 835403 835123 834493 833997 833370 832553 832183 833045 835495 839387 844305 849932 856379 863981 872656 881910 891683
58364 891683 902659 915300 929010 942660 955615 967918 979921 992127 1004952 1018250 1031349
58353 1031349 1043797 1055584 1066432 1075581 1082687 1088321 1093182 1097480 1101509 1106045 1111615 1117978 1124883
$$ packed form
58452G72862P576R388J0289R658Q229O704M943K819P77q94k481m155n605o598
58438H13512p187p145o032m126k552k043k104j756o72P16J879K707L573M857O308
58423G99935P086O815O153N915O010N856N320M530L213J101j277l108m298n118
58409H38133n333m781m345n029o251o467n409m328l870l246j843l48M33P76J366
58394G89458K226K978L508L916M240M512M668M362L473K671K689L061K576J065
58380H35403k80o30m96o27q17l70Q62K450L892M918N627O447P602Q675R254R773
58364H91683J0976J2641J3710J3650J2955J2303J2003J2206J2825J3298J3099
58353A031349J2448J1787J0848R149P106N634M861M298M029M536N570O363O905
$$ plain form
58340 1124883 1132658 1141535 1151201 1161608 1173371 1186637 1200412 1213886 1227620 1242500 1258303 1274354
58328 1274354 1290832 1308163 1325620 1341851 1356513 1370269 1383335 1395120 1405230 1413915 1421536 1428338
58316 1428338 1434688 1440986 1447507 1454662 1462958 1472215 1481576 1490945 1501606 1514623 1529385 1544688 1560442
58303 1560442 1577125 1594321 1611165 1627889 1645583 1664713 1684997 1706428 1729257 1753117 1777236
58292 1777236 1801331 1825457 1849397 1873157 1897632 1923655 1950761 1977907 2005049 2032975 2062078
58281 2062078 2092394 2124341 2158201 2193268 2228673 2264677 2302072 2340788 2380333 2421062 2463752
58270 2463752 2508355 2554444 2602324 2652386 2703975 2756419 2810697 2868519 2930149 2994578 3061349
58259 3061349 3130646 3202038 3274904 3349829 3427923 3508968 3591699 3675606 3761010 3847959 3936787
$$ packed form
58340A124883P775Q877R666J0407J1763J3266J3775J3474J3734J4880J5803J6051
58328A274354J6478J7331J7457J6231J4662J3756J3066J1785J0110Q685P621O802
58316A428338O350O298O521P155Q296R257R361R369J0661J3017J4762J5303J5754
58303A560442J6683J7196J6844J6724J7694J9130K0284K1431K2829K3860K4119
58292A777236K4095K4126K3940K3760K4475K6023K7106K7146K7142K7926K9103
58281B062078L0316L1947L3860L5067L5405L6004L7395L8716L9545M0729M2690
58270B463752M4603M6089M7880N0062N1589N2444N4278N7822O1630O4429O6771
58259C061349O9297P1392P2866P4925P8094Q1045Q2731Q3907Q5404Q6949Q8828
$$ plain form
58248 3936787 4029251 4127225 4230566 4337949 4449361 4565983 4688260 4816192 4951112 5094953
58238 5094953 5247940 5408988 5578167 5756838 5945858 6145706 6357863 6583845 6823462
58229 6823462 7076395 7344980 7632967 7942128 8272638 8626082 9005182 9411215 9844902
58220 9844902 10309589 10810671 11352514 11939115 12577046 13274241 14036708 14870431 15786013
58211 15786013 16797561 17918098 19161064 20545982 22097829 23841726 25804501 28022366
58203 28022366 30543009 33423145 36734410 40576512 45083286 50422066 56800879 64479968
58195 64479968 73766941 84996599 98522021 114725171 134024182 156855898 183607475
58188 183607475 214424738 248838617 285329949 321161728 352758848 376564413 389968299
$$ packed form
58248C936787R2464R7974J03341J07383J11412J16622J22277J27932J34920J43841
58238E094953J52987J61048J69179J78671J89020J99848K12157K25982K39617
58229F823462K52933K68585K87987L09161L30510L53444L79100M06033M33687
58220I844902M64687N01082N41843N86601O37931O97195P62467Q33723R15582
58211A5786013J011548J120537J242966J384918J551847J743897J962775K217865
58203B8022366K520643K880136L311265L842102M506774N338780O378813P679089
58195F4479968R286973J1229658J3525422J6203150J9299011K2831716K6751577
58188A83607475L0817263L4413879L6491332L5831779L1597120K3805565J3403886
$$ plain form
58181 389968299 391892108 382867880 364695879 339875910 311024699 280454715 249981667
58174 249981667 220902019 194042152 169832306 148401397 129677092 113464266 99499567
58167 99499567 87497553 77187543 68328212 60705058 54129525 48442778 43512535 39223433
58159 39223433 35473669 32179110 29273204 26700236 24411637 22367967 20538514 18896631
58151 18896631 17418017 16083478 14879183 13792687 12811010 11922746 11118986 10391455 9732037
58142 9732037 9134276 8592698 8100282 7648802 7231747 6844828 6483913 6145177 5827396
58133 5827396 5531477 5257150 5002173 4764821 4544764 4341014 4151180 3973353 3806898
58124 3806898 3650999 3504174 3365606 3235305 3112714 2996797 2887654 2786234 2692080 2603070
$$ packed form
58181C89968299J923809r024228j8172001k4819969k8851211l0569984l0473048
58174B49981667k9079648k6859867k4209846k1430909j8724305j6212826j3964699
58167I9499567j2002014j0310010q859331p623154o575533n686747m930243m289102
58159C9223433l749764l294559k905906k572968k288599k043670j829453j641883
58151A8896631j478614j334539j204295j086496r81677q88264q03760p27531o59418
58142I732037n97761n41578m92416m51480m17055l86919l60915l38736l17781
58133E827396k95919k74327k54977k37352k20057k03750j89834j77827j66455
58124C806898j55899j46825j38568j30301j22591j15917j09143j01420r4154q9010
$$ plain form
58114 2603070 2517814 2436768 2360518 2288453 2219666 2153858 2090884 2030436 1972453 1916934 1863327
58103 1863327 1811089 1760693 1712865 1667088 1622179 1578182 1536191 1496379 1457799 1420168 1384308
58092 1384308 1350654 1318825 1288778 1260838 1234374 1208060 1181888 1157367 1135209 1114221 1093083
58081 1093083 1071832 1050928 1030142 1009220 988653 968987 950086 931654 913784 896584 879932
58070 879932 863903 848716 834107 819592 805464 792544 780740 768971 756926 745758 736483 728543
58058 728543 720550 711679 701820 691125 680013 669069 658421 647693 636810 626323 616642 607544
58046 607544 598699 590177 582267 575239 569326 564362 559536 554239 549038 544909 541546 537543 532376 527006
58032 527006 522157 517157 511057 503904 496267 488292 479944 471512 463212 454796 446145 437738 430098 423225
$$ packed form
58114B603070q5256q1046p6250p2065o8787o5808o2974o0448n7983n5519n3607
58103A863327n2238n0396m7828m5777m4909m3997m1991l9812l8580l7631l5860
58092A384308l3654l1829l0047k7940k6464k6314k6172k4521k2158k0988k1138
58081A093083k1251k0904k0786k0922k0567j9666j8901j8432j7870j7200j6652
58070H79932j6029j5187j4609j4515j4128j2920j1804j1769j2045j1168r275p940
58058G28543p993q871r859j0695j1112j0944j0648j0728j0883j0487r681r098
58046F07544q845q522p910p028n913m964m826n297n201m129l363m003n167n370
58032E27006m849n000o100p153p637p975q348q432q300q416q651q407p640o873
$$ plain form
58018 423225 416974 411496 406863 402751 398907 395487 392590 389884 387061 384267 381824 379903 378626 378011
58004 378011 377700 377309 377120 377723 378842 379390 379008 378708 379544 381348 383284 384807 385403 384085 380082 373764
57988 373764 366278 358484 350699 343154 336115 329727 324090 319266 314973 310625 306027 301694 298166 295425
57974 295425 293271 291787 290988 290425 289639 288748 288154 287969 288109 288615 289427 290099 290251 290104 290205 290787 291706 292817
57956 292817 293970 294824 295094 294945 294787 294687 294225 292991 291101 289158 287732 286865 286110 285188 284428 284418 285363
57939 285363 287140 289795 293518 298152 303185 308264 313357 318461 323590 328952 334562 339701 343340 345181
57925 345181 345687 345095 343041 339265 334014 327607 320318 312874 306272 300792 295860 291184 287258 284346 281811
57910 281811 279054 276439 274622 273541 272756 272352 272712 273693 274686 275322 275645 275786 275924 276346 277107 277912 278718
$$ packed form
58018D23225o251n478m633m112l844l420k897k706k823k794k443j921j277o15
58004C78011l11l91j89O03J119N48l82l00Q36J804J936J523N96j318m003o318
57988C73764p486p794p785p545p039o388n637m824m293m348m598m333l528k741
57974B95425k154j484p99n63p86q91n94j85J40N06Q12O72J52j47J01N82R19J111
57956B92817J153Q54K70j49j58j00m62j234j890j943j426q67p55r22p60j0R45
57939B85363J777K655L723M634N033N079N093N104N129N362N610N139L639J841
57925C45181N06n92k054l776n251o407p289p444o602n480m932m676l926k912k535
57910B81811k757k615j817j081p85m04L60R81R93O36L23J41J38M22P61Q05Q06
$$ plain form
57893 278718 280197 283080 287147 291293 294465 296323 297224 297905 299009 300603 302180 303170 303242 302201 300089
57878 300089 297472 295017 292630 289615 285862 282169 279039 276001 272608 269379 267125 265929 265396 265270 265114
57863 265114 264079 261970 260064 259883 261429 263471 265356 267622 271014 275762 281729 288386 294596 299259
57849 299259 302379 304937 307714 310762 313914 317038 319700 321273 321544 320736 318953 316194 313028 310509 309118
57834 309118 308209 306781 304433 301435 298183 294828 291295 287607 284234 281907 280789 280121 279110 277938 277387
57819 277387 277729 278644 280059 282225 284852 286858 287223 285613 282116 276968 270769 264315 257878 251095 243817
57804 243817 236616 230209 224883 220771 218134 216837 215924 214345 212066 210002 208907 208714 208954 209414 210201
57789 210201 211379 212799 214283 215889 217942 220803 224574 228958 233365 237261 240572 243770 247463 251896
$$ packed form
57893B78718J479K883M067M146L172J858R01O81J104J594J577R90P2j041k112
57878C00089k617k455k387l015l753l693l130l038l393l229k254j196n33j26j56
57863B65114j035k109j906j81J546K042J885K266L392M748N967O657O210M663
57849B99259L120K558K777L048L152L124K662J573K71q08j783k759l166k519j391
57834C09118r09j428k348k998l252l355l533l688l373k327j118o68j011j172n51
57819B77387L42R15J415K166K627K006L65j610l497n148o199o454o437o783p278
57804B43817p201o407n326m112k637j297r13j579k279k064j095j93K40M60P87
57789B10201J178J420J484J606K053K861L771M384M407L896L311L198L693M433
$$ plain form
57775 251896 256916 262286 267797 273173 278182 282831 287035 290171 291496 291175 290309 289682 288981 287629 285759
57760 285759 283829 281788 279305 276494 273780 271302 269058 267371 266470 265839 264714 263171 262043 261832 262318
57745 262318 263137 263981 264314 263795 263059 263241 264467 265568 265568 264750 263993 263835 264611 266753 270192 273910 276752
57728 276752 278542 279971 281645 283641 285784 287865 289697 291311 293051 295214 297647 299939 301895 303587
57714 303587 304999 305880 306065 305813 305651 305771 305675 304664 302699 300409 298089 295213 291405 287402 284363 282491
57698 282491 281172 280292 280364 281242 281765 281160 279908 278647 276980 274189 270602 267354 265016 263124 260998 258414
57682 258414 255567 252972 251431 251678 253881 257752 263089 270029 278901 290249 304941 323898 347701
57669 347701 376692 411415 452542 500045 552260 605463 654185 692328 714948 719892 708243 683378
$$ packed form
57775B51896N020N370N511N376N009M649M204L136J325l21q66o27p01j352j870
57760B85759j930k041k483k811k714k478k244j687r01o31j125j543j128k11M86
57745B62318Q19Q44L33n19p36J82J226J101%q18p57j58P76K142L439L718K842
57728B76752J790J429J674J996K143K081J832J614J740K163K433K292J956J692
57714C03587J412Q81J85k52j62J20r6j011j965k290k320k876l808m003l039j872
57698B82491j319q80P2Q78N23o05j252j261j667k791l587l248k338j892k126k584
57682B58414k847k595j541K47K203L871N337O940Q872J1348J4692J8957K3803
57669C47701K8991L4723M1127M7503N2215N3203M8722L8143K2620M944j1649k4865
$$ plain form
57657 683378 649437 610202 568791 527808 489318 454511 423620 396433 372859 352817 335843
57646 335843 321347 309312 300169 293760 288889 284276 279701 275862 273339 272024 271356 270787 270148 269846 270563
57631 270563 272413 274573 276073 276872 277695 278854 279688 279428 278210 276855 275777 274580 272809 270718 268963
57616 268963 267715 266514 265055 263658 262745 262214 261693 261160 260905 261059 261570 262499 263827 265084 265711 265859 266241
57599 266241 267070 267643 267211 265790 263948 262189 260846 260138 259982 259974 259824 259547 259106 258172 256560 254621 252975
57582 252975 252054 252038 252906 254311 255659 256526 256819 256487 255491 254181 253253 253026 253114 253027 252682 252140 251387 250695 250681
57563 250681 251473 252255 252145 251249 250367 250066 250544 252003 254406 257102 259363 261264 263494 266384 269610 272747
57547 272747 275559 277808 279326 280345 281266 282122 282693 283129 283948 285359 287063 288803 290725 293050 295675
$$ packed form
57657F83378l3941l9235m1411m0983l8490l4807l0891k7187k3574k0042j6974
57646C35843j4496j2035r143o409m871m613m575l839k523j315o68n69o39l02P17
57631B70563J850K160J500P99Q23J159Q34k60j218j355j078j197j771k091j755
57616B68963j248j201j459j397r13n31n21n33k55J54N11R29J328J257O27J48L82
57599B66241Q29N73m32j421j842j759j343p08j56qj50k77m41r34j612j939j646
57582B52975r21j6Q68J405J348Q67K93l32r96j310r28k27Q8q7l45n42p53o92j4
57563B50681P92P82j10q96q82l01M78J459K403K696K261J901K230K890L226L137
57547B72747K812K249J518J019R21Q56N71M36Q19J411J704J740J922K325K625
$$ plain form
57532 295675 298182 300072 301135 301841 303131 305383 307756 309115 309528 310220 312040 314578 316939 318823 320586
57517 320586 322698 325450 328795 332191 334929 336865 338527 340311 341927 342982 343765 344983 346832 348790
57503 348790 350365 351678 353112 354643 355857 356511 356777 356822 356540 355927 355411 355333 355297 354712 353904 353944 355141 356499
57485 356499 357087 357232 357758 358761 359986 361801 364767 368427 371641 374050 376306 378781 381010 382629 383956
57470 383956 385249 386102 386020 385159 384172 383719 384239 385717 387581 389325 391246 393910 396917 399080 400077 401023
57454 401023 403061 406246 410250 415110 420470 425004 427709 429362 431666 435229 439232 442845 446004 448866
57440 448866 451483 454236 457825 462488 467639 472501 476824 480892 485108 489600 494002 497698 500550 503223
57426 503223 506483 510370 514471 518741 523506 528720 533863 538538 542664 546066 548579 550682 553394 557204
$$ packed form
57532B95675K507J890J063P06J290K252K373J359M13O92J820K538K361J884J763
57517C20586K112K752L345L396K738J936J662J784J616J055P83J218J849J958
57503C48790J575J313J434J531J214O54K66M5k82o13n16p8l6n85q08M0J197J358
57485C56499N88J45N26J003J225J815K966L660L214K409K256K475K229J619J327
57470C83956J293Q53q2q61r87m53N20J478J864J744J921K664L007K163R97R46
57454D01023K038L185M004M860N360M534K705J653K304L563M003L613L159K862
57440D48866K617K753L589M663N151M862M323M068M216M492M402L696K852K673
57426E03223L260L887M101M270M765N214N143M675M126L402K513K103K712L810
$$ plain form
57412 557204 561553 565611 569154 572374 575336 578102 581105 584887 589438 594130 598384 602286 606596 612138
57398 612138 619016 626314 632783 637890 642096 646084 650089 654111 658368 663106 668182 673330 678757 685025
57384 685025 692238 699784 707106 714412 722299 730828 739352 747241 754426 761157 767535 773529 779234 784774
57370 784774 790072 795051 800030 805496 811382 816944 821678 826094 831221 837508 844531 851703 858814 865900
57356 865900 873016 880329 888079 896229 904388 912332 920411 929155 938578 948144 957320 965891 973797 981033
57342 981033 987906 995081 1003103 1011941 1021155 1030441 1039830 1049428 1059152 1068719 1077718 1085749 1092768 1099376
57328 1099376 1106496 1114610 1123458 1132603 1141979 1151637 1161224 1170148 1178305 1186251 1194610 1203580 1213045 1222834
57314 1222834 1232723 1242483 1252124 1261978 1272346 1283114 1293784 1303757 1312642 1320560 1328289 1336823 1346648
$$ packed form
57412E57204M349M058L543L220K962K766L003L782M551M692M254L902M310N542
57398F12138O878P298O469N107M206L988M005M022M257M738N076N148N427O268
57384F85025P213P546P322P306P887Q529Q524P889P185O731O378N994N705N540
57370G84774N298M979M979N466N886N562M734M416N127O287P023P172P111P086
57356H65900P116P313P750Q150Q159P944Q079Q744R423R566R176Q571P906P236
57342I81033O873P175Q022Q838R214R286R389R598R724R567Q999Q031P019O608
57328A099376P120Q114Q848R145R376R658R587Q924Q157P946Q359Q970R465R789
57314A222834R889R760R641R854J0368J0768J0670R973Q885P918P729Q534R825
$$ plain form
57301 1346648 1357536 1369067 1381029 1393212 1405217 1416785 1428061 1439237 1450154 1460622 1470942
57290 1470942 1481670 1492935 1504354 1515613 1526783 1538035 1549406 1560919 1572645 1584560 1596531
57279 1596531 1608512 1620588 1632846 1645400 1658481 1672206 1686251 1700116 1713773 1727732 1742340
57268 1742340 1757383 1772514 1787731 1803151 1818617 1833854 1848794 1863432 1877626 1891460 1905563
57257 1905563 1920457 1935636 1949908 1962872 1975485 1988849 2002950 2017085 2031091 2045369 2059851
57246 2059851 2073708 2086361 2098187 2110012 2122383 2135570 2149637 2164010 2177521 2189638 2201348
57235 2201348 2214060 2227775 2241155 2253323 2264693 2275882 2286851 2297660 2309111 2321786 2334928
57224 2334928 2347246 2358571 2369877 2381755 2393721 2405172 2416286 2427619 2439260 2450767 2461692
$$ packed form
57301A346648J0888J1531J1962J2183J2005J1568J1276J1176J0917J0468J0320
57290A470942J0728J1265J1419J1259J1170J1252J1371J1513J1726J1915J1971
57279A596531J1981J2076J2258J2554J3081J3725J4045J3865J3657J3959J4608
57268A742340J5043J5131J5217J5420J5466J5237J4940J4638J4194J3834J4103
57257A905563J4894J5179J4272J2964J2613J3364J4101J4135J4006J4278J4482
57246B059851J3857J2653J1826J1825J2371J3187J4067J4373J3511J2117J1710
57235B201348J2712J3715J3380J2168J1370J1189J0969J0809J1451J2675J3142
57224B334928J2318J1325J1306J1878J1966J1451J1114J1333J1641J1507J0925
$$ plain form
57213 2461692 2471967 2481902 2491871 2501842 2511261 2519710 2527601 2535881 2544995 2554595 2564220 2573793 2583302 2592588
57199 2592588 2601754 2611319 2621584 2632193 2642702 2653247 2664258 2675869 2688074 2701153 2715243 2729724
57187 2729724 2743858 2758118 2774056 2792398 2811926 2830783 2848497 2866017 2884037 2902109 2919501
57176 2919501 2936167 2952387 2967949 2982319 2995462 3007939 3020128 3031867 3043033 3054010 3065165
57165 3065165 3076058 3085618 3093166 3099029 3104139 3109261 3114646 3120108 3125216 3129454 3132404 3133929 3134201 3133610
57151 3133610 3132547 3131191 3129516 3127499 3125254 3122828 3119995 3116468 3112304 3107894 3103507 3099112 3094751 3090917
57137 3090917 3088386 3087823 3089639 3094034 3100918 3109818 3120113 3131449 3143874 3157686 3173299 3191116 3211201
57124 3211201 3233008 3255792 3279483 3304952 3333148 3364137 3397355 3432790 3471624 3515723 3566783
$$ packed form
57213B461692J0275R935R969R971R419Q449P891Q280R114R600R625R573R509R286
57199B592588R166R565J0265J0609J0509J0545J1011J1611J2205J3079J4090J4481
57187B729724J4134J4260J5938J8342J9528J8857J7714J7520J8020J8072J7392
57176B919501J6666J6220J5562J4370J3143J2477J2189J1739J1166J0977J1155
57165C065165J0893R560P548N863N110N122N385N462N108M238K950J525K72n91
57151C133610j063j356j675k017k245k426k833l527m164m410m387m395m361l834
57137C090917k531n63J816M395O884Q900J0295J1336J2425J3812J5613J7817K0085
57124C211201K1807K2784K3691K5469K8196L0989L3218L5435L8834M4099N1060
$$ plain form
57113 3566783 3626085 3694659 3773434 3863506 3966631 4085309 4222099 4379048 4558358 4763846
57103 4763846 5001658 5279893 5608204 5998162 6463817 7021911 7692165 8497897 9466294
57094 9466294 10627425 12012193 13649819 15565190 17776074 20290607 23105430 26204553
57086 26204553 29558738 33125283 36847988 40657008 44467894 48178098 51660331 54758012
57078 54758012 57294576 59104272 60074570 60175460 59457497 58024270 56000993 53514741
57070 53514741 50685893 47623959 44425359 41173804 37941664 34789840 31766686 28908299
57062 28908299 26240099 23777870 21528151 19489435 17654279 16010910 14544061 13236216
57054 13236216 12069559 11027419 10094524 9256886 8502114 7819841 7201732 6641108 6132411
$$ packed form
57113C566783N9302O8574P8775R0072J03125J18678J36790J56949J79310K05488
57103D763846K37812K78235L28311L89958M65655N58094O70254Q05732R68397
57094I466294J161131J384768J637626J915371K210884K514533K814823L099123
57086B6204553L354185L566545L722705L809020L810886L710204L482233L097681
57078E4758012K536564J809696R70298J00890p17963j433227k023277k486252
57070E3514741k828848l061934l198600l251555l232140l151824l023154k858387
57062B8908299k668200k462229k249719k038716j835156j643369j466849j307845
57054A3236216j166657j042140r32895q37638p54772o82273o18109n60624n08697
$$ plain form
57045 6132411 5670540 5250441 4867373 4517640 4198840 3909200 3646667 3408692 3192862
57036 3192862 2997651 2822493 2667085 2530742 2412621 2312660 2232031 2172327 2133963 2114812
57026 2114812 2109537 2109562 2104055 2082331 2037149 1967197 1877127 1774967 1668539 1563223 1462054
57015 1462054 1367027 1279761 1201143 1131048 1068760 1013397 963815 918603 876694 837951 802872
57004 802872 771756 744267 719665 697180 676222 656424 637533 619400 602225 586712 573469
56993 573469 562127 551572 541312 532136 525011 519825 515873 513204 512739 515091 519868 525982 531912 535694
56979 535694 535559 531025 522966 512396 499663 485000 469268 453732 439413 426927 416532 408005
56967 408005 400820 394854 390672 388913 389765 393319 399922 409632 421659 434996 449331 464611 479705
$$ packed form
57045F132411m61871m20099l83068l49733l18800k89640k62533k37975k15830
57036C192862j95211j75158j55408j36343j18121r9961q0629n9704l8364j9151
57026B114812n275K5n507k1724m5182o9952r0070j02160j06428j05316j01169
57015A462054r5027q7266p8618p0095o2288n5363m9582m5212m1909l8743l5079
57004H02872l1116k7489k4602k2485k0958j9798j8891j8133j7175j5513j3243
56993E73469j1342j0555j0260r176p125n186l952k669m65K352M777O114N930L782
56979E35694j35m534q059j0570j2733j4663j5732j5536j4319j2486j0395q527
56967D08005p185n966m182j759Q52L554O603R710J2027J3337J4335J5280J5094
$$ plain form
56954 479705 492222 499929 501978 498703 490759 478830 463798 446777 428983 411627 395715 381723
56942 381723 369629 359435 351573 346684 345080 346553 350671 357280 366877 380443 398590 420647 444670
56929 444670 468305 489365 505579 514534 514672 506420 491926 473598 453049 431265 409131 387489
56917 387489 366960 347993 330943 315978 303028 291932 282417 273879 265559 257271 249737 243843 239604
56904 239604 236152 232711 229292 226388 224339 223131 222698 223179 224844 227792 231771 236426 241766 248246 256301
56889 256301 266039 277575 291386 307830 326256 344870 361542 374564 382872 386134 384882 380230
56877 380230 373179 364354 354454 344576 335834 328905 324135 321817 322095 324910 330424 339435 353022 371805
56863 371805 395746 424576 458223 496745 539696 585075 628699 665188 690349 702830 703497 693768
$$ packed form
56954D79705J2517P707K049l275p944j1929j5032j7021j7794j7356j5912j3992
56942C81723j2094j0194p862m889j604J473M118O609R597J3566J8147K2057K4023
56929D44670K3635K1060J6214Q955J38q252j4494j8328k0549k1784k2134k1642
56917C87489k0529j8967j7050j4965j2950j1096r515q538q320q288p534n894m239
56904B39604l452l441l419k904k049j208m33M81J665K948L979M655N340O480Q055
56889B56301R738J1536J3811J6444J8426J8614J6672J3022Q308L262j252m652
56877C80230p051q825r900r878q742o929m770k318K78K815N514R011J3587J8783
56863C71805K3941K8830L3647L8522M2951M5379M3624L6489K5161J2481O67r729
$$ plain form
56851 693768 675222 650422 622874 595569 569990 546847 527301 512907 504612 502321 505532 514242
56839 514242 529378 552579 585405 628490 681382 743079 812025 884902 955525 1015769 1058396
56828 1058396 1079439 1078493 1057658 1020654 972310 917695 861059 805503 753454 706906 666971 633642
56816 633642 606554 585921 572523 567023 569808 581436 602621 633428 672680 718201 767113 815504
56804 815504 858189 889587 905384 903722 885363 853206 811433 764416 715737 667873 622446 580581
56792 580581 543150 510937 484608 464379 449827 440245 435205 434732 439100 448652 463597 483529 506868
56779 506868 530872 552254 567905 575449 573689 562817 544140 519502 490872 460156 429052 398854
56767 398854 370413 344158 320165 298388 278951 262054 247511 234706 223270 213456 205457 198635
$$ packed form
56851F93768j8546k4800k7548k7305k5579k3143j9546j4394q295k291L211Q710
56839E14242J5136K3201L2826M3085N2892O1697O8946P2877P0623O0244M2627
56828A058396K1043r46k0835l7004m8344n4615n6636n5556n2049m6548l9935l3329
56816F33642k7088k0633j3398n500K785J1628K1185L0807L9252M5521M8912M8391
56804H15504M2685L1398J5797j662j8359l2157m1773m7017m8679m7864m5427m1865
56792E80581l7431l2213k6329k0229j4552r582n040m73M368R552J4945J9932K3339
56779E06868K4004K1382J5651P544j760j0872j8677k4638k8630l0716l1104l0198
56767C98854k8441k6255k3993k1777j9437j6897j4543j2805j1436r814p999o822
$$ plain form
56755 198635 191915 184830 177739 171164 165478 161120 158419 157030 156066 155000 153984 153103 151903 150030 147936
56740 147936 146464 145858 145514 144628 142926 140851 139151 138184 137626 136953 136123 135487 135179 135082 135363 136417 138103
56723 138103 139555 140064 139719 138952 137976 137040 136709 137365 138707 140139 141383 142308 142599 142130 141404 141105 141400
56706 141400 142137 143351 144954 146214 146380 145872 146067 147769 150395 152783 154200 154459 153689 152367 151104 150015
56690 150015 148646 146801 145085 144276 144482 145263 146300 147505 148684 149562 150180 150894 151897 153051 154251 155665
56674 155665 157377 159015 159988 160116 159797 159574 159698 160261 161455 163373 165608 167432 168481 168972 169160 168947
56658 168947 168319 167774 167850 168399 168803 168874 169063 169743 170716 171549 171989 171877 171028 169480 167630 165837 164082 162232
56640 162232 160382 158679 156957 154948 152755 150777 149090 147258 144963 142614 141102 140972 141998 143581
$$ packed form
56755A98635o720p085p091o575n686m358k701j389r64j066j016q81j200j873k094
56740A47936j472o06l44q86j702k075j700r67n58o73q30o36l08r7K81J054J686
56723A38103J452N09l45p67r76r36l31O56J342J432J244R25K91m69p26k99K95
56706A41400P37J214J603J260J66n08J95J702K626K388J417K59p70j322j263j089
56690A50015j369j845j716q09K06P81J037J205J179Q78O18P14J003J154J200J414
56674A55665J712J638R73J28l19k23J24N63J194J918K235J824J049M91J88k13
56658A68947o28n45P6N49M04P1J89O80R73Q33M40j12q49j548j850j793j755j850
56640A62232j850j703j722k009k193j978j687j832k295k349j512j30J026J583
$$ plain form
56626 143581 145389 147469 149811 151998 153449 154015 154240 154954 156568 158707 160522 161434 161577 161470 161299 160763
56610 160763 159707 158667 158469 159346 160674 161617 161794 161367 160728 160284 160323 160852 161547 161994 162022 161775 161448 161045
56592 161045 160441 159680 159055 158750 158476 157792 156783 156164 156520 157668 158990 160093 160849 161069 160679 160151 160219 161009
56574 161009 161865 162193 162166 162428 163436 165261 167717 170453 173208 176264 180423 186179 193054 200128 207179
56559 207179 215003 224498 235508 246574 255761 261862 265026 266280 266468 265739 264046 261788 259648 257954
56545 257954 256423 254557 252134 249370 246735 244468 242246 239500 236252 233325 231459 230405 229296 227719
56531 227719 225974 224380 222873 221389 220141 219333 218925 218824 218910 218725 217614 215498 213149 211352 210110 208990
56515 208990 207851 206701 205203 203015 200540 198649 197570 196667 195451 194231 193431 192851 192037 191035 190301
$$ packed form
56626A43581J808K080K342K187J451N66K25P14J614K139J815R12J43j07j71n36
56610A60763j056j040j98Q77J328R43J77m27o39m44L9N29O95M47K8k47l27m03
56592A61045o04p61o25l05k74o84j009o19L56J148J322J103P56K20l90n28O8P90
56574A61009Q56L28k7K62J008J825K456K736K755L056M159N756O875P074P051
56559B07179P824R495J1010J1066R187O101L164J254J88p29j693k258k140j694
56545B57954j531j866k423k764k635k267k222k746l248k927j866j054j109j577
56531B27719j745j594j507j484j248q08m08j01Q6j85j111k116k349j797j242j120
56515B08990j139j150j498k188k475j891j079r03j216j220q00n80q14j002p34
$$ plain form
56500 190301 190086 190317 190882 191573 191849 191203 189798 188379 187449 186801 185981 185000 184406 184772 186182 188070 189583
56483 189583 190210 190121 189833 189649 189599 189795 190513 191799 193258 194425 195313 196421 198186 200403 202256 203046 202921
56466 202921 202703 202935 203332 203379 203136 203079 203374 203760 204085 204471 204927 205281 205584 206161 207071 207883 208132 207699 206710
56447 206710 205510 204823 205389 207083 208813 209657 209797 210048 210846 212054 213377 214481 214940 214582 213783 213069 212589
56430 212589 212290 212388 213195 214609 216195 217610 218630 218947 218510 217964 218244 219611 221485 223149 224262 224681
56414 224681 224307 223245 221835 220442 219416 219150 219797 220927 221781 221930 221459 220685 220106 220385 221814 223756
56398 223756 225206 225967 226695 227720 228545 228777 228894 229586 230868 232359 234061 236187 238466 240262 241410 242425
56382 242425 243746 245236 246568 247758 248978 250040 250463 250140 249645 249693 250409 251411 252493 253794 255287 256607
$$ packed form
56500A90301k15K31N65O91K76o46j405j419r30o48q20r81n94L66J410J888J513
56483A89583O27q9k88j84n0J96P18J286J459J167Q88J108J765K217J853P90j25
56466B02921k18K32L97M7k43n7K95L86L25L86M56L54L03N77R10Q12K49m33r89
56447B06710j200o87N66J694J730Q44J40K51P98J208J323J104M59l58p99p14m80
56430B12589k99R8Q07J414J586J415J020L17m37n46K80J367J874J664J113M19
56414B24681l74j062j410j393j026k66O47J130Q54J49m71p74n79K79J429J942
56398B23756J450P61P28J025Q25K32J17O92J282J491J702K126K279J796J148J015
56382B42425J321J490J332J190J220J062M23l23m95M8P16J002J082J301J493J320
$$ plain form
56366 256607 257678 259038 261037 263136 264599 265607 266948 268737 270249 271059 271488 271787 271758 271539 271917 273290
56350 273290 275026 276503 278126 280466 282904 284154 284019 283624 283852 284424 284833 285367 286622 288502 290384 292110
56334 292110 294243 297190 300524 303445 305778 308208 311461 315473 319505 322971 325992 329196 333186 338080
56320 338080 343308 347824 350838 352392 353044 353047 352273 350964 349978 349893 350234 350090 349321 348759 349262 350887 353033
56303 353033 355164 357359 360248 364292 369109 373744 377758 381749 386551 392174 397908 403236 408175 412832
56289 412832 417188 421412 425980 431247 437136 443415 450113 457477 465595 474223 482998 491827 501046 511117
56275 511117 522110 533614 545299 557427 570622 585199 600966 617695 635552 654952 676079
56264 676079 698715 722570 747732 774825 804765 838424 876471 919346 967311 1020687 1080249
$$ packed form
56366B56607J071J360J999K099J463J008J341J789J512Q10M29K99k9k19L78J373
56350B73290J736J477J623K340K438J250j35l95K28N72M09N34J255J880J882J726
56334B92110K133K947L334K921K333K430L253M012M032L466L021L204L990M894
56320C38080N228M516L014J554O52Lp74j309r86q5L41j44p69n62N03J625K146
56303C53033K131K195K889M044M817M635M014L991M802N623N734N328M939M657
56289D12832M356M224M568N267N889O279O698P364Q118Q628Q775Q829R219J0071
56275E11117J0993J1504J1685J2128J3195J4577J5767J6729J7857J9400K1127
56264F76079K2636K3855K5162K7093K9940L3659L8047M2875M7965N3376N9562
$$ plain form
56253 1080249 1147286 1223046 1308223 1403180 1508485 1624792 1752259 1890524 2039183 2197651
56243 2197651 2364354 2536606 2711579 2886802 3059286 3224730 3378252 3515671 3633507
56234 3633507 3728211 3796440 3836363 3848134 3832877 3791704 3725990 3638154 3531714 3410610 3278464
56223 3278464 3138220 2992277 2843087 2693661 2547171 2405813 2270210 2140162 2015861
56214 2015861 1898143 1787683 1684441 1588101 1498711 1416459 1340913 1271017 1206012 1145982 1091247
56203 1091247 1041603 996589 956106 920135 887949 858339 830791 805797 783788 764303 746538
56192 746538 730186 715303 701769 689388 678265 668620 660346 653113 646715 641035 635908 631356 627739
56179 627739 625263 623517 621877 620210 618816 617799 616917 616057 615523 615841 617442 620419 624301 628156 631220
$$ packed form
56253A080249O7037P5760Q5177R4957J05305J16307J27467J38265J48659J58468
56243B197651J66703J72252J74973J75223J72484J65444J53522J37419J17836
56234C633507R4704O8229L9923J1771j5257m1173o5714q7836j06440j21104j32146
56223C278464j40244j45943j49190j49426j46490j41358j35603j30048j24301
56214B015861j17718j10460j03242r6340q9390q2252p5546o9896o5005o0030n4735
56203A091247m9644m5014m0483l5971l2186k9610k7548k4994k2009j9485j7765
56192G46538j6352j4883j3534j2381j1123r645q274p233o398n680n127m552l617
56179F27739k476j746j640j667j394j017q82q60n34L18J601K977L882L855L064
$$ plain form
56164 631220 633501 635725 638799 643360 649483 656639 664117 671716 679772 688458 697584 707343 718680 732316
56150 732316 747820 764357 782214 802953 828058 858051 892964 933144 979367 1032392 1092432
56139 1092432 1158747 1229658 1303026 1376658 1448236 1515340 1576194 1630527 1679490 1724766 1767737
56128 1767737 1808991 1848014 1883347 1913350 1936901 1953491 1963183 1966818 1965778 1960868 1951453 1935900
56116 1935900 1912577 1880127 1837469 1784448 1722566 1654664 1583891 1513159 1445009 1381226 1322642
56105 1322642 1269786 1223475 1184205 1151258 1123207 1099308 1079765 1064686 1053410 1044967 1038689 1034270
56093 1034270 1031639 1030865 1031838 1034008 1036658 1039424 1042426 1046071 1050858 1056998 1064044 1071314 1078859 1087351
56079 1087351 1096807 1106277 1115355 1124980 1135954 1147579 1158920 1170604 1183978 1198989 1214351 1229544
$$ packed form
56164F31220K281K224L074M561O123P156P478P599Q056Q686R126R759J1337J3636
56150G32316J5504J6537J7857K0739K5105K9993L4913M0180M6223N3025O0040
56139A092432O6315P0911P3368P3632P1578O7104O0854N4333M8963M5276M2971
56128A767737M1254L9023L5333L0003K3551J6590R692L635j040m910r415j5553
56116A935900k3323l2450m2658n3021o1882o7902p0773p0732o8150o3783n8584
56105A322642n2856m6311l9270l2947k8051k3899j9543j5079j1276q443o278m419
56093A034270k631p74R73K170K650K766L002L645M787O140P046P270P545Q492
56079A087351R456R470R078R625J0974J1625J1341J1684J3374J5011J5362J5193
$$ plain form
56067 1229544 1245198 1261603 1278254 1294981 1312257 1330220 1348507 1367188 1386788 1407268 1428060
56056 1428060 1449228 1471511 1495059 1519262 1543907 1569333 1595203 1620308 1643988 1666683 1688837
56045 1688837 1710403 1731829 1754359 1778766 1804598 1831143 1858369 1886606 1916104 1947211 1980204
56034 1980204 2014794 2050557 2087893 2127566 2169321 2212072 2255563 2300632 2347629 2395877 2444980
56023 2444980 2495466 2547795 2601866 2657744 2715697 2775321 2835956 2898266 2964043 3034110 3107767
56012 3107767 3184539 3264970 3349348 3437259 3528864 3625040 3725750 3829963 3937749 4050772
56002 4050772 4170093 4295218 4426051 4563948 4709956 4863760 5025334 5195907 5376300
55993 5376300 5566040 5765208 5975618 6199188 6436721 6689221 6958679 7246673 7553934
$$ packed form
56067A229544J5654J6405J6651J6727J7276J7963J8287J8681J9600K0480K0792
56056A428060K1168K2283K3548K4203K4645K5426K5870K5105K3680K2695K2154
56045A688837K1566K1426K2530K4407K5832K6545K7226K8237K9498L1107L2993
56034A980204L4590L5763L7336L9673M1755M2751M3491M5069M6997M8248M9103
56023B444980N0486N2329N4071N5878N7953N9624O0635O2310O5777P0067P3657
56012C107767P6772Q0431Q4378Q7911R1605R6176J00710J04213J07786J13023
56002D050772J19321J25125J30833J37897J46008J53804J61574J70573J80393
55993E376300J89740J99168K10410K23570K37533K52500K69458K87994L07261
$$ plain form
55984 7553934 7882108 8233981 8611276 9014514 9446049 9910845 10413290 10956006 11543127
55975 11543127 12181988 12880155 13643916 14481591 15405486 16428813 17564051 18826916 20239298
55966 20239298 21826715 23617110 25645641 27958591 30612132 33674246 37234655 41413473
55958 41413473 46363039 52272397 59377893 67964059 78346461 90855958 105843610 123695537
55950 123695537 144831531 169655659 198393555 230746306 265432397 299920345 330697940
55943 330697940 354117275 367432001 369505004 360912423 343531220 319890456 292558722
55936 292558722 263738623 235110217 207848190 182697462 160046370 140003165 122484976
55929 122484976 107298930 94197656 82917128 73206597 64844108 57634587 51404617
$$ packed form
55984G553934L28174L51873L77295M03238M31535M64796N02445N42716N87121
55975A1543127O38861O98167P63761Q37675R23895J023327J135238J262865J412382
55966B0239298J587417J790395K028531K312950K653541L062114L560409M178818
55958D1413473M949566N909358P105496Q586166J0382402J2509497J4987652J7851927
55950A23695537K1135994K4824128K8737896L2352751L4686091L4487948L0777595
55943C30697940K3419335J3314726K073003q592581j7381203k3640764k7331734
55936B92558722k8820099k8628406k7262027k5150728k2651092k0043205j7518189
55929A22484976j5186046j3101274j1280528r710531q362489p209521o229970
$$ plain form
55922 51404617 46004510 41310124 37216803 33632853 30480284 27696939 25232826 23045154
55914 23045154 21097910 19362156 17812647 16425263 15179199 14058815 13050678 12140622
55906 12140622 11315678 10566586 9885933 9265517 8697637 8177174 7700098 7261333 6856050
55897 6856050 6481641 6136411 5817561 5522244 5249307 4998050 4766285 4551405 4352313
55888 4352313 4168607 3998877 3841577 3696591 3563986 3441695 3326037 3214104 3104397
55879 3104397 2995931 2888407 2783007 2681594 2585164 2493829 2407673 2326510 2249313 2175019
55869 2175019 2103532 2035085 1969241 1905559 1844696 1787674 1734467 1684339 1637149 1593142 1551690
55858 1551690 1511368 1471333 1431924 1394004 1358336 1325324 1294635 1265198 1236125 1207426 1179400
$$ packed form
55922E1404617n400107m694386m093321l583950l152569k783345k464113k187672
55914B3045154j947244j735754j549509j387384j246064j120384j008137r10056
55906A2140622q24944p49092o80653o20416n67880n20463m77076m38765m05283
55897F856050l74409l45230l18850k95317k72937k51257k31765k14880j99092
55888D352313j83706j69730j57300j44986j32605j22291j15658j11933j09707
55879C104397j08466j07524j05400j01413r6430r1335q6156q1163p7197p4294
55869B175019p1487o8447o5844o3682o0863n7022n3207n0128m7190m4007m1452
55858A551690m0322m0035l9409l7920l5668l3012l0689k9437k9073k8699k8026
$$ plain form
55847 1179400 1151785 1124064 1096206 1068545 1041250 1014450 988479 963586 939779 917345 896932
55836 896932 878656 861706 845335 829615 814769 800543 786848 774226 762878 752028 741048
55825 741048 730448 720740 711030 699968 687702 675660 664580 653822 642567 630725 618662 606821
55813 606821 595668 585360 575529 565934 557093 549674 543490 537794 532336 527475 523544 520872 520120 521685
55799 521685 524835 528222 531199 533922 536319 537821 538163 537649 536547 534872 532798 530581 528031 524808 521379
55784 521379 518879 517674 516528 513574 507812 499574 489964 480105 470712 462238 455368 451087 450005 451944
55770 451944 456528 463745 473177 482856 489696 491353 487438 479208 468670 457814 447849 438795 430133 421796
55756 421796 414143 407152 400351 393485 386520 378883 369518 358057 345407 332833 320934 309766 299448
$$ packed form
55847A179400k7615k7721k7858k7661k7295k6800k5971k4893k3807k2434k0413
55836H96932j8276j6950j6371j5720j4846j4226j3695j2622j1348j0850j0980
55825G41048j0600r708r710j1062j2266j2042j1080j0758j1255j1842j2063j1841
55813F06821j1153j0308r831r595q841p419o184n696n458m861l931k672p52J565
55799E21685L150L387K977K723K397J502L42n14j102j675k074k217k550l223l429
55784E21379k500j205j146k954n762q238r610r859r393q474o870m281j082J939
55770D51944M584P217R432R679O840J657l915q230j0538j0856r965r054q662q337
55756D21796p653o991o801o866o965p637r365j1461j2650j2574j1899j1168j0318
$$ plain form
55743 299448 290226 282202 275377 269824 265567 262457 260253 258601 256876 254430 251200 247809 244883 242484
55729 242484 240318 238155 235800 232936 229404 225579 222184 219600 217463 215005 211849 208468 205801 204370
55715 204370 203910 203897 204239 205312 207565 211331 216731 223302 229789 234740 237450 238242 237936 237284 236634 235677
55699 235677 233521 229479 223830 217582 211523 205860 200630 195931 191706 187763 184177 181266 179044 177146
55685 177146 175461 174427 174417 175194 176293 177674 179677 182503 186007 189833 193478 196310 197839 198013 197157
55670 197157 195713 194143 192878 192084 191462 190516 189068 187462 186191 185481 185256 185393 185797 186280 186625 186933 187734
55653 187734 189472 191878 194115 195516 195992 195738 194979 194095 193541 193313 192800 191466 189486 187378 185243 182678
55637 182678 179318 175160 170512 165930 162009 158845 155800 152119 147720 143110 138761 134934 131939 130029
$$ packed form
55743B99448r222q024o825n553m257l110k204j652j725k446l230l391k926k399
55729B42484k166k163k355k864l532l825l395k584k137k458l156l381k667j431
55715B04370m60j3L42J073K253L766N400O571O487M951K710P92l06o52o50r57
55699B35677k156m042n649o248o059n663n230m699m225l943l586k911k222j898
55685A77146j685j034j0P77J099J381K003K826L504L826L645K832J529J74q56
55670A97157j444j570j265p94o22r46j448j606j271p10k25J37M04M83L45L08Q01
55653A87734J738K406K237J401M76k54p59q84n54k28n13j334j980k108k135k565
55637A82678l360m158m648m582l921l164l045l681m399m610m349l827k995j910
$$ plain form
55623 130029 129045 128529 128127 127596 126614 125055 123341 122011 121045 120053 119004 118139 117290 116036 114596 113762 113723
55606 113723 113670 112879 111500 109914 108034 105824 103885 102796 102305 101842 101517 101792 102416 102465 101570 100370 99568
55589 99568 99077 98369 97276 96198 95757 96376 97878 99362 99833 99226 98582 98993 100557 102597 104605 106641
55573 106641 108933 111532 114440 117773 121628 126001 130904 136315 141860 146738 150224 152115 152581 151762 149797
55558 149797 147029 143808 140172 136151 132297 129314 127052 124462 120913 117093 114112 112087 110164 107761
55544 107761 105177 103031 101618 100893 100602 100281 99530 98529 98009 98526 99918 101591 103121 104443 105611 106621
55528 106621 107419 107921 107993 107425 106065 104055 101955 100345 99208 97907 95954 93602 91433 89600 87808
55513 87808 85883 83982 82304 80926 79891 79089 78127 76648 74808 73124 71894 71108 70815 71080 71492 71217
$$ packed form
55623A30029r84n16m02n31r82j559j714j330r66r92j049q65q49j254j440q34l9
55606A13723n3p91j379j586j880k210j939j089m91m63l25K75O24M9q95j200q02
55589I9568m91p08j093j078m41O19J502J484M71o07o44M11J564K040K008K036
55573A06641K292K599K908L333L855M373M903N411N545M878L486J891M66q19j965
55558A49797k768l221l636m021l854k983k262k590l549l820k981k025j923k403
55544A07761k584k146j413p25k91l21p51j001n20N17J392J673J530J322J168J010
55528A06621P98N02P2n68j360k010k100j610j137j301j953k352k169j833j792
55513H7808j925j901j678j378j035q02r62j479j840j684j230p86k93K65M12k75
$$ plain form
55497 71217 69775 67465 65034 63247 62820 64149 66755 69395 71095 71906 72399 72768 72750 72213 71361 70387 69284
55480 69284 68096 67172 66988 67679 68824 69787 70341 70778 71340 71782 71747 71306 70788 70315 69940 70047 70933 72026
55462 72026 72212 71109 69449 67977 66677 65396 64501 64327 64486 64436 64410 65037 66187 66919 66666 65876 65316 65209
55444 65209 65319 65490 65722 65843 65505 64614 63621 63188 63545 64282 64884 65273 65667 66043 66165 66146 66517 67492 68497
55425 68497 68800 68461 68281 68831 69795 70335 69986 69057 68218 67856 67959 68480 69425 70441 70790 70198 69406 69356 69975
55406 69975 70393 70224 69836 69284 67899 65430 62835 61307 60910 60767 60278 59613 59202 59220 59541 59833 59832 59674 59793
55387 59793 60395 61377 62837 65012 67424 68789 68418 67170 66315 65993 65582 65145 65448 66603 67719 68075 67872
55370 67872 67618 67429 67233 67089 67027 66987 67068 67401 67720 67585 67177 67253 68045 68746 68442 67174 65752 64891 64805 65257
$$ packed form
55497G1217j442k310k431j787m27J329K606K640J700Q11M93L69j8n37q52r74j103
55480F9284j188r24j84O91J145R63N54M37N62M42l5m41n18m73l75J07Q86J093
55462G2026J86j103j660j472j300j281q95j74J59n0k6O27J150P32k53p90n60j07
55444F5209J10J71K32J21l38q91r93m33L57P37O02L89L94L76J22j9L71R75J005
55425F8497L03l39j80N50R64N40l49r29q39l62J03N21R45J016L49n92p92n0O19
55406F9975M18j69l88n52j385k469k595j528l97j43m89o65m11J8L21K92jj58J19
55387E9793O02R82J460K175K412J365l71j248q55l22m11m37L03J155J116L56k03
55370F7872k54j89j96j44o2m0Q1L33L19j35m08P6P92P01l04j268j422q61q6M52
$$ plain form
55350 65257 65652 65369 64448 63699 63792 64437 64821 64639 64232 63867 63386 62706 62218 62334 62831 62966 62329 61372 60911
55331 60911 61236 61924 62531 63131 64000 65114 66227 67235 68077 68407 67827 66430 64761 63293 62352 62479 64180
55314 64180 67058 69705 70941 70927 70737 71084 71809 72431 72664 72353 71337 69662 67777 66299 65499 65178 65112
55297 65112 65467 66504 67862 68574 68074 66961 66355 66681 67464 68181 68702 68869 68333 67147 66008 65515 65535 65701
55279 65701 66121 67071 68233 68855 68684 68181 67736 67137 66025 64493 62970 61750 60976 60920 61854 63592 65448
55262 65448 66915 68219 69961 72178 74052 74689 74053 72890 71882 71151 70596 70298 70336 70403 69961 68815 67332
55245 67332 66026 65088 64410 63887 63510 63212 62858 62540 62735 63987 66372 69254 71599 72527 71873 70361 69132
55228 69132 68783 68884 68611 67739 66708 65885 65237 64781 64711 64870 64693 64086 63851 64691 66187 67369 67952 68307
$$ packed form
55350F5257L95k83r21p49R3O45L84j82m07l65m81o80m88J16M97J35o37r57m61
55331F0911L25O88O07O00Q69J114J113J008Q42L30n80j397j669j468r41J27J701
55314F4180K878K647J236j4j90L47P25O22K33l11j016j675j885j478q00l21o6
55297F5112L55J037J358P12n00j113o06L26P83P17N21J67n36j186j139m93K0J66
55279F5701M20R50J162O22j71n03m45n99j112j532j523j220p74n6R34J738J856
55262F5448J467J304J742K217J874O37o36j163j008p31n55k98L8O7m42j146j483
55245F7332j306r38o78n23l77k98l54l18J95J252K385K882K345R28o54j512j229
55228F9132l49J01k73q72j031q23o48m56p0J59j77o07k35Q40J496J182N83L55
$$ plain form
55210 68307 68538 68387 67998 67938 68351 68835 69253 69909 70694 70878 70132 69072 68281 67456 66203 65119 65258 66692
55192 66692 68299 68986 68622 67857 67508 68091 69388 70406 70199 68908 67684 67529 68472 69880 71178 72095 72598
55175 72598 72870 73167 73445 73251 72164 70381 68695 67946 68483 70039 71904 73273 73658 73196 72505 72078 71802
55158 71802 71174 70050 69006 68845 69821 71479 73108 74195 74595 74602 74856 75841 77291 78330 78380 77752 77108 76511
55140 76511 75330 73146 70501 68546 67984 68517 69306 69771 69831 69633 69414 69577 70449 71784 72822 73071 72765
55123 72765 72411 72210 72158 72268 72281 71617 70193 68973 69009 70152 71429 72478 73769 75450 76924 77826 78562
55106 78562 79524 80467 81064 81450 81853 82257 82790 83790 85068 85727 85234 84166 83419 83208 83344 83837 84592 85023
55088 85023 84719 84098 83754 83542 83021 82375 82107 82099 81783 81089 80492 80313 80646 81668 83288 84770 85568 86187 87317
$$ packed form
55210F8307K31j51l89o0M13M84M18O56P85J84p46j060p91q25j253j084J39J434
55192F6692J607O87l64p65l49N83J297J018k07j291j224j55R43J408J298R17N03
55175G2598K72K97K78j94j087j783j686p49N37J556J865J369L85m62o91m27k76
55158G1802o28j124j044j61R76J658J629J087M00PK54R85J450J039N0o28o44n97
55140G6511j181k184k645j955n62N33P89M65O0j98k19J63Q72J335J038K49l06
55123G2765l54k01n2J10J3o64j424j220L6J143J277J049J291J681J474R02P36
55106G8562R62R43N97L86M03M04N33J000J278O59m93j068p47k11J36M93P55M31
55088H5023l04o21l44k12n21o46k68ql16o94n97j79L33J022J620J482P98O19J130
$$ plain form
55069 87317 88407 88322 87312 86951 87871 88840 88648 87753 87332 87610 87985 88144 88179 87995 87381 86403 85245 83935
55051 83935 82702 82224 82956 84481 86003 87207 88185 88819 88800 88111 87013 85710 84416 83552 83384 83575 83553
55034 83553 83260 83106 83277 83528 83661 83781 83957 84021 83861 83728 84053 84969 86049 86576 86216 85413 84912 84879 84781 84258
55014 84258 83709 83739 84350 85084 85688 86203 86530 86459 86125 85941 85964 85744 84993 84126 83839 84317 85088 85645 85943 86261
54994 86261 86732 87253 87840 88782 90225 91735 92553 92290 91158 89641 88223 87372 87274 87516 87471 87190 87417 88478
54976 88478 89626 89955 89588 89437 89983 90866 91561 91936 92086 92021 91702 91150 90439 89731 89326 89457 90029 90717 91302
54957 91302 91786 92229 92558 92569 92066 91129 90260 89993 90334 90853 91374 92095 92894 93139 92616 92108 92454 93435 94282
54938 94282 94911 95778 96713 96873 96040 95113 94945 95370 95703 95654 95350 94953 94741 95195 96543 98402 100205 101832
$$ packed form
55069H7317J090q5j010l61R20R69j92q95m21K78L75J59L5j84o14r78j158j310
55051H3935j233m78P32J525J522J204R78O34j9o89j098j303j294q64j68J91k2
55034H3553k93j54J71K51J33J20J76O4j60j33L25R16J080N27l60q03n01l3r8n23
55014H4258n49L0O11P34O04N15L27p1l34j84K3k20p51q67k87M78P71N57K98L18
54994H6261M71N21N87R42J443J510Q18k63j132j517j418q51r8K42m5k81K27J061
54976H8478J148L29l67j51N46Q83O95L75J50o5l19n52p11p08m05J31N72O88N85
54957I1302M84M43L29J1n03r37q69k67L41N19N21P21P99K45n23n08L46R81Q47
54938I4282O29Q67R35J60q33r27j68M25L33m9l04l97k12M54J348J859J803J627
$$ plain form
54920 101832 103615 105984 109348 114015 119862 126216 132373 138115 143466 148171 151724 153879 154814 154756 153629
54905 153629 151097 146987 141712 136202 131181 126539 121721 116774 112556 109704 107833 106066 104048 102060
54891 102060 100408 99154 98261 97575 96825 96063 95929 96958 98666 99929 100373 100837 102216 104386 106695 109139
54875 109139 112442 117057 122638 128620 134888 141529 148135 153797 157837 160325 161655 161790 160245 156862
54861 156862 152343 147781 143735 139966 136032 131895 127863 124096 120446 116722 112963 109375 106205 103738
54847 103738 102242 101620 101217 100261 98592 96711 95057 93567 92102 90941 90426 90357 90182 89746 89367 89211 89052
54830 89052 88764 88589 88715 88975 89248 89802 90812 91778 91867 90882 89561 88822 88861 89110 89016 88754 89037 90189 91596
54811 91596 92277 91879 90855 89821 89130 89001 89532 90430 91186 91670 92214 92945 93582 94037 94697 95728 96659 97056
$$ packed form
54920A01832J783K369L364M667N847O354O157N742N351M705L553K155R35n8j127
54905A53629k532m110n275n510n021m642m818m947m218k852j871j767k018j988
54891A02060j652j254q93o86p50p62j34J029J708J263M44M64J379K170K309K444
54875A09139L303M615N581N982O268O641O606N662M040K488J330J35j545l383
54861A56862m519m562m046l769l934m137m032l767l650l724l759l588l170k467
54847A03738j496o22m03r56j669j881j654j490j465j161n15o9j75m36l79j56j59
54830H9052k88j75J26K60K73N54J010R66Q9r85j321p39L9K49r4k62K83J152J407
54811I1596O81l98j024j034o91j29N31Q98P56M84N44P31O37M55O60J031R31L97
$$ plain form
54793 97056 97117 97167 97123 97039 97539 98855 99897 99372 97643 96446 96727 97800 98748 99613 100774 102083 103227 104309
54775 104309 105512 106688 107731 108855 110054 110815 110930 111164 112511 115173 118829 123525 129509 136357 143034
54760 143034 148828 153728 157902 161371 164198 166435 167741 167562 165858 163229 160178 156626 152343 147469
54746 147469 142353 137225 132338 128188 125185 123127 121285 119121 116764 114738 113312 112234 111041 109539
54732 109539 107921 106504 105534 105192 105558 106441 107408 108180 108951 110161 112020 114359 116904 119615 122802 126914
54716 126914 132076 137774 143132 147597 151176 153964 155729 156117 154978 152285 148077 142875 137825 133913
54702 133913 131055 128406 125483 122603 120231 118405 116882 115432 113848 111983 109927 107894 105909 103910
54688 103910 102172 101204 101089 101348 101631 102096 102863 103519 103580 103111 102487 101742 100594 99002 97305 95867 94921
$$ packed form
54793I7056O1N0m4q4N00J316J042n25j729j197K81J073R48Q65J161J309J144J082
54775A04309J203J176J043J124J199P61J15K34J347K662L656M696N984O848O677
54760A43034N794M900M174L469K827K237J306j79j704k629l051l552m283m874
54746A47469n116n128m887m150l003k058j842k164k357k026j426j078j193j502
54732A09539j618j417r70l42L66Q83R67P72P71J210J859K339K545K711L187M112
54716A26914N162N698N358M465L579K788J765L88j139k693m208n202n050l912
54702A33913k858k649k923k880k372j826j523j450j584j865k056k033j985j999
54688A03910j738r68j15K59K83M65P67O56O1m69o24p45j148j592j697j438r46
$$ plain form
54671 94921 94711 95317 96277 96770 96411 95652 95221 95339 95669 95929 96240 96833 97600 98121 98100 97684 97292 97199 97302 97253
54651 97253 96813 96101 95510 95311 95396 95538 95805 96393 97036 97066 96302 95466 95305 95702 96160 96751 97808 98883 99056
54632 99056 98402 98167 99053 100182 100434 100111 100458 101907 103601 104497 104307 103408 102395 101725 101356 100805 99855 98993
54614 98993 98751 98947 99069 99127 99417 99693 99400 98668 98229 98295 98337 98126 98088 98294 98012 96889 95847 95997 97087
54595 97087 97793 97369 96353 95772 96164 97354 98679 99437 99477 99331 99499 99776 99639 99128 98815 98969 99252 99354
54577 99354 99495 100066 101046 101957 102259 101760 100790 99980 99705 99784 99904 100205 101083 102414 103392 103344 102469 101631 101580 102415
54557 102415 103570 104206 103856 102832 101931 101652 101899 102404 103117 104052 105025 105831 106478 107052 107480 107710 107969 108578
54539 108578 109574 110725 111846 112815 113322 112981 111897 110920 111023 112378 114142 115203 115096 114161 112904 111413
$$ packed form
54671I4921k10O06R60M93l59p59m31J18L30K60L11N93P67N21k1m16l92r3J03m9
54651I7253m40p12n91j99Q5J42K67N88O43L0p64q36j61L97M58N91J057J075J73
54632I9056o54k35Q86J129K52l23L47J449J694Q96j90q99j013o70l69n51r50q62
54614I8993k42J96J22N8K90K76k93p32m39O6M2k11l8K06k82j123j042J50J090
54595I7087P06m24j016n81L92J190J325P58M0j46J68K77j37n11l13J54K83J02
54577I9354J41N71R80R11L02m99r70q10k75P9J20L01Q78J331R78m8q75q38n1Q35
54557A02415J155O36l50j024r01k79K47N05P13R35R73Q06O47N74M28K30K59O09
54539A08578R96J151J121R69N07l41j084r77J03J355J764J061j07r35j257j491
$$ plain form
54523 111413 109517 107360 105513 104470 104217 104399 104686 104818 104526 103735 102817 102420 102971 104390 106158 107514
54507 107514 107812 106992 105714 104733 104137 103515 102802 102503 102921 103632 104132 104628 105657 107012 107641 106828 105143
54490 105143 103983 104313 105958 107964 109455 110204 110555 110922 111378 111755 112018 112329 112775 113184 113370 113395 113537 114024
54472 114024 114851 115782 116484 116815 117006 117455 118278 119178 119819 120189 120454 120624 120576 120379 120368 120858 121851 123030 123938
54453 123938 124198 123724 122749 121625 120551 119532 118542 117621 116883 116503 116676 117427 118407 118994 118739 117784 116822 116540
54435 116540 117021 117674 117838 117438 116961 116837 117040 117288 117372 117179 116706 116260 116406 117382 118736 119858 120752 121872
54417 121872 123289 124481 125015 125069 125105 125328 125620 125767 125629 125294 125144 125474 126023 126236 126138 126519 127967 130065
54399 130065 131845 132806 133173 133483 134255 135774 137658 138829 138453 136935 135583 135328 136115 137403 138654 139296
$$ packed form
54523A11413j896k157j847j043k53J82K87J32k92p91r18l97N51J419J768J356
54507A07514K98q20j278r81n96o22p13k99M18P11N00M96J029J355O29q13j685
54490A05143j160L30J645K006J491P49L51L67M56L77K63L11M46M09J86K5J42M87
54472A14024Q27R31P02L31J91M49Q23R00O41L70K65J70m8j97j1M90R93J179R08
54453A23938K60m74r75j124j074j019r90r21p38l80J73P51R80N87k55r55r62k82
54435A16540M81O53J64m00m77j24K03K48Q4j93m73m46J46R76J354J122Q94J120
54417A21872J417J192N34N4L6K23K92J47j38l35j50L30N49K13r8L81J448K098
54399A30065J780R61L67L10P72J519J884J171l76j518j352k55P87J288J251O42
$$ plain form
54383 139296 138870 137546 136110 135158 134650 134378 134399 134722 134973 134873 134687 134779 135003 135104 135452 136674 138575 140185
54365 140185 141118 142202 144359 147368 150335 153042 156152 160088 164338 168034 170720 172251 172351 170796 167950
54350 167950 164699 161739 159149 156639 154001 151214 148350 145540 142887 140344 137839 135614 134153 133495
54336 133495 132845 131281 128848 126528 125109 124412 123763 122823 121750 120890 120616 121224 122612 124215 125552 126652
54320 126652 127628 128102 127607 126459 125566 125286 125039 124306 123445 123172 123657 124547 125463 126048 125868 124823 123454 122332
54302 122332 121381 120351 119708 120239 121792 123229 123864 124191 124833 125506 125649 125503 125861 127003 128478 129772 130615
54285 130615 130788 130228 129338 128669 128241 127647 126851 126377 126574 127188 127831 128442 128966 128997 128160 126699 125267 124227
54267 124227 123403 122538 121705 121199 121212 121768 122925 124810 127324 129962 132199 134080 136125 138494 140580 141691
$$ packed form
54383A39296m26j324j436r52n08k72K1L23K51j00j86R2K24J01L48J222J901J610
54365A40185R33J084K157L009K967K707L110L936M250L696K686J531J00j555k846
54350A67950l251k960k590k510k638k787k864k810k653k543k505k225j461o58
54336A33495o50j564k433k320j419o97o49r40j073q60k74O08J388J603J337J100
54320A26652R76M74m95j148q93k80k47p33q61k73M85Q90R16N85j80j045j369j122
54302A22332r51j030o43N31J553J437O35L27O42O73J43j46L58J142J475J294Q43
54285A30615J73n60q90o69m28n94p96m74J97O14O43O11N24L1q37j461j432j040
54267A24227q24q65q33n06J3N56J157J885K514K638K237J881K045K369K086J111
$$ plain form
54251 141691 141846 141560 141105 140478 139842 139373 138769 137667 136645 137009 139183 141860 143217 142542 140354 137505
54235 137505 134841 133277 133318 134410 135370 135534 135111 134465 133641 132740 132215 132400 132897 132772 131399 129063 126746
54218 126746 125299 124769 124529 124060 123469 123185 123417 124068 124995 126066 127056 127693 127763 127112 125742 124122 123081
54201 123081 123080 123734 124392 124945 125660 126406 126646 126203 125533 125131 125079 125334 126001 127058 128185 129075 129739 130264 130498
54182 130498 130214 129522 128909 128885 129593 130681 131566 131965 132123 132405 132784 132965 132874 132664 132266 131411 130165 129045
54164 129045 128386 127964 127398 126662 125981 125497 125271 125356 125664 125976 126273 126861 127918 129131 130003 130360 130349 130112 129736
54145 129736 129343 128913 128122 126648 124715 123127 122666 123455 124834 125830 125862 125151 124434 124278 124727 125525 126418 127199
54127 127199 127731 128073 128407 128718 128833 128933 129625 131186 132990 134140 134518 134785 135365 135944 136150 136348 137333 139352
$$ packed form
54251A41691J55k86m55o27o36m69o04j102j022L64K174K677J357o75k188k849
54235A37505k664j564M1J092R60J64m23o46q24r01n25J85M97j25j373k336k317
54218A26746j447n30k40m69n91k84K32O51R27J071R90O37P0o51j370j620j041
54201A23081jO54O58N53P15P46K40m43o70m02n2K55O67J057J127Q90O64N25K34
54182A30498k84o92o13k4P08J088Q85L99J58K82L79J81r1k10l98q55j246j120
54164A29045o59m22n66p36o81m84k26Q5L08L12K97N88J057J213Q72L57j1k37l76
54145A29736l93m30p91j474j933j588m61P89J379R96L2p11p17j56M49P98Q93P81
54127A27199N32L42L34L11J15J00O92J561J804J150L78K67N80N79K06J98R85K019
$$ plain form
54109 139352 141774 143801 145231 146293 146945 146774 145680 144243 143123 142423 142039 142304 143612 145449 146591
54094 146591 146545 146218 146760 148289 150195 152305 155146 159203 164384 170093 175403 179323 181382 181967 181782 180998
54078 180998 179287 176580 173407 170465 168198 166787 166176 165998 165733 165071 164021 162705 161297 160138 159627
54063 159627 159865 160546 161204 161444 160994 159831 158360 157293 157214 158209 159860 161595 163150 164776 166886 169460
54047 169460 172015 174246 176447 179144 182555 186570 190912 195154 198922 202417 206312 210715 214676 217355
54033 217355 219314 221899 225462 229070 231977 234495 237132 239664 241604 243076 244620 246413 248165 249653
54019 249653 250931 252001 252610 252484 251668 250536 249368 247902 245489 241860 237584 233483 229728 225830 221442
54004 221442 216750 212130 207850 204215 201544 199817 198585 197332 195787 193938 192045 190591 189867 189560 189055
$$ packed form
54109A39352K422K027J430J062O52j71j094j437j120p00l84K65J308J837J142
54094A46591m6l27N42J529J906K110K841M057N181N709N310L920K059N85j85p84
54078A80998j711k707l173k942k267j411o11j78k65o62j050j316j408j159n11
54063A59627K38O81O58K40m50j163j471j067p9R95J651J735J555J626K110K574
54047A69460K555K231K201K697L411M015M342M242L768L495L895M403L961K679
54033B17355J959K585L563L608K907K518K637K532J940J472J544J793J752J488
54019B49653J278J070O09j26q16j132j168j466k413l629m276m101l755l898m388
54004B21442m692m620m280l635k671j727j232j253j545j849j893j454p24l07n05
$$ plain form
53989 189055 188045 186573 184701 182624 180875 179728 178523 176369 173508 171153 169881 169116 168424 168237 168823
53974 168823 169494 169564 169319 169331 169503 169620 170162 171640 173599 175224 176552 178144 179864 181051 181703 182535 183915
53957 183915 185724 188196 191866 196603 201726 207367 214697 224309 235154 245480 254097 260260 263209 262770
53943 262770 260089 256980 254574 252995 252090 251877 252324 253164 254095 254977 255863 256979 258538 260376 261836 262279
53927 262279 261770 261230 261795 263878 266679 268777 269459 269543 270611 273456 277544 281963 286459 291354 296849 302761
53911 302761 308736 314417 319510 323883 327550 330519 332739 334280 335388 336252 336852 337088 336833 335813 333671
53896 333671 330344 326238 321952 317916 314266 310830 307105 302508 296799 290208 283188 276244 269898 264409
53882 264409 259442 254374 249079 244104 239987 236715 233968 231496 229123 226770 224668 223107 221773 219800
$$ packed form
53989A89055j010j472j872k077j749j147j205k154k861k355j272p65o92j87N86
53974A68823O71P0k45J2J72J17N42J478J959J625J328J592J720J187O52Q32J380
53957A83915J809K472L670M737N123N641P330R612J0845J0326Q617O163K949m39
53943B62770k681l109k406j579r05k13M47Q40R31Q82Q86J116J559J838J460M43
53927B62279n09n40N65K083K801K098O82Q4J068K845M088M419M496M895N495N912
53911C02761N975N681N093M373L667K969K220J541J108Q64O00K36k55j020k142
53896C33671l327m106m286m036l650l436l725m597n709o591p020o944o346n489
53882B64409m967n068n295m975m117l272k747k472k373k353k102j561j334j973
$$ plain form
53868 219800 216824 213475 210428 207469 204054 200389 197236 194862 192851 190867 188958 187142 185323 183670
53854 183670 182530 181852 181185 180319 179460 178704 177863 176976 176411 176208 175833 174929 173891 173308 173197 173162 173004 172762
53836 172762 172433 172120 172261 173176 174456 175268 175314 175012 174733 174368 173883 173800 174695 176394 178110 179285 179964 180316
53818 180316 180238 179675 179080 179168 180179 181629 182895 183912 185169 187073 189535 192200 194939 197967 201518 205552
53802 205552 209884 214450 219256 224021 228154 231309 233821 236336 239077 241801 244480 247516 250996 254140
53788 254140 256038 256838 257663 259304 261438 263277 264549 265494 266190 266276 265240 262721 258660 253458 247888 242569
53772 242569 237527 232541 227791 223744 220372 217007 213238 209528 206542 204156 201586 198439 195148 192390
53758 192390 190479 189390 188899 188488 187545 186021 184667 184254 184661 185014 184621 183516 182238 181363 181206 181606 181993
$$ packed form
53868B19800k976l349l047k959l415l665l153k374k011j984j909j816j819j653
53854A83670j140o78o67q66q59p56q41q87n65k03l75r04j038n83j11l5j58k42
53836A72762l29l13J41R15J280Q12M6l02k79l65m85q3Q95J699J716J175O79L52
53818A80316p8n63n95Q8J011J450J266J017J257J904K462K665K739L028L551M034
53802B05552M332M566M806M765M133L155K512K515K741K724K679L036L480L144
53788B54140J898Q00Q25J641K134J839J272R45O96Q6j036k519m061n202n570n319
53772B42569n042m986m750m047l372l365l769l710k986k386k570l147l291k758
53758A92390j911j089m91m11r43j524j354m13M07L53l93j105j278q75j57M00L87
$$ plain form
53741 181993 181872 181259 180478 179680 178921 178603 179321 181121 183289 185085 186339 187234 187908 188587 189701 191416 193222
53724 193222 194407 194884 195201 195807 196619 197365 198053 199005 200519 202471 204228 205126 205270 205657 207221 209871 212788
53707 212788 215516 218285 221254 224012 226145 227946 230119 232878 235659 237752 239029 240048 241577 244039
53693 244039 247236 250511 253280 255494 257591 259956 262463 264592 265953 266560 266584 266052 264959 263493 261873
53678 261873 260093 258131 256374 255394 255197 255118 254627 253881 253250 252745 252266 252012 252099 252035 251168 249586 248029 246920
53660 246920 246025 245117 244447 244369 244886 245705 246426 246612 246148 245630 245931 247169 248508 249203 249394 249580 249842 250049
53642 250049 250515 251807 253939 256250 258101 259442 260707 262429 264874 267734 270184 271598 272347 273604 276175
53627 276175 279640 282884 285419 287977 291664 296644 301871 306121 308996 310891 312422 314297 317359 321997
$$ packed form
53741A81993j21o13p81p98p59l18P18J800K168J796J254Q95O74O79J114J715J806
53724A93222J185M77L17O06Q12P46O88R52J514J952J757Q98J44L87J564K650K917
53707B12788K728K769K969K758K133J801K173K759K781K093J277J019J529K462
53693B44039L197L275K769K214K097K365K507K129J361O07K4n32j093j466j620
53678B61873j780j962j757r80j97p9m91p46o31n05m79k54Q7o4q67j582j557j109
53660B46920q95r08o70p8N17Q19P21J86m64n18L01J238J339O95J91J86K62K07
53642B50049M66J292K132K311J851J341J265J722K445K860K450J414P49J257K571
53627B76175L465L244K535K558L687M980N227M250K875J895J531J875L062M638
$$ plain form
53613 321997 327428 332243 335860 338958 342299 345765 348941 352033 355556 359414 362900 365533 367462 369180
53599 369180 371222 373907 376925 379360 380588 381067 381759 382919 384005 384653 385107 385635 386149 386557 386920 386981 386071
53582 386071 383888 381075 378677 377197 376359 375572 374339 372395 369771 366753 363743 361124 359148 357784 356752
53567 356752 355942 355699 356344 357519 358436 358756 358778 358712 358342 357589 356827 356320 355863 355412 355622 357166 359724 362203
53549 362203 363877 364866 365591 366230 366825 367564 368811 370908 373902 377322 380421 382912 385360 388641 393100
53534 393100 398424 404156 410056 416176 422927 430880 440066 449631 458716 467615 477491 488881 501077 513161
53520 513161 525072 537317 550196 563874 578839 595617 614009 633155 652458 672079 692482
53509 692482 713874 736279 759803 784440 809693 834761 859159 883046 906870 930778 954382
$$ packed form
53613C21997N431M815L617L098L341L466L176L092L523L858L486K633J929J718
53599C69180K042K685L018K435J228M79O92J160J086O48M54N28N14M08L63O1r10
53582C86071k183k813k398j480q38p87j233j944k624l018l010k619j976j364j032
53567C56752q10k43O45J175R17L20K2o6l70p53p62n07m57m51K10J544K558K479
53549C62203J674R89P25O39N95P39J247K097K994L420L099K491K448L281M459
53534C93100N324N732N900O120O751P953R186R565R085Q899R876J1390J2196J2084
53520E13161J1911J2245J2879J3678J4965J6778J8392J9146J9303J9621K0403
53509F92482K1392K2405K3524K4637K5253K5068K4398K3887K3824K3908K3604
$$ plain form
53498 954382 977028 998216 1017930 1036697 1055329 1074449 1094178 1114227 1134194 1153687 1172307
53487 1172307 1189818 1206422 1222747 1239420 1256748 1274736 1293209 1311796 1330036 1347706 1364881
53476 1364881 1381412 1396501 1409089 1418744 1425919 1431321 1435154 1437001 1436235 1432472 1425788 1416650 1405614
53463 1405614 1393123 1379616 1365725 1352051 1338655 1324926 1310103 1293923 1276751 1259108 1241143
53452 1241143 1222569 1203117 1182990 1162719 1142562 1122316 1101844 1081576 1062252 1044400 1028355
53441 1028355 1014497 1002983 993342 984908 977623 971903 967607 963834 960041 956817 955098 955104 956507 959226
53427 959226 963326 968346 973431 978240 983275 989343 997139 1007264 1020042 1035096 1051604 1069106 1087763
53414 1087763 1107755 1128987 1151547 1175921 1202315 1230205 1258993 1288746 1319867 1352375 1386119
$$ packed form
53498I54382K2646K1188J9714J8767J8632J9120J9729K0049J9967J9493J8620
53487A172307J7511J6604J6325J6673J7328J7988J8473J8587J8240J7670J7175
53476A364881J6531J5089J2588R655P175N402L833J847p66l763o684r138j1036
53463A405614j2491j3507j3891j3674j3396j3729j4823j6180j7172j7643j7965
53452A241143j8574j9452k0127k0271k0157k0246k0472k0268j9324j7852j6045
53441A028355j3858j1514r641q434p285n720m296l773l793l224j719OJ403K719
53427I59226M100N020N085M809N035O068P796J0125J2778J5054J6508J7502J8657
53414A087763J9992K1232K2560K4374K6394K7890K8788K9753L1121L2508L3744
$$ plain form
53403 1386119 1421499 1459286 1499647 1541901 1585423 1630364 1677269 1726321 1777213 1829457 1882596
53392 1882596 1936316 1990629 2045741 2101516 2157193 2211876 2265234 2317432 2368504 2418087 2465841
53381 2465841 2511843 2556323 2598989 2638718 2674045 2704038 2728711 2748550 2763781 2774293 2780114
53370 2780114 2781526 2778477 2770242 2755970 2735359 2708521 2675548 2636818 2593610 2547737 2500361 2451583
53358 2451583 2401324 2350089 2298653 2247567 2197349 2148707 2101968 2056615 2012027 1968484 1926709
53347 1926709 1886490 1846518 1805903 1765197 1725534 1687274 1650037 1613692 1578654 1545276 1513552
53336 1513552 1483589 1455887 1430874 1408377 1387834 1368912 1351679 1336138 1321808 1307906 1293922
53325 1293922 1279889 1266039 1252270 1238105 1223203 1207819 1192721 1178722 1166289 1155459 1145985
$$ packed form
53403A386119L5380L7787M0361M2254M3522M4941M6905M9052N0892N2244N3139
53392A882596N3720N4313N5112N5775N5677N4683N3358N2198N1072M9583M7754
53381B465841M6002M4480M2666L9729L5327K9993K4673J9839J5231J0512N821
53370B780114J412l049q235j4272k0611k6838l2973l8730m3208m5873m7376m8778
53358B451583n0259n1235n1436n1086n0218m8642m6739m5353m4588m3543m1775
53347A926709m0219l9972m0615m0706l9663l8260l7237l6345l5038l3378l1724
53336A513552k9963k7702k5013k2497k0543j8922j7233j5541j4330j3902j3984
53325A293922j4033j3850j3769j4165j4902j5384j5098j3999j2433j0830r474
$$ plain form
53314 1145985 1137638 1130454 1124693 1120550 1117964 1116734 1116667 1117577 1119303 1121944 1125973 1131874 1139641 1148839 1159176
53299 1159176 1170839 1184222 1199496 1216578 1235322 1255600 1277267 1300217 1324402 1349610 1375254
53288 1375254 1400658 1425617 1450506 1475603 1500408 1523812 1544839 1563017 1578120 1589964 1598646
53277 1598646 1604636 1608249 1609154 1606780 1601137 1592903 1582746 1570946 1557660 1542994 1526556 1507513 1485638
53264 1485638 1462015 1438124 1414338 1389872 1364170 1337713 1311211 1284550 1257035 1228434 1199379
53253 1199379 1170798 1143251 1116811 1091298 1066504 1042247 1018253 994033 969083 943378 917616
53242 917616 892736 869213 846934 825681 805397 785893 766626 747196 728151 710967 696861
53231 696861 685607 675695 665762 655727 646427 638344 630969 623329 614789 605225 594718 583388 571397
$$ packed form
53314A145985q347p184n761m143k586j230o7R10J726K641M029N901P767R198J0337
53299A159176J1663J3383J5274J7082J8744K0278K1667K2950K4185K5208K5644
53288A375254K5404K4959K4889K5097K4805K3404K1027J8178J5103J1844Q682
53277A598646N990L613R05k374n643q234j0157j1800j3286j4666j6438j9043k1875
53264A485638k3623k3891k3786k4466k5702k6457k6502k6661k7515k8601k9055
53253A199379k8581k7547k6440k5513k4794k4257k3994k4220k4950k5705k5762
53242I17616k4880k3523k2279k1253k0284j9504j9267j9430j9045j7184j4106
53231F96861j1254r912r933j0035r300q083p375p640q540r564j0507j1330j1991
$$ plain form
53218 571397 558835 545543 531263 516065 500580 485724 472225 460296 449693 439989 430829 421996
53206 421996 413382 405065 397385 390679 384729 378676 371731 363950 356034 348403 340815 333038 325504 318954
53192 318954 313540 308643 303605 298350 293239 288632 284708 281398 278198 274304 269381 264152 259782 256592
53178 256592 253794 250716 247820 246084 245626 245486 244745 243320 241559 239512 236976 234020 231187 229216 228616
53163 228616 229289 230380 230734 229837 228263 227048 226723 227071 227568 227750 227311 226270 225063 224150 223468 222543 221203
53146 221203 219880 219092 218861 218789 218514 217934 217169 216498 216203 216352 216807 217534 218717 220415 222256 223671 224363
53129 224363 224357 223714 222469 220906 219686 219487 220492 222211 223853 224911 225430 225693 225761 225427 224637 223760 223398
53112 223398 224030 225801 228337 230657 231653 231042 229685 228631 227959 226954 225310 223634 222624 222244 221973 221491
$$ packed form
53218E71397j2562j3292j4280j5198j5485j4856j3499j1929j0603r704r160q833
53206D21996q614q317p680o706n950o053o945p781p916p631p588p777p534o550
53192C18954n414m897n038n255n111m607l924l310l200l894m923n229m370l190
53178B56592k798l078k896j736m58j40p41j425j761k047k536k956k833j971o00
53163B28616O73J091L54q97j574j215l25L48M97J82m39j041j207r13o82r25j340
53146B21203j323p88k31p2k75n80p65o71k95J49M55P27J183J698J841J415O92
53129B24363oo43j245j563j220j99J005J719J642J058N19K63O8l34p90q77l62
53112B23398O32J771K536K320R96o11j357j054o72j005j644j676j010l80k71m82
$$ plain form
53096 221491 220736 219560 217846 215958 214593 214016 213688 212892 211545 210213 209433 209260 209448 209784 210115 210221 209937
53079 209937 209404 208997 208912 208965 208851 208512 208090 207706 207465 207569 208084 208526 208007 206069 203228 200493 198403 196813
53061 196813 195522 194751 194796 195438 196057 196296 196401 196805 197570 198386 198973 199325 199657 200409 202160 205148 208654 211269
53043 211269 212149 211881 211769 212349 212964 212733 211479 209685 208047 207311 208024 209977 212102 213372 213672 213536 213249
53026 213249 212655 211720 210739 209954 209413 209313 209959 211196 212248 212438 211840 211037 210529 210616 211495 213131 215152 217155
53008 217155 218910 220079 220171 219198 218087 217826 218329 218726 218645 218478 218353 217733 216433 215322 215352 216307 217152 217381
52990 217381 217358 217504 217790 218112 218564 219226 220064 221181 222717 224386 225532 225880 225968 226609 228169 230469 233055
52973 233055 235339 236838 237589 238180 239124 240368 241584 242601 243256 243198 242325 241270 240859 241082 241046 240051 238328
$$ packed form
53096B21491p55j176j714j888j365n77l28p96j347j332p80j73J88L36L31J06k84
53079B09937n33m07q5N3j14l39m22l84k41J04N15M42n19j938k841k735k090j590
53061A96813j291p71M5O42O19K39J05M04P65Q16N87L52L32P52J751K988L506K615
53043B11269Q80k68j12N80O15k31j254j794j638p36P13J953K125J270L00j36k87
53026B13249n94r35r81p85n41j00O46J237J052J90n98q03n08Q7Q79J636K021K003
53008B17155J755J169R2r73j111k61N03L97q1j67j25o20j300j111L0R55Q45K29
52990B17381k3J46K86L22M52O62Q38J117J536J669J146L48Q8O41J560K300K586
52973B33055K284J499P51N91R44J244J216J017O55n8q73j055m11K23l6r95j723
$$ plain form
52956 238328 236619 235399 234668 234134 233401 232189 230636 229236 228324 227760 227178 226343 225191 223809 222561 221972
52940 221972 222156 222520 222343 221613 221045 221275 222256 223397 224075 223960 223083 221799 220547 219464 218238 216503 214472
52923 214472 213054 213077 214368 215791 216343 216036 215507 215055 214509 213929 213805 214310 214778 214328 212863 211199 210289
52906 210289 210471 211300 211962 212038 211932 212332 213206 213746 213516 213089 213131 213369 213119 212482 212211 212505 212761 212626 212535 212924
52886 212924 213595 214253 215112 216483 218104 219327 219768 219448 218567 217503 216835 216967 217819 219119 220763 222622
52870 222622 224240 225148 225351 225188 224819 224294 223980 224408 225604 226981 228095 229158 230591 232347 233954 235088
52854 235088 235756 235962 235527 234409 232974 231600 230052 227576 223879 219719 216209 213668 211512 209222 206916
52839 206916 204888 203108 201465 200088 199056 198100 196984 195932 195253 194780 194169 193655 194001 195618 198022 200186
$$ packed form
52956B38328j709j220p31n34p33j212j553j400r12n64n82q35j152j382j248n89
52940B21972J84L64j77p30n68K30R81J141O78j15q77j284j252j083j226j735k031
52923B14472j418K3J291J423N52l07n29m52n46n80j24N05M68m50j465j664r10
52906B10289J82Q29O62P6j06M00Q74N40k30m27M2K38k50o37k71K94K56j35r1L89
52886B12924O71O58Q59J371J621J223M41l20q81j064o68J32Q52J300J644J859
52870B22622J618R08K03j63l69n25l14M28J196J377J114J063J433J756J607J134
52854B35088O68K06m35j118j435j374j548k476l697m160l510k541k156k290k306
52839B06916k028j780j643j377j032r56j116j052o79m73o11n14L46J617K404K164
$$ plain form
52823 200186 201137 200444 198615 197049 197029 198494 200110 200695 200297 199766 199706 200142 200887 201794 202686 203408 204026 204829
52805 204829 206018 207424 208570 209031 208728 207781 206111 203511 200281 197490 196107 195921 195745 194760 193309 192284
52789 192284 192108 192534 193103 193526 193799 194197 195079 196528 198203 199611 200424 200581 200253 199753 199322 199038 199052 199719
52771 199719 201143 202695 203482 203270 202422 200985 198583 195466 192850 191650 191441 191270 190987 191037 191315 191181 190557
52754 190557 190216 190759 191925 193103 194051 194853 195570 196182 196751 197493 198817 201124 204323 207703 210665 213463
52738 213463 216677 220040 222464 223378 223426 223597 224172 224845 225374 225698 225818 226022 226914 228721 230768 232040 232126
52721 232126 231295 229896 228157 226448 225163 224253 223222 221696 219755 217747 216092 215242 215379 215993 216131 215358
52705 215358 214291 213946 214705 216098 217450 218511 219443 220418 221334 221874 221818 221304 220726 220391 220341 220528 221016 221837
$$ packed form
52823B00186R51o93j829j566k0J465J616N85l98n31o0M36P45R07Q92P22O18Q03
52805B04829J189J406J146M61l03r47j670k600l230k791j383j86j76r85j451j025
52789A92284j76M26N69M23K73L98Q82J449J675J408Q13J57l28n00m31k84J4O67
52771A99719J424J552P87k12q48j437k402l117k616j200k09j71k83N0K78j34o24
52754A90557l41N43J166J178R48Q02P17O12N69P42J324K307L199L380K962K798
52738B13463L214L363K424R14M8J71N75O73N29L24J20K04Q92J807K047J272Q6
52721B32126q31j399j739j709j285r10j031j526j941k008j655q50J37O14J38p73
52705B15358j067l45P59J393J352J061R32R75R16N40n6n14n78l35n0J87M88Q21
$$ plain form
52687 221837 222715 223152 222895 222218 221643 221418 221286 220718 219318 217090 214512 212354 211215 211092 211466 211866 212238
52670 212238 212659 212871 212423 211289 210074 209467 209635 210243 210928 211566 212201 212922 213814 214945 216352 218125 220404
52653 220404 223254 226580 230212 233962 237455 240028 241053 240425 238634 236285 233732 231164 228795 226781
52639 226781 225061 223537 222351 221772 221740 221774 221516 221239 221621 223009 225027 226911 228125 228718 229230 230225 231673
52622 231673 232802 232804 231772 230626 229994 229531 228655 227579 227062 227313 227741 227841 227726 227631 227472 227256 227423 228298
52604 228298 229497 230390 231002 231886 233207 234411 234841 234293 232970 231317 229984 229500 229772 230213 230551 231187 232489
52587 232489 234035 234875 234476 233148 231686 230804 230786 231377 231994 232262 232369 232818 233864 235281 236595 237393 237550
52570 237550 237367 237413 237970 238605 238531 237445 235846 234498 233759 233519 233507 233502 233386 233232 233262 233502 233549 232898 231557 230137
$$ packed form
52687B21837Q78M37k57o77n75k25j32n68j400k228k578k158j139j23L74M00L72
52670B12238M21K12m48j134j215o07J68O08O85O38O35P21Q92J131J407J773K279
52653B20404K850L326L632L750L493K573J025o28j791k349k553k568k369k014
52639B26781j720j524j186n79l2L4k58k77L82J388K018J884J214N93N12R95J448
52622B31673J129Kj032j146o32m63q76j076n17K51M28J00j15r5j59k16J67Q75
52604B28298J199Q93O12Q84J321J204M30n48j323j653j333m84K72M41L38O36J302
52587B32489J546Q40l99j328j462q82j8N91O17K68J07M49J046J417J314P98J57
52570B37550j83M6N57O35p4j086j599j348p39k40j2nj16j54L0K40M7o51j341j420
$$ plain form
52550 230137 229209 228733 228258 227566 226899 226592 226738 227286 228174 229091 229322 228283 226302 224452 223459 223082 222846 222999
52532 222999 224184 226312 228427 229813 230712 231657 232629 233300 233735 234247 234734 234775 234435 234366 234880 235386 235079 233913
52514 233913 232581 231726 231500 231784 232506 233702 235440 237724 240340 242901 245168 247232 249235 250973 251954
52499 251954 251854 250735 248871 246525 243910 241227 238674 236504 234970 234096 233529 232839 231965 231218 230858 230803
52483 230803 230749 230408 229653 228682 228066 228400 229734 231521 233159 234446 235452 236266 236996 237779 238544 238950 238829
52466 238829 238518 238524 239006 239859 241172 243141 245508 247521 248717 249473 250511 252009 253445 254227 254233 253685 252755
52449 252755 251379 249353 246529 243003 239208 235793 233261 231689 230818 230394 230360 230683 231162 231483 231512 231429 231551
52432 231551 232024 232693 233266 233589 233711 233632 233127 232044 230789 230230 230896 232418 233949 235009 235676 236174 236634
$$ packed form
52550B30137r28m76m75o92o67l07J46N48Q88R17K31j039j981j850r93l77k36J53
52532B22999J185K128K115J386Q99R45R72O71M35N12M87M1l40o9N14N06l07j166
52514B33913j332q55k26K84P22J196J738K284K616K561K267K064K003J738R81
52499B51954j00j119j864k346k615k683k553k170j534q74n67o90q74p47l60n5
52483B30803n4l41p55r71o16L34J334J787J638J287J006Q14P30P83P65M06j21
52466B38829l11OM82Q53J313J969K367K013J196P56J038J498J436P82On48r30
52449B52755j376k026k824l526l795l415k532j572q71m24l4L23M79L21K9q3J22
52432B31551M73O69N73L23J22p9n05j083j255n59O66J522J531J060O67M98M60
$$ plain form
52415 236634 237272 238292 239491 240319 240558 240724 241635 243823 247499 252755 259472 267141 275021 282349 288337
52400 288337 292298 294083 294208 293206 291107 287860 284019 280450 277425 274520 271436 268536 266463 265584 265850
52385 265850 266858 267977 268746 269214 269620 269884 269860 270029 271260 273654 276253 278193 279629 281170 282996 285124
52369 285124 288054 292365 297806 303442 308689 313618 318245 322083 324620 325863 326236 326209 326095 325979 325847 325955
52353 325955 326927 329096 331878 334242 335833 337149 338609 340026 341196 342401 344004 346034 348518 351768
52339 351768 355880 360337 364678 369299 374998 381906 389496 397558 406462 416319 426597 436977 448164
52326 448164 461302 476777 493964 512064 530843 550537 571372 593318 616100 639244 662119
52315 662119 684110 704891 724559 743473 761966 780225 798358 816397 834184 851384 867711
$$ packed form
52415B36634O38J020J199Q28K39J66R11K188L676N256O717P669P880P328N988
52400B88337L961J785J25j002k099l247l841l569l025k905l084k900k073q79K66
52385B65850J008J119P69M68M06K64k4J69J231K394K599J940J436J541J826K128
52369B85124K930M311N441N636N247M929M627L838K537J243L73k7j14j16j32J08
52353C25955R72K169K782K364J591J316J460J417J170J205J603K030K484L250
52339C51768M112M457M341M621N699O908P590Q062Q904R857J0278J0380J1187
52326D48164J3138J5475J7187J8100J8779J9694K0835K1946K2782K3144K2875
52315F62119K1991K0781J9668J8914J8493J8259J8133J8039J7787J7200J6327
$$ plain form
52304 867711 883075 897408 910537 922395 933246 943452 953060 961800 969409 975667 980207 982657 983105
52291 983105 982060 979796 975991 970212 962452 953008 942204 930670 919630 910317 903012 897132 892391
52278 892391 889459 889235 891833 896626 903013 910697 919353 928607 938520 949718 962642 976799 991069
52265 991069 1004715 1017862 1031019 1044431 1058017 1071615 1084990 1097706 1109338 1119948 1130184
52254 1130184 1140763 1151817 1162706 1172410 1180179 1185964 1190239 1193371 1195229 1195444 1193822 1190250 1184414
52241 1184414 1176081 1165724 1154433 1142991 1131313 1119004 1106160 1093347 1081018 1069280 1058081
52230 1058081 1047342 1037050 1027443 1018906 1011428 1004430 997576 991534 987332 984979 983350 981559 979898
52217 979898 979158 979516 980587 982196 984570 987802 991589 995621 999958 1004865 1010423 1016351 1022174 1027512 1032263
$$ packed form
52304H67711J5364J4333J3129J1858J0851J0206R608Q740P609O258M540K450M48
52291I83105j045k264l805n779p760r444j0804j1534j1040r313p305n880m741
52278H92391k932k24K598M793O387P684Q656R254R913J1198J2924J4157J4270
52265I91069J3646J3147J3157J3412J3586J3598J3375J2716J1632J0610J0236
52254A130184J0579J1054J0889R704P769N785M275L132J858K15j622l572n836
52241A184414q333j0357j1291j1442j1678j2309j2844j2813j2329j1738j1199
52230A058081j0739j0292r607q537p478o998o854o042m202k353j629j791j661
52217I79898p40L58J071J609K374L232L787M032M337M907N558N928N823N338M751
$$ plain form
52202 1032263 1036552 1040576 1044488 1048380 1052286 1056197 1060124 1064114 1068163 1072190 1076163 1080047 1083535 1086118
52188 1086118 1087772 1089384 1091937 1095307 1098376 1100356 1101383 1101532 1099940 1095583 1088632 1080447 1072329 1064753
52174 1064753 1057717 1051158 1044772 1037936 1030309 1022417 1015310 1009586 1004992 1001118 998191 996824 997036 997987
52160 997987 998922 999950 1001542 1003681 1006130 1009227 1013513 1018447 1022403 1024281 1024545 1024271 1023876 1023263 1022627 1022397
52144 1022397 1022741 1023693 1025435 1027858 1030189 1031728 1032673 1033640 1034686 1035553 1036596 1038604 1041809 1045929 1051190
52129 1051190 1058437 1068161 1080213 1094619 1111822 1131817 1153846 1177349 1202585 1229945 1259238 1289966
52117 1289966 1321709 1353817 1385287 1415430 1444206 1471600 1497188 1520749 1542624 1562878 1580564
52106 1580564 1594573 1604900 1612465 1617941 1621349 1622623 1621910 1619345 1614998 1609103 1601985 1593858 1584928 1575490
$$ packed form
52202A032263M289M024L912L892L906L911L927L990M049M027L973L884L488K583
52188A086118J654J612K553L370L069J980J027J49j592m357o951q185q118p576
52174A064753p036o559o386o836p627p892p107n724m594l874k927j367K12R51
52160I97987R35J028J592K139K449L097M286M934L956J878K64k74l95o13o36k30
52144A022397L44R52J742K423K331J539R45R67J046Q67J043K008L205M120N261
52129A051190P247R724J2052J4406J7203J9995K2029K3503K5236K7360K9293L0728
52117A289966L1743L2108L1470L0143K8776K7394K5588K3561K1875K0254J7686
52106A580564J4009J0327P565N476L408J274p13k565m347n895p118q127q930r438
$$ plain form
52092 1575490 1565630 1555016 1543322 1530612 1516959 1502073 1485830 1468980 1452747 1437783 1423997
52081 1423997 1411280 1399930 1390447 1383313 1378865 1376931 1376755 1377795 1380535 1385992 1394468 1405322 1417904
$$ packed form
52092A575490r860j0614j1694j2710j3653j4886j6243j6850j6233j4964j3786
52081A423997j2717j1350r483p134m448j934j76J040K740N457Q476J0854J2582
$$ [...]
##END NTUPLES=NMR SPECTRUM
##END=
