
##TITLE=AC1304_DOMAH11116_6614092_c4TFJmoTcZ
##JCAMPDX= 6.0         $$ Bruker NMR JCAMP-DX V2.0
##DATA TYPE= NMR SPECTRUM
##DATA CLASS= NTUPLES
##ORIGIN= BRUKER
##OWNER= Administrator
$$ 1.72 TOPSPIN		Version 2.1
$$ 2012-08-02 15:59:41.781 -0500  Administrator@TOPSPIN
$$ Compression mode = diff/dup
##.OBSERVE FREQUENCY= 400.02188249412
##.OBSERVE NUCLEUS= ^1H
##.ACQUISITION MODE= SIMULTANEOUS (DQD)
##.ACQUISITION SCHEME= undefined
##.AVERAGES= 8
##.DIGITISER RES= 22
##SPECTROMETER/DATA SYSTEM= spect
##.PULSE SEQUENCE= zg30
##.SOLVENT NAME= COFFEE_meoh
##.SHIFT REFERENCE= INTERNAL, COFFEE_meoh, 1, 14.98509
##AUDIT TRAIL= $$ (NUMBER, WHEN, WHO, WHERE, PROCESS, VERSION, WHAT)
$$ ##TITLE= Audit trail, TOPSPIN		Version 2.1
$$ ##JCAMPDX= 5.01
$$ ##ORIGIN= Bruker BioSpin GmbH
$$ ##OWNER= Administrator
$$ $$ C:\Bruker\TOPSPIN/data/COFFEE/nmr/AC1304_DOMAH11116_6614092_c4TFJmoTcZ/10/pdata/1/auditp.txt
$$ ##AUDIT TRAIL=  $$ (NUMBER, WHEN, WHO, WHERE, PROCESS, VERSION, WHAT)
(   1,<2012-08-02 15:59:33.781 -0500>,<Administrator>,<TOPSPIN>,<go>,<TOPSPIN 2.1>,
      <created by zg
	started at 2012-08-02 15:58:26.968 -0500,
	POWCHK enabled, PULCHK disabled,
       configuration hash MD5:
       6B 1B 68 BB D9 2E 58 E2 7F 35 AD 54 07 DF 0E 41
       data hash MD5: 64K
       A2 41 F3 05 82 E8 02 F9 4C 53 CF 25 2A 03 73 94>)
(   2,<2012-08-02 15:59:37.687 -0500>,<Administrator>,<TOPSPIN>,<proc1d>,<TOPSPIN 2.1>,
      <Start of raw data processing
       efp LB = 0 FT_mod = 6 PKNL = 1 PHC0 = 0 PHC1 = 0 SI = 32K 
       data hash MD5: 32K
       73 63 78 50 ED 15 6D 12 DA 21 46 C6 FE E1 C7 17>)
(   3,<2012-08-02 15:59:37.968 -0500>,<Administrator>,<TOPSPIN>,<proc1d>,<TOPSPIN 2.1>,
      <pk PHC0 = 180.9064 PHC1 = 0 
       data hash MD5: 32K
       7B 4E 10 3A 58 90 17 3B B1 97 B4 F4 72 64 D8 E6>)
(   4,<2012-08-02 15:59:38.062 -0500>,<Administrator>,<TOPSPIN>,<proc1d>,<TOPSPIN 2.1>,
      <abs ABSG = 1 
       data hash MD5: 32K
       6F B9 9B 03 99 33 8C 0C EF 11 B9 F7 C2 8D D7 16>)
(   5,<2012-08-02 15:59:38.093 -0500>,<Administrator>,<TOPSPIN>,<proc1d>,<TOPSPIN 2.1>,
      <abs ABSG = 2 
       data hash MD5: 32K
       45 45 A7 5A 1B D5 7E D7 FC 0F A2 94 01 DE 37 3A>)
(   6,<2012-08-02 15:59:38.125 -0500>,<Administrator>,<TOPSPIN>,<proc1d>,<TOPSPIN 2.1>,
      <abs ABSG = 3 
       data hash MD5: 32K
       AE DC 1B 6F B8 C0 78 E0 19 41 9C 39 AB 32 54 30>)
(   7,<2012-08-02 15:59:38.156 -0500>,<Administrator>,<TOPSPIN>,<proc1d>,<TOPSPIN 2.1>,
      <abs ABSG = 4 
       data hash MD5: 32K
       F8 93 D7 C1 C2 DE 4C 2D 02 F6 6A 40 4C DB F8 C7>)
(   8,<2012-08-02 15:59:38.187 -0500>,<Administrator>,<TOPSPIN>,<proc1d>,<TOPSPIN 2.1>,
      <abs ABSG = 5 
       data hash MD5: 32K
       7D 61 BF 84 E1 24 5C 09 50 37 EE 80 58 E8 E7 05>)
$$ ##END=
$$ 
$$ $$ hash MD5
$$ $$ A0 31 EE 05 8D 5A 17 78 A9 88 75 0E F7 72 50 E4
##$RELAX= 
##$RELAX= 
##$RELAX= 
##$RELAX= 
##$RELAX= 
##$RELAX= 
##$RELAX= 
$$ Bruker specific parameters
$$ --------------------------
$$ [...]
150 150 150 150 150 150 150 150
##$TP07= 0
##$TPNAME0= <>
##$TPNAME1= <>
##$TPNAME2= <>
##$TPNAME3= <>
##$TPNAME4= <>
##$TPNAME5= <>
##$TPNAME6= <>
##$TPNAME7= <>
##$TPOAL= (0..7)
0.5 0.5 0.5 0.5 0.5 0.5 0.5 0.5
##$TPOFFS= (0..7)
0 0 0 0 0 0 0 0
##$TUNHIN= 0
##$TUNHOUT= 0
##$TUNXOUT= 0
##$USERA1= <user>
##$USERA2= <user>
##$USERA3= <user>
##$USERA4= <user>
##$USERA5= <user>
##$V9= 5
##$VALIST= <valist>
##$VCLIST= <CCCCCCCCCCCCCCC>
##$VD= 0
##$VDLIST= <DDDDDDDDDDDDDDD>
##$VPLIST= <PPPPPPPPPPPPPPP>
##$VTLIST= <TTTTTTTTTTTTTTT>
##$WBST= 1024
##$WBSW= 4
##$XGAIN= (0..3)
0 0 0 0
##$XL= 0
##$YL= 0
##$YMAX_a= 474969
##$YMIN_a= -621837
##$ZGOPTNS= <>
##$ZL1= 120
##$ZL2= 120
##$ZL3= 120
##$ZL4= 120
##$ABSF1= 14.98509
##$ABSF2= -5.573092
##$ABSG= 5
##$ABSL= 3
##$ALPHA= 0
##$AQORDER= 0
##$ASSFAC= 0
##$ASSFACI= 0
##$ASSFACX= 0
##$ASSWID= 0
##$AUNMP= <proc_prof1d_extract_pilot.lims>
##$AXLEFT= 0
##$AXNAME= <>
##$AXNUC= <1H>
##$AXRIGHT= 0
##$AXTYPE= 0
##$AXUNIT= <>
##$AZFE= 0.1
##$AZFW= 0.1
##$BCFW= 0
##$BC_mod= 0
##$BYTORDP= 0
##$COROFFS= 0
##$CY= 15
##$DATMOD= 1
##$DC= 0
##$DFILT= <>
##$DTYPP= 0
##$F1P= 0
##$F2P= 0
##$FCOR= 0.5
##$FTSIZE= 32768
##$FT_mod= 6
##$GAMMA= 0
##$GB= 0
##$INTBC= 1
##$INTSCL= 1
##$ISEN= 128
##$LB= 0
##$LEV0= 0
##$LPBIN= 0
##$MAXI= 10000
##$MC2= 0
##$MEAN= 0
##$ME_mod= 0
##$MI= 0
##$NCOEF= 0
##$NC_proc= -8
##$NLEV= 6
##$NOISF1= 0
##$NOISF2= 0
##$NSP= 0
##$NTH_PI= 0
##$NZP= 0
##$OFFSET= 14.98509
##$PC= 1
##$PHC0= 180.9064
##$PHC1= 0
##$PH_mod= 1
##$PKNL= yes
##$PPARMOD= 0
##$PPDIAG= 0
##$PPIPTYP= 0
##$PPMPNUM= 2147483647
##$PPRESOL= 1
##$PSCAL= 4
##$PSIGN= 0
##$PYNMP= <proc.py>
##$REVERSE= no
##$SF= 400.02
##$SI= 32768
##$SIGF1= 0
##$SIGF2= 0
##$SINO= 400
##$SIOLD= 32768
##$SPECTYP= <>
##$SREGLST= <1H.CDCl3>
##$SSB= 0
##$STSI= 32768
##$STSR= 0
##$SW_p= 8223.68421052631
##$SYMM= 0
##$S_DEV= 0
##$TDeff= 65536
##$TDoff= 0
##$TI= <>
##$TILT= no
##$TM1= 0
##$TM2= 0
##$TOPLEV= 0
##$USERP1= <user>
##$USERP2= <user>
##$USERP3= <user>
##$USERP4= <user>
##$USERP5= <user>
##$WDW= 1
##$XDIM= 32768
##$YMAX_p= 450150913
##$YMIN_p= -665018
##$CURPLOT= <Network HP LaserJet P1505>
##$CURPRIN= <$Network HP LaserJet P1505>
##$DFORMAT= <normdp>
##$LAYOUT= <+/1D_H.xwp>
##$LFORMAT= <normlp>
##$PFORMAT= <normpl>
##$SURQMSG= 1
$$ End of Bruker specific parameters
$$ ---------------------------------
##NTUPLES= NMR SPECTRUM
##VAR_NAME=  FREQUENCY,     SPECTRUM/REAL,   SPECTRUM/IMAG
##SYMBOL=    X,             R,               I
##VAR_TYPE=  INDEPENDENT,   DEPENDENT,       DEPENDENT
##VAR_FORM=  AFFN,          ASDF,            ASDF
##VAR_DIM=   32768,         32768,           32768
##UNITS=     HZ,            ARBITRARY UNITS, ARBITRARY UNITS
##FACTOR=    0.250966925370066, 1,           1
##FIRST=     8223.43324360094, 1877,         -14367
##LAST=      0,             -87771,          -115808
##MIN=       0,             -665018,         0
##MAX=       8223.43324360094, 450150913,    0
$$ Real data points
##PAGE= N=1
##DATA TABLE= (X++(R..R)), XYDATA
$$ [...]
19457A3446d25288C75876A73232e4989K6896I6541b16842O6950B06873D3101a51870
$$ 13446 -425288 375876 173232 -54989 -28093 96541 -216842 -149892 206873 43101 -151870
19445A07490J90329e9793j57375D8537J19640D0691e6472I2230c04224N9745A85619
$$ 107490 297819 -59793 -217168 48537 168177 40691 -56472 92230 -304224 -244479 185619
19433i6674A12908F676b37474L2838j08949l701a43028G2378F828a11867m230
$$ -96674 112908 6676 -237474 -204636 -313585 -317286 -143028 72378 6828 -111867 -116097
19422a16097B96938a82848O8408r7903O0376B82282C5252J55098a65893O7695
$$ -116097 296938 -182848 -114440 -212343 -151967 282282 35252 190350 -165893 -98198
19412i8198d6308D159K9008g1755B68532I9603J40615c67406e3510m4216L2868
$$ -98198 -46308 4159 33167 -71755 268532 99603 240218 -367406 -53510 -97726 -64858
19401f4858L0110a5886k33741j740j41258b7651j58225c9920q2683m1219p362
$$ -64858 -34748 -15886 -249627 -251367 -392625 -27651 -185876 -39920 -122603 -163822 -171184
19390a71184a5491B25984j7905a84543A6991a86495p8960j4456i0070d0229A22502
$$ -171184 -15491 225984 208079 -184543 16991 -186495 -265455 -279911 -90070 -40229 122502
19378C0506J71833b26825g7438C222a54145G9862a36503H1530b71838A47569K26656
$$ 30506 202339 -226825 -77438 3222 -154145 79862 -136503 81530 -271838 147569 374225
19367C74225a33369A745b45416A50388a31818q3953d1197k13169A08985a26311
$$ 374225 -133369 1745 -245416 150388 -131818 -215771 -41197 -254366 108985 -126311
19356A9253b26783O0125d2388r8663f3008A71304B1194c78282J12302A70844h5096
$$ 19253 -226783 -166658 -42388 -141051 -63008 171304 21194 -378282 -265980 170844 -85096
19344C031J77971d36008I1788B0369a32035a1613m1621H4108e6669a4693j21555
$$ 3031 181002 -436008 91788 20369 -132035 -11613 -53234 84108 -56669 -14693 -136248
19333a36248l3345f275F3973c2788k33308D5178i5579D71310A51150F6748c33162
$$ -136248 -169593 -6275 63973 -32788 -266096 45178 -95579 471310 151150 66748 -333162
19321c55666P6720o8540h2796A88342a36614E9543L59741B0315J05428b14402
$$ -355666 -278946 -347486 -82796 188342 -136614 59543 419284 20315 125743 -214402
19310b5108l7216A03122a80081D1156a38716F0077k3071a90068M5123m6001P5013
$$ -25108 -62324 103122 -180081 41156 -138716 60077 37006 -190068 -144945 -190946 -115933
19299a15933b4436k406l9390n69655A10973h6268H3153J4373O580b3426m65960
$$ -115933 -24436 -26842 -66232 -635887 110973 -86268 83153 97526 104106 -23426 -489386
19288d89386g9228c8687C3904d860l84376A55346A3681N3499a36429r6820E9048
$$ -489386 -79228 -38687 33904 -4860 -389236 155346 13681 67180 -136429 -233249 59048
19276A41576f6837a8596k10013K4293a7641j64404O844F6967d68666a3562E1020
$$ 141576 -66837 -18596 -228609 -204316 -17641 -182045 -175201 66967 -468666 -13562 51020
19264h4387p8100p3885A45479F7916N9253a16301g371k9857j39143F3866b40300
$$ -84387 -162487 -236372 145479 67916 127169 -116301 -7371 -37228 -176371 63866 -240300
19252C3093a33516H5033d4648k58937G2050b9116A77245J48547r0352B8154J18597
$$ 33093 -133516 85033 -44648 -303585 72050 -29116 177245 325792 235440 28154 146751
19241A46751c273k95431J37872E8023Q5199F2896H865J76107p0504b54885P4865
$$ 146751 -3273 -298704 -160832 58023 143222 62896 8865 184972 114468 -254885 -180020
19230a80020Q2833k8062N0347a9068k1654B9099b63640e5731n6059l1467K4162
$$ -180020 -97187 -125249 -74902 -19068 -40722 29099 -263640 -55731 -111790 -143257 -119095
19219a19095M4948l49166A94613b36130D2945b45419N6890A43131C3130o001i7799
$$ -119095 -74147 -423313 194613 -236130 42945 -245419 -188529 143131 33130 27129 -97799
19207c10920k7644A5459a95727D5648Q1422E8684k2284O1275a7386A74940g4466
$$ -310920 -338564 15459 -195727 45648 127070 58684 36400 97675 -17386 174940 -74466
19195b06790j34682c4954a1369j17027j14659G1049d0320k0256j69839B40955
$$ -206790 -341472 -34954 -11369 -128396 -243055 71049 -40320 -60576 -230415 240955
19184b56920C1104a34410A5946c04017F3942J98467a76262I2103K31450H399O2105
$$ -256920 31104 -134410 15946 -304017 63942 262409 -176262 92103 323553 8399 70504
19173G0504b60538j5098P7166G2573a54219j48778a5334H2177b29451L2242p7242
$$ 70504 -260538 -275636 -198470 72573 -154219 -302997 -15334 82177 -229451 -197209 -274451
19162b74451b9886o9016A62896b25510k9497I4436n773l4765a20638C4361c42902
$$ -274451 -29886 -98902 162896 -225510 -255007 94436 88663 53898 -120638 34361 -342902
19150b87588b9980r4706M0480J880p2810l9975e5520A27768d1450o3215B28974
$$ -287588 -29980 -124686 -84206 -82326 -155136 -195111 -55520 127768 -41450 -104665 228974
19138A68485a59476d2608l5269a1688A24981i5712A41576R8816e5657p4501k9027
$$ 168485 -159476 -42608 -77877 -11688 124981 -95712 141576 240392 -55657 -130158 -159185
19127a59185A50977g6614C1058J3499B0220b10337o4495e9717j21442O5609j84
$$ -159185 150977 -76614 31058 44557 20220 -210337 -274832 -59717 -181159 -115550 -115734
19116a15734L2574A06859N8866b02293P0279M3500j86219F6649i2826K4056m8831
$$ -115734 -83160 106859 165725 -202293 -132014 -88514 -274733 66649 -92826 -68770 -117601
19105a17601K3952A73829B6084J38651c816k98375a17958A6395C905e3709k02677
$$ -117601 -93649 173829 26084 164735 -3816 -302191 -117958 16395 3905 -53709 -256386
19094b56386k58371b38847E7607M0005a9033A1583J24987n4807a05640M4457D6433
$$ -256386 -514757 -238847 57607 97612 -19033 11583 136570 81763 -105640 -61183 46433
19082i1094C5886j41j0723e9597j693J4709r4999j55128F9041b57313h7251H9545
$$ -91094 35886 35745 25022 -59597 -61290 -46581 -141580 -296708 69041 -257313 -87251 89545
19069b27923H3966R322c26564m83h4648E3495L8079a76252A1167g6028q3807A23554
$$ -227923 83966 93288 -326564 -327047 -84648 53495 91574 -176252 11167 -76028 -159835 123554
19056A41584C3128N8844b19517N5368o578g0167n9122e3478B1630b30063M867
$$ 141584 33128 91972 -219517 -164149 -170727 -70167 -129289 -53478 21630 -230063 -225196
19045b25196p0862D03621F0787a68447G9916i7453j0836l4549O8675d726G2654
$$ -225196 -296058 403621 60787 -168447 79916 -97453 -108289 -142838 -74163 -4726 72654
19033B18398q9725d8190k8007l19276B47634b82266C4935a26683J6932C76870
$$ 218398 128673 -48190 -76197 -395473 247634 -282266 34935 -126683 -109751 376870
19022A41658k5333c428A08844b99692k5182A62504C5967a50997A13656K9593a81145
$$ 141658 116325 -3428 108844 -299692 -324874 162504 35967 -150997 113656 143249 -181145
19010a50496k68583B31851c809A12822d1417D0709i8649k09359A26077c41372
$$ -150496 -419079 231851 -3809 112822 -41417 40709 -98649 -308008 126077 -341372
18999a94617B58376a42321H3220c96369a64089A66420J30812F2731Q5105b79337
$$ -194617 258376 -142321 83220 -396369 -164089 166420 297232 62731 147836 -279337
18988b11519h7840K3056m932j07700A13501a20719n4022b4442A9117l678J77556
$$ -211519 -87840 -64784 -69716 -177416 113501 -120719 -174741 -24442 19117 15439 192995
18977A92995m5042K3346m5443a56873H7397b17992A24528N72542j31481I2755
$$ 192995 147953 171299 125856 -156873 87397 -217992 124528 697070 565589 92755
18966C2999b86524B14904g3563E1046O5004c08902g0280A83472g8401k77941B6439
$$ 32999 -286524 214904 -73563 51046 116050 -308902 -70280 183472 -78401 -356342 26439
18954e8856p1825P500d9042j45438a6019k14171c2822k80736J11113j17342B37068
$$ -58856 -130681 -123181 -49042 -194480 -16019 -230190 -32822 -313558 -202445 -319787 237068
18942d76436a35502A45440A3505b1755l90622D59436a72800p2729C5951R8357
$$ -476436 -135502 145440 13505 -21755 -412377 459436 -172800 -245529 35951 134308
18932A34308K28946A18063b22409A27564b90001K8424F3867C0983b80724P8096
$$ 134308 363254 118063 -222409 127564 -290001 -261577 63867 30983 -280724 -202628
18922b02628n4021C67606a21707A16214E7445J75111I6974b1147j76530a4078
$$ -202628 -256649 367606 -121707 116214 57445 232556 96974 -21147 -197677 -14078
18911E9605i2720A02566A221M22187K54659C37272R7800b01301k1670n5736a38761
$$ 59605 -92720 102566 1221 423408 678067 337272 435072 -201301 -222971 -278707 -138761
18899b4318n0968k41315a06991A02356b46339A80148K08060d2093E9254a40064
$$ -24318 -75286 -316601 -106991 102356 -246339 180148 388208 -42093 59254 -140064
18888A45969d5663a4476k64017B22076p8641P5857g4798o520I9223l2369b61846
$$ 145969 -45663 -14476 -278493 222076 143435 219292 -74798 -81318 99223 66854 -261846
18876b64918J22766Q424j16325f0691A42641a25079A01866b6142l19404B35149
$$ -264918 -142152 -133728 -250053 -60691 142641 -125079 101866 -26142 -345546 235149
18865a56380g23G7723Q932G92K0588J78710J04047c39221O6305C4432f7728j25318
$$ -156380 -723 77723 86655 792 21380 200090 304137 -339221 -272916 34432 -67728 -193046
18853a93046l6300A0103R6104j1683b22354j67094A62616b8002A81253d6870r2290
$$ -193046 -229346 10103 106207 94524 -222354 -389448 162616 -28002 181253 -46870 -139160
18842a39160C448O5281c73903a14780A07106f7324K9932C54240a07852I0715C1446
$$ -139160 3448 68729 -373903 -114780 107106 -67324 -37392 354240 -107852 90715 31446
18830B81646A6182J93228e3309H2961a20103o8079P9225I2376c5253k70310a23823
$$ 281646 16182 209410 -53309 82961 -120103 -188182 -108957 92376 -35253 -305563 -123823
18818b89493Q1249i5010A9258J96065B3122M3054K15006a84357M9176B02062m0947
$$ -289493 -208244 -95010 19258 215323 23122 66176 281182 -184357 -135181 202062 161115
18807A61115J6240N9439J14743a98549c1492o1167j6098A60007m6059J23326l8869
$$ 161115 177355 236794 351537 -198549 -31492 -92659 -108757 160007 113948 237274 198405
18796A98405P3668B6563J21085F5755J0427b38216F5295a03390j1796A46941a76522
$$ 198405 272073 26563 147648 65755 76182 -238216 65295 -103390 -115186 146941 -176522
18784d8783j37514A06806b15817a01466g855m7198A25405J3760B4834a52478c8510
$$ -48783 -186297 106806 -215817 -101466 -7855 -55053 125405 139165 24834 -152478 -38510
18772d17414J48359N6784A0620K23064m7054e0098k93314B0227d3433B67805a54961
$$ -417414 -269055 -212271 10620 233684 186630 -50098 -343412 20227 -43433 267805 -154961
18760h8446l27842J78841j3312f8439l07160L7913A61393a05110A82265K03416
$$ -88446 -416288 -237447 -250759 -68439 -375599 -337686 161393 -105110 182265 385681
18750C85681j71267D3091b40504h7010b0975o4335K4831D1689a80013e1984j31992
$$ 385681 214414 43091 -240504 -87010 -20975 -85310 -60479 41689 -180013 -51984 -183976
18739a83976b634j52738j78969J19824D1352b25651A05357J67645C0675J12567
$$ -183976 -2634 -155372 -334341 -214517 41352 -225651 105357 273002 30675 143242
18729A43242k6951h0227P705j0088B2865c26656h6924j94477J11430A34564N6680
$$ 143242 116291 -80227 -72522 -82610 22865 -326656 -86924 -281401 -169971 134564 191244
18718A91244H0237K28369a43087N6906A41945B7050a64868c9171k32166p6493
$$ 191244 80237 308606 -143087 -86181 141945 27050 -164868 -39171 -271337 -347830
18708c47830J24964b52j49997c2149j94310d6328I3289j1851d5655B15644J12823
$$ -347830 -222866 -252 -150249 -32149 -226459 -46328 93289 81438 -45655 215644 328467
18697C28467a0087l03506h8595p4499D22272a60026K996B69588e8226m825J8041
$$ 328467 -10087 -313593 -88595 -163094 422272 -160026 -157030 269588 -58226 -63051 -45010
18686d5010a0531j76976r9709i3845j0656k0690j07632q2116h4591j88970f3479
$$ -45010 -10531 -187507 -287216 -93845 -104501 -125191 -232823 -314939 -84591 -273561 -63479
18674b34798A48615f1520F7183j606Q4878M2073m5823n2248a54799g4613r7532
$$ -234798 148615 -61520 67183 65577 150455 192528 146705 94457 -154799 -74613 -172145
18663a72145j37509H2685d5743A52264J46288a63689B1795b7391j15138A64216
$$ -172145 -309654 82685 -45743 152264 298552 -163689 21795 -27391 -142529 164216
18652A9265b92603J02637P2703J0800J7032l4192A2570Q4448b89701J02778p9462
$$ 19265 -292603 -189966 -117263 -106463 -89431 -123623 12570 97018 -289701 -186923 -266385
18641b66385B51593c13944j4072d9199F2175a50736P076m9798k15637E4343b78352
$$ -266385 251593 -313944 -328016 -49199 62175 -150736 -143660 -193458 -409095 54343 -278352
18629c4722D4381b27265J00515A21972j8643b61054A92642a58254A03340a69309
$$ -34722 44381 -227265 -126750 121972 103329 -261054 192642 -158254 103340 -169309
18618b4897D18656h728o0057A71982c26881J44409l3269q8578B13614a60329c140
$$ -24897 418656 -8728 -68785 171982 -326881 -182472 -215741 -304319 213614 -160329 -3140
18606A37370b35798N4180Q2117A08193j1448a31314k47629J85483B29745d3892
$$ 137370 -235798 -181618 -99501 108193 96745 -131314 -378943 -193460 229745 -43892
18595a80817l8279A99546a8657j65483A85397B2796K52996B5693c81903A44554
$$ -180817 -219096 199546 -18657 -184140 185397 22796 275792 25693 -381903 144554
18584B41973A1084a91101r4771A8009J32899J6037L1842a05080d0603q2041J9076
$$ 241973 11084 -191101 -285872 18009 150908 166945 198787 -105080 -40603 -122644 -103568
18573a03568k54639j35089A26475a31154q107A69115G2837a60511A99309R0137
$$ -103568 -358207 -493296 126475 -131154 -139261 169115 72837 -160511 199309 289446
18563B89446c94640a2753j83549q8664H5538K5338a50706j38628J24167M8858
$$ 289446 -394640 -12753 -196302 -284966 85538 110876 -150706 -289334 -165167 -116309
18553a16309j64505m2178O8100C6995J15919e2111j11415a4218A17554b06491
$$ -116309 -280814 -322992 -254892 36995 152914 -52111 -163526 -14218 117554 -206491
18542A4770d9251o0752D4183M4213a0560k4384O864j32914C20970e6230q4494
$$ 14770 -49251 -110003 44183 88396 -10560 -34944 -28080 -160994 320970 -56230 -140724
18531a40724N4657A41714d61275A5363b3293n53571B78385C210N0351j97a24117
$$ -140724 -86067 141714 -461275 15363 -23293 -576864 278385 3210 53561 53364 -124117
18519A59353b84957J17907A98236f2143C3516a41414O6058l3795B65118j4805
$$ 159353 -284957 -167050 198236 -62143 33516 -141414 -75356 -109151 265118 250313
18509B50313h0796D0163a11324A23254D7328C573a50415D7167a9076r8265N4779
$$ 250313 -80796 40163 -111324 123254 47328 3573 -150415 47167 -19076 -117341 -62562
18498f2562k5264m7580r4534F2941i0003M4824j75600p557A20857d64094a99428
$$ -62562 -87826 -135406 -229940 62941 -90003 -45179 -220779 -228336 120857 -464094 -199428
18486A64779b14956R5703r44m3733i582k6288j05926k55273c8409l40612A34834
$$ 164779 -214956 -119253 -120197 -163930 -9582 -35870 -141796 -397069 -38409 -379021 134834
18474e0008q4205l1744F7617K30860d1016B9520P869b3059j83412E1011g871k55480
$$ -50008 -134213 -165957 67617 298477 -41016 29520 37389 -23059 -206471 51011 -7871 -263351
18462b63351a06185N0255B11302g2519j22383j8346O8343j86347J30761A98802
$$ -263351 -106185 -55930 211302 -72519 -194902 -213248 -144905 -331252 -200491 198802
18451c513A96194c67931d909B4952j0951a7611o2132B1076d3979l59572E0279
$$ -3513 196194 -367931 -4909 24952 14001 -17611 -79743 21076 -43979 -403551 50279
18439b07577b4677j98541B11078B6584O5425h3648C6421K0217R7484c27812H3446
$$ -207577 -24677 -223218 211078 26584 92009 -83648 36421 56638 154122 -327812 83446
18427F0042c0233k4146k6302a017n1016l27183h546l78744C053f1067I6799c45129
$$ 60042 -30233 -54379 -80681 -1017 -52033 -379216 -8546 -387290 3053 -61067 96799 -345129
18414g7600B06746b06755B1638J17850c21743J24584A54181b39258B4721O8072
$$ -77600 206746 -206755 21638 139488 -321743 -197159 154181 -239258 24721 92793
18404I2793J29516I0301l9649a88005a7368A37016J13866h0139A65782a54031
$$ 92793 222309 90301 50652 -188005 -17368 137016 250882 -80139 165782 -154031
18393c977B66943a06647B44104l2215j7733I3714J89830a5355A63365a64918g2825
$$ -3977 266943 -106647 244104 211889 194156 93714 283544 -15355 163365 -164918 -72825
18381C49968i3326M4304j85654J4585A13106a67014B2384h3199j72135c74q7813
$$ 349968 -93326 -49022 -234676 -220091 113106 -167014 22384 -83199 -255334 -374 -88187
18370h8187j07876C94537b2280A83308C7579a01965G0376L4050c18515J32177
$$ -88187 -196063 394537 -22280 183308 37579 -101965 70376 104426 -318515 -186338
18360a86338j76880f9006B2701L1434K30949a8799I3190J29664h7025a4884A62025
$$ -186338 -363218 -69006 22701 54135 285084 -18799 93190 222854 -87025 -14884 162025
18348a35662e8960B8463c06287a9247C38350b8852j11024b5225o5955k6343R120
$$ -135662 -58960 28463 -306287 -19247 338350 -28852 -139876 -25225 -91180 -117523 -108403
18337a08403B43086A13755m4922i596n15886b0206j53530B85588a83399B14399
$$ -108403 243086 113755 68833 -9596 -525482 -20206 -173736 285588 -183399 214399
18326E8836N5935c54358J21424H881R0486a43495B769J42465J51590L335j49414
$$ 58836 114771 -354358 -232934 8881 99367 -143495 2769 145234 296824 300159 150745
18315A50745l7875l6711b02939a1045r7021r0284R6521A05696d2687a3355l45891
$$ 150745 112870 76159 -202939 -11045 -108066 -198350 -101829 105696 -42687 -13355 -359246
18304c59246J61677A00011D0937b85955E577a49614e2233k9410K5567K1204A25857
$$ -359246 -197569 100011 40937 -285955 5577 -149614 -52233 -81643 -56076 -34872 125857
18292d51613h6098C753g851n1039J3489j8039k19324D90954E9416Q6178D2462
$$ -451613 -86098 3753 -7851 -58890 -45401 -63440 -282764 490954 59416 145594 42462
18280b85131J17965n9977c7113A29339n778Q5633f454I0259a77838m822c8433
$$ -285131 -167166 -227143 -37113 129339 123561 209194 -6454 90259 -177838 -182660 -38433
18268b13100L1582Q0048r7930a942k5614B9942e7214j37627D5932P0695g8226
$$ -213100 -181518 -101470 -199400 -1942 -27556 29942 -57214 -194841 45932 116627 -78226
18256b9445B3425a27424A91996J0413c04815a36571j09939J08950f832b961I6263
$$ -29445 23425 -127424 191996 202409 -304815 -136571 -246510 -137560 -6832 -2961 96263
18244B9027c09531A83127d1298j87169C7169o438c5907A13040C7112n87K9191
$$ 29027 -309531 183127 -41298 -228467 37169 30731 -35907 113040 37112 36525 65716
18233F5716e12836A23427a82225B48950d4434j41845b9047m34013A71120a48383
$$ 65716 -512836 123427 -182225 248950 -44434 -186279 -29047 -463060 171120 -148383
18222B83643a30600B95084C1918H124c04000J06701H2515i1892A07568C4752a01783
$$ 283643 -130600 295084 31918 8124 -304000 -197299 82515 -91892 107568 34752 -101783
18210c24343A60738a06281J4100j02078c6800B1551K96501a11053P086n3270C19
$$ -324343 160738 -106281 -92181 -194259 -36800 21551 318052 -111053 -103967 -157237 319
18198B7372L49574g9761j18736j37930a0798l70985A89020P9210G7034d32012
$$ 27372 376946 -79761 -198497 -336427 -10798 -381783 189020 268230 77034 -432012
18187H8125b38703q629a03774b5055G2716f9257B07096j1342g5767C05649a61670
$$ 88125 -238703 -247332 -103774 -25055 72716 -69257 207096 195754 -75767 305649 -161670
18175E9286b74681J21900G4889R7523a59054A35680m1469a38264O7995C99826
$$ 59286 -274681 -152781 74889 172412 -159054 135680 94211 -138264 -70269 399826
18164c36482b823j13452D3093J43145J09419A03952b30619j55292B23214M1666
$$ -336482 -2823 -116275 43093 186238 295657 103952 -230619 -385911 223214 264880
18154B64880j01426a84444B4361O0599d0085M412I5614h9551A24008b8475E963
$$ 264880 163454 -184444 24361 84960 -40085 -35673 95614 -89551 124008 -28475 5963
18142B44626a4886j55085L1313e5915G7010a65505j0246H3627J05203n4366n5335
$$ 244626 -14886 -169971 -138658 -55915 77010 -165505 -175751 83627 188830 134464 79129
18131G9129h560K719A80594b77648E2384K12698a57157N7875j50871e7819o9723
$$ 79129 -8560 -5841 180594 -277648 52384 265082 -157157 -99282 -250153 -57819 -127542
18120a27542j45667a12284H9767J76036A01517a14642A67434N3152Q5705a01071
$$ -127542 -273209 -112284 89767 265803 101517 -114642 167434 220586 306291 -101071
18109a79531D705b27061A18942J4829D5797Q0551P2568q7263a16761j33185j42258
$$ -179531 4705 -227061 118942 133771 45797 126348 198916 111653 -116761 -249946 -392204
18098c92204g5310m989C86660a17200I8443M4278F3484R4334a02844k10735A09382
$$ -392204 -75310 -80299 386660 -117200 98443 142721 63484 157818 -102844 -313579 109382
18086A66159a12113k7754C6100i8638B8981A3736J21418b63302Q6249B90241j5788
$$ 166159 -112113 -139867 36100 -98638 28981 13736 135154 -263302 -177053 290241 274453
18075B74453D7932a7674A93404b27772A27894P5797J24431a12759A93007I147
$$ 274453 47932 -17674 193404 -227772 127894 203691 328122 -112759 193007 9147
18064a67764k37956B80997d6245l4436c3791j37117E4008A671J17158a69603A18959
$$ -167764 -405720 280997 -46245 -80681 -33791 -170908 54008 1671 118829 -169603 118959
18052d2553A51173f5249j12688G2692a25031K7134A92780d7784C01809h3772o1733
$$ -42553 151173 -65249 -177937 72692 -125031 -97897 192780 -47784 301809 -83772 -145505
18041a45505j80296h4395j88548Q582h5143c628D7801d4052k22154E6626P135
$$ -145505 -325801 -84395 -272943 -264361 -85143 -3628 47801 -44052 -266206 56626 63761
18030F3761g0526B9152L8796M7331g5119o0653A57706i3404k6220B30134G7749
$$ 63761 -70526 29152 67948 115279 -75119 -135772 157706 -93404 -119624 230134 77749
18018A03692g9884J2632l080k26295A49708B6894c5745j55484b4274A47234b58318
$$ 103692 -79884 -67252 -70332 -296627 149708 26894 -35745 -191229 -24274 147234 -258318
18006b7836B92569c8518n0066o102B19048I7866e0889k65711J10060D1499b9782
$$ -27836 292569 -38518 -88584 -94686 219048 97866 -50889 -316600 -206540 41499 -29782
17994B17277E2959a59929d5893E0338a86663q6089a26923K9629L7692k70942R0714
$$ 217277 52959 -159929 -45893 50338 -186663 -272752 -126923 -97294 -59602 -330544 -239830
17983b39830A53639b50040B96447a30605A13145D6870h710j90602a3034k0762
$$ -239830 153639 -250040 296447 -130605 113145 46870 -8710 -199312 -13034 -33796
17973c3796E0225J50960q5773c28622C36795Q001q2050k277a95132d6976B1350
$$ -33796 50225 201185 115412 -328622 336795 344796 262746 260469 -195132 -46976 21350
17961e04640B61603b41476h906B93712c0133k28655B25529l3543A6549c9691I817
$$ -504640 261603 -241476 -8906 293712 -30133 -258788 225529 191986 16549 -39691 9817
17949a126o948D7961L7374J98227a24382A38863M6428A3218a36725A19861a57705
$$ -1126 -8074 47961 85335 283562 -124382 138863 185291 13218 -136725 119861 -157705
17937a77267B68760j1677h9334A14177L76576k25646A5049K23749D4819K36096
$$ -177267 268760 257083 -89334 114177 490753 265107 15049 238798 44819 280915
17927B80915A30047j7027h2545a9157r8311j03447B42185j00388J74991a94896
$$ 280915 130047 113020 -82545 -19157 -117468 -220915 242185 141797 316788 -194896
17916A22604b15469e8737C1606K52966A2378a92127Q7108B03132g395F536J83484
$$ 122604 -215469 -58737 31606 284572 12378 -192127 -105019 203132 -7395 6536 190020
17905A90020q7205d1525d309C7965c59528f0646C03878E6688J05800h6492A2453
$$ 190020 102815 -41525 -4309 37965 -359528 -60646 303878 56688 162488 -86492 12453
17893b32177B66245q8395P3593p6810P5495A0046a08823j04790e031B48826A09526
$$ -232177 266245 177850 251443 174633 250128 10046 -108823 -213613 -5031 248826 109526
17881A24786D6683P7462j3680c34240B70059C7076J93475i0169K8551I6506a95819
$$ 124786 46683 124145 110465 -334240 270059 37076 230551 -90169 -61618 96506 -195819
17869b06620M0800f950I446J49795g0430j74313E625a09994J4915q875G6086l3575
$$ -206620 -165820 -6950 9446 159241 -70430 -244743 5625 -109994 -95079 -103954 76086 42511
17857D2511j355J72181r7378a1386n54A41612E1084J66356a00832c8858m8040
$$ 42511 41156 213337 115959 -11386 -11940 141612 51084 217440 -100832 -38858 -86898
17846h6898B609K0389g8719B24220j01983M26251h1805C9727L0572a1280C21324
$$ -86898 2609 22998 -78719 224220 122237 548488 -81805 39727 70299 -11280 321324
17834a45916I3971a7980m6658B8771b1596D1088d3687B09731b70587a15563J8322
$$ -145916 93971 -17980 -64638 28771 -21596 41088 -43687 209731 -270587 -115563 -97241
17823i7241A1418L75933j52216D311J7715a26941G5824J753a81613C26159a90328
$$ -97241 11418 387351 235135 4311 22026 -126941 75824 77577 -181613 326159 -190328
17811A31988e1557C25711b73429a10803O366F2812c80614E2995L7049a02862B62692
$$ 131988 -51557 325711 -273429 -110803 -104437 62812 -380614 52995 90044 -102862 262692
17799E09745e3098B22115p6630a23843N3118j14817E43927B1579d6181E2297P7269
$$ 509745 -53098 222115 145485 -123843 -70725 -185542 543927 21579 -46181 52297 129566
17788A29566d3960n1595A92600j450C5311a13429B49455b07199B09732b12555
$$ 129566 -43960 -95555 192600 191150 35311 -113429 249455 -207199 209732 -212555
17777b73779B88498e693A90586C5393A2735L5447b4142n0226A3825K45947H9037
$$ -273779 288498 -5693 190586 35393 12735 48182 -24142 -74368 13825 259772 89037
17765A57549o2939J99097B9966b58648B0591N6214A7177M9501b10251A71730c466
$$ 157549 94610 293707 29966 -258648 20591 76805 17177 66678 -210251 171730 -3466
17753d5102A91338m6398l3404f2483r7001m3117A8884J4573m154L32614a7220
$$ -45102 191338 144940 111536 -62483 -159484 -202601 18884 33457 29303 361917 -17220
17741B03146I7618a6255j6549J5092G1382g2374q2931G9811N5112P2977m5167
$$ 203146 97618 -16255 -32804 -17712 71382 -72374 -155305 79811 134923 207900 162733
17730A62733N08881B11977J46331j00208c62466C04100e1020j00107B1324A029
$$ 162733 671614 211977 358308 258100 -362466 304100 -51020 -151127 21324 1029
17719D12258A77480H2972L46024j10807a15361A87961I0363L59427J07952G6968
$$ 412258 177480 82972 428996 318189 -115361 187961 90363 449790 557742 76968
17708D10247i0868f250D4107P0927N1561a34651J7319B40488I044L1936M87410
$$ 410247 -90868 -6250 44107 115034 166595 -134651 -117332 240488 9044 40980 528390
17697E28390A64566J95903a12801q8731R6133k561d268H6965j8124L7259m6712
$$ 528390 164566 360469 -112801 -201532 -105399 -107960 -4268 86965 68841 106100 59388
17686E9388K74497j20711F3144a15479C0001R5029P8272C4517L6813R4378a03676
$$ 59388 333885 213174 63144 -115479 30001 125030 203302 34517 71330 165708 -103676
17674E1366p113J63176J11442c12307A72509f631k1507C09661D9724a5641k4501
$$ 51366 44253 207429 318871 -312307 172509 -6631 -28138 309661 49724 -15641 -40142
17663d0142D6531K32492A36680C9045G524J71230K04939j49973E0426a09327A55875
$$ -40142 46531 279023 136680 39045 7524 178754 383693 233720 50426 -109327 155875
17651b96399P7153C60724H9991l7299a1506j37661H2732J17163a83853j8891E5271
$$ -296399 -219246 360724 89991 52692 -11506 -149167 82732 199895 -183853 -202744 55271
17639b33844A74089k6708h6708M2672a4561D3959J31207M7380A00297L22252G8567
$$ -233844 174089 147381 -86708 -44036 -14561 43959 175166 222546 100297 422549 78567
17627A35767A6672a99301B27093a3714I7334J91897B418M7815A036N2545K73146
$$ 135767 16672 -199301 227093 -13714 97334 289231 2418 50233 1036 53581 326727
17616C26727f2130E818K3127L38337L6235A12055a05351A38824d5617J5247A37361
$$ 326727 -62130 5818 28945 367282 403517 112055 -105351 138824 -45617 -30370 137361
17604A70591N7187m0443c1112n1738B93036A34804E4486J72557k6625q4713M5153
$$ 170591 227778 187335 -31112 -82850 293036 134804 54486 227043 200418 115705 160858
17593A60858K0081J7790a29543I5238K83128A66599b6411B27642b27587J9785
$$ 160858 180939 198729 -129543 95238 378366 166599 -26411 227642 -227587 -207802
17583b07802A30011J0525A8012d2645A74576O1026c2786C94820a83929A68344
$$ -207802 130011 140536 18012 -42645 174576 235602 -32786 394820 -183929 168344
17572C3917L04976F3457L72789i8021B77690M6346j29446A8103M3254M0684g994
$$ 33917 338893 63457 436246 -98021 277690 324036 194590 18103 61357 102041 -7994
17560A22073R7611p6141a86135H8203J02838O9071i0917B81855a72487G9827N2672
$$ 122073 219684 143543 -186135 88203 191041 260112 -90917 281855 -172487 79827 132499
17549A32499b25534C41299o4194a56532B75598p7103R7742C3144J61724J53235
$$ 132499 -225534 341299 277105 -156532 275598 198495 296237 33144 194868 348103
17539C48103j59004N4560l6036a23743p2323A64928N1818K48777j20472A31044
$$ 348103 189099 243659 207623 -123743 -196066 164928 216746 465523 345051 131044
17528F18461l9554M6899k52100P96250k59151l5637k51607K79202l22852n8426
$$ 618461 578907 625806 373706 1169956 910805 875168 623561 902763 579911 521485
17518E21485j96027P9737J19917C1306L70342M25237l46513o4491K66891L99219
$$ 521485 325458 405195 525112 31306 401648 826885 480372 415881 682772 1081991
17508A081991K31063k80232l03847A72832L75532p6910k19434J73447E5595M70313
$$ 1081991 1313054 1032822 728975 172832 548364 471454 252020 425467 55595 525908
17498E25908J3042j02704J33604A66020J02172B7317M1840R6705l2335K60722
$$ 525908 538950 436246 569850 166020 268192 27317 69157 165862 133527 394249
17488C94249P8368A07032J67426K23557B29248K20902A25987K18358j2927K40765
$$ 394249 472617 107032 274458 498015 229248 450150 125987 344345 331418 572183
17478E72183B48679P4383N0861j65897C6850M58524j67517j00924M30084j63904
$$ 572183 248679 323062 373923 208026 36850 495374 327857 226933 657017 493113
17468D93113b68518D02540O0651k10922O6604I5843J25467o5473N6272J29013
$$ 493113 -268518 402540 463191 252269 318873 95843 221310 155837 212109 341122
17458C41122r9863L46889B25883j6545l2118O6599N4322E6605Q4194K33021G3498
$$ 341122 241259 588148 225883 209338 177220 243819 298141 56605 140799 373820 73498
17446D62033A76331H2132K62769A72238J09291M96851G9926J75650K75401j56507
$$ 462033 176331 82132 344901 172238 281529 778380 79926 255576 530977 374470
17436C74470j02716A08943J01533b8583D78891j69672l2548r29j35509K44157
$$ 374470 271754 108943 210476 -28583 478891 309219 276671 275742 140233 384390
17426C84390j63141K80725B21690K60074k08350L3133F2772J80307J2275K18039
$$ 384390 221249 501974 221690 481764 273414 306547 62772 243079 255354 473393
17416D73393j93031N0352Q8377A28882O4632L2087j06231L47430A55446P2082
$$ 473393 280362 330714 419091 128882 193514 225601 119370 466800 155446 227528
17406B27528n4097L24658A40651L46010d1311H8012J94926d424C41770l9799A31728
$$ 227528 173431 498089 140651 486661 -41311 88012 282938 -4424 341770 301971 131728
17394B11591K12223G8553r846Q6097a06624C75632H6152K80133l924q1230I3778
$$ 211591 423814 78553 68707 154804 -106624 375632 86152 366285 362361 281131 93778
17382b99472H3030P2865a85918B42464J5304j07394K17637J51070A88022K4200
$$ -299472 83030 155895 -185918 242464 257768 150374 368011 519081 188022 212222
17372B12222l3967J27071M8208o1008h0917B99179L0784A54582L33637q8946r0295
$$ 212222 178255 305326 353534 292526 -80917 299179 329963 154582 488219 399273 308978
17361C08978A37534M42913P712B10500K858M0897m5662j3362K18041A28712M6906
$$ 308978 137534 580447 588159 210500 213358 254255 208593 195231 413272 128712 175618
17350A75618a62550B31558J6267K66900C4700L43311A32349R8117J95143m0621
$$ 175618 -162550 231558 247825 514725 34700 378011 132349 230466 425609 384988
17340C84988j03745e0255C29348j07842k531J4353J37397E5415M23433H9058L6004
$$ 384988 281243 -50255 329348 221506 218975 233328 370725 55415 478848 89058 125062
17329A25062J22215I1943J53673J87761b2882C40021l5635G8152K14874A20994
$$ 125062 247277 91943 245616 433377 -22882 340021 304386 78152 293026 120994
17318b10683F3704J83902F6508M20738H6157J16294K29416o8149K6490J21416
$$ -210683 63704 247606 66508 487246 86157 202451 431867 363718 390208 511624
17308E11624A30067P0646R0100M413M131E7674J23316L67940k08897R4484j47953
$$ 511624 130067 200713 290813 295226 299357 57674 180990 548930 340033 434517 286564
17297B86564N7924m7051o2675K39293j29915m2336j14107J69992L700m3323J41662
$$ 286564 344488 297437 234762 474055 344140 301804 187697 357689 361389 318066 459728
17286D59728A75748J56944K03277A52876l3283J23350E4432L19862b78011A84721
$$ 459728 175748 332692 535969 152876 119593 242943 54432 374294 -278011 184721
17275C57404l1664M3484j77629L25395D5471R0268J69584M219L2927j28454J36799
$$ 357404 325740 369224 191595 516990 45471 135739 305323 309542 342469 214015 350814
17264C50814j17079J88729A82908P7704J08902A33693L00073J14581J17992n6488
$$ 350814 233735 422464 182908 260612 369514 133693 433766 548347 666339 609851
17254F09851B91853j35619O7442J35483j23127j0134M3232J35839j70894M6546
$$ 609851 291853 156234 223676 359159 236032 225898 269130 404969 234075 280621
17244B80621K28203j70334j10445J78403J35598j66374P4460r8766J10895R2483
$$ 280621 508824 338490 228045 406448 542046 375672 450132 351366 462261 554744
17234E54744k63672p9969K07649m1595J7452m6669M7176J75979H6024K00296E7113
$$ 554744 291072 211103 418752 377157 394609 347940 395116 571095 86024 286320 57113
17222D74481B16821P0413L6197L7884R6656q6803o4044N47797D05300j6837O4882
$$ 474481 216821 287234 323431 361315 457971 371168 307124 854921 405300 388463 453345
17211D53345k15559J53172L31335C56770J28608A90632L07942L4997C4709K64819
$$ 453345 237786 390958 722293 356770 485378 190632 498574 533571 34709 299528
17201B99528J86526A99858M00403k98494j15660L01773O0279j41182L74349l71709
$$ 299528 486054 199858 600261 301767 186107 487880 548159 406977 781326 409617
17191D09617j80885K7964K35648L4017k59931L75816G4140N40909j14622R9397
$$ 409617 228732 256696 492344 526361 266430 642246 74140 615049 500427 599824
17181E99824k40653o672M9525k9603j5986n4720Q9111M58328C37418J44822L3680
$$ 599824 359171 352499 402024 372421 356435 301715 390826 849154 337418 482240 515920
17170E15920P5445B35615N27362k69219K45105C43015j39972M87388C19352K08563
$$ 515920 591365 235615 762977 493758 738863 343015 203043 690431 319352 527915
17160E27915j00920J877j7627J79319k55075K18886o8404K78506K1632C38554
$$ 527915 426995 428872 411245 590564 335489 554375 485971 764477 786109 338554
17149E42399H8643N09762J1229J84818l46671B21358J03140K46289P1500k0691
$$ 542399 88643 598405 609634 794452 447781 221358 324498 570787 642287 621596
17139F21596O1145B75328K34504J14066N1248j05559J54867l33937M75678k29938
$$ 621596 682741 275328 509832 623898 675146 569587 724454 390517 866195 636257
17129F36257j15015j3010L40787l34416j68560L85236k53989O7712P4534P3099
$$ 636257 521242 508232 849019 514603 346043 731279 477290 545002 619536 692635
17119F92635K13130k34474j13529L1210j08383J81477j0884k30281K4059m5575
$$ 692635 905765 671291 557762 588972 480589 662066 651182 420901 444960 399385
17109C99385A66857M78703B99266L63797K8653k63569K21362J90866k33186p4455
$$ 399385 166857 645560 299266 663063 691716 428147 649509 840375 607189 532734
17099E32734j37201L38120J2270p1352r5079o8202N7245J94027j52178r7632K39103
$$ 532734 395533 733653 745923 674571 579492 511290 568535 762562 610384 512752 751855
17088G51855k25126M3708N10051l81407j33869K9118J32074K52611l08222k20363
$$ 751855 526729 570437 1080488 699081 565212 594330 726404 979015 670793 450430
17078D50430N6643J30303M11383l79809k01556K04808K17617n3255j12425j16307
$$ 450430 507073 637376 1048759 668950 467394 672202 889819 836564 724139 607832
17068F07832J21243J21689r1096l7544O023M06433m88496O5273j1743K22786l6838
$$ 607832 729075 850764 759668 722124 728147 1134580 646084 711357 699614 922400 885562
17057H85562k8727J84296o9656m25624J11988J29734k66509O44413j89269l32346
$$ 885562 856835 1041131 971475 545851 657839 787573 521064 1165477 976208 643862
17047F43862M14048k16642N8487J97014j05052j99780K60682J51683j91175q8159
$$ 643862 1057910 841268 899755 1096769 991717 791937 1052619 1204302 1013127 924968
17037I24968j22580j48256K91514J13970O5385j44589j03607J12856k72751K66110
$$ 924968 802388 654132 945646 1059616 1125001 980412 876805 989661 716910 983020
17027I83020J39775l4564k21110K94558m46713M49809j29220o5451J54019L7563
$$ 983020 1122795 1088231 867121 1161679 714966 1164775 1035555 970104 1124123 1161686
17017A161686m8783j05615n0101J82818k01016J90475J16118k20007P7816j47527
$$ 1161686 1112903 1007288 957187 1140005 938989 1129464 1245582 1025575 1103391 955864
17007I55864J75701J40664j03215L4255n9382M06865l48046K59646j1825k89426
$$ 955864 1131565 1272229 1169014 1203269 1143887 1550752 1202706 1462352 1450527 1161101
16997A161101O3425l31017M38881K1023Q610k13762O7173K0167p113P6606L8748
$$ 1161101 1224526 893509 1332390 1353413 1362023 1148261 1215434 1235601 1228488 1305094 1343842
16986A343842L1814P0452J46817k8594k95320J04810k08344K66773j3344j12087
$$ 1343842 1375656 1446108 1592925 1564331 1269011 1373821 1165477 1432250 1418906 1306819
16976A306819J14630j61953N87948m56450m2116M63494l84148M19064m80523K99127
$$ 1306819 1421449 1259496 1847444 1390994 1348878 1812372 1428224 1847288 1366765 1665892
16966A665892J04588k82697P6827r3438j12512L23812J01568q1834j48648N9984
$$ 1665892 1770480 1487783 1564610 1471172 1358660 1682472 1784040 1702206 1553558 1613542
16956A613542L12986J4302j15754p9222K0168l51220M46950J4022L9050l52336
$$ 1613542 1926528 1940830 1825076 1745854 1766022 1414802 1861752 1875774 1914824 1562488
16946A562488O3131o6396J90386j49987J12891L63590j00276k29696L47993j46401
$$ 1562488 1625619 1559223 1749609 1599622 1712513 2076103 1975827 1746131 2094124 1947723
16936A947723P4615L5010k51201r247M48553k94038M2095j26133L53865j9002
$$ 1947723 2022338 2057348 1806147 1796900 2245453 1951415 1993510 1867377 2221242 2202240
16926B202240l77822L54540k27591N08150m16818M90765r4409k23727l5005P2098
$$ 2202240 1824418 2178958 1951367 2459517 2042699 2533464 2439055 2215328 2180323 2252421
16916B252421J46202K3145L28585m57689K92394p37q8695J06967j19378O27575
$$ 2252421 2398623 2421768 2750353 2292664 2585058 2584321 2495626 2602593 2483215 3110790
16906C110790l23438k12457M3588k62968M50610j94901M07049j99570j22575P2179
$$ 3110790 2787352 2574895 2618483 2355515 2806125 2611224 3018273 2818703 2696128 2768307
16896B768307J03871M5663l29262L41961K79679j4944j67092m2805l7139K46374
$$ 2768307 2872178 2917841 2588579 2930540 3210219 3195275 3028183 2985378 2948239 3194613
16886C194613Q2071Q0580K11299n46283K97126m450J12974N5133L37296k00739
$$ 3194613 3276684 3357264 3568563 3022280 3319406 3314956 3427930 3483063 3820359 3619620
16876C619620j61072K51573Q6247n6370K62111k24389J74829K10824K4740Q6717
$$ 3619620 3458548 3710121 3796368 3739998 4002109 3777720 3952549 4163373 4188113 4274830
16866D274830K71560j33608l42440K90131j4753M66796l42413R5525R4646K4907
$$ 4274830 4546390 4412782 4070342 4360473 4345720 4812516 4470103 4565628 4660274 4685181
16856D685181J84688J58955j29348K16858P8332K57084j47528L05585j46750m8131
$$ 4685181 4869869 5028824 4899476 5116334 5194666 5451750 5304222 5609807 5463057 5414926
16846E414926L05918j20525M44669O8434J4617o9714K18590j06685L38712L98394
$$ 5414926 5720844 5600319 6044988 6113422 6128039 6058325 6276915 6170230 6508942 6907336
16836F907336j2093k28640J03669O470M61228m0382J0399L53197j28395M93807
$$ 6907336 6895243 6666603 6770272 6776742 7237970 7197588 7207987 7561184 7432789 7926596
16826G926596J02978j59807M29332r6327K19840J54049n6904J74353K20561O10809
$$ 7926596 8029574 7869767 8299099 8202772 8422612 8576661 8519757 8694110 8914671 9525480
16816I525480m00455O16767l741K37037O2579j53378O45810K73306M54211k08031
$$ 9525480 9125025 9741792 9738051 9975088 10037667 9884289 10530099 10803405 11257616 11049585
16806A1049585N44513K45992K73552j37813O93467J8067N89681P1915K89651J85407
$$ 11049585 11594098 11840090 12113642 11975829 12669296 12687363 13277044 13348959 13638610 13824017
16796A3824017K89755K96073K51460N57697N42216P84080j98714M20154M87015
$$ 13824017 14113772 14409845 14661305 15219002 15761218 16545298 16346584 16766738 17253753
16787A7253753P36188M27905N37370L37166N36303M70775L73614P58311Q02507
$$ 17253753 17989941 18417846 18955216 19292382 19828685 20299460 20673074 21431385 22233892
16778B2233892K86146P98430J008388M22712Q47053N02624P90573R08880J084736
$$ 22233892 22520038 23318468 24326856 24749568 25596621 26099245 26889818 27798698 28883434
16769B8883434P84898R43777Q13859P06683J324545Q50036J047951J386188J305750
$$ 28883434 29668332 30612109 31425968 32132651 33457196 34307232 35355183 36741371 38047121
16760C8047121J469974J240980J508926J512802J117667J758797J516974J693954
$$ 38047121 39517095 40758075 42267001 43779803 44897470 46656267 48173241 49867195
16752D9867195J827440K059427J955420J973887K032255K070370K317041K520663
$$ 49867195 51694635 53754062 55709482 57683369 59715624 61785994 64103035 66623698
16744F6623698J734304K939392K473590K274505K396481K956517K435804K626798
$$ 66623698 68358002 71297394 73770984 76045489 78441970 81398487 83834291 86461089
16736H6461089K920387K617933K630496K610167K546807K209648K575988K245006
$$ 86461089 89381476 91999409 94629905 97240072 99786879 101996527 104572515 106817521
16728A06817521J558238J903796J552906J408359Q28083J116403L78362J12198
$$ 106817521 108375759 110279555 111832461 113240820 114068903 115185306 115563668 115675866
16720A15675866N3356k42049p30855p74832j390170j219513j961935j598257k351546
$$ 115675866 115729222 115487173 114756318 113981486 112591316 111371803 109409868 107811611 105460065
16711A05460065k092462k453805k232876k607428k977782k722526k608913k238055
$$ 105460065 103367603 100913798 98680922 96073494 93095712 90373186 87764273 85526218
16703H5526218k972111k826236k800214k335017k753957k729730k265547k589447
$$ 85526218 82554107 79727871 76927657 74592640 71838683 69108953 66843406 64253959
16695F4253959k048922k310665j773384k425493k274914j602769j732662j824056
$$ 64253959 62205037 59894372 58120988 55695495 53420581 51817812 50085150 48261094
16687D8261094j677806k049072j249965j172056j667453j302730j814633r15434
$$ 48261094 46583288 44534216 43284251 42112195 40444742 39142012 37327379 36411945
16679C6411945j460530r15062j397578j021655q74712j127801p77715j136396
$$ 36411945 34951415 34036353 32638775 31617120 30742408 29614607 28836892 27700496
16671B7700496n90032n48154j027854p10445r92310p00234n93354n60128n14700
$$ 27700496 27110464 26562310 25534456 24824011 23831701 23131467 22538113 21977985 21463285
16662B1463285q68412m59636o40451q3572j044828j95188n21712n86110k85118
$$ 21463285 20594873 20135237 19494786 19411214 18366386 18171198 17649486 17063376 16778258
16653A6778258q27851j0403n23015m74377j79083l82169o04190l23675O5417m73513
$$ 16778258 15950407 15940004 15416989 14942612 14763529 14381360 13777170 13453495 13518912 13045399
16643A3045399l26485m53117j97423k44138O522q03519J07767q3074m14101l07242
$$ 13045399 12718914 12265797 12068374 11824236 11830758 11027239 11135006 11051932 10637831 10330589
16633A0330589Q1218n94816j81930j66738j97269p6298p4415l91037j71217O5927
$$ 10330589 10411807 9816991 9635061 9468323 9271054 9194756 9120341 8729304 8558087 8624014
16623H624014l22042j6619m83117J22141j37424k52921k63697r2553p6284k4887
$$ 8624014 8301972 8285353 7802236 7924377 7786953 7534032 7270335 7177782 7101498 7076611
16613G076611j80557o5299j33603j91987n3714K68862q35699M36256k99993k83928
$$ 7076611 6896054 6830755 6697152 6505165 6451451 6720313 5884614 6320870 6020877 5736949
16603E736949O8026k81k94404K80640k78794j6825m0434k32800j94411J25450
$$ 5736949 5804975 5804694 5510290 5790930 5512136 5495311 5454877 5222077 5027666 5153116
16593E153116O7043m39811K42531j33418l97730J4415j4040k6988K7284n6446
$$ 5153116 5220159 4780348 5022879 4889461 4491731 4506146 4492106 4465118 4492402 4435956
16583D435956k25063K305n3621J60512k01179m2479j27513J50460k38082o8249
$$ 4435956 4210893 4213198 4159577 4320089 4118910 4076431 3948918 4099378 3861296 3793047
16573C793047K54030j93357j3547q5611j20420M6653j39324O5029j38756j31945
$$ 3793047 4047077 3853720 3840173 3754562 3634142 3680795 3541471 3606500 3467744 3335799
16563C335799J39347J12295m94153K94541p22672K38332j53113K50185j20118
$$ 3335799 3475146 3587441 3093288 3387829 2665157 2903489 2750376 3000561 2880443
16554B880443P7898k05363p4791N5131R8081q0541O7702k01428N9708j69511J01589
$$ 2880443 2958341 2752978 2678187 2733318 2831399 2750858 2818560 2617132 2676840 2507329 2608918
16543B608918k48890K36246k41522K66187l72228R7799n4834P6922o2977J92440
$$ 2608918 2360028 2596274 2354752 2620939 2248711 2346510 2291676 2368598 2305621 2498061
16533B498061j64500n629j36319J36971k11667J56667M6835m60200o7853L74357
$$ 2498061 2333561 2327932 2191613 2328584 2116917 2273584 2320419 1860219 1792366 2166723
16523B166723j54152J38523k15135M08687l20890m50362L60352K52326L09574
$$ 2166723 2012571 2151094 1935959 2344646 2023756 1573394 1933746 2186072 2495646
16514B495646o52600K69292m32640K40041o5781l07005L80620k12376K2293J43519
$$ 2495646 1843046 2112338 1679698 1919739 1853958 1546953 1927573 1715197 1737490 1881009
16504A881009k43639K81623k35274J08243k24485K06766j09113j24310M0677L7348
$$ 1881009 1637370 1918993 1683719 1791962 1567477 1774243 1665130 1540820 1581497 1618845
16494A618845m91215M46548R4938j60301J39974o3797M5809l12423M06623m7621
$$ 1618845 1127630 1574178 1669116 1508815 1648789 1584992 1630801 1318378 1725001 1677380
16484A677380j34010k10444L65323n66229J23531p7677Q0481l9747J87474J6808
$$ 1677380 1543370 1332926 1698249 1132020 1255551 1177874 1258355 1218608 1406082 1422890
16474A422890l6954K10604l45556K12756j21204j76062J69976M0924k03558L8823
$$ 1422890 1385936 1596540 1250984 1463740 1342536 1166474 1336450 1377374 1173816 1212639
16464A212639j24535j0268L63470p7802q9887J79401l36682j91736K11273m0554
$$ 1212639 1088104 1077836 1441306 1363504 1273617 1453018 1116336 924600 1135873 1095319
16454A095319m25098M17875M7914j52738M08368n73258M27144j82426J79837m6251
$$ 1095319 670221 1088096 1136010 983272 1391640 818382 1245526 1063100 1242937 1196686
16444A196686j48139J78932k03076J34479l92307R9987J08620N9152k19914K52370
$$ 1196686 1048547 1227479 1024403 1158882 766575 866562 975182 1034334 814420 1066790
16434A066790j1638j8233p9672j31767J21066k4302m0720K09558j75249M2732
$$ 1066790 1055152 1036919 957247 825480 946546 922244 881524 1091082 915833 958565
16424I58565L72759n12659P3922K08915j60415j06089J65140j26662l46526N64706
$$ 958565 1331324 818665 892587 1101502 941087 834998 1000138 873476 526950 1091656
16414A091656M1015j48123l13324J55791j43058J28915l41460O3458L97940l16144
$$ 1091656 1132671 984548 671224 827015 683957 812872 471412 534870 932810 616666
16404F16666K81971j89850J84770k52322K59983m14519L33755j64995k54432M45218
$$ 616666 898637 708787 893557 641235 901218 486699 820454 655459 401027 846245
16394H46245j029j98054o7328J52094r3147J75052l58428j05463M96708l9341
$$ 846245 845216 647162 579834 731928 638781 813833 455405 349942 846650 807309
16384H07309K8121o6575q0793K12784B76545N85868k96451J80299j16732K24336
$$ 807309 835430 768855 688062 900846 276545 862413 565962 746261 629529 853865
16374H53865C58910M08192j23813J10189l6772R2650l17924K61283L2699j09684
$$ 853865 358910 767102 643289 753478 716706 809356 491432 752715 785414 675730
16364F75730C20293L74014k51601J0560J426p7967J78408L7693K02826j86495
$$ 675730 320293 694307 442706 453266 454692 376725 555133 592826 795652 609157
16354F09157j99084J64826M7397K55982j57115B49421L75645J7695k6469O4502
$$ 609157 410073 574899 622296 878278 721163 249421 625066 642761 616292 680794
16344F80794m6630k1819j05986O6681k54248J75703m2058j6919N7730M0216J95741
$$ 680794 634164 612345 506359 573040 318792 494495 452437 435518 493248 533464 729205
16333G29205k9791O610j78833j08574L41669Q9172l13029J44044p5657j46067
$$ 729205 699414 706024 527191 418617 760286 849458 536429 680473 604816 458749
16323D58749J43114j47166K1483m0533j16162M8051J23469J2807r9888J32160
$$ 458749 601863 454697 476180 435647 319485 367536 491005 503812 403924 536084
16313E36084j13305j96741J8131R3052P6053K17515k60479l4972q6002O1925j15011
$$ 536084 422779 226038 244169 337221 413274 630789 370310 335338 249336 311261 196250
16302A96250J88338J24790q6125M6625O1829A38791K38438J25033B10244L50449
$$ 196250 384588 509378 423253 469878 531707 138791 377229 502262 210244 560693
16292E60693A56356L17212m7194A78740Q6104K44166A11871K27168J83979j93039
$$ 560693 156356 473568 426374 178740 264844 509010 111871 339039 523018 329979
16282C29979L29687k62570j87040J8653j3275n3803J16739F9369J20518R8913
$$ 329979 659666 397096 210056 228709 215434 161631 278370 69369 189887 288800
16272B88800A32716J38573n1840J81889Q1967o9317J91003k47484k6149A33221
$$ 288800 132716 271289 219449 401338 483305 413988 604991 357507 331358 133221
16261C82306r9758N038A18661J4564J83210j48219k9163L08296m3300B7140N82527
$$ 382306 282548 287586 118661 133225 316435 168216 139053 447349 404049 27140 609667
16250F09667B28482J50967A37540a1153E251L76446j47914J17845l0296Q7105
$$ 609667 228482 379449 137540 -11153 5251 381697 233783 351628 321332 408437
16240D08437M9191A33302N5398J41651j30254K75515B05965J08504R2291K8067
$$ 408437 457628 133302 188700 330351 200097 475612 205965 314469 406760 434827
16230D34827B3607M19182p5242A55793Q5260E3120K23550J76621r0280D4343M64935
$$ 434827 23607 442789 367547 155793 241053 53120 276670 453291 363011 44343 509278
16219E09278m211k37905n0672J22052L0850A36021n9947P6853J98326j08294O677
$$ 509278 505067 267162 216490 338542 369392 136021 76074 152927 351253 242959 249636
16208B49636m2378M6094D4073J64226J6031K3484q4512O0486F8408k2656J31630
$$ 249636 207258 253352 44073 208299 224330 247814 163302 223788 68408 45752 177382
16197A77382p0173R9657I5454K91261A10759a78965B7168M42841A89944P8289
$$ 177382 107209 206866 95454 386715 110759 -178965 27168 470009 189944 268233
16187B68233M9238A50533K24478j38667L3321J880A16514J86194H8916C3790J59847
$$ 268233 317471 150533 375011 236344 269665 271545 116514 302708 88916 33790 193637
16176A93637d193A83020D1795J553K39454R2467q4630q8782a25693b5609H6643
$$ 193637 -4193 183020 41795 43348 282802 375269 290639 201857 -125693 -25609 86643
16164C73673I026K40896k168K8994N6770L0162A33240k5447B1634a05519A39320
$$ 373673 9026 249922 247754 276748 333518 363680 133240 107793 21634 -105519 139320
16152b9560D27654K04847B09583p9576m2264D1193L68055H9121K97347j06651
$$ -29560 427654 632501 209583 130007 87743 41193 409248 89121 386468 279817
16142B79817A433L24561A00255J55850o8470E6384J14321n6234a8307B97632n8875
$$ 279817 1433 325994 100255 256105 187635 56384 170705 114471 -18307 297632 238757
16131B38757J63297p9626f1274A17915j3322b53767B9314a8829C44062f6185f936
$$ 238757 402054 322428 -61274 117915 104593 -253767 29314 -18829 344062 -66185 -6936
16119I8593J8464m4310i3308B7834a05942B89136A23844p319b9960I0100b9976
$$ 98593 117057 72747 -93308 27834 -105942 289136 123844 116525 -29960 90100 -29976
16107A99765b97067A83261J4129J09342a8870k57032A45763Q2644a34535A39196
$$ 199765 -297067 183261 197390 306732 -18870 -275902 145763 228407 -134535 139196
16096B03028E3661K00101c1924c618k77173A69579o0972a65376b8851A68905F5438
$$ 203028 53661 253762 -31924 -3618 -280791 169579 108607 -165376 -28851 168905 65438
16084i8232D3519J77034k48A07670L34632k16620F8525a4975j64873j99226A02719
$$ -98232 43519 220553 220305 107670 442302 225682 68525 -14975 -179848 -379074 102719
16072A02870l1276A8828L77302H5515c8781D504j676f0395k0334D9549A9678J26422
$$ 102870 71594 18828 396130 85515 -38781 4504 2828 -60395 -80729 49549 19678 146100
16060A46100c39311J66126a6984B4521a61329c7487A51746p4049l0283J93974
$$ 146100 -339311 -173185 -16984 24521 -161329 -37487 151746 77697 47414 241388
16050B41388m049i462A98398r413q0250a21403e4392h065H8504M0400F3667a86750
$$ 241388 237339 -9462 198398 188985 108735 -121403 -54392 -8065 88504 128904 63667 -186750
16037a41610d0289I2962B3264b5869H553b04540b3415j05781L7277q3881f9120
$$ -141610 -40289 92962 23264 -25869 8553 -204540 -23415 -129196 -91919 -175800 -69120
16025A96496K4630K167M299h7539D1138R4554e7516p3088G8049b2494j19036j40863
$$ 196496 221126 223293 227592 -87539 41138 135692 -57516 -130604 78049 -22494 -141530 -282393
16013b82393A81825h5824A32894J24986B4488a3582q5693a8864D3728d0406C34663
$$ -282393 181825 -85824 132894 257880 24488 -13582 -99275 -18864 43728 -40406 334663
16001F6379K74842j62d7494k2076F309b73230B20336E5112J16374J15437b91541
$$ 66379 341221 341059 -47494 -69570 6309 -273230 220336 55112 171486 286923 -291541
15989E5874J53053J54147K98367K28910L30072j8113j5489Q320n05528j46570
$$ 55874 208927 363074 661441 890351 1220423 1202310 1186821 1195141 689613 543043
15979E43043A20915J57712q3887O9933o1712E3297L8329j0482K43704n1293b91678
$$ 543043 120915 278627 194740 264673 202961 53297 91626 81144 324848 273555 -291678
15967C8191c91433J54011f1825B45324q2066L0340H1558e9614k32691A1869R6449
$$ 38191 -391433 -237422 -61825 245324 163258 193598 81558 -59614 -292305 11869 108318
15956A08318C4097L6715a46360n2219B4642Q631A670b59735B27471E9695a34268
$$ 108318 34097 70812 -146360 -198579 24642 33273 1670 -259735 227471 59695 -134268
15944g0648J0779l343p9651I155J23141L3708p9843c86471h0971A7517R2620J21674
$$ -70648 -59869 -63212 -142863 9155 132296 166004 86161 -386471 -80971 17517 110137 231811
15932B31811c5743k64661A12093C4590b42484b6528q8567D01387a09975A63604
$$ 231811 -35743 -300404 112093 34590 -242484 -26528 -115095 401387 -109975 163604
15921b7908E8131b20315k650c9207B71269f4933j41887I2390k8531K90713I3330
$$ -27908 58131 -220315 -222965 -39207 271269 -64933 -206820 92390 63859 354572 93330
15909g7859A921a59880c6062l66595A24841a43478d5918A4544d9885G8764O6208
$$ -77859 1921 -159880 -36062 -402657 124841 -143478 -45918 14544 -49885 78764 144972
15898A44972k4236Q12m8976c4885A97904b33726f0538k2204b5322A67455d0324
$$ 144972 120736 121548 72572 -34885 197904 -233726 -60538 -82742 -25322 167455 -40324
15886B93246l4575f5329A08755e4002j38466h7434J0556r3567C4558L624K00717
$$ 293246 258671 -65329 108755 -54002 -192468 -87434 -76878 -170445 34558 38182 238899
15875B38899b31065a10944g932G4586g4267j42767B07142k8442c5275B3960d5360
$$ 238899 -231065 -110944 -7932 74586 -74267 -217034 207142 178700 -35275 23960 -45360
15863b9312j39373b4512A50027c36607B67799A8086b23278B15514a926n6139A32004
$$ -29312 -168685 -24512 150027 -336607 267799 18086 -223278 215514 -1926 -58065 132004
15851D60043a4474m949B82037i2419n4071I8662a29144N5652B43508j1951a41728
$$ 460043 -14474 -19423 282037 -92419 -146490 98662 -129144 -73492 243508 231557 -141728
15839a20059k23907g3493b7974A25559n5975K3323c60754E7065i8505A37999b8286
$$ -120059 -343966 -73493 -27974 125559 69584 92907 -360754 57065 -98505 137999 -28286
15827d3135r6531e4964j53666C80780A76624a61402B20535m2439a02931j14530
$$ -43135 -139666 -54964 -208630 380780 176624 -161402 220535 178096 -102931 -217461
15817b17461r9742B13940a90752l3201G2125M4432m7592J45358b27706C5843Q3085
$$ -217461 -317203 213940 -190752 -223953 72125 116557 68965 214323 -227706 35843 118928
15806A18928g4258K3771F7968a76721c914q8347B5813P3281M524b21245B8570
$$ 118928 -74258 -50487 67968 -176721 -3914 -92261 25813 99094 103618 -221245 28570
15794H2432a40778e7291j3096J1088j3689A97628b08089a00103j41869B216M9444
$$ 82432 -140778 -57291 -70387 -59299 -72988 197628 -208089 -100103 -241972 2216 51660
15783E1660b37333A28519E5295J30364k2491I160K1538c89255A83014H0579e81844
$$ 51660 -237333 128519 55295 185659 163168 9160 30698 -389255 183014 80579 -581844
15771B39950a59479j1291D9194i9643p9394C89017b49700B4002d9717D9726g4540
$$ 239950 -159479 -170770 49194 -99643 -179037 389017 -249700 24002 -49717 49726 -74540
15759h056A70973H4133K04132l9801d0822A70484e9435I1269R1076L9958h6986
$$ -8056 170973 84133 288265 248464 -40822 170484 -59435 91269 182345 222303 -86986
15747A98329q0063l232A3124b64404B18329P6800h2413n9818L5407A78696b63575
$$ 198329 118266 115034 13124 -264404 218329 295129 -82413 -142231 -106824 178696 -263575
15735A49645D1365f8803n8166n4747J7006h1892j68105R3047B57069G8219L0577
$$ 149645 41365 -68803 -126969 -181716 -164710 -81892 -249997 -156950 257069 78219 108796
15724A08796J11547E8401a62137O9551F9275d30337F412J85912H2047c26912B54786
$$ 108796 220343 58401 -162137 -92586 69275 -430337 6412 192324 82047 -326912 254786
15712b08135J01971f03q8142B79183I9541b12558b6636l9424m16379J90276c1279
$$ -208135 -106164 -603 -88745 279183 99541 -212558 -26636 -66060 -482439 -292163 -31279
15700A25341b99504A13776a97594A47616B0432a85786B15854J25792c4809B42231
$$ 125341 -299504 113776 -197594 147616 20432 -185786 215854 341646 -34809 242231
15689a04618A47466o7398a20718j11053N6284L0016A61661b83444a2443k52462
$$ -104618 147466 80068 -120718 -231771 -175487 -145471 161661 -283444 -12443 -264905
15679b64905D0214B872a57844l01374h2824A96918c66881G176e4106b396A96729
$$ -264905 40214 2872 -157844 -459218 -82824 196918 -366881 7176 -54106 -2396 196729
15667a00851n2499f4797k18244l8499B03023a36948B62934i1824A39817e11004
$$ -100851 -153350 -64797 -283041 -321540 203023 -136948 262934 -91824 139817 -511004
15656e1868B641J3908P2130g1666B7018a22159r032n3521A04375a0988E9485Q0137
$$ -51868 2641 16549 88679 -71666 27018 -122159 -131191 -184712 104375 -10988 59485 139622
15644A39622b4158A38150b86470N3523G6137J0282a93216q0078A98811b11218
$$ 139622 -24158 138150 -286470 -232947 76137 86419 -193216 -273294 198811 -211218
15633b03840N4101j69256J42347r7197j40552a49786B7042i9407F1720J49115
$$ -203840 -149739 -318995 -176648 -273845 -414397 -149786 27042 -99407 61720 210835
15623B10835G0531k1401N10888a29654A25958R815k2114b66029J13922A54954
$$ 210835 70531 49130 560018 -129654 125958 135773 113659 -266029 -152107 154954
15612b51189J24733B52279a05284D5029J67717g075m04885A8069O5995J13385
$$ -251189 -126456 252279 -105284 45029 212746 -7075 -411960 18069 84064 197449
15602A97449l6893e688e60j02712j2492n2802j32673j526E6149a59770o611N7332
$$ 197449 160556 -5688 -560 -103272 -115764 -168566 -301239 -302765 56149 -159770 -166381 -109049
15590a09049L3572B80718A00150J2908l3789J41561A7962a8375B19397L160i0861
$$ -109049 -75477 280718 100150 113058 79269 220830 17962 -18375 219397 222557 -90861
15578d123C3015J38813P3744a32939e8002Q421B2031b28421F0400J60040e6752
$$ -4123 33015 171828 245572 -132939 -58002 -49581 22031 -228421 60400 220440 -56752
15566b39151A73557a36411n8171f3160D54855b9965A48179J20779O2542j51044
$$ -239151 173557 -136411 -194582 -63160 454855 -29965 148179 268958 331500 180456
15556A80456D7965j8993h3651C17874a57839B28626E3352K83448A34750j1893
$$ 180456 47965 28972 -83651 317874 -157839 228626 53352 336800 134750 122857
15546A22857B9349b29619R2819n607D2100g6335j8978b1927C8781J52701D4437
$$ 122857 29349 -229619 -136800 -142407 42100 -76335 -95313 -21927 38781 191482 44437
15534A24797J95514a05465G8836P1103f0715B0526a33702A4780L39116g692A73769
$$ 124797 320311 -105465 78836 149939 -60715 20526 -133702 14780 353896 -7692 173769
15522b24654A93745j0405M0221a40669d5725C63257c8735A89270K68944i0268
$$ -224654 193745 183340 223561 -140669 -45725 363257 -38735 189270 458214 -90268
15511I4166H796M12485A76340M2461e3254A00673P5175J8883J58375A27636K1511
$$ 94166 8796 421281 176340 218801 -53254 100673 175848 194731 353106 127636 149147
15500A49147B1723J60117i2227c2527k29143D7002a54180q7285C31079j22599
$$ 149147 21723 181840 -92227 -32527 -261670 47002 -154180 -241465 331079 208480
15490B08480b17147A35192a32803B37380m9752f3964m8597j21824B90037A45006
$$ 208480 -217147 135192 -132803 237380 187628 -63964 -112561 -234385 290037 145006
15479A1497a74801C4965g7959A96761Q8950J42601p7140K04819j36430j87400
$$ 11497 -174801 34965 -77959 196761 285711 428312 351172 555991 419561 232161
15469B32161I1973c4723g750B56823j18877a11070B45630c41613I6720J68559
$$ 232161 91973 -34723 -7750 256823 137946 -111070 245630 -341613 96720 265279
15459B65279D0881J57241o8305l8508J1601K3929J86965a09014a9061A2414a93136
$$ 265279 40881 198122 129817 91309 102910 126839 313804 -109014 -19061 12414 -193136
15447A05511D8915B3565L38566C2396P32303j6600n2524P18895l02602m12006
$$ 105511 48915 23565 362131 32396 764699 748099 695575 1414470 1111868 699862
15437F99862A28057K11783j11808F7030P2756B1079c53681G7188d8557G36f5530
$$ 699862 128057 339840 228032 67030 139786 21079 -353681 77188 -48557 736 -65530
15425F2484c8182j89266H627b6965l7478E7080a23623L83e6719p4794e5046l218
$$ 62484 -38182 -227448 8627 -26965 -64443 57080 -123623 -123240 -56719 -131513 -55046 -58264
15413e8264O516J5727q1941n6827A94674a14662G6502i8790I0535A7964J82292
$$ -58264 -51748 -36021 -117962 -174789 194674 -114662 76502 -98790 90535 17964 200256
15402B00256r3765b2753k01227C01065e11415A39223R5873l4912q9573J35715
$$ 200256 106491 -22753 -223980 301065 -511415 139223 235096 200184 110611 246326
15392B46326o2609k4471C0330a10637a2441C0787K08812D0765L9789N9083o3460
$$ 246326 183717 159246 30330 -110637 -12441 30787 239599 40765 80554 139637 76177
15381G6177f1856F2114N2169C2137a01215H4877C508J08478J47584J25155P2384
$$ 76177 -61856 62114 114283 32137 -101215 84877 3508 111986 259570 384725 457109
15370D57109A97897F4763Q3814a11246j19396A54631a81000B45521q9048K54782
$$ 457109 197897 64763 148577 -111246 -230642 154631 -181000 245521 156473 411255
15360D11255b71741J22445D08265j86846J3486A10688f263B52759A02622K4940
$$ 411255 -271741 -149296 408265 221419 234905 110688 -6263 252759 102622 127562
15350A27562B8844K30808p1570l9885D2821K06465J52447h418B91392J38987I3205
$$ 127562 28844 259652 188082 148197 42821 249286 401733 -8418 291392 430379 93205
15338B35364F3277K19302B6842J78974k3897a01597j27992A5696d44239C8946
$$ 235364 63277 282579 26842 205816 181919 -101597 -229589 15696 -444239 38946
15327a27983A46631C6608L67367j34181k609c25B6283L57177j66153J0338G9452
$$ -127983 146631 36608 403975 269794 267185 -325 26283 383460 217307 227645 79452
15315A66431a51548A70550J61904c25442B93103n8755R3277H4139P681k2738N7196
$$ 166431 -151548 170550 332454 -325442 293103 234348 327625 84139 91820 69082 126278
15304A26278a55917i469A21177K91465b87724a6345H8157J14178R7196a71420
$$ 126278 -155917 -9469 121177 412642 -287724 -16345 88157 202335 299531 -171420
15293b97759A49893c31290A80574J22828A14131P2426H0630A4040P4167P1651
$$ -297759 149893 -331290 180574 303402 114131 186557 80630 14040 88207 159858
15283A59858F8063L6737L1056r710a290A36887K8608a35007B74319A28309C1885
$$ 159858 68063 104800 135856 126146 -1290 136887 165495 -135007 274319 128309 31885
15271b93462O8611d1182j65712I7077J90299c03659A57592h5897m6960A09461
$$ -293462 -224851 -41182 -206894 97077 287376 -303659 157592 -85897 -132857 109461
15260c887l33906b7618A77852n9267b5775I2422J77624A4179c598A92632A3952
$$ -3887 -337793 -27618 177852 118585 -25775 92422 270046 14179 -3598 192632 13952
15248D3796a2078n7505A15378K60595j40358a13948C46683Q28867J059909p69472
$$ 43796 -12078 -69583 115378 375973 235615 -113948 346683 1175550 2235459 1465987
15238A465987K47089O3294F36284j23528j05991h0540I5031P4052K0878b72194
$$ 1465987 1713076 1776370 636284 512756 406765 -80540 95031 169083 189961 -272194
15227A70820q0392h3102j56353c8658D0157a81065A86146e9876B41918a02897
$$ 170820 90428 -83102 -239455 -38658 40157 -181065 186146 -59876 241918 -102897
15216C08569j36060l3775j9515e0751C832J37468F7664a85956B60970a43238b3676
$$ 308569 172509 138734 119219 -50751 3832 141300 67664 -185956 260970 -143238 -23676
15204c1261j90808O7384B0560e4831A11589K3691O8115o3926q680j30J65218a34403
$$ -31261 -222069 -154685 20560 -54831 111589 135280 203395 139469 130789 130659 295877 -134403
15191H0557a9388A96030d1292q9982B40846a1264l8233k7831a7868D3445N3709
$$ 80557 -19388 196030 -41292 -131274 240846 -11264 -49497 -77328 -17868 43445 97154
15180I7154f5094A11515J7488k3214A9269a50510F6091o393J3595K23397d1752
$$ 97154 -65094 111515 129003 105789 19269 -150510 66091 59698 73293 296690 -41752
15168B11977a9445B17490a34941I7819Q0291A3326N32307B13007a8958m0358A05248
$$ 211977 -19445 217490 -134941 97819 178110 13326 545633 213007 -18958 -59316 105248
15156g8680E050K42799j19804B8592J96992j05424D8681c13694C09736j32768
$$ -78680 5050 247849 128045 28592 225584 120160 48681 -313694 309736 176968
15146A76968d7174A53766P250G9084e5997a1855A74513p6759P758Q9655b42986
$$ 176968 -47174 153766 161016 79084 -55997 -11855 174513 97754 105512 195167 -242986
15134B15648b8417D80002H5071N6454a36021A92702b17803a06623A96134B8887
$$ 215648 -28417 480002 85071 141525 -136021 192702 -217803 -106623 196134 28887
15123b3878C4781J86132c7641B57279o2475K57035B01180J30838q4044A21327
$$ -23878 34781 220913 -37641 257279 194804 451839 201180 332018 247974 121327
15112A58049e9006I0505C0472c1322k703G8862J53022o8334a99109A37128a83285
$$ 158049 -59006 90505 30472 -31322 -34025 78862 231884 163550 -199109 137128 -183285
15100E158K21864p0701b07334a3672C04023I3909M04191k39706l8449q495a4499
$$ 5158 227022 156321 -207334 -13672 304023 93909 498100 258394 219945 211450 -14499
15088A06759g1406A32395h328k03798C27778N3867b93277d1316o7057B9620J34981
$$ 106759 -71406 132395 -8328 -212126 327778 381645 -293277 -41316 -108373 29620 164601
15077A64601j7848J4209n5061b11071B52275Q1267a43152C70941A78065n2557
$$ 164601 146753 160962 105901 -211071 252275 333542 -143152 370941 178065 125508
15067A25508J20543E8289J46285D533a31151C9842K27324m9553r3759N09935k47797
$$ 125508 246051 58289 204574 4533 -131151 39842 267166 217613 123854 633789 385992
15056C85992l8767o9400D0078M24986r1976J13435k40155K20322A29968M52673
$$ 385992 347225 277825 40078 465064 373088 486523 246368 466690 129968 582641
15046E82641j55729J29357j37027j71828K26441A79941J6361K92445r9199C1032
$$ 582641 426912 556269 419242 247414 473855 179941 196302 488747 389548 31032
15035D85302j24070r1175O6970L27998L5523J55088J76545k41320J40738l73200
$$ 485302 361232 270057 337027 665025 700548 855636 1032181 790861 931599 558399
15025E58399J25431l24772L08576k4428J21064k49146j83141J22412N1469A63010
$$ 558399 683830 359058 667634 643206 764270 515124 331983 454395 505864 163010
15014D19679A15381L82850A63505M46033B61248j8855K16187J85395p1909A78240
$$ 419679 115381 498231 163505 609538 261248 242393 458580 643975 572066 178240
15003D14596A17664M17697r4073J23181B62294M02966A78070K24297j06963q7440
$$ 414596 117664 535361 441288 564469 262294 665260 178070 402367 295404 207964
14993B07964M30203C06810a2680D0305K72755J34015j85922Q5611K7415l3971
$$ 207964 638167 306810 -12680 40305 313060 447075 261153 346764 374179 340208
14983C40208P5996M64808J70841k86624p8696k88179M8898K12871B22773K9748
$$ 340208 416204 881012 1051853 765229 686533 398354 447252 660123 222773 252521
14973B52521J35107K02543J99758J0819C63801J16712j84091L3907J8657j3925
$$ 252521 387628 590171 789929 800748 363801 480513 296422 330329 348986 335061
14963C35061r262J65747j21094R9293k3939J2969j16171G7042J51434J44597A06377
$$ 335061 325799 491546 370452 469745 445806 458775 342604 77042 228476 373073 106377
14951C43433j54125M82647k81275J21482k25787n6587K76765o1860k0535M28809
$$ 343433 189308 671955 390680 512162 286375 229788 506553 444693 424158 852967
14941H52967l22643j46747Q5117Q7793j70981R1299l1435k17795K37334J09536
$$ 852967 530324 383577 468694 556487 385506 476805 445370 227575 464909 574445
14931E74445J5480P39621k92858O3921M5300K76317r4937L51549M0614m50323
$$ 574445 589925 1329546 1036688 1100609 1145909 1422226 1327289 1678838 1719452 1269129
14921A269129K71236j78129J9199N80985J59294K9201K66210p38291j20521n02347
$$ 1269129 1540365 1362236 1381435 1962420 2121714 2150915 2417125 1678834 1558313 1055966
14911A055966M3562k03351k41921n7509B94802m8130J17336K74339M7539k36548
$$ 1055966 1099528 896177 654256 596747 294802 246672 364008 638347 685886 449338
14901D49338F4979L54701N9686O7356p2994p8570j14866D3793M09133j30985J53701
$$ 449338 64979 419680 479366 546722 473728 395158 280292 43793 452926 321941 475642
14890D75642k35022L25084J41210k34079j86458O45229l57776M32837K2815k68056
$$ 475642 240620 565704 706914 472835 286377 931606 573830 1006667 1029482 761426
14880G61426j5576k7931R4584k52783j55562M52186m19671J31623k10491j38693
$$ 761426 745850 717919 812503 559720 404158 856344 436673 568296 357805 219112
14870B19112J93093J21488k1208j0570k0052L07035q0590j09257l5488j77636
$$ 219112 412205 533693 512485 501915 481863 788898 708308 599051 563563 385927
14860C85927J26688k36173L43876j27209J69295k57971r3975K13947l8486q9650
$$ 385927 512615 276442 620318 493109 662404 404433 310458 524405 485919 396269
14850C96269o2634D9829P19749j93611q0298J35850L48056m3180q4675P1679J89680
$$ 396269 333635 49829 769578 575967 495669 631519 979575 936395 851720 923399 1113079
14839A113079J7541k92409j98418B73333M23975o6274j74141A19453N38984L03785
$$ 1113079 1130620 838211 639793 273333 697308 631034 456893 119453 658437 962222
14829I62222l40416k23812M42328k42505Q3570p0135K65648B18535L41288j44962
$$ 962222 621806 397994 840322 597817 681387 611252 876900 218535 559823 414861
14819D14861L90205q6383l301J74963K6897J83954j81626J21163D80340J66388
$$ 414861 805066 718683 715382 890345 917242 1101196 919570 1040733 480340 646728
14809F46728l20902L65139l2129o6751r0277N57371k52893j85138J48977J40429
$$ 646728 325826 690965 658836 592085 501808 1059179 806286 621148 770125 910554
14799I10554k88669B09223J96034J69978k41377L66039j48630l5213K43407B30187
$$ 910554 621885 209223 405257 575235 333858 699897 551267 516054 759461 230187
14788B89467M07638k00427J55081L45489k99561L7864o4714M2714q6804j9960
$$ 289467 697105 496678 651759 997248 697687 735551 670837 713551 626747 606787
14778F06787p8083K74605J04300J22123K39183m72472N16913k57471D36379l2018
$$ 606787 528704 803309 907609 1029732 1268915 796443 1313356 1055885 436379 404361
14768D04361J59492N779j15111K50040J43773k78960J03039l04231J27847L04389
$$ 404361 563853 569632 454521 704561 848334 569374 672413 368182 496029 800418
14758H00418J59720D24747J64115J26457k69145J49360J23396K1980j67287M49860
$$ 800418 960138 424747 588862 715319 446174 595534 718930 740910 573623 1023483
14748A023483r4035m47322A95178L29721J33345m4066K61907K00175m20721n5246
$$ 1023483 929448 482126 195178 524899 658244 614178 876085 1076260 655539 600293
14738F00293J13000m6759J04303Q2401j69657m84K01618J31269K20129J76384
$$ 600293 713293 666534 770837 853238 683581 683097 884715 1015984 1236113 1412497
14728A412497K87665K41107l20115M41818n12005l61161m00745J76241K2954q525
$$ 1412497 1700162 1941269 1621154 2062972 1550967 1189806 789061 965302 988256 979731
14718I79731k10919K10874k75706K80998D78551J30826P14448m63892j81365K35039
$$ 979731 768812 979686 703980 984978 478551 609377 1323825 859933 678568 913607
14708I13607r8799J08433M78663n11605J26008O30362l60741N46078R2715j62068
$$ 913607 814808 923241 1401904 890299 1016307 1646669 1285928 1832006 1924721 1762653
14698A762653l27279m1848j43202j51101o502k82321L35426j94738n6305n7532
$$ 1762653 1435374 1393526 1250324 1099223 1092721 810400 1145826 951088 894783 837251
14688H37251n14K50699O0749k32029j67755L09131k68642k12916N91417p8013
$$ 837251 836737 1087436 1148185 916156 748401 1057532 788890 575974 1167391 1089378
14678A089378k75690K2939J86443m0118M76276E63849M33797k93377P1499L57715
$$ 1089378 813688 836627 1023070 982952 1459228 563849 997646 704269 775768 1133483
14668A133483k82643K3574N9895O4882p521J29014R9875k03232L4043m4231o6398
$$ 1133483 850840 874414 934309 999191 991670 1120684 1220559 1017327 1051370 1007139 940741
14657I40741o1303L68967j11586j68663M83331o8365J04448r4977k68636O6543
$$ 940741 879438 1248405 1136819 968156 1451487 1383122 1487570 1392593 1123957 1190500
14647A190500J53809l48090J69529J90335l54236K07663J16385J7182k67314L7823
$$ 1190500 1344309 996219 1165748 1356083 1001847 1209510 1325895 1343077 1075763 1113586
14637A113586K90291m08920L01648n9575Q0106k41900K1305K64568o942n2651
$$ 1113586 1403877 994957 1296605 1237030 1317136 1075236 1096541 1361109 1354167 1301516
14627A301516o6872m22837L83296J00563L1125j07908j26512M76733l22245K6301
$$ 1301516 1234644 811807 1195103 1295666 1326791 1218883 1092371 1569104 1246859 1273160
14617A273160K47119k0733J20799k42268R9759k9700Q2715l96962J24625R4195
$$ 1273160 1520279 1499546 1620345 1378077 1477836 1448136 1530851 1133889 1258514 1352709
14607A352709N5898L46930l80829J16216j50426l07N2628K51290j94542l1313
$$ 1352709 1408607 1755537 1374708 1490924 1340498 1340191 1392819 1644109 1449567 1418254
14597A418254K45895l12132K63806O6066l8235j44955l3250O34747l39668j67039
$$ 1418254 1664149 1352017 1615823 1681889 1643654 1498699 1465449 2100196 1760528 1593489
14587A593489O1728p9320M9792K48617k37214j05196J70919Q5183J07249N7052
$$ 1593489 1655217 1575897 1625689 1874306 1637092 1531896 1702815 1787998 1895247 1952299
14577A952299J14147m05199K982K86554M3436J30681k74570J22414j9594K24061
$$ 1952299 2066446 1661247 1664229 1950783 1994219 2124900 1850330 1972744 1953150 2177211
14567B177211J72510P7284k06783l05049O42385K8853k04240K51778l07669M58448
$$ 2177211 2349721 2427005 2220222 1915173 2557558 2586411 2382171 2633949 2326280 2784728
14557B784728O2061j67101K05637L77494M75911Q1910M94824J178380J714714
$$ 2784728 2846789 2679688 2885325 3262819 3738730 3820640 4315464 5493844 7208558
14548G208558K999057P863245J6770879J1172148B0241728G988455l288582j366769
$$ 7208558 10207615 18070860 34841739 46013887 20241728 7988455 4699873 3333104
14540C333104l87300o87783M53044M45113K012428o27099j735700n89310j61163
$$ 3333104 2945804 2258021 2711065 3156178 5168606 4541507 2805807 2216497 2055334
14531B055334q9384L88033k23119J34830l38192L07576l65147K26764O8351K81078
$$ 2055334 1965950 2353983 2130864 2265694 1927502 2235078 1869931 2096695 2165046 2446124
14521B446124l43607J24223K9210K0421J86956l2347K14809l52823M06229l44248
$$ 2446124 2102517 2226740 2255950 2276371 2463327 2430980 2645789 2292966 2699195 2354947
14511B354947L10801Q972j03163K473M69540j71713P8328j00643K17848k53121
$$ 2354947 2665748 2674720 2571557 2574030 3043570 2871857 2950185 2849542 3067390 2814269
14501B814269R6808j88660M44833k17952j33752N39951K13368m60668l9337L10355
$$ 2814269 2911077 2722417 3167250 2949298 2815546 3355497 3568865 3108197 3068860 3379215
14491C379215j16872j7241J46593K3128l68796J73059J40736M53495l12750l7882
$$ 3379215 3262343 3245102 3391695 3414823 3046027 3219086 3359822 3813317 3500567 3462685
14481C462685n7109K75831J33971o824k04547j2217J08436J63766M13138j82195
$$ 3462685 3405576 3681407 3815378 3808554 3604007 3591790 3700226 3863992 4277130 4094935
14471D094935L13754N2721l63391j54450M06848k27035J76435J1977L11579J2276
$$ 4094935 4408689 4461410 4098019 3943569 4350417 4123382 4299817 4311794 4623373 4635649
14461D635649J5699j18746L58670l22108P8980J11680K2849P3043J15244j17218
$$ 4635649 4651348 4532602 4891272 4569164 4648144 4759824 4782673 4855716 4970960 4853742
14451D853742L74396j55041K99590l21033L46192K69896k10971O218K65497m23045
$$ 4853742 5228138 5073097 5372687 5051654 5397846 5667742 5456771 5462989 5728486 5305441
14441E305441M23803J76351N7913L60785k59833j8182r3984J6457L29606K95327
$$ 5305441 5729244 5905595 5963508 6324293 6064460 6046278 5952294 5968751 6298357 6593684
14431F593684J6290j50390K42293P2249K1448J19225Q2243L75910N2428K04740
$$ 6593684 6609974 6459584 6701877 6774126 6795574 6914799 6997042 7372952 7425380 7630120
14421G630120K0629L60955J10093L92095m92212L51591k92914K49757o0112J71846
$$ 7630120 7650749 8011704 8121797 8513892 8021680 8373271 8080357 8330114 8270002 8441848
14411H441848L80392j41803k5497N39512K54803L2564P20201k46476J74546m01176
$$ 8441848 8822240 8680437 8654940 9194452 9449255 9481819 10202020 9955544 10130090 9728914
14401I728914J42261M8136K04423J87067K63647K18105J35148K54425N64245k58190
$$ 9728914 9871175 9919311 10123734 10310801 10574448 10792553 10927701 11182126 11746371 11488181
14391A1488181J24132N34295J28330M8459N25827l89040P46017J21014L90872
$$ 11488181 11612313 12146608 12274938 12323397 12849224 12460184 13206201 13327215 13718087
14382A3718087J97342K91560K03841K77831N34518k07897K23002O15717K68105
$$ 13718087 13915429 14206989 14410830 14688661 15223179 15015282 15238284 15854001 16122106
14373A6122106P0108K84747K24437O73196M49708J84757L30832M85234N50459
$$ 16122106 16192214 16476961 16701398 17374594 17824302 18009059 18339891 18825125 19375584
14364A9375584P5250L55805O36505N5107K96931Q59719N07584L03171M52353N17558
$$ 19375584 19450834 19806639 20443144 20498251 20795182 21654901 22162485 22465656 22918009 23435567
14354B3435567L63672Q70916L67233Q12559M21834N62498J111230M72497L49415
$$ 23435567 23799239 24670155 25037388 25849947 26271781 26834279 27945509 28418006 28767421
14345B8767421R16641Q92630J101291N03516J043111R02488P15424R44753J028460
$$ 28767421 29684062 30576692 31677983 32181499 33224610 34127098 34842522 35787275 36815735
14336C6815735J254151R16669J344099J323126J134304J266168J342320J092039
$$ 36815735 38069886 38986555 40330654 41653780 42788084 44054252 45396572 46488611
14328D6488611K010283J215699J627519J760789J288082K334184J954022J773483
$$ 46488611 48498894 49714593 51342112 53102901 54390983 56725167 58679189 60452672
14320F0452672K435895K143072K117403K620918K698141K550889K797772L441424
$$ 60452672 62888567 65031639 67149042 69769960 72468101 75018990 77816762 81258186
14312H1258186K744385L359746L820443L529172M120192M533708M077410M786923
$$ 81258186 84002571 87362317 91182760 94711932 98832124 103365832 107443242 112230165
14304A12230165N155797N019456N743891N676161O312904O795528P107834P283226
$$ 112230165 117385962 122405418 128149309 133825470 140138374 146933902 154041736 161324962
14296A61324962P693521Q720916Q689153R613925R712187J0322100J0992518J1327686
$$ 161324962 169018483 177739399 186428552 196042477 205754664 216076764 227069282 238396968
14288B38396968J2289124J2848823J3038749J3307408J3981867J4578025J4328939
$$ 238396968 250686092 263534915 276573664 289881072 303862939 318440964 332769903
14281C32769903J4718408J4649574J4583563J3801256J3373730J2470149J1241144
$$ 332769903 347488311 362137885 376721448 390522704 403896434 416366583 427607727
14274D27607727Q515710O152921L823723K120349R54847R75636m095662l508949
$$ 427607727 436123437 442276358 446100081 448220430 449175277 450150913 446055251 442546302
14266D42546302n607912q094649r304122j1098248j2287794j3300702j3915389
$$ 442546302 436938390 428843741 419539619 408441371 396153577 382852875 368937486
14259C68937486j4830681j4955607j5366653j5353468j4611641j4509294j3793898
$$ 368937486 354106805 339151198 323784545 308431077 293819436 279310142 265516244
14252B65516244j3334263j2527152j2198311j1666399j1121232r274592q579722
$$ 265516244 252181981 239654829 227456518 215790119 204668887 195394295 186814573
14245A86814573r301295q301457q239081p636193p440993o880989o342244n793171
$$ 186814573 177513278 169211821 160972740 153336547 145895554 139014565 132672321 126879150
14237A26879150n067905n623362n300708m576841m467220m241261l522745l969425
$$ 126879150 121811245 116187883 110887175 106310334 101843114 97601853 94079108 90109683
14229I0109683l396560l653960l359204l233609k760142j843260k915403k746456
$$ 90109683 86713123 83059163 79699959 76466350 73706208 71862948 68947545 66201089
14221F6201089k456200j823840k468564k046237j970648j632643j883691q70770
$$ 66201089 63744889 61921049 59452485 57406248 55435600 53802957 51919266 51048496
14213E1048496j686612j697754j860984j057142j455566r99337r04381j071139
$$ 51048496 49361884 47664130 45803146 44746004 43290438 42291101 41386720 40315581
14205D0315581j230179j195550j648768n02024r65239m71147r50826j073095j013222
$$ 40315581 39085402 37889852 36241084 35739060 34773821 34302674 33351848 32278753 31265531
14196C1265531r07035p24249l50733p20351q38915o64678q51079p36028o67963
$$ 31265531 30358496 29634247 29283514 28563163 27724248 27059570 26208491 25472463 24804500
14187B4804500k95323o54992l29526p76457k05969r89727l76645k39478o42383
$$ 24804500 24509177 23854185 23524659 22748202 22542233 21552506 21175861 20936383 20294000
14178B0294000k76812k98829o34772m90752q9466j99245n40441k15585k45353
$$ 20294000 20017188 19718359 19083587 18592835 18503369 18304124 17763683 17548098 17302745
14169A7302745m37848n31133m70791K4802l46636l38315j38259m65236j52636
$$ 17302745 16864897 16333764 15862973 15887775 15541139 15202824 15064565 14599329 14446693
14160A4446693m52144M9604l01592j75031j38965m16439k92705r738j80859m45581
$$ 14446693 13994549 14044153 13742561 13567530 13428565 13012126 12719421 12709683 12528824 12083243
14150A2083243j04688k94630J34173j61032l91931k01603j28469l55852o5887
$$ 12083243 11978555 11683925 11818098 11657066 11265135 11063532 10935063 10579211 10513324
14141A0513324q5796j62634l41609L55308n78210k30460J32767k11918j95818
$$ 10513324 10427528 10264894 9923285 10278593 9700383 9469923 9602690 9390772 9194954
14132I194954k95843J2942J22492l79230n9711n8083l52409l8615M696K7304j91812
$$ 9194954 8899111 8912053 9034545 8655315 8595604 8537521 8185112 8146497 8151193 8178497 7986685
14121G986685k52524O7863l62963j17158o2071J16234j39997m6541j61552j56999
$$ 7986685 7734161 7802024 7439061 7321903 7259832 7376066 7236069 7189528 7027976 6870977
14111F870977L43068n87322L70776m15207k42530K72982k37750o3660j311k24408
$$ 6870977 7214045 6626723 6997499 6582292 6339762 6612744 6374994 6311334 6310023 6085615
14101F085615j24815K37796k72114k81093K91161J6682l75314k30377K37145j54310
$$ 6085615 5960800 6198596 5926482 5645389 5936550 5953232 5577918 5347541 5584686 5430376
14091E430376q3932M73784p14432K40554j42924r4366L2662o16224K85394J08076
$$ 5430376 5346444 5820228 5105796 5346350 5203426 5109060 5141722 4525498 4810892 4918968
14081D918968q7379k51013J6184O8921l3630L06018m03595K06309m38545L00923
$$ 4918968 4831589 4580576 4596760 4665681 4632051 4938069 4534474 4740783 4302238 4603161
14071D603161j75840L3878j38982q0663j29825J21876k76632K07985j6126J71995
$$ 4603161 4427321 4461199 4322217 4241554 4111729 4233605 3956973 4164958 4148832 4320827
14061D320827m81840P4842J27162p3502k21854R3257l617J3357k9642n43477L08162
$$ 4320827 3838987 3913829 4040991 3967489 3745635 3838892 3835275 3848632 3818990 3275513 3583675
14050C583675N8868J18890j03861l21768K07776j31522j32770J36999k10339k46296
$$ 3583675 3642543 3761433 3657572 3335804 3543580 3412058 3279288 3416287 3205948 2959652
14040B959652O7798K49868j02369J59137l53877R1059j25909j58893J86553k24707
$$ 2959652 3027450 3277318 3174949 3334086 2980209 3071268 2945359 2786466 2973019 2748312
14030B748312R8314j59269J79362M36570m75589K89413n02846l9790K16612J65475
$$ 2748312 2846626 2687357 2866719 3303289 2827700 3117113 2614267 2574477 2791089 2956564
14020B956564l06787L00949l56420O8375j70171K00020k07026p7766K85008k51145
$$ 2956564 2649777 2950726 2594306 2662681 2492510 2692530 2485504 2407738 2692746 2441601
14010B441601K43278l40233k3726l2721j2407o2897K27846m49341M88423n08565
$$ 2441601 2684879 2344646 2320920 2288199 2275792 2212895 2440741 1991400 2479823 1971258
14000A971258L9495K97436j84093R9814j69041J87784j13863j97970J93172j6518
$$ 1971258 2010753 2308189 2124096 2223910 2054869 2242653 2128790 1930820 2123992 2107474
13990B107474O07105Q03944J917476O187401J5235282K2053068k1333355j3707382
$$ 2107474 2714579 3518523 5435999 11623400 26858682 48911750 27578395 13871013
13982A3871013n676779k421425r66129m15668n32366o44779j71777K2975j19101
$$ 13871013 8194234 5772809 4806680 4391012 3858646 3213867 3042090 3065065 2945964
13973B945964j97752j0244j95932l61458L20518n38433J65779J41112j69908M0753
$$ 2945964 2748212 2737968 2542036 2180578 2501096 1962663 2128442 2269554 2099646 2140399
13963B140399K72630l94366K54476l44911K24098r2013k5906J0409k49743R1762
$$ 2140399 2413029 2018663 2273139 1928228 2152326 2060313 2034407 2044816 1795073 1886835
13953A886835K90634m94480K50846j5600J74039j88589p919j38602J1680q6611
$$ 1886835 2177469 1682989 1933835 1918235 2092274 1903685 1895766 1757164 1768844 1682233
13943A682233O0641l70297M26864j69917P1338j11620L78857j74882k09546J84793
$$ 1682233 1742874 1372577 1799441 1629524 1700862 1589242 1968099 1793217 1583671 1768464
13933A768464l99594J52704L43387p2559J2017o0763m12947L91665k78565O1386
$$ 1768464 1368870 1521574 1864961 1792402 1804419 1743656 1330709 1722374 1443809 1505195
13923A505195n7014K85399k26919j0121j90899K22822J05220k84829J67397k88684
$$ 1505195 1448181 1733580 1506661 1496540 1305641 1528463 1633683 1348854 1516251 1227567
13913A227567L79508l93425K32482r8127L38163j43606l6501j88786o274n7864
$$ 1227567 1607075 1213650 1446132 1348005 1686168 1542562 1506061 1317275 1311001 1253137
13903A253137N97074n27343j36887k62805K70063o3064N55053k47061l87391j39945
$$ 1253137 1850211 1322868 1185981 923176 1193239 1130175 1685228 1438167 1050776 910831
13893I10831M61149p7975K64608m58422L36993l12842k37258L67639J64656j50800
$$ 910831 1371980 1294005 1558613 1100191 1437184 1124342 887084 1254723 1419379 1268579
13883A268579r5126k78389M2592P1377M57740k98093L1310r078j44579P4918J54707
$$ 1268579 1173453 895064 937656 1009033 1466773 1168680 1199990 1190912 1046333 1121251 1275958
13872A275958k03414Q1051L0105j03307L5670J73792m30405J28572R3401J603
$$ 1275958 1072544 1153595 1183700 1080393 1116063 1289855 859450 988022 1081423 1083026
13862A083026N8492j48547L4906r628k5986r751j77288L67122j86430l5795q4515
$$ 1083026 1141518 992971 1027877 1018249 992263 982512 805224 1172346 985916 950121 865606
13851H65606L83759j23530k1674k18906K60757k75859K83696k28168J13876k17772
$$ 865606 1249365 1125835 1104161 885255 1146012 870153 1153849 925681 1039557 821785
13841H21785K14508J9148r0669K52121j02426l28917L18527m8083L77565n31400
$$ 821785 1036293 1055441 964772 1216893 1114467 785550 1104077 1055994 1433559 902159
13831I02159Q6757O7203j00049j74710L48087l65674j34473K89020J74691m16514
$$ 902159 988916 1056119 956070 781360 1129447 763773 629300 918320 1093011 676497
13821F76497K13134j16033K3673q6924J40563k0803p4541K81618m0381o3721r5291
$$ 676497 889631 773598 797271 710347 850910 830107 755566 1037184 996803 933082 837791
13810H37791k21936p6285L91700k57219J03126P5753k23678M57140k26821n5176
$$ 837791 615855 539570 931270 674051 777177 852930 629252 1086392 859571 804395
13800H04395J11744m20715J89170B02834N88853L22432k80921j39232R7026j84399
$$ 804395 916139 495424 684594 202834 791687 1114119 833198 693966 790992 606593
13790F06593o850L13484q2823l65202K15680j07642K52585M7252J8151J11848
$$ 606593 599743 913227 830404 465202 680882 573240 825825 873077 891228 1003076
13780A003076k95952p8827L839J77153q7943J13962J6411k76774L508J23449J27644
$$ 1003076 707124 628297 632136 809289 721346 835308 851719 574945 578453 701902 829546
13769H29546j2413j20127j93817J65108K70360k26284K08324l08737J27185q6774
$$ 829546 817133 697006 503189 668297 938657 712373 920697 611960 739145 652371
13759F52371j15573J51167J90598k15800B05268K73963M83233k64290k75529L47928
$$ 652371 536798 687965 878563 662763 205268 479231 962464 698174 422645 770573
13749G70573j11937k93775K21391J10324j35636J18607J41948j24298k5339n3079
$$ 770573 658636 364861 586252 696576 560940 679547 821495 697197 671858 618779
13739F18779O6873p3007r6353J3508N30588B87084M84149q5800q5621j54703j25416
$$ 618779 685652 612645 516292 529800 1060388 287084 771233 685433 599812 445109 319693
13728C19693R5999J28048O9326k11750k7671M9560m8570J0206O4580O7422k44221
$$ 319693 415692 543740 613066 401316 373645 423205 374635 384841 449421 516843 272622
13717B72622K42485j13199K41937k3671p6366J11898B53141M79068C50412q4585
$$ 272622 515107 401908 643845 620174 543808 655706 253141 732209 350412 265827
13707B65827K96304P2083j84256K81983C32049J55002j1935M36688k01213J64090
$$ 265827 562131 634214 449958 731941 332049 487051 475116 911804 710591 874681
13697H74681l48856j93501L07455N5210k58389Q5178B35580J89768N42674l83064
$$ 874681 525825 332324 639779 694989 436600 521778 235580 425348 968022 584958
13687E84958J04414l6696C4879L64954L07451k72052j42341K67900A95167K48462
$$ 584958 689372 652676 34879 399833 707284 435232 292891 560791 195167 443629
13677D43629M532A38194L63271k6684j47761M48973B86509J62310j65573K74775
$$ 443629 448161 138194 501465 474781 327020 775993 286509 448819 283246 558021
13667E58021o5507J0305N016p7009J50523B63591k1488R5416q0832R6841n1757
$$ 558021 492514 502819 507835 430826 581349 263591 242103 337519 256687 353528 301771
13656C01771l8201L22847M6720j30549J74611l00814N7662Q717r2991J35778m6017
$$ 301771 263570 586417 633137 502588 677199 376385 434047 442764 349773 485551 439534
13645D39534j91275M23888A84070K12675L50314B15174m0277L78650j75636m2165
$$ 439534 248259 672147 184070 396745 747059 215174 174897 553547 377911 335746
13635C35746m4317J02459l7826M36980l54811p6160K4524M31319C81288P5594
$$ 335746 291429 393888 356062 793042 438231 362071 386595 817914 381288 456882
13625D56882J83790l08359R2254A12229J10390j8667l2643O00078l47655q5253
$$ 456882 640672 332313 424567 112229 222619 203952 171309 771387 423732 338479
13615C38479M2682N531j40532m4638N5494l3194G8608J75219J6669J98963j78987
$$ 338479 381161 386692 246160 201522 257016 223822 78608 253827 270496 469459 290472
13604B90472a1650A36348M86672f987E69599A72584P528d8901D2017L37538j18133
$$ 290472 -11650 136348 623020 -6987 569599 172584 180112 -48901 42017 379555 261422
13593B61422K55762k37681m1873J62837j77506K02243A87142r0929K12977q0319
$$ 261422 517184 279503 237630 400467 222961 425204 187142 96213 309190 228871
13583B28871J53438j59439J68758A12319L31739k04855R6464j6677a68692A02842
$$ 228871 382309 222870 391628 112319 444058 239203 335667 318990 -168692 102842
13572C23606b374B67416Q1033G7981L81610J46615H2011K90381J14010A39221
$$ 323606 -2374 267416 348449 77981 459591 606206 82011 372392 486402 139221
13561E38879j48670j05616P4118N55260B71848r4741J43330j08184J52277A79986
$$ 538879 390209 284593 358711 913971 271848 177107 320437 212253 364530 179986
13550E08124B31511K90720B0015L57428I966K73047p525A32176J05273M40420
$$ 508124 231511 522231 20015 377443 9966 283013 275488 132176 237449 677869
13540F77869b2378B31511o0363K30179C2015L66374I6813K9135L24348n8164K85444
$$ 677869 -22378 231511 171148 401327 32015 398389 96813 125948 450296 392132 677576
13529F77576k35989q2627j67397o3656b04721h445A25976K33100l4218J87418
$$ 677576 441587 358960 191563 127907 -204721 -8445 125976 359076 324858 512276
13519E12276A72946h706C49694M8246M1714k02905A17407M38767B19453J88149
$$ 512276 172946 -8706 349694 397940 439654 236749 117407 556174 219453 407602
13509D07602j90654D03Q8928K70750j6448J80163B36852F1459g8820B05011M6089
$$ 407602 216948 403 89331 360081 343633 523796 236852 61459 -78820 205011 251100
13498B51100N3060J59167k20535L7159L9676r9284e3812C73231D4976M7803K62548
$$ 251100 304160 463327 242792 279951 319627 220343 -53812 373231 44976 92779 355327
13487C55327B0076a82317C21516C1385b1228l4018A41027M03089F9265J16539
$$ 355327 20076 -182317 321516 31385 -21228 -55246 141027 544116 69265 185804
13477A85804p1204O1975K44876A43924J8013L08816j86005J99872G7947J07706
$$ 185804 114600 176575 421451 143924 161937 470753 284748 484620 77947 185653
13467A85653J31181c3345A30738a69280B95774L48580b98716D2920P4959C9700
$$ 185653 316834 -33345 130738 -169280 295774 644354 -298716 42920 117879 39700
13456A64395J13145J18023F9242g7834A19341C8938k160b5715D12709A37336M1536
$$ 164395 277540 395563 69242 -77834 119341 38938 36778 -25715 412709 137336 178872
13445A78872Q3547J41623A33987N7006m3030g2738L036A13449R3012J21017P7176
$$ 178872 262419 404042 133987 190993 147963 -72738 -69702 113449 206461 327478 404654
13434D04654r4869A49085A9120K83814K03361D8652N0511L26250A97318J55467
$$ 404654 309785 149085 19120 302934 506295 48652 99163 425413 197318 352785
13424C52785A35879Q5526q2900R2419R050K19882B21891K30914I7671N2599K4471
$$ 352785 135879 221405 138505 230924 239974 459856 221891 452805 97671 150270 174741
13413A74741a05287M3774B26231C7415P8808a26349D79061E0364J58087H4660
$$ 174741 -105287 -61513 226231 37415 116223 -126349 479061 50364 208451 84660
13402B38420F4006J31632P26i2663B24464o958o3963a32716B47316j6550E2270
$$ 238420 64006 195638 196364 -92663 224464 217506 153543 -132716 247316 230766 52270
13390B73192j30078N6644k0518o3319J72317a64841f3319A57623L13590j58748
$$ 273192 143114 199758 179240 115921 288238 -164841 -63319 157623 471213 312465
13380C12465E9213J25427R1398m7441j2741L06329a72257G3441K44646J0748M9864
$$ 312465 59213 184640 276038 228597 215856 522185 -172257 73441 318087 328835 378699
13369C78699A28166K75442L8039C8832N90457B55305g0360A34177J84950A25225
$$ 378699 128166 403608 441647 38832 629289 255305 -70360 134177 319127 125225
13358C07711K4100A8503K22396P358L9075o0343k3133m04O180M6981I1500J30193
$$ 307711 331811 18503 240899 248257 287332 226989 203856 203452 209632 256613 91500 221693
13346B21693o9869C3204J4323J51695O3409L20230B14971H7955J9725J92714j1897
$$ 221693 151824 33204 47527 199222 262631 582861 214971 87955 107680 300394 288497
13335B88497A8572J08416J20120A20181K06112A18936K2951k9362J98164H5548
$$ 288497 18572 126988 247108 120181 326293 118936 141887 112525 310689 85548
13324C3647R3922l2524K41814p2098A32327J29512A12820m148R7261J49815f3977
$$ 33647 127569 95045 336859 264761 132327 261839 112820 108672 205933 355748 -63977
13312B85136j6662J139a01489D29255C3162L40683d9979E6215J94937k2290K96737
$$ 285136 268474 269613 -101489 429255 33162 373845 -49979 56215 251152 228862 525599
13301E25599j91925j30048J02533p9319K03138p5789C7308J40622o7306J59547
$$ 525599 333674 203626 306159 226840 429978 354189 37308 177930 110624 270171
13291B70171m5037B1128b37023C56433l6385F0579k1525M09916f7293D56216b04855
$$ 270171 225134 21128 -237023 356433 320048 60579 39054 448970 -67293 456216 -204855
13279A13418K2761a38545C6572r238K24108j05346K05584e1855F7845Q744K68314
$$ 113418 136179 -138545 36572 27334 251442 146096 351680 -51855 67845 76589 344903
13268C44903n4054A03635k8732c8100n869B26145O8259k3861d4155B09134a69605
$$ 344903 290849 103635 74903 -38100 -43969 226145 294404 270543 -44155 209134 -169605
13256b4021j50695H1262a08356c1766E48784H3186N9358i7249m696A57496M498
$$ -24021 -174716 81262 -108356 -31766 548784 83186 142544 -97249 -101945 157496 161994
13245A61994p5710a47822Q550A29038l4185k171J25103K1373J68622A16722D4689
$$ 161994 86284 -147822 -139272 129038 94853 92682 217785 239158 407780 116722 44689
13233C08872g5646n3149E1817e6318F8231L44780F4136J21555b42964D82362G9642
$$ 308872 -75646 -128795 51817 -56318 68231 413011 64136 185691 -242964 482362 79642
13221b58144A48938F8a94364A25737J84569A28212D3986K00991a94263G4323K92648
$$ -258144 148938 68 -194364 125737 310306 128212 43986 244977 -194263 74323 366971
13210C66971D236M8818J87989J1923b19518B10777I7556J64838A26198b67551
$$ 366971 4236 53054 241043 252966 -219518 210777 97556 262394 126198 -267551
13199B48540E4730A041J37515C7581J22282J25033a03109B75592A4663e2981A83942
$$ 248540 54730 1041 138556 37581 159863 284896 -103109 275592 14663 -52981 183942
13187F9105d56387a05276I8593h257j04628A8229J16758R786L7237c6461j05909
$$ 69105 -456387 -105276 98593 -8257 -112885 18229 134987 144773 182010 -36461 -142370
13176a42370j65797J00723I8611b2206n1055G8672A9789J72047a1704q1695E0986
$$ -142370 -308167 -207444 98611 -22206 -73261 78672 19789 191836 -11704 -93399 50986
13164C78182j22990a1062j6353A45790a04338a2696B16339c5635B81355a5895
$$ 378182 255192 -11062 -27415 145790 -104338 -12696 216339 -35635 281355 -15895
13153B37839b14427A22314m3053d2436F7982R6897J28291H04J4609M50524k26408
$$ 237839 -214427 122314 79261 -42436 67982 164879 293170 804 15413 465937 239529
13142B39529M1166e0772A12134n1113d186k720H495a07451D8094K56988D3060
$$ 239529 280695 -50772 112134 61021 -4186 -6906 8495 -107451 48094 305082 43060
13130C8110K61381m7424a59835A32434J978e9672H6373I299L71322j67630b05802
$$ 38110 299491 252067 -159835 132434 134412 -59672 86373 9299 380621 212991 -205802
13118i693A95507a72562Q4238k1745A39266c08703D38423d25582J97942A29137
$$ -9693 195507 -172562 -88324 -110069 139266 -308703 438423 -425582 -227640 129137
13107A75313b07574H8648J68899q7259J36317A17523i665n6081E7948e9863b0971
$$ 175313 -207574 88648 257547 170288 306605 117523 -9665 -65746 57948 -59863 -20971
13095A00455b01609C47266G9005d0275j7537d171C77584A121K19094r0247c86774
$$ 100455 -201609 347266 79005 -40275 -57812 -4171 377584 1121 220215 129968 -386774
13083h8028A43670J83652D1395a43896G6788c0866C76238i6218G6337J4137D0171
$$ -88028 143670 327322 41395 -143896 76788 -30866 376238 -96218 76337 90474 40171
13071c40222A73715P6606e2109F5210k2206a59082A87921g7040D6779P6627p138
$$ -340222 173715 250321 -52109 65210 43004 -159082 187921 -77040 46779 123406 116268
13060A16268E7344B3951I790K65526A15367K77192d4531j48640c3829j23360D85627
$$ 116268 57344 23951 9790 275316 115367 392559 -44531 -193171 -33829 -157189 485627
13048A46440R0600h0627B51037a5767A17245c6231H9507C0456R3172K4009R1128
$$ 146440 237040 -80627 251037 -15767 117245 -36231 89507 30456 123628 147637 238765
13037B38765B9810M53184F4991d675l1085a2718C46270E1895K10760a5674j86532
$$ 238765 29810 482994 64991 -4675 -35760 -12718 346270 51895 262655 -15674 -202206
13026b02206I4125a32396C45823a59401F5432a88409A99040b28829A12494K12813
$$ -202206 94125 -132396 345823 -159401 65432 -188409 199040 -228829 112494 325307
13016C25307f971B28927J85648A55699M8080G5851J81183b0940B0705a22906B45878
$$ 325307 -6971 228927 414575 155699 203779 75851 257034 -20940 20705 -122906 245878
13004E1509K62941a07676L9361j06285r2945A80614P6369B705J64920o3326f7767
$$ 51509 314450 -107676 -68315 -174600 -267545 180614 256983 2705 167625 104299 -67767
12992c427k37344A34874M5863D4107b7681j93969A84649C8889N7495L8103b91444
$$ -3427 -240771 134874 180737 44107 -27681 -221650 184649 38889 96384 134487 -291444
12980c9273A7459O909c34359B75497A17135P2953D7416J18452M738b00818M5711
$$ -39273 17459 24368 -334359 275497 117135 190088 47416 165868 170606 -200818 -155107
12969a55107j58479d9771b4036A24133a04664B35671C2005J23306q81a6592A7638
$$ -155107 -313586 -49771 -24036 124133 -104664 235671 32005 155311 154430 -16592 17638
12957A98136D3610N7752C1170L44020A69668b13979P1459Q992e7939A34394J62408
$$ 198136 43610 101362 31170 375190 169668 -213979 -142520 -133528 -57939 134394 296802
12946B96802a6911j8687A10155e2726I4494a50815I5675R5938b27900B20381E9680
$$ 296802 -16911 -35598 110155 -52726 94494 -150815 95675 191613 -227900 220381 59680
12934a82297P1805K8140a7671D04568A8345c03032I4422d3931j00026A13958D9098
$$ -182297 -110492 -82352 -17671 404568 18345 -303032 94422 -43931 -143957 113958 49098
12922A14725K8029a58765L9136A0918a05260J0543j51501A7510J21995i3725D1981
$$ 114725 142754 -158765 -119629 10918 -105260 -94717 -246218 17510 139505 -93725 41981
12910B0198K1816a0050B72590c56350n9359C1172a54959G1122g5627d749I8064
$$ 20198 42014 -10050 272590 -356350 -415709 31172 -154959 71122 -75627 -4749 98064
12898c7342B07398C391M1485b26768L6801B64a0405p5135J2303B1441L89618C2704
$$ -37342 207398 3391 44876 -226768 -189967 264 -10405 -85540 -73237 21441 411059 32704
12885A78586f8934k98296B13107G8597e8517r8421A60108b0738C80865j83790
$$ 178586 -68934 -367230 213107 78597 -58517 -156938 160108 -20738 380865 197075
12875A97075g3161G540K57976F9924b25176A01706C1532J15560a02853M5964b34
$$ 197075 -73161 7540 265516 69924 -225176 101706 31532 147092 -102853 -56889 -234
12863a04482j70437C67958A73238a63185E0034e8380C26433j29502a89312D8381
$$ -104482 -274919 367958 173238 -163185 50034 -58380 326433 196931 -189312 48381
12852B32171c56108J11440A68983A0966J03738c47221A59052b50223B08717b4068
$$ 232171 -356108 -244668 168983 10966 114704 -347221 159052 -250223 208717 -24068
12841A32126J15628j15490b22304N4779n5581P9493H8407K35045A12874K2595
$$ 132126 247754 132264 -222304 -167525 -223106 -143613 88407 323452 112874 135469
12831A35469a33711I9225b27726d5297j11358B01361P1847j31409d06661D19036
$$ 135469 -133711 99225 -227726 -45297 -156655 201361 273208 141799 -406661 419036
12820C06767A10464b73985a27384C6769L4538c04531k47393a3157k29525D70742
$$ 306767 110464 -273985 -127384 36769 71307 -304531 -551924 -13157 -242682 470742
12809A28523c29939a5445C65814A37070a20840A19160Q9162I4501K7985K40569
$$ 128523 -329939 -15445 365814 137070 -120840 119160 208322 94501 122486 363055
12799C63055m3084d28469a54835h520D1708d06233a22047c9024j24325g8733A07753
$$ 363055 319971 -428469 -154835 -8520 41708 -406233 -122047 -39024 -163349 -78733 107753
12787g6977J3994p4521a2698k6986l59803B82778a69290e2283a230q3501q4423
$$ -76977 -62983 -137504 -12698 -39684 -399487 282778 -169290 -52283 -1230 -84731 -169154
12776a69154j79886A7410b79135a31535B24234f6768H441a13630B37232p2198
$$ -169154 -349040 17410 -279135 -131535 224234 -66768 8441 -113630 237232 165034
12766A65034b30851C71495a32633J992l2912A54958C9217K65427a12016C73303
$$ 165034 -230851 371495 -132633 -130641 -163553 154958 39217 304644 -112016 373303
12755A04451a70305P2203J7106B5757J53340O0777g0575j84699J22389b2418r1536
$$ 104451 -170305 -98102 -80996 25757 179097 239874 -70575 -255274 -132885 -22418 -113954
12744a13954c5056q0705E2747P9419l2912a18518M99B13142B9120a76345B46812
$$ -113954 -35056 -115761 52747 132166 99254 -118518 -118019 213142 29120 -176345 246812
12732A79833L16803A5269P101e5065A72235c60235e2875A09391L4177F5047c3757
$$ 179833 496636 15269 22370 -55065 172235 -360235 -52875 109391 143568 65047 -33757
12720A589L3877M9702i7007p970I5689c7206B3904e31417B91859A37970d7410
$$ 1589 35466 85168 -97007 -104977 95689 -37206 23904 -531417 291859 137970 -47410
12708G08770A5915K55382N9425A57933J029o2737K37075a77896a7798C21177n5150
$$ 708770 15915 271297 330722 157933 158962 96225 333300 -177896 -17798 321177 266027
12697B66027b28564J1080B43817k3092a37814K819A28903D5523K25327i9898B98780
$$ 266027 -228564 -217484 243817 220725 -137814 -134995 128903 45523 270850 -99898 298780
12685E2508b02411a7315B28149I9J03507C4943J10868k4419O6483J69987F7857
$$ 52508 -202411 -17315 228149 99 103606 34943 145811 121392 187875 357862 67857
12673B07741a65650C87089A02804J81653a10388A26070E8461e7361J7989A93352
$$ 207741 -165650 387089 102804 284457 -110388 126070 58461 -57361 -39372 193352
12662e4458m4084A61144J59951f9800A16247J69055A0696L27793i8195B7517b72330
$$ -54458 -98542 161144 321095 -69800 116247 285302 10696 338489 -98195 27517 -272330
12650B9839c4903e432E2947P609j8869a11251l3131l1156B20869A560J00275d17222
$$ 29839 -34903 -5432 52947 60556 41687 -111251 -144382 -175538 220869 1560 101835 -417222
12637a25950A85722G3997K7999b3531A77766a61584I2494a985k5058B5502O0389
$$ -125950 185722 73997 101996 -23531 177766 -161584 92494 -1985 -27043 25502 85891
12626H5891P3681a96174O0456A71035a75814A20819a9707B02195d07946G1275
$$ 85891 159572 -196174 -135718 171035 -175814 120819 -19707 202195 -407946 71275
12615a29605H6614M6593J40645I0914j211g0387A25390a40477A26465d45236b15259
$$ -129605 86614 133207 273852 90914 89703 -70387 125390 -140477 126465 -445236 -215259
12603D6719c3984C41991A2441J21366n3780i1291H998c55267I0683h2658B22225
$$ 46719 -33984 341991 12441 133807 80027 -91291 8998 -355267 90683 -82658 222225
12591C7043a16879B14808b3971m54318A02819g5818p166J6938A88522c6823o6090
$$ 37043 -116879 214808 -23971 -478289 102819 -75818 -82984 -66046 188522 -36823 -102913
12580a02913A95070a76324B7366Q8446K0041b45514A10396a15790p7671R5055
$$ -102913 195070 -176324 27366 115812 135853 -245514 110396 -115790 -193461 -98406
12570i8406k3329k68749A93051B4940P1874O7810A0131K598a69143C1560L60198
$$ -98406 -121735 -390484 193051 24940 96814 164624 10131 12729 -169143 31560 391758
12559C91758e7121C90077f5507r7405B01477C4596a52726A12965l7931a48146
$$ 391758 -57121 390077 -65507 -162912 201477 34596 -152726 112965 75034 -148146
12548B46984F1042M4703a81133F6179J5470h5720a0271A7295N9670C7320b46135
$$ 246984 61042 105745 -181133 66179 81649 -85720 -10271 17295 76965 37320 -246135
12536A89120B6587J53699C6279e7015j60693A01218a21174i555k09635A93328
$$ 189120 26587 180286 36279 -57015 -217708 101218 -121174 -9555 -219190 193328
12525a98525A08561J5881a62178k4869N9280k17068H1489B3285c69184A85539
$$ -198525 108561 124442 -162178 -187047 -127767 -344835 81489 23285 -369184 185539
12514d2069n2224C21312b34010F8904l2872d8402j51388B78756a26237L5240f82
$$ -42069 -94293 321312 -234010 68904 36032 -48402 -199790 278756 -126237 -90997 -682
12502E7459K37518a41832c5723J4579A56448E082h0820p8102A44089a32304C175
$$ 57459 294977 -141832 -35723 -21144 156448 5082 -80820 -158922 144089 -132304 3175
12490B66994a14047A16905C6914N2827C7847Q1502b58381a9064l13919e8906k01430
$$ 266994 -114047 116905 36914 89741 37847 119349 -258381 -19064 -332983 -58906 -260336
12479b60336a2148r3261j19752L9702A92541L7900r2042b4235A61527a72766h4296
$$ -260336 -12148 -105409 -225161 -185459 192541 230441 138399 -24235 161527 -172766 -84296
12467A44254a70061P0900C1268c21017B02516a1811I517a82375N237P710B69255
$$ 144254 -170061 -99161 31268 -321017 202516 -11811 9517 -182375 -177138 -169428 269255
12455i7457A8604a69586O9223d075A87296c63976A74788a30171i9k12870B18078
$$ -97457 18604 -169586 -100363 -4075 187296 -363976 174788 -130171 -99 -212969 218078
12443c45945g5652k9820B06252E2909d3614j30525f1619A44435A4757D373M7362
$$ -345945 -75652 -105472 206252 52909 -43614 -174139 -61619 144435 14757 4373 51735
12432E1735c78685F2815a1165A44488C8708R2421c7277A0707e7198n12j18574
$$ 51735 -378685 62815 -11165 144488 38708 131129 -37277 10707 -57198 -57710 -176284
12421a76284A79613c18328A81413I326a82199Q4059J4913p2049L2914B17079j07847
$$ -176284 179613 -318328 181413 9326 -182199 -98140 -83227 -155276 -122362 217079 109232
12410A09232d088k65064A04695P6679F7107b35641A62173D6144e2671k73903e5877
$$ 109232 -4088 -269152 104695 181374 67107 -235641 162173 46144 -52671 -326574 -55877
12398b51671J07731f9061j32439j89027G9132C730d5739F1278A7872A622J49029
$$ -251671 -143940 -69061 -201500 -390527 79132 3730 -45739 61278 17872 1622 150651
12387A50651L77563B03193I3705a7799B25925E5362J70915b01699A2555J83689
$$ 150651 528214 203193 93705 -17799 225925 55362 226277 -201699 12555 196244
12377A96244j9130k633J50578A7135K43534c1778D6999b9626j63798e7942C18650
$$ 196244 177114 174481 325059 17135 260669 -31778 46999 -29626 -193424 -57942 318650
12365E01J91493k3128A2635L1916k1814e2453C42652g1128a9322k82486H4351
$$ 501 191994 168866 12635 44551 22737 -52453 342652 -71128 -19322 -301808 84351
12353i9457A5804c61569J43508R8094B9903d8692J6165A40657n8510J72606A8781
$$ -99457 15804 -361569 -218061 -119967 29903 -48692 -32527 140657 82147 254753 18781
12341d0228G9681l6920J55232f3146j03326A76734a38926n8206A89882c3010C35195
$$ -40228 79681 42761 197993 -63146 -166472 176734 -138926 -197132 189882 -33010 335195
12329a26031B31627k9835M9117a8B5547K00349g7351b2252A77962K6235E3340
$$ -126031 231627 201792 250909 -18 25547 225896 -77351 -22252 177962 204197 53340
12317B61614E780J07720M40560B17250K98910A98628G0474J51462C4677J52033
$$ 261614 5780 113500 554060 217250 516160 198628 70474 221936 34677 186710
12307A86710A871J46499i0914A0455R5338E155P05278A17512a59260M0092A20799
$$ 186710 1871 148370 -90914 10455 105793 5155 710433 117512 -159260 -119168 120799
12295C80043p8699k242p6122I547d3436k63016a33945A9982O1006b48819B24337
$$ 380043 301344 299102 222980 9547 -43436 -306452 -133945 19982 80988 -248819 224337
12283B04128q6023M0237P682B1231L81676A27109L06245j54417b329A00974j0797
$$ 204128 118105 158342 166024 21231 402907 127109 433354 278937 -2329 100974 90177
12272I0177J24088m6726a61374A22541Q8426o983a06229A89702l1483q521k0652
$$ 90177 214265 167539 -161374 122541 210967 203984 -106229 189702 158219 149698 129046
12261A29046N8699b1250G7850J60184p7785b06052A7671J68399o8303l0D3098
$$ 129046 187745 -21250 77850 238034 160249 -206052 17671 186070 117767 117737 43098
12249i255H5379J54765E5594O4225A0075M0191K17713h4411G8744k782M16461
$$ -9255 85379 240144 55594 119819 10075 50266 267979 -84411 78744 75962 492423
12238D92423b6946B82199a08438D30122j86391a91352j77262a47140e772B79205
$$ 492423 -26946 282199 -108438 430122 243731 -191352 -368614 -147140 -5772 279205
12227e036j52136C31636k1264A36498b9028D77356k03386q4929q2836J81273R9688
$$ -5036 -157172 331636 310372 136498 -29028 477356 273970 189041 106205 287478 387166
12216C87166M6316k06143j5116g2506G8083J64660n4284k0173J80620A72543B1586
$$ 387166 433482 227339 212223 -72506 78083 242743 188459 168286 348906 172543 21586
12204A09070J39332p5653E2505j3605O0897h3132C10612o5143J01674d5603B6866
$$ 109070 248402 172749 52505 38900 99797 -83132 310612 245469 347143 -45603 26866
12192B13220l9807K7784m2738K51062O3428j91316D7398K66167p6333M4105A3131
$$ 213220 173413 201197 158459 409521 472949 281633 47398 313565 237232 281337 13131
12180A73948n7004a04833G2548c4871A07954K58350j07609B9596K84003j05943
$$ 173948 116944 -104833 72548 -34871 107954 366304 258695 29596 313599 207656
12170B07656j0920K25922A22649K78739A86922J97247A88870K66671j81424N5078
$$ 207656 196736 422658 122649 401388 186922 384169 188870 455541 274117 329195
12160C29195A46438J28305I8791K02646I6536N5351E4671J39753n3988C9568a91796
$$ 329195 146438 274743 98791 301437 96536 151887 54671 194424 140436 39568 -191796
12148F6192B9594a81996A06417m0035k5797J86793Q8692a49590g0456E5675L8253
$$ 66192 29594 -181996 106417 66382 40585 227378 316070 -149590 -70456 55675 93928
12137I3928J41071E0207J43032E9111P5689f9288j32874A1437f0688j27362B14043
$$ 93928 234999 50207 193239 59111 134800 -69288 -202162 11437 -60688 -188050 214043
12125C3022M1180g9359B88091K27608j66835j1699j00370q4532a77035A16993
$$ 33022 74202 -79359 288091 515699 348864 337165 236795 152263 -177035 116993
12114B89324j00806o9723J07567D5984b5868B56697G2236f2700A35303C5952M8387
$$ 289324 188518 118795 226362 45984 -25868 256697 72236 -62700 135303 35952 84339
12103H4339K66297j39665B7698R881J40079k0382m2735A4202F567P8744J34166
$$ 84339 350636 210971 27698 37579 177658 157276 114541 14202 6567 85311 219477
12092B19477i5487C04424j07477b41215A88716n5160O9512q8868M9973l6725J3794
$$ 219477 -95487 304424 196947 -241215 188716 133556 203068 114200 164173 127448 141242
12081A41242J48346m0020i2355L0258j72719f0180E6488J15652P9629r422G9829
$$ 141242 289588 249568 -92355 -62097 -234816 -60180 56488 172140 251769 242347 79829
12069B29630J32648A47467N8341P369C8061J09934b01964A13468b6141B14968
$$ 229630 362278 147467 205808 213177 38061 147995 -201964 113468 -26141 214968
12058C52008j65664a64721E7823o325J44993g1471A76280a18270D6891a67270
$$ 352008 186344 -164721 57823 51498 196491 -71471 176280 -118270 46891 -167270
12047c8387j80647H3800Q246a83512A31078J09785a545B34105d4905K528k8766
$$ -38387 -219034 83800 92046 -183512 131078 240863 -1545 234105 -44905 -42377 -71143
12036g1143a6049j06123n6672A51244j3013D417c39116A76926l0545K73406H2717
$$ -71143 -16049 -122172 -178844 151244 138231 4417 -339116 176926 146381 419787 82717
12024b19482B37606P5834j26277H9491j1511J76865d4933B1960b9614I2897E265
$$ -219482 237606 313440 187163 89491 77980 254845 -44933 21960 -29614 92897 5265
12012a839C66332g6736A54708K31176c4399G2486K74307F8160k1792M6050b92208
$$ -1839 366332 -76736 154708 385884 -34399 72486 346793 68160 46368 92418 -292208
12000g6094n661A1969B915J9442b4823j7266j58064C90831j37092f843C5811J52392
$$ -76094 -81755 11969 2915 22357 -24823 -42089 -200153 390831 253739 -6843 35811 188203
11988A88203e8683d173o8922D7754J44716b1781j23747A32376b36048H4605l7887
$$ 188203 -58683 -4173 -73095 47754 192470 -21781 -145528 132376 -236048 84605 46718
11977D6718H85a12792A39148n4392a59061J3997f9402a5599A80472b85340A63334
$$ 46718 885 -112792 139148 84756 -159061 -145064 -69402 -15599 180472 -285340 163334
11965c2173j10523k22734b8250k64780i9618H846J0680g3347B48204a83699H4146
$$ -32173 -142696 -365430 -28250 -293030 -99618 8846 19526 -73347 248204 -183699 84146
11953a60824A16369P3316b0938O84o9589j29271c0402o3516B60666H636a90825
$$ -160824 116369 189685 -20938 -20254 -89843 -219114 -30402 -93918 260666 8636 -190825
11941e5792B41031d2626l0951m7105I8829J83623p3563E2545b89441H9918i4746
$$ -55792 241031 -42626 -73577 -120682 98829 282452 208889 52545 -289441 89918 -94746
11929b71533N5530G362J5472a88373C07262a34198A31462b57157B33965a72395
$$ -271533 -216003 7362 22834 -188373 307262 -134198 131462 -257157 233965 -172395
11918B25699G2064e04299H284g8216l89957A08375j1466R6594n4733e8227l0476
$$ 225699 72064 -504299 8284 -78216 -468173 108375 96909 193503 138770 -58227 -88703
11907h8703F9039f6392j35281a3536A51314a69916A83753a04187o8527D7971J1888
$$ -88703 69039 -66392 -201673 -13536 151314 -169916 183753 -104187 -172714 47971 59859
11896E9859a764C7764a34072A84708b87241B5896P6066i0847A67397f1012k6793
$$ 59859 -1764 37764 -134072 184708 -287241 25896 101962 -90847 167397 -61012 -87805
11885h7805A32410e775B93594f2222k77476I7136a34346A29694J83009g2057B86123
$$ -87805 132410 -5775 293594 -62222 -339698 97136 -134346 129694 312703 -72057 286123
11873A25596B6562K90665G1894h2757r9239B98311a07278n5007C9073a69403A62678
$$ 125596 26562 317227 71894 -82757 -181996 298311 -107278 -162285 39073 -169403 162678
11861i3098b4812k41581J18297L4490J8986d682l26732f2173j89616D1904E010
$$ -93098 -24812 -266393 -148096 -113606 -94620 -4682 -331414 -62173 -251789 41904 5010
11849H1982a05236c3639j18255B92665F4448c45878a66897M3116J2229k9879O6364
$$ 81982 -105236 -33639 -151894 292665 64448 -345878 -166897 -123781 -111552 -141431 -75067
11838g5067G1225a73043g2800b377p5453K3464l22425e3084A25371a57671q9447
$$ -75067 71225 -173043 -72800 -2377 -77830 -54366 -376791 -53084 125371 -157671 -247118
11827b47118B3582R0340d9059E6761J7809c29363b8040j91887O3988L3187C2026
$$ -247118 23582 113922 -49059 56761 74570 -329363 -28040 -219927 -155939 -122752 32026
11815a57865A14337a35251B91902B5379i4467j41881a00851B84380j02204b95628
$$ -157865 114337 -135251 291902 25379 -94467 -236348 -100851 284380 182176 -295628
11804b19706D6547b02002A4430h3901B4696d854j57980o7010B90569A34248j5267
$$ -219706 46547 -202002 14430 -83901 24696 -4854 -162834 -229844 290569 134248 118981
11793A18981c24263A31596n8188a93390g6318I1838J22387F573f345q7633A03833
$$ 118981 -324263 131596 73408 -193390 -76318 91838 214225 6573 -6345 -93978 103833
11781b945k54485d5908j48079A91656a22232B32060a22631G7552B9471L19326
$$ -2945 -257430 -45908 -193987 191656 -122232 232060 -122631 77552 29471 348797
11771C48797a48829g0805k9902Q19A00282Q8991B634a28863K5244n3939o4970
$$ 348797 -148829 -70805 -100707 -99888 100282 189273 2634 -128863 -103619 -157558 -222528
11760b22528C83484a17328j52597A50032i9707F1920c3508k74189e3584a7880
$$ -222528 383484 -117328 -269925 150032 -99707 61920 -33508 -307697 -53584 -17880
11749c39012a5709j48033A2128b1965J0518A63854a8095B97537N8500A30487b50071
$$ -339012 -15709 -163742 12128 -21965 -11447 163854 -18095 297537 356037 130487 -250071
11737A98889n4104d2218k79009b6687A18846a4179j57163q0073I488K1234J512
$$ 198889 144785 -42218 -321227 -26687 118846 -14179 -171342 -251415 9488 30722 32234
11726C2234J93017n9497b69377D0731A9149a60703I1293b89654k9481N2042e9870
$$ 32234 225251 165754 -269377 40731 19149 -160703 91293 -289654 -319135 -267093 -59870
11714A94915d05782C22538n3003b28074B88229I5408a8814E9668L22740r1159
$$ 194915 -405782 322538 269535 -228074 288229 95408 -18814 59668 382408 291249
11704B91249h6571L9470D81566g346C9141J20642r468a56432A15802a76754B01718
$$ 291249 -86571 -47101 481566 -7346 39141 159783 150315 -156432 115802 -176754 201718
11692a24155d8492I37K5204e7532C28824j13891C9603j0517b40298m5403g7627
$$ -124155 -48492 937 26141 -57532 328824 214933 39603 29086 -240298 -285701 -77627
11680B71147L8298b69507A92011M3876r7229N5228g7305A66066o3981b26672C0646
$$ 271147 309445 -269507 192011 235887 138658 193886 -77305 166066 102085 -226672 30646
11668A45709J08406H3184b76881A84316H2648J62075a22108j07C2628K34127m2565
$$ 145709 254115 83184 -276881 184316 82648 244723 -122108 -122215 32628 266755 224190
11657B24190k6082E376J87206i4261A66230K13207A7404J8758L8476e1457A13221
$$ 224190 198108 5376 192582 -94261 166230 379437 17404 36162 74638 -51457 113221
11645b80618F6555a65774r7072B96590a11924l688m7702A49686J28822A12716
$$ -280618 66555 -165774 -262846 296590 -111924 -115612 -163314 149686 278508 112716
11634b9384B62991h6373F4113a89167C1757a6524j62618a8885B37291h9915f081
$$ -29384 262991 -86373 64113 -189167 31757 -16524 -179142 -18885 237291 -89915 -6081
11622D45090F3200K7451Q290a16800E7506d72417a32952O743H9536d2328n6104
$$ 445090 63200 90651 98941 -116800 57506 -472417 -132952 -126209 89536 -42328 -98432
11611i8432C98779c4441B20568b22208J07828q1713F9369e834A63480J52383A54723
$$ -98432 398779 -34441 220568 -222208 -114380 -196093 69369 -5834 163480 315863 154723
11599B35358E7826F869d55529a9653F6789f6586A33791K61591D1509n763J98071
$$ 235358 57826 6869 -455529 -19653 66789 -66586 133791 395382 41509 35746 233817
11588B33817n7528A1423e6719A67265m0830p04e22888A27436a07700C46839A00371
$$ 233817 176289 11423 -56719 167265 126435 125731 -522888 127436 -107700 346839 100371
11576A03046d5075A99488h9718C54931b29922J12780A03359b8664H8925J05820
$$ 103046 -45075 199488 -89718 354931 -229922 -117142 103359 -28664 88925 194745
11566A94745H8415J56075A02682J64394a2269A42819D1743N9022K89857A165e7403
$$ 194745 88415 244490 102682 267076 -12269 142819 41743 100765 390622 1165 -57403
11554a93470g0639L1805j5534j27888A32803N7974N6048g346A8890L18567H0859
$$ -193470 -70639 -38834 -54368 -182256 132803 190777 246825 -7346 18890 337457 80859
11542D4246a44546B87286a55925E4445d8735q4591c5348B10435b43563J06367
$$ 44246 -144546 287286 -155925 54445 -48735 -133326 -35348 210435 -243563 -137196
11532a37196D33544A47030n2557a17958p624M3240A53674a60093A6383Q4855c3271
$$ -137196 433544 147030 94473 -117958 -125582 -82342 153674 -160093 16383 101238 -33271
11520a07661A69233J6418J51442a29842j10790a1081j9783C55113a87876H1607
$$ -107661 169233 185651 337093 -129842 -240632 -11081 -30864 355113 -187876 81607
11509d8386A89922q6252K65809e3255A96896f9381H8949j5699m881d6291A97036
$$ -48386 189922 103670 369479 -53255 196896 -69381 88949 73250 68369 -46291 197036
11497G1545K05778J06827g185G8253C4164i7551a5896a885k36021A08831a9617
$$ 71545 277323 384150 -7185 78253 34164 -97551 -15896 -1885 -237906 108831 -19617
11485B22397b71799D0996L44377a75514i618D15740b89830C19960J71457B39480
$$ 222397 -271799 40996 385373 -175514 -9618 415740 -289830 319960 491417 239480
11474B52349d3605A5092L42157A19984k3437D0989g3416A8294P2007O5131R0851
$$ 252349 -43605 15092 357249 119984 96547 40989 -73416 18294 90301 155432 246283
11463B46283l6728M0223H3373O6087E1185b947A91972m288o3403h5425E9641k2820
$$ 246283 209555 249778 83373 149460 51185 -2947 191972 187684 124281 -85425 59641 36821
11451C6821P1130M5373O8c62430A08369Q3610a85979D8040d7349B47201B1781
$$ 36821 107951 153324 153392 -362430 108369 191979 -185979 48040 -47349 247201 21781
11439a57847A93707G6682a53884F1161J8663K5025b06711M2120A00104J3491a15009
$$ -157847 193707 76682 -153884 61161 79824 104849 -206711 -164591 100104 113595 -115009
11427F2421K78154b70832A69634f4048A46496c9582B35488c8079p068A56020D3875
$$ 62421 340575 -270832 169634 -64048 146496 -39582 235488 -38079 -45147 156020 43875
11415g8898j15583B12996a94415e5712j79878A1460b06943G505a68374G9459h3746
$$ -78898 -194481 212996 -194415 -55712 -235590 11460 -206943 7505 -168374 79459 -83746
11403c7232I9479J14536l2281J9196b5637A86268K4414q4211K073K23963a96111
$$ -37232 99479 214015 181734 200930 -25637 186268 210682 126471 128544 352507 -196111
11391a21345b1921F2859J60002a79835L1362l5915k6499j34446e6240A37500B0916
$$ -121345 -21921 62859 222861 -179835 -148473 -184388 -210887 -345333 -56240 137500 20916
11379F5599h2422b7399q7518C86141b00026P0613A75960G87b00860d7238e063
$$ 65599 -82422 -27399 -114917 386141 -200026 -129413 175960 787 -200860 -47238 -5063
11367a15445L9357A53011b57108O7319A34878a70654B4339P9754b67625A65256
$$ -115445 -76088 153011 -257108 -189789 134878 -170654 24339 104093 -267625 165256
11356G9985b37816A77596b51512h316k10492g1394k59709E9511j6517h7503C77398
$$ 79985 -237816 177596 -251512 -8316 -218808 -71394 -331103 59511 42994 -87503 377398
11344F5439a58958P1086l5078j20787a06674f42j46606J4934A33046K9187b24158
$$ 65439 -158958 -87872 -122950 -243737 -106674 -642 -147248 -132314 133046 162233 -224158
11332d138A35339D47b03923g4H9487b76727F8962j3698c29005J61007A56568d4783
$$ -4138 135339 447 -203923 -74 89487 -276727 68962 55264 -329005 -167998 156568 -44783
11319b48174c8012A28004a85294D3864J1925J1092K7621e7000n6585A60353D7396
$$ -248174 -38012 128004 -185294 43864 55789 66881 94502 -57000 -113585 160353 47396
11307b45739C753L3717L74275A7240Q1654a74856A4935N9503A4943a31003j21528
$$ -245739 3753 37470 411745 17240 98894 -174856 14935 74438 14943 -131003 -252531
11296b52531j5712B02840b59697g5578j44202A13683M7086a74037H2292j7705
$$ -252531 -268243 202840 -259697 -75578 -219780 113683 160769 -174037 82292 64587
11286F4587a23826k10906a46677H4590a30266F9061N7944c30030j84648a84944
$$ 64587 -123826 -334732 -146677 84590 -130266 69061 127005 -330030 -514678 -184944
11275A4775h034I629b88588i6031k70265c2333k07948H1114a8062n6133B1381
$$ 14775 -8034 9629 -288588 -96031 -366296 -32333 -240281 81114 -18062 -74195 21381
11263d9207I5676a67809n7681A49874G1269a24324G2117a42591C580b17864J2204
$$ -49207 95676 -167809 -225490 149874 71269 -124324 72117 -142591 3580 -217864 -205660
11252b05660D1060N60568c8890j11520A14979b05621d4976k77458a8348A3361
$$ -205660 41060 601628 -38890 -150410 114979 -205621 -44976 -322434 -18348 13361
11241a38573A31694a32978B3019c87553A12773c93400B8782b19189P0447m1418
$$ -138573 131694 -132978 23019 -387553 112773 -393400 28782 -219189 -148742 -190160
11231a90160d3629I8400i5926j15451n347B12805m2401F5277a52734j06166E2663
$$ -190160 -43629 98400 -95926 -211377 -216724 212805 170404 65277 -152734 -258900 52663
11219a16438j22225d5333n777j2126r3357A7028f605j30994A10586b87854H5886
$$ -116438 -238663 -45333 -51110 -63236 -156593 17028 -6605 -137599 110586 -287854 85886
11207B18149a19577A09338b10274L1151F6888a92462j24492N9445E4533K46369
$$ 218149 -119577 109338 -210274 -179123 66888 -192462 -316954 -257509 54533 300902
11197C00902A1726a14986k7486B04555G0593b19357a4840j6021A40554a02499
$$ 300902 11726 -114986 -142472 204555 70593 -219357 -14840 -30861 140554 -102499
11186a82048L4054C17903A29932B8634J54678a40196m239k22377L0834J50487
$$ -182048 -147994 317903 129932 28634 183312 -140196 -144435 -366812 -335978 -185491
11176a85491B37986j06039d7170q5621k67679a27560b5273o5159c2623I1036a90649
$$ -185491 237986 131947 -47170 -132791 -400470 -127560 -25273 -90432 -32623 91036 -190649
11164a28879A20333b62724Q1372M9441k95743g247k26354b1467j19326M3042j35917
$$ -128879 120333 -262724 -181352 -131911 -427654 -7247 -233601 -21467 -140793 -97751 -233668
11153b33668o464g5031j91527I891J61544B3549n423f9878B00596b29203K2124
$$ -233668 -240132 -75031 -266558 9891 171435 23549 18126 -69878 200596 -229203 -207079
11142b07079E1497e9308o5801O18B31557c03960a20140B4651b71549b6928G4803
$$ -207079 51497 -59308 -125109 -124491 231557 -303960 -120140 24651 -271549 -26928 74803
11130A30729J29314b59495j1629g0945B17957a12978j28079J7382N4326d2180
$$ 130729 260043 -259495 -271124 -70945 217957 -112978 -241057 -223675 -169349 -42180
11119b49270O6158I6002D275a9306A47346e7658F6344Q151K35202E8263J01623
$$ -249270 -183112 96002 4275 -19306 147346 -57658 66344 74495 309697 58263 159886
11108A59886o5841A7251e2136A51439b04101n0670B58767B4054K29798J30171
$$ 159886 94045 17251 -52136 151439 -204101 -254771 258767 24054 253852 384023
11098C84023j32912K24763h462H4377J57855K6152a14144B07376F1234l90e194
$$ 384023 251111 475874 -8462 84377 242232 268384 -114144 207376 61234 60844 -5194
11086G4804k465L74903c529A25125B9630A2654J8589L9728L39597j71927a10012
$$ 74804 72339 447242 -3529 125125 29630 12654 31243 70971 410568 238641 -110012
11074B26377D339J58671J06200j1946q7050J80026L7940j39574j4065R3097j25445
$$ 226377 4339 163010 269210 257264 170214 350240 388180 248606 234541 327638 202193
11063B02193N0861r4891O9292N6669R9003K57445K33275B87958J08944J80847
$$ 202193 253054 158163 227455 284124 383127 640572 873847 287958 396902 577749
11053E77749r7540K01966J8321l7564J87308k59582J74891j02786j44620J29274
$$ 577749 480209 682175 700496 662932 850240 590658 765549 662763 518143 647417
11043F47417p7779l9033o2967K91113k58631Q1304K61780k47278o8083n9736K50191
$$ 647417 569638 530605 467638 758751 500120 581424 843204 595926 527843 468107 718298
11032G18298k91832L4277J39388o3681K8766l3424r2164j5818J55247L3775K35654
$$ 718298 426466 460743 600131 536450 565216 531792 439628 423810 579057 612832 848486
11021H48486j0837k36746M14794k86588l05447q1390K23772k5237J46204j17045
$$ 848486 837649 600903 1015697 729109 423662 342272 566044 540807 687011 569966
11011E69966P3202k0661k20965J95786j51593L50682l43891M46705j09873l62270
$$ 569966 643168 622507 401542 597328 445735 796417 452526 899231 789358 427088
11001D27088J57666A76530P52229l59207J37873l19831L95188j51538j62609M4973
$$ 427088 584754 176530 928759 569552 707425 387594 782782 631244 468635 513608
10991E13608n5571L06510j3749k71353j9170K38487J09947K62136j49107k23304
$$ 513608 458037 764547 750798 479445 460275 698762 808709 1070845 921738 698434
10981F98434J80231J26050J01998N5411l8506J67111m6205J03345K75274q1820
$$ 698434 878665 1004715 1106713 1162124 1123618 1290729 1244524 1347869 1623143 1541323
10971A541323N10891j28728K25138J67884L2074K0001j79158n0777K2158k71626
$$ 1541323 2052214 1923486 2148624 2316508 2348582 2368583 2189425 2138648 2160806 1889180
10961A889180k78692K75747k73108l1220o9888N1177n9193J79612j37114J19668
$$ 1889180 1610488 1886235 1613127 1581907 1512019 1563196 1504003 1683615 1546501 1666169
10951A666169J21385k37629q7284N0915n83962p7077P0672D46682J20167k73306
$$ 1666169 1787554 1549925 1462641 1513556 929594 852517 923189 446682 566849 293543
10941B93543L78981k97432r6743P6953j25019L1986r787q4283L0777F6420a27684
$$ 293543 672524 375092 278349 355302 230283 262269 252482 168199 198976 66420 -127684
10929A70419j2097l2982a00183H1497J59785J11804r5694e4860j24620C77127
$$ 170419 158322 125340 -100183 81497 241282 353086 257392 -54860 -179480 377127
10918H0830a60668D3960a29212A34799p364a22608C278a38399C5978J63J01167
$$ 80830 -160668 43960 -129212 134799 127435 -122608 3278 -138399 35978 36141 137308
10907A37308N7663a12720A48281i678j31404e1726j2994A70098c3727l9769A45691
$$ 137308 194971 -112720 148281 -9678 -141082 -51726 -64720 170098 -33727 -73496 145691
10895c9088B22837H9511K12782a8457q4694m8767j41719a34135j21850j4243A44706
$$ -39088 222837 89511 302293 -18457 -103151 -151918 -293637 -134135 -255985 -270228 144706
10883c370A16412a66436D8853K1107f9901B70867A0873c3642k4450B6930P4687
$$ -3370 116412 -166436 48853 69960 -69901 270867 10873 -33642 -58092 26930 101617
10872A01617f7815b1381j51564e5268j44522K5223a2425C1371a33241j55707A40125
$$ 101617 -67815 -21381 -172945 -55268 -199790 -174567 -12425 31371 -133241 -288948 140125
10860G7775c53585g8925B11715b7288A2643K61061a81560k4849g2162l6639k13486
$$ 77775 -353585 -78925 211715 -27288 12643 273704 -181560 -206409 -72162 -108801 -322287
10849c22287h2239n2658I2b11129B10506B267N6108b03796B46054J1815c02905
$$ -322287 -82239 -134897 92 -211129 210506 2267 58375 -203796 246054 257869 -302905
10837B14013b3962o2322c8400E6497B1147R8236a320A25380h265F2100b8824k0427
$$ 214013 -23962 -86284 -38400 56497 21147 119383 -1320 125380 -8265 62100 -28824 -49251
10825d9251j02724H2177K59174B2258L2027a54648A20871c41680A16103b01646
$$ -49251 -151975 82177 341351 22258 54285 -154648 120871 -341680 116103 -201646
10814A14930a41617d6869B22760a27227A47484c88476c8298j30968j37574B9838
$$ 114930 -141617 -46869 222760 -127227 147484 -388476 -38298 -169266 -306840 29838
10803a8534k2071k74895J02273R3627k6155G0821L3461K9003a85348C33277a13685
$$ -18534 -40605 -315500 -213227 -119600 -145755 70821 104282 133285 -185348 333277 -113685
10791a39951q7410A67403a70003A64907H428K05988a65531j10688M732J6150h7082
$$ -139951 -227361 167403 -170003 164907 8428 214416 -165531 -276219 -271487 -255337 -87082
10779F9103d0741C06081b02990a2807A16355c86948c9011r7010O569d8859k74656
$$ 69103 -40741 306081 -202990 -12807 116355 -386948 -39011 -136021 -129452 -48859 -323515
10768c23515b1618o2461A28488b56110B20593A4628M6767b12606k21715D9457
$$ -323515 -21618 -84079 128488 -256110 220593 14628 61395 -212606 -434321 49457
10757d12452g6438j66363I8154a04645k35298g9893k3592A29276b70886h8784
$$ -412452 -76438 -242801 98154 -104645 -339943 -79893 -103485 129276 -270886 -88784
10746A07489K66422b78954A7693a9865I5730m2301a36243j33337d1156A98100
$$ 107489 373911 -278954 17693 -19865 95730 53429 -136243 -269580 -41156 198100
10735a30235B2244b17526P8174j30705A39125a8573B2503Q5094O3551c46054B93387
$$ -130235 22244 -217526 -139352 -270057 139125 -18573 22503 107597 171148 -346054 293387
10723B70229m6546b88630a16610a0033m0545B52989a44488g0826r6191B90382
$$ 270229 223683 -288630 -116610 -10033 -50578 252989 -144488 -70826 -167017 290382
10712a19j83577l0557j63368B40664a48312j94619B0087a40237A85063a25131
$$ -119 -183696 -214253 -377621 240664 -148312 -342931 20087 -140237 185063 -125131
10701A08938d2436n1621j70499a01372A06819f8740A54900n3112L182a22401m984
$$ 108938 -42436 -94057 -264556 -101372 106819 -68740 154900 101788 104970 -122401 -127385
10690a27385B90222i00A11659a94649d4142k08040D1147A8329e2962k17074F4703
$$ -127385 290222 -900 111659 -194649 -44142 -252182 41147 18329 -52962 -270036 64703
10678B44088a65483N7329k61431a53490a96l39962E6576J26469a56232L9826G3342
$$ 244088 -165483 -108154 -369585 -153490 -196 -340158 56576 183045 -156232 -116406 73342
10666c41770R4917a4252N012n5315f179l17657A2336a94894A88063a18331A61721
$$ -341770 -246853 -14252 -9240 -64555 -6179 -323836 12336 -194894 188063 -118331 161721
10654A45581A3139a197k5681k79467i1040m4825A64826J21033d77029J2041D8309
$$ 145581 13139 -1197 -26878 -306345 -91040 -135865 164826 285859 -477029 -464988 48309
10642A23226h5398G326a38007f0603D7370b40708I0630a6763j16820A59966F7912
$$ 123226 -85398 7326 -138007 -60603 47370 -240708 90630 -16763 -133583 159966 67912
10630b03395J1031A14891b23205j99521F5597j7142b16686d8744B32372c21649
$$ -203395 -192364 114891 -223205 -422726 65597 48455 -216686 -48744 232372 -321649
10619E89R9229e9170j0878I3168c68606Q0826P4787i417d231B16429q8148a23199
$$ 589 99818 -59170 -70048 93168 -368606 -287780 -212993 -9417 -4231 216429 128281 -123199
10606A41961R57f417n8356j36746K1209C5963P4389R9718l168f4487j51398r5648
$$ 141961 142918 -6417 -64773 -201519 -180310 35963 110352 210070 206902 -64487 -215885 -311533
10594c11533A24768f0832G6053M203a16718B8750d6007A179a48343B7797P0796
$$ -311533 124768 -60832 76053 80256 -116718 28750 -46007 1179 -148343 27797 98593
10583I8593b18287B0007d8329j44506A14829a37870r0504A17689a39679A72013
$$ 98593 -218287 20007 -48329 -192835 114829 -137870 -228374 117689 -139679 172013
10572A15170g1425A29839h1669b4824r8943L7394H8879K4126h8518j930k58392
$$ 115170 -71425 129839 -81669 -24824 -123767 -86373 88879 113005 -88518 -90448 -348840
10561c48840j6989A41968a62552k7967A2864O8172l4583e5803I3865a37906B7423
$$ -348840 -365829 141968 -162552 -190519 12864 81036 46453 -55803 93865 -137906 27423
10549H3533a85324a9513A8466b23866R1906d642B35777b81205J622d7174r5103
$$ 83533 -185324 -19513 18466 -223866 -131960 -4642 235777 -281205 -279583 -47174 -142277
10538a42277j35120F3843a78602f3129j27901e674A6387R3585b46984a01432l3820
$$ -142277 -277397 63843 -178602 -63129 -191030 -5674 16387 109972 -246984 -101432 -135252
10527a35252K1427I4693B1068i9364G6910a57524c5122m80570a29938H6372g5177
$$ -135252 -113825 94693 21068 -99364 76910 -157524 -35122 -515692 -129938 86372 -75177
10515a53033F7181B5556b80732a20229g177k39656Q5879B10652B773J05508a80122
$$ -153033 67181 25556 -280732 -120229 -7177 -246833 -160954 210652 2773 108281 -180122
10503B41138j9812e1394k8523A24409h3313D9409d1366B6354a48386e7245F2840
$$ 241138 221326 -51394 -79917 124409 -83313 49409 -41366 26354 -148386 -57245 62840
10491B744e2452q8933r7155B09086a78982g1882l1129k365D9320i308A20284i732
$$ 2744 -52452 -141385 -238540 209086 -178982 -71882 -103011 -105376 49320 -9308 120284 -9732
10478d6725F5d1783D19449k5151q2975K52410B45321K30992A81829a46791E26695
$$ -46725 65 -41783 419449 394298 311323 563733 245321 476313 181829 -146791 526695
10466b02512A14367i14r3072A34146b8993A6002a06383c5944Q675A6507L9100
$$ -202512 114367 -914 -93986 134146 -28993 16002 -106383 -35944 -27269 16507 55607
10455E5607O0273a88384O7749A97361o4822d95541A79914D7136g4476D3115A9797
$$ 55607 115880 -188384 -120635 197361 132539 -495541 179914 47136 -74476 43115 19797
10443A14555L7297b58434b9547b120A27398a05962q4113O6738C55828a96622A52772
$$ 114555 151852 -258434 -29547 -2120 127398 -105962 -190075 -123337 355828 -196622 152772
10431e4527k77034D3369a30537j05438a6378m9021D9924g1174h34j962H5929d3093
$$ -54527 -331561 43369 -130537 -235975 -16378 -65399 49924 -71174 -834 -2796 85929 -43093
10418A63525C9691K03524d9949n5704E9362a78187D8692M90a49800j9288b9073
$$ 163525 39691 243215 -49949 -105653 59362 -178187 48692 49182 -149800 -169088 -29073
10406a00687H8217a15757a0823o0449j91784h4504C02820c43466B08746f2501
$$ -100687 88217 -115757 -10823 -71272 -263056 -84504 302820 -343466 208746 -62501
10395a81034I648b67725G7223O0848d3715G0824J45414f7003B40294K2511i3868
$$ -181034 9648 -267725 77223 138071 -43715 70824 216238 -67003 240294 262805 -93868
10383B05530k1236b5554B97429l1389h1690F2275c08876C4112P750b48144A07513
$$ 205530 184294 -25554 297429 266040 -81690 62275 -308876 34112 41862 -248144 107513
10371C72606p2897D8261K93007A12687A5918J77560R7396K4125J26099q5323A77638
$$ 372606 299709 48261 341268 112687 15918 193478 290874 314999 441098 355775 177638
10359A87440b21660C57999J03349B29228k6338J88258A39962J62850N6654E398
$$ 187440 -221660 357999 461348 229228 202890 391148 139962 302812 359466 5398
10348E74134B04865M51075k20635A00517M78371j54619A83803L07097A75550L9863
$$ 574134 204865 655940 435305 100517 578888 424269 183803 490900 175550 215413
10338B15413m6421R7211J50022j57377a3113j03999B73697i2456A21221b8180
$$ 215413 168992 266203 416225 258848 -13113 -117112 273697 -92456 121221 -28180
10327a03568D28682r1763j15830n3008F9672J08615K84789A67702g4577F7367
$$ -103568 428682 336919 221089 168081 69672 178287 463076 167702 -74577 67367
10316e6889I0699Q9513a49471A50170p0293h5746A02429K0356a93372F8252b11424
$$ -56889 90699 180212 -149471 150170 79877 -85746 102429 122785 -193372 68252 -211424
10304A14595b54334C8594J3740h5799J2444r3027B5896K54078d0790A60847D0872
$$ 114595 -254334 38594 52334 -85799 -73355 -166382 25896 279974 -40790 160847 40872
10292a99920B68977I2365b96348a01844l02862g4500A75628c6821q4894A70547
$$ -199920 268977 92365 -296348 -101844 -404706 -74500 175628 -36821 -121715 170547
10281d679k03063d1592B0452a3174j78174g2727k146D4507O6049c20652L7079
$$ -4679 -207742 -41592 20452 -13174 -191348 -72727 -74873 44507 110556 -320652 -283573
10270b83573D1510c7786A2355g0897n3164a6330l04996g3367p7039m0929A84617
$$ -283573 41510 -37786 12355 -70897 -124061 -16330 -321326 -73367 -150406 -191335 184617
10258B20140G1780k5322J63993J14239E9153L9791J96310l6734L890k1394L1709
$$ 220140 71780 46458 210451 324690 59153 98944 295254 258520 262410 241016 272725
10247B72725A9983c2610J0924B7437b6396A6239a63754f825B39402a85748j07041
$$ 272725 19983 -32610 -21686 27437 -26396 16239 -163754 -6825 239402 -185748 -292789
10236b92789J18560B08055b54847D0589J25923m8585J5554c48872A90436Q986
$$ -292789 -174229 208055 -254847 40589 166512 117927 133481 -348872 190436 199422
10226A99422a83243r8611b2611A94470c0538l51527a63927a3274l23552M6958
$$ 199422 -183243 -281854 -22611 194470 -30538 -382065 -163927 -13274 -336826 -289868
10216b89868N7743j42472a00275I9328a76327k64971a8671o575j0354k6762A11158
$$ -289868 -232125 -374597 -100275 99328 -176327 -441298 -18671 -25246 -35600 -62362 111158
10204a17486G4093a3589A60754H850J87871a20309q190F6397g1762J3498j29214
$$ -117486 74093 -13589 160754 8850 196721 -120309 -128499 66397 -71762 -58264 -187478
10193a87478d5137j97244f9457A84298p9091b02731c5383k66723f0260K5445j65008
$$ -187478 -45137 -242381 -69457 184298 105207 -202731 -35383 -302106 -60260 -34815 -199823
10182a99823G7236i6954J2961L3079E0082J58391a30120l7438a0947k1881B91707
$$ -199823 77236 -96954 -83993 -50914 50082 208473 -130120 -167558 -10947 -32828 291707
10170A05259f1625A15588A0485a55917b9333n169p3517c4617k77816B90548a86148
$$ 105259 -61625 115588 10485 -155917 -29333 -34502 -108019 -34617 -312433 290548 -186148
10158H6631C4642a49657l60267a5926D734a20940m975A16289n1325c6327k53845
$$ 86631 34642 -149657 -509924 -15926 4734 -120940 -125915 116289 64964 -36327 -290172
10147b90172j7456E4184a03132g652A98248A1602b25067j60741P042q5783g6562
$$ -290172 -307628 54184 -103132 -7652 198248 11602 -225067 -385808 -378766 -464549 -76562
10135C1444b85234N0923b6267o6154k5689A97281b99760f7041j9414A81387c0174
$$ 31444 -285234 -234311 -26267 -92421 -118110 197281 -299760 -67041 -86455 181387 -30174
10123b11657p5127a0119o0222B3125Q0438c45610A11261i3200J9778C5478J9503
$$ -211657 -286784 -10119 -70341 23125 103563 -345610 111261 -93200 -73422 35478 54981
10112E4981b14510A47386d03326A82101g6183g20r1178A60504g7995B13440N5642
$$ 54981 -214510 147386 -403326 182101 -76183 -720 -91898 160504 -77995 213440 269082
10101B69082h9720M4463m5806a3310k12378c9253j36465F8521J32893a64301D2260
$$ 269082 -89720 -45257 -91063 -13310 -225688 -39253 -175718 68521 201414 -164301 42260
10089G4429B6505J4417a00644j68649a9138k08600R2848G0135k8953N2946a56357
$$ 74429 26505 40922 -100644 -269293 -19138 -227738 -134890 70135 41182 94128 -156357
10077a52176o5639A23554a67150k25751g3501b1110H2927b64367a09513M9862
$$ -152176 -217815 123554 -167150 -392901 -73501 -21110 82927 -264367 -109513 -59651
10067e9651H8131a14616E7348b62122E5518i4509c1934B88788D4062a26815L0148
$$ -59651 88131 -114616 57348 -262122 55518 -94509 -31934 288788 44062 -126815 -96667
10056i6667H3686k8214Q0998A9347b30971C5779c04112A7577b59751N2101h570
$$ -96667 83686 55472 136470 19347 -230971 35779 -304112 17577 -259751 -207650 -8570
10044e9615I6357a36331A74307b84793B24009I516L364a80814F4228J79902A10943
$$ -59615 96357 -136331 174307 -284793 224009 9516 12880 -180814 64228 244130 110943
10032A17165c81667c3715I0821c87467E6212a44712m1711f621j26947e0396k08173
$$ 117165 -381667 -33715 90821 -387467 56212 -144712 -186423 -6621 -133568 -50396 -258569
10021b58569C00121h412A8281K73339a49902E0867L7799J01803b36321e6928B03586
$$ -258569 300121 -8412 18281 291620 -149902 50867 88666 190469 -236321 -56928 203586
10009b77508J14466k24785i2812a8979j72213b6801o8680j7359L9342r7951M9757
$$ -277508 -163042 -387827 -92812 -18979 -191192 -26801 -95481 -112840 -73498 -171449 -121692
9998a21692r7821k82273h9201J3492j93580K1868c9852A85351b33374H582l740
$$ -121692 -219513 -501786 -89201 -75709 -269289 -247421 -39852 185351 -233374 8582 4842
9987D842J17320m837a19830A29704F505i2339A5317c9061j44040f2797k85072
$$ 4842 122162 117325 -119830 129704 6505 -92339 15317 -39061 -183101 -62797 -347869
9976c47869a35971J7286A35769A516R77J49077J37443a42967H2105a12315d0400
$$ -347869 -135971 -118685 135769 1516 2493 151570 289013 -142967 82105 -112315 -40400
9964H5731I920d58306B42502h3311j36609c9454j19930j26941A36201G922a4852
$$ 85731 9920 -458306 242502 -83311 -219920 -39454 -159384 -286325 136201 7922 -14852
9952d34800A28738a67483A32371C9833g9484A07385b92302B35508I1056b05924
$$ -434800 128738 -167483 132371 39833 -79484 107385 -292302 235508 91056 -205924
9941h4513B17181D6516J29627e8654D9169L4626b45012J09636j0186N1308k9865
$$ -84513 217181 46516 176143 -58654 49169 83795 -245012 -135376 -145562 -94254 -124119
9930a24119f190k22826H888c36203g6946l42027a13683m9277c3107H4523b54384
$$ -124119 -6190 -229016 8888 -336203 -76946 -418973 -113683 -162960 -33107 84523 -254384
9918b17986k9426A95634c0009k3449o7872m8814A9512L34216b15852j46870b9523
$$ -217986 -247412 195634 -30009 -53458 -121330 -170144 19512 353728 -215852 -362722 -29523
9906a50980j16262H4148N725c00487D6639h1364B27J43338b51058A71267b469
$$ -150980 -267242 84148 89873 -300487 46639 -81364 227 143565 -251058 171267 -2469
9894A25510b28929C8704b06729K6329b7887B4162p076a28387N5858m0556A90859
$$ 125510 -228929 38704 -206729 -180400 -27887 24162 17086 -128387 -72529 -113085 190859
9882d7636l3248j58738A43272K8514E3196N7146A2978O7005M4764D517K5987J13534
$$ -47636 -80884 -239622 143272 171786 53196 110342 12978 79983 124747 4517 30504 144038
9870A44038c0888A5152a74537A49815K4910a37985E0864d2694l0902K9080k90213
$$ 144038 -30888 15152 -174537 149815 174725 -137985 50864 -42694 -73596 -44516 -334729
9859c34729a05067J4945I105a81242D4183b96368P36C53129b92888A5311a15805
$$ -334729 -105067 -90122 9105 -181242 44183 -296368 -295632 353129 -292888 15311 -115805
9847B38117a37838m2284H3378b8188k98066A2076a20981N8071K5003k79029a28436
$$ 238117 -137838 -180122 83378 -28188 -326254 12076 -120981 -62910 -37907 -316936 -128436
9835b29499c2010J3321j88837e0583o4652K7107B56416j18127g9468D88J32291
$$ -229499 -32010 -18689 -207526 -50583 -115235 -88128 256416 138289 -79468 488 132779
9824A32779K75813j03821e86A44078a31741A26624C7506e08417B3925c36489A87840
$$ 132779 408592 304771 -586 144078 -131741 126624 37506 -508417 23925 -336489 187840
9812B27887b13826A385f6872j09425A70197A281J27711a22847A14482P62d7994
$$ 227887 -213826 1385 -66872 -176297 170197 1281 128992 -122847 114482 115244 -47994
9800b44697A35790b20326P2668f6254r0812H947c0956k57070j6858A86843a45809
$$ -244697 135790 -220326 -147658 -66254 -157066 8947 -30956 -288026 -304884 186843 -145809
9788b15551M1102e0124A08362f5928m0693o5943L1391b4060G1421g7111j40057
$$ -215551 -174449 -50124 108362 -65928 -106621 -172564 -141173 -24060 71421 -77111 -217168
9777b17168h9462D1589c76449J03425N0320a0013A65199a27282c558k45839e2679
$$ -217168 -89462 41589 -376449 -273024 -222704 -10013 165199 -127282 -3558 -249397 -52679
9765F574L8089e2689k78873D3199b83893g1857E3758A1028J07236C4502c0599
$$ 6574 44663 -52689 -331562 43199 -283893 -71857 53758 11028 118264 34502 -30599
9753g0470j64484f6962A62206c48424c3640B4899L6215L7879R8069b33215l8796
$$ -70470 -234954 -66962 162206 -348424 -33640 24899 61114 98993 197062 -233215 -272011
9742b72011G0026M4346D9193c0640C9506b2628o5394I2290c3920A6997b44646
$$ -272011 70026 114372 49193 -30640 39506 -22628 -88022 92290 -33920 16997 -244646
9730A01158J44520B6051b34366b6531n1620k52770R3663h2447j46737A54449j1208
$$ 101158 245678 26051 -234366 -26531 -78151 -330921 -237258 -82447 -229184 154449 143241
9719A43241d5728A85816H894b10002B63250c98703J75456P4516c5518j86532a7226
$$ 143241 -45728 185816 8894 -210002 263250 -398703 -223247 -148731 -35518 -222050 -17226
9707b96562R2660D1986a41857D6870b71552A49445p2821M0399P5901Q6864i1052
$$ -296562 -203902 41986 -141857 46870 -271552 149445 76624 117023 192924 279788 -91052
9695h3612A76580m8508b21633e7604l4521c4115D604J09370i5100D3717O659a19537
$$ -83612 176580 128072 -221633 -57604 -92125 -34115 4604 113974 -95100 43717 50376 -119537
9682b10180G7804a04602A01111a3100Q32k6355m2443I7527a39539r059I9624c32590
$$ -210180 77804 -104602 101111 -13100 -12268 -38623 -81066 97527 -139539 -148598 99624 -332590
9669a16613I4617e4514O312j76261A09037c53523A52057C6263K31673b12959a05915
$$ -116613 94617 -54514 -48202 -224463 109037 -353523 152057 36263 267936 -212959 -105915
9657a31096L4589j18220E7774A7840K6789b70458B34575h9439h678r6270B7303
$$ -131096 -96507 -214727 57774 17840 44629 -270458 234575 -89439 -8678 -104948 27303
9645I7832c59972C17620b39590B45200c6753C28062a94641A6321c87041f4163
$$ 97832 -359972 317620 -239590 245200 -36753 328062 -194641 16321 -387041 -64163
9634c07551G3721a33619e6019j18863O1550A75154b66068F9090b9425k9767l53768
$$ -307551 73721 -133619 -56019 -174882 -113332 175154 -266068 69090 -29425 -59192 -412960
9623d12960G7040a3360A11033a07175m4595B64117i6510k17847J31510C326a08753
$$ -412960 77040 -13360 111033 -107175 -151770 264117 -96510 -314357 -182847 3326 -108753
9611A05397f2813r4334O9044c5283m7246l44280a7143k54559g6966B8701J79353
$$ 105397 -62813 -157147 -88103 -35283 -82529 -426809 -17143 -271702 -76966 28701 208054
9600B08054a09794c286j32545b8838F1174b07292q890B73973a07684k7953j21232
$$ 208054 -109794 -3286 -135831 -28838 61174 -207292 -216182 273973 -107684 -135637 -256869
9589b56869L3654j18889K7384E6714J20522H4037k1243R4982f9665j72686c2516
$$ -256869 -223215 -342104 -314720 56714 177236 84037 62794 157776 -69665 -242351 -32516
9577B04406f7016K9239j29555H2482a39145K8524j0710J8821A01637C1580J00496
$$ 204406 -67016 -37777 -167332 82482 -139145 -110621 -121331 -102510 101637 31580 132076
9566A32076d75146K26635P5821r6123g1052j06679D2023M3771A7743K84483d56834
$$ 132076 -475146 -248511 -172690 -268813 -71052 -177731 42023 85794 17743 302226 -456834
9554F1054L4686J16976K18146F4114a0641n3619k78950g9383B8020a36062A55466
$$ 61054 95740 212716 430862 64114 -10641 -64260 -343210 -79383 28020 -136062 155466
9542c1261A4216M7749g3833n9983j60998A73588b2940o5402k97552G7202d61677
$$ -31261 14216 61965 -73833 -133816 -294814 173588 -22940 -88342 -385894 77202 -461677
9530a16520c6462q097A1861b07456n2205A13647c3856E716M609b98282D0854d5361
$$ -116520 -36462 -44559 11861 -207456 -259661 113647 -33856 5716 10325 -298282 40854 -45361
9517a0209j68650Q8057d5259j12221l28291B57201a08072b6558C780e8752j07640
$$ -10209 -178859 -90802 -45259 -157480 -485771 257201 -108072 -26558 3780 -58752 -166392
9506a66392A17491b11815i3798L0027k40525A01190P9473a93545j34071e1778
$$ -166392 117491 -211815 -93798 -63771 -304296 101190 180663 -193545 -327616 -51778
9495C23500c85668i5104k89949J68959A13830m4154j8364b87756j20977E3688
$$ 323500 -385668 -95104 -385053 -216094 113830 69676 51312 -287756 -408733 53688
9484a47968J2574j66590l7905a40333D5299b25701d1208j97871a12117m4810A11901
$$ -147968 -135394 -301984 -339889 -140333 45299 -225701 -41208 -239079 -112117 -156927 111901
9472a67986l562B71362a31725H658a3458a346n1326m5070b4855A27814D1033a60825
$$ -167986 -171548 271362 -131725 8658 -13458 -1346 -52672 -97742 -24855 127814 41033 -160825
9459f4736B49607d457k52308P6750O2639A22742b08185j08339n3455A66289L2988
$$ -64736 249607 -4457 -256765 -180015 -117376 122742 -208185 -316524 -369979 166289 199277
9448A99277e3562n7967A12419d27473C4022a16630k7370p5251p7712a25528g897
$$ 199277 -53562 -111529 112419 -427473 34022 -116630 -144000 -219251 -296963 -125528 -7897
9436B88565a59121F0602c4239k26149A52549J22801m7659b1810A38634K4827h3045
$$ 288565 -159121 60602 -34239 -260388 152549 275350 227691 -21810 138634 163461 -83045
9424c90463B06632a29810j26818A06015i7070j89577C4469J06065m4705b8287
$$ -390463 206632 -129810 -256628 106015 -97070 -286647 34469 140534 95829 -28287
9413d3028H415d44152J68347h7276l39466A71575a37075B71047n8464I1652K17810
$$ -43028 8415 -444152 -275805 -87276 -426742 171575 -137075 271047 212583 91652 309462
9402C09462a95819e2387I2831h5246b7818j13532J0759I8675D8554c2610A02977
$$ 309462 -195819 -52387 92831 -85246 -27818 -141350 -130591 98675 48554 -32610 102977
9390b89100e3016A91865i4022n7777q8484R9249A42010J10772c82561A15774i036
$$ -289100 -53016 191865 -94022 -151799 -240283 -141034 142010 252782 -382561 115774 -9036
9378C3327a23839o6129A24825n9155a16925K4838A88931c44245a10521L791B12345
$$ 33327 -123839 -189968 124825 65670 -116925 -92087 188931 -344245 -110521 -106730 212345
9366i798l4682l88073i9270F3876M8956K5626D2308b50586J13804E1680g117j25507
$$ -9798 -44480 -432553 -99270 63876 112832 138458 42308 -250586 -136782 51680 -7117 -132624
9354a32624m8544e0121A36578a04602A1441a0696j36440p2064B36278b63014B8966
$$ -132624 -181168 -50121 136578 -104602 11441 -10696 -147136 -219200 236278 -263014 28966
9342i1202b2505F8940a95466B05906a64066m23500A63885f2412l27266C8768f8970
$$ -91202 -22505 68940 -195466 205906 -164066 -587566 163885 -62412 -389678 38768 -68970
9330H1296L5614C5618a14655r504L7374A24124e0133k27005i3166k19257A51293
$$ 81296 116910 35618 -114655 -124159 -86785 124124 -50133 -277138 -93166 -312423 151293
9318b32335g6294B0793f0820j80669a20311e8123l1915m8414N1856C2875a4586
$$ -232335 -76294 20793 -60820 -241489 -120311 -58123 -90038 -138452 -86596 32875 -14586
9306A75711a79971K2292a2237l08925b2071k2295C2475J61658a7842B4441J15784
$$ 175711 -179971 -157679 -12237 -321162 -22071 -44366 32475 194133 -17842 24441 140225
9295A40225D1784a76368j08667h0539M608k95469a79231P5618A90177a93565B04097
$$ 140225 41784 -176368 -285035 -80539 -75931 -371400 -179231 -103613 190177 -193565 204097
9283C15600A13357a55286B3013i1570a4465o3291A14981b6267j38050p2442g1680
$$ 315600 113357 -155286 23013 -91570 -14465 -77756 114981 -26267 -164317 -236759 -71680
9271D7700b24238f0582k37830e7808j46893C21809C4961K770c48623P7184n5616
$$ 47700 -224238 -60582 -298412 -57808 -204701 321809 34961 37731 -348623 -271439 -327055
9260c27055A03719C4130a8280j3849l90694D7275a35890A15553a0553k1481A68442
$$ -327055 103719 34130 -18280 -32129 -422823 47275 -135890 115553 -10553 -32034 168442
9248C24793b89337B27194A11762a61956A96451c08633A84591b46881b1379A13623
$$ 324793 -289337 227194 111762 -161956 196451 -308633 184591 -246881 -21379 113623
9237C25136a48342j98775r7495a61211a9719j87150a6383k50206e4872l0694j03946
$$ 325136 -148342 -347117 -444612 -161211 -19719 -206869 -16383 -266589 -54872 -85566 -189512
9226a89512R4045A12695b39163B34512o4639a52068F1316a86024A44491c46155
$$ -189512 -95467 112695 -239163 234512 169873 -152068 61316 -186024 144491 -346155
9215a3029r1883B1016a3253l5394l8896G1027f0654C03491g9707n0373k42422
$$ -13029 -104912 21016 -13253 -48647 -87543 71027 -60654 303491 -79707 -130080 -372502
9204c72502M9088R2032f9280a1453j72995A18126e8072A71293a37114B40342c09368
$$ -372502 -323414 -231382 -69280 -11453 -184448 118126 -58072 171293 -137114 240342 -309368
9192I3737j9575b82794A41424a59477a9315A5825b606A08719c6058l11246G6857
$$ 93737 74162 -282794 141424 -159477 -19315 15825 -2606 108719 -36058 -347304 76857
9180b79048J31907j05311N4554h2237L9421p3312B93274H7582a04885K8032n5610
$$ -279048 -147141 -252452 -197898 -82237 -42816 -116128 293274 87582 -104885 -76853 -132463
9169a32463n5609F5565b1191A00761b4460j62369j18238d45j67541A08012J61126
$$ -132463 -188072 65565 -21191 100761 -24460 -186829 -305067 -445 -167986 108012 269138
9158B69138B6669j1355a76630a9052j33824j8237j65689A38398B0025b48003d4620
$$ 269138 26669 15314 -176630 -19052 -152876 -171113 -336802 138398 20025 -248003 -44620
9146a03655j23608r0347F5050L2311c94810C98784A44765J9025a30185m9644k33434
$$ -103655 -227263 -317610 65050 97361 -394810 398784 144765 163790 -130185 -179829 -413263
9135d13263f9375H8247l4101a69836f2942C515J67932a87366K0327A26017c26933
$$ -413263 -69375 88247 54146 -169836 -62942 3515 171447 -187366 -167039 126017 -326933
9123a87550Q2520A65784b30958g923A69228b08994D1480M0208a6743A20624d24381
$$ -187550 -105030 165784 -230958 -7923 169228 -208994 41480 81688 -16743 120624 -424381
9111b48474j83238J17075J24062O5279p5971H7155b33130a12858n3869M1810M5623
$$ -248474 -431712 -314637 -190575 -125296 -201267 87155 -233130 -112858 -166727 -124917 -79294
9100g9294A6617n199P7337G428K6900b13927C6506j0230J77634b49177a02942
$$ -79294 16617 11418 88755 7428 34328 -213927 36506 26276 203910 -249177 -102942
9088a38893L0344b3795B93109o3354h2257C55624j65557c41840g1448B7572c0222
$$ -138893 -108549 -23795 293109 229755 -82257 355624 190067 -341840 -71448 27572 -30222
9076A54033a07021A17070l5623B1813j093a62376N2389M4156B68277B0752b77823
$$ 154033 -107021 117070 81447 21813 20720 -162376 -109987 -65831 268277 20752 -277823
9064E2398a67711K4864C04565b5353H8830J52761r0887B5988b07597P9998j16550
$$ 52398 -167711 -142847 304565 -25353 88830 241591 150704 25988 -207597 -127599 -244149
9053b44149e8007k54745D9620a69085N8715H5472a45998p6368f3507o3935A51583
$$ -244149 -58007 -312752 49620 -169085 -110370 85472 -145998 -222366 -63507 -127442 151583
9041I7072a60277c5054A2665b97322J27036c7839J3379n1678j11387i2439A72162
$$ 97072 -160277 -35054 12665 -297322 -170286 -37839 -24460 -76138 -187525 -92439 172162
9029c40730E1906a83810O9803g916o5576D0914b73952C34355a86195O1928M8751
$$ -340730 51906 -183810 -114007 -7916 -73492 40914 -273952 334355 -186195 -124267 -75516
9018g5516A08594j2954a45123E0867Q006M979c387n7561A23683M6783b53077m4335
$$ -75516 108594 95640 -145123 50867 58873 63852 -3387 -60948 123683 170466 -253077 -297412
9006b97412B31812h5531E1190a22073b5288k3147k1166H142J28009a29228p288
$$ -297412 231812 -85531 51190 -122073 -25288 -48435 -69601 8142 136151 -129228 -136516
8995a36516A19049d2605j41969Q7066B56455a47051j05719H8158b53705g6781
$$ -136516 119049 -42605 -184574 -97508 256455 -147051 -252770 88158 -253705 -76781
8984g0172q1277B5268J01128a08140B14913C2423a28321B59441M1204h6500q3595
$$ -70172 -151449 25268 126396 -108140 214913 32423 -128321 259441 300645 -86500 -170095
8973a70095M5321j55098c4852j08507j19827c5617F527R7851a08984F4331B9884
$$ -170095 -124774 -279872 -34852 -143359 -263186 -35617 6527 104378 -108984 64331 29884
8961E1582a40768j63173J49432k6049h4587k5916j02834D5663g5951B15611d1132
$$ 51582 -140768 -303941 -154509 -180558 -84587 -110503 -213337 45663 -75951 215611 -41132
8949g1910q3793M9298j83787a36452i611o8117c3007m2896j13471J3112A2841
$$ -71910 -155703 -106405 -290192 -136452 -9611 -77728 -33007 -75903 -189374 -176262 12841
8937c91365i6633G9040J59268g8766H5826J71549q7684b5785q2078k35742J14673
$$ -391365 -96633 79040 238308 -78766 85826 257375 169691 -25785 -107863 -343605 -228932
8926b28932e337A27475k1808M84170j45394J019757K963818Q787470D095860A484591
$$ -228932 -5337 127475 105667 589837 444443 1464200 4428018 13215488 4095860 1484591
8915C80991Q2148K05816A17779j0445P8223c1376k30395J30315A94820M9444A02571
$$ 380991 463139 668955 117779 107334 185557 -31376 -261771 -131456 194820 244264 102571
8903g0245A76448B4545A2070J35853a57685o684b1552l1228A44088c78575A37358
$$ -70245 176448 24545 12070 147923 -157685 -164369 -21552 -52780 144088 -378575 137358
8891f1449j87349h8002B62608A9871a12751c8157q3793G2691a32910c2233j25980
$$ -61449 -248798 -88002 262608 19871 -112751 -38157 -121950 72691 -132910 -32233 -158213
8880a58213G6662b8830A34516K67001b30887D1269P4800B7091a57761L6736j84544
$$ -158213 76662 -28830 134516 401517 -230887 41269 116069 27091 -157761 -121025 -305569
8869c05569A81641b64216A26433d9664r537l91499h4527E2437d29260A0581a29690
$$ -305569 181641 -264216 126433 -49664 -59201 -450700 -84527 52437 -429260 10581 -129690
8857c09045g5751B8061L6598c5143n7328A3233J72956b6017j4001j9818A01865
$$ -309045 -75751 28061 64659 -35143 -92471 13233 186189 -26017 -40018 -59836 101865
8845a01314j08956i1632D3341a85968A76299i2751n1221A26857d972j64840c9241
$$ -101314 -210270 -91632 43341 -185968 176299 -92751 -143972 126857 -4972 -169812 -39241
8833A55064a21986j50608G2613b95814q2561F3638a48883k0048A62561C0924a28797
$$ 155064 -121986 -272594 72613 -295814 -378375 63638 -148883 -168931 162561 30924 -128797
$$ [...]
##END NTUPLES=NMR SPECTRUM
##END=
