
##TITLE=AC1304_DOMAH11116_6614092_c4TFJmoTcZ
##JCAMPDX= 6.0         $$ Bruker NMR JCAMP-DX V2.0
##DATA TYPE= NMR SPECTRUM
##DATA CLASS= NTUPLES
##ORIGIN= BRUKER
##OWNER= Administrator
$$ 1.72 TOPSPIN		Version 2.1
$$ 2012-08-02 16:12:44.812 -0500  Administrator@TOPSPIN
$$ Compression mode = diff/dup
##.OBSERVE FREQUENCY= 400.02188249412
##.OBSERVE NUCLEUS= ^1H
##.ACQUISITION MODE= SIMULTANEOUS (DQD)
##.ACQUISITION SCHEME= undefined
##.AVERAGES= 64
##.DIGITISER RES= 22
##SPECTROMETER/DATA SYSTEM= spect
##.PULSE SEQUENCE= noesygpps1d.comp
##.SOLVENT NAME= COFFEE_meoh
##.SHIFT REFERENCE= INTERNAL, COFFEE_meoh, 1, 14.96243
##AUDIT TRAIL= $$ (NUMBER, WHEN, WHO, WHERE, PROCESS, VERSION, WHAT)
$$ ##TITLE= Audit trail, TOPSPIN		Version 2.1
$$ ##JCAMPDX= 5.01
$$ ##ORIGIN= Bruker BioSpin GmbH
$$ ##OWNER= Administrator
$$ $$ C:\Bruker\TOPSPIN/data/COFFEE/nmr/AC1304_DOMAH11116_6614092_c4TFJmoTcZ/12/pdata/1/auditp.txt
$$ ##AUDIT TRAIL=  $$ (NUMBER, WHEN, WHO, WHERE, PROCESS, VERSION, WHAT)
(   1,<2012-08-02 16:12:39.687 -0500>,<Administrator>,<TOPSPIN>,<go>,<TOPSPIN 2.1>,
      <created by zg
	started at 2012-08-02 16:01:09.453 -0500,
	POWCHK enabled, PULCHK disabled,
       configuration hash MD5:
       6B 1B 68 BB D9 2E 58 E2 7F 35 AD 54 07 DF 0E 41
       data hash MD5: 64K
       A4 2E 3B D1 24 7C A7 80 74 8E 68 49 F4 61 0C 04>)
(   2,<2012-08-02 16:12:42.687 -0500>,<Administrator>,<TOPSPIN>,<proc1d>,<TOPSPIN 2.1>,
      <Start of raw data processing
       efp LB = 0.3 FT_mod = 6 PKNL = 1 PHC0 = 0 PHC1 = 0 SI = 128K 
       data hash MD5: 128K
       9B 7F EB 37 E9 7B B0 41 C5 E3 08 63 82 36 F0 1F>)
(   3,<2012-08-02 16:12:43.734 -0500>,<Administrator>,<TOPSPIN>,<proc1d>,<TOPSPIN 2.1>,
      <pk PHC0 = 3.834229 PHC1 = 0 
       data hash MD5: 128K
       80 B5 5B 42 19 42 25 77 F0 73 DB B8 CC AC D7 87>)
(   4,<2012-08-02 16:12:44.453 -0500>,<Administrator>,<TOPSPIN>,<proc1d>,<TOPSPIN 2.1>,
      <abs ABSG = 1 
       data hash MD5: 128K
       09 07 09 52 2E 62 4A 55 21 EB D5 AA 2D 96 F1 CC>)
(   5,<2012-08-02 16:12:44.531 -0500>,<Administrator>,<TOPSPIN>,<proc1d>,<TOPSPIN 2.1>,
      <abs ABSG = 2 
       data hash MD5: 128K
       1C 8A 6D 19 1D 5F D4 F7 A4 E2 06 BE 7C F9 EE E7>)
(   6,<2012-08-02 16:12:44.593 -0500>,<Administrator>,<TOPSPIN>,<proc1d>,<TOPSPIN 2.1>,
      <abs ABSG = 3 
       data hash MD5: 128K
       8E 19 DE AD 12 8B 15 23 6F 14 F5 B9 0F CB 26 63>)
(   7,<2012-08-02 16:12:44.671 -0500>,<Administrator>,<TOPSPIN>,<proc1d>,<TOPSPIN 2.1>,
      <abs ABSG = 4 
       data hash MD5: 128K
       0F D0 36 EE D9 B0 C1 55 1B E5 BE A7 E4 CB 68 6B>)
(   8,<2012-08-02 16:12:44.734 -0500>,<Administrator>,<TOPSPIN>,<proc1d>,<TOPSPIN 2.1>,
      <abs ABSG = 5 
       data hash MD5: 128K
       3F 86 B4 6C 5B 66 16 57 1C A1 54 B8 6B 07 17 E5>)
$$ ##END=
$$ 
$$ $$ hash MD5
$$ $$ BE B2 7D E1 8A 6F 10 81 9B CE 50 DC 95 00 59 8A
##$RELAX= 
##$RELAX= 
##$RELAX= 
##$RELAX= 
##$RELAX= 
##$RELAX= 
##$RELAX= 
##$RELAX= 
$$ Bruker specific parameters
$$ [...]
150 150 150 150 150 150 150 150
##$TP07= 0
##$TPNAME0= <>
##$TPNAME1= <>
##$TPNAME2= <>
##$TPNAME3= <>
##$TPNAME4= <>
##$TPNAME5= <>
##$TPNAME6= <>
##$TPNAME7= <>
##$TPOAL= (0..7)
0.5 0.5 0.5 0.5 0.5 0.5 0.5 0.5
##$TPOFFS= (0..7)
0 0 0 0 0 0 0 0
##$TUNHIN= 0
##$TUNHOUT= 0
##$TUNXOUT= 0
##$USERA1= <user>
##$USERA2= <user>
##$USERA3= <user>
##$USERA4= <user>
##$USERA5= <user>
##$V9= 5
##$VALIST= <valist>
##$VCLIST= <CCCCCCCCCCCCCCC>
##$VD= 0
##$VDLIST= <DDDDDDDDDDDDDDD>
##$VPLIST= <PPPPPPPPPPPPPPP>
##$VTLIST= <TTTTTTTTTTTTTTT>
##$WBST= 1024
##$WBSW= 4
##$XGAIN= (0..3)
0 0 0 0
##$XL= 0
##$YL= 0
##$YMAX_a= 16704525
##$YMIN_a= -9363014
##$ZGOPTNS= <>
##$ZL1= 120
##$ZL2= 120
##$ZL3= 120
##$ZL4= 120
##$ABSF1= 14.96243
##$ABSF2= -5.595752
##$ABSG= 5
##$ABSL= 3
##$ALPHA= 0
##$AQORDER= 0
##$ASSFAC= 0
##$ASSFACI= 0
##$ASSFACX= 0
##$ASSWID= 0
##$AUNMP= <proc_prof1d_extract.lims>
##$AXLEFT= 0
##$AXNAME= <>
##$AXNUC= <1H>
##$AXRIGHT= 0
##$AXTYPE= 0
##$AXUNIT= <>
##$AZFE= 0.1
##$AZFW= 0.1
##$BCFW= 0
##$BC_mod= 0
##$BYTORDP= 0
##$COROFFS= 0
##$CY= 15
##$DATMOD= 1
##$DC= 0
##$DFILT= <>
##$DTYPP= 0
##$F1P= 0
##$F2P= 0
##$FCOR= 0.5
##$FTSIZE= 131072
##$FT_mod= 6
##$GAMMA= 0
##$GB= 0
##$INTBC= 1
##$INTSCL= 1
##$ISEN= 128
##$LB= 0.3
##$LEV0= 0
##$LPBIN= 0
##$MAXI= 10000
##$MC2= 0
##$MEAN= 0
##$ME_mod= 0
##$MI= 0
##$NCOEF= 0
##$NC_proc= -2
##$NLEV= 6
##$NOISF1= 0
##$NOISF2= 0
##$NSP= 0
##$NTH_PI= 0
##$NZP= 0
##$OFFSET= 14.96243
##$PC= 1
##$PHC0= 3.834229
##$PHC1= 0
##$PH_mod= 1
##$PKNL= yes
##$PPARMOD= 0
##$PPDIAG= 0
##$PPIPTYP= 0
##$PPMPNUM= 2147483647
##$PPRESOL= 1
##$PSCAL= 4
##$PSIGN= 0
##$PYNMP= <proc.py>
##$REVERSE= no
##$SF= 400.020009062745
##$SI= 131072
##$SIGF1= 0
##$SIGF2= 0
##$SINO= 400
##$SIOLD= 131072
##$SPECTYP= <>
##$SREGLST= <1H.CDCl3>
##$SSB= 0
##$STSI= 131072
##$STSR= 0
##$SW_p= 8223.68421052631
##$SYMM= 0
##$S_DEV= 0
##$TDeff= 65536
##$TDoff= 0
##$TI= <>
##$TILT= no
##$TM1= 0
##$TM2= 0
##$TOPLEV= 0
##$USERP1= <user>
##$USERP2= <user>
##$USERP3= <user>
##$USERP4= <user>
##$USERP5= <user>
##$WDW= 1
##$XDIM= 131072
##$YMAX_p= 425425111
##$YMIN_p= -52361
##$CURPLOT= <Network HP LaserJet P1505>
##$CURPRIN= <$Network HP LaserJet P1505>
##$DFORMAT= <normdp>
##$LAYOUT= <+/1D_H.xwp>
##$LFORMAT= <normlp>
##$PFORMAT= <normpl>
##$SURQMSG= 1
$$ End of Bruker specific parameters
$$ ---------------------------------
##NTUPLES= NMR SPECTRUM
##VAR_NAME=  FREQUENCY,     SPECTRUM/REAL,   SPECTRUM/IMAG
##SYMBOL=    X,             R,               I
##VAR_TYPE=  INDEPENDENT,   DEPENDENT,       DEPENDENT
##VAR_FORM=  AFFN,          ASDF,            ASDF
##VAR_DIM=   131072,        131072,          131072
##UNITS=     HZ,            ARBITRARY UNITS, ARBITRARY UNITS
##FACTOR=    0.0627417313425164, 1,          1
##FIRST=     8223.62146879497, 2585,         -60490
##LAST=      0,             4462,            -60663
##MIN=       0,             -52361,          0
##MAX=       8223.62146879497, 425425111,    0
$$ Real data points
##PAGE= N=1
##DATA TABLE= (X++(R..R)), XYDATA
$$ [...]
$$ plain form
60961 29745710 31009918 31333806 31038513 30516384 30084149 29962286 30272692 30960618 31717901
60952 31717901 32059844 31564285 30093220 27821654 25085876 22207983 19414593 16840155
60944 16840155 14551029 12563527 10863731 9427104 8225711 7226539 6394734 5701333
60936 5701333 5124225 4642542 4235135 3884725 3579320 3309261 3066414 2846324 2647500
60927 2647500 2467840 2304300 2155800 2023128 1905576 1800451 1706048 1622228 1547507 1478353
60917 1478353 1412069 1348159 1286469 1226424 1168683 1115241 1067040 1023215 983105 947099 915146
60906 915146 886333 860375 837751 818062 800047 783509 769390 757750 747583 738855 732660 729012
60894 729012 726513 724699 724745 727268 731384 736504 743147 751215 759342 766790 774277 782087 788940 793593 796121
$$ packed form
60961B9745710J264208L23888k95293n22129m32235j21863L10406O87926P57283
60952C1717901L41943m95559j471065k271566k735778k877893k793390k574438
60944A6840155k289126j987502j699796j436627j201393r99172q31805o93401
60936E701333n77108m81683m07407l50410l05405k70059k42847k20090j98824
60927B647500j79660j63540j48500j32672j17552j05125r4403q3820p4721o9154
60917A478353o6284o3910o1690o0045n7741n3442m8201m3825m0110l6006l1953
60906I15146k8813k5958k2624j9689j8015j6538j4119j1640j0167q728o195l648
60894G29012k499j814M6K523M116N120O643Q068Q127P448P487P810O853M653K528
$$ plain form
60879 796121 796841 795381 791570 785991 779017 770473 760691 750537 740025 728373 715886 704116 693657
60866 693657 683446 672905 663170 655319 648913 643166 638204 634320 631288 629231 628943 630601 633371 636920
60852 636920 641984 648774 656315 664216 673654 685624 699477 714201 729940 747183 765566 784507
60840 784507 804056 824117 843690 861866 878797 894933 910020 923513 935118 944348 950453 953488
60828 953488 954677 955254 955734 956569 958252 960232 960942 959559 956668 952749 947287 940017 931691 922814 912854
60813 912854 901459 889187 876246 861842 845752 829263 813513 798035 782048 766172 751742
60802 751742 739280 728620 719611 711808 704327 696960 690607 685957 682696 680665 680504 682251 684579 686502
60788 686502 688742 692410 697524 703893 712178 722696 734289 745737 757442 770453 784857 800374
$$ packed form
60879G96121P20j460l811n579o974q544r782j0154j0512j1652j2487j1770j0459
60866F93657j0211j0541r735p851o406n747m962l884l032k057k88J658K770L549
60852F36920N064O790P541P901R438J1970J3853J4724J5739J7243J8383J8941
60840G84507J9549K0061J9573J8176J6931J6136J5087J3493J1605R230O105L035
60828I53488J189N77M80Q35J683J980P10j383k891l919n462p270q326q877r960
60813I12854j1395j2272j2941j4404j6090j6489j5750j5478j5987j5876j4430
60802G51742j2462j0660r009p803p481p367o353m650l261k031j61J747K328J923
60788F86502K240L668N114O369Q285J0518J1593J1448J1705J3011J4404J5517
$$ plain form
60776 800374 817448 836163 855013 872356 888394 904224 919756 934142 947612 961004 973909
60765 973909 985010 994137 1002409 1010367 1017359 1022767 1026646 1029212 1030853 1032455 1034466 1035770 1034680 1031048
60751 1031048 1026261 1021303 1016053 1010517 1005440 1001397 998282 995984 994650 993904 992511 989149 983201 974829
60737 974829 964783 954054 943173 931840 919606 906703 893885 881771 870781 861243 853036 845595
60725 845595 838864 833790 831209 830731 831402 832936 835537 839036 843090 847827 853315 858760 863146 866449 869284
60710 869284 871554 872389 871435 869406 867297 865582 864180 862713 860869 858876 857349 856446 855614 854414 852928
60695 852928 850972 847798 843233 838192 833160 826974 818155 806793 794002 780188 765141 749377 734006
60682 734006 719435 705370 692046 680298 670409 661805 653906 646483 639408 632924 627901 624855 622939
$$ packed form
60776H00374J7074J8715J8850J7343J6038J5830J5532J4386J3470J3392J2905
60765I73909J1101R127Q272P958O992N408L879K566J641J602K011J304j090l632
60751A031048m787m958n250n536n077m043l115k298j334p46j393l362n948q372
60737I74829j0046j0729j0881j1333j2234j2903j2818j2114j0990r538q207p441
60725H45595o731n074k581m78O71J534K601L499M054M737N488N445M386L303K835
60710H69284K270Q35r54k029k109j715j402j467j844j993j527r03q32j200j486
60695H52928j956l174m565n041n032o186q819j1362j2791j3814j5047j5764j5371
60682G34006j4571j4065j3324j1748r889q604p899p423p075o484n023l046j916
$$ plain form
60669 622939 620985 619405 619855 622927 627287 631307 634596 637618 640690 643795 646742 649153 650675 651433 651983
60654 651983 652800 654134 656150 658719 661242 663300 665431 668755 673830 680224 686984 693145 698050 701784
60640 701784 705199 709170 713960 719508 725823 732708 739659 746594 754229 763191 773353 784580 797438
60627 797438 812299 828277 843969 858891 873526 888377 903704 919559 935190 948932 959594
60616 959594 967476 973145 975942 974913 970662 964890 958396 950826 942148 932997 923601 913728 903869 895297
60602 895297 888736 883923 880552 878537 877204 875293 872110 867869 862751 856504 849238 841781 834904 828799
60588 828799 823500 819168 815835 813446 812265 812647 814343 816552 818616 820084 820290 818615 815273 811271 807509
60573 807509 804356 801919 800175 799007 798618 799702 802627 806783 811298 815995 820999 825872 829993 833358
$$ packed form
60669F22939j954j580M50L072M360M020L289L022L072L105K947K411J522P58N50
60654F51983Q17J334K016K569K523K058K131L324N075O394O760O161M905L734
60640G01784L415L971M790N548O315O885O951O935P635Q962J0162J1227J2858
60627G97438J4861J5978J5692J4922J4635J4851J5327J5855J5631J3742J0662
60616I59594P882N669K797j029m251n772o494p570q678r151r396r873r859q572
60602H95297o561m813l371k015j333j911l183m241n118o247p266p457o877o105
60588H28799n299m332l333k389j181L82J696K209K064J468K06j675l342m002l762
60573H07509l153k437j744j168l89J084K925M156M515M697N004M873M121L365
$$ plain form
60559 833358 836149 837893 838004 836772 834843 832081 828028 823176 818644 814760 811084 807679 805232 804059
60545 804059 804119 805864 809888 815790 822614 830457 840433 853035 867855 885143 906416 933139 965711
60532 965711 1003938 1047346 1094553 1143022 1189725 1231486 1264861 1286729 1295364 1290577 1273226 1245611
60520 1245611 1211838 1176307 1141543 1108434 1078257 1053056 1033994 1020814 1013178 1011190 1014222 1020565
60508 1020565 1028699 1037878 1047313 1056078 1064186 1072483 1081133 1089598 1098525 1110159 1126106 1145978 1169099
60495 1169099 1196412 1229777 1270446 1319244 1377373 1445926 1524991 1613886 1711835 1818025 1931761
60484 1931761 2053391 2184838 2329157 2490262 2673137 2883169 3124567 3399675 3708949
60475 3708949 4048906 4408082 4765560 5094721 5368894 5564748 5663934 5655552 5538911 5324196
$$ packed form
60559H33358K791J744J11j232j929k762m053m852m532l884l676l405k447j173
60545H04059O0J745M024N902O824P843R976J2602J4820J7288K1273K6723L2572
60532I65711L8227M3408M7207M8469M6703M1761L3375K1868Q635m787j7351k7615
60520A245611l3773l5531l4764l3109l0177k5201j9062j3180p636j988L032O343
60508A020565Q134R179R435Q765Q108Q297Q650Q465Q927J1634J5947J9872K3121
60495A169099K7313L3365M0669M8798N8129O8553P9065Q8895R7949J06190J13736
60484A931761J21630J31447J44319J61105J82875K10032K41398K75108L09274
60475C708949L39957L59176L57478L29161K74173J95854R9186q382j16641k14715
$$ plain form
60465 5324196 5030585 4682970 4307639 3927530 3559387 3214129 2898547 2616014 2366664
60456 2366664 2148535 1959072 1795473 1654315 1531872 1425031 1331654 1250253 1179576 1118310
60446 1118310 1064969 1018223 977292 941620 910197 881868 856304 833886 814364 796354 778506
60435 778506 760551 742929 726042 710259 695995 683378 672233 662580 654595 648019 642309 637482
60423 637482 634044 631936 630351 628796 627472 626481 625619 625146 625662 626910 627853 628336 629455 631755 634309 636278
60407 636278 638134 640461 642786 644741 647273 651326 656147 660287 663755 667857 673277 679626 686600 694332
60393 694332 702573 710670 718493 726495 734649 742076 747889 751801 753797 753875 752313 749767 746808 743553 739834
60378 739834 735587 731001 726349 721656 716712 711582 706957 703576 701397 699831 698706 698320 698568 698778 698669
$$ packed form
60465E324196k93611l47615l75331l80109l68143l45258l15582k82533k49350
60456B366664k18129j89463j63599j41158j22443j06841r3377q1401p0677o1266
60446A118310n3341m6746m0931l5672l1423k8329k5564k2418j9522j8010j7848
60435G78506j7955j7622j6887j5783j4264j2617j1145r653p985o576n710m827
60423F37482l438k108j585j555j324r91q62m73N16J248R43M83J119K300K554J969
60407F36278J856K327K325J955K532M053M821M140L468M102N420O349O974P732
60393F94332Q241Q097P823Q002Q154P427N813L912J996P8j562k546k959l255l719
60378G39834m247m586m652m693m944n130m625l381k179j566j125l86K48K10j09
$$ plain form
60363 698669 698743 699401 700375 701342 702478 704020 705861 707976 710738 714483 719180 724674 730711 736697 742238
60348 742238 748031 755309 764166 773364 782108 790930 800410 810171 819849 829913 840561 850718 859251
60335 859251 866593 874092 882208 890339 898032 905469 912964 920836 929739 940479 953555 969214 987582
60322 987582 1008246 1029939 1050973 1069719 1084514 1093760 1096613 1093136 1083465 1067594 1046488 1022739
60310 1022739 999306 977821 958472 940918 924804 909926 896536 885144 875679 867384 859917 853918
60298 853918 849996 847797 846631 846401 847434 849898 853874 859313 865496 871242 876132 880732 885118 888186
60284 888186 889197 889067 889206 889869 890590 891435 892697 894006 894873 895729 897366 899778 902535 905887 910477 916236
60268 916236 922678 930074 939335 950745 963679 977593 992666 1009492 1028726 1050884 1076041 1103972
$$ packed form
60363F98669P4O58R74R67J136J542J841K115K762L745M697N494O037N986N541
60348G42238N793P278Q857R198Q744Q822R480R761R678J0064J0648J0157Q533
60335H59251P342P499Q116Q131P693P437P495P872Q903J0740J3076J5659J8368
60322I87582K0664K1693K1034J8746J4795R246K853l477r671j5871k1106k3749
60310A022739k3433k1485j9349j7554j6114j4878j3390j1392r465q295p467n999
60298H53918l922k199j166k30J033K464L976N439O183N746M890M600M386L068
60284H88186J011j30J39O63P21Q45J262J309Q67Q56J637K412K757L352M590N759
60268I16236O442P396R261J1410J2934J3914J5073J6826J9234K2158K5157K7931
$$ plain form
60256 1103972 1134940 1169871 1209237 1252396 1298730 1348879 1404113 1465029 1531757 1604951 1685580
60245 1685580 1773991 1870014 1973657 2084789 2202295 2324344 2449281 2575527 2700954 2823180
60235 2823180 2940315 3050668 3151985 3241870 3318791 3381967 3430442 3463066 3479374 3479897 3465688
60224 3465688 3438096 3398864 3350044 3294098 3234404 3174996 3119034 3067925 3022630 2985243 2958412
60213 2958412 2943645 2941103 2950737 2972659 3006735 3052959 3112297 3186194 3274995 3377329 3490886
60202 3490886 3613168 3741539 3873249 4005514 4135142 4258182 4370416 4468250 4549020 4610893
60192 4610893 4652941 4674959 4676821 4658305 4619797 4562651 4488607 4399684 4299120 4191613 4081858
60181 4081858 3973445 3869560 3773676 3688497 3615088 3554113 3507344 3476904 3463714 3467789 3489332
$$ packed form
60256A103972L0968L4931L9366M3159M6334N0149N5234O0916O6728P3194Q0629
60245A685580Q8411R6023J03643J11132J17506J22049J24937J26246J25427J22226
60235B823180J17135J10353J01317Q9885P6921O3176M8475L2624J6308N23j4209
60224C465688k7592l9232m8820n5946n9694n9408n5962n1109m5295l7387k6831
60213B958412j4767k542R634K1922L4076M6224N9338P3897Q8801J02334J13557
60202C490886J22282J28371J31710J32265J29628J23040J12234R7834Q0770O1873
60192D610893M2048K2018J862j8516l8508n7146p4044q8923j00564j07507j09755
60181D081858j08413j03885r5884q5179p3409o0975m6769l0440j3190M075K1543
$$ plain form
60170 3489332 3528204 3582679 3650005 3727925 3814433 3906270 3998857 4087766 4169532 4241511 4302053
60159 4302053 4350566 4386435 4408156 4414550 4406403 4385819 4354405 4313409 4265440 4214642 4165052 4119821
60147 4119821 4081952 4054535 4040010 4040116 4056617 4091309 4145432 4219915 4316055 4435068 4577238
60136 4577238 4742479 4931622 5146191 5387100 5654416 5948003 6267128 6609488 6971632
60127 6971632 7350132 7741207 8139317 8537331 8928063 9304665 9659784 9985728 10275683
60118 10275683 10523903 10724901 10873801 10967612 11005202 10986019 10909945 10778401 10594547 10362430
60108 10362430 10087123 9775830 9437813 9083034 8721449 8363031 8016888 7690058 7387968
60099 7387968 7115726 6877671 6675886 6510649 6382432 6292153 6239610 6223234 6241479 6292876
$$ packed form
60170C489332L8872N4475O7326P7920Q6508R1837R2587Q8909Q1766P1979O0542
60159D302053M8513L5869K1721O394q147k0584l1414m0996m7969n0798m9590m5231
60147D119821l7869k7417j4525J06J6501L4692N4123P4483R6140J19013J42170
60136D577238J65241J89143K14569K40909K67316K93587L19125L42360L62144
60127F971632L78500L91075L98110L98014L90732L76602L55119L25944K89955
60118A0275683K48220K00998J48900R3811L7590j9183p6074j31544j83854k32117
60108A0362430k75307l11293l38017l54779l61585l58418l46143l26830l02090
60099G387968k72242k38055k01785j65237j28217r0279n2543j6376J8245N1397
$$ plain form
60089 6292876 6374467 6481683 6610000 6755042 6910548 7067871 7218289 7354688 7470715 7560179
60079 7560179 7618569 7644304 7637700 7599647 7531830 7437027 7318205 7177945 7019233 6845732 6660630
60068 6660630 6466197 6265221 6061982 5861007 5665641 5478555 5302782 5141215 4995511
60059 4995511 4866208 4753644 4658366 4581169 4523184 4485572 4468844 4472927 4497938 4544110 4610745
60048 4610745 4696015 4798037 4915219 5045088 5183516 5325545 5466319 5600899 5724040 5830820
60038 5830820 5917263 5980302 6017933 6029611 6015603 5975663 5909116 5816630 5701163 5566881 5418034
60027 5418034 5259241 5095842 4933038 4775020 4625119 4486163 4360170 4248265 4151326 4070357
60017 4070357 4006064 3958662 3928354 3915598 3920835 3944546 3987639 4051150 4135484 4240427 4365713
$$ packed form
60089F292876Q1591J07216J28317J45042J55506J57323J50418J36399J16027Q9464
60079G560179N8390K5735o604l8053o7817r4803j18822j40260j58712j73501j85102
60068F660630j94433k00976k03239k00975j95366j87086j75773j61567j45704
60059D995511j29303j12564r5278p7197n7985l7612j6728M083K5011M6172O6635
60048D610745Q5270J02022J17182J29869J38428J42029J40774J34580J23141J06780
60038E830820Q6443O3039L7631J1678j4008l9940o6547r2486j15467j34282j48847
60027E418034j58793j63399j62804j58018j49901j38956j25993j11905r6939q0969
60017D070357o4293m7402l0308j2756N237K3711M3093O3511Q4334J04943J25286
$$ plain form
60006 4365713 4510792 4674133 4853415 5045937 5247689 5452261 5652025 5840519 6012693
59997 6012693 6163299 6286979 6380435 6443024 6474704 6474689 6442557 6379299 6286699 6167087 6024563
59986 6024563 5865383 5696350 5523570 5352917 5190074 5039147 4902180 4780691 4676572
59977 4676572 4590974 4523714 4474785 4445272 4435801 4445235 4472048 4516012 4577391 4655104 4746755 4849750
59965 4849750 4961376 5078326 5197147 5314846 5428460 5534661 5630515 5714171 5784263 5839387
59955 5839387 5878864 5903475 5914938 5915277 5907124 5893735 5878127 5863060 5852488 5852014 5866996 5900915
59943 5900915 5956297 6036329 6144658 6284318 6457833 6667757 6916146 7203794 7530583 7895886
59933 7895886 8297784 8732065 9192122 9668776 10149362 10617670 11055588 11444616 11766196
$$ packed form
60006D365713J45079J63341J79282J92522K01752K04572J99764J88494J72174
59997F012693J50606J23680R3456O2589L1680j5l2132o3258r2600j19612j42524
59986F024563j59180j69033j72780j70653j62843j50927j36967j21489j04119
59977D676572q5598o7260m8929k9513r471R434K6813M3964O1379P7713R1651J02995
59965D849750J11626J16950J18821J17699J13614J06201R5854Q3656P0092N5124
59955E839387L9477K4611J1463L39q153j3389j5608j5067j0572m74J4982L3919
59943E900915N5382Q0032J08329J39660J73515K09924K48389K87648L26789L65303
59933G895886M01898M34281M60057M76654M80586M68308M37918L89028L21580
$$ plain form
59924 11766196 12002796 12140977 12173990 12101603 11928782 11665463 11326374 10929217 10492362 10033785
59914 10033785 9570339 9116103 8681264 8272998 7896821 7556523 7253840 6989508 6764450
59905 6764450 6579320 6433584 6326008 6255726 6222211 6224742 6262512 6334598 6439080 6572723
59895 6572723 6732120 6914313 7115453 7329333 7547761 7761492 7960018 8131525 8264504
59886 8264504 8349501 8379303 8348890 8256761 8105981 7902998 7655747 7373226 7065609 6743058
59876 6743058 6414410 6087419 5769330 5466031 5181151 4916905 4675270 4457444 4262943
59867 4262943 4090526 3939659 3810057 3700299 3607979 3530891 3467122 3414307 3369732 3330843
59857 3330843 3295006 3259315 3221661 3181617 3139639 3096033 3051617 3008565 2969399 2935505 2907562
$$ packed form
59924A1766196K36600J38181L3013p2387j72821k63319l39089l97157m36855m58577
59914A0033785m63446m54236m34839m08266l76177l40298l02683k64332k25058
59905F764450j85130j45736j07576p0282l3515K531L7770P2086J04482J33643
59895F572723J59397J82193K01140K13880K18428K13731J98526J71507J32979
59886H264504Q4997K9802l0413r2129j50780k02983k47251k82521l07617l22551
59876F743058l28648l26991l18089l03299k84880k64246k41635k17826j94501
59867D262943j72417j50867j29602j09758r2320p7088o3769n2815m4575l8889
59857C330843l5837l5691l7654m0044m1978m3606m4416m3052l9166l3894k7943
$$ plain form
59846 2907562 2886745 2874141 2869166 2869560 2872736 2876278 2877491 2873477 2861681 2840079 2807670 2765686 2717590
59833 2717590 2666875 2615357 2564283 2515965 2472873 2435707 2403841 2377289 2356999 2343591 2337148
59822 2337148 2338037 2346751 2363157 2387012 2418892 2459536 2508563 2564886 2627859 2696716 2769249 2842538
59810 2842538 2914932 2986149 3055685 3122432 3185599 3244429 3296735 3338951 3368051 3382851 3383884
59799 3383884 3373316 3355063 3333677 3312623 3294042 3279883 3272252 3272849 3283126 3304944 3340108 3389392
59787 3389392 3453113 3532724 3630972 3750615 3893967 4063626 4262712 4494408 4761945 5068599
59777 5068599 5416270 5803504 6224634 6669029 7118682 7546234 7917476 8198376 8362617
59768 8362617 8396976 8304191 8102160 7818365 7482295 7120645 6756013 6406060 6082246 5790426
$$ packed form
59846B907562k0817j2604m975L94L176L542J213m014j1796k1602l2409m1984m8096
59833B717590n0715n1518n1074m8318m3092l7166l1866k6552k0290j3408o443
59822B337148Q89Q714J6406K3855L1880M0644M9027N6323O2973O8857P2533P3289
59810B842538P2394P1217O9536O6747O3167N8830N2306M2216K9100J4800J033
59799C383884j0568j8253k1386k1054j8581j4159p631N97J0277K1818L5164M9284
59787C389392O3721P9611R8248J19643J43352J69659J99086K31696K67537L06654
59777E068599L47671L87234M21130M44395M49653M27552L71242K80900J64241
59768H362617L4359r2785k02031k83795l36070l61650l64632l49953l23814k91820
$$ plain form
59758 5790426 5533395 5312443 5126921 4974196 4851090 4755008 4683769 4635453 4608636 4601903
59748 4601903 4613127 4640245 4682841 4741844 4817613 4909474 5017237 5141796 5283841 5443372
59738 5443372 5621098 5819157 6039709 6283694 6551802 6845942 7169086 7524255 7914219
59729 7914219 8341584 8808364 9315577 9863370 10450954 11075784 11732651 12413406 13107048
59720 13107048 13800125 14477950 15126528 15734408 16294297 16804527 17269607 17699093 18105743
59711 18105743 18504383 18911075 19341277 19807511 20318024 20876381 21480915 22124323 22794145
59702 22794145 23473417 24140644 24770561 25337079 25816814 26190824 26445410 26574089 26579571 26472941
59692 26472941 26270804 25993594 25665204 25311238 24955845 24620177 24323242 24082357 23911850
$$ packed form
59758E790426k57031k20952j85522j52725j23106r6082p1239m8316k6817o733
59748D601903J1224K7118M2596N9003P5769R1861J07763J24559J42045J59531
59738E443372J77726J98059K20552K43985K68108K94140L23144L55169L89964
59729G914219M27365M66780N07213N47793N87584O24830O56867O80755O93642
59720A3107048O93077O77825O48578O07880N59889N10230M65080M29486M06650
59711A8105743L98640M06692M30202M66234N10513N58357O04534O43408O69822
59702B2794145O79272O67227O29917N66518M79735L74010K54586J28679N482j06630
59692B6472941k02137k77210l28390l53966l55393l35668k96935k40885j70507
$$ plain form
59683 23911850 23822104 23820486 23912972 24105103 24402525 24811019 25335419 25978114 26738613 27613449
59673 27613449 28594474 29665940 30802835 31970870 33126346 34216030 35179437 35954432
59665 35954432 36484289 36724615 36649753 36257244 35568147 34623186 33476889 32191118 30828335
59656 30828335 29445861 28092557 26807125 25616465 24534829 23565059 22700138 21922506
59648 21922506 21202955 20503705 19786450 19021332 18193071 17303165 16367655 15410682 14457176
59639 14457176 13528707 12642541 11810987 11040624 10333331 9688710 9105152 8579341 8106606
59630 8106606 7682390 7302651 6963076 6659212 6387481 6145018 5928642 5735316 5563503
59621 5563503 5412690 5281479 5167448 5068852 4984814 4913568 4852003 4797364 4748066 4702425 4657896
$$ packed form
59683B3911850q9746j618R2486J92131K97422M08494N24400O42695P60499Q74836
59673B7613449R81025J071466J136895J168035J155476J089684R63407P74995
59665C5954432N29857K40326p4862l92509o89097r44961j146297j285771j362783
59656C0828335j382474j353304j285432j190660j081636r69770q64921p77632
59648B1922506p19551o99250p17255p65118q28261q89906r35510r56973r53506
59639A4457176r28469q86166q31554p70363p07293o44621n83558n25811m72735
59630H106606m24216l79739l39575l03864k71731k42463k16376j93326j71813
59621E563503j50813j31211j14031r8596q4038p1246o1565n4639m9298m5641m4529
$$ plain form
59610 4657896 4611979 4562653 4507591 4444299 4371640 4290312 4201557 4106541 4007101 3905764 3804512
59599 3804512 3704566 3607476 3515187 3428838 3348817 3276118 3212171 3157090 3109689 3069643 3038095
59588 3038095 3015598 3001018 2993081 2991496 2995916 3005244 3018729 3036350 3057429 3080252 3103860 3128724
59576 3128724 3154820 3180451 3204071 3226078 3247871 3270276 3293961 3320250 3350485 3385439 3426171
59565 3426171 3474482 3531673 3597783 3672838 3757844 3853750 3960578 4078526 4209023 4353777
59555 4353777 4513720 4689842 4884042 5098010 5331789 5584269 5854389 6141116 6442851
59546 6442851 6757511 7082436 7413594 7745668 8073662 8393843 8702816 8996819 9272776
59537 9272776 9529479 9767322 9987542 10191544 10379359 10548294 10694913 10819626 10928407
$$ packed form
59610D657896m5917m9326n5062o3292p2659q1328q8755r5016r9440j01337j01252
59599C804512r9946r7090r2289q6349q0021p2699o3947n5081m7401m0046l1548
59588C038095k2497j4580p937j585M420R328J3485J7621K1079K2823K3608K4864
59576C128724K6096K5631K3620K2007K1793K2405K3685K6289L0235L4954M0732
59565C426171M8311N7191O6110P5055Q5006R5906J06828J17948J30497J44754
59555D353777J59943J76122J94200K13968K33779K52480K70120K86727L01735
59546F442851L14660L24925L31158L32074L27994L20181L08973K94003K75957
59537I272776K56703K37843K20220K04002J87815J68935J46619J24713J08781
$$ plain form
59528 10928407 11029324 11128649 11230981 11340865 11461842 11594027 11733646 11874152 12006628
59519 12006628 12119810 12201363 12239666 12224679 12148577 12006855 11798613 11525546 11191683 10804543
59509 10804543 10375055 9915102 9435701 8947757 8462627 7990113 7536512 7105622 6700777
59500 6700777 6324856 5979396 5665084 5382495 5131217 4909049 4713310 4542346 4394774
59491 4394774 4268087 4159417 4067255 3991395 3931694 3887834 3859662 3846669 3847668 3862010 3890539
59480 3890539 3934396 3993525 4067402 4156623 4262590 4386179 4527830 4688586 4869885 5072377
59470 5072377 5295537 5538033 5797665 6071280 6355183 6644940 6934072 7213539 7473144
59461 7473144 7702884 7892817 8033280 8116850 8139776 8101061 8001442 7844509 7637711 7390639
$$ packed form
59528A0928407J00917R9325J02332J09884J20977J32185J39619J40506J32476
59519A2006628J13182Q1553L8303j4987p6102j41722k08242k73067l33863l87140
59509A0804543m29488m59953m79401m87944m85130m72514m53601m30890m04845
59500F700777l75921l45460l14312k82589k51278k22168j95739j70964j47572
59491D394774j26687j08670r2162p5860n9701m3860k8172j2993R99J4342K8529
59480C890539M3857N9129P3877Q9221J05967J23589J41651J60756J81299K02492
59470E072377K23160K42496K59632K73615K83903K89757K89132K79467K59605
59461G473144K29740J89933J40463Q3570K2926l8715r9619j56933k06798k47072
$$ plain form
59451 7390639 7112495 6811912 6497974 6179540 5863653 5555496 5259395 4978726 4715286
59442 4715286 4469905 4243389 4036108 3847248 3675484 3520005 3380185 3254967 3143446
59433 3143446 3045311 2959748 2884711 2818344 2760440 2711408 2670523 2636427 2608694 2587661 2573157
59422 2573157 2564542 2561500 2563687 2569983 2579194 2591162 2606339 2624749 2646195 2670943 2699451 2732158
59410 2732158 2770127 2814513 2864024 2913891 2959072 2998266 3034084 3070513 3111616 3161433 3222914
59399 3222914 3297115 3384957 3489106 3612045 3752368 3904934 4065416 4233989 4415064 4615073
59389 4615073 4840634 5097248 5388738 5718062 6088373 6502565 6962025 7466296 8013238
59380 8013238 8598291 9213639 9848644 10490635 11124862 11735238 12307315 12831145 13301236
$$ packed form
59451G390639k78144l00583l13938l18434l15887l08157k96101k80669k63440
59442D715286k45381k26516k07281j88860j71764j55479j39820j25218j11521
59433C143446r8135q5563p5037o6367n7904m9032m0885l4096k7733k1033j4504
59422B573157q615l042K187O296R211J1968J5177J8410K1446K4748K8508L2707
59410B732158L7969M4386M9511M9867M5181L9194L5818L6429M1103M9817O1481
59399C222914P4201Q7842J04149J22939J40323J52566J60482J68573J81075K00009
59389D615073K25561K56614K91490L29324L70311M14192M59460N04271N46942
59380H013238N85053O15348O35005O41991O34227O10376N72077N23830M70091
$$ plain form
59371 13301236 13714941 14072117 14375397 14629074 14837588 15005387 15136645 15233161 15292858 15311612
59361 15311612 15286013 15213134 15088883 14909072 14672539 14382412 14045325 13671373 13274441 12870125
59351 12870125 12472061 12090186 11731153 11398118 11089872 10801638 10527068 10258890 9988703
59342 9988703 9708516 9413330 9101675 8774296 8433742 8084892 7734068 7387127 7049087
59333 7049087 6724867 6418780 6133267 5869372 5628236 5410930 5217198 5045818 4896030
59324 4896030 4767333 4658319 4567192 4493127 4435715 4393493 4364766 4349552 4348809 4361787 4385930
59313 4385930 4419465 4462312 4514162 4573202 4636986 4703082 4768622 4830619 4886988 4936100 4975517
59302 4975517 5002672 5016813 5018723 5008601 4985892 4951378 4907773 4857936 4804084 4749022 4696392
$$ packed form
59371A3301236M13705L57176L03280K53677K08514J67799J31258R6516N9697J8754
59361A5311612k5599p2879j24251j79811k36533k90127l37087l73952l96932m04316
59351A2870125l98064l81875l59033l33035l08246k88234k74570k68178k70187
59342I988703k80187k95186l11655l27379l40554l48850l50824l46941l38040
59333G049087l24220l06087k85513k63895k41136k17306j93732j71380j49788
59324D896030j28697j09014r1127p4065n7412m2222k8727j5214p43J2978K4143
59313D385930L3535M2847N1850N9040O3784O6096O5540O1997N6369M9112L9417
59302D975517K7155J4141J910j0122k2709l4514m3605m9837n3852n5062n2630
$$ plain form
59291 4696392 4649055 4608455 4575975 4553621 4543033 4545051 4560666 4591263 4637647 4699928 4778487
59280 4778487 4873898 4985854 5113384 5256076 5413668 5584348 5764764 5951568 6141289 6328657
59270 6328657 6506943 6670490 6815544 6938589 7035988 7106050 7149806 7168685 7162567 7130783 7074005
59259 7074005 6994753 6897355 6787924 6672984 6557102 6442281 6329570 6219910 6113230 6008285
59249 6008285 5904179 5801192 5699906 5600855 5505507 5416336 5335400 5263856 5203288 5156434 5126197
59238 5126197 5114927 5124888 5158330 5216941 5302426 5417839 5567047 5752597 5975333 6236156
59228 6236156 6536438 6875945 7251438 7657451 8086654 8528446 8968197 9388747 9772294
59219 9772294 10101266 10359425 10533507 10613759 10593581 10470531 10248368 9936991 9550020 9103315
$$ packed form
59291D696392m7337m0600l2480k2354j0588K018J5615L0597M6384O2281P8559
59280D778487R5411J11956J27530J42692J57592J70680J80416J86804J89721J87368
59270F328657J78286J63547J45054J23045R7399P0062M3756J8879o118l1784n6778
59259G074005p9252r7398j09431j14940j15882j14821j12711j09660j06680j04945
59249F008285j04106j02987j01286r9051r5348q9171q0936p1544o0568m6854l0237
59238E126197j1270R961L3442N8611Q5485J15413J49208J85550K22736K60823
59228F236156L00282L39507L75493M06013M29203M41792M39751M20550L83547
59219I772294L28972K58159J74082Q0252k0178j23050k22163l11377l86971m46705
$$ plain form
59209 9103315 8615166 8105082 7590380 7084055 6595737 6133024 5701291 5303654 4941951
59200 4941951 4616889 4326976 4068732 3838698 3634448 3453638 3293602 3152320 3028483
59191 3028483 2920165 2824728 2740324 2666114 2600743 2542212 2489668 2443612 2403824 2368789 2337814
59180 2337814 2311942 2291847 2276498 2264930 2257810 2256003 2258906 2265409 2275494 2289854 2308804 2332409
59168 2332409 2360824 2393786 2430639 2471433 2517003 2567560 2622412 2681510 2745970 2816447 2892231
59157 2892231 2972477 3056909 3144802 3234709 3325895 3418479 3511321 3601265 3685319 3762163 3830663
59146 3830663 3888538 3933725 3965739 3984543 3989341 3979799 3957431 3924698 3883704 3836690 3786624 3736074
59134 3736074 3686373 3638865 3596069 3560554 3533473 3515129 3506298 3508304 3522544 3550500 3593303 3650861
$$ packed form
59209I103315m88149n10084n14702n06325m88318m62713m31733l97637l61703
59200D941951l25062k89913k58244k30034k04250j80810j60036j41282j23837
59191C028483j08318r5437q4404p4210o5371n8531n2544m6056l9788l5035l0975
59180B337814k5872k0095j5349j1568p120j807K903O503J0085J4360J8950K3605
59168B332409K8415L2962L6853M0794M5570N0557N4852N9098O4460P0477P5784
59157B892231Q0246Q4432Q7893Q9907R1186R2584R2842Q9944Q4054P6844O8500
59146C830663N7875M5187L2014J8804M798r542k2368l2733m0994m7014n0066n0550
59134C736074m9701m7508m2796l5515k7081j8344q831K006J4240K7956M2803N7558
$$ plain form
59122 3650861 3722458 3808613 3911113 4030869 4167244 4319996 4490134 4678107 4882952 5104294
59112 5104294 5343445 5601069 5875004 6161452 6456700 6756081 7052235 7335633 7595829
59103 7595829 7821405 8000512 8123613 8185653 8185331 8123936 8006151 7840328 7635974 7401250
59093 7401250 7143464 6870269 6588542 6302768 6015810 5730420 5449005 5173047 4904100
59084 4904100 4644559 4396376 4160044 3935880 3725147 3528706 3345708 3174943 3016467
59075 3016467 2870628 2736488 2612514 2497836 2391742 2293052 2201296 2117325 2041417 1971950
59065 1971950 1907239 1847474 1793286 1743703 1697247 1653976 1614554 1578213 1543490 1510360 1479844
59054 1479844 1452006 1425928 1401129 1377491 1354299 1330812 1307321 1284357 1261548 1238707 1217279
$$ packed form
59122C650861P1597Q6155J02500J19756J36375J52752J70138J87973K04845K21342
59112E104294K39151K57624K73935K86448K95248K99381K96154K83398K60196
59103G595829K25576J79107J23101O2040l22o1395j17785j65823k04354k34724
59093G401250k57786k73195k81727k85774k86958k85390k81415k75958k68947
59084D904100k59541k48183k36332k24164k10733j96441j82998j70765j58476
59075C016467j45839j34140j23974j14678j06094r8690r1756q3971p5908o9467
59065A971950o4711n9765n4188m9583m6456m3271l9422l6341l4723l3130l0516
59054A479844k7838k6078k4799k3638k3192k3487k3491k2964k2809k2841k1428
$$ plain form
59043 1217279 1199002 1183628 1169508 1156134 1144588 1135795 1129669 1125795 1123706 1122761 1122861 1125038 1130379
59030 1130379 1138789 1149543 1162343 1176882 1192232 1207752 1223800 1240394 1255995 1268880 1278996
59019 1278996 1287259 1293872 1298597 1301857 1304210 1305505 1305888 1306865 1309983 1315179 1321727 1329913 1340324 1352357
59005 1352357 1365051 1378666 1393836 1409738 1424687 1437935 1449410 1458487 1464758 1469369 1473737 1477344
58993 1477344 1478593 1477534 1476090 1475788 1476873 1479418 1483621 1489010 1494806 1501145 1508843 1518110 1528608 1540348
58979 1540348 1553286 1566408 1578613 1590302 1602916 1617188 1632973 1650366 1669751 1691116 1714504
58968 1714504 1740729 1770410 1802711 1836182 1870460 1906062 1943077 1981237 2020590 2060829 2100555
58957 2100555 2138600 2175618 2213160 2251860 2291821 2333926 2379133 2427158 2477621 2532077 2593167
$$ packed form
59043A217279j8277j5374j4120j3374j1546q793o126l874k089r45J00K177N341
59030A130379Q410J0754J2800J4539J5350J5520J6048J6594J5601J2885J0116
59019A278996Q263O613M725L260K353J295L83R77L118N196O548Q186J0411J2033
59005A352357J2694J3615J5170J5902J4949J3248J1475R077O271M611M368L607
58993A477344J249j059j444l02J085K545M203N389N796O339P698R267J0498J1740
58979A540348J2938J3122J2205J1689J2614J4272J5785J7393J9385K1365K3388
58968A714504K6225K9681L2301L3471L4278L5602L7015L8160L9353M0239L9726
58957B100555L8045L7018L7542L8700L9961M2105M5207M8025N0463N4456O1090
$$ plain form
58946 2593167 2661991 2737773 2819812 2908215 3003107 3104837 3214959 3335523 3467331 3610039
58936 3610039 3763863 3930074 4110052 4305005 4516443 4746014 4995249 5266326 5562392
58927 5562392 5886118 6238728 6621645 7038282 7492894 7988391 8526554 9109389 9738524
58918 9738524 10413756 11133537 11895909 12696940 13528183 14376622 15226039 16056698 16844346
58909 16844346 17561582 18180700 18675443 19022655 19205729 19217577 19060152 18742630 18281314
58900 18281314 17699165 17022114 16275078 15481715 14665382 13846933 13041749 12260769 11513470
58891 11513470 10807433 10146009 9529411 8958163 8433355 7954035 7517031 7119410 6758914
58882 6758914 6432140 6134638 5862968 5614707 5386647 5175142 4978180 4795095 4624436
$$ packed form
58946B593167O8824P5782Q2039Q8403R4892J01730J10122J20564J31808J42708
58936C610039J53824J66211J79978J94953K11438K29571K49235K71077K96066
58927E562392L23726L52610L82917M16637M54612M95497N38163N82835O29135
58918I738524O75232P19781P62372Q01031Q31243Q48439Q49417Q30659P87648
58909A6844346P17236O19118M94743L47212J83074J1848j57425l17522m61316
58900A8281314n82149o77051p47036p93363q16333q18449q05184p80980p47299
58891A1513470p06037o61424o16598n71248n24808m79320m37004l97621l60496
58882F758914l26774k97502k71670k48261k28060k11505j96962j83085j70659
$$ plain form
58873 4624436 4464237 4314139 4175001 4046486 3927169 3816815 3716224 3624796 3540532 3462521
58863 3462521 3391238 3326417 3266912 3212752 3164990 3123338 3086283 3053712 3027098 3006750 2991244
58852 2991244 2980108 2974882 2976844 2985646 3000751 3022435 3050885 3085945 3128091 3178089 3235495 3299094
58840 3299094 3368755 3445261 3528638 3618607 3716364 3823735 3940827 4066850 4203030 4352203
58830 4352203 4515602 4692725 4884417 5093309 5320912 5567290 5834311 6126519 6447843
58821 6447843 6799943 7184679 7605729 8066651 8569504 9116336 9709833 10351221 11039092
58812 11039092 11770597 12541221 13341982 14158355 14972537 15764790 16511911 17186875 17761826
58803 17761826 18211117 18512561 18649631 18615119 18412294 18052476 17553032 16937113 16231595
$$ packed form
58873D624436j60199j50098j39138j28515j19317j10354j00591r1428q4264p8011
58863C462521p1283o4821n9505n4160m7762m1652l7055l2571k6614k0348j5506
58852B991244j1136n226J962Q802J5105K1684K8450L5060M2146M9998N7406O3599
58840C299094O9661P6506Q3377Q9969R7757J07371J17092J26023J36180J49173
58830D352203J63399J77123J91692K08892K27603K46378K67021K92208L21324
58821F447843L52100L84736M21050M60922N02853N46832N93497O41388O87871
58812A1039092P31505P70624Q00761Q16373Q14182P92253P47121O74964N74951
58803A7761826M49291L01444J37070l4512k02825l59818m99444o15919p05518
$$ plain form
58794 16231595 15462746 14654184 13828164 13005362 12201673 11426951 10687906 9990389 9338124
58785 9338124 8731573 8169624 7651094 7173943 6735038 6331861 5962969 5626125 5317788
58776 5317788 5035149 4776806 4540737 4323555 4122595 3936776 3764577 3603191 3450618
58767 3450618 3306752 3171621 3044446 2925215 2814992 2713639 2619188 2530451 2448327 2373622
58757 2373622 2305627 2243882 2189176 2141527 2099059 2060158 2024986 1993785 1965483 1939146 1915041
58746 1915041 1893136 1872238 1851714 1832366 1814610 1797507 1780569 1764662 1750014 1735038 1718354
58735 1718354 1700452 1682378 1664319 1646352 1628964 1611993 1594528 1576430 1558318 1539683 1519042
58724 1519042 1496420 1473411 1450261 1425289 1397931 1369843 1342113 1314047 1285772 1259340 1235792
$$ packed form
58794A6231595p68849q08562q26020q22802q03689p74722p39045o97517o52265
58785I338124o06551n61949n18530m77151m38905m03177l68892l36844l08337
58776E317788k82639k58343k36069k17182k00960j85819j72199j61386j52573
58767C450618j43866j35131j27175j19231j10223j01353r4451q8737q2124p4705
58757B373622o7995o1745n4706m7649m2468l8901l5172l1201k8302k6337k4105
58746A915041k1905k0898k0524j9348j7756j7103j6938j5907j4648j4976j6684
58735A718354j7902j8074j8059j7967j7388j6971j7465j8098j8112j8635k0641
58724A519042k2622k3009k3150k4972k7358k8088k7730k8066k8275k6432k3548
$$ plain form
58713 1235792 1213635 1191680 1170964 1152351 1134701 1117060 1100444 1085729 1071920 1058137 1045213
58702 1045213 1033741 1022738 1011824 1002466 995241 988122 979380 970128 962090 954916 947703 941104 935755
58689 935755 930421 923895 917125 911300 905353 897443 887596 876967 865805 854012 842536 832452 823701
58676 823701 816154 810652 807681 806285 805514 805565 806435 807118 807269 807899 809325 810357 810766 812421 816606 822246
58660 822246 828155 834747 841889 847368 849497 849391 848845 847843 845742 842911 839482 834629 828925 825396 826288
58645 826288 830734 837332 846826 860313 877025 896082 918403 944730 973802 1004623 1038507 1076569
58633 1076569 1117288 1159057 1203458 1253547 1310442 1373763 1443888 1521592 1607047 1701305 1807316
58622 1807316 1927575 2062318 2211619 2377278 2560875 2762017 2980274 3216282 3468543
$$ packed form
58713A235792k2157k1955k0716j8613j7650j7641j6616j4715j3809j3783j2924
58702A045213j1472j1003j0914r358p225p119q742r252q038p174p213o599n349
58689I35755n334o526o770n825n947p910r847j0629j1162j1793j1476j0084q751
58676H23701p547n502k971j396p71N1Q70O83J51O30J426J032M09J655M185N640
58660H22246N909O592P142N479K129j06n46j002k101k831l429m853n704l529Q92
58645H26288M446O598R494J3487J6712J9057K2321K6327K9072L0821L3884L8062
58633A076569M0719M1769M4401N0089N6895O3321P0125P7704Q5455R4258J06011
58622A807316J20259J34743J49301J65659J83597K01142K18257K36008K52261
$$ plain form
58613 3468543 3731215 3997072 4259978 4511938 4740311 4931309 5074811 5163900 5192799 5159221
58603 5159221 5067450 4926296 4745310 4535006 4307951 4075663 3845168 3620695 3406712 3206608
58593 3206608 3020553 2847829 2689590 2546564 2416151 2295193 2183903 2083885 1994027 1911779
58583 1911779 1837002 1771213 1714271 1664898 1623050 1588607 1559159 1532228 1508232 1488095 1469472
58572 1469472 1448698 1425163 1400440 1374506 1346371 1317193 1289217 1262520 1236038 1210733 1188344
58561 1188344 1168060 1147718 1127394 1108594 1090908 1072721 1054280 1036915 1020235 1003329 987631
58550 987631 975324 965867 957272 949694 944464 940758 936751 933042 931455 931327 930486 929009 928447 928066 925392
58535 925392 919978 913387 906118 897612 888462 879417 869141 856143 841870 828678 815943 801624 786352
$$ packed form
58613C468543K62672K65857K62906K51960K28373J90998J43502Q9089K8899l3578
58603E159221r1771j41154j80986k10304k27055k32288k30495k24473k13983k00104
58593C206608j86055j72724j58239j43026j30413j20958j11290j00018q9858q2248
58583A911779p4777o5789n6942m9373m1848l4443k9448k6931k3996k0137j8623
58572A469472k0774k3535k4723k5934k8135k9178k7976k6697k6482k5305k2389
58561A188344k0284k0342k0324j8800j7686j8187j8441j7365j6680j6906j5698
58550I87631j2307r457q595p578n230l706m007l709j587j28q41j477n62l81k674
58535I25392n414o591p269q506r150r045j0276j2998j4273j3192j2735j4319j5272
$$ plain form
58522 786352 772262 758952 744523 729709 716937 705995 694588 682701 672635 665128 658949 653778
58510 653778 650034 646613 642300 638614 637668 638164 637237 635290 635039 636677 638075 638979 640818 642968 643503 643247
58494 643247 644970 648881 652811 656334 660664 665020 667387 668570 671356 675876 679782 682691 686377 691038
58480 691038 695422 700352 707951 717602 726621 734519 742691 750618 756593 761416 766876 771245 770969 766301
58466 766301 760523 754169 745039 733611 723205 714636 705646 695764 686894 678996 670095 660732 653510 648018
58452 648018 641153 632690 625617 620719 615855 610786 607566 605766 602605 598360 596405 597230 597608 596463 596396
58437 596396 598612 601416 604559 609821 616377 620675 621996 623230 625377 626336 625930 626800 629347 631031 631773
58422 631773 634799 641074 648129 655378 665207 677644 689377 699348 709928 721347 730478 736488 742168
$$ packed form
58522G86352j4090j3310j4429j4814j2772j0942j1407j1887j0066p507o179n171
58510F53778l744l421m313l686r46M96r27j947k51J638J398R04J839K150N35k56
58494F43247J723L911L930L523M330M356K367J183K786M520L906K909L686M661
58480F91038M384M930P599R651R019P898Q172P927N975M823N460M369k76m668
58466G66301n778o354r130j1428j0406q569q990r882q870p898q901r363p222n492
58452F48018o865q463p073m898m864n069l220j800l161m245j955Q25L78j145o7
58437E96396K216K804L143N262O556M298J321J234K147R59m06Q70K547J684P42
58422F31773L026O275P055P249R829J2437J1733R971J0580J1419R131O010N680
$$ plain form
58409 742168 748204 751702 751926 751955 753016 752694 750339 748573 747738 744605 738541 733314 730751 728162 724049
58394 724049 720770 719396 717518 714319 712415 712476 711505 708534 706575 706852 706734 705500 706390 710631 715141 718636
58378 718636 724309 733927 744787 754936 765885 777759 787405 793818 800015 807234 812836 816096 820212
58365 820212 826344 831527 834686 838707 844413 848783 851324 855636 862386 867520 869866 873472 879778 884708
58351 884708 886558 889321 894850 899143 900104 901630 906068 909798 910457 911480 915289 918976 920982 925069 933313
58336 933313 941967 948560 956142 966315 975276 981219 988459 999629 1010986 1019975 1029941 1042628 1053714
58323 1053714 1060883 1068713 1080273 1091549 1099575 1108410 1121288 1134449 1144545 1154713 1167541 1179661
58311 1179661 1189169 1200594 1216453 1231654 1242416 1252747 1265914 1277861 1285833 1295094 1309911 1325984
$$ packed form
58409G42168O036L498K24K9J061l22k355j766q35l133o064n227k563k589m113
58394G24049l279j374j878l199j904O1r71k971j959K77j18j234Q90M241M510L495
58378G18636N673R618J0860J0149J0949J1874R646O413O197P219N602L260M116
58365H20212O132N183L159M021N706M370K541M312O750N134K346L606O306M930
58351H84708J850K763N529M293R61J526M438L730O59J023L809L687K006M087Q244
58336I33313Q654O593P582J0173Q961N943P240J1170J1357Q989R966J2687J1086
58323A053714P169P830J1560J1276Q026Q835J2878J3161J0096J0168J2828J2120
58311A179661R508J1425J5859J5201J0762J0331J3167J1947P972R261J4817J6073
$$ plain form
58299 1325984 1339144 1353312 1372326 1392100 1408719 1426287 1448779 1472038 1491839 1511912 1535903
58288 1535903 1559462 1578584 1597756 1621531 1646205 1668191 1692159 1722152 1753148 1780314 1808121
58277 1808121 1841312 1875707 1907164 1940511 1979936 2019732 2054577 2089711 2130730 2172735 2210112
58266 2210112 2247400 2289570 2331511 2368607 2407840 2456495 2509802 2561810 2618173 2685369 2757428
58255 2757428 2826558 2896862 2974202 3052956 3126687 3201504 3284754 3371162 3454491 3541695 3640582
58244 3640582 3745042 3848026 3957120 4080929 4212368 4342557 4478635 4630017 4790069
58235 4790069 4950099 5118137 5304290 5501261 5699879 5909606 6142095 6389256 6640511
58226 6640511 6906516 7201639 7518771 7847138 8198704 8589623 9012448 9455729 9933809
$$ packed form
58299A325984J3160J4168J9014J9774J6619J7568K2492K3259J9801K0073K3991
58288A535903K3559J9122J9172K3775K4674K1986K3968K9993L0996K7166K7807
58277A808121L3191L4395L1457L3347L9425L9796L4845L5134M1019M2005L7377
58266B210112L7288M2170M1941L7096L9233M8655N3307N2008N6363O7196P2059
58255B757428O9130P0304P7340P8754P3731P4817Q3250Q6408Q3329Q7204R8887
58244C640582J04460J02984J09094J23809J31439J30189J36078J51382J60052
58235D790069J60030J68038J86153J96971J98618K09727K32489K47161K51255
58226F640511K66005K95123L17132L28367L51566L90919M22825M43281M78080
$$ plain form
58217 9933809 10466495 11047544 11666432 12342481 13102114 13942275 14854844 15866984 17016462
58208 17016462 18309210 19746699 21373191 23247999 25396024 27839451 30652138 33924555
58200 33924555 37706639 42056200 47117384 53082533 60121528 68447551 78423428 90510435
58192 90510435 105168893 122935266 144520114 170634038 201747468 238139818 279772723
58185 279772723 325134896 369618102 405602221 425425111 425298976 406883132 375522226
58178 375522226 337235745 296849697 257649085 221603176 189617712 161888119 138283632
58171 138283632 118506455 102082661 88449771 77124721 67733626 59923992 53364807
58164 53364807 47829234 43182795 39288123 35997186 33226491 30953742 29136100 27705658
$$ packed form
58217I933809N32686N81049O18888O76049P59633Q40161R12569J012140J149478
58208A7016462J292748J437489J626492J874808K148025K443427K812687L272417
58200C3924555L782084M349561N061184N965149P038995Q326023R975877J2087007
58192I0510435J4658458J7766373K1584848K6113924L1113430L6392350M1632905
58185B79772723M5362173M4483206L5984119J9822890j26135j8415844l1360906
58178C75522226l8286481m0386048l9200612l6045909l1985464k7729593k3604487
58171A38283632j9777177j6423794j3632890j1325050r391095p809634o559185
58164E3364807n535573m646439l894672l290937k770695k272749j817642j430442
$$ plain form
58156 27705658 26646051 25996795 25775725 25973073 26631146 27848126 29684356 32149874 35300173
58147 35300173 39191484 43580544 47688940 50424620 50972023 49233176 45762816 41350688
58139 41350688 36653723 32086695 27882300 24158387 20946198 18218482 15928129 14026484
58131 14026484 12455945 11149881 10052381 9129231 8354497 7698593 7136865 6657237 6248472
58122 6248472 5890192 5564338 5267049 4998275 4748201 4505355 4270371 4049781 3842781
58113 3842781 3645703 3463083 3301966 3160128 3031177 2916355 2820026 2737985 2661133 2586354
58103 2586354 2513375 2436021 2348277 2255247 2167020 2085047 2004850 1928018 1860078 1799593 1740569
58092 1740569 1683319 1632549 1587132 1542023 1498024 1459672 1425744 1391670 1358998 1332475 1309852
$$ packed form
58156B7705658j059607o49256k21070J97348O58073J216980J836230K465518L150299
58147C5300173L891311M389060M108396K735680N47403j738847l470360m412128
58139D1350688m696965m567028m204395l723913l212189k727716k290353j901645
58131A4026484j570539j306064j097500r23150p74734o55904n61728m79628m08765
58122F248472l58280l25854k97289k68774k50074k42846k34984k20590k07000
58113C842781j97078j82620j61117j41838j28951j14822r6329q2041p6852p4779
58103B586354p2979p7354q7744r3030q8227q1973q0197p6832o7940o0485n9024
58092A740569n7250n0770m5417m5109m3999l8352l3928l4074l2672k6523k2623
$$ plain form
58081 1309852 1284487 1256245 1230108 1205891 1179193 1151083 1126986 1106900 1086105 1064642 1046965
58070 1046965 1033008 1018534 1003620 991983 982618 970760 956621 944838 935868 926118 915813 908403
58058 908403 902763 894279 883238 874004 866445 856403 844173 834217 826687 817497 806745 798789 793791
58045 793791 787381 779132 773328 770660 767034 761476 757567 756076 753623 749814 748505 750759 753312 755094
58031 755094 758505 763248 765596 764942 764587 765062 763208 758879 755934 755405 754054 750932 748903 748344 745747
58016 745747 740239 735324 732490 728994 723649 718913 715397 709949 701226 691970 683972 675782 666937 659418
58002 659418 653289 645809 636397 627834 621187 614198 605876 598036 591309 584442 578425 576302 577827 579310
57988 579310 579753 582042 587052 591998 595922 601354 608795 614836 617783 620213 624004 627585 630109 633694
$$ packed form
58081A309852k5365k8242k6137k4217k6698k8110k4097k0086k0795k1463j7677
58070A046965j3957j4474j4914j1637r365j1858j4139j1783q970r750j0305p410
58058I08403n640q484j1041r234p559j0042j2230r956p530r190j0752p956m998
58045G93791o410q249n804k668l626n558l909j491k453l809j309K254K553J782
58031G55094L411M743K348o54l55M75j854m329k945n29j351l122k029n59k597
58016G45747n508m915k834l496n345m736l516n448q723r256p998q190q845p519
58002F59418o129p480r412q563o647o989q322p840o727o867o017k123J525J483
57988E79310M43K289N010M946L924N432P441O041K947K430L791L581K524L585
$$ plain form
57974 633694 639342 644859 648739 652109 655205 656081 654375 652187 649824 644970 637429 630184 624207 616840
57960 616840 607034 597631 590515 583992 576871 570694 565790 559604 551305 543853 539100 534853 529239 524081
57946 524081 521411 520268 519423 519843 522025 524160 525209 526694 529425 531586 531935 531738 531731 530470 527469 524558
57930 524558 522269 518277 511306 503318 495935 488122 479287 471204 464832 458551 451615 446134 443577 442540
57916 442540 441913 442982 446373 450238 453551 458037 464758 471975 478479 485823 495114 504783 513619 522731
57902 522731 532375 540166 544858 548676 553498 557857 560201 561891 564289 565832 564822 562415 560179 557224
57888 557224 552311 546280 539990 532425 523244 514563 507838 501584 494549 488349 484428 481232 477110 473346
57874 473346 471476 470152 467627 465054 464341 464953 465639 467288 471229 476677 482483 489480 498420 507558 514918
$$ packed form
57974F33694N648N517L880L370L096Q76j706k188k363m854p541p245n977p367
57960F16840r806r403p116o523p121o177m904o186q299p452m753m247n614n158
57946E24081k670j143q45M20K182K135J049J485K731K161L49j97pj261l001k911
57930E24558k289l992o971p988p383p813q835q083o372o281o936n481k557j037
57916D42540o27J069L391L865L313M486O721P217O504P344R291R669Q836R112
57902E22731R644P791M692L818M822M359K344J690K398J543j010k407k236k955
57888E57224m913o031o290p565r181q681o725o254p035o200l921l196m122l764
57874D73346j870j324k525k573p13O12O86J649L941N448N806O997Q940R138P360
$$ plain form
57859 514918 521061 527126 532152 534933 536520 538231 539088 537905 535950 534820 533509 530365 526189 522644
57845 522644 519282 514911 510229 506338 502161 496158 489241 483385 478650 474067 469971 466878 463509 458604
57831 458604 453416 449848 447385 444285 440441 436570 431964 425617 418391 411627 404815 397044 389397 383389
57817 383389 378235 372132 365079 358103 351008 343381 336555 332024 329023 326067 323618 322756 322556 321456 320097
57802 320097 320132 321205 321720 321680 322278 323615 325302 328351 334021 341654 349971 359462 371143 384114 396734
57787 396734 408895 420567 429539 433641 434197 434322 434712 434053 432505 431412 430209 427042 422265 418099 414828
57772 414828 410393 403954 397112 391313 386545 382803 380439 378815 376796 374728 373923 374311 374662 374839 375650
57757 375650 376698 376727 376012 376164 377640 379533 381670 384732 388432 391835 395393 400515 407155 413922 420317
$$ packed form
57859E14918O143O065N026K781J587J711Q57j183j955j130j311l144m176l545
57845E22644l362m371m682l891m177o003o917n856m735m583m096l093l369m905
57831D58604n188l568k463l100l844l871m606o347p226o764o812p771p647o008
57817C83389n154o103p053o976p095p627o826m531l001k956k449q62k00j100j359
57802C20097L5J073N15m0N98J337J687L049N670P633Q317R491J1681J2971J2620
57787C96734J2161J1672Q972M102N56J25L90o59j548j093j203l167m777m166l271
57772D14828m435o439o842n799m768l742k364j624k019k068q05L88L51J77Q11
57757C75650J048K9p15J52J476J893K137L062L700L403L558N122O640O767O395
$$ plain form
57742 420317 426621 431845 434347 434703 435600 438587 442995 448170 454533 462035 469654 476960 484514 492528 500720
57727 500720 509433 519113 528761 536782 543267 549529 555473 559512 561085 561313 561183 561272 563296 569714 581286
57712 581286 596784 615265 636745 660615 685534 711343 739241 769824 802696 838209 877745
57701 877745 921984 970612 1023901 1082881 1147985 1219356 1298487 1387646 1487683 1598444 1721321
57690 1721321 1859151 2013475 2184149 2371956 2579149 2806662 3052633 3313881 3586398
57681 3586398 3863426 4134940 4389775 4616790 4804244 4941366 5022637 5049702 5029058 4970019
57671 4970019 4885273 4790246 4699397 4623361 4568708 4536033 4514845 4482047 4409957 4279305 4087377
57660 4087377 3847016 3579501 3306274 3043390 2800510 2582766 2392116 2227617 2086714
$$ packed form
57742D20317O304N224K502L56Q97K987M408N175O363P502P619P306P554Q014Q192
57727E00720Q713R680R648Q021O485O262N944M039J573K28j30Q9K024O418J1572
57712E81286J5498J8481K1480K3870K4919K5809K7898L0583L2872L5513L9536
57701H77745M4239M8628N3289N8980O5104P1371P9131Q9159J00037J10761J22877
57690A721321J37830J54324J70674J87807K07193K27513K45971K61248K72517
57681C586398K77028K71514K54835K27015J87454J37122Q1271K7065k0644n9039
57671D970019q4746r5027r0849p6036n4653l2675k1188l2798p2090j30652j91928
57660D087377k40361k67515k73227k62884k42880k17744j90650j64499j40903
$$ plain form
57651 2086714 1967373 1868340 1787558 1721916 1668914 1627221 1595432 1571875 1556033 1548529 1549203 1556715
57639 1556715 1570661 1592482 1623550 1663724 1712576 1770700 1839080 1918350 2009455 2113942 2232955
57628 2232955 2366835 2516102 2681626 2863314 3059660 3268773 3488338 3713756 3937258
57619 3937258 4149136 4338780 4494621 4605230 4662173 4661788 4604685 4495161 4341294 4153685
57609 4153685 3942762 3717550 3486489 3257397 3035854 2824918 2626873 2443960 2277090
57600 2277090 2125500 1988254 1864861 1754127 1654063 1563423 1481846 1408155 1340338 1277713
57590 1277713 1221265 1171110 1125492 1083098 1044488 1010197 979191 950371 923967 900303 878676
57579 878676 858662 841013 826013 812315 798669 785550 773917 763611 754186 746003 739322 733437
$$ packed form
57651B086714j19341r9033q0782o5642n3002m1693l1789k3557j5842p504O74P512
57639A556715J3946K1821L1068M0174M8852N8124O8380P9270R1105J04487J19013
57628B232955J33880J49267J65524J81688J96346K09113K19565K25418K23502
57619C937258K11878J89644J55841J10609N6943l85n7103j09524j53867j87609
57609D153685k10923k25212k31061k29092k21543k10936j98045j82913j66870
57600B277090j51590j37246j23393j10734j00064r0640q1577p3691o7817o2625
57590A277713n6448n0155m5618m2394l8610l4291l1006k8820k6404k3664k1627
57579H78676k0014j7649j5000j3698j3646j3119j1633j0306r425q183o681n885
$$ plain form
57567 733437 727934 723606 721033 719545 718799 720030 724301 730751 738054 746526 757226 769912 783465 797654
57553 797654 813048 829820 847994 868225 891069 916043 942623 971601 1004382 1041483 1082843
57542 1082843 1128979 1180693 1238137 1301284 1370907 1448300 1534467 1630324 1736919 1854693 1983253
57531 1983253 2122689 2274135 2437980 2612133 2792748 2975487 3154784 3322631 3469523
57522 3469523 3586495 3665974 3702170 3692513 3638714 3545714 3420109 3269980 3104693 2932935
57512 2932935 2760838 2592505 2431415 2280236 2140069 2011122 1893710 1787835 1692591 1607058
57502 1607058 1531108 1464423 1405610 1353383 1307857 1269472 1237427 1210363 1187932 1170420 1157518
57491 1157518 1148699 1144181 1144240 1148147 1155009 1165146 1179412 1197812 1220113 1247243 1280563 1320103 1365010
$$ packed form
57567G33437n503m328k573j488p46J231M271O450P303Q472J0700J2686J3553J4189
57553G97654J5394J6772J8174K0231K2844K4974K6580K8978L2781L7101M1360
57542A082843M6136N1714N7444O3147O9623P7393Q6167R5857J06595J17774J28560
57531A983253J39436J51446J63845J74153J80615J82739J79297J67847J46892
57522C469523J16972P9479L6196r657n3799r3000j25605j50129j65287j71758
57512B932935j72097j68333j61090j51179j40167j28947j17412j05875r5244q5533
57502A607058p5950o6685n8813n2227m5526l8385l2045k7064k2431j7512j2902
57491A157518q819m518N9L907O862J0137J4266J8400K2301K7130L3320L9540M4907
$$ plain form
57478 1365010 1415642 1473873 1541354 1618535 1705447 1802521 1910730 2031588 2166565 2315573
57468 2315573 2476295 2645508 2820176 2996073 3166016 3320767 3451439 3550231 3609972 3625111
57458 3625111 3593717 3517891 3402701 3255636 3086243 2904227 2717153 2530412 2348806 2176810
57448 2176810 2017292 1870998 1737474 1615903 1505453 1405724 1316757 1238047 1168047 1105318
57438 1105318 1049506 1000368 956647 916978 881160 849336 820638 793995 769659 748441 729864
57427 729864 712498 695818 680415 666618 654247 643404 634094 625324 615960 606349 597728 590210 582732
57414 582732 574955 567823 562179 558000 554994 552844 550920 548818 547020 546007 545107 543475 541807 541633 543191
57399 543191 545468 548106 551574 555505 558637 560722 562979 566300 570307 574453 578717 582944 586746 590337
$$ packed form
57478A365010N0632N8231O7481P7181Q6912R7074J08209J20858J34977J49008
57468B315573J60722J69213J74668J75897J69943J54751J30672R8792N9741J5139
57458C625111l1394p5826j15190j47065j69393j82016j87074j86741j81606j71996
57448B176810j59518j46294j33524j21571j10450r9729q8967p8710p0000o2729
57438A105318n5812m9138m3721l9669l5818l1824k8698k6643k4336k1218j8577
57427G29864j7366j6680j5403j3797j2371j0843r310q770r364r611q621p518p478
57414E82732p777p132n644m179l006k150j924k102j798j013r00j632j668j74J558
57399E43191K277K638L468L931L132K085K257L321M007M146M264M227L802L591
$$ plain form
57385 590337 594245 598038 600639 602132 603951 606920 610304 613161 615399 617219 618725 620520 623440 627197
57371 627197 630346 632111 633353 635334 638345 641877 645249 647848 649601 651443 654484 658557 662475 665746
57357 665746 669040 672976 677472 682437 688030 694091 700246 706613 713487 720515 727260 734283 742318 750630
57343 750630 757819 764177 771531 780578 790090 799053 807812 816639 824907 832397 839934 848022 856227 864459
57329 864459 873394 882998 892146 900385 908667 917634 926719 935682 945441 956375 967283 977097 986407 996274
57315 996274 1006812 1017914 1030040 1043127 1056008 1068134 1080684 1094772 1109669 1124137 1138431
57304 1138431 1153540 1169319 1184871 1200205 1216161 1233178 1251227 1270498 1291160 1312947 1335815
57293 1335815 1360402 1387017 1414935 1443575 1473452 1504944 1537091 1568879 1600976 1634830 1670638
$$ packed form
57385E90337L908L793K601J493J819K969L384K857K238J820J506J795K920L757
57371F27197L149J765J242J981L011L532L372K599J753J842L041M073L918L271
57357F65746L294L936M496M965N593O061O155O367O874P028O745P023Q035Q312
57343G50630P189O358P354R047R512Q963Q759Q827Q268P490P537Q088Q205Q232
57329H64459Q935R604R148Q239Q282Q967R085Q963R759J0934J0908R814R310R867
57315I96274J0538J1102J2126J3087J2881J2126J2550J4088J4897J4468J4294
57304A138431J5109J5779J5552J5334J5956J7017J8049J9271K0662K1787K2868
57293A335815K4587K6615K7918K8640K9877L1492L2147L1788L2097L3854L5808
$$ plain form
57282 1670638 1707468 1744878 1783008 1821388 1858927 1894950 1929159 1960730 1988432 2011477 2029457
57271 2029457 2041690 2047496 2046965 2040800 2029788 2015144 1998843 1982678 1967177 1952154 1937835 1924769
57259 1924769 1913188 1903376 1896175 1892194 1890893 1891330 1893408 1897547 1903570 1910914 1919642 1930374 1943435
57246 1943435 1958751 1976134 1994896 2013731 2031924 2050298 2070046 2091050 2112328 2133701 2155952
57235 2155952 2179579 2204383 2230119 2256663 2283684 2310975 2338862 2367499 2396116 2423787 2450638
57224 2450638 2477471 2504551 2531533 2558147 2584052 2608517 2631344 2653669 2676763 2700392 2723502
57213 2723502 2746209 2769750 2794607 2819968 2845208 2870750 2897292 2925168 2954686 2986134 3019149
57202 3019149 3052803 3086532 3120424 3154543 3188552 3221953 3254117 3284291 3312248 3338816 3365045
$$ packed form
57282A670638L6830L7410L8130L8380L7539L6023L4209L1571K7702K3045J7980
57271B029457J2233N806n31o165j1012j4644j6301j6165j5501j5023j4319j3066
57259A924769j1581r812p201l981j301M37K078M139O023P344Q728J0732J3061
57246A943435J5316J7383J8762J8835J8193J8374J9748K1004K1278K1373K2251
57235B155952K3627K4804K5736K6544K7021K7291K7887K8637K8617K7671K6851
57224B450638K6833K7080K6982K6614K5905K4465K2827K2325K3094K3629K3110
57213B723502K2707K3541K4857K5361K5240K5542K6542K7876K9518L1448L3015
57202C019149L3654L3729L3892L4119L4009L3401L2164L0174K7957K6568K6229
$$ plain form
57191 3365045 3391013 3416069 3439964 3462991 3485313 3507065 3528929 3551703 3575298 3598872 3621829
57180 3621829 3643997 3665129 3685009 3703916 3722260 3740034 3757280 3774629 3792576 3810738 3828777
57169 3828777 3847474 3867675 3888645 3908767 3927564 3945733 3963553 3980704 3997514 4014782 4032292
57158 4032292 4048907 4064263 4079003 4093195 4105934 4116845 4126629 4135770 4143930 4151023 4157657 4164018
57146 4164018 4169354 4173032 4175224 4176261 4176263 4175655 4175039 4174321 4172895 4170779 4168556 4166057 4162268 4156603 4148999
57131 4148999 4138605 4123773 4103683 4078706 4048942 4013895 3973953 3930761 3885622 3839052 3792359
57120 3792359 3748086 3708110 3672646 3641571 3614942 3591369 3567636 3541076 3510950 3476736 3437103
57109 3437103 3392190 3345476 3301837 3264852 3237059 3221121 3219012 3231461 3260064 3308900 3382791
$$ packed form
57191C365045K5968K5056K3895K3027K2322K1752K1864K2774K3595K3574K2957
57180C621829K2168K1132J9880J8907J8344J7774J7246J7349J7947J8162J8039
57169C828777J8697K0201K0970K0122J8797J8169J7820J7151J6810J7268J7510
57158D032292J6615J5356J4740J4192J2739J0911R784R141Q160P093O634O361
57146D164018N336L678K192J037Ko08o16p18j426k116k223k499l789n665p604
57131D148999j0394j4832k0090k4977k9764l5047l9942m3192m5139m6570m6693
57120C792359m4273l9976l5464l1075k6629k3573k3733k6560l0126l4214l9633
57109C437103m4913m6714m3639l6985k7793j5938k109J2449K8603M8836P3891
$$ plain form
57098 3382791 3485654 3622600 3802366 4035785 4333324 4706058 5166916 5727673 6395355
57089 6395355 7173223 8061972 9055022 10133545 11269546 12431191 13580920 14677838 15704243
57080 15704243 16701238 17762837 18966471 20291271 21601164 22708817 23461396 23784338
57072 23784338 23673741 23168391 22327041 21215815 19903193 18459665 16956269 15457620
57064 15457620 14013784 12658409 11412466 10287010 9283481 8395776 7614792 6931025
57056 6931025 6333877 5811549 5353316 4950993 4597668 4286400 4010856 3765873 3546428
57047 3546428 3347020 3162820 2990544 2827706 2672172 2523197 2381603 2247798 2120501
57038 2120501 1998324 1881442 1770571 1665312 1564973 1470229 1382409 1301647 1227130 1158638
$$ packed form
57098C382791J02863J36946J79766K33419K97539L72734M60858N60757O67682
57089F395355P77868Q88749R93050J078523J136001J161645J149729J096918J026405
57080A5704243R96995J061599J203634J324800J309893J107653P52579L22942
57072B3784338j10597n05350q41350j111226j312622j443528j503396j498649
57064A5457620j443836j355375j245943j125456j003529q87705p80984o83767
57056F931025n97148n22328m58233m02323l53325l11268k75544k44983k19445
57047C546428j99408j84200j72276j62838j55534j48975j41594j33805j27297
57038B120501j22177j16882j10871j05259j00339r4744q7820q0762p4517o8492
$$ plain form
57028 1158638 1096328 1039457 986980 939181 897040 859991 826006 794074 765012 739498 716912
57017 716912 696611 678892 663928 650972 639379 629472 621762 616164 612462 610649 610485 611780 615499
57004 615499 623415 636254 653497 675545 704655 743202 792839 856354 938335 1042593 1171397
56993 1171397 1329211 1522766 1749323 1981954 2171682 2271518 2262854 2161467 2002018 1818526
56983 1818526 1634905 1464793 1313754 1181295 1063829 957895 861502 773652 694009 623098
56973 623098 561778 509995 466633 430790 402565 382091 368397 359784 354988 353525 355351 360812
56961 360812 370524 384632 402384 423122 447381 476016 507930 539057 563704 576881 576265 563301
56949 563301 542627 519537 497315 476915 458595 442885 430022 419586 411222 405192 401979 401881 405192
$$ packed form
57028A158638o2310n6871n2477m7799m2141l7049l3985l1932k9062k5514k2586
57017G16912k0301j7719j4964j2956j1593r907p710n598l702j813j64J295L719
57004F15499P916J2839J7243K2048K9110L8547M9637O3515Q1981J04258J28804
56993A171397J57814J93555K26557K32631J89728R9836q664j01387j59449j83492
56983A818526j83621j70112j51039j32459j17466j05934r6393q7850p9643p0911
56973F23098o1320n1783m3362l5843k8225k0474j3694q613m796j463J826N461
56961C60812R712J4108J7752K0738K4259K8635L1914L1127K4647J3177o16j2964
56949E63301k0674k3090k2222k0400j8320j5710j2863j0436q364o030l213r8L311
$$ plain form
56936 405192 412250 423043 437239 454895 476850 504233 537440 574899 612061 642066 658670 659203
56924 659203 644805 618655 584891 548389 513440 481811 452910 426101 401906 380924 362917
56913 362917 347548 334916 324765 316100 308239 301502 296336 292489 289535 287395 285913 284703 283913 284339
56899 284339 286277 289022 291966 295384 299691 304842 311035 319124 329655 342325 357032 374645 396059
56886 396059 421132 449016 478496 507090 530714 545493 549836 544539 531735 514436 496065 479145
56874 479145 464499 452180 442599 436173 432704 431988 434616 441493 453119 470011 493178 523486 561076
56861 561076 606188 659945 723182 794049 866494 930542 974712 990635 977420 941598 892415
56850 892415 837475 782294 731343 687463 651112 621832 600187 587380 583820 589309 604013 628223
$$ packed form
56936D05192P058J0793J4196J7656K1955K7383L3207L7459L7162L0005J6604N33
56924F59203j4398k6150l3764l6502l4949l1629k8901k6809k4195k0982j8007
56913C62917j5369j2632j0151q665p861o737n166l847k954k140j482j210p90M26
56899B84339J938K745K944L418M307N151O193Q089J0531J2670J4707J7613K1414
56886C96059K5073K7884K9480K8594K3624J4779M343n297j2804j7299j8371j6920
56874D79145j4646j2319r581o426l469p16K628O877J1626J6892K3167L0308L7590
56861E61076M5112N3757O3237P0867P2445O4048M4170J5923j3215l5822m9183
56850H92415n4940n5181n0951m3880l6351k9280k1645j2807l560N489J4704K4210
$$ plain form
56838 628223 661959 706127 763283 835946 924618 1028197 1144241 1265674 1377252 1458634 1493865
56827 1493865 1479069 1422272 1337431 1238367 1135662 1036438 945537 866200 799683 745239 701643
56816 701643 668606 646366 634626 632876 641349 660768 691529 734030 789319 858183 938974 1025965
56804 1025965 1108689 1172911 1204893 1198077 1156510 1091179 1013222 930789 850000 775621 710165
56793 710165 654034 607056 569021 539117 516367 500779 492865 492167 497600 509186 528051 554635
56781 554635 588209 627851 671841 715345 750351 769239 768378 748634 713855 669381 620667 571915
56769 571915 525662 483313 445457 411859 382196 356867 336430 320376 307325 296329 287050 278846
56757 278846 270825 262901 255812 249995 245234 241353 238365 236027 234090 232800 232209 231395 229518 227298 226070
$$ packed form
56838F28223L3736M4168N7156P2663Q8672J03579J16044J21433J11578Q1382L5231
56827A493865j4796n6797q4841r9064j02705r9224r0901p9337o6517n4444m3596
56816G01643l3037k2240j1740j750Q473J9419L0761M2501N5289O8864Q0791Q6991
56804A025965Q2724O4222L1982o816m1567o5331p7957q2433q0789p4379o5456
56793G10165n6131m6978l8035k9904k2750j5588p914o98N433J1586J8865K6584
56781E54635L3574L9642M3990M3504L5006J8888q61j9744l4779m4474m8714m8752
56769E71915m6253m2349l7856l3598k9663k5329k0437j6054j3051j0996r279q204
56757B78846q021p924p089n817m761l881k988k338j937j290n91q14j877k220j228
$$ plain form
56742 226070 225609 224386 221907 219285 217326 215617 213766 212044 210351 207901 204497 200900 197530 193942
56728 193942 190065 186732 184476 182818 181277 179979 178812 177056 174534 172193 170928 170583 170623 170932 171378
56713 171378 171352 170380 168705 166855 165131 163686 162625 161812 161076 160638 160726 160948 160749 160269 159920 159405 158177
56696 158177 156696 156064 156473 157166 157884 159081 160714 162137 163310 164756 166147 166380 165458 164947 165998 168029
56680 168029 169855 171083 171893 172441 172996 173891 174930 175492 175383 174932 174321 173635 173314 173539 173427 172101 170283
56663 170283 169402 169383 168881 167622 166728 166602 166330 165447 164516 163543 161584 158518 155486 152939 149876 145713 141366
56646 141366 137804 134928 132539 130866 129471 127107 123404 119350 115603 111869 108478 106793 107255 108712
56632 108712 110462 113218 117164 120944 123796 126970 131724 137452 143154 149238 156370 163828 170508 176513
$$ packed form
56742B26070m61j223k479k622j959j709j851j722j693k450l404l597l370l588
56728A93942l877l333k256j658j541j298j167j756k522k341j265l45M0L09M46
56713A71378k6r72j675j850j724j445j061q13p36m38Q8K22j99m80l49n15j228
56696A58177j481o32M09O93P18J197J633J423J173J446J391K33r22n11J051K031
56680A68029J826J228Q10N48N55Q95J039N62j09m51o11o86l21K25j12j326j818
56663A70283q81j9n02j259q94j26k72q83r31r73j959l066l032k547l063m163m347
56646A41366l562k876k389j673j395k364l703m054l747l734l391j685M62J457
56632A08712J750K756L946L780K852L174M754N728N702O084P132P458O680O005
$$ plain form
56618 176513 182417 188024 193081 198092 203091 206675 207617 206593 205098 203570 201696 199625 197558 194989
56604 194989 191586 188119 185533 183842 182824 182834 183946 185239 185927 186324 186736 186435 184780 182430 180435 178984
56588 178984 177960 177676 178091 178305 177797 177174 176888 176407 175604 175627 177273 179684 181781 183775 186139 188431 190442
56571 190442 193203 197419 202090 206115 210079 214965 220267 225013 229595 234861 240311 244920 249064 253970
56557 253970 259838 265950 272083 278399 284469 289771 294689 299813 304764 308638 310959 311332 309222 305144
56543 305144 300988 297972 295303 291996 288619 285745 282083 276178 269007 262934 258661 254960 250867 246488
56529 246488 242114 238095 235225 233863 233106 231997 230940 230733 230980 230734 229845 228357 225510 220893 215824
56514 215824 212022 209470 206909 203726 200054 195883 191520 188120 186346 185270 183844 182477 181845 181381 180534
$$ packed form
56618A76513N904N607N057N011M999L584R42j024j495j528j874k071k067k569
56604A94989l403l467k586j691j018J0J112J293O88L97M12l01j655k350j995j451
56588A78984j024k84M15K14n08o23k86m81q03K3J646K411K097J994K364K292K011
56571A90442K761M216M671M025L964M886N302M746M582N266N450M609M144M906
56557B53970N868O112O133O316O070N302M918N124M951L874K321L73k110m078
56543C05144m156l016k669l307l377k874l662n905p171o073m273l701m093m379
56529B46488m374m019k870j362p57j109j057k07K47k46q89j488k847m617n069
56514B15824l802k552k561l183l672m171m363l400j774j076j426j367o32m64q47
$$ plain form
56499 180534 180335 181902 184408 186355 187820 189631 191326 191969 192130 193039 194546 195855 197387 199906 202604
56484 202604 204154 205017 206624 208975 211127 213362 216683 220690 224091 226801 229490 231733 232798 233666 235861
56469 235861 238749 240378 240675 241430 243386 245727 248256 251679 255686 259082 261907 265268 268957 271456 272400
56454 272400 272980 273695 273816 273290 273199 273972 274942 275912 277449 279492 281397 283416 286420 290030 292703 293836
56438 293836 294222 294473 294575 294946 296272 298230 299821 300853 301687 301918 300814 298706 296382 293631 289996 286282
56422 286282 283488 280921 277373 273542 271137 270113 268955 267166 265195 262402 257421 250173 241251 229901
56408 229901 215250 199233 185589 175955 169316 165059 163874 165638 169033 173497 179251 185417 190578
56395 190578 195158 200742 207064 212256 216086 220260 225348 230010 233508 236351 238283 238355 237360 237555 239576
$$ packed form
56499A80534j99J567K506J947J465J811J695O43J61R09J507J309J532K519K698
56484B02604J550Q63J607K351K152K235L321M007L401K710K689K243J065Q68K195
56469B35861K888J629K97P55J956K341K529L423M007L396K825L361L689K499R44
56454B72400N80P15J21n26r1P73R70R70J537K043J905K019L004L610K673J133
56438B93836L86K51J02L71J326J958J591J032Q34K31j104k108k324k751l635l714
56422B86282k794k567l548l831k405j024j158j789j971k793m981p248q922j1350
56408B29901j4651j6017j3644r634o639m257j185J764L395M464N754O166N161
56395A90578M580N584O322N192L830M174N088M662L498K843J932P2r95J95K021
$$ plain form
56380 239576 242105 244761 248619 253531 257714 260537 263099 265675 267212 267766 268733 270177 270682 270300 270826
56365 270826 272588 273839 273955 274355 275481 275835 274918 274322 274966 275964 277085 279456 282801 284954 285298 285922
56349 285922 288045 290094 290742 291165 292626 294261 295012 295684 297474 300246 303570 307721 312570 317225 321681
56334 321681 327031 333408 339724 346011 353703 362911 371756 379206 386365 394235 402501 411170 420912 431138
56320 431138 440215 448262 457108 466921 475635 482352 488299 493612 496401 496170 495034 494257 492627 489645 487226
56305 487226 486556 486083 484339 482193 480764 479698 478959 479637 481524 482574 482278 482883 485822 489733 493520 498500
56289 498500 505738 514076 522599 532399 544040 555948 567211 579446 594127 610567 628231 648365
56277 648365 671534 696211 721727 750060 782746 818520 855963 896120 940647 989695 1043417
$$ packed form
56380B39576K529K656L858M912M183K823K562K576J537N54R67J444N05l82N26
56365B70826J762J251J16M00J126L54r17n96O44R98J121K371L345K153L44O24
56349B85922K123K049O48M23J461J635P51O72J790K772L324M151M849M655M456
56334C21681N350O377O316O287P692R208Q845P450P159P870Q266Q669R742J0226
56320D31138R077Q047Q846R813Q714O717N947N313K789k31j136p77j630k982k419
56305D87226o70m73j744k146j429j066p39O78J887J050k96O05K939L911L787M980
56289D98500P238Q338Q523R800J1641J1908J1263J2235J4681J6440J7664K0134
56277F48365K3169K4677K5516K8333L2686L5774L7443M0157M4527M9048N3722
$$ plain form
56266 1043417 1103275 1170356 1244708 1327639 1421812 1527686 1642918 1766964 1903147 2054272
56256 2054272 2219304 2396280 2585140 2785234 2992997 3204564 3417932 3630089 3834751
56247 3834751 4025367 4197861 4348421 4471594 4563350 4623583 4653370 4652447 4621800 4566126 4491202
56236 4491202 4401055 4299523 4191659 4081180 3969021 3856417 3746534 3641002 3537878 3435171
56226 3435171 3333262 3231704 3127274 3018015 2906006 2793437 2679169 2561931 2443615
56217 2443615 2326394 2209684 2093000 1978742 1869158 1763536 1661375 1565210 1477217 1396115
56207 1396115 1320460 1251769 1191215 1136435 1084978 1037832 996292 958640 923320 892086 866310
56196 866310 843349 820281 798177 779037 761676 744531 729403 718375 709896 701782 695201 691800
$$ packed form
56266A043417N9858O7081P4352Q2931R4173J05874J15232J24046J36183J51125
56256B054272J65032J76976J88860K00094K07763K11567K13368K12157K04662
56247C834751J90616J72494J50560J23173R1756O0233K9787r23l0647n5674p4924
56236D491202r0147j01532j07864j10479j12159j12604j09883j05532j03124j02707
56226C435171j01909j01558j04430j09259j12009j12569j14268j17238j18316
56217B443615j17221j16710j16684j14258j09584j05622j02161r6165q7993q1102
56207A396115p5655o8691o0554n4780n1457m7146m1540l7652l5320l1234k5776
56196H66310k2961k3068k2104j9140j7361j7145j5128j1028q479q114o581l401
$$ plain form
56184 691800 689878 687360 685621 686440 688219 689226 691508 697395 705154 712271 719904 729817 740132 748608
56170 748608 756890 766876 776073 781436 784673 788741 792127 791903 789571 788405 787518 784022 778820 774935 772199
56155 772199 768770 765823 765688 767390 768908 771634 777752 785630 792848 801376 814615 831751 850282 871692
56141 871692 899316 932926 970898 1015450 1070343 1135611 1209776 1294741 1392870 1501565 1616119
56130 1616119 1735262 1858088 1978231 2087416 2182940 2266258 2337196 2395991 2448254 2500585
56120 2500585 2552375 2597714 2633218 2658030 2668947 2663064 2644012 2618998 2590772 2557931 2520517
56109 2520517 2478502 2426819 2359156 2275843 2182360 2082259 1977843 1875151 1780910 1695926 1617735
56098 1617735 1547556 1488020 1436624 1388740 1344932 1308182 1276338 1244837 1214699 1190157 1170468
$$ packed form
56184F91800j922k518j739Q19J779J007K282N887P759P117P633R913J0315Q476
56170G48608Q282R986R197N363L237M068L386k24k332j166q87l496n202l885k736
56155G72199l429k947j35J702J518K726O118P878P218Q528J3239J7136J8531K1410
56141H71692K7624L3610L7972M4552N4893O5268P4165Q4965R8129J08695J14554
56130A616119J19143J22826J20143J09185R5524Q3318P0938N8795N2263N2331
56120B500585N1790M5339L5504K4812J0917n883j9052k5014k8226l2841l7414
56109B520517m2015n1683o7663q3313r3483j00101j04416j02692r4241q4984p8191
56098A617735p0179n9536n1396m7884m3808l6750l1844l1501l0138k4542j9689
$$ plain form
56087 1170468 1151704 1134391 1121557 1111408 1099981 1088781 1081786 1077302 1071163 1065420 1064978 1067984 1068805
56074 1068805 1068417 1072356 1080278 1087170 1093252 1102893 1115146 1125181 1133842 1145981 1160538 1172127 1181247
56061 1181247 1193080 1207491 1220260 1232843 1250419 1271417 1289457 1304613 1322225 1341964 1359051
56050 1359051 1375020 1395810 1420159 1441386 1459820 1481844 1507559 1531398 1554093 1581645 1612941
56039 1612941 1640962 1665966 1694930 1728284 1759856 1789545 1823060 1859574 1892951 1924830 1962900
56028 1962900 2006647 2048726 2089741 2137089 2189730 2239434 2286896 2340926 2401715 2461033 2519086
56017 2519086 2584333 2656095 2724605 2789179 2858827 2933871 3005073 3072319 3145720 3226643 3306494
56006 3306494 3385882 3475468 3575959 3677277 3779442 3893505 4019737 4146579 4273728 4413810
$$ packed form
56087A170468j8764j7313j2834j0149j1427j1200o995m484o139n743m42L006Q21
56074A068805l88L939P922O892O082R641J2253J0035Q661J2139J4557J1589R120
56061A181247J1833J4411J2769J2583J7576K0998J8040J5156J7612J9739J7087
56050A359051J5969K0790K4349K1227J8434K2024K5715K3839K2695K7552L1296
56039A612941K8021K5004K8964L3354L1572K9689L3515L6514L3377L1879L8070
56028A962900M3747M2079M1015M7348N2641M9704M7462N4030O0789N9318N8053
56017B519086O5247P1762O8510O4574O9648P5044P1202O7246P3401Q0923P9851
56006C306494P9388Q9586J00491J01318J02165J14063J26232J26842J27149J40082
$$ plain form
55996 4413810 4568369 4725535 4884691 5059115 5250339 5445026 5641701 5854727 6087044
55987 6087044 6325738 6569897 6835155 7125087 7427013 7742106 8089476 8473973 8881489
55978 8881489 9312954 9789834 10318888 10886935 11498520 12181431 12946472 13781970 14697835
55969 14697835 15732608 16906891 18216269 19682564 21363349 23298860 25504074 28027479
55961 28027479 30958740 34364487 38286430 42825581 48159290 54461838 61903449 70762871
55953 70762871 81451501 94406543 110084690 129087582 152115861 179715268 212203417
55946 212203417 249717901 291564027 334682966 372846557 398413887 406017423 395195302
55939 395195302 369884282 335760686 297912025 260009424 224393405 192305775 164173930
$$ packed form
55996D413810J54559J57166J59156J74424J91224J94687J96675K13026K32317
55987F087044K38694K44159K65258K89932L01926L15093L47370L84497M07516
55978H881489M31465M76880N29054N68047O11585O82911P65041Q35498R15865
55969A4697835J034773J174283J309378J466295J680785J935511K205214K523405
55961B8027479K931261L405747L921943M539151N333709O302548P441611Q859422
55953G0762871J0688630J2955042J5678147J9002892K3028279K7599407L2488149
55946B12203417L7514484M1846126M3118939L8163591K5567330P603536j0822121
55939C95195302k5311020l4123596l7848661l7902601l5616019l2087630k8131845
$$ plain form
55932 164173930 139983436 119522506 102414514 88154230 76253762 66330304 58051576
55925 58051576 51093154 45193330 40182202 35918765 32251406 29062779 26294399 23895334
55917 23895334 21790888 19922812 18272917 16821943 15524850 14347216 13287022 12339617
55909 12339617 11476391 10676963 9948627 9295135 8696962 8139320 7629792 7171556 6747211
55900 6747211 6345161 5975447 5644188 5337612 5045935 4778560 4541173 4321100 4109376
55891 4109376 3914981 3743505 3583157 3425462 3279345 3151451 3032045 2913314 2802810
55882 2802810 2706017 2613612 2518550 2428636 2350070 2275041 2197368 2124332 2061415 2000937 1937304
55871 1937304 1878472 1830891 1787491 1741768 1699700 1666438 1634553 1596714 1557600 1522672 1487251
$$ packed form
55932A64173930k4190494k0460930j7107992j4260284j1900468r923458q278728
55925E8051576o958422n899824n011128m263437l667359l188627k768380k399065
55917B3895334k104446j868076j649895j450974j297093j177634j060194r47405
55909A2339617q63226p99428p28336o53492n98173n57642n09528m58236m24345
55900F747211m02050l69714l31259l06576k91677k67375k37387k20073k11724
55891D109376j94395j71476j60348j57695j46117j27894j19406j18731j10504
55882B802810r6793r2405r5062q9914p8566p5029p7673p3036o2917o0478o3633
55871A937304n8832m7581m3400m5723m2068l3262l1885l7839l9114l4928l5421
$$ plain form
55860 1487251 1447147 1408514 1377097 1348659 1319411 1294841 1279086 1266612 1253475 1245955 1249004 1256654
55848 1256654 1262374 1268117 1274388 1272544 1256664 1233259 1210074 1184930 1154402 1123514 1097274 1071619
55836 1071619 1042047 1012653 987840 963591 935785 908866 887529 867811 845070 823028 806311
55825 806311 791570 774418 757843 745420 733321 717386 701267 689399 678586 664610 650739
55814 650739 641690 635339 628063 622180 620581 620109 617740 617240 622232 628649 631491 633116 637401 641564 641483
55799 641483 639539 639471 638599 632668 623437 614169 602599 585740 566991 551202 537127 521617 506658
55786 506658 495257 484823 471824 458867 450256 444463 437729 431204 427882 426293 423738 421982 423194
55773 423194 423862 419150 409988 399934 388715 374919 361316 351126 342300 331539 320725 313499 308787
$$ packed form
55860A487251m0104l8633l1417k8438k9248k4570j5755j2474j3137p520L049P650
55848A256654N720N743O271j844j5880k3405k3185k5144l0528l0888k6240k5655
55836A071619k9572k9394k4813k4249k7806k6919k1337j9718k2741k2042j6717
55825H06311j4741j7152j6575j2423j2099j5935j6119j1868j0813j3976j3871
55814F50739r049o351p276n883j599m72k369n00M992O417K842J625M285M163q1
55799F41483j944o8q72n931r231r268j1570j6859j8749j5789j4075j5510j4959
55786E06658j1401j0434j2999j2957q611n793o734o525l322j589k555j756J212
55773D23194O68m712r162j0054j1219j3796j3603j0190q826j0761j0814p226m712
$$ plain form
55760 308787 303469 298106 294377 290236 283406 276359 272231 269213 264571 260610 260656 262495 261854 259331 257974
55745 257974 257053 254112 250363 248194 246013 241212 235542 232067 229597 225543 221450 220124 220140 218767 217546
55730 217546 219293 222259 222956 222145 222426 222453 219315 214293 210558 207441 202508 197028 193701 191176 186471
55715 186471 180815 177532 176064 173641 171043 171234 173928 176745 180041 185531 191931 197086 202533 210819
55701 210819 220147 226833 231193 235823 239951 240892 239475 238733 238705 237605 236452 237334 238695 237509 234636
55686 234636 232949 231863 228984 225540 224661 225623 225243 223837 224517 227601 230879 234253 238982 243435 244856
55671 244856 244409 245424 247622 248172 247280 247511 248599 248272 247367 248788 252118 254535 256271 259760 264050 265684
55655 265684 264837 264989 266577 266422 263677 261053 259645 257481 253679 249445 244549 237317 228428 220404 213115
$$ packed form
55760C08787n318n363l729m141o830p047m128l018m642l961M6J839o41k523j357
55745B57974r21k941l749k169k181m801n670l475k470m054m093j326J6j373j221
55730B17546J747K966O97q11K81K7l138n022l735l117m933n480l327k525m705
55715A86471n656l283j468k423k598J91K694K817L296N490O400N155N447Q286
55701B10819R328O686M360M630M128R41j417p42k8j100j153Q82J361j186k873
55686B34636j687j086k879l444q79R62l80j406O80L084L278L374M729M453J421
55671B44856m47J015K198N50q92K31J088l27r05J421L330K417J736L489M290J634
55655B65684q47J52J588j55k745k624j408k164l802m234m896p232q889q024p289
$$ plain form
55640 213115 204140 193658 184534 177414 170121 162132 155281 149774 143854 137769 133795 131958 129789 126598
55626 126598 123991 121960 118653 114239 110923 108825 105980 102635 101342 102378 103153 102642 102405 102818 102285
55611 102285 100738 99951 99893 98584 96048 94555 94442 93520 91147 89111 87933 86041 83253 81418 81030 80661
55595 80661 80131 80672 81654 80912 78723 77734 78532 79048 78765 79553 81777 83421 83850 84649 86007 86070 84662 83944
55577 83944 84520 84592 83770 83947 85450 86106 85274 85179 87005 89135 90495 92241 94871 96908 97811 99119 101455
55560 101455 103291 103821 104160 104713 104250 102497 100804 99418 97070 94010 92347 92505 92438 91249 90499 91023
55544 91023 91600 91788 92939 95285 97035 97546 98533 101051 104035 106765 109921 113283 115319 115967 116965 118623
55528 118623 119313 118968 119774 122288 124082 123514 121798 120038 117334 113268 109301 106095 102189 96766 91148
$$ packed form
55640B13115q975j0482r124p120p293p989o851n507n920o085l974j837k169l191
55626A26598k607k031l307m414l316k098k845l345j293J036P75n11k37M13n33
55611A02285j547p87n8j309k536j493j13r22k373k036j178j892k788j835l88l69
55595H0661n30N41R82p42k189r89P98N16k83P88K224J644M29P99J358O3j408p18
55577H3944N76P2q22J77J503O56q32r5J826K130J360J746K630K037R03J308K336
55560A01455J836N30L39N53m63j753j693j386k348l060j663J58o7j189p50N24
55544I1023N77J88J151K346J750N11R87K518K984K730L156L362K036O48R98J658
55528A18623O90l45Q06K514J794n68j716j760k704m066l967l206l906n423n618
$$ plain form
55513 91148 86240 81157 75720 71560 69345 67496 65100 63541 63802 64628 64780 64774 65061 64817 63840 63380 63936
55496 63936 64382 64298 64843 66435 67909 68869 70321 72099 72352 70563 68345 66237 62512 56330 49176 41839
55480 41839 32777 20982 7866 -5126 -18155 -30774 -40775 -46905 -50395 -52361 -52136 -49639 -46820 -45049
55466 -45049 -43288 -40394 -37031 -33885 -30324 -26310 -23398 -22221 -21086 -18489 -15014 -11559 -8010 -4885
55452 -4885 -3839 -4965 -5885 -4985 -3385 -2386 -1404 105 1088 919 876 1967 3312 4052 4763 5675 5734 4799
55434 4799 4447 5236 5530 4490 3780 4739 6291 7289 8486 10431 11845 11968 12276 13956 15821 16592 17109
55417 17109 18354 19370 19111 18415 18256 17880 16519 15126 14661 14528 14338 15253 17853 20638 22386 24024
55401 24024 26377 28077 27634 25787 23977 22308 20714 20199 21037 21535 20390 18549 17117 15410 12849
$$ packed form
55513I1148m908n083n437m160k215j849k396j559K61Q26J52oK87k44r77m60N56
55496F3936M46q4N45J592J474R60J452J778K53j789k218k108l725o182p154p337
55480D1839r062j1795G866e126j3029j2619j0001o130l490j966K25K497K819J771
55466d5049J761K894L363L146L561M014K912J177J135K597L475L455L549L125
55452d885J046j126r20R00J600R99R82A05R83j69m3J091J345P40P11R12N9r35
55434D799l52P89K94j040p10R59J552R98J197J945J414J23L08J680J865P71N17
55417A7109J245J016k59o96j59l76j361j393m65j33j90R15K600K785J748J638
55401B4024K353J700m43j847j810j669j594n15Q38M98j145j841j432j707k561
$$ plain form
55386 12849 10759 10342 10665 10523 10432 11019 11373 10895 10856 12171 13487 13447 13018 13591 14589 14898 14869 14894 13868
55367 13868 11161 8360 7059 6576 5840 5640 6980 9006 10638 12456 14857 16249 15406 13886 13776 14665
55351 14665 15159 15755 17784 20843 23562 25637 27072 26898 24786 22421 21230 20279 18419 16726 16590 17131
55335 17131 16904 16492 16997 17623 17309 17169 18636 20570 20899 19875 19161 18904 18239 17508 17438 17257 16018 14619
55317 14619 14201 13901 12653 11730 12784 14704 15248 14637 14700 15516 15838 15854 16594 17351 16599 14923 14283 14909
55299 14909 15484 15764 16461 17088 16539 15281 14587 14215 13246 12461 13327 15331 16869 18033 19933 21972 22598
55282 22598 22151 22192 22544 21815 20362 19776 19742 18447 16025 14730 15512 17083 18488 19982 21213 21108 19934
55265 19934 19185 19187 18947 18428 18638 19339 19015 17393 15826 14935 13929 12569 11748 11761 11857 11757 11947 12384 12531
$$ packed form
55386A2849k090m17L23j42r1N87L54m78l9J315J316m0m29N73R98L09k9K5j026
55367A3868k707k801j301m83p36k00J340K026J632J818K401J392q43j520j10Q89
55351A4665M94N96K029L059K719K075J435j74k112k365j191r51j860j693j36N41
55335A7131k27m12N05O26l14j40J467J934L29j024p14k57o65p31p0j81j239j399
55317A4619m18l00j248r23J054J920N44o11O3Q16L22J6P40P57p52j676o40O26
55299A4909N75K80O97O27n49j258o94l72r69p85Q66K004J538J164J900K039O26
55282B2598m47M1L52p29j453n86l4j295k422j295P82J571J405J494J231j05j174
55265A9934p49Kk40n19K10P01l24j622j567q91j006j360q21J3R6j00J90M37J47
$$ plain form
55246 12531 12622 13257 14002 14086 14127 15210 16707 17079 16509 16530 17287 17530 17220 17794 19642 21464 22353 22569 22166
55227 22166 20882 19493 19301 20058 20259 19564 19153 19616 20309 20773 21091 20953 20175 19878 21264 23496 24749
55210 24749 25013 25761 27202 28194 28630 29469 30507 30572 29994 30373 31711 32269 31562 31005 31160 30842 29528 28344
55192 28344 27877 27228 26005 25266 25624 26229 26347 26241 25922 24736 22792 21228 20550 20191 19973 20309 20835 20612
55174 20612 19960 20228 21446 22114 21598 20812 20218 19202 17917 17736 19197 21283 23268 25449 27570 28476
55158 28476 27963 27216 26772 25833 24208 23091 23127 23389 23028 22433 22020 21421 20571 20195 20519 20775 20506 20187 20174
55139 20174 20308 20713 21631 22403 22090 21165 20994 21686 22161 22291 22980 24086 24375 23808 23717 24368 24518 23910 23994
55120 23994 25506 27374 28672 29648 30231 29641 28319 28100 29550 31062 31515 31869 33156 34804 36025 37066
$$ packed form
55246A2531R1O35P45Q4M1J083J497L72n70K1P57K43l10N74J848J822Q89K16m03
55227B2166j284j389j92P57K01o95m11M63O93M64L18j38p78k97J386K232J253
55210B4749K64P48J441R92M36Q39J038O5n78L79J338N58p07n57J55l18j314j184
55192B8344m67o49j223p39L58O05J18j06l19j186j944j564o78l59k18L36N26k23
55174B0612o52K68J218O68n16p86n94j016j285j81J461K086J985K181K121R06
55158B8476n13p47m44r39j625j117L6K62l61n95m13n99q50l76L24K56k69l19j3
55139B0174J34M05R18P72l13r25j71O92M75J30O89J106K89n67r1O51J50o08Q4
55120B3994J512J868J298R76N83n90j322k19J450J512M53L54J287J648J221J041
$$ plain form
55104 37066 38028 38112 37146 36266 36156 36191 36203 37297 39858 42458 43900 44798 46001 47017 47227 47241 47830 48674
55086 48674 49270 49961 51137 52490 53827 55458 57177 58125 58256 58543 59195 59180 58154 57229 57139 57222 56935 56739
55068 56739 56724 56086 54788 54065 54344 54300 52920 50903 49135 47471 45966 45586 46646 48114 49398 51067
55052 51067 52922 53390 52102 51083 51847 53073 52803 51312 50092 49438 48842 48558 49015 49616 49613 49321 49214 48831
55034 48831 47806 46874 46663 46573 46066 45829 46407 46883 46336 45522 45676 46655 47603 48536 49961 51768 53624 55583
55016 55583 57318 57865 57207 56864 57753 58705 58371 57264 56505 55797 54323 52599 51735 51641 51481 51212 51264 51373
54998 51373 51088 50763 50866 51020 50834 50843 51497 52120 52158 52462 53992 56045 57208 57303 57147 57096 57120 57604 58757 59837
54978 59837 60153 60171 60600 61131 61145 60841 60595 60205 59919 61054 64199 67794 70024 71230 72950 75493 78185
$$ packed form
55104C7066R62Q4r66q80j10L5J2J094K561K600J442Q98J203J016K10J4N89Q44
55086D8674N96O91J176J353J337J631J719R48J31K87O52j5j026r25r0Q3k87j96
55068E6739j5o38j298p23K79m4j380k017j768j664j505l80J060J468J284J669
55052E1067J855M68j288j019P64J226k70j491j220o54n96k84M57O01lk92j07l83
55034D8831j025r32k11r0n07k37N78M76n47q14J54R79R48R33J425J807J856J959
55016E5583J735N47o58l43Q89R52l34j107p59p08j474j724q64r4j60k69N2J09
54998E1373k85l25J03J54j86RO54O23L8L04J530K053J163R5j56n1K4M84J153J080
54978E9837L16J8M29N31J4l04k46l90k86J135L145L595K230J206J720K543K692
$$ plain form
54961 78185 81220 85392 90449 95445 100475 106465 113469 120689 128094 136657 147008 158981 172369 187045
54947 187045 202410 217604 232042 244979 254946 260596 261772 258948 252109 241114 226783 210754
54935 210754 194511 179084 165074 152310 140098 128466 118426 110460 103772 97720 92900 89919
54923 89919 88275 87465 87988 89990 92083 92958 93225 94258 96220 98715 102380 108081 115180 122362 129715
54908 129715 138456 149027 160977 174330 189435 205596 221121 234566 244911 251041 252331 249432
54896 249432 243351 234184 221811 207179 191664 175707 159452 144167 131556 121873 114007 107176
54884 107176 101405 96709 92963 90291 88552 86905 84830 83028 82268 82051 81534 80966 80889 80711 79536 77744
54868 77744 76280 74955 73045 70950 69606 68657 66928 64429 62287 60862 59491 57981 56936 56630 56790
$$ packed form
54961G8185L035M172N057M996N030N990P004P220P405Q563J0351J1973J3388J4676
54947A87045J5365J5194J4438J2937R967N650J176k824o839j0995j4331j6029
54935B10754j6243j5427j4010j2764j2212j1632j0040p966o688o052m820k981
54923H9919j644q10N23K002K093Q75K67J033J962K495L665N701P099P182P353
54908A29715Q741J0571J1950J3353J5105J6161J5525J3445J0345O130J290k899
54896B49432o081r167j2373j4632j5515j5957j6255j5285j2611r683p866o831
54884A07176n771m696l746k672j739j647k075j802p60k17n17n68p7j78j175j792
54868G7744j464j325j910k095j344r49j729k499k142j425j371j510j045l06J60
$$ plain form
54853 56790 57309 57975 57880 56408 54391 52952 51714 49676 47371 46358 46786 47279 47203 47347 48243 49402 50375
54836 50375 51204 51653 51337 50683 50536 50827 50880 50860 51531 52701 53475 54002 55344 57488 59160 59892 60723 62345
54818 62345 64055 65113 65893 67028 68411 69658 70778 71967 73372 75246 77720 80438 83174 86589 91432
54803 91432 97191 102674 107862 114007 121829 130760 140196 150467 162292 176082 191883 209167 226611
54790 226611 242726 256678 267881 275274 277966 276257 271041 262599 251062 237598 223829 210329
54778 210329 196993 184512 173979 165202 156975 149133 142851 138719 135880 133359 131032 129046 127414
54765 127414 126467 126731 128192 130518 133878 138547 143943 149243 154760 161526 169768 179133 190182 204101
54751 204101 220954 239749 260067 281901 303763 322804 337239 347103 352239 351424 344225 332210
$$ packed form
54853E6790N19O66r5j472k017j439j238k038k305j013M28M93p6J44Q96J159R73
54836E0375Q29M49l16o54j47K91N3k0O71J170P74N27J342K144J672P32Q31J622
54818F2345J710J058P80J135J383J247J120J189J405J874K474K718K736L415M843
54803I1432N759N483N188O145P822Q931R436J0271J1825J3790J5801J7284J7444
54790B26611J6115J3952J1203P393K692j709n216q442j1537j3464j3769j3500
54778B10329j3336j2481j0533q777q227p842o282m132k839k521k327j986j632
54765A27414r47K64J461K326L360M669N396N300N517O766Q242R365J1049J3919
54751B04101J6853J8795K0318K1834K1862J9041J4435R864N136q15p199j2015
$$ plain form
54739 332210 317395 300695 282603 264127 246143 228782 212195 197055 183699 171640 160477
54728 160477 150460 141758 134115 127660 123027 120051 117325 113754 109797 106544 104285 102588 101138 99867
54714 99867 98683 97558 96645 96079 96017 96806 98537 100414 101251 100661 99178 97343 95444 94059 93896 94952
54698 94952 96532 98160 99761 101031 101474 101142 100579 100101 99796 99972 100712 101230 100688 99491 98839 99180 100105
54681 100105 101440 103201 104676 104947 104369 104283 105214 106528 107807 109286 110911 112259 113598 115744 118740
54666 118740 121867 125121 129474 135424 142335 149293 155574 160394 163463 165802 168741 172153 174938 177073
54652 177073 179599 182635 185152 186901 188910 191719 194759 197827 201662 206676 212621 219832 229200 240457
54638 240457 252135 263647 275717 288165 298998 306516 310705 311790 309005 301877 291356 278700
$$ packed form
54739C32210j4815j6700j8092j8476j7984j7361j6587j5140j3356j2059j1163
54728A60477j0017q702p643o455m633k976k726l571l957l253k259j697j450j271
54714I9867j184j125r13n66o2P89J731J877Q37n90j483j835j899j385j63J056
54698I4952J580J628J601J270M43l32n63m78l05J76P40N18n42j197o52L41R25
54681A00105J335J761J475K71n78q6R31J314J279J479J625J348J339K146K996
54666A18740L127L254M353N950O911O958O281M820L069K339K939L412K785K135
54652A77073K526L036K517J749K009K809L040L068L835N014N945P211R368J1257
54638B40457J1678J1512J2070J2448J0833P518M189J085k785p128j0521j2656
$$ plain form
54626 278700 264360 248825 233364 219029 205911 194009 183761 175124 167331 160231 154612 150636
54614 150636 147340 144300 142361 141944 142055 141928 142226 143648 145613 147331 148956 150664 151828 152192 152614 153519
54598 153519 153751 152201 149539 147075 144776 141686 137580 132993 128166 123032 117821 112861 108155 103736
54584 103736 99858 96412 92945 89667 87476 86497 85653 84233 82732 81544 80094 78042 76099 74804 73706
54569 73706 72641 72528 73775 75068 74923 73510 71894 70498 69381 68994 69397 69621 68968 68207 68442 69573
54553 69573 70872 72192 73575 74543 74845 75115 75778 76221 76061 76249 77724 79926 81826 83583 85853 88312
54537 88312 90266 92064 94560 97761 101266 105458 110950 117322 123667 129916 136446 142835 148187 152244
54523 152244 155040 155937 154282 150726 146729 142909 138861 134328 129572 124767 119913 115146 110455 105447
$$ packed form
54626B78700j4340j5535j5461j4335j3118j1902j0248q637p793p100n619l976
54614A50636l296l040j939m17J11j27K98J422J965J718J625J708J164L64M22R05
54598A53519K32j550k662k464k299l090m106m587m827n134n211m960m706m419
54584A03736l878l446l467l278k191r79q44j420j501j188j450k052j943j295j098
54569G3706j065j13J247J293j45j413j616j396j117l87M03K24o53p61K35J131
54553F9573J299J320J383R68L02K70O63M43j60J88J475K202J900J757K270K459
54537H8312J954J798K496L201L505M192N492O372O345O249O530O389N352M057
54523A52244K796Q97j655l556l997l820m048m533m756m805m854m767m691n008
$$ plain form
54509 105447 100062 95072 91209 88308 85927 84148 83026 82044 80933 80288 80465 80573 79542 77606 75809
54494 75809 74748 74605 75593 77319 78522 78528 78340 79218 80954 82541 83760 84908 85800 86356 87444 89743 92387
54477 92387 94111 95118 96371 97641 97904 97336 97271 98282 99736 101200 102904 104736 106033 106595 106899 107208
54461 107208 107284 106952 106208 104921 103181 101643 100711 99720 97783 95138 92804 91248 90202 89436 88852 88178
54445 88178 87317 86590 85947 84650 82493 80580 79934 80055 79880 79335 78821 78073 76892 76234 77060 78682 79706
54428 79706 80026 80463 80973 80892 80473 80581 81155 81570 82184 83806 85905 87053 87110 87305 88210 89309 90573 92685
54410 92685 95462 97760 99325 101214 103946 106607 108381 109756 111676 114521 118254 122587 126708 129821
54396 129821 132283 135341 139583 144471 149343 153859 157481 159755 161257 163108 165335 166744 166570 165199
$$ packed form
54509A05447n385m990l863k901k381j779j122r82j111o45J77J08j031j936j797
54494G5809j061j43R88J726J203Oj88Q78J736J587J219J148Q92N56J088K299K644
54477I2387J724J007J253J270K63n68o5J011J454J464J704J832J297N62L04L09
54461A07208P6l32p44j287j740j538r32r91j937k645k334j556j046p66n84o74
54445H8178q61p27o43j297k157j913o46J21j75n45n14p48j181o58Q26J622J024
54428G9706L20M37N10q1m19J08N74M15O14J622K099J148N7J95R05J099J264K112
54410I2685K777K298J565J889K732K661J774J375J920K845L733M333M121L113
54396A29821K462L058M242M888M872M516L622K274J502J851K227J409j74j371
$$ plain form
54382 165199 163127 160278 156661 152692 148610 144409 140445 137207 134494 131717 129002 126922 125183 122793
54368 122793 119626 116629 114285 112025 109392 106655 103986 101183 98630 97414 97983 99440 100575 100894 100461
54353 100461 99561 98770 98616 98944 99261 99670 100710 102401 104326 106533 109368 112520 115360 118224 122191 127525
54337 127525 133382 139105 144605 149433 152802 154791 156254 157215 156557 153735 149701 145696 142149 139116 136708
54322 136708 134534 131629 127495 122582 117525 112624 108180 104401 100796 96611 92055 88183 85413 83136
54308 83136 80900 78927 77297 75705 74252 73391 72906 72026 70715 69672 68913 67650 65837 64443 63815 63170
54292 63170 62214 61811 62357 62807 62180 60931 60021 59653 59677 60250 61310 62322 63175 64392 65858 66487 65918 65369
54274 65369 65839 66559 66339 65490 65166 65513 65775 65798 66178 67167 68453 69895 71581 73231 74328 74833 75167 75434
$$ packed form
54382A65199k072k849l617l969m082m201l964l238k713k777k715k080j739k390
54368A22793l167k997k344k260k633k737k669k803k553j216N69J457J135L19m33
54353A00461r00p91j54L28L17M09J040J691J925K207K835L152K840K864L967N334
54337A27525N857N723N500M828L369J989J463R61o58k822m034m005l547l033k408
54322A36708k174k905m134m913n057m901m444l779l605m185m556l872k770k277
54308H3136k236j973j630j592j453q61m85q80j311j043p59j263j813j394o28o45
54292F3170r56m03N46M50o27j249r10l68K4N73J060J012Q53J217J466O29n69n49
54274F5369M70P20k20q49l24L47K62K3L80R89J286J442J686J650J097N05L34K67
$$ plain form
54256 75434 75210 74184 72673 71408 70853 70745 70393 69634 69230 69946 71506 73016 74085 74796 74856 73864 72368
54239 72368 71582 71950 72956 74295 75984 77306 77157 75879 75346 76509 78184 78963 79053 79250 79329 78687 77749
54222 77749 77421 77625 77461 76476 74954 73317 71962 71338 71447 71630 71403 71127 71281 71579 71435 70883 70380 70025
54204 70025 69628 69215 68924 68644 68275 68081 68307 68667 68628 68063 67380 67108 67436 67933 67799 66787 65723 65524 65838
54185 65838 65487 64208 63042 62893 63686 65114 67069 68969 69770 69280 68570 68465 68497 67949 67114 66786 67166 67895
54167 67895 68607 68939 68602 67880 67459 67374 66874 65686 64531 63960 63586 63021 62616 62618 62503 61985 61837 62835 64550
54148 64550 66045 67122 68103 68928 69351 69585 69963 70350 70473 70428 70305 69803 68787 67721 67058 66707 66517 66607
54130 66607 66716 65978 64027 61740 60238 59716 59781 60284 61148 61997 62602 63129 63514 63248 62312 61517 61347 61251 60734
$$ packed form
54256G5434k24j026j511j265n55j08l52p59m04P16J560J510J069P11O0r92j496
54239G2368p86L68J006J339J689J322j49j278n33J163J675P79R0J97P9o42r38
54222G7749l28K04j64r85j522j637j355o24J09J83k27k76J54K98j44n52n03l55
54204G0025l97m13k91k80l69j94K26L60l9n65o83k72L28M97j34j012j064j99L14
54185F5838l51j279j166j49P93J428J955J900Q01m90p10j05L2n48q35l28L80P29
54167F7895P12L32l37p22m21q5n00j188j155n71l74n65m05Kj15n18j48R98J715
54148F4550J495J077R81Q25M23K34L78L87J23m5j23n02j016j066o63l51j90R0
54130F6607J09p38j951k287j502n22O5N03Q64Q49O05N27L85k66r36p95j70r6n17
$$ plain form
54111 60734 60256 60304 60409 59937 59145 58625 58429 58526 59261 60531 61311 61056 60773 61584 62970 63610 63370 63187 63413
54092 63413 63535 63332 63162 63225 63404 63647 63732 63021 61269 59361 58363 58159 57866 57146 56269 55353 54531 54446 55506
54073 55506 56918 57521 57388 57589 58555 59698 60522 61107 61516 61626 61550 61484 61183 60352 59473 59441 60421 61735 62825
54054 62825 63661 64300 64725 65130 65816 66867 68335 70423 73002 75297 76675 77421 78143 78866 79367 79969 81246
54037 81246 83293 85985 89470 93606 97433 100194 102479 105409 109012 112492 115759 119517 123977 128639
54023 128639 133343 138450 143859 148807 152882 156387 159598 162469 165187 168185 171372 174076 176011 177722
54009 177722 179795 182117 184098 185286 185655 185536 185206 184359 182350 179323 176605 175365 175231 174872 173585 171551
53993 171551 168909 165622 162173 159489 157966 157183 156604 156004 155228 154120 152718 151043 148796 145759 142324
$$ packed form
54111F0734m78M8J05m72p92n20j96R7P35J270P80k55k83Q11J386O40k40j83K26
54092F3413J22k03j70O3J79K43Q5p11j752j908r98k04k93p20q77r16q22q5J060
54073E5506J412O03j33K01R66J143Q24N85M09J10p6o6l01q31q79l2R80J314J090
54054F2825Q36O39M25M05O86J051J468K088K579K295J378P46P22P23N01O02J277
54037H1246K047K692L485M136L827K761K285K930L603L480L267L758M460M662
54023A28639M704N107N409M948M075L505L211K871K718K998L187K704J935J711
54009A77722K073K322J981J188L69j19l30q47k009l027k718j240j34l59j287k034
53993A71551k642l287l449k684j523p83n79o00p76j108j402j675k247l037l435
$$ plain form
53978 142324 139126 136310 133661 131231 129223 127432 125443 123296 121472 120270 119659 119523 119662 119742 119644 119628
53962 119628 119800 119827 119544 119355 119587 120034 120674 122167 124950 128419 131711 134689 137425 139449 140575 141844
53946 141844 144580 148811 153544 158212 162925 167805 173149 179785 188122 197156 205514 213158 220980 229061
53932 229061 236451 242382 246498 248203 247156 244235 240787 236967 232031 226087 220262 215191 210765 207317
53918 207317 205613 205408 205407 205043 205048 205946 207252 208666 210899 214644 219574 224921 230325 235724 241082 246577
53902 246577 252413 258278 263570 268206 272399 275633 276833 275777 273520 271179 269106 267357 266059 265043
53888 265043 263847 262330 260580 258227 254627 249844 244626 239328 233706 227742 221738 215570 208880 202048
53874 202048 195875 190174 183918 177111 171286 167606 165481 163672 161773 159961 158087 155819 153262 150882
$$ packed form
53978A42324l198k816k649k430k008j791j989k147j824j202o11j36J39Q0r8j6
53962A19628J72K7k83j89K32M47O40J493K783L469L292K978K736K024J126J269
53946A41844K736M231M733M668M713M880N344O636Q337R034Q358P644P822Q081
53932B29061P390N931M116J705j047k921l448l820m936n944n825n071m426l448
53918B07317j704k05jl64NQ98J306J414K233L745M930N347N404N399N358N495
53902B46577N836N865N292M636M193L234J200j056k257k341k073j749j298j016
53888B65043j196j517j750k353l600m783n218n298n622n964o004o168o690o832
53874B02048o173n701o256o807n825l680k125j809j899j812j874k268k557k380
$$ plain form
53860 150882 149054 147775 146434 143972 139972 135473 131852 128941 125327 120614 116201 113475 112277 111592
53846 111592 110758 109472 107515 105128 102996 101404 99924 98283 96898 96256 96380 97063 98020 98676 98495 97630
53830 97630 96603 95493 94255 93601 94311 95708 96210 95585 95206 95824 96578 96791 97108 97973 98371 97312 95559
53813 95559 94750 95475 97178 99267 101397 103203 104545 105644 106509 106854 106985 107941 110162 112861 115341 118027
53797 118027 121507 125394 129058 132718 136879 141285 145301 148891 152474 156254 160277 164607 168853 172179
53783 172179 174408 176510 179352 182604 185501 187908 189861 190855 190497 189277 187859 186159 184018 182098 181111
53768 181111 180578 179367 177127 174332 171316 168232 165611 163953 162922 161825 160716 160121 159829 158894 156921
53753 156921 154573 152685 151481 150752 150281 149894 149469 148990 148440 147812 147330 147309 147537 147207 145847 143935 142268
$$ packed form
53860A50882j828j279j341k462m000m499l621k911l614m713m413k726j198o85
53846A11592q34j286j957k387k132j592j480j641j385o42J24O83R57O56j81q65
53830I7630j027j110j238o54P10J397N02o25l79O18P54K13L17Q65L98j059j753
53813I5559q09P25J703K089K130J806J342J099Q65L45J31R56K221K699K480K686
53797A18027L480L887L664L660M161M406M016L590L583L780M023M330M246L326
53783A72179K229K102K842L252K897K407J953R94l58j220j418j700k141j920r87
53768A81111n33j211k240k795l016l084k621j658j031j097j109n95k92r35j973
53753A56921k348j888j204p29m71l87m25m79n50o28m82k1K28l30j360j912j667
$$ plain form
53736 142268 141119 140391 140039 139870 139455 138806 138634 139307 140071 140070 139751 140349 142211 144485 146399 148067 149886
53719 149886 151779 153291 154100 154283 154279 154534 155010 155152 154563 153507 152572 152043 151821 151763 151825 152070 152616 153395 153965
53700 153965 153894 153335 152786 152320 151667 151107 151494 153159 155507 157963 160552 163241 165547 167318 169111 171274
53684 171274 173399 175311 177802 181544 185907 189683 192559 195085 197630 200180 202888 205979 209183 211841
53670 211841 213547 214391 214817 215545 217176 219468 221405 222301 222404 222097 221218 219651 217946 216662 215586 214211
53654 214211 212470 210448 207922 204839 201734 199009 196328 193434 190975 189725 189458 189393 189318 189388 189220 188161
53638 188161 186310 184529 183468 183215 183643 184480 185199 185453 185507 185854 186642 187816 189365 191020 192324 193472
53622 193472 195462 198685 202057 204262 205261 205823 206311 206933 208490 211588 215406 218454 220412 222210 224496
$$ packed form
53736A42268j149p28l52j69m15o49j72O73P64jl19N98J862K274J914J668J819
53719A49886J893J512Q09J83mK55M76J42n89j056r35n29k22n8O2K45N46P79N70
53700A53965p1n59n49m66o53n60L87J665K348K456K589K689K306J771J793K163
53684A71274K125J912K491L742M363L776K876K526K545K550K708L091L204K658
53670B11841J706Q44M26P28J631K292J937Q96J03l07q79j567j705j284j076j375
53654B14211j741k022k526l083l105k725k681k894k459j250k67o5p5P0j68j059
53638A88161j851j781j061k53M28Q37P19K54N4L47P88J174J549J655J304J148
53622A93472J990L223L372K205R99N62M88O22J557L098L818L048J958J798K286
$$ plain form
53607 224496 227065 229729 232695 236015 239505 243185 247033 250485 253073 255487 258986 263722 268570 272749
53593 272749 276694 281137 286115 291213 296177 300946 305430 309448 312706 314967 316491 318005 319877 321674
53579 321674 322965 324082 325505 327022 328258 329584 331568 333922 335889 337422 338985 340419 341071 340970 340898
53564 340898 341263 341772 342238 342796 343309 343443 343487 344269 346139 348690 351522 354519 357357 359545 361118 362611
53548 362611 364306 366058 367834 369738 371604 373246 374977 377088 379027 380024 380455 381541 383657 386038 388345
53533 388345 391431 396081 401821 407477 412283 416089 419124 421975 425374 429687 434855 440805 447434 454346
53519 454346 461249 468584 477061 486651 496729 507174 518484 530781 543628 556920 571070 586105
53507 586105 601438 616780 632502 648903 665918 683716 702733 722828 743307 764104 786048
$$ packed form
53607B24496K569K664K966L320L490L680L848L452K588K414L499M736M848M179
53593B72749L945M443M978N098M964M769M484M018L258K261J524J514J872J797
53579C21674J291J117J423J517J236J326J984K354J967J533J563J434O52j01p2
53564C40898L65N09M66N58N13J34M4P82J870K551K832K997K838K188J573J493
53548C62611J695J752J776J904J866J642J731K111J939R97M31J086K116K381K307
53533C88345L086M650N740N656M806L806L035K851L399M313N168N950O629O912
53519D54346O903P335Q477R590J0078J0445J1310J2297J2847J3292J4150J5035
53507E86105J5333J5342J5722J6401J7015J7798J9017K0095K0479K0797K1944
$$ plain form
53496 786048 809611 834240 859421 885436 912438 939580 965915 991570 1017324 1043409 1069421
53485 1069421 1095069 1120382 1145268 1169418 1192545 1214538 1235613 1256495 1278084 1300641 1323615
53474 1323615 1346464 1369193 1391819 1413789 1434416 1453655 1472052 1490074 1507675 1524342 1539384
53463 1539384 1552378 1563526 1573474 1582703 1591270 1598999 1605569 1610441 1613096 1613412 1611461 1606973 1599492 1589105
53449 1589105 1576539 1562483 1547252 1531153 1514670 1498132 1481564 1464923 1448090 1430605 1411874
53438 1411874 1391624 1369849 1346496 1321804 1296795 1272656 1249530 1226658 1203796 1181743 1161297
53427 1161297 1142476 1125059 1109150 1094788 1081653 1069599 1058970 1049943 1041999 1034482 1027345 1021079
53415 1021079 1016214 1013166 1012169 1013011 1015051 1017732 1020912 1024730 1029569 1036144 1045088 1056311 1069170 1083365
$$ packed form
53496G86048K3563K4629K5181K6015K7002K7142K6335K5655K5754K6085K6012
53485A069421K5648K5313K4886K4150K3127K1993K1075K0882K1589K2557K2974
53474A323615K2849K2729K2626K1970K0627J9239J8397J8022J7601J6667J5042
53463A539384J2994J1148R948R229Q567P729O570M872K655L16j951m488p481j0387
53449A589105j2566j4056j5231j6099j6483j6538j6568j6641j6833j7485j8731
53438A411874k0250k1775k3353k4692k5009k4139k3126k2872k2862k2053k0446
53427A161297j8821j7417j5909j4362j3135j2054j0629r027p944p517p137o266
53415A021079m865l048r97Q42K040K681L180L818M839O575Q944J1223J2859J4195
$$ plain form
53401 1083365 1099188 1116824 1135951 1156225 1177643 1200342 1224465 1250333 1278199 1307813 1338787
53390 1338787 1371412 1406374 1443589 1482202 1521989 1563886 1608616 1655552 1703542 1752236 1802000
53379 1802000 1852970 1904868 1957410 2010325 2063146 2115394 2166857 2217454 2267082 2315785 2363805
53368 2363805 2411238 2457853 2503244 2546700 2586888 2622312 2652406 2677732 2698893 2715801 2728247
53357 2728247 2736491 2740837 2741085 2736834 2727869 2713949 2694725 2670453 2642387 2611952 2579728 2545583
53345 2545583 2509361 2470933 2429968 2386363 2340858 2294771 2249061 2203937 2159326 2115332 2072184
53334 2072184 2029922 1988348 1947281 1906771 1866851 1827144 1787130 1747099 1708315 1671754 1637040
53323 1637040 1603343 1570957 1541027 1513768 1488087 1463210 1439728 1418567 1399746 1382673 1366907
$$ packed form
53401A083365J5823J7636J9127K0274K1418K2699K4123K5868K7866K9614L0974
53390A338787L2625L4962L7215L8613L9787M1897M4730M6936M7990M8694M9764
53379A802000N0970N1898N2542N2915N2821N2248N1463N0597M9628M8703M8020
53368B363805M7433M6615M5391M3456M0188L5424L0094K5326K1161J6908J2446
53357B728247Q244M346K48m251q965j3920j9224k4272k8066l0435l2224l4145
53345B545583l6222l8428m0965m3605m5505m6087m5710m5124m4611m3994m3148
53334B072184m2262m1574m1067m0510l9920l9707m0014m0031l8784l6561l4714
53323A637040l3697l2386k9930k7259k5681k4877k3482k1161j8821j7073j5766
$$ plain form
53312 1366907 1351993 1337036 1321131 1304097 1286453 1269006 1252691 1238303 1225951 1214998 1204804
53301 1204804 1195294 1186732 1179406 1173707 1170028 1168325 1168160 1169299 1171773 1175253 1179031 1182886 1187451 1193502
53287 1193502 1201416 1211449 1223862 1238481 1254779 1272685 1292716 1315056 1339175 1364606 1391266
53276 1391266 1418686 1445772 1471899 1497433 1522631 1546801 1569290 1590552 1611345 1631357 1649442
53265 1649442 1664888 1677754 1688272 1696578 1702793 1706871 1708642 1708349 1706718 1704020 1699596 1692798 1683845
53252 1683845 1673214 1660826 1646521 1630707 1613758 1595287 1574927 1553324 1531427 1509148 1485819
53241 1485819 1461718 1438011 1415168 1392502 1369474 1346538 1324361 1302955 1281936 1261119 1240491
53230 1240491 1220045 1199976 1180717 1162526 1145149 1128027 1110703 1093135 1075840 1059642 1044985
$$ packed form
53312A366907j4914j4957j5905j7034j7644j7447j6315j4388j2352j0953j0194
53301A204804r510q562p326n699l679j703j65J139K474L480L778L855M565O051
53287A193502P914J0033J2413J4619J6298J7906K0031K2340K4119K5431K6660
53276A391266K7420K7086K6127K5534K5198K4170K2489K1262K0793K0012J8085
53265A649442J5446J2866J0518Q306O215M078J771k93j631k698m424o798q953
53252A683845j0631j2388j4305j5814j6949j8471k0360k1603k1897k2279k3329
53241A485819k4101k3707k2843k2666k3028k2936k2177k1406k1019k0817k0628
53230A240491k0446k0069j9259j8191j7377j7122j7324j7568j7295j6198j4657
$$ plain form
53219 1044985 1031510 1018527 1005821 993720 982565 972457 963406 955245 947397 939087 929931 920118
53207 920118 909959 899432 888175 875786 862136 847515 832433 817204 801829 786341 771104
53196 771104 756604 742999 729996 717130 704182 691392 679214 667769 656635 645299 633506
53185 633506 620978 607224 592205 576891 562430 548861 535341 521544 507994 495009 482257
53174 482257 469557 457301 445763 434814 424502 415080 406186 396992 387615 379355 372890 367177 360878
53161 360878 354014 347314 340785 334021 327366 321592 316681 311903 306903 301806 296401 290213 283492 277422
53147 277422 273096 270654 269378 268281 266700 264666 262693 261096 259811 258955 258883 259355 259292 257961 255960 254499
53131 254499 254173 254940 256739 259383 262328 265282 268692 272966 277610 281808 285419 288629 291030 291998 291780
$$ packed form
53219A044985j3475j2983j2706j2101j1155j0108r051q161p848q310r156r813
53207I20118j0159j0527j1257j2389j3650j4621j5082j5229j5375j5488j5237
53196G71104j4500j3605j3003j2866j2948j2790j2178j1445j1134j1336j1793
53185F33506j2528j3754j5019j5314j4461j3569j3520j3797j3550j2985j2752
53174D82257j2700j2256j1538j0949j0312r422q894r194r377q260o465n713o299
53161C60878o864o700o529o764o655n774m911m778n000n097n405o188o721o070
53147B77422m326k442j276j097j581k034j973j597j285q56p2M72o3j331k001j461
53131B54499l26P67J799K644K945K954L410M274M644M198L611L210K401R68k18
$$ plain form
53116 291780 291295 290862 289846 287596 284119 279852 275316 270949 266778 262291 257008 251058 244900 238789 232871
53101 232871 227432 222558 217906 213251 208806 204572 200002 194986 190549 187681 185907 183984 181709 180004
53087 180004 179371 179256 178959 178303 177248 175601 173334 170764 168309 166340 165047 164084 162712 160724 158877
53072 158877 157858 157279 156404 155359 154782 154585 154030 152870 151585 150584 149892 149467 149163 148536 147409 146355
53056 146355 145953 145878 145456 144763 144304 143953 143168 142050 141234 140894 140733 140722 140952 141062 140764 140593 141022 141184 139851
53037 139851 137508 136013 136151 136922 137374 137646 137878 137611 136922 136794 137546 138003 137045 135144 133529 132580 131842
53020 131842 131046 130326 129813 129568 129659 129946 130127 130144 130109 129856 129268 129079 130332 132779 134805 135465 135595 136267 137148
53001 137148 137297 136852 136790 137407 138054 138307 138542 139260 140465 141855 143240 144633 146129 147778 149525 151328
$$ packed form
53116B91780m85m33j016k250l477m267m536m367m171m487n283n950o158o111n918
53101B32871n439m874m652m655m445m234m570n016m437k868j774j923k275j705
53087A80004o33j15k97o56j055j647k267k570k455j969j293r63j372j988j847
53072A58877j019n79q75j045n77j97n55j160j285j001o92m25l04o27j127j054
53056A46355m02p5m22o93m59l51p85j118q16l40j61j1K30J10k98j71M29J62j333
53037A39851k343j495J38P71M52K72K32k67o89j28P52M57r58j901j615r49p38
53020A31842p96p20n13k45R1K87J81J7l5k53n88j89J253K447K026O60J30O72Q81
53001A37148J49m45o2O17O47K53K35P18J205J390J385J393J496J649J747J803
$$ plain form
52985 151328 153316 155666 158292 160937 163562 166440 169792 173590 177617 181486 184795 187640 190818 194926
52971 194926 199377 202902 204960 205997 206390 206018 205013 204079 203604 203065 201713 199425 196607 193704 191013
52956 191013 188521 185755 182313 178699 176057 174820 174190 173199 171652 169751 167466 164843 162402 160661 159507
52941 159507 158482 157422 156455 155635 154991 154746 155074 155719 156140 156005 155388 154571 153853 153558 154092 155777 158388
52924 158388 160939 162379 162706 163002 164052 165387 166086 166005 165619 165189 164852 165079 166143 167361 167809 167638 167785
52907 167785 168539 169321 169801 170193 170468 170356 170164 170536 171250 171396 170934 170944 171960 173242 174155 175178 176875 178807
52889 178807 180190 180920 181288 181391 181451 182066 183540 185424 187149 188597 189713 190290 190561 191351 193077 195161
52873 195161 196799 197716 197899 197417 196959 197675 199800 202130 203520 204298 205537 207578 209981 212449 215083 218058
$$ packed form
52985A51328J988K350K626K645K625K878L352L798M027L869L309K845L178M108
52971A94926M451L525K058J037L93l72j005r34m75n39j352k288k818k903k691
52956A91013k492k766l442l614k642j237o30r91j547j901k285k623k441j741j154
52941A59507j025j060r67q20o44k45L28O45M21j35o17q17p18k95N34J685K611
52924A58388K551J440L27K96J050J335O99q1l86m30l37K27J064J218M48j71J47
52907A67785P54P82M80L92K75j12j92L72P14J46m62J0J016J282R13J023J697J932
52889A78807J383P30L68J03O0O15J474J884J725J448J116N77K71P90J726K084
52873A95161J638R17J83m82m58P16K125K330J390P78J239K041K403K468K634K975
$$ plain form
52857 218058 221603 225930 230730 235185 238932 242537 246547 250550 253683 255587 256469 256706 256818 257277 257897
52842 257897 257924 257129 256165 255424 254343 252415 250132 248171 246287 243790 240612 237143 233466 229575 225943
52827 225943 223131 221013 218997 216792 214462 212121 210033 208621 207858 207058 205725 204177 202818 201388 199445
52812 199445 197066 194473 191513 188234 185426 183866 183364 183148 182727 181821 180088 177684 175572 174451 173863
52797 173863 173071 172227 171787 171330 170096 168338 166993 166192 165092 163164 160701 158111 155611 153644 152715 152596
52781 152596 152384 151489 150131 148884 148240 148472 149297 149771 149094 147529 146035 145120 144543 143982 143368 142652 141804
52764 141804 140944 140015 138506 136084 133275 130934 129166 127341 125066 122577 120291 118460 117159 116155 114997
52749 114997 113689 112928 113141 113603 113224 111923 110512 109472 108601 107697 106790 105686 104068 102104 100442 99556
$$ packed form
52857B18058L545M327M800M455L747L605M010M003L133J904Q82K37J12M59O20
52842B57897K7p95r64p41j081j928k283j961j884k497l178l469l677l891l632
52827B25943k812k118k016k205k330k341k088j412p63q00j333j548j359j430j943
52812A99445k379k593k960l279k808j560n02k16m21r06j733k404k112j121n88
52797A73863p92q44m40m57j234j758j345q01j100j928k463k590k500j967r29j19
52781A52596k12q95j358j247o44K32Q25M74o77j565j494r15n77n61o14p16q48
52764A41804q60r29j509k422k809k341j768j825k275k489k286j831j301j004j158
52749A14997j308p61K13M62l79j301j411j040q71r04r07j104j618j964j662q86
$$ plain form
52733 99556 99454 99809 99889 98790 96515 94521 94297 95518 96462 96219 95549 95546 96385 97652 99113 100701 102331
52716 102331 104071 106117 108337 110218 111460 112349 113426 115062 117357 120129 123038 125935 128960 132059
52702 132059 134669 136316 137213 137757 137745 136677 134652 132313 130000 127626 125259 123163 121228 118992 116354
52687 116354 113803 111851 110624 109930 109295 108015 105704 102839 100409 99022 98509 98153 97081 94871 92207
52672 92207 90438 90007 89774 88507 86504 84993 84444 84405 84535 84722 84485 83420 82119 81586 81758 81625 80769
52655 80769 79792 79184 78871 78958 79805 81172 82320 83207 84492 86092 86885 86330 85330 84908 84968 85022 85247 85980
52637 85980 86855 87297 87431 87709 87978 87711 87037 86901 88071 90305 92495 93494 92951 91459 89869 88493 87162
52620 87162 85795 84420 82812 80773 78763 77585 77331 77249 76840 76510 76888 78067 79720 81447 82804 83473
$$ packed form
52733I9556j02L55Q0j099k275j994k24J221R44k43o70lQ39J267J461J588J630
52716A02331J740K046K220J881J242Q89J077J636K295K772K909K897L025L099
52702A32059K610J647Q97N44j2j068k025k339k313k374k367k096j935k236k638
52687A16354k551j952j227o94o35j280k311k865k430j387n13l56j072k210k664
52672I2207j769m31k33j267k003j511n49l9J30J87k37j065j301n33J72j33q56
52655H0769r77o08l13Q7Q47J367J148Q87J285J600P93n55j000m22O0N4K25P33
52637H5980Q75M42J34K78K69k67o74j36J170K234K190R99n43j492j590j376j331
52620H7162j367j375j608k039k010j178k54q2m09l30L78J179J653J727J357O69
$$ plain form
52604 83473 83672 83919 84228 84088 83430 83028 83624 85155 87108 89139 90969 92159 92493 92333 92283 92683 93588 94906
52586 94906 96313 97320 97647 97433 97080 97130 98134 100130 102280 103540 103818 104000 104837 106341 108231 110292
52570 110292 112152 113392 114134 115023 116461 118374 120806 123959 127440 130218 131757 132663 133782 135206 136532
52555 136532 137580 138405 139022 139528 140165 140929 141483 141727 142089 142931 144080 145197 146219 147161 147933 148682 149832
52538 149832 151402 152715 153210 153223 153542 154446 155583 156580 157386 158072 158614 158929 159068 159376 160209 161285 161631 160743
52520 160743 159588 159668 161139 162592 162906 162441 162083 161939 161573 160937 160363 159997 159756 159641 159666 159665 159487 159180 158763
52501 158763 158112 157247 156433 155802 155212 154621 154273 154372 154944 156064 157742 159470 160410 160269 159586 159026 158906 159458
52483 159458 160858 162753 164397 165538 166599 167802 168859 169841 171508 174199 177043 178931 179797 180380 181137
$$ packed form
52604H3473J99K47L09j40o58m02N96J531J953K031J830J190L34j60n0M00R05J318
52586I4906J407J007L27k14l53N0J004J996K150J260K78J82Q37J504J890K061
52570A10292J860J240P42Q89J438J913K432L153L481K778J539R06J119J424J326
52555A36532J048Q25O17N06O37P64N54K44L62Q42J149J117J022R42P72P49J150
52538A49832J570J313M95J3L19R04J137R97Q06O86N42L15J39L08Q33J076L46q88
52520A60743j155Q0J471J453L14m65l58j44l66o36n74l66k41j15K5jj78l07m17
52501A58763o51q65q14o31n90n91l48R9N72J120J678J728R40j41o83n60j20N52
52483A59458J400J895J644J141J061J203J057R82J667K691K844J888Q66N83P57
$$ plain form
52468 181137 181966 182639 183062 183331 183910 185365 187647 189999 191811 193086 193897 194078 193813 193832 194518 195421 196129
52451 196129 196979 198399 200189 202049 204187 206749 209211 211034 212430 213820 215116 216178 217422 219143
52437 219143 220812 221860 222618 223621 224537 224848 225038 225878 226813 226410 224382 221920 219835 217608 214612 211233
52421 211233 208218 205740 203696 202312 201778 201615 200946 199348 197255 195588 194945 194966 194657 193599 192575 192505
52405 192505 193067 193097 192279 191544 191648 192160 192232 191751 191236 191098 191497 192501 193884 194999 195361 195293 195588 196540 197666
52386 197666 198398 198751 199167 199943 201012 202217 203517 204826 205861 206398 206600 206821 207058 206927 206350 205938 206447
52369 206447 207980 210050 212298 214824 217774 220806 223145 224206 224196 224047 224685 226411 229016 232173 235405
52354 235405 237977 239478 240535 242320 245174 248251 250769 252958 255407 258072 260585 263147 266391 270401
$$ packed form
52468A81137Q29O73M23K69N79J455K282K352J812J275Q11J81k65J9O86R03P08
52451A96129Q50J420J790J860K138K562K462J823J396J390J296J062J244J721
52437B19143J669J048P58J003R16L11J90Q40R35m03k028k462k085k227k996l379
52421B11233l015k478k044j384n34j63o69j598k093j667o43K1l09j058j024p0
52405A92505N62L0q18p35J04N12P2m81n15j38L99J004J383J115L62o8K95R52J126
52386A97666P32L53M16P76J069J205J300J309J035N37K02K21K37j31n77m12N09
52369B06447J533K070K248K526K950L032K339J061j0j49O38J726K605L157L232
52354B35405K572J501J057J785K854L077K518K189K449K665K513K562L244M010
$$ plain form
52340 270401 274392 277435 279209 280204 281403 283625 286842 290204 292966 295169 297230 299193 300818 302187
52326 302187 303785 306004 308873 312173 315522 318443 320654 322332 323960 326008 328857 332750 337569 342816
52312 342816 348064 353269 358511 363652 368503 373167 377997 383356 389539 396765 405059 414322 424552 435762
52298 435762 447743 460280 473572 487918 502895 517491 531295 545042 559747 575809 593147
52287 593147 611503 630240 648524 666286 684505 704018 724519 745100 765253 784865 803879
52276 803879 822544 841416 860395 878344 894335 908781 922555 935536 946956 956706 965266 972651
52264 972651 978471 982943 986803 990164 992310 992758 991775 989819 987195 984398 982051 980211 978187 975270 971375
52249 971375 967009 962958 959898 957950 956684 955785 955381 955466 955639 956000 957681 961634 967374 973856 981182 990331
$$ packed form
52340B70401L991L043J774R95J199K222L217L362K762K203K061J963J625J369
52326C02187J598K219K869L300L349K921K211J678J628K048K849L893M819N247
52312C42816N248N205N242N141M851M664M830N359O183P226Q294R263J0230J1210
52298D35762J1981J2537J3292J4346J4977J4596J3804J3747J4705J6062J7338
52287E93147J8356J8737J8284J7762J8219J9513K0501K0581K0153J9612J9014
52276H03879J8665J8872J8979J7949J5991J4446J3774J2981J1420R750Q560P385
52264I72651N820M472L860L361K146M48r83j956k624k797k347j840k024k917l895
52249I71375m366m051l060j948j266q99m04Q5J73L61J681L953N740O482P326R149
$$ plain form
52233 990331 1001414 1013370 1025441 1037893 1051189 1065449 1080735 1096878 1112808 1127132 1139625
52222 1139625 1151240 1162433 1172520 1181019 1188516 1195599 1201918 1207005 1211204 1214985 1217902 1219009 1217948
52209 1217948 1215005 1210506 1204760 1198247 1191233 1183364 1174140 1163681 1152651 1141575 1130527 1119354 1107925
52196 1107925 1096259 1084532 1072883 1061226 1049594 1038620 1029190 1021501 1014937 1009055 1004087 1000221
52184 1000221 997021 994045 991538 989889 988643 986740 983743 980396 977889 976764 976580 976409 975596 974060 971956
52169 971956 969261 965878 962031 958250 955003 952469 950546 948755 946387 943234 940052 937771 936270 934513
52155 934513 931775 928137 923799 918722 913129 907549 902040 896124 889864 884220 879770 875779 871271 866483
52141 866483 862466 859565 857122 854499 851576 848269 844256 839444 834115 828445 822285 815657 809156 803566
$$ packed form
52233I90331J1083J1956J2071J2452J3296J4260J5286J6143J5930J4324J2493
52222A139625J1615J1193J0087Q499P497P083O319N087M199L781K917J107j061
52209A217948k943m499n746o513p014p869r224j0459j1030j1076j1048j1173j1429
52196A107925j1666j1727j1649j1657j1632j0974r430p689o564n882m968l866
52184A000221l200k976k507j649j246j903k997l347k507j125j84j71q13j536k104
52169I71956k695l383l847l781l247k534j923j791k368l153l182k281j501j757
52155I34513k738l638m338n077n593n580n509n916o260n644m450l991m508m788
52141H66483m017k901k443k623k923l307m013m812n329n670o160o628o501n590
$$ plain form
52127 803566 799219 795879 793134 790699 788345 785725 782473 778585 774573 770996 767826 764540 760926 757537
52113 757537 755125 753810 753126 752775 752981 754021 755725 757755 760290 764064 769564 776438 784041 792446 802392
52098 802392 814106 826687 839034 851087 863748 877848 893740 911701 932011 954422 978060
52087 978060 1002158 1026612 1051620 1077020 1102278 1127002 1151190 1174938 1198071 1220194 1241120
52076 1241120 1261091 1280306 1298319 1314233 1327625 1338929 1348706 1356886 1363054 1367142 1369422 1370070 1369197
52063 1369197 1367121 1364119 1359981 1354235 1346783 1337991 1328311 1318160 1307995 1298083 1288315 1278585 1269191
52050 1269191 1260499 1252425 1244680 1237254 1230196 1223263 1216478 1210766 1207213 1205732 1205202 1204924 1205226 1206622 1209186
52035 1209186 1212845 1217541 1222838 1228011 1232814 1237639 1242748 1247896 1252908 1258078 1263728 1269797 1276029 1282155
$$ packed form
52127H03566m347l340k745k435k354k620l252l888m012l577l170l286l614l389
52113G57537k412j315o84l51K06J040J704K030K535L774N500O874P603Q405R946
52098H02392J1714J2581J2347J2053J2661J4100J5892J7961K0310K2411K3638
52087I78060K4098K4454K5008K5400K5258K4724K4188K3748K3133K2123K0926
52076A241120J9971J9215J8013J5914J3392J1304R777Q180O168M088K280O48q73
52063A369197k076l002m138n746p452q792r680j0151j0165r912r768r730r394
52050A269191q692q074p745p426p058o933o785n712l553j481n30k78L02J396K564
52035A209186L659M696N297N173M803M825N109N148N012N170N650O069O232O126
$$ plain form
52021 1282155 1287774 1292521 1296422 1299670 1302088 1303334 1303575 1303258 1302261 1299974 1296278 1291628 1286093 1279197 1270866
52006 1270866 1261600 1251387 1239400 1225306 1209991 1194312 1177770 1159075 1137517 1113305 1087152
51995 1087152 1060062 1032991 1005996 978104 948595 918077 887798 858307 829371 800867 773074
51984 773074 746127 719729 693457 667201 641339 616534 593126 570759 548945 527879 508167
51973 508167 489812 472236 455356 439764 425617 412261 399362 387473 376961 367201 357468 347839
51961 347839 338592 329547 320833 313454 308090 303913 299561 294805 290301 286235 282351 278898 276293 274002
51947 274002 270918 266902 262895 259433 256058 252368 248693 245401 242393 239687 237829 237181 237237 237044 236145
51932 236145 234924 234183 234353 234883 234589 232956 230887 229626 229098 228024 225646 222599 219985 218339 217728 218156
$$ packed form
52021A282155N619M747L901L248K418J246K41l17r97k287l696m650n535o896q331
52006A270866r266j0213j1987j4094j5315j5679j6542j8695k1558k4212k6153
51995A087152k7090k7071k6995k7892k9509l0518l0279k9491k8936k8504k7793
51984G73074k6947k6398k6272k6256k5862k4805k3408k2367k1814k1066j9712
51973E08167j8355j7576j6880j5592j4147j3356j2899j1889j0512r760r733r629
51961C47839r247r045q714p379n364m177m352m756m504m066l884l453k605k291
51947B74002l084m016m007l462l375l690l675l292l008k706j858o48N6j93q99
51932B36145j221p41J70N30k94j633k069j261n28j074k378l047k614j646o11M28
$$ plain form
51916 218156 219347 220591 221217 221022 220007 218146 215670 213174 210953 208537 205319 201504 197945 195104 192636
51901 192636 190040 187298 184653 182128 179649 177502 176199 175737 175327 174123 172057 169728 167670 165994 164613
51886 164613 163398 162094 160463 158597 156815 155200 153574 152028 151098 151200 152149 153310 154062 154075 153467 152804
51870 152804 152650 153037 153620 154261 155028 155683 155851 155817 156419 157880 159388 160222 160631 161094 161398 161195 160982 161686
51852 161686 163437 165469 167183 168685 170290 172088 174105 176421 178955 181385 183412 184982 186301 187725
51838 187725 189473 191294 192589 193043 192881 192333 191175 189106 186386 183717 181606 180070 178846 177719 176754
51823 176754 176299 176594 177296 177676 177312 176335 175027 173661 172822 173210 174883 177109 179210 181101 182904 184663
51807 184663 186645 189224 192125 194461 195892 196966 197993 198416 197885 197033 196401 195448 193589 191500 190307
$$ packed form
51916B18156J191J244O26j95j015j861k476k496k221k416l218l815l559k841k468
51901A92636k596k742k645k525k479k147j303m62m10j204k066k329k058j676j381
51886A64613j215j304j631j866j782j615j626j546r30J02R49J161P52J3o08o63
51870A52804j54L87N83O41P67O55J68l4O02J461J508Q34M09M63L04k03k13P04
51852A61686J751K032J714J502J605J798K017K316K534K430K027J570J319J424
51838A87725J748J821J295M54j62n48j158k069k720k669k111j536j224j127r65
51823A76754m55K95P02L80l64r77j308j366q39L88J673K226K101J891J803J759
51807A84663J982K579K901K336J431J074J027M23n31q52o32r53j859k089j193
$$ plain form
51792 190307 189962 189557 188822 188173 187505 186132 183997 181970 180806 180517 180724 180969 180769 180091 179660 180198 181572
51775 181572 183293 185411 187942 189821 189718 187910 186163 185608 185699 185498 184906 184228 183546 183042 183245 184424 186246
51758 186246 188412 191077 194343 197848 201214 204448 207583 210329 212367 213703 214601 215575 217412 220676 225070
51743 225070 229809 234727 240433 247182 254313 261191 268162 276069 285136 294802 304512 314243 324155 333876
51729 333876 342320 348384 351852 353388 353619 352711 351106 350046 350656 352825 355579 358265 360741 362797 364301
51714 364301 365760 367829 370261 372116 372960 373053 372350 370316 366988 363421 360735 359249 358693 358634 358564 358156 357553
51697 357553 356874 355571 353041 349829 347246 345682 344238 342311 340563 339902 340339 341370 342747 344382 346149
51682 346149 348316 351643 356542 362482 368454 373540 376900 377925 376760 374157 370644 366456 362339 359495
$$ packed form
51792A90307l45m05p35o49o68j373k135k027j164k89K07K45k00o78m31N38J374
51775A81572J721K118K531J879j03j808j747n55R1k01n92o78o82n04K03J179J822
51758A86246K166K665L266L505L366L234L135K746K038J336Q98R74J837L264M394
51743B25070M739M918N706O749P131O878O971P907R067R666R710R731R912R721
51729C33876Q444O064L468J536K31r08j605j060O10K169K754K686K476K056J504
51714C64301J459K069K432J855Q44R3p03k034l328l567k686j486n56n9p0m08o03
51697C57553o79j303k530l212k583j564j444j927j748o61M37J031J377J635J767
51682C46149K167L327M899N940N972N086L360J025j165k603l513m188m117k844
$$ plain form
51668 359495 358372 358353 359018 360784 363833 367395 370812 374506 379152 384631 390560 397124 404438 411633 417461
51653 417461 421416 423447 423067 419721 413776 406229 397584 387856 377518 367499 358167 349045 339727 330522
51639 330522 322069 314711 308318 302425 296552 290652 285158 280317 275718 270869 266007 261845 258628 255879
51625 255879 253062 250069 247051 244073 241049 237897 234767 232100 230241 228996 227872 226828 226328 226520 226832
51610 226832 226628 225821 224590 222992 221233 219801 218927 218325 217812 217684 218033 218264 217867 217170 216718 216424 216061
51593 216061 216127 217293 219240 220955 222066 223078 224285 225363 226223 227491 229771 232949 236540 240316 244359
51578 244359 248832 253914 259712 266030 272423 278602 284657 290824 297099 303054 307960 311202 312672 312679 311457
51563 311457 309046 305687 301902 297977 293763 289291 285133 281781 279081 276713 274772 273371 272143 270886
$$ packed form
51668C59495j123j9O65J766L049L562L417L694M646N479N929O564P314P195N828
51653D17461L955K031l80l346n945p547q645r728j0338j0019r332r122r318r205
51639C30522q453p358o393n893n873n900n494m841m599m849m862m162l217k749
51625B55879k817k993l018k978l024l152l130k667j859j245j124j044n00J92L12
51610B26832k04q07j231j598j759j432q74o02n13j28L49K31l97o97m52k94l63
51593B16061O6J166J947J715J111J012J207J078Q60J268K280L178L591L776M043
51578B44359M473N082N798O318O393O179O055O167O275N955M906L242J470Pj222
51563C11457k411l359l785l925m214m472m158l352k700k368j941j401j228j257
$$ plain form
51549 270886 270322 271430 274211 277890 282135 287149 292615 297612 301892 306406 312091 318704 325251 331040
51535 331040 335892 339833 343057 345893 348362 350011 350530 350309 349952 349406 348026 345574 342797 340872 340387
51520 340387 340985 341920 342852 344093 346137 349055 352413 355581 358066 359617 360206 359855 358476 355964 352511
51505 352511 348527 344129 338929 332673 325860 319348 313453 307814 302129 296579 291373 286325 281185 276178
51491 276178 271865 268486 265707 263128 260844 259260 258357 257486 256115 254609 253922 254527 255986 257584 259022
51476 259022 260390 261838 263479 265321 267175 268985 271308 274967 279919 285070 289654 294268 299928 306514
51462 306514 312965 318888 325133 332642 341321 350285 358775 366648 374282 382153 390278 398063 404957 411137
51448 411137 417144 422898 427639 430945 433302 435436 437464 439020 439898 440222 440211 440147 440503 441725 443775 446063
$$ packed form
51549B70886n64J108K781L679M245N014N466M997M280M514N685O613O547N789
51535C31040M852L941L224K836K469J649N19k21l57n46j380k452k777j925m85
51520C40387N98R35R32J241K044K918L358L168K485J551N89l51j379k512l453
51505C52511l984m398n200o256o813o512n895n639n685n550n206n048n140n007
51491B76178m313l379k779k579k284j584r03q71j371j506o87O05J459J598J438
51476B59022J368J448J641J842J854J810K323L659M952N151M584M614N660O586
51462C06514O451N923O245P509Q679Q964Q490P873P634P871Q125P785O894O180
51448D11137O007N754M741L306K357K134K028J556Q78L24j1o4L56J222K050K288
$$ plain form
51432 446063 448006 449645 451607 454382 457701 460757 462912 463925 463504 461171 456952 451870 447162 442959
51418 442959 438136 431589 423432 414893 407260 400992 395595 390238 384577 379026 374261 370576 367812 365703
51404 365703 364056 362757 361835 361453 361638 362177 363007 364446 366608 368848 370338 371169 372271 374109 376048 377278
51388 377278 377850 378392 379164 379854 380044 379379 377353 373455 367660 360507 352572 344099 335222 326247 317477 308927
51372 308927 300522 292540 285571 279853 274853 269673 263776 257215 250308 243405 236908 231157 226145 221513
51358 221513 216988 212700 208937 205775 203046 200539 198053 195391 192478 189437 186463 183630 180959 178607
51344 178607 176885 176012 175890 176050 175906 175155 173975 172751 171666 170661 169677 168730 167813 167016 166734 167429 169047
51327 169047 170918 172323 172981 172985 172625 172436 173042 174664 176923 179261 181476 183758 186466 189934 194247 199060
$$ packed form
51432D46063J943J639J962K775L319L056K155J013m21k333m219n082m708m203
51418D42959m823o547q157q539p633o268n397n357n661n551m765l685k764k109
51404C65703j647j299r22l82J85N39Q30J439K162K240J490Q31J102J838J939J230
51388C77278N72N42P72O90J90o65k026l898n795p153p935q473q877q975q770q550
51372C08927q405p982o969n718n000n180n897o561o907o903o497n751n012m632
51358B21513m525m288l763l162k729k507k486k662k913l041k974k833k671k352
51344A78607j722q73j22J60j44p51j180j224j085j005r84r47r17p97k82O95J618
51327A69047J871J405O58Ml60j89O06J622K259K338K215K282K708L468M313M813
$$ plain form
51311 199060 203885 208626 213604 218984 224530 230014 235486 240937 246055 250537 254305 257223 258969 259454
51297 259454 258943 257487 254655 250253 244940 239622 234507 229182 223440 217557 211922 206823 202462 198759
51283 198759 195199 191273 187067 183142 179888 177271 175040 172908 170624 168169 165806 163706 161650 159281
51269 159281 156506 153426 150153 147027 144739 143784 143873 144237 144473 144785 145420 146196 146606 146270 145322 144416 144164
51252 144164 144566 145194 145959 147218 148935 150299 150591 150066 149551 149494 149804 150285 150788 151211 151814 153209 155600
51235 155600 158219 159961 160327 159499 157940 156396 155758 156140 156411 155361 153179 151135 150081 149983 150693 152168
51219 152168 153833 154643 154145 152976 152086 151895 152301 152988 153503 153449 152855 152156 151768 151865 152523 153710 155216 156814
51201 156814 158365 159496 159536 158261 156453 155200 154852 155144 156023 157528 159008 159373 158308 156586 155002 153611
$$ packed form
51311A99060M825M741M978N380N546N484N472N451N118M482L768K918J746M85
51297B59454n11j456k832m402n313n318n115n325n742n883n635n099m361l703
51283A98759l560l926m206l925l254k617k231k132k284k455k363k100k056k369
51269A59281k775l080l273l126k288r55Q9L64K36L12O35P76M10l36r48r06k52
51252A44164M02O28P65J259J717J364K92n25n15n7L10M81N03M23O03J395K391
51235A55600K619J742L66q28j559j544o38L82K71j050k182k044j054r8P10J475
51219A52168J665Q10m98j169q90j91M06O87N15n4n94o99l88R7O58J187J506J598
51201A56814J551J131M0j275j808j253l48K92Q79J505J480L65j065j722j584j391
$$ plain form
51185 153611 152215 150998 150386 150633 151717 153264 154499 154643 153569 151886 150374 149552 149587 150190 150734 150841
51169 150841 150794 151012 151367 151447 151161 150607 149669 148474 147851 148512 149914 150833 150897 150676 150316 149156 146901 144231
51151 144231 141941 140231 139011 138108 136986 135070 132671 130792 129738 128712 127129 125486 124494 124068 123702
51136 123702 123230 122763 122407 122449 123287 124818 126437 127895 129602 131784 134056 136148 138317 140624 142547 143909
51120 143909 145455 147889 150891 153687 156006 157835 158776 158507 157517 156637 156054 155398 154548 153700 152838 151826
51104 151826 150973 150879 151626 152486 152592 151760 150725 150628 152093 154664 157364 159772 162178 164635 166550 167551
51088 167551 168185 169314 171148 173237 174997 175852 175287 173296 170622 168198 166486 165463 164884 164357 163632 163073
51072 163073 163348 164378 165206 165259 165103 165485 166251 166854 167321 167930 168376 168179 167695 167820 168639 169118 168343 166578
$$ packed form
51185A53611j396j217o12K47J084J547J235J44j074j683j512q22L5O03N44J07
51169A50841m7K18L55Q0k86n54r38j195o23O61J402R19O4k21l60j160k255k670
51151A44231k290j710j220r03j122j916k399j879j054j026j583j643r92m26l66
51136A23702m72m67l56M2Q38J531J619J458J707K182K272K092K169K307J923J362
51120A43909J546K434L002K796K319J829R41k69r90q80n83o56q50q48q62j012
51104A51826q53r4P47Q60J06q32j035r7J465K571K700K408K406K457J915J001
51088A67551O34J129J834K089J760Q55n65j991k674k424j712j023n79n27p25n59
51072A63073K75J030Q28N3j56L82P66O03M67O09M46j97m84J25Q19M79p75j765
$$ plain form
51054 166578 164888 164056 164047 164355 164793 165835 168018 171074 174109 176688 179205 181984 184632 186736 188673 191152
51038 191152 194334 197848 201302 204330 206588 208253 210143 212703 215168 216360 216038 214966 213939 213350 213328
51023 213328 213556 213087 211158 208166 205294 203218 201769 200692 200089 200048 200440 201130 201947 202476 202418 202190 202649
51006 202649 204128 206134 208079 209945 212136 214998 218474 221984 224739 226514 228112 230754 235107 241120
50992 241120 248459 256612 264765 272252 279270 286756 295508 305694 317070 329247 341812 354622 368045
50979 368045 382553 398170 414629 432060 451092 472394 496481 523898 555046 589798 627770
50968 627770 669143 714809 765503 821050 880557 943156 1008492 1076668 1147837 1221643 1297027
50957 1297027 1372572 1446855 1518403 1585595 1646973 1701581 1748795 1788122 1819423 1843110 1859661
$$ packed form
51054A66578j690q32rL08M38J042K183L056L035K579K517K779K648K104J937K479
51038A91152L182L514L454L028K258J665J890K560K465J192l22j072j027n89k2
51023B13328K28m69j929k992k872k076j449j077o03m1L92O90Q17N29n8k28M59
51006B02649J479K006J945J866K191K862L476L510K755J775J598K642M353O013
50992B41120P339Q153Q153P487P018P486Q752J0186J1376J2177J2565J2810J3423
50979C68045J4508J5617J6459J7431J9032K1302K4087K7417L1148L4752L7972
50968F27770M1373M5666N0694N5547N9507O2599O5336O8176P1169P3806P5384
50957A297027P5545P4283P1548O7192O1378N4608M7214L9327L1301K3687J6551
$$ plain form
50946 1859661 1869107 1871394 1867167 1857789 1844729 1829352 1813257 1798199 1785357 1774867 1766089 1758159
50934 1758159 1750229 1741429 1730764 1717157 1699779 1678408 1653191 1623961 1590076 1551077 1507075 1458267
50922 1458267 1404604 1346470 1285279 1222748 1159796 1096836 1034928 975793 920534 868988 820702
50911 820702 776067 736058 701057 670321 642631 617269 594237 573656 555384 539421 526338
50900 526338 516708 510134 505420 501705 498845 496626 494501 492422 491115 491019 491619 492368 493491 495175 496721
50885 496721 497473 497948 499138 501181 503736 507160 512106 518260 524748 531705 540094 549951 560133 570202
50871 570202 581335 594730 610045 626050 642092 658363 675386 693921 714988 739340 767023
50860 767023 797768 831616 869042 910805 957893 1011278 1071503 1138772 1213512 1296591 1388946
$$ packed form
50946A859661R446K287m227r378j3060j5377j6095j5058j2842j0490q778p930
50934A758159p930q800j0665j3607j7378k1371k5217k9230l3885l8999m4002m8808
50922A458267n3663n8134o1191o2531o2952o2960o1908n9135n5259n1546m8286
50911H20702m4635m0009l5001l0736k7690k5362k3032k0581j8272j5963j3083
50900E26338r630o574m714l715k860k219k125k079j307r6O00P49J123J684J546
50885D96721P52M75J190K043K555L424M946O154O488O957Q389R857J0182J0069
50871E70202J1133J3395J5315J6005J6042J6271J7023J8535K1067K4352K7683
50860G67023L0745L3848L7426M1763M7088N3385O0225O7269P4740Q3079R2355
$$ plain form
50849 1388946 1491313 1604262 1727976 1861845 2004578 2154790 2311240 2472693 2638007
50840 2638007 2806065 2974852 3140481 3297706 3441520 3568018 3674203 3758056 3819052 3857899
50830 3857899 3875668 3873913 3855598 3824865 3785419 3739898 3691131 3643065 3599713 3563758 3536561
50819 3536561 3518682 3509454 3506329 3505348 3502138 3492291 3471561 3436745 3386541 3321198 3241370 3147418
50807 3147418 3039449 2917777 2783721 2640344 2492049 2342966 2195875 2052769 1915823
50798 1915823 1787124 1667756 1557818 1457299 1366474 1285571 1214464 1152666 1099279 1053050
50788 1053050 1012903 978437 949599 925928 906514 890735 878639 870293 864913 860953 857142 853316
50776 853316 850074 847702 845640 843049 839473 834754 828717 821438 813589 805876 798182 789804 780561 771181
$$ packed form
50849A388946J02367J12949J23714J33869J42733J50212J56450J61453J65314
50840B638007J68058J68787J65629J57225J43814J26498J06185Q3853O0996L8847
50830C857899J7769j755j8315l0733l9446m5521m8767m8066m3352l5955k7197
50819C536561j7879r228l125r81l210r847k0730l4816n0204o5343p9828r3952
50807C147418j07969j21672j34056j43377j48295j49083j47091j43106j36946
50798A915823j28699j19368j09938j00519r0825q0903p1107o1798n3387m6229
50788A053050m0147l4466k8838k3671j9414j5779j2096q346n380l960l811l826
50776H53316l242k372k062k591l576m719o037p279p849p713p694q378r243r380
$$ plain form
50762 771181 762499 754854 748283 742750 737970 733606 729926 727828 727909 729977 733691 739150 746583 756010 767714
50747 767714 782533 801030 822663 846331 871682 899446 930613 965749 1004985 1048251 1095406
50736 1095406 1146512 1202128 1263174 1330347 1403611 1482303 1565789 1654028 1747313 1845256 1946195
50725 1946195 2047938 2149005 2248675 2345775 2437844 2521653 2594208 2653145 2696654 2723442 2732742
50714 2732742 2724380 2699173 2659448 2608950 2552036 2492883 2435099 2381439 2333608 2292540 2258882
50703 2258882 2232958 2214433 2202364 2195434 2191618 2187811 2180543 2167154 2145780 2114435 2071209 2015674
50691 2015674 1949304 1874167 1791972 1704714 1615209 1526233 1439675 1357044 1280077 1210069 1147076
50680 1147076 1090531 1040230 996081 957435 923542 894412 870472 851600 837253 827325 822118 821523
$$ packed form
50762G71181q682p645o571n533m780m364l680k098Q1K068L714N459P433R427J1704
50747G67714J4819J8497K1633K3668K5351K7764L1167L5136L9236M3266M7155
50736A095406N1106N5616O1046O7173P3264P8692Q3486Q8239R3285R7943J00939
50725A946195J01743J01067R9670R7100R2069Q3809P2555N8937M3509K6788R300
50714B732742q362k5207l9725n0498n6914n9153n7784n3660m7831m1068l3658
50703B258882k5924j8525j2069o930l816l807p268j3389k1374l1345m3226n5535
50691B015674o6370p5137q2195q7258q9505q8976q6558q2631p6967p0008o2993
50680A147076n6545n0301m4149l8646l3893k9130k3940j8872j4347r928n207n95
$$ plain form
50668 821523 824945 832023 842695 856458 872200 888913 906179 923849 941645 959179 976009 991648
50656 991648 1005838 1018847 1031237 1043410 1055656 1068472 1082388 1097519 1113702 1131085 1150228
50645 1150228 1171630 1195522 1222121 1251756 1284701 1321223 1361802 1406911 1456390 1509274 1564361
50634 1564361 1620792 1678005 1735327 1791758 1846049 1896880 1943020 1983432 2017393 2044622 2065215
50623 2065215 2079315 2087010 2088786 2085933 2080026 2072082 2062753 2053394 2046164 2042698 2043242 2047499 2055689 2068084
50609 2068084 2083989 2101897 2120417 2138364 2154241 2166540 2174607 2178518 2177966 2171865 2159073 2138832
50597 2138832 2110362 2072863 2026403 1972326 1912281 1847179 1777556 1704720 1630893 1558112 1487303
50586 1487303 1418561 1352074 1288619 1229188 1174349 1124013 1077772 1035321 996590 961569 930193
$$ packed form
50668H21523L422P078J0672J3763J5742J6713J7266J7670J7796J7534J6830J5639
50656I91648J4190J3009J2390J2173J2246J2816J3916J5131J6183J7383J9143
50645A150228K1402K3892K6599K9635L2945L6522M0579M5109M9479N2884N5087
50634A564361N6431N7213N7322N6431N4291N0831M6140M0412L3961K7229K0593
50623B065215J4100P695J776k853n907p944r329r359p230l466N44M257Q190J2395
50609B068084J5905J7908J8520J7947J5877J2299Q067L911n52o101j2792k0241
50597B138832k8470l7499m6460n4077o0045o5102o9623p2836p3827p2781p0809
50586A487303o8742o6487o3455n9431n4839n0336m6241m2451l8731l5021l1376
$$ plain form
50575 930193 902398 878197 857598 840434 826327 814933 806235 800504 797886 798158 800935 805964 813046
50562 813046 821914 832446 844824 859190 875272 892706 911557 932117 954356 978117 1003778 1032029
50550 1032029 1062928 1095748 1129974 1165822 1203492 1242394 1281463 1319849 1357090 1393078 1428169
50539 1428169 1462856 1497035 1530008 1561570 1592687 1624867 1659321 1696966 1738581 1784435 1834267
50528 1834267 1888247 1947563 2013512 2086298 2165201 2249496 2338643 2431902 2528312 2626806 2725818
50517 2725818 2823152 2916864 3006016 3089901 3166728 3233687 3288188 3328562 3353831 3363533 3357726 3336652
50505 3336652 3300518 3250026 3186938 3113529 3031784 2943762 2852521 2761907 2675486 2596343 2527535
50494 2527535 2471677 2429807 2401495 2386277 2384215 2394811 2416240 2446077 2482104 2521775 2561370
$$ packed form
50575I30193k7795k4201k0599j7164j4107j1394q698n731k618K72K777N029P082
50562H13046Q868J0532J2378J4366J6082J7434J8851K0560K2239K3761K5661K8251
50550A032029L0899L2820L4226L5848L7670L8902L9069L8386L7241L5988L5091
50539A428169L4687L4179L2973L1562L1117L2180L4454L7645M1615M5854M9832
50528A834267N3980N9316O5949P2786P8903Q4295Q9147R3259R6410R8494R9012
50517B725818R7334R3712Q9152Q3885P6827O6959N4501M0374K5269R702n807k1074
50505C336652l6134n0492o3088p3409q1745q8022r1241r0614q6421p9143o8808
50494B527535n5858m1870k8312j5218k062J0596K1429K9837L6027L9671L9595
$$ plain form
50483 2561370 2596257 2621813 2633882 2629034 2605224 2562326 2501665 2425111 2334913 2234203 2127005
50472 2127005 2017325 1908234 1801755 1699339 1602172 1511097 1426574 1348903 1278390 1215139
50462 1215139 1158846 1109032 1065369 1027521 994767 966281 941780 921450 905137 892164 882060
50451 882060 874893 870649 868980 869990 874572 883240 895084 908590 923165 939161 956816 976046 997119
50438 997119 1020553 1046168 1072985 1100289 1128344 1157937 1189646 1223569 1259217 1295562 1331591
50427 1331591 1366935 1401682 1435687 1468455 1499583 1528802 1555656 1579697 1601040 1620252 1637645
50416 1637645 1653188 1667182 1680566 1694434 1709545 1726332 1744973 1765440 1787811 1812516 1839901
50405 1839901 1869640 1900944 1933224 1966103 1998882 2030536 2060153 2086833 2109257 2125965 2136164
$$ packed form
50483B561370L4887K5556J2069m848k3810m2898o0661p6554r0198j00710j07198
50472B127005j09680j09091j06479j02416r7167r1075q4523p7671p0513o3251
50462A215139n6293m9814m3663l7848l2754k8486k4501k0330j6313j2973j0104
50451H82060p167m244j669J010M582Q668J1844J3506J4575J5996J7655J9230K1073
50438I97119K3434K5615K6817K7304K8055K9593L1709L3923L5648L6345L6029
50427A331591L5344L4747L4005L2768L1128K9219K6854K4041K1343J9212J7393
50416A637645J5543J3994J3384J3868J5111J6787J8641K0467K2371K4705K7385
50405A839901K9739L1304L2280L2879L2779L1654K9617K6680K2424J6708J0199
$$ plain form
50394 2136164 2139730 2136381 2125373 2105920 2077377 2039120 1991023 1934205 1870669 1802122 1729860 1655820
50382 1655820 1582770 1513052 1447884 1388295 1335921 1292165 1257131 1230190 1211324 1201174 1199850
50371 1199850 1206246 1218638 1235500 1255592 1277460 1299024 1317676 1330820 1336417 1333218 1320836 1299876
50359 1299876 1271800 1238328 1200903 1160799 1119423 1078102 1037681 998650 961478 926453 893422
50348 893422 862231 833259 806934 782927 760511 739621 720855 704480 690277 678397 669378 662946
50336 662946 657662 652435 647857 645478 646080 649066 653254 657901 663170 669873 678599 689025 700366 712450
50322 712450 725842 740817 756843 773325 790325 808140 826656 845545 864825 884890 906159
50311 906159 928867 952937 977929 1003355 1028968 1054259 1077744 1097551 1113049 1125343 1135854
$$ packed form
50394B136164L566l349j1008j9453k8543l8257m8097n6818o3536o8547p2262p4040
50382A655820p3050o9718o5168n9589n2374m3756l5034k6941j8866j0150j324
50371A199850O396J2392J6862K0092K1868K1564J8652J3144N597l199j2382k0960
50359A299876k8076l3472l7425m0104m1376m1321m0421l9031l7172l5025l3031
50348H93422l1191k8972k6325k4007k2416k0890j8766j6375j4203j1880r019o432
50336F62946n284n227m578k379O02K986M188M647N269O703Q726J0426J1341J2084
50322G12450J3392J4975J6026J6482J7000J7815J8516J8889J9280K0065K1269
50311I06159K2708K4070K4992K5426K5613K5291K3485J9807J5498J2294J0511
$$ plain form
50300 1135854 1144931 1152120 1157129 1159922 1160335 1158163 1153407 1146114 1136297 1124323 1111033 1097130 1082728
50287 1082728 1067735 1052260 1036322 1019603 1001896 983513 964911 946229 927501 908945 890715
50276 890715 872669 854755 837319 820783 805266 790701 776899 763329 749403 735283 721869
50265 721869 709711 698553 688305 679672 673132 668017 663434 659606 657326 656439 655933 655549 656299 659141
50251 659141 663763 668932 673645 677751 681853 686699 692435 698423 704027 709426 715298 721805 728288 733867
50237 733867 737980 740392 741202 740953 740374 739757 738668 736316 732191 726509 720162 714091 708585 703286 697890
50222 697890 692502 687258 682087 677143 672963 669735 666850 663816 661331 660779 662698 666249 670182 673810
50208 673810 677040 680006 682937 686128 689799 694001 698524 702797 706133 708384 710202 712294 714550 716210
$$ packed form
50300A135854R077P189N009K793M13k172m756p293r817j1974j3290j3903j4402
50287A082728j4993j5475j5938j6719j7707j8383j8602j8682j8728j8556j8230
50276H90715j8046j7914j7436j6536j5517j4565j3802j3570j3926j4120j3414
50265G21869j2158j1158j0248q633o540n115m583l828k280q87n06l84P50K842
50251F59141M622N169M713M106M102M846N736N988N604N399N872O507O483N579
50237G33867M113K412Q10k49n79o17j089k352m125n682o347o071n506n299n396
50222F97890n388n244n171m944m180l228k885l034k485n52J919L551L933L628
50208F73810L230K966K931L191L671M202M523M273L336K251J818K092K256J660
$$ plain form
50194 716210 716772 716368 715265 713428 710589 706510 701126 694642 687500 680093 672543 664846 657053 649122 640815
50179 640815 632015 622965 613880 604509 594504 584151 574377 565951 558936 552973 547877 543854 541225 540027
50165 540027 539886 540348 541209 542306 543124 542987 541708 539649 537060 533775 529735 525259 520500 515126 508971
50150 508971 502595 496743 491556 486710 482019 477435 472820 468264 464364 461632 459756 457955 455925 453985
50136 453985 452448 451307 450433 449672 448858 448086 447791 448199 449062 450408 453141 458146 464916 471830 477763 482831
50120 482831 487610 492383 497334 502737 508550 514232 519228 523392 526833 529681 532115 534337 536403 538316
50106 538316 540213 542143 543745 544550 544615 544431 544214 543752 542994 542257 541698 541038 540143 539612 540462 543278 547679
50089 547679 552540 556837 560523 564571 570023 577139 585577 595029 605196 615488 625442 635374 645944
$$ packed form
50194G16210N62m04j103j837k839m079n384o484p142p407p550p697p793p931q307
50179F40815q800r050r085r371j0005j0353r774q426p015n963n096m023k629j198
50165E40027j41M62Q61J097Q18j37j279k059k589l285m040m476m759n374o155
50150E08971o376n852n187m846m691m584m615m556l900k732j876j801k030j940
50136D53985j537j141q74p61q14p72k95M08Q63J346K733N005O770O914N933N068
50120D82831M779M773M951N403N813N682M996M164L441K848K434K222K066J913
50106E38316J897J930J602Q05O5j84k17m62p58p37n59o60q95n31Q50K816M401
50089E47679M861M297L686M048N452P116Q438R452J0167J0292R954R932J0570
$$ plain form
50076 645944 657076 667972 678317 688805 700210 712496 725143 737815 750371 762629 774590
50065 774590 786591 798865 811108 822758 833519 843426 852624 861325 869828 878262 886435 894072 901140
50052 901140 907828 914330 920746 927051 933082 938668 943832 948692 953183 957131 960653 964090 967389 969841
50038 969841 970696 969860 967743 964620 960433 955141 948899 941784 933673 924665 915508 907213 900011 892937 884853
50023 884853 875900 867530 860960 855983 851536 847111 843132 840165 838257 837151 836826 837741 840620 845952 853568
50008 853568 862937 873949 887134 902896 920976 941125 963841 989698 1018113 1047487 1076551 1104815
49996 1104815 1131665 1155809 1175941 1191402 1201919 1207470 1208917 1208175 1206941 1205392 1202711 1198752 1194614
49983 1194614 1191424 1188989 1185806 1180066 1170376 1155726 1135264 1108538 1076031 1039260 1000104 960001
$$ packed form
50076F45944J1132J0896J0345J0488J1405J2286J2647J2672J2556J2258J1961
50065G74590J2001J2274J2243J1650J0761R907R198Q701Q503Q434Q173P637P068
50052I01140O688O502O416O305O031N586N164M860M491L948L522L437L299K452
50038I69841Q55q36k117l123m187n292o242p115q111r008r157q295p202p074q084
50023H84853q953q370o570m977m447m425l979k967j908j106l25R15K879N332P616
50008H53568R369J1012J3185J5762J8080K0149K2716K5857K8415K9374K9064K8264
49996A104815K6850K4144K0132J5461J0517N551J447p42j234j549k681l959m138
49983A194614l190k435l183n740r690j4650k0462k6726l2507l6771l9156m0103
$$ plain form
49971 960001 919843 880503 843155 808931 778403 751465 727677 706598 687813 670775 654883
49960 654883 639913 626275 614556 604749 596154 588063 580240 572582 564743 556378 547578 538768 530344
49947 530344 522577 515546 508957 502317 495623 489499 484302 479443 474067 468126 462252 456871 452039 447912
49933 447912 444689 442094 439578 437017 434727 432923 431770 431834 433678 436835 439882 441753 442498 442718 442921
49918 442921 443616 445326 448099 451466 455146 459318 464021 468867 473591 478318 482928 486773 489511 491726
49904 491726 494297 497517 501336 505998 511823 518616 525860 533429 541629 550702 560742 572021 584894
49891 584894 599404 615429 633365 654316 679389 708924 742413 778940 817577 857529 898086
49880 898086 938511 977925 1015235 1049235 1079017 1104572 1127014 1148060 1169139 1190926 1213505
$$ packed form
49971I60001m0158l9340l7348l4224l0528k6938k3788k1079j8785j7038j5892
49960F54883j4970j3638j1719r807q595q091p823p658p839q365q800q810q424
49947E30344p767p031o589o640o694o124n197m859n376n941n874n381m832m127
49933D47912l223k595k516k561k290j804j153O4J844L157L047J871P45K20K03
49918D42921O95J710K773L367L680M172M703M846M724M727M610L845K738K215
49904D91726K571L220L819M662N825O793P244P569Q200R073J0040J1279J2873
49891E84894J4510J6025J7936K0951K5073K9535L3489L6527L8637L9952M0557
49880H98086M0425L9414L7310L4000K9782K5555K2442K1046K1079K1787K2579
$$ plain form
49869 1213505 1236674 1260103 1283359 1305806 1326324 1343220 1354624 1359063 1355692 1344194 1324756 1298072
49857 1298072 1265224 1227622 1187017 1145073 1102632 1059783 1017001 975664 936781 899764 863357
49846 863357 827558 793562 761916 731944 703262 676682 653043 632070 613087 596103 581305
49835 581305 568098 555573 543625 532816 523253 514355 505670 497304 489476 482224 475647 469953 465066
49822 465066 460458 455520 449978 443947 437829 432234 427804 424833 422995 421474 419594 417440 415779 415190
49808 415190 415404 415728 415958 416474 417515 418824 420082 421262 422453 423748 425374 427527 429953 432153 434103
49793 434103 436239 438524 440088 440205 439183 437908 436863 436023 435367 435058 435293 436310 438324 441143 444034
49778 444034 446325 448071 449972 452806 457049 462682 469215 476187 483842 493022 504242 517269 531822
$$ packed form
49869A213505K3169K3429K3256K2447K0518J6896J1404M439l371j1498j9438k6684
49857A298072l2848l7602m0605m1944m2441m2849m2782m1337l8883l7017l6407
49846H63357l5799l3996l1646k9972k8682k6580k3639k0973j8983j6984j4798
49835E81305j3207j2525j1948j0809r563q898q685q366p828p252o577n694m887
49822D65066m608m938n542o031o118n595m430k971j838j521j880k154j661n89
49808D15190K14L24K30N16J041J309J258J180J191J295J626K153K426K200J950
49793D34103K136K285J564J17j022j275j045q40o56l09K35J017K014K819K891
49778D44034K291J746J901K834M243N633O533O972P655R180J1220J3027J4553
$$ plain form
49765 531822 548164 566726 587664 611166 637661 667151 698669 730906 763085 794645 824460
49754 824460 851038 873407 891336 904930 914753 922321 929749 938620 949408 961904 975653 989800
49742 989800 1002919 1013210 1018841 1018234 1010429 995307 973377 945449 912698 876828 839738 802927
49730 802927 767483 734496 705050 679607 657641 638127 620378 604415 590604 579005 569066 560029
49718 560029 551587 543962 537358 531571 526261 521358 517030 513394 510401 507809 505187 502198 499069 496578
49704 496578 495359 495322 495834 496326 496670 497163 498200 499741 501155 501908 502298 503031 504165 505126 505795 506672 507684
49687 507684 507809 506579 505122 504800 505376 505545 504951 504554 505041 505929 506523 506836 507065 506832 505635 503848 502687
$$ packed form
49765E31822J6342J8562K0938K3502K6495K9490L1518L2237L2179L1560K9815
49754H24460K6578K2369J7929J3594R823P568P428Q871J0788J2496J3749J4147
49742I89800J3119J0291N631o07p805j5122k1930k7928l2751l5870l7090l6811
49730H02927l5444l2987k9446k5443k1966j9514j7749j5963j3811j1599r939r037
49718E60029q442p625o604n787n310m903m328l636k993k592k622k989l129k491
49704D96578j219l7N12M92L44M93J037J541J414P53L90P33J134R61O69Q77J012
49687E07684J25j230j457l22N76J69n94l97M87Q88N94L13K29k33j197j787j161
$$ [...]
##END NTUPLES=NMR SPECTRUM
##END=
