
##TITLE=AC1305_DOMAH11117_6613836_ogVs06oHye
##JCAMPDX= 6.0         $$ Bruker NMR JCAMP-DX V2.0
##DATA TYPE= NMR SPECTRUM
##DATA CLASS= NTUPLES
##ORIGIN= BRUKER
##OWNER= Administrator
$$ 1.72 TOPSPIN		Version 2.1
$$ 2012-08-02 13:33:52.265 -0500  Administrator@TOPSPIN
$$ Compression mode = diff/dup
##.OBSERVE FREQUENCY= 400.02188249412
##.OBSERVE NUCLEUS= ^1H
##.ACQUISITION MODE= SIMULTANEOUS (DQD)
##.ACQUISITION SCHEME= undefined
##.AVERAGES= 8
##.DIGITISER RES= 22
##SPECTROMETER/DATA SYSTEM= spect
##.PULSE SEQUENCE= zg30
##.SOLVENT NAME= COFFEE_meoh
##.SHIFT REFERENCE= INTERNAL, COFFEE_meoh, 1, 14.98509
##AUDIT TRAIL= $$ (NUMBER, WHEN, WHO, WHERE, PROCESS, VERSION, WHAT)
$$ ##TITLE= Audit trail, TOPSPIN		Version 2.1
$$ ##JCAMPDX= 5.01
$$ ##ORIGIN= Bruker BioSpin GmbH
$$ ##OWNER= Administrator
$$ $$ C:\Bruker\TOPSPIN/data/COFFEE/nmr/AC1305_DOMAH11117_6613836_ogVs06oHye/10/pdata/1/auditp.txt
$$ ##AUDIT TRAIL=  $$ (NUMBER, WHEN, WHO, WHERE, PROCESS, VERSION, WHAT)
(   1,<2012-08-02 13:33:44.656 -0500>,<Administrator>,<TOPSPIN>,<go>,<TOPSPIN 2.1>,
      <created by zg
	started at 2012-08-02 13:32:37.203 -0500,
	POWCHK enabled, PULCHK disabled,
       configuration hash MD5:
       6B 1B 68 BB D9 2E 58 E2 7F 35 AD 54 07 DF 0E 41
       data hash MD5: 64K
       22 86 2A 00 49 78 DC F2 62 82 F7 5F 0A 82 AD D5>)
(   2,<2012-08-02 13:33:47.281 -0500>,<Administrator>,<TOPSPIN>,<proc1d>,<TOPSPIN 2.1>,
      <Start of raw data processing
       efp LB = 0 FT_mod = 6 PKNL = 1 PHC0 = 0 PHC1 = 0 SI = 32K 
       data hash MD5: 32K
       6D 31 65 D0 D4 CF 33 6C 20 C2 65 54 17 E1 23 C5>)
(   3,<2012-08-02 13:33:47.640 -0500>,<Administrator>,<TOPSPIN>,<proc1d>,<TOPSPIN 2.1>,
      <pk PHC0 = 181.7633 PHC1 = 0 
       data hash MD5: 32K
       18 BB 39 B3 6A 9B FE 96 CB 9E 8F F5 AA 4F EF 14>)
(   4,<2012-08-02 13:33:47.781 -0500>,<Administrator>,<TOPSPIN>,<proc1d>,<TOPSPIN 2.1>,
      <abs ABSG = 1 
       data hash MD5: 32K
       C7 BD 6E 09 06 03 09 7C A1 36 98 C8 2F 69 18 5E>)
(   5,<2012-08-02 13:33:47.859 -0500>,<Administrator>,<TOPSPIN>,<proc1d>,<TOPSPIN 2.1>,
      <abs ABSG = 2 
       data hash MD5: 32K
       4B E7 63 8C A5 03 12 11 CF 90 90 AE 40 AF 00 3C>)
(   6,<2012-08-02 13:33:47.953 -0500>,<Administrator>,<TOPSPIN>,<proc1d>,<TOPSPIN 2.1>,
      <abs ABSG = 3 
       data hash MD5: 32K
       B9 D1 17 56 39 AE 16 DD 1D EF 18 D1 02 92 A9 64>)
(   7,<2012-08-02 13:33:48.046 -0500>,<Administrator>,<TOPSPIN>,<proc1d>,<TOPSPIN 2.1>,
      <abs ABSG = 4 
       data hash MD5: 32K
       CD 6B F5 00 2A A9 00 59 9E 52 48 94 2C 0E 49 FD>)
(   8,<2012-08-02 13:33:48.109 -0500>,<Administrator>,<TOPSPIN>,<proc1d>,<TOPSPIN 2.1>,
      <abs ABSG = 5 
       data hash MD5: 32K
       8B BC 45 88 1E 71 79 BB BC E9 1E 90 41 D2 8F 34>)
$$ ##END=
$$ 
$$ $$ hash MD5
$$ $$ CC FC DF EA FC B9 87 81 C1 81 51 CB B3 77 97 02
##$RELAX= 
##$RELAX= 
##$RELAX= 
##$RELAX= 
##$RELAX= 
##$RELAX= 
##$RELAX= 
$$ Bruker specific parameters
$$ --------------------------
$$ [...]
##$TP= (0..7)
150 150 150 150 150 150 150 150
##$TP07= 0
##$TPNAME0= <>
##$TPNAME1= <>
##$TPNAME2= <>
##$TPNAME3= <>
##$TPNAME4= <>
##$TPNAME5= <>
##$TPNAME6= <>
##$TPNAME7= <>
##$TPOAL= (0..7)
0.5 0.5 0.5 0.5 0.5 0.5 0.5 0.5
##$TPOFFS= (0..7)
0 0 0 0 0 0 0 0
##$TUNHIN= 0
##$TUNHOUT= 0
##$TUNXOUT= 0
##$USERA1= <user>
##$USERA2= <user>
##$USERA3= <user>
##$USERA4= <user>
##$USERA5= <user>
##$V9= 5
##$VALIST= <valist>
##$VCLIST= <CCCCCCCCCCCCCCC>
##$VD= 0
##$VDLIST= <DDDDDDDDDDDDDDD>
##$VPLIST= <PPPPPPPPPPPPPPP>
##$VTLIST= <TTTTTTTTTTTTTTT>
##$WBST= 1024
##$WBSW= 4
##$XGAIN= (0..3)
0 0 0 0
##$XL= 0
##$YL= 0
##$YMAX_a= 481288
##$YMIN_a= -632036
##$ZGOPTNS= <>
##$ZL1= 120
##$ZL2= 120
##$ZL3= 120
##$ZL4= 120
##$ABSF1= 14.98509
##$ABSF2= -5.573092
##$ABSG= 5
##$ABSL= 3
##$ALPHA= 0
##$AQORDER= 0
##$ASSFAC= 0
##$ASSFACI= 0
##$ASSFACX= 0
##$ASSWID= 0
##$AUNMP= <proc_prof1d_extract_pilot.lims>
##$AXLEFT= 0
##$AXNAME= <>
##$AXNUC= <1H>
##$AXRIGHT= 0
##$AXTYPE= 0
##$AXUNIT= <>
##$AZFE= 0.1
##$AZFW= 0.1
##$BCFW= 0
##$BC_mod= 0
##$BYTORDP= 0
##$COROFFS= 0
##$CY= 15
##$DATMOD= 1
##$DC= 0
##$DFILT= <>
##$DTYPP= 0
##$F1P= 0
##$F2P= 0
##$FCOR= 0.5
##$FTSIZE= 32768
##$FT_mod= 6
##$GAMMA= 0
##$GB= 0
##$INTBC= 1
##$INTSCL= 1
##$ISEN= 128
##$LB= 0
##$LEV0= 0
##$LPBIN= 0
##$MAXI= 10000
##$MC2= 0
##$MEAN= 0
##$ME_mod= 0
##$MI= 0
##$NCOEF= 0
##$NC_proc= -8
##$NLEV= 6
##$NOISF1= 0
##$NOISF2= 0
##$NSP= 0
##$NTH_PI= 0
##$NZP= 0
##$OFFSET= 14.98509
##$PC= 1
##$PHC0= 181.7633
##$PHC1= 0
##$PH_mod= 1
##$PKNL= yes
##$PPARMOD= 0
##$PPDIAG= 0
##$PPIPTYP= 0
##$PPMPNUM= 2147483647
##$PPRESOL= 1
##$PSCAL= 4
##$PSIGN= 0
##$PYNMP= <proc.py>
##$REVERSE= no
##$SF= 400.02
##$SI= 32768
##$SIGF1= 0
##$SIGF2= 0
##$SINO= 400
##$SIOLD= 32768
##$SPECTYP= <>
##$SREGLST= <1H.CDCl3>
##$SSB= 0
##$STSI= 32768
##$STSR= 0
##$SW_p= 8223.68421052631
##$SYMM= 0
##$S_DEV= 0
##$TDeff= 65536
##$TDoff= 0
##$TI= <>
##$TILT= no
##$TM1= 0
##$TM2= 0
##$TOPLEV= 0
##$USERP1= <user>
##$USERP2= <user>
##$USERP3= <user>
##$USERP4= <user>
##$USERP5= <user>
##$WDW= 1
##$XDIM= 32768
##$YMAX_p= 455076810
##$YMIN_p= -693426
##$CURPLOT= <Network HP LaserJet P1505>
##$CURPRIN= <$Network HP LaserJet P1505>
##$DFORMAT= <normdp>
##$LAYOUT= <+/1D_H.xwp>
##$LFORMAT= <normlp>
##$PFORMAT= <normpl>
##$SURQMSG= 1
$$ End of Bruker specific parameters
$$ ---------------------------------
##NTUPLES= NMR SPECTRUM
##VAR_NAME=  FREQUENCY,     SPECTRUM/REAL,   SPECTRUM/IMAG
##SYMBOL=    X,             R,               I
##VAR_TYPE=  INDEPENDENT,   DEPENDENT,       DEPENDENT
##VAR_FORM=  AFFN,          ASDF,            ASDF
##VAR_DIM=   32768,         32768,           32768
##UNITS=     HZ,            ARBITRARY UNITS, ARBITRARY UNITS
##FACTOR=    0.250966925370066, 1,           1
##FIRST=     8223.43324360094, 92180,        -86013
##LAST=      0,             76986,           -91380
##MIN=       0,             -693426,         0
##MAX=       8223.43324360094, 455076810,    0
$$ Real data points
##PAGE= N=1
##DATA TABLE= (X++(R..R)), XYDATA
$$ [...]
$$ plain form
19458 -442323 324988 -271656 -55881 -118477 -59258 -341748 230476 -212848 -259501 -193745
19448 -193745 -278794 -215621 78850 309269 -173974 -325454 -420643 134286 14118 -164392
19437 192823 55574 -29297 -241590 114146 -173588 -350943 -265725 -169914 -211180 -233996 -85686
19425 -186767 -430740 -38871 -140738 49276 -45691 611180 -389053 201010 -333145 -160165
19414 22670 -180280 -54204 -267964 -14904 23231 -58923 -98667 17510 -324029 22628 -119266
19402 -131661 -109338 183485 -144572 8759 -265119 141057 134580 -133147 -66069 -29516 -76273
19391 -76273 57593 452076 -49459 427247 335151 55541 1499 -270213 -205862 179115 37585
19379 16688 160903 -159627 113724 112286 -64950 210569 -454331 41083 142795 106997 104103
$$ packed form
19458d42323C24988b71656e5881o2596N9219k82490B30476b12848m6653O5756
19448a93745q5049O3173G8850K30419a73974j51480r5189A34286A4118a64392
19437A92823E5574b9297k12293A14146a73588j77355Q5218R5811m1266k2816h5686
19425a86767k43973c8871j01867D9276d5691F11180c89053B01010c33145a60165
19414B2670a80280e4204k13760a4904B3231e8923l9744A7510c24029B2628a19266
19402a31661K2323A83485a44572H759b65119A41057o477a33147f6069b9516m6757
19391g6273E7593L94483d9459D27247r2096E5541A499b70213O4351A79115C7585
19379A6688J44215a59627A13724j438f4950B10569d54331D1083J01712l5798k894
$$ plain form
19368 104103 -179373 -93218 58798 60711 -152118 -415976 -211948 -119282 -65009 -102987 74319
19356 -211670 107855 -155134 -228894 -38152 -234237 -8864 343558 113912 14783 -194793
19345 -39866 151859 179617 -147033 -118382 -74993 2983 -42919 182792 -180716 99386 223157
19334 223157 -51549 -271774 187218 -204226 173225 -349928 -60557 -274893 -201754 76524
19323 -77578 -73609 -111667 -21009 -46424 -14953 -64650 172892 71017 101964 -451780 -135398
19311 -70584 -109365 -149248 -313335 -188238 -152221 152485 -205348 6348 -285627 127345 -228248
19299 -507716 88036 102982 -348763 -137801 -178521 163751 -172123 -175480 -92851 -214614 -188666
19288 -188666 219097 -197457 -166307 327098 -321219 25575 -298669 -122742 54417 -251515
$$ packed form
19368A04103a79373Q6155E8798J913a52118k63858K04028R2666N4273l7978G4319
19356b11670A07855a55134p3760c8152j96085h864C43558A13912A4783a94793
19345c9866A51859K7758a47033K8651M3389B983d2919A82792a80716I9386J23771
19334B23157e1549k20225A87218b04226A73225c49928f0557k14336P3139G6524
19323g7578L969l8058b1009k5415a4953m9697A72892G1017L0947d51780a35398
19311g0584l8781l9883j64087J25097L6017A52485b05348F348b85627A27345b28248
19299e07716H8036J4946c48763a37801m0720A63751a72123l357Q2629j21763K5948
19288a88666B19097a97457L1150C27098c21219B5575b98669a22742E4417b51515
$$ plain form
19277 -33819 44776 -132658 -13730 -336211 6156 -187879 -40720 6673 -97792 91782 -3423 -172889
19265 -172889 -153421 23739 -65424 -299768 -155886 -217535 19350 -12198 -112053 -146385 6409
19253 -14398 -106116 -128573 -56807 46852 -285562 153119 -110260 -107800 -134894 -449748 -120172
19241 -14691 -225949 -233679 -287230 -29555 -34209 71396 -249558 -189273 -259988 -267006 -157100 -138627
19229 -138627 -235521 -435116 165109 -156501 -44213 -251095 157496 170622 -346259 -303349
19219 -303349 -109811 77390 165003 7480 -13517 -113864 -294573 116756 -267493 -182782 -179361
19208 -179361 54712 -64 -205595 -120306 -68070 145727 -106378 -350248 -215663 -50234 -74931
19197 -74931 -22649 -183057 -10371 57106 -170483 1167 -106074 -237788 87104 -2232 -252434
$$ packed form
19277c3819D4776a32658a3730l22481F156a87879d0720F673i7792I1782c423j69466
19265a72889J9468B3739f5424k34344J43882o1649A9350a2198r9855l4332F409
19253a4398r1718k2457e6807D6852b85562A53119a10260K460k7094l14854a20172
19241a4691k11258p730n3551b9555m654G1396b49558O0285p0715p018J09906J8473
19229a38627r6894j99595A65109a56501d4213k06882A57496J3126c46259M2910
19219c03349a09811G7390Q7613G480a3517j00347j80709A16756b67493Q4711L421
19208a79361E4712f4k05531Q5289N2236A45727a06378k43870J34585e0234k4697
19197g4931b2649j60408a0371E7106a70483A167a06074j31714H7104b232k50202
$$ plain form
19186 -252434 -276229 -204636 -57152 -93601 28624 -269325 -25039 -265964 -262181 46953 287826
19175 287826 -320926 -338217 11476 -183989 -185601 -4318 -194806 -350336 -394 -148861 407287
19163 -193639 50049 -128709 47004 80014 -35616 87066 -120895 17025 -40232 -245791 -216933
19152 -216933 -183041 1580 125344 -39789 278309 -24098 70337 72645 -251973 -175200 133972
19140 -201511 56733 53322 -199514 226992 -184417 -92942 81536 -39094 -68147 -277315 -250847
19129 -250847 -164871 126564 -97997 64447 -16584 142409 26249 87411 -185511 37827 -130618
19117 28793 -64320 -105013 -223917 -53155 -248674 -316646 -64643 -62562 -269123 7798 -78996
19105 52849 -31828 -165548 -94181 16976 162226 -211791 108729 57173 -153731 -182162 -4138
$$ packed form
19186b52434k3795P1593e7152l6449B8624b69325b5039k40925L783D6953K40873
19175B87826c20926j7291A1476a83989j612d318j90488j55530c94j48467D07287
19163a93639E0049a28709D7004L3010c5616H7066a20895A7025d0232k05559K8858
19152b16933L3892A580J23764c9789B78309b4098G0337K308b51973P6773A33972
19140b01511E6733l411a99514B26992a84417R1475H1536c9094k9053k09168K6468
19129b50847Q5976A26564i7997F4447a6584A42409B6249O1162a85511C7827a30618
19117B8793f4320m0693j18904e3155j95519o7972f4643K081k06561G798g8996
19105E2849c1828j33720P1367A6976J45250b11791A08729n1556a53731k8431d138
$$ plain form
19093 202145 -276326 -32019 86406 -253994 241590 11751 178430 33868 93060 -35315 100851
19081 -169504 76463 -210043 -105531 157506 -212495 112249 39945 107176 -230429 123385
19070 12179 45565 28047 16641 65385 11560 -44287 -36544 -13028 181305 -17449 -64127 -49356
19058 -49356 295211 -200432 -110153 -107490 -232966 -101238 169383 44219 -376392 -6823 -2387
19046 47646 -173404 -111132 -393685 1951 -34723 -69056 17297 111212 -25294 -22864 315613
19034 -111502 -98164 -279052 -221872 -97505 -84755 59379 482965 154054 86848 157131 -87512
19022 55365 230718 57131 190853 216518 14491 236587 440395 -22697 -55015 193582 -138688
19010 -81993 -96796 -194692 -258085 -24464 -14866 -242195 -20837 54658 -180799 144270 -17702
$$ packed form
19093B02145b76326c2019H6406b53994B41590A1751J66679C3868N9192c5315A00851
19081a69504G6463b10043J04512A57506b12495A12249C9945O7231b30429A23385
19070A2179L3386j7518j1406M8744A1560d4287P743a3028A81305a7449m6678J4771
19058d9356B95211b00432R0279K663j25476a01238A69383D4219c76392f823b387
19046D7646a73404O2272k82553A951c4723l4333A7297R3915b5294K430C15613
19034a11502J3338j80888N7180i7505J2750E9379M23586A54054o7206P0283h7512
19022E5365J75353E7131J33722K5665A4491K22096K03808b2697l2318A93582a38688
19010h1993j4803r7896o3393b4464R598k27329b0837E4658a80799A44270a7702
$$ plain form
18998 108021 56097 -58467 10286 -221019 -125182 -304856 -4566 46037 -81145 -31275 -255657
18987 -255657 -115872 48334 -207841 -212299 180108 179894 -123476 -115414 210769 99036 -185872
18975 -20815 42070 314693 494390 309913 630433 345021 63641 -67340 -163356 47920 -103411
18963 -115261 29902 -23133 -277156 -135203 -40541 101151 103946 -130819 63808 60630 -188451
18951 -113460 28894 -347741 249226 -214652 -67074 129707 -260049 -255692 -72624 141526
18940 28544 -66271 -104897 -223473 147966 222049 -117796 -201752 -385351 -55335 351080 -87008
18928 13070 -105464 -35316 9227 199654 46830 -114084 79911 -117371 -141855 -15180 206807
18916 235452 -112153 128554 77800 -115819 -36505 195349 379511 511811 491001 510465
$$ packed form
18998A08021n1924e8467A0286b21019R5837j79674d566D6037h1145c1275k24382
18987b55657a15872D8334b07841m458A80108k14a23476Q062B10769I9036a85872
18975b0815D2070K72623J79697j84477L20520k85412F3641f7340r6016D7920a03411
18963a15261B9902b3133k54023a35203d0541A01151K795a30819F3808l178a88451
18951a13460B8894c47741B49226b14652f7074A29707b60049M357g2624A41526
18940B8544f6271l8626j18576A47966P4083a17796q3956j83599e5335C51080h7008
18928A3070a05464c5316I227J90427D6830a14084G9911a17371k4484a5180B06807
18916B35452a12153A28554n0754a15819c6505A95349J84162J32300k0810J9464
$$ plain form
18906 510465 193654 -15730 45068 -3869 -179660 -136317 -203927 -278825 13678 -17428 23743
18894 33325 -93864 -113885 17139 -10 -166666 -44274 144957 143874 -72448 -243240 -50843 -25269
18881 -379652 -218890 95877 -219100 88617 -224135 5586 -322783 306069 -464323 -134786
18870 -3441 94716 -72384 -133593 33299 -195465 -177292 -550653 -27849 -18824 28749 -44035 -296119
18858 -296119 -16994 -85696 19129 -264876 159265 -157967 -168338 -29679 -231949 -113962
18847 438683 146859 -54457 153740 -154063 -196106 -220315 240666 -212855 96330 133221
18837 133221 -76201 42140 87842 367741 -292494 -35893 -180595 -12664 -227244 -28936 160703
18825 -255348 58339 102573 -130537 -27384 116918 -324623 -182345 99299 -244707 -45937
$$ packed form
18906E10465A93654a5730D5068c869j75791M3343o7610p4898A3678a7428B3743
18894C3325i3864k0021A7139a0j66656d4274A44957j083g2448j70792e0843b5269
18881c79652J60762I5877b19100H8617b24135E586c22783C06069d64323a34786
18870c441I4716g2384o1209C3299a95465J8173l73361b7849R025B8749d4035k52084
18858b96119a6994o8702A9129b64876A59265a57967j0371b9679k02270a13962
18847D38683A46859e4457A53740a54063m2043k4209B40666b12855I6330L6891
18837A33221g6201D2140M5702K79899b92494c5893j44702a2664k14580b8936A60703
18825b55348E8339M4234a30537b7384A16918c24623J42278I9299b44707d5937
$$ plain form
18814 -138499 165003 -94753 -205663 87201 42736 -93051 221312 172935 -43428 252123 -110715
18802 209804 -149316 42244 -205661 -220223 -39664 105044 -65906 -337769 132019 -38664
18791 -104130 -201363 -21364 -85399 -11735 -191811 -166530 -82380 43923 -182736 39449 -129499
18779 189042 -263690 -357475 -168375 -185668 -193351 -3543 -181902 -101653 -174947 -53697 3259
18767 -181426 -174132 -18167 -162964 -193724 -135859 2831 140092 12195 7153 -110508 -69651
18756 -69651 -46753 -240575 24955 -276173 206190 -58434 6687 -123164 217194 -99189 135637
18744 51196 -240981 302776 -101744 -56908 38767 35496 -323189 -83062 249161 -234869 -72681
18732 -182908 -25687 74955 -37821 117171 -195586 -42325 255621 -253043 -283428 -129312
$$ packed form
18814a38499A65003i4753j10910H7201D2736i3051B21312m8377d3428B52123a10715
18802B09804a49316D2244b05661j4562c9664A05044f5906k71863A32019c8664
18791a04130r7233b1364o4035a1735j80076K5281h2380D3923a82736C9449a29499
18779A89042b63690r3785a68375j7293p683c543j78359Q0249p3294e3697C259
18767a81426P294a8167j44797l0760N7865B831J37261A2195n042a10508M0857
18756f9651K2898j93822B4955b76173B06190e8434F687a23164B17194i9189A35637
18744E1196b40981C02776a01744M4836C8767l271c23189h3062B49161b34869g2681
18732a82908b5687G4955c7821A17171a95586d2325B55621b53043l0385a29312
$$ plain form
18721 -71302 -171451 134293 69684 57959 75522 328183 -141120 -54499 -109445 -126465 24667
18709 322304 85609 -134875 -68171 -253063 39801 -385014 -175924 -92439 -37183 -36150 -85201
18698 -85201 332926 -329199 38423 -112858 -181893 -56925 -56736 15051 -137406 -99587 11983
18686 254681 3150 -123707 -104029 -269285 87133 -12025 -42025 -18109 -151603 93601 482978
18675 482978 -111003 -421600 23246 -263824 -16702 152842 -10038 29972 -25959 -385415
18665 -385415 131923 -442280 -172488 -86426 87353 262 3490 6131 -178062 -57905 -199640
18654 -199640 -163505 89069 -104256 -337172 -194573 -193759 -28727 -260890 -271546 23516 -198969
18642 -106604 -154796 249321 -27005 -79159 261430 -37172 16614 -153582 132130 -264844
$$ packed form
18721g1302j00149A34293o4609j1725J7563K52661a41120e4499n4946j7020B4667
18709C22304H5609a34875O6704j84892C9801c85014a75924Q3485c7183J033m9051
18698h5201C32926c29199C8423a12858o9035e6925J89A5051a37406L7819A1983
18686B54681C150a23707J9678j65256H7133a2025l0000a8109j33494I3601L89377
18675D82978a11003l10597B3246b63824a6702A52842a0038B9972b5959l59456
18665c85415A31923d42280a72488Q6062H7353B62L228K641a78062e7905j41735
18654a99640L6135H9069a04256k32916J42599Q14b8727k32163j0656B3516a98969
18642a06604m8192B49321b7005n2154B61430c7172A6614a53582A32130b64844
$$ plain form
18631 -47519 -207232 -45370 -12420 -269092 -131305 -50594 -300931 -143697 -178725 83807 -161897
18619 -78513 -88181 -144667 -130526 -262354 -7724 -200667 353079 -213192 -140442 185146 -188939
18607 -228658 112462 79232 -165601 -208385 -235567 -75502 3034 -381140 -106671 -14897 -98887
18596 -98887 147169 -281558 -82373 187166 -295692 122168 -155227 -221763 42713 62939
18586 62939 27784 390435 166395 -102988 -134585 55915 -138869 35038 -123325 132127
18575 213089 80618 -33311 -9791 -170255 52458 -273412 -20654 -168525 -161929 -277694 -32351
18563 -188698 -134450 -487661 -139006 -88932 318471 -102369 115935 -2499 27780 359725
18553 359725 576 205316 387309 141527 -39526 -148733 -26617 -155101 -142169 -74287 -317644
$$ packed form
18631d7519j59713d5370a2420k56672a31305e0594k50337a43697l5028H3807a61897
18619g8513r668n6486J4141j31828g724j92943C53079b13192P2750A85146a88939
18607b28658A12462l3230a65601m2784k7182g5502C034c81140a06671a4897q3990
18596i8887A47169b81558h2373A87166b95692A22168a55227o6536D2713K0226
18586F2939B7784L62651A66395a02988l1597E5915a38869C5038a23325A32127
18575B13089H0618c3311i791j60464E2458b73412b0654j47871O596j15765c2351
18563a88698N4248l53211a39006N0074C18471a02369A15935b499B7780L31945
18553C59725E76K04740J81993A41527c9526j09207b6617j28484J2932O7882k43357
$$ plain form
18542 -317644 -188201 58758 -238639 -233297 -36334 -122306 6978 130867 173482 24011 -116762
18530 206000 72065 138201 -32180 186840 -12676 -350667 134571 -234109 -225920 29139 -49960
18518 -33580 130321 -171789 -316811 253988 -109265 46355 -59633 -95826 108589 -370382
18507 -60045 -142226 122262 -157169 152051 -107546 140295 -16643 111114 -249386 247921
18496 -102388 5549 -44377 -163152 91023 -217516 -118073 -41176 -268555 -203873 -120463 -117304
18485 -117304 193711 80457 -288051 26649 37585 -4073 -48050 686723 133899 199885 13648
18473 -24820 -59024 -337070 -53800 -133195 6369 34326 -111654 19309 -98173 34045 -273241
18461 -66677 41145 -265570 -91068 25550 107466 44159 -95406 -329983 316919 -3855 -249895
$$ packed form
18542c17644J29443E8758b38639N342c6334q5972F978J23889M2615B4011a16762
18530B06000G2065O6136c2180A86840a2676l37991A34571b34109Q189B9139d9960
18518c3580A30321a71789j45022B53988a09265D6355e9633l6193A08589c70382
18507f0045q2181A22262a57169A52051a07546A40295a6643A11114b49386B47921
18496a02388E549d4377j18775I1023b17516R9443d1176k27379O4682Q3410L159
18485a17304A93711H0457b88051B6649J0936d073m3977F86723A33899O5986A3648
18473b4820l4204k78046e3800p9395F369K7957a11654A9309i8173C4045b73241
18461f6677D1145b65570i1068B5550Q1916D4159i5406k34577C16919c855k46040
$$ plain form
18450 -249895 -315821 -31856 419491 -163714 -45209 -353826 -149241 66971 -96123 -71559 -276136
18439 -276136 -323802 -101583 -104804 -9449 -8175 -123122 175114 -429086 -117434 159300 -79230
18427 199541 -258112 -94443 -2506 -156455 103635 -299148 9234 -148066 75951 150957 36830
18415 62339 -138805 -10301 240206 266147 -135798 -91022 167213 -136816 -188959 293082
18404 116173 -359263 -157218 -95514 -52204 -44491 265294 -35939 82167 -213271 85396 98511
18393 98511 -86121 7231 193109 -112542 152825 -217532 206251 121122 -332491 105819
18382 64411 -65326 -48715 331296 77262 -32692 158980 -180756 -420817 -236448 -448728
18372 -448728 -131430 -56935 -97716 -129140 28585 -204843 -293949 55090 120556 5662 126112
$$ packed form
18450b49895o5926c1856D19491a63714d5209l08617a49241F6971i6123K4564k04577
18439b76136m7666a01583l221i449J274j14947A75114d29086a17434A59300g9230
18427A99541b58112i4443b506j53949A03635b99148I234a48066G5951P5006C6830
18415F2339a38805a0301B40206K5941a35798M4776A67213a36816n2143B93082
18404A16173c59263a57218O1704M3310P713B65294c5939H2167b13271H5396J3115
18393I8511h6121G231J85878a12542A52825b17532B06251q5129c32491A05819
18382F4411f5326J6611C31296G7262c2692A58980a80756k40061J84369k12280
18372d48728a31430e6935m0781l1424B8585b04843q9106E5090O5466E662J20450
$$ plain form
18361 126112 62936 76994 210901 174044 -176489 -152864 135640 -23347 170488 147093 -261466
18349 -94457 -231272 -20891 6480 105296 -67541 -235723 59720 121088 -27869 14784 316054
18338 316054 -193056 32600 174855 -78447 -5298 -159372 -49439 59644 -225124 51332 -307358
18326 -267441 44113 67480 24048 -37059 -213024 398803 -29466 61532 -142192 209866 136296
18315 136296 -150686 171850 -118963 -112065 82314 -262365 106436 178781 -68413 -8318 247340
18303 -224798 61987 59131 7647 42649 -306005 161606 68889 -141883 -264086 -113385 -28540
18291 43977 -132166 -7000 111257 91270 146772 -122228 -65464 -70223 78864 199551 -96009
18279 135228 59331 -99684 -193078 -43887 -10774 -153244 -123438 209755 31824 -77880 -87621
$$ packed form
18361A26112F2936J4058J33907l6857a76489K3625A35640b3347A70488k3395b61466
18349i4457j36815b0891F480R8816f7541j68182E9720O1368b7869A4784L01270
18338C16054a93056C2600J42255g8447e298j54074d9439E9644b25124E1332c07358
18326b67441D4113K3367B4048c7059j75965C98803b9466F1532a42192B09866p3570
18315A36296a50686A71850a18963O898H2314b62365A06436P2345f8413h318B47340
18303b24798F1987k856G647L5002c06005A61606F8889a41883j22203a13385b8540
18291D3977a32166g000A11257j9987N5502a22228N6764m759G8864J20687i6009
18279A35228E9331i9684r3394d3887a0774j42470K9806B09755C1824g7880r741
$$ plain form
18268 -87621 29428 320118 250934 198565 274693 340574 -180338 137086 -25956 91416 12035
18256 278053 128883 241034 91051 -78376 -114138 -37799 178390 -202760 -80484 -26295 -84193
18245 -84193 88338 -117292 -175946 -84975 -123138 -284899 -50308 -207609 -99192 -206691 10336
18233 217995 -79676 -137392 -171795 52378 -225846 -128595 91428 65247 -16476 -375711 -274515
18222 -274515 -53893 86933 -73011 -369876 -160729 17561 137149 -65379 188817 -177656
18211 -297095 -39738 81190 13810 25993 178832 -132089 218303 189767 -312086 32930 87004
18200 87004 5115 -201179 -277987 -228911 -471792 -285057 -52836 344355 -225599 298511 -228
18188 -217658 -330752 -246850 -327450 143104 55612 133632 -141341 222687 -85426 -97426 182071
$$ packed form
18268h7621B9428K90690o9184n2369P6128O5881a80338A37086b5956I1416A2035
18256B78053A28883J12151I1051g8376l5762c7799A78390b02760h0484b6295n7898
18245h4193H8338a17292n8654h4975l8163j61761e0308j57301i9192j07499A0336
18233B17995g9676n7716l4403E2378b25846R7251I1428k6181a6476l59235J01196
18222b74515e3893H6933g3011k96865a60729A7561J19588f5379A88817a77656
18211b97095c9738H1190A3810J2183J52839a32089B18303k8536c12086C2930N4074
18200H7004E115b01179p6808M9076k42881J86735e2836C44355b25599B98511b28
18188b17658j13094Q3902q0600A43104E5612P8020a41341B22687h5426j2000A82071
$$ plain form
18176 -101168 54670 329546 274338 -152633 104070 -5217 -51486 -13805 66612 205168 -27943
18164 281414 -117596 9940 37006 64487 378073 291536 -270233 332986 24554 225424 -61743
18152 -101078 -129194 159195 278179 -192121 52935 134068 -213889 -325394 -138900 -130264
18142 -130264 -116821 171992 54737 -116839 -137918 38756 170105 -285540 259294 -176457
18131 82931 72688 184022 175100 -105665 -207766 254734 -369334 99649 42934 188930 163619
18120 163619 -58442 388333 -16209 30323 84006 197629 117343 -189515 -379563 -108497
18109 -375433 87910 246977 137715 48394 -302114 -105474 324135 272732 203437 229387
18099 229387 -389404 -7341 7636 -11269 -36077 114185 43147 -126490 171942 155362 -73800
$$ packed form
18176a01168E4670K74876n5208a52633A04070e217m6269a3805F6612J38556b7943
18164B81414a17596I940K7066K7481L13586q6537b70233C32986B4554K00870f1743
18152a01078k8116A59195J18984a92121E2935Q1133b13889j11505a38900Q636
18142a30264J3443A71992E4737a16839k1079C8756J31349b85540B59294a76457
18131H2931j0243J11334q922a05665j02101B54734c69334I9649D2934J45996k5311
18120A63619e8442C88333a6209C0323N3683J13623q0286a89515j90048a08497
18109c75433H7910J59067j09262D8394c02114a05474C24135n1403o9295K5950
18099B29387c89404g341G636a1269k4808A14185D3147a26490A71942j6580g3800
$$ plain form
18087 59827 79671 219090 9922 99294 -241567 -26956 231522 -19257 -27097 -92310 -14055
18075 243827 -237024 52441 -301430 120692 122813 -35617 57651 40421 -81230 -427555 -110955
18063 -44536 -35748 172165 -104872 -75398 275641 114169 -113835 -207784 4636 -133172 -109511
18052 -109511 241640 88076 -130143 -277769 -262043 248683 -382232 1599 395710 31245
18041 297732 418870 311737 37826 172991 -60060 -292208 8685 -251835 373569 -128949
18030 -60452 -243014 -129751 63719 -161572 -244913 457553 -143741 -313727 186271 -111456
18019 151689 1778 -408694 441185 -211844 141883 218620 103122 121312 121736 -88354 -311378
18008 -311378 -89203 61281 -141020 -93401 -10361 -53292 -24485 38368 -240977 -11780 -237104
$$ packed form
18087E9827J9844J39419I922Q9372b41567b6956B31522a9257p840o5213a4055
18075B43827b37024E2441c01430A20692K121c5617E7651j7230h1230l46325a10955
18063d4536Q788A72165a04872K9474B75641A14169a13835r3949D636a33172K3661
18052a09511B41640H8076a30143j47626J5726B48683c82232A599L94111C1245
18041B97732J21138j07133C7826J35165f0060k32148H685b51835C73569a28949
18030f0452j82562J13263F3719a61572q3341D57553a43741j69986A86271a11456
18019A51689A778d08694D41185b11844A41883P6737A03122J8190M24h8354k23024
18008c11378h9203F1281a41020M7619a0361m2931b4485C8368b40977a1780k25324
$$ plain form
17997 -237104 187808 203201 -267890 -72795 105457 438525 -75883 20732 198441 183772
17987 183772 -113054 -178659 -280275 -31986 25084 201612 24362 -166155 -243377 -88893 -941
17975 -138459 -170766 97403 -283849 71002 197874 23168 100220 -83378 -383276 -159110 -33637
17963 -93920 -113706 -262074 -63921 -346979 232365 -116982 -108343 -196441 -4502 91179 107201
17952 107201 133890 357831 -14206 340949 59196 15271 -207285 123355 -76535 228496
17941 379345 -35392 148865 149163 95720 63826 -45644 -70048 -52883 205390 -187227 326956
17929 -48934 34228 -72793 328132 -191069 -98558 29573 -166866 -159394 123315 77421 -135308
17917 -150828 227916 190615 -110235 110273 -208277 94805 -96045 117258 -94059 410065
$$ packed form
17997b37104A87808J5393b67890g2795A05457L33068g5883B0732J77709j4669
17987A83772a13054o5605j01616c1986B5084J76528B4362a66155p7222h8893i41
17975a38459l2307I7403b83849G1002J26872B3168P7052h3378k99898a59110c3637
17963i3920j9786j48368f3921k83058B32365a16982Q639q8098d502I1179J6022
17952A07201K6689K23941a4206C40949E9196A5271b07285A23355g6535B28496
17941C79345c5392A48865K98n3443l1894d5644k4404J7165B05390a87227C26956
17929d8934C4228g2793C28132a91069R2511B9573a66866P472A23315m5894a35308
17917a50828B27916l7301a10235A10273b08277I4805i6045A17258i4059D10065
$$ plain form
17906 144578 -53977 -103765 -47890 -78290 95217 99477 32773 161703 17284 -225792 62778
17894 49364 -181108 -177461 64450 -190144 106770 -198546 5189 299629 196424 122379 289918
17883 289918 482654 51910 167230 -206452 -228613 -334744 140413 -21983 -87332 87073
17872 -134341 -194991 -205227 -110142 328626 -204496 36952 63934 -48288 114517 210400 -41536
17860 36501 -51586 127250 370029 407219 190373 295389 116623 38490 230642 -112235
17849 242703 -194085 235947 397532 -220981 -183110 115499 151991 67051 -154481 1592
17838 142347 -272856 178354 396770 204225 303321 -82148 -106512 242811 -23458 -80643
17828 -80643 109539 -480157 -9986 9607 -5524 302220 -19276 21712 532552 87450 -55277
$$ packed form
17906A44578e3977m9788d7890l0400I5217M260C2773J28930A7284b25792F2778
17894D9364a81108L647F4450a90144A06770a98546E189K94440j03205p4045J67539
17883B89918J92736E1910J15320b06452k2161j06131A40413b1983o5349H7073
17872a34341o0650j0236R5085C28626b04496C6952K6982d8288A14517R5883d1536
17860C6501e1586A27250K42779L7190A90373J05016A16623C8490J92152a12235
17849B42703a94085B35947J61585b20981L7871A15499L6492F7051a54481A592
17838A42347b72856A78354K18416j92545R9096h2148k4364B42811b3458n7185
17828h0643A09539d80157i986I607e524C02220a9276B1712N10840H7450e5277
$$ plain form
17816 155543 -26386 2266 -386283 177426 -54646 -46355 -92870 461297 -308024 178355 -171046
17804 -132289 53588 -38242 -122208 506913 310682 14372 -201659 -34249 -14848 258891 322725
17793 322725 76390 333384 -190820 121987 274973 151842 8514 398785 242107 208389
17783 208389 183808 -191460 62754 202580 -24848 218301 -157862 -82869 112383 -235085
17772 -111227 -99650 -48520 -41527 66726 243870 85243 227496 -20353 -68356 -142315 -412231
17761 -412231 59068 -77315 121382 249159 85539 186463 192674 298030 120953 -90729 191627
17749 267946 -50544 -221774 301007 331736 40527 25727 237706 237050 -148831 -47809 131598
17737 91081 -337624 -218953 110166 -78312 186857 70983 168669 178424 291231 71054 207794
$$ packed form
17816A55543b6386B266c86283A77426e4646Q291m6515D61297c08024A78355a71046
17804a32289E3588c8242q3966E06913j96231A4372b01659c4249a4848B58891O3834
17793C22725G6390K56994a90820A21987J52986j23131H514L90271j56678l3718
17783B08389k4581a91460F2754J39826b4848B18301a57862P4993A12383b35085
17772a11227J1577d8520O993F6726J77144H5243J42253b0353m8003p3959k69916
17761d12231E9068g7315A21382J27777H5539J00924O211J05356A20953i0729A91627
17749B67946e0544j71230C01007L0729D0527j4800K11979o56a48831d7809A31598
17737I1081c37624J18671A10166g8312A86857G0983R7686R755J12807G1054J36740
$$ plain form
17726 207794 30650 109517 -122263 -127090 111470 92614 46559 3493 -192259 88015 55102
17715 55102 258363 194108 187469 -51000 80178 279465 101025 255947 89090 112706 377142
17704 377142 89770 -220057 287216 -235420 208230 102921 -95778 -182226 33892 425857
17694 425857 312632 -11538 -86947 -187353 -43602 20115 -117285 38006 -160704 162963
17683 317355 128233 537101 8205 212325 173592 29944 85841 -70804 187969 145471 324484
17672 324484 -96367 331898 185376 -250349 -44869 93143 277486 270968 289640 124622 220467
17661 220467 85043 240599 275913 102438 160384 371409 254121 30789 -280991 -65461
17650 17704 -19071 132531 26166 169334 -160047 -172533 298264 16941 192372 -280234
$$ packed form
17726B07794C0650P8867a22263m827A11470j8856m6055C493a92259H8015l2913
17715E5102K03261o4255o639e1000H0178J99287A01025J54922H9090K3616K64436
17704C77142H9770b20057B87216b35420B08230A02921i5778q6448C3892L91965
17694D25857j13225a1538p5409j00406d3602B0115a17285C8006a60704A62963
17683C17355A28233M08868H205K04120l8733B9944N5897g0804A87969m2498J79013
17672C24484i6367C31898j46522b50349d4869I3143J84343o518J8672A24622R5845
17661B20467H5043J55556L5314A02438N7946K11025j17288C0789b80991f5461
17650A7704a9071A32531B6166J43168a60047j2486B98264A6941J75431b80234
$$ plain form
17639 343864 314782 46812 124162 220379 42870 -81211 149244 43064 -117307 242025 291479
17628 291479 191606 339452 -89234 49219 258385 -113181 -6809 -233798 272155 -51801 -26951
17617 -26951 304174 14410 334157 120860 26422 67850 236007 171100 -117382 201864
17606 -74390 -70282 196742 62667 185365 -68194 342504 177268 152981 191911 9638 96865
17595 96865 115007 388112 301101 82563 205878 146500 -238954 304366 366803 -44425 45777
17583 47006 158790 101290 306026 -66518 375107 112743 -6769 235824 278828 167566 -384346
17571 -188571 40688 114322 155234 -225654 284640 158809 200476 81271 195440 78671 94568
17560 94568 199107 182993 -165484 332778 195993 140794 46664 79694 387384 171744
$$ packed form
17639C43864k9082D6812P7350R6217D2870h1211A49244D3064a17307B42025M9454
17628B91479r9873J47846h9234D9219K09166a13181f809k26989B72155e1801K4850
17617b6951C04174A4410L19747A20860B6422M1428J68157o4907a17382B01864
17606g4390M108A96742F2667J22698f8194C42504j65236k4287L8930I638Q7227
17595I6865J8142K73105q7011H2563J23315n9378b38954C04366O2437d4425D5777
17583D7006J11784n7500K04736f6518C75107A12743f769B35824M3004j11262c84346
17571a88571D0688P3634M0912b25654B84640j25831M1667H1271J14169G8671J5897
17560I4568J04539j6114a65484C32778j36785n5199D6664L3030L07690A71744
$$ plain form
17549 82407 130377 82886 -71003 348097 273385 -30980 360520 241424 329018 284493 112995
17537 198126 481404 326236 196519 -109378 277009 281908 80467 285325 321770 589653
17527 589653 354417 868485 852213 1034873 756849 820274 852113 489487 730396 543974
17517 543974 508879 379773 359375 415641 284403 686904 754524 1098715 1031688 640984
17507 640984 786025 769688 255420 458465 449909 542303 328609 660297 573691 210622
17496 434967 460697 242099 267885 297019 174216 362096 268036 -5387 446980 406971 27152
17484 387824 516953 201017 440443 89474 325979 385562 853621 502229 -42970 165683
17473 177827 498981 193244 345043 104216 95204 138130 520522 200543 47309 375131
$$ packed form
17549H2407M7970m7491g1003C48097p4712c0980C60520j19096Q7594m4525A12995
17537A98126K83278j55168j29717a09378B77009M899H0467K04858L6445K67883
17527E89653k35236N14068j6272J82660k78024O3425L1839l62626K40909j86422
17517E43974l5095j29106k0398N6266j31238M02501O7620L44191o7027l90704
17507F40984J45041j6337B55420K03045q556R2394k13694L31688q6606B10622
17496D34967K5730k18598K5786K9134j22803J87880r4060e387D46980m0009B7152
17484C87824J29129B01017K39426H9474K36505N9583M68059l51392d2970A65683
17473A77827L21154A93244J51799A04216r012M2926L82392B00543D7309L27822
$$ plain form
17463 375131 214449 196791 330399 308863 258536 314276 224514 162897 217722 266783 218248
17452 218248 365184 95877 368292 286078 424874 448957 418652 570917 264558 461943
17442 461943 95780 227825 707712 151491 290501 210970 213615 253399 198654 175794 130887
17431 130887 564455 122246 344088 381183 56974 77243 134355 219722 493866 227183
17420 645367 148857 211277 510924 372810 601872 248563 309208 321985 460506 45900
17409 361700 32015 127830 207794 126934 390124 146695 480491 298274 255450 353031 408220
17398 408220 206629 243728 81179 251337 152372 217768 461048 485649 479751 581604 267572
17386 403385 25696 275938 114467 177911 204627 305481 494044 215886 183246 266011
$$ packed form
17463C75131j60682j7658J33608k1536n0327N5740q9762o1617N4825M9061m8535
17452B18248J46936I5877K72415q2214J38796K4083l0305J52265B64558J97385
17442D61943I5780J32045M79887A51491J39010p9531K645L9784n4745k2860m4907
17431A30887M33568A22246K21842L7095E6974K0269N7112Q5367K74144B27183
17420F45367A48857O2420K99647j38114K29062B48563O0645J2777J38521D5900
17409C61700C2015R5815P9964q0860K63190A46695L33796j82217m2824R7581N5189
17398D08220k01591L7099H1179J70158r8965O5396K43280K4601n898J01853B67572
17386D03385B5696K50242A14467O3444K6716J00854J88563B15886l2640Q2765
$$ plain form
17376 266011 479922 252838 154745 295077 305702 384348 -202188 -21087 106801 199208
17366 199208 426596 -231710 448729 126463 465733 382007 502876 296521 112722 90858
17356 90858 373370 428759 248938 321414 403954 312255 369396 276819 372879 114823 652970
17345 652970 295747 301113 140989 378035 253175 242760 168595 394073 337754 510056
17335 510056 337677 367426 284448 324373 269993 111017 154438 278802 65115 264099 -54039
17323 209634 -72677 270566 222503 315026 129172 406369 215714 52182 316221 244110
17313 244110 444911 616596 308989 146687 131301 298317 344304 125787 571475 47899
17302 466642 329277 142153 178929 458159 207233 85379 250398 283911 245248 144763
$$ packed form
17376B66011K13911k27084r8093J40332J0625P8646b02188b1087A06801R2407
17366A99208K27388b31710D48729A26463L39270q3726J20869k06355A12722k1864
17356I0858K82512N5389j79821P2476Q2540r1699N7141r2577R6060A14823N38147
17345F52970B95747N366A40989K37046j24860j0415p4165K25478n6319J72302
17335E10056j72379K9749q2978L9925n4380A11017M3421J24364F5115J98984e4039
17323B09634g2677B70566m8063R2523A29172K77197j90655E2182K64039p2111
17313B44110K00801J71685l07607A46687j5386J67016M5987A25787M45688D7899
17302D66642j37365A42153L6776K79230B07233H5379J65019L3513l8663j00485
$$ plain form
17292 144763 433819 280769 -86 395276 511277 359030 218347 430112 540068 325869
17282 325869 102851 615029 72567 392452 498849 493597 485450 470971 409426 167270 195478
17271 195478 154463 474819 170738 378852 559574 399505 161114 398381 760222 181531
17260 585683 582030 240118 335318 604339 485380 117631 314888 358214 311794 322287 254684
17249 254684 245334 284393 205084 94608 168863 693911 334229 417126 289502 124209 417390
17238 417390 342788 735219 337748 200108 512389 593262 215895 594623 350066 421632
17228 421632 148631 358822 258272 493048 266406 467226 365317 373340 520338 733189
17218 733189 440831 548977 733291 496657 402529 308502 391862 371386 485615 861246
$$ packed form
17292A44763K89056j53050h6C95276J16001j52247j40683K11765J09956k14199
17282C25869A02851N12178G2567L19885J06397n252q147j4479o1545A67270K8208
17271A95478m1015L20356A70738K08114J80722j60069A61114K37267L61841A81531
17260E85683l653B40118R5200K69021j18959A17631J97257M3326m6420J0493o7603
17249B54684r350L9059p9309I4608P4255N25048C34229Q2897j27624A24209K93181
17238D17390p4602L92431C37748j37640L12281Q0873B15895L78728k44557P1566
17228D21632A48631K10191j00550K34776k26642K00820j01909Q023J46998K12851
17218G33189k92358J08146J84314k36634r4128r4027Q3360k0476J14229L75631
$$ plain form
17208 861246 608548 53476 172718 680355 39952 576741 612105 221896 558041 397925
17198 397925 395358 245286 403922 389031 351603 265090 534251 258808 57964 305084 293732
17187 293732 592012 452952 319469 941281 385685 256396 380275 561093 138730 505909
17177 505909 109502 426469 396105 484922 653003 708989 719446 484998 752593 673849
17167 673849 382539 664060 420368 406748 256506 378512 354913 492769 97747 463076
17157 463076 835894 562078 678196 214982 790958 392819 581333 345286 416454 361538
17147 361538 644393 346558 287609 509167 300028 367912 699163 572979 339341 461344
17137 461344 686354 500151 401749 244556 509047 722533 750840 310901 630495 391543
$$ packed form
17208H61246k52698E3476J19242N07637C9952N36789L5364B21896L36145j60116
17198C97925k567j50072J58636j4891l7428q6513K69161B58808E7964K47120j1352
17187B93732K98280j39060j33483O21812C85685j29289J23879J80818A38730L67179
17177E05909A09502L16967l0364Q8817J68081N5986J0457k34448K67595p8744
17167F73849k91310K81521k43692j3620j50242J22006k3599J37856I7747L65329
17157D63076L72818k73816J16118B14982N75976C92819J88514k36047P1168n4916
17147C61538K82855k97835n8949K21558k09139O7884L31251j26184k33638J22003
17137D61344K25010j86203r8402j57193K64491K13486K8307C10901L19594k38952
$$ plain form
17127 391543 697035 766854 811693 529730 527020 669486 612570 609428 692464 683383 762994
17116 762994 607315 468887 459390 461034 742132 621498 500144 501980 602827 632968 170382
17104 529536 789091 552733 687557 593262 548632 532970 613760 742562 588182 796861
17094 796861 799528 745524 761123 419689 626892 782837 297918 713695 410435 584912
17084 584912 998754 822108 544379 720173 596391 627638 654312 665045 1047123 607088
17074 607088 828828 1160917 977551 718345 723749 1030381 505958 727478 977129 737919
17064 737919 865611 946291 551392 1046738 797007 1035348 685051 937084 803157 1034658
17054 1034658 536874 1233348 983361 1204713 813378 877500 840291 1109403 975031 994220
$$ packed form
17127C91543L05492O9819M4839k81963k710J42466n6916l142Q3036r081P9611
17116G62994j55679j38428r497J644K81098j20634j21354J836J00847L0141A70382
17104E29536K59555k36358J34824r4295m4630j5662Q0790J28802j54380K08679
17094G96861K667n4004J5599l41434K07203J55945B97918M15777l03260J74477
17084E84912M13842j76646k77729J75794j23782L1247K6674J0733L82078m40035
17074F07088K21740L32089j83366k59206N404L06632E05958K21520K49651k39210
17064G37919J27692Q0680l94899M95346k49731K38341l50297K52033j33927K31501
17054A034658m97784O96474k49987K21352l91335O4122l7209K69112j34372J9189
$$ plain form
17044 994220 824338 736502 934475 1071866 614518 797468 1180940 1081407 955992 1110361
17034 1110361 1001641 1314782 901654 1110173 884547 1048309 835984 1009145 1020918 1260535
17024 1260535 932209 1060082 1270577 1056165 1026585 881002 1232451 1273142 995964 1259393
17014 1259393 1056424 1212879 1320773 1051073 862085 1283016 896429 1305737 1356990 1168710
17004 1168710 1385581 1196138 930630 1006001 1300842 1115802 1196622 1367721 1102446 1240994
16994 1240994 1279759 1399317 1176755 1325316 1275262 1427167 1261113 1438379 1461954 1466052
16984 1466052 1467330 1605091 1487146 1535309 1311618 1645480 1664349 1448610 1847450 1215480
16974 1215480 1476551 1662828 1698086 1399619 1645766 1700817 1806291 1772632 1839398 1636350
$$ packed form
17044I94220j69882q7836J97973J37391m57348J82950L83472r9533j25415J54369
17034A110361j08720L13141m13128K08519k25626J63762k12325J73161J1773K39617
17024A260535l28326J27873K10495k14412k9580j45583L51449M0691k77178K63429
17014A259393k02969J56455J07894k69700j88988M20931l86587M09308N1253j88280
17004A168710K16871j89443k65508P5371K94841j85040Q0820J71099k65275J38548
16994A240994L8765J19558k22562J48561n0054J51905j66054J77266K3575M098
16984A466052J278J37761j17945M8163k23691L33862J8869k15739L98840o31970
16974A215480K61071J86277L5258k98467K46147N5051J05474l3659O6766k03048
$$ plain form
16964 1636350 1810097 1665600 1470224 1706622 1659480 1614917 1398879 1322796 1412071 1584567
16954 1584567 1804383 1843695 1841755 1493890 1365533 2020517 2104671 1824249 1581774 1922930
16944 1922930 2021273 1759111 1870337 1772881 1762108 1984047 2054175 1867397 1980320 1987737
16934 1987737 1946006 2151908 2416702 2467225 2405751 2092158 2145297 2074467 2444880 2332480
16924 2332480 2432287 2376470 2501035 2199164 2417571 2429992 2461510 2603433 2375804 2433257
16914 2433257 2362295 2638822 2535534 2501980 2892942 2644298 3056412 3038871 3044357 2511988
16904 2511988 2751475 2910047 2877411 3017259 2857505 2899873 3328589 2815659 3219784 2929098
16894 2929098 3364091 3135239 3132870 3524270 3387073 3308434 3346480 3629745 3301568 3518305
$$ packed form
16964A636350J73747j44497j95376K36398m7142m4563k16038p6083Q9275J72496
16954A584567K19816L9312j940l47865j28357O54984Q4154k80422k42475L41156
16944A922930R8343k62162J11226r7456j0773K21939P0128j86778J12923P417
16934A987737m1731K05902K64794N0523o1474l13593N3139p0830L70413j12400
16924B332480R9807n5817J24565l01871K18407J2421L1518J41923k27629N7453
16914B433257p0962K76527j03288l3554L90962k48644M12114j7541N486n32369
16904B511988K39487J58572l2636J39848j59754M2368M28716n12930M04125k90686
16894B929098M34993k28852k369L91400j37197p8639L8046K83265l28177K16737
$$ plain form
16884 3518305 3704452 3624001 3663639 3967094 3803106 3760540 4062887 4092133 3938465 4041819
16874 4041819 4160907 4224586 4140723 4135114 4267256 4205991 4296863 4590960 4216452 4543173
16864 4543173 4928540 4370094 4676373 4703271 4765682 4827171 5074003 5352991 5229270 5148396
16854 5148396 5390655 5660818 5519325 5295715 5595088 5433199 5677712 5886939 6128000
16845 6128000 5545057 6312862 6382000 6230169 6448239 6356513 6653769 6689320 6705496 6695806
16835 6695806 6779051 7004828 7255167 7247006 7266455 7580568 7706754 7603545 7984116 7750464
16825 7750464 8089755 8289957 8402438 8439049 8701547 9036266 9182632 9239284 9599124 9478540
16815 9478540 9430389 9912910 10127436 10391095 10517885 10841655 10976539 11334064 11699937 11778186
$$ packed form
16884C518305J86147q0451L9638L03455j63988m2566L02347K9246j53668J03354
16874D041819J19088O3679q3863n609J32142o1265R0872K94097l74508L26721
16864D543173L85367n58446L06279K6898O2411O1489K46832K78988j23721q0874
16854E148396K42259K70163j41493k23610K99373j61889K44513K09227K41061
16845F128000n82943P67805O9138j51831K18070r1726K97256L5551J6176r690
16835F695806Q3245K25777K50339q161J9449L14113J26186j03209L80571k33652
16825G750464L39291K00202J12481L6611K62498L34719J46366N6652L59840j20584
16815I478540m8151M82521K14526K63659J26790L23770J34884L57525L65873P8249
$$ plain form
16805 11778186 11885197 12057465 12608944 12496743 12739502 13348939 13659662 13904928 14303562
16796 14303562 14416681 15096868 15234784 15550165 15963062 16361024 16836421 16906227 17516814
16787 17516814 18198637 18523531 19165500 19380382 19819447 20650874 21309978 21521358 22330552
16778 22330552 22964578 23258172 24404054 24988099 25712522 26381588 27093549 28357229 28816944
16769 28816944 29670180 30409342 31430165 32067662 33582002 34778863 35831737 36527784 37951678
16760 37951678 39270106 40422829 41756639 43308246 44716634 46232840 47971741 49744395
16752 49744395 50955835 52642452 54788894 56811784 58721096 60864862 63075064 65474796
16744 65474796 67300133 69402916 71827638 74225249 76638468 79365227 81444640 84477878
$$ packed form
16805A1778186J07011J72268N51479j12201K42759O09437L10723K45266L98634
16796A4303562J13119O80187J37916L15381M12897L97962M75397O9806O10587
16787A7516814O81823L24894O41969K14882M39065Q31427O59104K11380Q09194
16778B2330552O34026K93594J145882N84045P24423O69066P11961J263680M59715
16769B8816944Q53236P39162J020823O37497J514340J196861J052874O96047J423894
16760C7951678J318428J152723J333810J551607J408388J516206J738901J772654
16752D9744395J211440J686617K146442K022890J909312K143766K210202K399732
16744F5474796J825337K102783K424722K397611K413219K726759K079413L033238
$$ plain form
16736 84477878 86891095 89356193 91799417 94402932 96592133 99036553 101342940 103355951
16728 103355951 105304212 107248842 108958870 110502785 111311985 112515903 113422001 113573053
16720 113573053 114043496 113840711 113615792 113170216 112087161 111100368 109744864 108112381 106291242
16711 106291242 104506313 102664049 100210566 97904019 95086890 92840889 90349100 87583409
16703 87583409 85125192 82665081 79880716 77244371 74869384 72420838 69769166 67506992
16695 67506992 65135341 63011344 60485401 58606794 56680318 54766512 52446746 50663780
16687 50663780 48831211 47137080 45221253 44112055 42551299 41093844 39778370 38518874
16679 38518874 37319484 35745488 34555510 33565595 32841507 31384672 30628308 29415028
$$ packed form
16736H4477878K413217K465098K443224K603515K189201K444420K306387K013011
16728A03355951J948261J944630J710028J543915Q09200J203918R06098J51052
16720A13573053M70443k02785k24919m45576j083055r86793j355504j632483j821139
16711A06291242j784929j842264k453483k306547k817129k246001k491789k765691
16703H7583409k458217k460111k784365k636345k374987k448546k651672k262174
16695F7506992k371651k123997k525943j878607j926476j913806k319766j782966
16687E0663780j832569j694131j915827j109198j560756j457455j315474j259496
16679C8518874j199390j573996j189978r89915p24088j456835p56364j213280
$$ plain form
16671 29415028 28685042 27651313 26897016 26132983 25330600 24511658 24128675 23411117 22533723
16662 22533723 21988746 21421687 20839510 20066572 19813491 19249434 18604665 18354416 17628012
16653 17628012 17125397 16889306 16349666 15611509 15022407 15063102 15086321 14627144 14041484 13742296
16643 13742296 13339428 13409049 12756203 12378596 12226153 12088036 11924664 11111412 11443451
16634 11443451 10906828 10678076 10633880 10308395 10237995 9949214 9562689 9744181 9152598 8951685
16624 8951685 8901428 9126100 8690385 8474234 8238934 8016028 7704073 7981907 7756093 7434728
16614 7434728 7271123 7309787 7148487 6833320 6997262 7084706 6761009 6378932 6097700 6301974
16604 6301974 6180765 6225351 5909658 6158006 5815178 6097663 5946222 5367158 5393676 5257999
$$ packed form
16671B9415028p29986j033729p54297p64033q02383q18942l82983p17558q77394
16662B2533723n44977n67059n82177p72938k53081n64057o44769k50249p26404
16653A7628012n02615k36091n39640p38157n89102M0695K3219m59177n85660k99188
16643A3742296m02868O9621o52846l77607j52443j38117j63372q13252L32039
16634A1443451n36623k28752m4196l25485p0400k88781l86525J81492n91583k00913
16624H951685n0257K24672m35715k16151k35300k22906l11955K77834k25814l21365
16614G434728j63605L8664j61300l15167J63942Q7444l23697l82077k81232K04274
16604F301974j21209M4586l15693K48348l42828K82485j51441n79064K6518j35677
$$ plain form
16594 5257999 5316188 5329963 5273037 5186603 4599619 5025041 4973352 5223923 4776583 4763847
16584 4763847 4400684 4555560 4381756 4547582 4454242 4662103 4026112 4050145 4173707 4349863
16574 4349863 4007776 4085332 3805841 4029673 3741557 3590775 3754057 3621918 3720653 3386115
16564 3386115 3364234 3725461 3503286 3434014 3167248 3602757 3120098 3074754 3388915 3201715
16554 3201715 3310712 2789927 2914584 3254173 3042070 2796142 2969360 3113697 2608869
16545 2608869 2831571 2598191 2534384 2663918 2702003 2759233 2640622 2506420 2683159 2600101
16535 2600101 2312167 2372524 2466031 2575332 2414100 2370321 2600192 2454123 2231057 2493205
16525 2493205 2215692 2444487 2434252 2260171 1874883 2155417 2257927 2284464 1690929 1681569
$$ packed form
16594E257999N8189J3775n6926q6434n86984M25422n1689K50571m47340j2736
16584D763847l63163J54876j73804J65826r3340K07861o35991K4033J23562J76156
16574D349863l42087P7556k79491K23832k88116j50782J63282j32139R8735l34538
16564C386115k1881L61227k22175o9272k66766M35509m82659m5344L14161j87200
16554C201715J08997n20785J24657L39589k12103k45928J73218J44337n04828
16545B608869K22702k33380o3807J29534L8085N7230j18611j34202J76739q3058
16535B600101k87934O0357R3507J09301j61232m3779K29871j46069k23066K62148
16525B493205k77513K28795j0235j74081l85288K80534J02510K6537n93535r360
$$ plain form
16515 1681569 2076744 2147583 1956550 2214632 2055150 1967631 1903680 2191141 1550034 2035690
16505 2035690 1873061 1888815 2111876 1606111 1760976 1730411 1763037 1568121 1949567 1559257
16495 1559257 1730314 1547804 1702155 1757838 1653942 1539840 1588873 1584522 1731003 1723821
16485 1723821 1678594 1282099 1537242 1780220 1739101 1574497 1374916 1618838 1071919 1640288
16475 1640288 1447661 1534931 1505515 1483058 1431859 1628548 1427859 1386450 1321730 1429221
16465 1429221 1018018 1246659 1632949 1349797 1380507 1162543 1528470 1393980 1284471 1041301
16455 1041301 1158987 1415466 1330395 1005619 1214359 1447935 1100905 1266715 1164619 1353098
16445 1353098 1102235 1195512 993077 1004781 969949 1065282 1104411 791175 1002104 913976
$$ packed form
16515A681569L95175P0839j91033K58082j59482q7519o3951K87461o41107M85656
16505B035690j62629J5754K23061n05765J54865l0565L2626j94916L81446l90310
16495A559257J71057j82510J54351N5683j03896j14102M9033m351J46481p182
16485A723821m5227l96495K55143K42978m1119j64604j99581K43922n46919N68369
16475A640288j92627Q7270k9416k2457n1199J96689k00689m1409o4720J07491
16465A429221m11203K28641L86290k83152L0710k17964L65927j34490j09509k43170
16455A041301J17686K56479q5071l24776K08740K33576l47030J65810j02096J88479
16445A353098k50863R3277k02435J1704l4832R5333L9129l13236K10929q8128
$$ plain form
16435 913976 1257953 1341897 1013775 1070809 799303 1252452 979341 1097467 1045188 801959
16425 801959 865126 1103114 890241 1088791 1002381 1041258 724902 979533 1257216 792039
16415 792039 1180040 701942 1160193 682558 828320 569733 661329 872050 842422 557791
16405 557791 691162 637585 578396 776314 736713 625903 814115 1237960 846883 1008327
16395 1008327 1006228 1119222 844811 1110966 712714 824051 808984 933406 824258 597669
16385 597669 946490 784322 593181 514579 484557 661517 822277 703189 839264 823562
16375 823562 849281 650351 598867 1003770 955047 372482 793419 438547 822718 785659
16365 785659 618969 467618 605339 640264 448198 185585 744958 852478 771088 478151
$$ packed form
16435I13976L43977Q3944l28122N7034k71506M53149k73111J18126n2279k43229
16425H01959O3167K37988k12873J98550q6410L8877l16356K54631K77683m65177
16415G92039L88001m78098M58251m77635J45762k58587R1596K10721k9628k84631
16405E57791J33371n3577n9189J97918l9601j10810J88212M23845l91077J61444
16395A008327k099J12994k74411K66155l98252J11337j5067J24422j09148k26589
16385E97669L48821j62168j91141p8602l0022J76960J60760j19088J36075j5702
16375H23562K5719j98930n1484M04903m8723C72482M20937l54872L84171l7059
16365G85659j66690j51351J37721L4925j92066A85585N59373J07520q1390k92937
$$ plain form
16355 478151 792219 542299 463041 779800 280158 636926 313542 506950 610752 309199
16345 309199 149751 710643 669475 329623 651266 643902 283963 506346 617417 534049
16335 534049 478745 475114 441146 624976 502837 577051 744643 673265 594768 792114 491258
16324 491258 619344 523408 484572 580594 486200 299538 245238 376489 381106 562458 223718
16312 489292 329041 449393 356976 494905 361089 590928 475139 485544 557775 639269
16302 639269 521824 544271 459975 609230 46839 529497 735832 373275 78475 635113
16292 635113 476381 86284 461982 458069 670193 201823 401068 192506 376005 225465
16282 225465 378696 400604 330118 599354 450672 377869 153009 364860 562034 410902
$$ packed form
16355D78151L14068k49920p9258L16759B80158L56768C13542J93408J03802l01553
16345C09199A49751N60892m1168C29623L21643p364B83963K22383J11071q3368
16335E34049n5304l631l3968J83830j22139P4214J67592p1378p8497J97346l00856
16324D91258J28086r5936l8836R6022r4394j86662n4300J31251M617J81352B23718
16312D89292j60251J20352r2417J37929j33816K29839j15789J0405P2231Q1494
16302F39269j17445K2447q4296J49255D6839M82658K06335l62557G8475N56638
16292F35113j58732H6284L75698l913K12124B01823J99245A92506J83499j50540
16282B25465J53231K1908p0486K69236j48682p2803A53009K11851J97174j51132
$$ plain form
16272 410902 462941 643085 427857 437819 562044 426404 425944 172592 143221 442261 681047
16261 681047 725200 304090 427729 191683 360217 776993 72548 -13857 266954 238708
16251 238708 107965 313101 298144 243142 444004 -65340 353084 246298 452118 430601
16241 430601 428799 258395 129474 320529 118001 395141 335862 32797 355129 416739
16231 416739 261728 148892 18464 357740 276983 -116607 311563 215958 330358 579005
16221 579005 210859 420622 324465 139410 270060 280691 26321 96678 33192 239839
16211 239839 227282 470839 123937 261333 78543 339048 153114 349816 603307 11741
16200 51117 133986 257742 260259 230010 105646 154509 317511 391924 348126 470455 473324
$$ packed form
16272D10902N2039J80144k15228R962J24225j35640m60A72592k9371K99040K38786
16261F81047M4153C04090J23639A91683J68534M16776G2548a3857B66954k8246
16251B38708A07965K05136j4957n5002K00862f5340C53084j06786K05820k1517
16241D30601j802j70404j28921J91055A18001K77140n9279C2797L22332O1610
16231D16739j55011j12836A8464L39276q0757a16607C11563r5605J14400K48647
16221E79005B10859K09763r6157A39410J30650J0631B6321P0357C3192K06647
16211B39839j2557K43557A23937J37396G8543K60505A53114J96702K53491A1741
16200E1117Q2869J23756K517l0249A05646M8863J63002P4413m3798J22329K869
$$ plain form
16189 473324 108784 283173 196309 78090 187496 433081 374424 145506 -20667 -19547 273927
16177 173595 79188 217141 -254350 211259 -12341 256897 243008 405001 66892 189444
16167 189444 -88250 292676 434783 250311 136924 286197 179664 276412 171501 91788
16157 91788 -55775 125887 404826 -1051 115636 36513 59613 166348 -45160 211221 149248
16146 149248 224247 -60611 189204 7003 67241 -176193 219975 121147 457149 -38502 231840
16134 -85560 483105 323013 31829 135169 150114 275908 308947 52564 92969 -92444 188029
16122 254773 237460 177205 222961 -7387 213263 -61640 29364 73241 29912 101243 263769
16111 263769 -237707 363222 280639 230370 330515 51418 229562 194748 43057 344927
$$ packed form
16189D73324A08784J74389q6864G8090J09406K45585n8657A45506b0667J120B73927
16177A73595G9188J37953b54350B11259a2341B56897j3889J61993F6892J22552
16167A89444h8250B92676J42107j84472j13387J49273j06533R6748j04911p9713
16157I1788e5775A25887K78939a051A15636C6513K3100J06735d5160B11221o1973
16146A49248P4999f0611A89204G003O0238a76193B19975r8828L36002c8502B31840
16134h5560D83105j60092C1829J03340J4945J25794L3039E2564M0405i2444A88029
16122B54773j7313o0255M5756g387B13263f1640B9364M3877B9912P1331J62526
16111B63769b37707C63222q2583n0269J00145E1418J78144l4814D3057L01870
$$ plain form
16101 344927 259815 180625 -98243 511560 -355952 -69746 -72903 -192766 294607 552176 -382924
16089 -119499 171428 123443 -236091 -66156 112594 325010 223335 -94944 38064 164772
16079 164772 219000 410501 183895 135838 191609 -1311 224001 143930 -20402 -133807 -27348
16067 102984 -192310 41173 44069 -69843 432576 -124305 129766 20768 -177917 -301832
16057 -301832 189521 147966 224258 231608 290197 236139 241888 123865 30729 -78171 -61727
16046 -61727 143811 167533 -92498 44205 76409 178166 -341659 237543 217615 130572 -37349
16034 171471 140987 -85178 79265 -74877 -26615 -253562 37533 -237286 248307 167624 261522
16023 261522 -26039 323240 206031 555087 117349 -32900 161853 -255277 80716 200634
$$ packed form
16101C44927q5112p9190i8243E11560c55952f9746l157j19863B94607K57569c82924
16089a19499A71428m7985b36091f6156A12594K12416j01675i4944C8064J26708
16079A64772N4228J91501A83895m8057N5771a311B24001q0071b0402j13405b7348
16067A02984a92310D1173K896f9843D32576a24305A29766B0768a77917j23915
16057c01832A89521m1555P6292P350N8589n4058N749j18023C0729g8171J6444
16046f1727A43811K3722i2498D4205L2204J01757c41659B37543j9928q7043c7349
16034A71471l0484h5178G9265g4877b6615k26947C7533b37286B48307q0683R3898
16023B61522b6039C23240j17209L49056A17349c2900A61853b55277H0716J19918
$$ plain form
16013 200634 -198015 48227 -119545 15208 -179453 164497 -85887 400483 58637 19388
16002 -326857 17643 84727 -42639 318923 157889 -138111 -232245 87163 -115105 24390 268209
15991 268209 -25624 -392609 319120 65233 222738 669442 679087 1139976 1232083 700169
15981 700169 900942 526218 432754 322886 286259 199895 134852 245514 8738 389738 222298
15970 222298 66108 -20560 -268860 224652 124421 -88922 -74648 106700 24288 179986
15960 179986 -346298 -63535 -118276 -14197 -168567 28834 -189415 -15427 -211306 -70075 -65497
15949 -65497 -50646 -322427 74518 324941 -175864 -67781 -52295 -330868 -150932 132836
15938 46924 83831 -268858 242582 108046 -159049 281179 20780 37185 -343351 -23523
$$ packed form
16013B00634a98015D8227a19545A5208a79453A64497h5887D00483E8637A9388
16002c26857A7643O7084d2639C18923A57889a38111r4134H7163a15105B4390K43819
15991B68209b5624l66985C19120F5233J57505M46704R645M60889R2107n31914
15981G00169K00773l74724r3464j09868l6627q6364o5043J10662H738L81000j67440
15970B22298F6108b0560k48300B24652j00231h8922J4274A06700B4288J55698
15960A79986c46298f3535n4741a4197j54370B8834a89415a5427j95879g0075M578
15949f5497J4851k71781G4518K50423a75864f7781J5486k78573a50932A32836
15938D6924L6907b68858B42582A08046a59049B81179B0780J6405c43351b3523
$$ plain form
15927 263330 56144 14037 102868 -54311 246372 319096 -126330 89547 -163923 248378 -31046
15915 -187005 45023 -204428 -192078 310380 187732 203601 279951 -176457 378698 -94417
15904 205322 -149978 85776 24881 419793 50154 -32379 4643 -269057 -2749 -150555 117241
15892 -344967 -73945 -141496 -142810 -37762 109449 53114 -114385 5638 240345 -158720 254177
15880 -232562 -3585 -274354 41068 445320 -39160 79819 -397798 -215267 122143 14271 30344
15869 30344 97816 12507 -97579 -453930 -22406 173298 -88827 54833 -118225 -14862 292595
15857 -208930 51501 -355367 -215982 136614 -78833 222426 43704 178104 -2576 -71062 -125332
15846 -125332 -229198 -87368 125938 -12570 33623 14140 213914 -181876 217604 38230
$$ packed form
15927B63330E6144A4037Q8831e4311B46372P2724a26330H9547a63923B48378c1046
15915a87005D5023b04428J2350C10380j22648J5869P6350a76457C78698i4417
15904B05322a49978H5776B4881L94912E0154c2379D643b69057b749j47806A17241
15892c44967g3945o7551j314c7762A09449E3114a14385E638K34707a58720B54177
15880b32562c585k70769D1068M04252c9160G9819c97798J82531A22143A4271J6073
15869C0344O7472A2507i7579l56351b2406A73298h8827E4833a18225a4862B92595
15857b08930E1501c55367J39385A36614g8833B22426D3704J34400b576o8486n4270
15846a25332j03866h7368A25938a2570C3623A4140J99774a81876B17604C8230
$$ plain form
15835 -102674 33979 -402211 -234643 -190381 -42942 119067 -124724 242770 59301 -30826
15824 -79761 -56780 176164 -57032 216027 -68549 107667 27201 -23058 -13264 327620 274860
15813 274860 -159834 -48389 -360754 212490 -306755 -183815 -156835 -42847 83960 146842
15803 146842 80228 70661 240257 -1513 162104 134761 -74274 -64544 60781 -122853 175535
15791 187793 -62578 220670 196259 -334513 -154590 311421 162786 -151565 57483 469277
15781 469277 2388 -13150 -332742 134777 34653 -55163 98625 -277410 28377 -159754 -46090
15769 -453671 -207170 -10163 233247 -10765 181701 -38419 -142373 61086 178178 276696
15759 276696 94948 188805 225561 -13360 -70373 119393 181774 162710 185309 18333 -2004
$$ packed form
15835a02674C3979d02211J67568M4262d2942A19067a24724B42770E9301c0826
15824g9761K2981A76164e7032B16027f8549A07667B7201b3058R794C27620n2760
15813B74860a59834d8389l12365B12490c06755J22940K6980d2847H3960O2882
15803A46842o6614r567J69596a513A62104k7343g4274R730F0781a22853A75535
15791A87793f2578B20670k4411c34513a54590C11421j48635a51565E7483M11794
15781D69277B388a3150l19592A34777C4653e5163I8625b77410B8377a59754d6090
15769d53671b07170a0163B33247a0765A81701c8419j03954F1086J17092R8518
15759B76696I4948R3857L6756a3360n7013A19393O2381j9064K2599A8333b004
$$ plain form
15747 -114502 -353794 194310 -77936 -337459 162938 193285 -211331 6887 89746 118159 -39734
15735 -249823 102011 -183353 -225259 63677 191536 163801 37037 -49899 -129957 163606 -344349
15723 -271428 123509 -3347 -86108 65552 -125525 48425 65836 101718 -86680 26827 -124356
15711 131370 189497 -232219 -182198 -104475 149789 -177697 -205687 -17462 -50408 64434 -18252
15699 -165517 -258662 -133784 -34301 257753 151122 11071 82754 -88487 2938 124644 109346
15688 109346 -124968 61975 -95501 -451 173020 176327 42307 -96420 -141340 -32123 -74766 89716
15675 119786 -299981 224898 -200975 -282780 69800 -449795 -76455 52488 35650 -453444
15664 137038 -124420 -92497 139380 -83147 -69902 204719 -115200 246543 -240860 -231757
$$ packed form
15747a14502k39292A94310g7936k59523A62938L0347b11331F887Q2859K8413c9734
15735b49823A02011a83353m1906F3677J27859k7735C7037d9899q0058A63606c44349
15723b71428A23509c347q2761F5552a25525D8425J7411L5882h6680B6827a24356
15711A31370N8127b32219N0021P7723A49789a77697k7990a7462l2946F4434a8252
15699a65517r3145J24878c4301B57753j06631A1071P1683h8487B938J21706j5298
15688A09346a24968F1975i5501d51A73020L307D2307i6420m4920c2123m2643H9716
15675A19786b99981B24898b00975q1805F9800d49795g6455E2488j6838d53444
15664A37038a24420L1923A39380h3147J3245B04719a15200B46543b40860R103
$$ plain form
15654 -231757 -49981 93567 -31886 -264896 -114957 -186677 51359 -1414 -216943 107578 174666
15643 174666 81184 68845 325123 98905 207955 -181854 -34935 19411 -22009 77869 -73102
15631 -147763 29102 36228 -65099 145104 144878 -78270 -288737 -8441 -258872 -1417 120892 -102491
15618 -54424 -5309 -38895 -245917 -118482 246089 -3104 -96753 -244196 109622 -189017 -106527
15607 -106527 -225392 -227129 -199422 46534 7262 -218476 -158341 258110 319321 -240138 -213676
15596 -213676 26688 -36319 90632 -166614 -211002 46823 186401 -169249 170266 -232189
15585 -116103 42435 124795 -273660 141488 186845 -11182 -43965 223863 109629 125926 -66420
15573 -238538 -151862 -276415 196227 -148904 -259452 2123 -48000 45976 132367 -144031 37239
$$ packed form
15654b31757d9981I3567c1886k33010a14957p1720E1359a414k15529A07578O7088
15643A74666H1184j2339K56278I8905J09050a81854c4935A9411b2009G7869g3102
15631a47763B9102P126f5099A45104k26g8270k10467h441k50431a417A20892a02491
15618e4424e309l3586k07022a18482B46089c104r3649j47443A09622a89017Q2490
15607a06527j18865j737K7707D6534G262b18476O0135B58110O1211b40138K6462
15596b13676B6688c6319I0632a66614m4388D6823J39578a69249A70266b32189
15585a16103D2435Q2360b73660A41488M5357a1182l2783B23863A09629J6297f6420
15573b38538Q6676j24553A96227a48904j10548B123d8000D5976Q6391a44031C7239
$$ plain form
15561 87267 356592 128065 -93648 -141221 -45153 -135518 227247 91002 31149 44644 151266
15550 151266 127891 401075 -208862 13238 296456 128418 93394 -22725 -185692 -18814
15539 164902 -52637 208208 1605 -4803 338656 -38678 -147151 -17813 207804 238838 5682
15527 221256 218914 -34369 -216410 129500 1773 -139292 22268 200495 -140500 -38804 -88960
15516 -88960 97382 381892 533322 292827 28278 280347 175526 94775 121636 254492
15506 254492 32566 248518 87707 94675 41430 320833 -7764 -28040 265267 356563 450354
15495 450354 78723 -134483 202486 189599 68777 -86308 97725 134073 27001 105144 381921
15484 381921 175517 221521 512614 135586 69270 302295 201507 -67606 -237255 210506
$$ packed form
15561H7267K69325A28065i3648m7573d5153r0365B27247I1002C1149J3495J06622
15550A51266k3375K73184b08862A3238K83218A28418l5024b2725j62967a8814
15539A64902e2637B08208A605d803C38656c8678j08473a7813B07804L1034E682
15527B21256k342c4369j82041A29500A773a39292B2268J78227a40500c8804n0156
15516h8960I7382K84510J51430k40495B8278K52069j04821q0751K6861J32856
15506B54492C2566K15952H7707O968D1430K79403g764k0276B65267R1296R3791
15495D50354G8723a34483B02486j2887F8777h6308I7725L6348B7001P8143K76777
15484C81921A75517M6004K91093A35586o6316K33025j00788f7606j69649B10506
$$ plain form
15473 178321 920750 662801 427198 475237 246197 136979 -110346 -106434 -99701 308034
15462 144253 -140621 104596 23943 -110218 -97067 173039 298812 -10422 176969 -179070
15451 48510 -17874 -200646 -25706 -28783 33379 275362 198923 185602 350448 895358 777331
15440 777331 1121284 871416 571925 381554 170088 390549 28016 86951 184393 -180293
15429 -122004 -99679 83589 26651 270876 -19157 -149864 -83461 45840 3580 -247654 440001
15417 -118577 -131679 -71285 197828 172962 -126264 149139 56196 -108420 -9414 221058 -67629
15405 166315 -176017 -56628 -73860 -118817 -3613 40270 87507 237961 296795 43083 174675
15394 174675 152455 -169656 -130382 -140713 180809 126322 107047 89954 124481 -15835 106622
$$ packed form
15473A78321P42429k57949k35603M8039k29040j09218a10346L912O733C08034
15462A44253a40621A04596B3943a10218J3151A73039J25773a0422A76969a79070
15451D8510a7874j82772b5706l077C3379K41983p6439j3321J64846N44910j18027
15440G77331L43953k49868k99491j90371A70088K20461B8016N8935R7442a80293
15429a22004K2325H3589B6651K44225a9157j30707O6403D5840C580b47654D40001
15417a18577j3102O0394A97828k4866a26264A49139E6196a08420i414B21058f7629
15405A66315a76017e6628j7232m4957c613D0270M7237J50454N8834D3083J31592
15394A74675k2220a69656L9274j0331A80809n4487j9275j7093L4527a5835A06622
$$ plain form
15382 52542 170712 296075 -202585 2973 -6388 -17150 32061 -38962 -87069 50180 244587
15371 244587 36391 365092 -287238 407305 108627 283353 118009 275101 70743 128446
15361 128446 24596 46846 -99911 323983 320860 192987 -18582 119498 93101 7481 109330
15350 109330 116385 299930 47734 -18290 177930 -76105 429211 444755 205925 260700 -62166
15338 329003 -10894 -42227 -105850 -159675 15272 62954 153695 146529 210053 110440 159851 18429
15325 -162598 64881 355190 -231802 -45321 28248 128802 -104207 11484 195923 234093
15315 234093 179674 47559 -139883 292323 97184 403361 370892 101272 63375 224670
15305 224670 301212 124459 -278103 -60677 -181749 187728 77374 79997 178650 256582 38008
$$ packed form
15382E2542J18170J25363b02585B973f388j0762C2061c8962m8107E0180J94407
15371B44587C6391L28701b87238D07305A08627J74726A18009J57092G0743N7703
15361A28446B4596K2250i9911C23983l123j27873a8582A19498k6397G481J01849
15350A09330P055J83545D7734a8290A77930g6105D29211J5544B05925N4775f2166
15338C29003a0894l1333o3623n3825A5272M7682R0741p166O3524r9613M9411A8429
15325a62598F4881K90309b31802d5321B8248J00554a04207A1484J84439L8170
15315B34093n4419D7559a39883B92323I7184L06177l2469A01272l7897J61295
15305B24670P6542A24459b78103f0677j21072A87728G7374K623R8653P7932C8008
$$ plain form
15293 36428 304662 205258 54142 29290 525 -336853 205597 -54865 -197798 355729 -52008
15281 -188117 82253 -23966 211902 -109939 204863 -44131 -152526 56327 -29318 122080
15270 213866 92216 164550 12433 4320 380818 -30393 173658 5677 23663 75151 121902
15259 121902 518146 74230 209855 -185069 -8919 69036 -18101 264321 -128579 288102
15248 -76393 -112420 388992 140860 -21269 29767 268728 648832 1471650 1594120 1372689
15238 1372689 1948704 1051024 291569 197626 144609 4700 -110018 67597 224756 -151289
15227 184427 218197 210402 -73487 2674 84024 -5725 350829 195271 -207333 167678 411181
15216 411181 48913 -109111 58037 -42342 358134 289171 -45128 267159 445408 56609 -118243
$$ packed form
15293C6428K68234r9404E4142k4852E25c36853B05597e4865j42933C55729e2008
15281a88117H2253b3966B11902a09939B04863d4131j08395E6327b9318A22080
15270B13866I2216P2334A2433D320L76498c0393A73658E677J7986N1488M6751
15259A21902L96244G4230J35625a85069h919F9036a8101B64321a28579B88102
15248g6393l6027C88992A40860b1269B9767K38961L80104Q22818J22470k21431
15238A372689N76015q97680B91569r3943n3017D700a10018F7597J57159a51289
15227A84427L3770p795g3487B674Q1350e725C50829j55558b07333A67678K43503
15216D11181D8913a09111E8037d2342C58134o8963d5128B67159J78249E6609a18243
$$ plain form
15204 -217200 -223355 -28262 -17083 -25234 -70891 14247 96714 263089 15911 98243 38091 156455
15192 156455 -362921 126467 249966 132617 -124447 186496 41813 425828 -101116 -99840
15182 -99840 168313 243677 187381 57468 114087 -101564 188177 231899 123984 443282 -41843
15170 284347 -289864 390288 -11472 11950 25922 -89017 65289 107780 -20448 410961 132061
15158 -165242 167839 214412 -13445 98362 -63275 127510 259422 -68252 -168387 453686
15147 45785 -313171 44393 39523 49657 174783 -224834 233350 287739 -168339 226261 -19383
15135 343092 -137026 155726 -76067 -78253 81415 204761 304358 81676 49558 22125 408223
15124 408223 344314 52686 172728 326523 337137 652969 283679 -63449 414541 -14146
$$ packed form
15204b17200o155b8262J1179q151m5657A4247Q2467J66375A5911Q2332C8091J18364
15192A56455c62921A26467J23499j17349a24447A86496D1813L84015a01116J276
15182i9840A68313P5364n6296E7468N6619a01564A88177M3722j07915L19298d1843
15170B84347b89864C90288a1472A1950J3972h9017F5289M2491b0448D10961A32061
15158a65242A67839M6573a3445I8362f3275A27510J31912f8252j00135D53686
15147D5785c13171D4393m870J0134J25126b24834B33350N4389a68339B26261a9383
15135C43092a37026A55726g6067k186H1415J23346R9597H1676l2118B2125L86098
15124D08223o3909E2686J20042J53795J0614L15832B83679f3449D14541a4146
$$ plain form
15113 226075 347240 115858 95440 180148 -33512 43524 50595 -185148 57946 139323 303621
15102 303621 -5650 173671 -46011 55852 31477 107579 128150 69325 101620 80490 66786
15091 66786 467267 102176 -115222 395801 46947 31358 -4205 -28900 108205 290924 208803
15080 208803 236953 -75257 -119800 105150 92834 117359 185347 71217 -12667 210437 100399
15068 367757 203874 191851 413057 164240 59238 241500 175634 -110421 296097 313558
15058 313558 93756 315764 174359 136415 -114279 407978 395161 470268 389639 427054 459567
15047 459567 396895 287409 -29541 222407 114535 92513 190818 525957 372079 363350 681144
15036 681144 511652 271737 581800 634423 493599 706202 720533 635525 840504 654116
$$ packed form
15113B26075J21165A15858k0418Q4708c3512D3524P071a85148E7946Q1377J64298
15102C03621e650A73671d6011E5852k4375P6102K0571n8825L2295k1130j3704
15091F6786M00481A02176a15222C95801D6947j5589d205k4695A08205J82719q2121
15080B08803K8150g5257m4543A05150j2316K4525O7988G1217a2667B10437A00399
15068C67757j63883j2023K21206A64240E9238J82262o5866a10421B96097J7461
15058C13558I3756K22008j41405l7944a14279D07978j2817P5107q0629L7415L2513
15047D59567o2672j09486b9541B22407j07872k2022R8305L35139j53878q729L17794
15036F81144j69492k39915L10063N2623j40824K12603J4331q5008K04979j86388
$$ plain form
15026 654116 719124 403952 154926 500795 761228 491196 445368 255353 803500 373612
15015 651991 247122 189040 413184 384017 676316 507287 318393 591065 353456 251771
15005 251771 396174 196491 194474 430226 253354 409473 679122 447189 626625 832490
14995 832490 463737 267067 515568 526047 419973 448667 345759 846449 398650 596593
14985 596593 287513 273739 494948 992190 306095 628777 936265 470122 610789 214621
14974 196464 564724 904138 408398 666088 221042 639255 717463 6781 472654 500805
14964 500805 34852 266426 -39395 315766 147187 472190 529251 324050 426172 232699
14954 232699 176441 488632 643919 499897 181257 427740 308831 710646 306261 639087
$$ packed form
15026F54116O5008l15172A54926L45869K60433k70032m5828j90015N48147C73612
15015F51991B47122n8082K24144k9167K92299j69029j88894K72672k37609j01685
15005B51771J44403A96491k017K35752j76872J56119K69649k31933J79436K05865
14995H32490l68753j96670K48501J0479j06074K8694j02908N00690C98650J97943
14985E96593B87513j3774K21209M97242C06095L22682L07488m66143J40667B14621
14974A96464L68260L39414D08398K57690B21042M18213P8208F781M65873K8151
14964E00805C4852K31574c9395C15766A47187L25003N7061k05201J02122j93473
14954B32699n6258L12191J55287j44022A81257K46483j18909M01815C06261L32826
$$ plain form
14944 639087 547366 881063 805896 437328 583696 394760 595254 626467 322810 611168
14934 611168 282150 741892 930631 981403 952152 1182575 1473352 1152184 1337987 1654743
14924 1654743 2038436 1745063 1471765 1421438 1397994 1817760 1941975 2196209 2374104 2200891
14914 2200891 1741504 1331798 1388350 1196817 902593 773450 651294 556659 400162 279619
14904 279619 678352 409470 419825 568964 397041 329624 346073 797916 148733 655652
14894 655652 675076 545561 496172 507506 193960 509223 448129 679229 635402 667156 554232
14883 554232 703315 890717 1156016 824782 632806 905161 890370 475242 709259 416796
14873 416796 481006 536005 517041 369570 466151 699517 322849 612890 754391 773093
$$ packed form
14944F39087r1721L33697p5167l68568J46368j88936K00494L1213l03657K88358
14934F11168B82150M59742J88739N0772k9251K30423K90777l21168J85803L16756
14924A654743L83693k93373k73298n0327k3444M19766J24215K54234J77895j73213
14914B200891m59387m09706N6552j91533k94224j29143j22156r4635j56497j20543
14904B79619L98733k68882J0355J49139j71923o7417J6449M51843A48733N06919
14894F55652J9424j29515m9389J1334A93960L15263o1094K31100m3827L1754j12924
14883E54232J49083J87402K65299l31234j91976K72355j4791m15128K34017k92463
14873D16796O4210N4999j8964j47471R6581K33366C22849K90041J41501J8702
$$ plain form
14863 773093 415791 942988 655051 639743 619477 686594 399841 405330 634864 385590
14853 385590 551495 180950 287430 446334 582505 708922 712437 684076 631362 913854
14843 913854 930142 1484252 1186114 1333085 1231139 871802 848214 877948 871775 705107
14833 705107 623740 663584 431928 291844 475487 688367 665432 1002493 126703 648719
14823 648719 494274 713826 761767 661461 143955 783567 677393 905474 696256 1129249
14813 1129249 811032 301939 966308 576114 656215 645358 865610 690339 1210092 976269
14803 976269 1209747 878069 293870 480814 581932 618950 81953 589839 73516 321561
14793 321561 368419 593795 800885 592472 491567 550601 756404 488775 381890 1105156
$$ packed form
14863G73093l57302N27197k87937j5308k0266O7117k86753N489K29534k49274
14853C85590J65905A80950J06480J58904J36171J26417L515k8361n2714K82492
14843I13854J6288N54110k98138J46971j01946l59337k3588K9734o173j66668
14833G05107q1367L9844k31656j40084J83643K12880k2935L37061A26703N22016
14823F48719j54445K19552M7941j00306A43955O39612j06174K28081k09218M32993
14813A129249l18217C01939O64369l90194Q0101j0857K20252j75271N19753k33823
14803I76269K33478l31678B93870J86944J01118L7018H1953N07886G3516K48045
14793C21561M6858K25376K07090k08413j00905N9034K05803k67629j06885P23266
$$ plain form
14783 1105156 631711 1177007 525076 988587 658970 425839 1007619 1038269 1010173 781464
14773 781464 868259 723805 810677 792799 703492 713678 730599 488098 871242 641319 448908
14762 448908 627080 641698 586413 426566 394956 867030 753163 390792 695763 644625
14752 644625 745510 584736 829721 775145 507023 785175 422674 311597 583007 720371
14742 720371 884313 649812 532270 694133 591688 914996 1045107 870257 1019015 938199
14732 938199 1029775 1192511 1185033 1335418 1503383 1585601 1753733 1491425 1379588 1356367
14722 1356367 1118973 1308868 1189462 1101860 1152042 1213836 1134686 822670 849102 918418
14712 918418 897366 936150 647749 1116177 1110851 1025523 1312293 1160067 1078543 1252277 1598693
$$ packed form
14783A105156m73445N45296E25076M63511l29617k33131N81780L0650k8096k28709
14773G81464Q6795j44454Q6872j7878q9307J0186J6921k42501L83144k29923j92411
14762D48908J78172J4618n5285j59847l1610M72074j13867l62371L04971n1138
14752F44625J00885j60774K44985n4576k68122K78152l62501j11077K71410J37364
14742G20371J63942k34501j17542J61863j02445L23308J30111j74850J48758q0816
14732I38199R1576J62736p478J50385J67965Q2218J68132k62308j11837k3221
14722A356367k37394J89895j19406q7602N0182O1794p9150l12016K6432O9316
14712I18418k1052L8784k88401M68428n326q5328K86770j52226q1524J73734L46416
$$ plain form
14701 1598693 2147526 1893799 1531689 1502910 1494649 1082783 1049416 893010 1026759 971158
14691 971158 769543 680405 950351 1066076 1043008 842433 924182 791490 919206 1110124
14681 1110124 954129 1185556 779085 1270016 1342399 843144 1203563 812459 895191 1184801
14671 1184801 1046113 877248 1058758 938163 937530 1133626 1310637 1125894 740519 962667
14661 962667 1098955 895033 974830 869984 1272003 1013830 972697 1518957 1455906 1618646
14651 1618646 1151223 1387035 1512795 1160222 1326400 1198565 1040996 1287738 1108606
14642 1108606 1050493 1263576 1411296 1078243 1426583 1146724 1146675 869809 1064081 1178665
14632 1178665 1009340 1178525 1513612 1200874 1420039 1351621 1402571 1318415 1603972 1390588
$$ packed form
14701A598693N48833k53727l62110k8779q261m11866l3367j56406J33749n5601
14691I71158k01615q9138K69946J15725k3068k00575Q1749j32692J27716J90918
14681A110124j55995K31427m06471M90931P2383m99255L60419l91104Q2732K89610
14671A184801j38688j68865J81510j20595o33J96096J77011j84743l85375K22148
14661I62667J36288k03922P9797j04846M02019k58173m1133N46260o3051J62740
14651A618646m67423K35812J25760l52573J66178j27835j57569K46742j79132
14642A108606n8113K13083J47720l33053L48340k79859m9k76866J94272J14584
14632A178665j69325J69185L35087l12738K19165o8418N0950q4156K85557k13384
$$ plain form
14622 1390588 1247273 1455842 1275777 1776088 1389873 1428126 1400432 1504037 1548718 1396362
14612 1396362 1605241 1563319 1792501 1690605 1426478 1472327 1529242 1275859 1472888 1728771
14602 1728771 1598444 1687182 1814132 1609515 1582405 1808828 1801589 1642387 1628122 1589323
14592 1589323 1924633 1657298 1742269 1880442 1544162 1864438 2099574 1984641 1681169 1798086
14582 1798086 1878205 1737171 1675387 2160463 1592248 2152615 2125334 1866884 2055187 2109969
14572 2109969 1989335 2133143 2179436 2195759 2298579 2428976 2158414 2642230 2276549 2377040
14562 2377040 2383640 2287020 2791807 2633531 3176748 2918539 2974943 3204458 3473711 3588785
14552 3588785 4032957 4746161 5421598 6876602 9947574 16741042 32317851 42011527
$$ packed form
14622A390588j43315K08569j80065N00311l86215L8253k7694J03605M4681j52356
14612A396362K08879m1922K29182j01896k64127M5849N6915k53383J97029K55883
14602A728771j30327Q8738J26950k04617k7110K26423p239j59202j4265l8799
14592A589323L35310k67335Q4971J38173l36280L20276K35136j14933l03472J16917
14582A798086Q0119j41034o1784M85076n68215N60367k7281k58450J88303N4782
14572B109969j20634J43808M6293J6323J02820J30397k70562M83816l65681J00491
14562B377040O600r6620N04787j58276N43217k58209N6404K29515K69253J15074
14552C588785M44172P13204O75437J455004L070972O793468J5576809R693676
$$ plain form
14544 42011527 20728513 9472574 6305445 4722391 3889867 3354679 3521454 4503046
14536 4503046 5585476 3658292 2519051 2319698 2405768 2371737 2045837 2170039 1946635
14527 1946635 2293997 2013049 2134398 2537311 2132861 2128930 2218337 2560772 2629518 2770126
14517 2770126 2323507 2307485 2772923 2448197 2634594 2629612 2509237 3089544 3058634 2756304
14507 2756304 2681499 2984150 3095888 3026380 2850687 2833987 3168563 2788592 2910792 3269733
14497 3269733 3123861 3183919 3444241 3394478 3094455 3428709 3521667 3823033 3556022 3632820
14487 3632820 3486594 3540645 3508719 3418758 3638486 3466429 3904754 4127101 3999906 3760302
14477 3760302 4585912 4164497 4296644 3975311 4245100 3966281 4081081 3809119 4081860
$$ packed form
14544D2011527B0728513I472574l167129j583054q32524n35188J66775R81592
14536D503046J082430j927184j139241j99353Q6070l4031l25900J24202k23404
14527A946635L47362k80948J21349M02913m04450l931Q9407L42435O8746J40608
14517B770126m46619j6022M65438l24726J86397m982j20375N80307l0910l02330
14507B756304p4805L02651J11738o9508j75693j6700L34576l79971J22200L58941
14497C269733j45872O0058K60322m9763l00023L34254R2958L01366k67011P6798
14487C632820j46226N4051l1926q9961K19728j72057M38325K22347j27195k39604
14477C760302Q25610m21415J32147l21333K69789k78819J14800k71962K72741
$$ plain form
14468 4081860 4410219 4554819 4414154 4381341 4497347 4486468 4733624 4652561 4652704 4933181
14458 4933181 4697180 5124706 5036258 5031633 5054906 5192819 5570520 5277853 5219665 5435954
14448 5435954 5441509 5530091 5508286 5468573 6097844 5970318 6002502 6179150 6235197 6084662 6347611
14437 6347611 6295113 6169807 6587299 6791752 6769993 6762074 6871865 7014458 7083116 7316989
14427 7316989 6957508 7355490 7395150 7596710 7825925 7889871 8377138 8165268 8172983 8440802
14417 8440802 8307829 8585741 8905535 8712627 8402538 9048887 9257004 9045820 9570810
14408 9570810 9332899 9461939 9935999 10116686 10426597 10261861 10477987 10365085 10779089
14399 10779089 10875949 11046456 11003526 11624467 11534331 11516243 11822355 11956539 12129085 12374231
$$ packed form
14468D081860L28359J44600j40665l2813J16006j0879K47156q1063J43K80477
14458D933181k36001M27526q8448m625K3273J37913L77701k92667n8188K16289
14448E435954N555Q8582k1805l9713O29271j27526L2184J76648N6047j50535K62949
14437F347611n2498j25306M17492K04453k1759p919J09791J42593O8658K33873
14427G316989l59481L97982L9660K01560K29215O3946M87267k11870P715K67819
14417H440802j32973K77912L19794j92908l10089O46349K08117k11184N24990
14408I570810k37911J29040M74060J80687L09911j64736K16126j12902M14004
14399A0779089R6860J70507m2930O20941r0136j8088L06112J34184J72546K45146
$$ plain form
14389 12374231 12776642 12830122 13120195 13726632 13346029 13817333 14094536 14513865 14950211
14380 14950211 15101814 15169926 15637092 15466123 15876402 15904919 16582474 16766354 17233654 17474733
14370 17474733 17659644 17966035 18479086 18986128 19547429 19825850 19981960 20217864 20431605
14361 20431605 20812200 21783817 22097772 22416719 22970219 23325486 23940548 24672644 25070411
14352 25070411 25550385 26401552 26878519 27679977 28483903 29110523 29686468 30786539 31614281
14343 31614281 32411952 32808401 33913783 34396684 35637263 36997070 37477604 38748482 40219412
14334 40219412 40997558 42273105 43453880 44823967 46332126 47945353 49176506 51111246
14326 51111246 52806218 54319569 56296764 58409036 60162116 62057682 64388374 66546085
$$ packed form
14389A2374231M02411N3480K90073O06437l80603M71304K77203M19329M36346
14380A4950211J51603O8112M67166j70969M10279K8517O77555J83880M67300K41079
14370A7474733J84911L06391N13051N07042N61301K78421J56110K35904K13741
14361B0431605L80595R71617L13955L18947N53500L55267O15062P32096L97767
14352B5070411M79974Q51167M76967Q01458Q03926O26620N75945J100071Q27742
14343C1614281P97671L96449J105382M82901J240579J359807M80534J270878J470930
14334D0219412P78146J275547J180775J370087J508159J613227J231153J934740
14326E1111246J694972J513351J977195K112272J753080J895566K330692K157711
$$ plain form
14318 66546085 69130171 71187009 73898726 76406476 79357890 82254255 85691823 88823998
14310 88823998 92685535 96450666 100129745 104157972 108600585 113594963 118458012 124022971
14302 124022971 129527537 135340931 141565799 148009982 154973975 162257696 170182924 178104891
14294 178104891 186989828 196080940 205959026 215890801 226946436 238076160 249845329
14287 249845329 262116467 275054846 288693961 302304833 316798269 330990323 345826901
14280 345826901 360557483 375152286 389637316 403482143 416464367 428571151 438615215
14273 438615215 446107110 450057364 452747927 454734024 455076810 452037275 446536215 436786085
14265 436786085 426492752 417430983 407228753 397117619 385427785 374002669 360895368
$$ packed form
14318F6546085K584086K056838K711717K507750K951414K896365L437568L132175
14310H8823998L861537L765131L679079M028227M442613M994378M863049N564959
14302A24022971N504566N813394O224868O444183O963993P283721P925228P921967
14294A78104891Q884937R091112R878086R931775J1055635J1129724J1769169
14287B49845329J2271138J2938379J3639115J3610872J4493436J4192054J4836578
14280C45826901J4730582J4594803J4485030J3844827J2982224J2106784J0044064
14273D38615215P491895L950254K690563J986097L42786l039535n501060r750130
14265D36786085j0293333r061769j0202230j0111134j1689834j1425116j3107301
$$ plain form
14258 360895368 348074369 334240509 319898021 305679491 290920285 276782962 262520872
14251 262520872 248847838 235740384 223156873 211417816 202118294 192049874 182061106
14244 182061106 173224315 164925334 157043902 149240430 142396365 135583964 129486446 123954759
14236 123954759 118553523 113081939 108371698 103533198 99252316 95335501 91544522 87925003
14228 87925003 84313953 80941604 77985565 75071848 72413156 69701857 67116434 64957116
14220 64957116 62388849 60685881 58234854 56469649 54529697 52692127 51106505 49989291
14212 49989291 47992693 46532724 45156790 44362458 42698686 41917848 40639427 39521170
14204 39521170 38527570 37306392 36179725 35221472 34809900 33506386 32423421 31402483
$$ packed form
14258C60895368j2820999j3833860j4342488j4218530j4759206j4137323j4262090
14251B62520872j3673034j3107454j2583511j1739057r299522j0068420r988768
14244A82061106q836791q298981p881432p803472o844065o812401o097518n531687
14236A23954759n401236n471584m710241m838500m280882l916815l790979l619519
14228H7925003l611050l372349k956039k913717k658692k711299k585423k159318
14220F4957116k568267j702968k451027j765205j939952j837570j585622j117214
14212D9989291j996598j459969j375934p94332j663772p80838j278421j118257
14204C9521170r93600j221178j126667r58253m11572j303514j082965j020938
$$ plain form
14196 31402483 30896784 30075011 29312475 28657879 27707964 27152841 26611225 26055299 25166877
14187 25166877 24570331 24326649 23838804 23202692 22711156 21844485 21527298 20832310 20611335
14178 20611335 20109870 19788034 19250714 19354988 18536600 18258656 17681251 17262611 17184542
14169 17184542 16793509 16421696 15736256 15873147 15565361 15471316 15211864 14686024 14381040
14160 14381040 14106488 13876495 13901292 13427927 13228327 13029003 12822478 12628900 12210933
14151 12210933 12100219 11956877 11716659 11232163 11760278 11339227 10790970 10806240 10861410 10543459
14141 10543459 10749962 10450548 10452611 9881090 9948816 9821599 9632492 9100598 9292533 8895586
14131 8895586 9007098 8899943 8800442 8566267 8652646 8511202 8236488 7887783 8156700 7777726
$$ packed form
14196C1402483n05699q21773p62536o54596r49915n55123n41616n55926q88422
14187B5166877n96546k43682m87845o36112m91536q66671l17187o94988k20975
14178B0611335n01465l21836n37320J04274q18388k77944n77405m18640p8069
14169A7184542l91033l71813o85440J36891l07786r4045k59452n25840l04984
14160A4381040k74552k29993K4797m73365j99600j99324k06525j93578m17967
14151A2210933j10714j43342k40218m84496N28115m21051n48257J5270N5170l17951
14141A0543459K06503k99414K063n71521O7726j27217j89107n31894J91935l96947
14131H895586J11512j07155r9501k34175Q6379j41444k74714l48705K68917l78974
$$ plain form
14121 7777726 8084887 7954580 7914764 7415512 7738687 7507046 7239013 7156692 7337283 7203744
14111 7203744 6815629 6543725 6764129 6597379 6571327 6836560 6296086 5961423 6013664 5782826
14101 5782826 6027972 5738920 5883512 6002978 5776396 5602328 5625334 5652015 5646380 5781879
14091 5781879 5331201 5503317 5238361 5282109 4970074 5136412 5124446 5136211 5064623 4767878
14081 4767878 5006459 4902089 4663607 4853963 4603596 4622280 4374734 4492869 4733050 4504582
14071 4504582 4375997 4433815 4065900 4269377 4367717 4150127 4295999 3931155 4238276 3885295
14061 3885295 3995740 4362244 4220646 3827524 4001682 3650039 3881214 3900688 3729062 3541311
14051 3541311 3805021 3623007 3699995 3578935 3509114 3408870 3249782 3717010 3360091 3603812
$$ packed form
14121G777726L07161j30307l9816m99252L23175k31641k68033q2321J80591j33539
14111G203744l88115k71904K20404j66750k6052K65233n40474l34663N2241k30838
14101E782826K45146k89052J44592J19466k26582j74068K3006K6681n635J35499
14091E781879m50678J72116k64956M3748l12035J66338j1966J1765p1588k96745
14081D767878K38581j04370k38482J90356k50367J8684k47546J18135K40181k28468
14071D504582j28585N7818l67915K03477R8340k17590J45872l64844L07121l52981
14061C885295J10445L66504j41598l93122J74158l51643K31175J9474j71626j87751
14051C541311K63710j82014P6988j21060o9821j00244j59088M67228l56919K43721
$$ plain form
14041 3603812 3280290 3612258 3478202 3122270 3010806 3309636 2996274 3021380 3107659 3071084
14031 3071084 3060919 3144115 3353445 3101701 3030261 3091872 2447572 2463663 2717547 2809061
14021 2809061 2852920 2562350 2908171 2877916 2707880 2452393 2345085 2385832 2595507 2514327
14011 2514327 2587489 2107743 2747930 2333361 2501927 2280342 2825994 2162787 2409650 2465859
14001 2465859 2093112 2051417 1987266 2212050 2257137 2097766 1924591 2429520 2213115 2529982
13991 2529982 2538208 3096279 3415768 5632109 10724731 23785591 43772630 26612055
13983 26612055 14173813 9567084 7433658 5994422 4669451 4243721 3698357 3726430
13975 3726430 3164423 2994165 3172335 2706800 2518511 2658751 2404825 2331497 2209212 2690086
$$ packed form
14041C603812l23522L31968j34056l55932j11464K98830l13362K5106Q6279l6575
14031C071084j0165Q3196K09330k51744p1440O1611o44300J6091K53884R1514
14021B809061M3859k90570L45821l0255j70036k55487j07308M0747K09675q1180
14011B514327P3162m79746O40187m14569J68566k21585N45652o63207K46863N6209
14001B465859l72747m1695o4151K24784M5087j59371j73175N04929k16405L16867
13991B529982Q226N58071L19489K216341N092622J3060860J9987039j7160575
13983B6612055j2438242m606729k133426j439236j324971m25730n45364K8073
13975C726430n62007j70258J78170m65535j88289J40240k53926p3328j22285M80874
$$ plain form
13965 2690086 2245387 2416347 2350361 2511513 1937732 1886697 2349274 2107794 1765004 1840677
13955 1840677 1927752 2114245 1741451 1779757 1748060 1912929 1798255 2176161 1752840 1899125
13945 1899125 1615904 1857551 1551937 2002135 1792142 1284825 1458780 1822041 1772649 1623470
13935 1623470 1779976 1569496 1501857 1681512 1537011 1434669 1626027 1465146 1559434 1363171
13925 1363171 1755442 1996374 1603956 1769459 1584482 1185118 1728686 1582685 1641296 1474807
13915 1474807 1387652 1372761 1365639 1459266 1414882 1190287 1492221 1366729 1341930 1428376 1297720
13904 1297720 1435054 1243622 1175889 1462553 1308195 1248202 1442740 1388434 1651217 1228186
13894 1228186 1470288 1107857 1057659 1158342 1357233 1093700 1313129 1203262 1589202 1205733
$$ packed form
13965B690086m44699J70960o5986J61152n73781n1035M62577k41480l42790P5673
13955A840677Q7075J86493l72794L8306l1697J64869j14674L77906m23321J46285
13945A899125k83221K41647l05614M50198k09993n07317J73955L63261m9392j49179
13935A623470J56506k10480o7639J79655j44501j02342J91358j60881R4288j96263
13925A363171L92271K40932l92418J65503j84977l99364N43568j46001N8611j66489
13915A474807q7155j4891p122R3627m4384k24595L01934j25492k4799Q6446j30656
13904A297720J37334j91432o7733K86664j54358n9993J94538n4306K62783m23031
13894A228186K42102l62431n0198J00683J98891k63533K19429j09867L85940l83469
$$ plain form
13884 1205733 1266908 1381341 1031838 1089162 1024900 1181975 1161143 1487786 1370935 1146613
13874 1146613 988974 1451729 1056995 1217654 1204278 1455758 1220336 1276583 1040509 1004262
13864 1004262 1107737 1079514 1325193 923299 883392 1169081 1106015 1100916 757103 817498
13854 817498 1125314 1007679 1247459 990223 660493 987770 1084001 1229529 958534 976106
13844 976106 933750 555126 889959 954253 1023287 678517 842172 965050 1120516 622623
13834 622623 1055230 743094 878987 803325 856830 899031 1159202 1004550 841734 1015974
13824 1015974 999489 587088 788346 835953 1276944 932792 992765 736925 568764 948907
13814 948907 1084392 1047259 938482 569538 829820 870552 651366 826541 725908 634627
$$ packed form
13884A205733O1175J14433l49503N7324o4262J57075k0832L26643j16851k24322
13874A146613j57639M62755l94734J60659j3376K51480k35422N6247k36074l6247
13864A004262J03475k8223K45679m01894l9907K85689o3066n099l43813O0395
13854H17498L07816j17635K39780k57236l29730L27277R6231J45528k70995J7572
13844I76106m2356l78624L34833O4294O9034l44770J63655J22878J55466m97893
13834F22623M32607l12136J35893p5662N3505M2201K60171j54652j62816J74240
13824A015974j6485m12401K01258M7607M40991l44152N9973k55840j68161L80143
13814I48907J35485l7133j08777l68944K60282M0732k19186J75175j00633r1281
$$ plain form
13804 634627 707896 553349 726834 809173 849195 500064 871936 576647 1014139 613163
13794 613163 622047 720612 849124 684752 886357 562740 780837 956376 712723 822723
13784 822723 712182 615023 590956 817973 508351 633201 773058 572370 583870 807291
13774 807291 687604 862474 545084 382360 933365 678828 684557 810650 802858 592073
13764 592073 498531 663511 739583 1132958 603539 417123 548484 744878 443759 342649
13754 342649 434170 562002 825777 510835 352334 763335 420082 540768 826107 458371
13744 458371 459340 649738 513230 501852 616580 435419 1027351 655819 361594 810036
13734 810036 527917 737448 618844 649741 680098 533764 592654 691131 395896 637432
$$ packed form
13804F34627P3269j54547J73485Q2339M0022l49131L71872k95289M37492m00976
13794F13163Q884R8565J28512j64372K01605l23617K18097J75539k43653J10000
13784H22723j10541r7159k4067K27017l09622J24850J39857k00688J1500K23421
13774H07291j19687J74870l17390j62724N51005k54537N729J26093p792k10785
13764E92073r3542J64980P6072L93375n29419j86416J31361J96394l01119j01110
13754C42649R1521J27832K63775l14942j58501M11001l43253J20686K85339l67736
13744D58371R69J90398j36508j1378J14728j81161N91932l71532k94225M48442
13734H10036k82119K09531j18604L0897L0357j46334N8890R8477k95235K41536
$$ plain form
13724 637432 232920 722702 594487 507526 755320 666331 688792 505383 391266 622219
13714 622219 482065 897600 633355 425653 657929 404494 804820 263433 585352 558304
13704 558304 657511 612795 441888 436911 365910 320651 553553 408749 629262 204461 423682
13693 423682 286230 627790 557647 662169 625573 493055 582472 710401 76429 226648
13683 226648 605202 152292 557386 531120 553940 610638 392164 431522 410176 227742
13673 227742 855897 685529 338756 483104 561229 624687 422769 308650 449816 561111
13663 561111 288755 313839 549821 375538 297720 540111 211152 528012 323021 514801
13653 514801 691179 607218 500540 531498 500594 402227 187613 251188 614204 162179
$$ packed form
13724F37432B32920M89782j28215q6961K47794q8989K2461j83409j14117K30953
13714F22219j40154M15535k64245k07702K32276k53435M00326B63433L21919k7048
13704E58304R9207m4716j70907m977p1001m5259K32902j44804K20513B04461K19221
13693D23682j37452L41560p0143J04522l6596j32518Q9417J27929G6429J50219
13683B26648L78554A52292M05094k6266K2820N6698k18474L9358k1346j82434
13673B27742O28155j70368C38756J44348P8125O3458k01918j14119J41166J11295
13663E61111k72356K5084K35982j74283p7818K42391B11152L16860k04991J91780
13653E14801J76378q3961j06678L0958l0904r8367A87613O3575L63016A62179
$$ plain form
13642 858039 340867 310031 356250 353276 206583 309665 669181 102162 438638 580853
13632 580853 497800 515475 411354 192244 471895 387673 535339 849223 232842 237212
13622 237212 331694 345180 376261 322265 467900 261784 445139 198862 171962 363596
13612 363596 288668 201438 438811 594718 278692 156524 228145 490456 -12819 39040
13601 373284 245905 369844 268028 472481 285129 301816 245433 391014 356049 153159
13590 293139 162156 304603 417196 347434 263079 337238 341097 322566 345620 265819 217623
13579 217623 146093 333381 307757 210544 447210 425623 439177 466512 286455 291388 380049
13568 380049 427649 611563 40091 462088 -79951 479163 331321 18562 -10044 149536
$$ packed form
13642H58039C40867l0836M6219k974j46693J03082L59516A02162L36476J42215
13632E80853q3053J7675j04121A92244K79651q4222J47666L13884B32842M370
13622B37212R4482J3486L1081n3996J45635k06116J83355A98862k6900J91634
13612C63596p4928q7230K37373J55907B78692j22168P1621K62311a2819C9040
13601C73284j27379J23939j01816K04453j87352J6687n6383J45581l4965A53159
13590B93139j30983J42447J12593o9762q4355P4159L859j8531K3054p9801m8196
13579B17623p1530J87288k5624r7213K36666k1587J3554K7335j80057M933Q8661
13568C80049M7600J83914D0091M21997g9951D79163j47842A8562a0044A49536
$$ plain form
13557 177715 284888 321099 233822 256195 295844 410926 409119 238812 443838 241422 196555
13546 196555 136881 364651 462814 326628 69857 452002 153941 558557 124566 304666
13536 304666 492664 553292 211543 350938 241877 212682 205247 241876 94284 498319 119856
13524 111315 427281 82701 153076 30922 250857 47730 174123 446776 247970 510972
13514 510972 373084 176154 516648 286999 678488 -79771 142396 294305 627796 498102
13504 498102 4251 161527 561485 378058 326523 200947 50755 197905 121092 210682 204931
13493 204931 136516 112756 38706 -90205 336595 143377 415921 593326 314043 147891
13482 -10086 281335 288004 191740 -3115 383838 130135 234565 523206 293791 231863 50655
$$ packed form
13557A77715J07173L6211q7277K2373L9649J15082j807j70307K05026k02416m4867
13546A96555n9674K27770R8163j36186F9857L82145A53941M04616A24566J80100
13536C04666J87998O0628B11543J39395j09061k9195p435L6629I4284M04035A19856
13524A11315L15966H2701P0375C0922K19935D7730J26393K72653j98806K63002
13514E10972j37888A76154L40494k29649L91489g9771A42396J51909L33491j29694
13504D98102D251J57276L99958j83427n1535j25576E0755J47150p6813Q9590n751
13493B04931o8415k3760C8706i0205C36595A43377K72544J77405k79283A47891
13482a0086B81335O669r6264c115C83838A30135J04430K88641k29415o1928E0655
$$ plain form
13470 399645 182672 331440 474263 333861 145807 -250682 125925 173597 755168 324827
13459 142949 612152 36708 57114 284724 103597 185146 34145 52935 146000 -264236 60720
13447 370695 163384 436078 203894 426968 433724 128382 108325 597100 279589 -19053
13436 166912 167407 171161 362456 74544 -15047 96522 54761 134335 178121 91412 340962 -216994
13423 13614 392343 259699 571841 284576 191808 238875 544896 233166 193790 258086
13413 258086 165216 -178572 214759 135476 -156584 273759 171481 378434 191557 488298
13403 488298 396323 214689 57995 157112 282553 213727 -84984 203479 -119438 459316
13392 233179 186230 54015 347901 443979 129916 87896 76459 -7017 -87023 390272 192361
$$ packed form
13470C99645A82672J48768J42823j40402A45807b50682A25925M7672N81571C24827
13459A42949M69203C6708K0406K27610A03597Q1549C4145J8790R3065b64236F0720
13447C70695A63384K72694B03894K23074O756A28382k0057M88775B79589a9053
13436A66912M95L754J91295G4544a5047I6522m1761P9574M3786q6709K49550b16994
13423A3614L78729j32644L12142B84576r2768M7067L06021B33166l9376O4296
13413B58086r2870a78572B14759p9283a56584B73759j02278K06953j86877K96741
13403D88298r1975j81634E7995R9117J25441o8826h4984B03479a19438D59316
13392B33179m6949E4015K93886R6078A29916m2020j1437g017q0006C90272A92361
$$ plain form
13380 290532 469691 118215 107564 483846 110262 450230 67702 173262 221120 201144
13370 201144 99893 244622 401755 190797 125473 67495 337730 569750 354571 9580
13359 126403 512292 318622 31910 69070 69927 14902 365274 331352 261276 27072 96896
13348 96896 278871 241849 495881 214153 167023 301721 270380 375163 565987 -41027
13337 387489 218875 5887 -296824 350001 143290 413061 -33680 -9975 299661 471246
13327 471246 224704 195477 176512 107381 -161444 629683 -133111 450708 -45362 159891
13316 234732 150717 201272 -69823 362354 106467 315227 -3007 343761 17917 124795 -128951
13304 182845 -61184 -64202 68148 226722 -71825 14631 220024 326562 -8529 321644 302250
$$ packed form
13380B90532J79159A18215j0651L76282A10262L39968F7702J05560M7858j9976
13370B01144I9893J44729J57133A90797o5324n7978K70235K32020k15179I580
13359A26403L85889j93670C1910L7160Q57A4902L50372l3922p0076B7072O9824
13348I6896J81975l7022K54032B14153m7130J34698l1341J04783J90824d1027
13337C87489j68614E887b96824C50001A43290K69771c3680i975B99661J71585
13327D71246B24704k9227j8965o9131a61444F29683a33111D50708d5362A59891
13316B34732q4015N0555f9823C62354A06467K08760c007C43761A7917J06878a28951
13304A82845f1184l018F8148J58574g1825A4631K05393J06538h529C21644j9394
$$ plain form
13293 302250 179575 -62685 234043 -95502 238908 -171079 -35767 65176 436642 -14160
13282 58829 111964 144697 325363 162917 339275 -8110 217907 -273819 35359 221135 500382
13271 500382 158243 264392 90877 -37083 132037 30034 147764 160793 199177 36144 97894
13260 97894 327570 322202 -269675 393458 81204 -68715 232087 4554 47098 -57770 -41328
13249 -41328 50784 164273 557869 190409 24989 264263 122077 729 160789 50914 94900
13238 94900 171459 1451 -8192 -153512 221933 252386 -134746 -63559 57162 -73094 160770
13226 73901 120720 12778 111751 101696 325009 108339 -5608 203792 -63801 278264 442687
13215 442687 220653 53091 197570 -25628 -39657 -16133 -321950 164183 262939 201293 126952
$$ packed form
13293C02250j22675f2685B34043i5502B38908a71079c5767F5176L71466a4160
13282E8829N3135L2733J80666j62446J76358h110B17907b73819C5359J85776K79247
13271E00382A58243J06149I0877c7083A32037C0034J17730J3029L8384C6144O1750
13260I7894K29676n368b69675C93458H1204f8715B32087D554M2544e7770J6442
13249d1328E0784J13489L93596A90409B4989K39274A22077G29J60060E0914M3986
13238I4900P6559A451h192j45320B21933L0453a34746f3559E7162g3094A60770
13226G3901M6819A2778R8973j0055K23313A08339e608B03792f3801B78264J64423
13215D42687B20653E3091J44479b5628j4029a6133l05817A64183R8756o1646p4341
$$ plain form
13204 126952 -73309 76660 -120848 -5502 376960 41425 62167 139707 -230677 16733 -174828
13192 358645 396531 -85516 9262 -51928 -39023 33736 14981 261076 -121252 -126865 -103740
13181 -103740 38580 -113694 31749 32586 213780 85708 -96987 47638 -261738 -117799 64393
13169 -37118 47870 105954 307511 -127094 115176 -103034 156290 91689 -70213 -138558 73372
13157 -126850 -80127 83897 187097 61500 114949 114566 -154028 332926 -286306 -229928 -33078
13145 -293752 294832 -12802 22155 384813 208505 -127069 96805 252140 20778 35409
13135 35409 -450960 236496 -96539 -98456 203709 670 66359 27834 155746 188218 244800
13124 244800 289946 29685 14727 112611 -102127 173726 -51046 -400717 111094 15745 -194071
$$ packed form
13204A26952g3309G6660a20848e502C76960D1425K0742P7540b30677A6733a74828
13192C58645L7886h5516I262e1928J2905C3736A4981K46095a21252n613K3125
13181a03740C8580a13694C1749Q37J81194H5708i6987D7638b61738a17799F4393
13169c7118D7870N8084K01557a27094A15176a03034A56290o4601g0213o8345G3372
13157a26850M6723H3897J03200F1500N3449l83a54028C32926b86306N6378c3078
13145b93752B94832a2802B2155L62658j76308a27069I6805J55335B0778J4631
13135C5409d50960B36496i6539j917B03709F70O5689B7834J27912L2472N6582
13124B44800M5146B9685A4727R7884a02127A73726e1046l49671A11094A5745a94071
$$ plain form
13112 370090 -98576 6697 70992 238207 -34671 62202 166147 278344 -361065 101637 303840
13101 303840 129828 79575 -315282 146798 399270 36170 285864 191763 468317 -259654
13090 233178 -150756 -133383 -141411 190036 -95217 94412 20287 227293 279007 249916 -30045
13078 177172 -30046 210824 173809 124412 159130 -48637 147972 107548 129901 358349 103751
13066 -51853 -240211 171343 -145773 149284 285893 43624 -35513 -151730 5440 -7016 195476
13054 -120388 -61725 189855 129990 -44298 -94462 -64478 -58064 225641 -61356 102736 48166
13042 232631 285741 1825 171663 10307 258966 -10179 59753 -35943 167325 84676 331474
13031 331474 -8579 216435 -58888 -59778 168617 -61565 13133 -246201 -139526 1744 -50902
$$ packed form
13112C70090i8576F697O4295J67215c4671F2202J03945J12197c61065A01637K02203
13101C03840A29828n0253c15282A46798K52472C6170K49694r4101K76554b59654
13090B33178a50756J7373q028A90036i5217I4412B0287K07006N1714k9091c0045
13078A77172c0046B10824l7015m9397L4718d8637A47972m0424K2353K28448A03751
13066e1853j88358A71343a45773A49284J36609D3624c5513j16217E440g016A95476
13054a20388N8663A89855n9865d4298n0164K9984O414B25641f1356A02736D8166
13042B32631N3110A825J69838A0307K48659a0179E9753c5943A67325q2649K46798
13031C31474h579B16435e8888q90A68617f1565A3133b46201J06675A744e0902
$$ plain form
13019 -257943 240891 183059 201828 286574 124285 189520 247245 -174154 43474 269700 320027
13008 320027 326701 366032 123585 193515 -17073 -75168 172911 319960 133280 170547 75543
12996 -125384 -35979 207111 192230 -8520 5904 -183199 1103 83130 320380 64675 -337379
12984 116656 -205868 185086 48682 40943 -94997 156772 190108 -41489 51766 -294453 -29026
12972 21249 251722 -90222 73294 73313 -217090 212092 -36697 -132171 -75617 -139572 282702
12960 104412 -187777 -241017 172978 -141601 115507 -61572 381212 -213343 -205975 117733
12949 55496 65337 -162357 -90346 295271 -78391 -29629 32144 105022 71095 39095 -181682
12937 -6079 -215058 191973 231378 84929 -29151 69332 -29773 443308 110938 123941 129762
$$ packed form
13019b57943B40891n7832J8769Q4746A24285O5235N7725a74154D3474K26226N0327
13008C20027O674L9331A23585O9930a7073n8095A72911J47049A33280L7267G5543
12996a25384c5979B07111j4881h520E904a83199A103Q2027K37250F4675c37379
12984A16656b05868A85086D8682p739i4997A56772L3336d1489E1766b94453b9026
12972B1249K30473i0222G3294J9b17090B12092c6697r5474N6554o3955B82702
12960A04412a87777n3240A72978a41601A15507f1572C81212b13343P368A17733
12949E5496R841a62357P2011B95271g8391b9629C2144P2878l3927l2000a81682
12937f079k08979A91973L9405H4929b9151F9332b9773D43308A10938J3003N821
$$ plain form
12926 129762 83130 237181 235713 -121605 -263647 -96625 -154631 -104898 237613 -83345 -87689
12915 -87689 177707 329267 376596 391019 -27462 -89685 -46924 -302538 79415 139976 -34681
12903 127851 -276436 47142 194509 155005 -255771 -49075 413403 34119 -38677 355300
12892 346952 91362 -15648 97938 18182 114885 -205980 360075 -9504 279897 -164347 -98414
12881 -98414 268374 -420271 -31112 156812 156000 -339325 4901 236304 -10660 279406 24349
12869 -42268 85322 -289912 16775 95259 48525 -72281 -100431 63119 -29507 64356 -308475
12857 42809 -441664 179643 142709 55099 13989 -95753 19069 -30630 156977 111718 301709
12846 301709 113537 147937 -89984 -69248 -246786 2983 38854 -15472 13343 -128812 153079
$$ packed form
12926A29762m6632J54051j468a21605j42042i6625n8006M9733B37613h3345m344
12915h7689A77707J51560M7329J4423b7462o2223M2761k55614G9415O0561c4681
12903A27851b76436D7142J47367l9504b55771d9075D13403C4119c8677C55300
12892C46952I1362a5648I7938A8182R6703b05980C60075i504B79897a64347O5933
12881i8414B68374d20271c1112A56812q12c39325D901K31403a0660B79406B4349
12869d2268H5322b89912A6775P8484m6734g2281k8150F3119b9507F4356c08475
12857D2809d41664A79643l6934E5099A3989i5753A9069c0630A56977m5259J89991
12846C01709A13537L4400h9984K0736j77538B983L5871a5472A3343a28812A53079
$$ plain form
12834 -160584 66891 -54731 -44232 1934 78490 18471 178115 216526 -35013 -52390 -45160 -393331
12822 -393331 64213 146609 -88986 -321842 -297066 45278 -448470 284455 -308710 -290478 95505
12810 -228009 281996 134500 -72756 -132170 -102674 182951 -56073 244778 -329508 126666
12799 102062 -16003 6522 -29786 268140 -97562 -33437 17917 -146378 -359092 227365 -114036
12787 35961 22087 -104594 -10840 52715 97885 -144634 -7061 -212113 -184265 346989 -135332
12775 11612 -136425 -23486 -721 112364 -320292 109843 225288 124987 126799 228749 -72989
12763 -12821 -276853 12635 -75661 -178659 -9870 -180541 -150302 37329 -78535 -34869 59375
12751 281876 -20179 143328 -157016 93919 -32549 193483 354865 -84609 128725 50305
$$ packed form
12834a60584F6891e4731J0499A934P6556A8471J59644L8411c5013j7377P230l48171
12822c93331F4213Q2396h8986k32856K4776D5278d48470B84455c08710J8232I5505
12810b28009B81996A34500g2756n9414K9496A82951e6073B44778c29508A26666
12799A02062a6003F522b9786B68140i7562c3437A7917a46378k12714B27365a14036
12787C5961j3874a04594a0840E2715M5170a44634g061k05052K7848C46989a35332
12775A1612a36425b3486g21A12364c20292A09843J15445j00301J812J01950g2989
12763a2821k64032A2635g5661j02998i870j70671L0239C7329g8535c4869E9375
12751B81876b0179A43328a57016I3919c2549A93483J61382h4609A28725E0305
$$ plain form
12740 71401 -26045 124593 -76333 81204 63258 -142194 50713 -176136 116611 4896 257184
12729 257184 204167 -264495 -18870 294246 -251578 -117886 -78865 91625 132617 79270 70497
12718 70497 -135573 75210 -187456 75952 -68854 -8465 259461 508869 -135170 45203 315596
12707 315596 46883 145562 498005 143883 -130318 -177333 83996 72873 94726 -93702 12090
12695 10171 -112372 -92363 -16929 -111039 -69808 72160 31646 -160568 17009 -339715 175376
12683 201294 34869 -76660 258423 102976 -33236 124558 584781 -286997 104464 -301036
12672 -98469 145907 -308449 51146 -383783 248174 -319131 409701 83750 66687 91028
12662 91028 -205240 -340072 272593 135583 453478 -140082 101276 137486 -336655 123790
$$ packed form
12740G1401b6045A24593g6333H1204j7946a42194E0713a76136A16611D896K52288
12729B57184n3017b64495a8870B94246b51578a17886L9021I1625M0992n3347q773
12718G0497a35573G5210a87456G5952f8854h465B59461K49408a35170D5203K70393
12707C15596D6883R8679L52443A43883a30318m7015H3996j1123K1853i3702A2090
12695A0171a12372K0009a6929r4110M1231G2160C1646a60568A7009c39715A75376
12683B01294C4869g6660B58423A02976c3236A24558M60223b86997A04464c01036
12672i8469A45907c08449E1146c83783B48174c19131D09701H3750j7063K4341
12662I1028b05240j34832B72593A35583L17895a40082A01276L6210c36655A23790
$$ plain form
12651 -16424 66705 -16379 45167 -23876 -135340 319749 181533 209728 -197512 20689 95068
12640 95068 374740 351367 -32484 -50916 297258 -361668 -126205 111810 86394 -35075 321803
12628 300601 65572 49867 109379 346561 -180919 240796 101506 413890 95206 50943
12618 50943 43778 99151 -4777 -193632 367413 301396 70114 88204 -15505 319177 -109857
12606 175979 -123593 20603 239055 -16870 8211 313743 180924 192235 -35186 78612 116879
12595 116879 -76638 115963 88544 209666 -31337 73336 -25588 67236 34752 253973 455525
12584 455525 80337 170102 -212925 110368 47911 -61823 -104703 -201066 -183414 -108438 -443381
12573 -443381 19028 453761 170295 -113968 -182673 -95785 -192645 85183 187565 -108231
$$ packed form
12651a6424F6705a6379D5167b3876j11464C19749j38216K8195a97512B0689P4379
12640I5068K79672k3373c2484j8432B97258c61668a26205A11810k5416c5075C21803
12628C00601F5572j5705N9512K37182a80919B40796A01506L12384I5206m4263
12618E0943p165N5373d777j88855C67413o6017G0114J8090a5505C19177a09857
12606A75979a23593B0603K18452a6870H211L05532j32819J1311c5186G8612L8267
12595A16879g6638A15963k7419J21122c1337G3336b5588F7236l2484K19221K01552
12584D55525H0337Q9765b12925A10368D7911f1823m2880r6363J7652P4976l34943
12573d43381A9028M34733A70295a13968o8705Q6888r6860H5183J02382a08231
$$ plain form
12562 -108322 -51482 68640 67797 143012 56427 7823 -114676 40942 -254278 -207052 -52865 -48627
12550 -48627 -26365 -203637 -97063 -68287 -153081 -71840 -120463 -138935 -313503 -136099 278916
12538 -71773 -211098 -295594 -118639 -311320 25775 -1051 151540 120512 80112 182417 -27476
12526 93973 -3894 18800 -67142 15055 -115378 180472 83217 178349 -201726 181315 -107349
12514 199743 -107737 -87454 -62450 37467 226027 -126069 172883 -181692 -76978 302190
12503 129029 -13868 -84843 165103 89364 8313 51333 82376 31567 198458 -132214 -3559
12491 -120898 405175 24985 22765 -135999 -115850 -324509 -253265 -145149 183882 213889 140000
12480 140000 -282576 -195932 -132127 -141786 -223303 -51010 -33914 67399 -129672 139837 15730
$$ packed form
12562a08322e1482F8640q43P5215E6427G823a14676D0942b54278M7226e2865M238
12550d8627K2262j77272i7063K8776q4794g1840m8623j8472j74568a36099B78916
12538g1773j39325q4496a18639j92681B5775a051A51540l1028m0400J02305b7476
12526I3973c894A8800f7142A5055a15378A80472H3217R5132b01726A81315a07349
12514A99743a07737K0283K5004C7467J88560a26069A72883a81692g6978C02190
12503A29029a3868p0975A65103p5739H313M3020L1043C1567J66891a32214c559
12491a20898D05175B4985k220a35999K0149k08659P1244J08116A83882L0007p3889
12480A40000b82576Q6644O3805r659q1517e1010J7096F7399a29672A39837A5730
$$ plain form
12468 -869 -135290 -213060 -92285 217504 58763 171685 35500 487483 82224 24302 -53570
12456 -29805 27254 152315 72377 -213833 157290 -2643 -74090 -405941 -183493 -24678 41898
12444 211021 -192866 283126 47542 -84423 137114 261033 44859 56823 176422 108260
12434 108260 -158178 30802 -96925 50456 139657 -4653 9016 -7115 -72225 -139589 -184901 -51048
12421 -102433 -27489 209264 -74179 144586 42000 -102199 65800 83488 -159311 -100193 95351
12409 252252 -115170 -27733 -94742 153329 151719 -93400 225172 -82038 59923 -382913 341409
12397 -81395 196604 -204064 171897 186368 -57636 230335 302408 3635 143320 57732 -59330
12385 136590 -45990 -28356 -32858 133426 83523 210796 153112 182698 -67707 332620 -85864
$$ packed form
12468h69j34421p7770i2285B17504E8763J12922C5500M51983H2224B4302e3570
12456b9805B7254J25061G2377b13833A57290b643p1447l31851a83493b4678D1898
12444B11021a92866B83126D7542h4423A37114J23919D4859J1964J19599o8162
12434A08260a58178C0802i6925E0456Q9201d653I016g115o5110o7364m5312e1048
12421a02433b7489B09264g4179A44586D2000a02199F5800J7688a59311N9118I5351
12409B52252a15170b7733o7009A53329j610i3400B25172h2038E9923c82913C41409
12397h1395A96604b04064A71897J4471e7636B30335P2073C635J39685E7732e9330
12385A36590d5990J7634m502A33426m9903J27273n7684K9586f7707C32620h5864
$$ plain form
12373 111510 94375 -20143 17554 -142098 -189538 -31781 23495 114711 182815 82892 153936
12362 153936 -161158 -188292 136884 -59865 -183030 -45443 240825 -94540 410598 57384
12351 93521 89058 -228848 -220171 51466 -122537 -200012 -128302 295340 -321195 -35424 136693
12339 -138386 147159 343010 -101145 -68931 61828 -11808 141718 -46576 186121 455910
12329 455910 231639 -75073 171085 234321 295456 385283 -110563 258283 234376 105473
12318 89499 137603 33646 222417 120993 41223 151958 359700 -86866 -205916 362637
12307 73456 115501 151621 148043 -128591 -34885 -78609 611915 70203 155550 205728 25494
12295 -245938 -111998 68892 219421 42410 267469 248339 249254 211367 -43714 -297049 152141
$$ packed form
12373A11510j7135b0143A7554a42098m7440c1781B3495R1216O8104H2892P1044
12362A53936a61158k7134A36884e9865j23165d5443B40825i4540D10598E7384
12351I3521m463b28848Q677E1466a22537p7475P1710B95340c21195c5424A36693
12339a38386A47159J95851a01145L2214F1828a1808A41718d6576A86121K69789
12329D55910k24271g5073A71085O3236O1135Q9827a10563B58283k3907A05473
12318H9499M8104C3646J88771j01424D1223J10735K07742h6866j19050C62637
12307G3456M2045L6120l578a28591c4885m3724F11915G0203Q5347N0178B5494
12295b45938a11998F8892J50529D2410K25059j9130R15l7887d3714k53335A52141
$$ plain form
12283 96733 307887 -2959 143225 -107161 -49743 -374097 274812 -161296 140221 97188
12273 97188 346679 -59727 163252 51139 -98839 277346 309906 106451 140427 173432 531593
12262 531593 534179 -115243 233650 394463 -20034 116424 73737 -38555 -199655 431267
12251 253206 123172 751066 442250 81235 119838 222512 124866 208814 -64473 383079
12240 324603 113720 -39564 -240368 -125962 248372 125488 -288092 156299 208997 55635
12229 106685 290793 135607 450761 9285 -71299 389425 -78946 82162 228398 238306 411335
12218 411335 135521 287238 96077 158807 -131528 412593 -257150 395673 138424 -28002
12207 -111819 467549 205050 13866 90867 470473 237017 -37092 185832 409126 80301
$$ packed form
12283I6733K11154b959A43225a07161d9743l24354B74812a61296A40221m3033
12273I7188K49491e9727A63252E1139i8839B77346L2560A06451L3976L3005L58161
12262E31593K586a15243B33650J60813b0034A16424m2687c8555j61100D31267
12251B53206A23172O27894l08816H1235L8603J02674r7646Q3948f4473C83079
12240C24603A13720c9564k00804J14406B48372j22884b88092A56299N2698E5635
12229A06685J84108A35607L15154I285g1299C89425g8946H2162J46236R908J73029
12218D11335A35521J51717I6077O2730a31528D12593b57150C95673A38424b8002
12207a11819D67549B05050A3866P7001L79606k33456c7092A85832K23294H0301
$$ plain form
12196 -23646 219500 -121337 -213247 65311 -99102 194272 -18192 185232 418432 22047 -35051
12184 225873 -140272 38781 -5325 146058 75286 108441 404413 108871 118480 -77629 125189
12172 -51604 442453 -260137 151466 -193732 281063 143705 316468 177425 -15453 348756
12161 18246 45000 75655 205664 56361 177221 286636 237073 -241369 313469 89304 348547
12150 348547 68728 118760 41651 130275 -115767 161926 -61359 48839 139223 202226 -167131
12138 243564 -226636 -120295 245311 275409 242078 366174 190682 -165078 443871 -130008
12127 -218566 -100438 59226 -388690 4138 107261 -31248 314063 162141 44651 123847 83737
12116 83737 168027 212415 265709 100340 231260 -99975 38550 -271360 275354 -126949 364749
$$ packed form
12196b3646B19500a21337r1910F5311i9102A94272a8192A85232K33200B2047c5051
12184B25873a40272C8781e325A46058p0772L3155K95972A08871R609g7629A25189
12172e1604D42453b60137A51466a93732B81063j37358J72763j39043a5453C48756
12161A8246K6754L0655J30009E6361J20860J09415m9563b41369C13469H9304K59243
12150C48547F8728N0032D1651Q8624a15767A61926f1359D8839R0384O3003a67131
12138B43564b26636J06341B45311L0098l3331J24096j75492a65078D43871a30008
12127b18566a00438E9226c88690D138J03123c1248C14063j51922D4651P9196m0110
12116H3737Q4290M4388N3294A00340J30920i9975C8550b71360B75354a26949C64749
$$ plain form
12104 23644 340458 -195698 214567 -196796 -297029 -207408 439958 170201 -3769 -32297
12094 -32297 154662 -5444 116874 73590 169731 284927 16181 330382 49856 174913 138229
12083 138229 -91205 495248 -15448 300190 90597 176896 -230851 416888 251204 110231
12072 154760 24783 -31212 -2648 515790 183266 305725 274176 65354 112277 213229 -188086
12060 206576 50918 374825 143803 151023 229624 -41790 174270 95367 -84371 -123926 -79546
12049 -79546 77733 -156039 85736 6281 82675 401493 224004 -97247 -756 127459 221547
12038 221547 64900 -183075 19041 20542 -252165 146639 -303693 13762 -67864 302028 -153910
12026 -3168 -75357 24326 121817 90072 -209971 -324808 -124554 197595 -249623 32582 467097
$$ packed form
12104B3644L16814a95698B14567a96796j00233Q9621D39958A70201c769k8528
12094c2297A54662e444A16874m3284R6141J15196A6181L14201D9856J25057l6684
12083A38229i1205D95248a5448C00190I0597Q6299b30851D16888j65684A10231
12072A54760B4783c1212b648E15790A83266J22459l1549F5354M6923J00952a88086
12060B06576E0918L23907A43803P220P8601d1790A74270p8903h4371l9555M4380
12049g9546G7733a56039H5736F281P6394L18818j77489i7247g56A27459R4088
12038B21547F4900a83075A9041J501b52165A46639c03693A3762f7864C02028a53910
12026c168p2189B4326R7491l1745b09971j14837a24554A97595b49623C2582M34515
$$ plain form
12015 467097 108237 -109021 137457 97265 -114080 -84449 144091 -88737 -86820 -115304 -90947
12004 -90947 -94208 126959 18350 173519 183431 215046 -141525 14298 187081 202135 175443
11993 175443 50141 76727 -65478 -87399 120552 -282270 85632 127458 -374074 -48686 -35406
11982 -35406 126650 -119333 -170615 -160321 134794 189627 219497 -202921 -198222 -8404 -88652
11971 -88652 9115 -18959 126809 -88903 119780 55709 97975 -63107 163139 -9188 -205221
11960 -205221 -118981 82046 -52726 -35594 1176 -7262 -329380 -66173 185019 -46141 -219127
11949 -219127 -146556 45833 -217893 125258 -236 -10749 -183732 -66288 -331700 -54673 166337
11937 -152851 172505 -93273 201292 435232 252963 -2537 -28774 184537 145109 -459755
$$ packed form
12015D67097A08237a09021A37457m0192a14080K9631A44091h8737J917k8484K4357
12004i0947l261A26959A8350J55169R912L1615a41525A4298J72783J5054k6692
11993A75443E0141K6586f5478k1921A20552b82270H5632M1826c74074d8686J3280
11982c5406A26650a19333n1282J0294A34794N4833K9870b02921M699h404q0248
11971h8652I115a8959A26809h8903A19780E5709M2266f3107A63139i188j96033
11960b05221Q6240H2046e2726J7132A176g262l22118f6173A85019d6141j72986
11949b19127P2571D5833b17893A25258b36j0513j72983f6288k65412e4673A66337
11937a52851A72505i3273B01292K33940j82269b537k6237A84537l9428d59755
$$ plain form
11926 103388 -244302 -159975 -245529 50180 72173 88774 103241 -214943 -254285 -44361 -367188
11915 -367188 44903 -35972 205661 -61540 39295 -92725 8867 22384 -72851 -329662 -85700
11903 102889 -29288 252162 -106932 -142223 115894 10349 -365748 224773 101242 -48028
11892 -275266 95397 6187 -187600 -168618 -61840 135122 143731 -110562 98467 202026 308676
11881 308676 -99600 146038 320323 -273587 62829 183984 -108247 46108 31380 -492533
11870 148208 -157084 20600 47748 122448 -34804 -185837 14899 157323 -37038 -32548 -66291
11859 -66291 -143969 44084 97392 -273259 233454 -248074 320623 -122147 117924 -151033
11848 -208456 -126132 -43930 -146097 -273222 46083 -59128 -152549 10513 -22712 -277756 -98
$$ packed form
11926A03388b44302Q4327q5554E0180K1993J6601J4467b14943l9342d4361l22827
11915c67188D4903c5972B05661f1540C9295i2725H867J3517g2851k56811h5700
11903A02889b9288B52162a06932l5291A15894A0349c65748B24773A01242d8028
11892b75266I5397F187a87600J8982f1840A35122Q609a10562I8467J03559J06650
11881C08676i9600A46038J74285b73587F2829J21155a08247D6108j4728d92533
11870A48208a57084B0600K7148P4700c4804j51033A4899J42424c7038M490l3743
11859f6291p7678D4084N3308b73259B33454b48074C20623a22147A17924a51033
11848b08456Q2324d3930j02167j27125D6083e9128r3421A0513b2712k55044i8
$$ plain form
11836 -69343 -211556 97509 38909 -329658 -303616 -50407 -45768 -219360 140695 -285251 11728
11824 81237 159836 205070 92809 -60415 -85761 19110 9604 -110499 -336179 16108 260016
11813 260016 111710 -225559 71375 -4602 -308324 -126091 7589 122252 -45835 -76097 196298
11801 -197091 207825 -39292 -187524 25076 -123514 220999 20738 39056 39133 294409 -118242
11789 -188515 -365936 -138047 10481 -211745 -216097 -238656 -140087 -89249 -248771 100631 -51898
11777 2895 28618 -61253 -101613 -64636 -197153 -81827 -140685 -265805 -47590 146819 -113077
11765 19593 -2685 -286316 127071 99237 -213310 -252921 -12938 114205 113398 16308 -298485
11753 -10258 96958 -73669 -218710 -260398 -152849 43387 -100884 225140 265615 -16284 -298219
$$ packed form
11836f9343j42213I7509C8909c29658K6042e0407M639j73592A40695b85251A1728
11824H1237P8599M5234I2809f0415k5346A9110r506a10499k25680A6108K43908
11813B60016A11710b25559G1375d602l03722a26091G589J14663d5835l0262A96298
11801a97091B07825c9292j48232B5076a23514B20999B0738J8318P7K55276a18242
11789a88515j77421a38047A0481b11745m352k2559R8569N0838j59522A00631e1898
11777B895K5723f1253m0360L6977j32517h1827n8858j25120d7590A46819a13077
11765A9593b685k83631A27071k7834b13310l9611a2938A14205q07A6308b98485
11753a0258I6958g3669j45041m1688J07549D3387a00884B25140M0475a6284k81935
$$ plain form
11742 -298219 -17374 -182644 -77361 -112448 -85919 473285 149052 151248 259847 67873 233747
11731 233747 -145059 184497 190823 22367 -27533 53698 -172961 -309140 205778 -124807
11720 288293 137419 -109975 125531 124225 -138427 362681 15346 187976 277383 -214386
11709 -77652 172630 -65249 -184232 -168122 131790 80597 310614 145749 278865 182462
11699 182462 22751 -19977 255137 20386 -50631 72327 193762 371234 160463 -166173
11688 -51505 2259 -107223 59554 305981 -74384 168430 61713 -73953 -60947 -256434 34717
11676 212021 -32377 276646 -193605 -124378 64617 -292105 177330 -110107 112972 143827
11666 143827 -107301 106185 102301 1371 -7656 -56544 -150919 -140864 -5193 158655 46816 -94888
$$ packed form
11742b98219a7374j65270g7361l5087K6529D73285A49052K196J08599F7873J65874
11731B33747a45059A84497O326B2367b7533E3698a72961j36179B05778a24807
11720B88293A37419a09975A25531j306a38427C62681A5346J72630Q9407b14386
11709g7652A72630f5249j18983J6110A31790n1193K30017A45749J33116r6403
11699A82462B2751a9977B55137B0386e0631G2327J21435J77472A60463a66173
11688e1505B259a07223E9554K46427g4384A68430F1713g3953J3006j95487C4717
11676B12021c2377B76646a93605O9227F4617b92105A77330a10107A12972L0855
11666A43827a07301A06185l884A371g656m8888r4375J0055e193A58655D6816i4888
$$ plain form
11653 -208257 -130506 107064 135085 -173251 -382 142721 -205709 -275507 -27244 210970 90358
11641 -319796 52833 -157752 192627 -2641 198012 -103718 139426 116986 274587 -113300
11630 -206396 -96227 55379 232071 132897 170562 -126777 -273194 -27399 222833 -66255 -3487
11618 126335 102557 24728 -183980 -87749 -134495 -76541 -43131 22525 -341918 -187253 10745
11606 -90263 23297 229943 -68262 -280424 51139 152966 36742 400148 11796 227735 88793
11594 -62971 114525 -86681 154185 36417 57945 224919 -363332 145837 -53340 554743
11583 2919 -71994 357628 338576 188249 124034 -185983 -24795 -35164 -853 -37303 -351561
11572 -351561 -139748 113354 69793 262529 43796 154688 -122715 124802 129125 150206
$$ packed form
11653b08257P7751A07064K8021a73251c82A42721b05709o9798b7244B10970I0358
11641c19796E2833a57752A92627b641A98012a03718A39426k2440J57601a13300
11630b06396i6227E5379J76692r9174L7665a26777j46417b7399B22833f6255c487
11618A26335k3778B4728a83980h7749m6746N7954L3410B2525c41918J54665A0745
11606i0263B3297K06646f8262k12162E1139J01827C6742L63406A1796K15939H8793
11594f2971A14525h6681A54185C6417K1528J66974c63332A45837e3340E54743
11583B919g1994C57628j9052j50327o4215a85983b4795j0369h53l6450l14258
11572c51561a39748A13354m3561J92736D3796J10892a22715A24802M323K1081
$$ plain form
11562 150206 148428 140137 90088 -261776 6412 -188653 158707 -50782 65655 224084 -6636
11550 169280 -229998 -180698 21916 264611 57422 -54774 11550 7655 12871 105347 275989
11539 275989 212288 -26988 67283 -102658 263549 31681 38169 178061 -115107 119428 438685
11528 438685 100417 25692 327859 -167567 117262 433013 11124 -179615 -136866 108381
11517 190039 40464 -176432 78673 -31632 -197683 -6684 104348 -108587 31261 -16030 20313
11505 -104096 7735 -76899 -20267 67290 253269 -44671 -101045 -138358 -126494 9622 341863
11494 341863 109579 -84500 266906 -10262 -61305 247571 -42218 156897 376974 158712
11483 284650 -52009 -40478 89637 2252 -85595 -32701 53696 -14097 14176 397761 172910
$$ packed form
11562A50206j778q291n0049b61776F412a88653A58707e0782F5655J58429f636
11550A69280b29998M9300B1916K42695E7422e4774A1550l895N216R2476J70642
11539B75989o3701b6988F7283a02658B63549C1681O488J39892a15107A19428L19257
11528D38685A00417B5692L02167a67567A17262L15751A1124a79615M2749A08381
11517A90039D0464a76432G8673c1632j66051f684A04348a08587C1261a6030B0313
11505a04096G735g6899b0267F7290J85979d4671n6374l7313J1864I622L32241
11494C41863A09579h4500B66906a0262n1043B47571d2218A56897K20077A58712
11483B84650e2009J1531H9637B252h5595c2701E3696a4097A4176L83585A72910
$$ plain form
11471 -364750 97902 298790 37333 43156 341154 169031 8383 124894 116657 285105 109842
11459 197932 206390 162655 -86087 55616 201171 -66919 149822 149840 237531 243185 415245 21519
11446 -63504 225905 130302 173759 -32929 -84998 196720 84798 52111 -326574 68922 -114812
11434 358513 -100806 198989 219957 119351 -117181 -68064 76195 32501 54162 221331
11424 221331 87294 -147886 -205067 -20798 33476 -182081 -172603 349070 -78403 -294231 -128221
11412 1868 74058 173171 -188240 -9456 -18277 -259119 109240 4548 21328 -143658 -338408
11401 -338408 168007 150802 -138783 60688 242611 192092 140043 81216 353745 -42545 -91593
11390 -91593 350542 -173562 -83078 208856 -89861 312487 270565 34298 -122929 -108895 21809
$$ packed form
11471c64750I7902K00888C7333N823K97998A69031H383J16511q237J68448A09842
11459A97932Q458m3735h6087E5616J45555f6919A49822J8Q7691N654J72060B1519
11446f3504B25905r5603M3457c2929n2069A96720H4798l2687c26574F8922a14812
11434C58513a00806A98989K0968j00606a17181M9117G6195C2501K1661J67169
11424B21331H7294a47886n7181b0798C3476a82081R478C49070g8403k15828a28221
11412A868P2190R9113a88240i456q821k40842A09240D548J6780a43658j94750
11401c38408A68007j7205a38783F0688J81923n0519n2049n8827K72529d2545m9048
11390i1593C50542a73562h3078B08856h9861C12487m1922C4298a22929J4034B1809
$$ plain form
11378 -59739 -177814 -130058 70685 34554 -27796 -215069 -22283 109135 -30251 -152155 -107252
11367 -107252 -14030 74577 -74000 27753 -281252 -220625 -113304 28478 14144 24866 -31995
11355 128245 246378 -316028 113810 -59770 277379 -22338 42575 -137816 -144931 -64602 -104428
11344 -104428 137261 170448 44292 -62519 236377 -155129 -141252 -395122 -121602 1576 232613
11333 232613 54080 -175437 -36924 -30260 -68508 -29583 -75352 23570 -276294 -331545 -17188
11321 -37090 -58453 291914 -101720 144310 197751 -395520 -170842 74157 62355 -155581
11310 -94145 52188 316323 20357 227027 -35475 -410133 59431 115626 -106809 42923 69751
11299 69751 178219 -5694 -168508 -92530 164177 -46111 16506 15178 -406868 -292545 -546898
$$ packed form
11378e9739j18075M7756G0685C4554b7796j87273b2283A09135c0251j21904M4903
11367a07252a4030G4577g4000B7753b81252O0627J07321B8478A4144J0722c1995
11355A28245J18133c16028A13810e9770B77379b2338D2575a37816p115f4602l9826
11344a04428A37261L3187D4292f2519B36377a55129J3877k53870a21602A576K31037
11333B32613E4080a75437c6924O664l8248b9583m5769B3570b76294n5251a7188
11321c7090k1363B91914a01720A44310N3441c95520a70842G4157j1802a55581
11310i4145E2188K64135B0357K06670c5475l74658E9431N6195a06809D2923K6828
11299F9751J08468e694j62814P5978A64177d6111A6506j328d06868J14323k54353
$$ plain form
11288 -546898 -36704 -16947 -155475 125901 71651 -57789 48365 -128108 110006 -35554 56107
11276 88460 229761 -258958 -217565 -109901 -64643 -184208 -232216 -255346 -201336 65046 -9968
11264 -42548 -257785 -114000 -22370 -66425 -180685 246172 399240 -86290 -143585 -33789 342013
11252 114767 -86268 -149054 -455447 248152 -59301 121214 -146572 48470 -433368 163290
11241 199530 136350 8698 135690 -341127 -324438 74864 5541 -267780 108977 -89395 -209280
11230 -209280 -117103 84973 -279446 -20854 5194 -10550 -66107 46043 13908 -235755 56117
11218 -2253 -126538 -41148 -61390 -384946 -115947 -18597 -178686 80818 -282316 52365 -174152
11206 175044 -110395 -143959 -103644 43377 -261182 96700 -54886 -782 -389378 4760 -159010
$$ packed form
11288e46898c6704a6947j38528A25901n4250e7789D8365a28108A10006c5554E6107
11276H8460J41301b58958M1393J07664M5258j19565m8008k3130N4010F5046i968
11264d2548k15237a14000b2370m4055j14260B46172J53068h6290n7295c3789C42013
11252A14767h6268o2786l06393B48152e9301A21214a46572D8470d33368A63290
11241A99530o3180H698J26992c41127J6689G4864E541b67780A08977h9395j19885
11230b09280R2177H4973b79446b0854E194a0550n5557D6043A3908b35755E6117
11218b253j24285d1148k0242l23556a15947a8597j60089H0818b82316E2365a74152
11206A75044a10395l3564M0315D3377b61182I6700e4886g82l88596D760a59010
$$ plain form
11194 21905 -74541 100355 -34799 -20215 -87692 -419694 -40317 -153076 24854 -334927 54602
11182 -122879 328885 -122798 -302460 -414944 -327683 66972 -82362 -15908 -20253 56065 -50919
11170 -176035 -70486 -140139 205821 -95234 -195439 -13997 -87409 -36722 -244662 -187813 -404768
11159 -404768 -57772 -14438 -119758 246238 358313 -74037 -39652 217278 55270 -53610 207159
11147 -256587 188961 56216 -73804 -118591 -163309 -101166 -38880 48484 -15554 58706 128854
11136 128854 -38968 206707 75877 -307873 164339 -143033 -225491 192208 85386 -237082
11125 123048 171834 140272 -65439 7241 86657 -353663 76754 -168193 -114985 -87408 207491
11113 78138 -120689 -234181 72759 -265182 102955 121349 33320 -263590 -128782 -102253
$$ packed form
11194B1905g4541A00355c4799J4584o7477l32002d0317j12759B4854c34927E4602
11182a22879C28885a22798j79662j12484Q7261F6972h2362a5908m345E6065e0919
11170a76035g0486o9653B05821i5234j00205a3997p3412c6722k07940N6849k16955
11159d04768e7772a4438j05320B46238J12075g4037L4385B17278E5270e3610B07159
11147b56587A88961E6216g3804m4787m4718O2143c8880D8484a5554E8706P0148
11136A28854c8968B06707G5877c07873A64339a43033q2458A92208H5386b37082
11125A23048M8786l1562f5439G241P9416c53663G6754a68193N3208K7577B07491
11113G8138a20689j13492G2759b65182A02955J8394C3320b63590a28782K6529
$$ plain form
11103 -102253 -6629 -24437 -156287 -125929 187196 187594 324697 209064 192563 175594 -123219
11091 -10472 250004 -73994 189814 270340 345511 292232 -178329 208806 17162 70467 315098
11080 315098 250937 -114423 -19690 66467 212455 367686 -139313 244360 27055 515855
11070 515855 118769 317064 -168845 522975 87076 279799 383330 190868 547800 126835
11059 506812 374857 460289 284146 372921 647886 264746 316981 502496 848718 485702
11049 485702 581597 550256 261584 427854 748946 516466 300367 772771 832401 139919
11038 500587 317639 509382 905901 685748 580397 800459 588305 497599 665687 625951
11028 625951 490510 724957 749707 548255 628602 549654 276226 444158 425929 403509
$$ packed form
11103a02253f629j7808j31850L0358A87196L98J37103j15633j6501j6969a23219
11091a0472B50004g3994A89814Q0526P5171n3279a78329B08806A7162N3305K44631
11080C15098o4161a14423a9690F6467J45988J55231a39313B44360B7055M88800
11070E15855A18769J98295a68845E22975H7076J92723J03531A90868L56932A26835
11059E06812j31955Q5432j76143Q8775K74965B64746N2235J85515L46222l63016
11049D85702R5895l1341B61584J66270L21092k32480k16099M72404N9630A39919
11038E00587j82948J91743L96519k20153j05351K20062k12154r0706J68088l9736
11028F25951j35441K34447K4750k01452Q0347p8948k73428J67932j8229k2420
$$ plain form
11018 403509 576172 614736 727048 460540 766320 446992 413427 430040 498978 590597
11008 590597 464074 719308 700955 385631 694771 299529 129742 388995 559559 503032
10998 503032 429918 465758 774754 513495 686644 569599 455310 522183 465518 465312 725127
10987 725127 624349 596182 524880 900821 1059413 540363 525564 674736 517862 1018949
10977 1018949 1148879 887496 1147230 1144615 1548329 1216121 1575769 1851900 2103159 2241661
10967 2241661 1936930 2224283 2108539 1897115 1897951 1552367 1584939 1487641 1360480 1228419
10957 1228419 1297161 1281296 1148207 1555278 1573870 1532807 1667936 1668185 1401433 1427332 1351418
10946 1351418 1210411 588244 606103 258204 238643 343001 264138 -6312 359745 250698
$$ packed form
11018D03509J72663L8564J12312k66508L05780l19328l3565J6613O8938R1619
11008E90597j26523K55234j8353l15324L09140B99529A29742K59253J70564n6527
10998E03032p3114L5840L08996k61259J73149j17045j14289O6873n6665k06K59815
10987G25127j00778k8167p1302L75941J58592n19050j4799J49172j56874N01087
10977A018949J29930k61383K59734k615M03714l32208L59648K76131K51259J38502
10967B241661l04731K87353j15744k11424Q36l45584L2572r7298j27161j32061
10957A228419O8742j5865j33089M07071J8592m1063J35129K49k66752K5899p5914
10946A351418j41007E88244J7859B58204j9561J04358p8863f312C59745j09047
$$ plain form
10936 250698 275375 61662 249307 334190 229278 248929 34390 53306 142994 -80243 185325
10924 136570 205860 -292718 148957 110368 -60462 143597 86666 -60257 -89883 -114167 221535
10912 124484 171463 -411927 -40563 37151 -4230 64963 -194705 -124242 -93461 180322 -151930
10900 -18500 -78462 7959 149450 198303 -151624 54930 16570 200372 62225 -152784 -61544
10888 88276 -122787 81076 273426 -108385 119537 -173821 -289249 102071 -127276 25181
10877 -226086 -154193 160554 289707 7107 72740 -290199 -201128 -38198 -107888 353466 -51806
10865 -263264 -247066 44135 -149644 33560 235347 63611 49512 -269097 -396952 338243
10854 -97150 -47717 68857 164637 4222 -73670 -29103 72235 -164111 -47256 -114599 117593
$$ packed form
10936B50698K4677F1662J87645Q4883j04912J9651C4390J8916Q9688h0243A85325
10924A36570O9290b92718A48957l8589f0462A43597n6931f0257k9626k4284B21535
10912A24484M6979d11927d0563C7151d230F4963a94705P0463L0781A80322a51930
10900a8500n9962G959J41491M8853a51624E4930A6570J83802F2225a52784f1544
10888H8276a22787H1076J92350a08385A19537a73821j15428A02071a27276B5181
10877b26086P1893A60554J29153G107O5633b90199Q9071c8198o9690C53466e1806
10865b63264J6198D4135a49644C3560K01787F3611j4099b69097j27855C38243
10854i7150d7717F8857R5780D222g3670b9103G2235a64111d7256o7343A17593
$$ plain form
10842 -45923 -226206 169058 -228711 -236392 -246625 -17291 -62255 340945 115 -265821 -51724
10830 50767 -159219 -4747 -604 -150555 128534 -152788 -15728 63168 323025 -31166 -10932
10818 -41906 -94265 154882 198837 7179 205191 197019 -181687 -239590 25285 -219584 -145462
10807 -145462 268260 -102434 55746 144022 29430 -3410 -182754 -230547 -95020 32549 123097
10796 123097 155988 13663 -211088 -95564 -277586 103017 -2523 113248 -111961 86946 -238911
10784 244354 -158817 279357 -201807 -272606 -159977 118557 -143643 30757 -36077 385455
10773 70092 59452 -293754 127338 -274704 -133358 -9156 -262901 116072 131700 -368694
10762 -121710 -32831 6679 -414610 -95742 102289 -533814 54150 103329 -255864 -32492 -3552
$$ packed form
10842d5923j80283A69058b28711p681j0233a7291m4964C40945A15b65821e1724
10830E0767a59219d747f04j49951A28534a52788a5728F3168K59857c1166a0932
10818d1906n2359A54882M3955G179J98012q172a81687n7903B5285b19584P4122
10807a45462B68260a02434E5746Q8276B9430c410j79344m7793i5020C2549R0548
10796A23097L2891A3663b11088i5564j82022A03017b523A13248a11961H6946b38911
10784B44354a58817B79357b01807p0799J12629A18557a43643C0757c6077C85455
10773G0092j0640b93754A27338b74704a33358i156k53745A16072J5628c68694
10762a21710c2831F679d14610i5742A02289e33814E4150M9179b55864c2492c552
$$ plain form
10750 -147560 -206439 -153486 41258 -291698 -40877 -337672 -18362 -106473 -120870 39048 -58293
10738 -121438 126645 149749 197625 121443 7652 -65026 72066 -291995 -153482 284806 19332
10726 137401 -15185 -261280 -139228 71871 -261451 -83407 44895 -120510 -196393 100371
10715 -337938 -172065 183731 -21140 -235932 -161134 -15991 -307048 -297907 4925 -38505 -214588
10704 -214588 -436662 -93455 -191219 103084 191523 87452 -92428 107900 -191036 -241435 12933
10692 -94116 50643 -119982 -291728 -541095 137356 -250541 -466752 26189 -237971 -184763
10682 -184763 -14653 -85927 99060 -174460 -69010 10282 -50039 -229527 -498435 214275 5203
10670 -29972 -168485 109492 -148391 96260 -191039 106543 67060 223382 -460370 131195
$$ packed form
10750a47560n8879N2953D1258b91698d0877k96795a8362q8111j4397C9048e8293
10738a21438A26645K3104M7876p6182G652f5026G2066b91995J38513B84806A9332
10726A37401a5185k46095J22052G1871b61451h3407D4895a20510p5883A00371
10715c37938J65873A83731b1140k14792P4798a5991k91057R141D925c8505j76083
10704b14588k22074i3455r7764A03084Q8439H7452i2428A07900a91036n0399A2933
10692i4116E0643a19982j71746k49367A37356b50541k16211B6189b37971N3208
10682a84763a4653p1274I9060a74460f9010A0282e0039j79488k68908B14275E203
10670b9972j38513A09492a48391I6260a91039A06543l9483J56322d60370A31195
$$ plain form
10659 -368089 -94623 223211 265353 47605 112528 -175511 -361572 -83474 109382 51200 151296
10648 151296 -216171 -283404 -97767 -178529 -122567 -23941 -241463 210976 27685 -88893 -128918
10637 -128918 -469615 249379 -97945 -160364 -8175 -145724 209641 102497 -178453 -225919
10627 -225919 -147850 -275436 -168933 118674 -73612 -187654 25476 -176509 109662 -41543
10616 -191329 126489 48434 -186261 125342 -326572 -147726 -385909 -258529 284722 173738
10606 173738 -306225 -37734 -237931 -145990 -497815 229450 153405 -164732 -37195 -127193
10596 -127193 128543 -4933 -38006 298723 -102433 -128786 8432 -277193 -150968 58691 24949
10584 119688 161963 -295846 81419 -481213 -282420 -87932 234037 -137183 -141454 -83694 -245560
$$ packed form
10659c68089i4623B23211M2142D7605O4923a75511j86061h3474A09382E1200J00096
10648A51296b16171o7233i7767q0762N5962b3941k17522B10976B7685h8893m0025
10637a28918l40697B49379i7945o2419h175j37549B09641A02497a78453m7466
10627b25919P8069j27586J06503A18674g3612j14042B5476a76509A09662d1543
10616a91329A26489D8434a86261A25342c26572a47726k38183J27380B84722j10984
10606A73738c06225c7734k00197R1941l51825B29450p6045a64732c7195q9998
10596a27193A28543d933l3073B98723a02433k6353H432b77193J26225E8691B4949
10584A19688M2275b95846H1419d81213J98793h7932B34037a37183m271N7760j61866
$$ plain form
10573 -245560 11196 -371747 253724 -321059 194946 35529 110816 -236735 -112162 10829
10562 -196728 -115753 -16993 -149804 -209237 -624747 -579803 -8925 -81620 215243 -125231 42860
10550 301893 9382 55055 271823 528982 -175907 1276 94772 -89395 64221 -444538 -29620
10538 -14730 -237071 -191263 -14438 96970 91535 -224581 -212389 101872 -91151 94557 214744
10527 214744 -136539 -28945 38704 121849 71674 -297731 10030 -8918 43868 -215968 -211667
10516 -211667 -72796 325661 91286 63494 190601 -66129 42595 -101590 -72240 -308606 -114930
10504 -72054 6249 87965 15754 -13352 309560 -58132 -333759 -406031 -23820 -25401 26094 -259448
10491 59925 -247254 -150955 134184 -112518 185866 -132087 35287 -80191 -73188 24448 -59845
$$ packed form
10573b45560A1196c71747B53724c21059A94946C5529P5287b36735a12162A0829
10562a96728Q0975a6993j32811n9433m15510M4944h925p2695B15243a25231D2860
10550C01893I382M5673K16768K57159a75907A276R3496h9395F4221d44538b9620
10538a4730k22341M5808a4438I6970n435b24581J2192A01872i1151I4557J20187
10527B14744a36539b8945C8704Q3145n0175b97731A0030h918D3868b15968M301
10516b11667g2796C25661I1286k7792J27107f6129D2595a01590K9350k36366a14930
10504g2054F249Q1716A5754a3352C09560e8132k75627p2272b3820j581B6094b59448
10491E9925b47254R6299A34184a12518A85866a32087C5287h0191P003B4448e9845
$$ plain form
10479 -74948 -93357 -144131 2717 258025 191286 692345 561820 494165 280711 500262 410930
10468 410930 -1303 -37817 16032 -21740 167242 -163898 94986 55691 27621 -165892 -153403
10457 -153403 -619248 -41758 119171 -108236 -186290 244814 17704 337986 286403 42446
10446 -334922 -192590 -53925 -291597 125544 -134359 -145554 -158656 207760 -29894 109962
10435 -54589 -114828 -141613 -199395 -15948 -39289 -30652 33163 -41153 -16128 183142 180805 121149
10423 121149 -253148 -152411 -254923 -308786 -60055 -201034 220025 -105264 -155393 -23504
10412 27900 30546 93335 -154637 115336 167113 -170099 -207970 147358 229179 -267540 -133445
10400 -122120 252645 -94216 -45783 216758 210623 -170147 -237139 -35809 -164304 -147457 209109
$$ packed form
10479g4948j8409n0774B717K55308o6739N01059j30525o7655k13454K19551q9332
10468D10930a303l6514A6032b1740A67242a63898I4986l9295B7621a65892J2489
10457a53403m65845d1758A19171a08236p8054B44814A7704L20282n1583D2446
10446c34922J42332e3925k37672A25544a34359j1195j3102B07760b9894A09962
10435e4589o0239k6785n7782a5948k3341Q637C3163d1153a6128A83142k337n9656
10423A21149b53148J00737j02512n3863f0055j40979B20025a05264n0129b3504
10412B7900K646O2789a54637A15336N1777a70099l7871A47358Q1821b67540a33445
10400a22120B52645i4216d5783B16758o135a70147o6992c5809j28495J6847B09109
$$ plain form
10388 278974 38738 -146941 -83390 348289 142507 -48267 -74884 -23116 -149760 -53651 -57098
10377 -57098 -56097 -178923 442331 -26664 389862 20439 -146578 216115 237798 307959 201894
10366 201894 573495 257541 316295 456332 389589 198122 145450 458697 196276 249989
10356 249989 94166 74666 240417 417080 461301 210442 242542 -74467 676007 140282
10345 233571 389524 441230 119267 157471 459335 244277 332641 433971 137514 241127
10335 241127 156978 104182 -53166 86237 60411 229623 -54558 140101 290699 -130188 195720
10323 149542 66477 83022 130631 -17146 80521 72410 141028 351133 -55784 218867 90820
10311 305344 219059 39489 272400 -108846 -212549 -8780 -171112 -82182 -136260 16031 -213394
$$ packed form
10388B78974C8738a46941O3551C48289A42507d8267k6617b3116j26644e3651l447
10377e7098J001j22826D42331b6664C89862B0439a46578B16115K1683P0161j06065
10366B01894L71601B57541N8754J40037o6743j91467n2672L13247A96276N3713
10356B49989I4166j9500J65751J76663M4221B10442L2100g4467F76007A40282
10345B33571J55953N1706A19267L8204L01864k15058Q8364J01330A37514J03613
10335B41127q4149n2796e3166H6237k5826J69212e4558A40101J50598a30188A95720
10323A49542F6477J6545M7609a7146H0521q111O8618K10105e5784B18867I0820
10311C05344q6285C9489K32911a08846j03703h780j62332h2182n4078A6031b13394
$$ plain form
10299 -29042 -289526 87514 -18000 -13171 -127449 130815 62062 -91244 209711 -94411 1079
10287 341801 7821 518477 -68785 -249095 186073 11368 6667 218306 116963 -84052 -260583
10276 -260583 115323 1044 147755 -49035 49060 -82726 -120458 -199421 23839 212482 45512
10264 330465 -1444 62021 -118152 -485351 157402 -91887 146274 -130143 -285883 9601 -140221
10252 -164353 371945 217757 298979 163503 183095 154328 -106201 11398 -35695 -275704
10242 -275704 -106402 130920 -109791 -418234 5829 -293598 237276 -29511 125114 -192009
10231 -76957 154543 -271095 173369 -99611 -275044 -111118 -207221 22259 118569 277340
10221 277340 27793 193036 -325452 -197345 -176350 54168 -365234 16097 -203202 268650
$$ packed form
10299b9042k60484H7514a8000M829j14278A30815F2062i1244B09711i4411A079
10287C41801G821N10656f8785j80310A86073A1368m701K11639j01343h4052j76531
10276b60583A15323A044J46711d9035D9060h2726l7732p8963B3839J88643D5512
10264C30465a444F2021a18152l67199A57402i1887A46274a30143j55740I601a40221
10252a64353C71945j54188Q1222j35476J9592k8767a06201A1398c5695k40009
10242b75704a06402A30920a09791l08443E829b93598B37276b9511A25114a92009
10231g6957A54543b71095A73369i9611j75433a11118r6103B2259R6310J58771
10221B77340B7793J65243c25452J28107K0995E4168c65234A6097b03202B68650
$$ plain form
10210 -339562 107144 -88038 -286586 -50616 -249968 -72795 -17726 160675 54432 121659 -84163
10198 -9417 -19502 159197 408767 -40255 37285 88035 -23173 -205009 -201845 -68535 240427
10186 -288983 -431798 -527633 -270702 265661 -57960 -138776 -175755 -60722 -128271 -139285 161211
10174 150364 -116343 -159734 64572 346013 -13846 -398781 -157039 -221844 -25002 72847 -226322
10162 -269322 124752 -106637 40520 -360270 131038 207343 200931 -23190 43467 -57265 -137966
10151 -137966 14612 139100 335197 -228405 -378558 -264440 27679 -137619 -291811 122481
10140 -3215 -88305 -225380 -66694 -229119 -124368 87734 55463 -43819 -308101 -231071 -303822
10129 -303822 65824 -22007 -187258 -103623 -123444 -158447 -68049 -188240 33527 -136671 -64995
$$ packed form
10210c39562A07144h8038j98548e0616j99352g2795a7726A60675E4432O7227h4163
10198i417j0085A59197K49570d0255C7285N0750b3173j81836L164f8535B40427
10186b88983j42815r5835K56931B65661e7960q0816l6979f0722o7549j1014A61211
10174A50364a16343m3391F4572K81441a3846l84935a57039o4805b5002G2847b26322
10162b69322A24752a06637D0520c60270A31038P6305o412b3190D3467e7265q0701
10151a37966A4612J24488J96097b28405j50153J14118B7679a37619j54192A22481
10140c215q5090j37075f6694j62425J04751H7734l2271d3819k64282P7030p2751
10129c03822F5824b2007j65251Q3635j9821l5003f8049j20191C3527a36671f4995
$$ plain form
10117 160111 186311 92397 -263995 -242536 -6283 176111 -204655 -82662 151294 -18866 -290454
10106 -290454 -42829 134668 19510 -13855 -69002 -175017 -126267 -38263 50659 -75032 -311977
10095 -311977 -177423 -45387 -160809 -313208 -406498 155358 184001 91651 -185396 124040
10084 81515 -264219 -146914 143974 -229368 37248 -97095 6193 -136621 144092 -72936 -100274
10073 -100274 -122851 -153264 -239926 171148 -80904 -208147 44622 -71042 30232 -182801 -166475
10062 -166475 127236 3202 58881 180699 28701 -111626 -248630 99133 150559 -175381 124022
10050 -150947 -388853 -275389 -183933 54668 -195833 157268 89135 437640 23283 49603
10040 49603 -226108 -57263 44572 -77923 37981 38839 242382 -5320 158359 -288550 -25418
$$ packed form
10117A60111K6200I2397b63995K1459f283A76111b04655h2662A51294a8866k71588
10106b90454d2829A34668A9510a3855n5147j06015M8750c8263E0659g5032k36945
10095c11977J34554d5387j15422j52399r3290A55358K8643I1651a85396A24040
10084H1515b64219J17305A43974b29368C7248i7095F193a36621A44092g2936k7338
10073a00274k2577l0413q6662A71148h0904j27243D4622g1042C0232a82801J6326
10062a66475A27236C202N5679J21818B8701a11626j37004I9133N1426a75381A24022
10050a50947k37906J13464R1456E4668a95833A57268o8133L48505B3283K6320
10040D9603b26108e7263D4572g7923C7981Q58K03543e320A58359b88550b5418
$$ plain form
10028 119961 -185913 -131350 -27055 254312 -265432 -124038 -322980 -27840 -192137 -180416
10018 -180416 -221416 143856 207659 -438999 -290283 -83764 102239 -393436 376467 -234085
10007 121909 146185 179678 -178424 -110312 -264559 -445783 -257275 -236125 -134132 65316
9996 -39930 -46285 186691 -44748 -166681 -48124 -135031 -172318 -44307 217182 -112348 -39824
9984 122064 -208885 -17529 -92201 -131042 -75797 4812 -203668 -435578 -65605 285883 -299957
9972 45793 64270 -229234 -40447 33591 -230362 -25299 -356969 9439 -278538 336387 -9297
9960 107887 -91488 -142094 -87829 -226297 37749 -163548 -15338 -19593 15148 -139116 -285335
9949 -285335 -31573 -170808 -225311 -172643 -18931 -89185 -131636 264354 -253550 -423990 22117
$$ packed form
10028A19961a85913N4563b7055B54312b65432a24038j98942b7840j64297J1721
10018a80416m1000A43856O3803d38999J48716h3764A02239c93436C76467b34085
10007A21909K4276L3493a78424O8112j54247j81224J88508K1150J01993F5316
9996c9930o355A86691d4748j21933d8124q6907l7287d4307B17182a12348c9824
9984A22064b08885a7529p4672l8841N5245D812b03668k31910f5605B85883b99957
9972D5793J8477b29234d0447C3591b30362b5299l31670I439b78538C36387i297
9960A07887i1488n0606N4265j38468C7749a63548a5338m255A5148a39116j46219
9949b85335c1573j39235n4503N2668a8931p0254m2451B64354b53550j70440B2117
$$ plain form
9937 -70979 -128229 -154149 -319145 -241557 -18534 -191925 101944 -62914 -38098 43873 27002
9926 27002 -121603 115883 -254969 -115570 56093 86336 108995 118945 1078 -290562 33795
9914 116420 -215636 -219424 199632 -247448 142468 15298 -149900 42883 -98293 69210 -268028
9902 -112686 -137523 -100089 109551 -99643 85211 87197 75557 -56950 268612 -49114 -92721
9891 -92721 -100060 147653 322692 -224709 -85783 162138 265489 60259 237681 -60590 73473
9879 -12690 -144123 140820 -249875 -181832 -46595 -167508 -261701 -13479 -128252 -293575 -132445
9867 -409937 -84610 -92334 305491 -37774 -207531 -32236 24541 -41074 163235 -259883 463079
9855 -132972 26792 -15810 -29616 -183329 35284 -431 -193330 120142 -238162 10522 -263026
$$ packed form
9937g0979n7250k5920j64996P7588a8534j73391A01944f2914K4816D3873j6871
9926B7002a21603A15883b54969a15570E6093L0243K2659R950A078b90562C3795
9914A16420b15636l788A99632b47448A42468A5298a49900D2883i8293F9210b68028
9902a12686k4837L7434A09551i9643H5211J986j1640e6950B68612d9114m3607
9891i2721p339A47653J75039b24709h5783A62138J03351F0259J77422f0590G3473
9879a2690j31433A40820b49875O8043d6595j20913r4193a3479j14773j65323a32445
9867d09937h4610p724C05491c7774j69757c2236B4541d1074A63235b59883D63079
9855a32972B6792a5810j3806j53713C5284d31j92899A20142b38162A0522b63026
$$ plain form
9843 173420 -174058 68089 -135872 -141147 -181159 112899 -76903 -417100 228242 144418 -269650
9831 -101325 -285532 201421 -186483 -215310 24901 -145783 -218959 -209662 69773 -246918 -246772
9820 -246772 74020 -243457 -443953 -100355 -2802 118857 128854 45969 -87474 -466219 -208982
9808 -118586 61584 65299 -197440 47252 -268663 152514 188966 -233436 -244410 249599 -110036
9796 165999 168910 231687 -277770 302759 248427 18555 122741 -194636 -115101 -140094 163059
9784 -214062 -10378 331437 24935 -414932 -35064 -66603 -26974 164134 -62571 46900 -24738
9772 -163833 4438 -197721 -10063 -132510 -83942 190505 108220 -78948 -189635 -96910 -48130
9760 -48477 -299287 -70822 -159451 -29553 -332937 93329 245459 216270 -75145 -501917 7555
$$ packed form
9843A73420a74058F8089a35872n275m0012A12899g6903l40197B28242q3824b69650
9831a01325j84207B01421a86483k8827B4901a45783p3176R297F9773b46918J46
9820b46772G4020b43457k00496a00355b802A18857R997D5969h7474l78745b08982
9808a18586F1584L715a97440D7252b68663A52514L6452b33436j0974B49599a10036
9796A65999K911O2777b77770C02759n4332A8555J04186a94636P9535k4993A63059
9784b14062a0378C31437B4935d14932c5064l1539b6974A64134f2571D6900b4738
9772a63833D438a97721a0063j22447M8568A90505q2285g8948j10687R2725d8130
9760d8477k50810g0822q8629b9553l03384I3329J52130k9189g5145m26772G555
$$ plain form
9748 -179762 -229461 -79505 -373743 -348953 74227 -319426 -242109 -7512 94043 -47542 126802
9736 -184093 -39104 -79803 -409298 125923 -189258 -130198 -296752 -87186 -215949 90999 -58006
9724 195801 -313912 -254790 -138830 -6466 -55012 30366 -8396 229566 34468 15267 -80870
9712 -92330 -144596 -154577 -140975 124222 -99737 -304951 -147936 -62599 44222 30960 81862
9701 81862 -287571 -173539 -6685 -117611 -219830 -291392 -137379 -14239 -377825 35274 -374206
9689 -78023 -193763 -315933 75247 252335 -192319 -34071 -36725 -284722 85368 -182029 124316
9677 -153271 399647 -219914 -55924 -145855 23195 -83888 116507 -177952 -26782 162662 -239334
9665 -111269 -59247 289703 89259 110161 -276413 -233340 -180242 -43426 41170 92868 -357235
$$ packed form
9748a79762m9699g9505k94238K4790G4227c19426P7317g512I4043d7542A26802
9736a84093c9104m0699l29495A25923a89258N9060j66554h7186j28763I0999e8006
9724A95801c13912N9122J15960f466m8546C0366h396B29566C4468A5267h0870
9712i2330n2266r981J3602A24222i9737k05214a47936f2599D4222j3262N0902
9701H1862b87571J14032f685j10926j02219p1562a37379a4239l63586C5274c74206
9689g8023j15740j22170G5247J77088a92319c4071k654k47997H5368a82029A24316
9677a53271C99647b19914e5924q9931B3195h3888A16507a77952b6782A62662b39334
9665a11269N2022B89703H9259K0902b76413M3073N3098d3426D1170N1698c57235
$$ plain form
9653 -45615 -17436 -188279 -293721 -102943 -172 -142217 -258883 155850 128435 -84364 -136440
9642 -136440 36244 -8907 9167 163725 -330553 62886 24069 -150542 -23822 -192035 -334671
9631 -334671 -256052 -145294 64736 103217 -170954 -257482 -114883 -93842 -62712 -184593 -358809
9620 -358809 240321 160683 271575 320746 242976 301920 -200108 -22638 -269441 35406 162186
9609 162186 -71284 -27236 9380 17870 -16498 -373769 3160 -144189 -281083 6469 -45708 -214930
9597 -214930 157118 254231 -279316 -160340 -246188 15407 -283936 -212306 -65273 87036 130409
9586 130409 -291392 -135816 -102388 132531 -322253 -310757 29219 -143052 -123594 -131317 -88570
9575 -88570 -143280 -246289 -20753 45465 209630 -61868 -345305 -181895 154766 306673 -130671
$$ packed form
9653d5615a7436j70843j05442a02943a72j42045j16666A55850k7415h4364n2076
9642a36440C6244h907I167J54558c30553F2886B4069a50542b3822j68213j42636
9631c34671P8619J10758F4736L8481a70954q6528a14883K1041L1130j21881j74216
9620c58809B40321p9638J10892M9171p7770N8944b00108b2638k46803C5406J26780
9609A62186g1284b7236I380Q490a6498l57271C160a44189j36894F469d5708j69222
9597b14930A57118R7113b79316J18976q5848A5407b83936P1630f5273H7036M3373
9586A30409b91392a35816L3428A32531c22253J1496B9219a43052J9458p723M2747
9575h8570n4710j03009b0753D5465J64165f1868k83437J63410A54766J51907a30671
$$ plain form
9563 13447 -182464 -155752 67764 -375018 -261739 -145602 -105772 118327 -26145 191688 -21284
9551 -233197 -187707 -237880 -26389 -299087 174154 -101617 -299467 47739 -188742 51298 48442
9540 48442 -35552 -382235 5867 -53737 -181751 107 -371256 -34154 -95405 -109350 -31952 -134373
9528 -134373 -343534 76440 -9154 237270 -132461 144290 211749 -147633 -114773 -187629 268504
9516 -87069 264754 -106665 -66584 331697 -3461 10106 -84883 84263 -3546 80788 -95353 -301336
9504 -301336 -32305 -626 -148392 -83164 -170136 -105410 43704 62120 -488470 -146194 -49358
9492 -115561 155726 98536 166155 27491 -196092 -163571 -358605 -214913 -18360 -180176 -55620
9480 275399 100860 -91249 -199574 100079 -107996 -106981 -90928 160140 -111801 101395
$$ packed form
9563A3447a82464K6712F7764c75018J13279J16137L9830A18327b6145A91688b1284
9551b33197M5490n0173b6389k72698A74154a01617j97850D7739a88742E1298k856
9540D8442c5552l46683E867e3737j28014A07c71256c4154o1251j3945c1952j02421
9528a34373k09161G6440i154B37270a32461A44290O7459a47633L2860p2856B68504
9516h7069B64754a06665M0081C31697c461A0106h4883H4263c546H0788i5353k05983
9504c01336c2305f26j47766O5228q6972O4726D3704J8416d88470a46194d9358
9492a15561A55726n7190O7619B7491a96092L2521j95034J43692a8360j61816e5620
9480B75399A00860i1249j08325A00079a07996J015J6053A60140a11801A01395
$$ plain form
9469 20840 -116184 -210632 -86589 -216477 -229848 26309 -431688 -170029 -9355 67781 -229882
9457 -4972 -346345 -388467 -266656 -163540 495445 -44188 -178410 31765 228621 97646 -34335
9445 -74988 -170914 -144217 -94757 -202788 -12372 -61428 117270 -114943 -14681 -63088 -2734
9433 -122391 -311910 -186134 -118095 45172 52909 164982 -238411 92217 -70874 296901 -12580
9421 46513 89913 -161143 -146767 70771 268795 -47267 -270590 -169541 -85510 -115168 -187596
9410 -187596 -39936 -220023 -52343 -2285 -103653 216362 -40942 -21834 -69025 -129587 37631
9398 -266027 2977 77782 -267250 -99229 -6790 6588 -55287 -31364 -270878 -347598 -200681 85691
9385 -211575 -127658 254379 -152173 -73569 -269854 -247842 -130235 -3032 -190489 48147 -477785
$$ packed form
9469B0840a16184r4448h6589j29888j3371B6309d31688a70029i355F7781b29882
9457d972l41373m2122J21811J03116D95445d4188j34222C1765J96856I7646c4335
9445g4988r5926K6697M9460j08031a2372m9056A17270a14943a4681m8407b734
9433a22391j89519J25776O8039D5172P737J12073b38411I2217g0874B96901a2580
9421D6513M3400a61143J4376G0771J98024d7267k23323J01049Q4031k9658p2428
9410a87596c9936j80087e2343b285j01368B16362d0942J9108m7191o0562C7631
9398b66027B977P4805b67250i9229f790F588e5287K3923k39514p6720J46917H5691
9385b11575Q3917B54379a52173g3569j96285K2012J17607c032j87457D8147d77785
$$ plain form
9373 23892 202168 -178715 -118403 -193436 -275014 -63290 -525586 -132393 -208573 -147101 11125
9361 -107048 -339249 -133428 564 -328434 -224849 -386938 -114298 -68539 216768 -140855
9350 -238927 -60389 -309718 -428103 -173791 -6915 183813 288935 -245420 20720 -170100
9339 285134 -16813 46596 -46227 164720 -208671 10889 -177985 -48441 -252294 -46525 94044
9327 -60465 -201714 270935 98882 -145407 -119238 -325421 -283418 74217 35248 -112385 36621
9315 203196 -328149 484000 -175645 -35291 70476 -128254 -107907 29954 -84669 -439774 -193310
9303 -49234 -17063 -87445 -178230 -67707 -362286 -153869 275303 -22527 -8394 -422562 -100662
9291 -96202 -266275 -182498 -161085 78915 56523 -78979 -393415 15359 -46064 128602 172611
$$ packed form
9373B3892J78276a78715O0312p5033q1578f3290m62296a32393p6180O1472A1125
9361a07048k32201a33428E64c28434J03585j62089a14298M5759B16768a40855
9350b38927f0389k49329j18385a73791f915A83813J05122b45420B0720a70100
9339B85134a6813D6596d6227A64720b08671A0889a77985d8441k03853d6525I4044
9327f0465j41249B70935I8882a45407K6169k06183M2003G4217C5248a12385C6621
9315B03196c28149D84000a75645c5291G0476a28254K0347B9954h4669l55105a93310
9303d9234a7063p0382r0785f7707k94579a53869B75303b2527h394m14168a00662
9291i6202j70073Q3777K1413G8915k2392g8979l14436A5359d6064A28602M4009
$$ plain form
9280 172611 211224 -110087 -119038 104813 -303103 -72093 180618 168977 7632 -438462 131985
9268 -64272 -126034 -96719 138715 -207821 157000 14388 209937 140903 -217220 252214 -320899
9256 -45907 -125327 183940 -117276 -97700 52907 -207267 -157680 -246050 -24248 135982 -105951
9244 289593 -145862 -219496 -40095 -66381 29006 -71906 -6027 4008 -310546 297809 -51298
9232 -43880 -55269 53316 52365 -90049 83605 -253473 -37202 -101609 -149173 -382286 -10895 -225144
9220 -225144 179717 65022 69218 184401 -116554 -137025 -86251 -257349 -135188 183464 -118135
9208 600 35172 -56765 -45524 75962 191823 25781 -24275 48791 -126181 -57980 -252499 -232501
9196 -232501 -195808 47147 -107205 125701 -23316 182703 -24302 17732 -595462 -178970 35904
$$ packed form
9280A72611L8613a10087q951A04813c03103g2093A80618j1641G632d38462A31985
9268f4272o1762K9315A38715b07821A57000A4388J95549o9034b17220B52214c20899
9256d5907p9420A83940a17276J9576E2907b07267M9587q8370b4248A35982a05951
9244B89593a45862p3634d0095k6286B9006g1906f027D008c10546B97809e1298
9232d3880j1389E3316r51i0049H3605b53473c7202o4407m7564k33113a0895k14249
9220b25144A79717F5022M196J15183a16554k0471N0774j71098J22161A83464a18135
9208F00L4572e6765J1241G5962J15861B5781b4275D8791a26181e7980j94519J9998
9196b32501L6693D7147a07205A25701b3316A82703b4302A7732e95462a78970C5904
$$ plain form
9184 -376457 125132 -34098 -313990 114659 372457 -175567 -210679 85463 17651 15365 -751
9172 -256389 157848 -199405 16341 -312007 -220607 19598 -269982 -117896 -60839 -402374
9162 -402374 215406 -170759 -171998 191452 -2855 76904 -97708 -166536 -153255 -146362 146647
9150 -131765 267538 -44412 320251 51511 19325 79216 19080 -417164 -37408 547 -112841
9138 -313930 -371180 41473 -323219 -183024 -16465 -404243 -316183 43479 -319828 -129413 83123
9126 -251996 62867 102046 121214 92021 -158108 45774 165863 142850 37774 -150141 21713
9114 -228231 85182 -69885 56032 -255027 85281 153550 263757 -233816 361991 -214098 -149777
9103 -149777 35395 122779 -118271 -118024 5944 5396 77602 178879 100558 -180206 -162268 97552
$$ packed form
9184c76457A25132c4098k79892A14659K57798a75567l5112H5463A7651k286g51
9172b56389A57848a99405A6341c12007R1400A9598b69982a17896N7057l41535
9162d02374B15406a70759j239A91452b855G6904i7708o8828J3281O893A46647
9150a31765B67538d4412C20251E1511A9325N9891A9080d17164c7408E47a12841
9138c13930n7250D1473c23219J40195a6465l87778Q8060D3479c19828a29413H3123
9126b51996F2867L9179J9168k9193a58108D5774J20089k3013C7774a50141B1713
9114b28231H5182f9885E6032b55027H5281O8269J10207b33816C61991b14098O4321
9103a49777C5395Q7384a18271K47E944n48P2206J01277p8321a80206J7938I7552
$$ plain form
9090 -51791 -249765 25834 -222063 -120742 -314959 -133639 28713 81192 -258515 208687
9079 -298477 -66154 -143733 61326 118099 -161363 -83077 -114175 -229210 -48415 -36720 -123588
9068 -123588 18786 14989 92918 40801 198773 -63681 37663 -143809 -151907 -60846 -146304 72442
9055 -153640 -96110 86222 -222283 -57795 236735 204031 -158708 -200420 -216426 39285 -38411
9043 236311 -43582 116470 138819 68435 -59235 -44598 -154967 -51151 -286095 -393777 -26009
9031 330472 132807 -201982 -7586 -25642 -237402 -212110 -323352 -190136 -281369 23000 206128
9020 206128 -87202 -108949 -239551 332890 -212889 189817 107360 295676 -86362 -138520 -335936
9009 -335936 -32451 -101735 -287087 -46049 98653 43995 -164955 231333 207254 242549 -53150
$$ packed form
9090e1791j97974B5834b22063J01321j94217a33639B8713N2479b58515B08687
9079b98477f6154p7579F1326N6773a61363P8286l1098j15035d8415J1695q6868
9068a23588A8786l797P7929D0801J57972f3681C7663a43809q098f0846q5458G2442
9055a53640N7530H6222b22283e7795B36735l2704a58708m1712j6006C9285c8411
9043B36311d3582A16470K2349F8435e9235J4637j10369e1151k34944j07682b6009
9031C30472A32807b01982g586j8056k11760K5292j11242J33216r1233B3000J83128
9020B06128h7202k1747j30602C32890b12889A89817q2457J88316h6362n2158j97416
9009c35936c2451o9284j85352d6049I8653D3995a64955B31333k4079L5295e3150
$$ plain form
8997 -462709 65266 41962 49758 142870 -130882 151654 -61742 -176808 -241207 -276269 -340378
8986 -340378 -13858 -214224 -349169 -128776 35732 101465 -181885 -26145 -212176 76931 -228386
8974 -166307 -96979 -64311 100030 176578 -183633 141401 54574 -3698 -218723 -308311 -23639
8962 13631 90304 -174124 87600 45562 -305447 98339 -106705 -95774 -127256 455197 -325611
8950 -159854 15142 -76993 -33117 137904 -148341 -36327 -124603 -333770 91015 64289 27797
8938 -35898 -201077 -50719 -156957 -261695 -12732 153880 113952 183557 -125817 -54002 242192
8926 79455 328352 127526 309264 490411 725188 1427636 2929120 10653589 5087411
8916 2026320 866322 737598 665675 436411 414862 -2872 155357 22928 52934 302114 249356
$$ packed form
8997d62709F5266k3304P796R3112a30882A51654f1742j15066o4399l5062o4109
8986c40378a3858k00366j34945a28776C5732O5733a81885b6145j86031G6931b28386
8974a66307O9328L2668A00030P6548a83633A41401E4574c698k15025q9588b3639
8962A3631P6673a74124H7600m2038c05447I8339a06705J0931l1482D55197c25611
8950a59854A5142g6993c3117A37904a48341c6327q8276k09167I1015k6726B7797
8938c5898j65179e0719j06238j04738a2732A53880l9928O9605a25817e4002B42192
8926G9455K48897A27526J81738J81147K34777P02448J501484P724469E087411
8916B026320H66322j28724p1923k29264k1549b872A55357B2928L0006K49180n2758
$$ plain form
8905 249356 360368 -305870 176169 114242 6469 -81373 24799 30128 -218119 10587 71344
8894 71344 -198494 150817 26561 227166 -100021 -465849 -249471 230071 -55734 -196800
8884 -196800 306617 -9808 -63243 47413 201650 -79731 70997 394223 -336391 22668 -190702
8872 357032 51374 -152250 164834 -11820 -85399 101220 28560 101057 343126 -65019 -155013
8861 -155013 89893 161502 -358415 201987 -187764 -252911 6108 -195296 -129535 40435 178163
8850 178163 -98202 -194546 71189 -145805 -21791 207232 184609 256125 45674 -83597 -190330
$$ packed form
8905B49356J11012c05870A76169o1927F469h1373B4799N329b18119A0587O0757
8894G1344a98494A50817B6561K00605a00021l65828K16378B30071e5734j41066
8884a96800C06617i808n3435D7413J54237g9731G0997L23226c36391B2668a90702
8872C57032E1374a52250A64834a1820p3579A01220B8560P2497K42069f5019q9994
8861a55013H9893P1609c58415B01987a87764o5147F108a95296O5761D0435J37728
8850A78163i8202r6344G1189a45805b1791B07232k2623P1516D5674h3597j06733
$$ [...]
##END NTUPLES=NMR SPECTRUM
##END=
