
##TITLE=AC1306_DOMAH11118_6615295_IFYvxexN2Q
##JCAMPDX= 6.0         $$ Bruker NMR JCAMP-DX V2.0
##DATA TYPE= NMR SPECTRUM
##DATA CLASS= NTUPLES
##ORIGIN= BRUKER
##OWNER= Administrator
$$ 1.72 TOPSPIN		Version 2.1
$$ 2012-08-02 19:10:54.640 -0500  Administrator@TOPSPIN
$$ Compression mode = diff/dup
##.OBSERVE FREQUENCY= 400.02188249412
##.OBSERVE NUCLEUS= ^1H
##.ACQUISITION MODE= SIMULTANEOUS (DQD)
##.ACQUISITION SCHEME= undefined
##.AVERAGES= 8
##.DIGITISER RES= 22
##SPECTROMETER/DATA SYSTEM= spect
##.PULSE SEQUENCE= zg30
##.SOLVENT NAME= COFFEE_meoh
##.SHIFT REFERENCE= INTERNAL, COFFEE_meoh, 1, 14.98509
##AUDIT TRAIL= $$ (NUMBER, WHEN, WHO, WHERE, PROCESS, VERSION, WHAT)
$$ ##TITLE= Audit trail, TOPSPIN		Version 2.1
$$ ##JCAMPDX= 5.01
$$ ##ORIGIN= Bruker BioSpin GmbH
$$ ##OWNER= Administrator
$$ $$ C:\Bruker\TOPSPIN/data/COFFEE/nmr/AC1306_DOMAH11118_6615295_IFYvxexN2Q/10/pdata/1/auditp.txt
$$ ##AUDIT TRAIL=  $$ (NUMBER, WHEN, WHO, WHERE, PROCESS, VERSION, WHAT)
(   1,<2012-08-02 19:10:47.250 -0500>,<Administrator>,<TOPSPIN>,<go>,<TOPSPIN 2.1>,
      <created by zg
	started at 2012-08-02 19:09:40.750 -0500,
	POWCHK enabled, PULCHK disabled,
       configuration hash MD5:
       6B 1B 68 BB D9 2E 58 E2 7F 35 AD 54 07 DF 0E 41
       data hash MD5: 64K
       FC FF 13 D2 F7 78 95 CB AB C3 FB 90 3E A8 DD 8E>)
(   2,<2012-08-02 19:10:50.468 -0500>,<Administrator>,<TOPSPIN>,<proc1d>,<TOPSPIN 2.1>,
      <Start of raw data processing
       efp LB = 0 FT_mod = 6 PKNL = 1 PHC0 = 0 PHC1 = 0 SI = 32K 
       data hash MD5: 32K
       C4 A0 C1 0E 6F 3C E1 7F 9F E8 F8 35 07 08 60 BE>)
(   3,<2012-08-02 19:10:50.781 -0500>,<Administrator>,<TOPSPIN>,<proc1d>,<TOPSPIN 2.1>,
      <pk PHC0 = 179.3188 PHC1 = 0 
       data hash MD5: 32K
       01 8A 45 9C 5B 6B 70 B0 07 07 42 2F BB 1C B6 9A>)
(   4,<2012-08-02 19:10:50.843 -0500>,<Administrator>,<TOPSPIN>,<proc1d>,<TOPSPIN 2.1>,
      <abs ABSG = 1 
       data hash MD5: 32K
       01 0C F8 89 FA 0F DE 3E AC 1E D1 7A 71 3B 48 52>)
(   5,<2012-08-02 19:10:50.875 -0500>,<Administrator>,<TOPSPIN>,<proc1d>,<TOPSPIN 2.1>,
      <abs ABSG = 2 
       data hash MD5: 32K
       7B 60 C6 E4 09 F4 98 66 B5 4E 3B BB 85 F8 00 28>)
(   6,<2012-08-02 19:10:50.890 -0500>,<Administrator>,<TOPSPIN>,<proc1d>,<TOPSPIN 2.1>,
      <abs ABSG = 3 
       data hash MD5: 32K
       82 11 B8 3D 0D DA DF 1E 87 9C E5 02 3A 44 AA 57>)
(   7,<2012-08-02 19:10:50.921 -0500>,<Administrator>,<TOPSPIN>,<proc1d>,<TOPSPIN 2.1>,
      <abs ABSG = 4 
       data hash MD5: 32K
       08 DD AA 49 06 12 84 63 12 7D C2 49 C2 A8 AE 5F>)
(   8,<2012-08-02 19:10:50.953 -0500>,<Administrator>,<TOPSPIN>,<proc1d>,<TOPSPIN 2.1>,
      <abs ABSG = 5 
       data hash MD5: 32K
       EC E0 2D EC 17 BF F8 2B 7B BF 47 2D 32 F0 18 74>)
$$ ##END=
$$ 
$$ $$ hash MD5
$$ $$ D6 0D B3 16 D8 DF E7 9D 9C 40 00 17 A1 8D CD 8A
##$RELAX= 
##$RELAX= 
##$RELAX= 
##$RELAX= 
##$RELAX= 
##$RELAX= 
##$RELAX= 
$$ Bruker specific parameters
$$ --------------------------
$$ [...]
##$TP= (0..7)
150 150 150 150 150 150 150 150
##$TP07= 0
##$TPNAME0= <>
##$TPNAME1= <>
##$TPNAME2= <>
##$TPNAME3= <>
##$TPNAME4= <>
##$TPNAME5= <>
##$TPNAME6= <>
##$TPNAME7= <>
##$TPOAL= (0..7)
0.5 0.5 0.5 0.5 0.5 0.5 0.5 0.5
##$TPOFFS= (0..7)
0 0 0 0 0 0 0 0
##$TUNHIN= 0
##$TUNHOUT= 0
##$TUNXOUT= 0
##$USERA1= <user>
##$USERA2= <user>
##$USERA3= <user>
##$USERA4= <user>
##$USERA5= <user>
##$V9= 5
##$VALIST= <valist>
##$VCLIST= <CCCCCCCCCCCCCCC>
##$VD= 0
##$VDLIST= <DDDDDDDDDDDDDDD>
##$VPLIST= <PPPPPPPPPPPPPPP>
##$VTLIST= <TTTTTTTTTTTTTTT>
##$WBST= 1024
##$WBSW= 4
##$XGAIN= (0..3)
0 0 0 0
##$XL= 0
##$YL= 0
##$YMAX_a= 496273
##$YMIN_a= -649417
##$ZGOPTNS= <>
##$ZL1= 120
##$ZL2= 120
##$ZL3= 120
##$ZL4= 120
##$ABSF1= 14.98509
##$ABSF2= -5.573092
##$ABSG= 5
##$ABSL= 3
##$ALPHA= 0
##$AQORDER= 0
##$ASSFAC= 0
##$ASSFACI= 0
##$ASSFACX= 0
##$ASSWID= 0
##$AUNMP= <proc_prof1d_extract_pilot.lims>
##$AXLEFT= 0
##$AXNAME= <>
##$AXNUC= <1H>
##$AXRIGHT= 0
##$AXTYPE= 0
##$AXUNIT= <>
##$AZFE= 0.1
##$AZFW= 0.1
##$BCFW= 0
##$BC_mod= 0
##$BYTORDP= 0
##$COROFFS= 0
##$CY= 15
##$DATMOD= 1
##$DC= 0
##$DFILT= <>
##$DTYPP= 0
##$F1P= 0
##$F2P= 0
##$FCOR= 0.5
##$FTSIZE= 32768
##$FT_mod= 6
##$GAMMA= 0
##$GB= 0
##$INTBC= 1
##$INTSCL= 1
##$ISEN= 128
##$LB= 0
##$LEV0= 0
##$LPBIN= 0
##$MAXI= 10000
##$MC2= 0
##$MEAN= 0
##$ME_mod= 0
##$MI= 0
##$NCOEF= 0
##$NC_proc= -8
##$NLEV= 6
##$NOISF1= 0
##$NOISF2= 0
##$NSP= 0
##$NTH_PI= 0
##$NZP= 0
##$OFFSET= 14.98509
##$PC= 1
##$PHC0= 179.3188
##$PHC1= 0
##$PH_mod= 1
##$PKNL= yes
##$PPARMOD= 0
##$PPDIAG= 0
##$PPIPTYP= 0
##$PPMPNUM= 2147483647
##$PPRESOL= 1
##$PSCAL= 4
##$PSIGN= 0
##$PYNMP= <proc.py>
##$REVERSE= no
##$SF= 400.02
##$SI= 32768
##$SIGF1= 0
##$SIGF2= 0
##$SINO= 400
##$SIOLD= 32768
##$SPECTYP= <>
##$SREGLST= <1H.CDCl3>
##$SSB= 0
##$STSI= 32768
##$STSR= 0
##$SW_p= 8223.68421052631
##$SYMM= 0
##$S_DEV= 0
##$TDeff= 65536
##$TDoff= 0
##$TI= <>
##$TILT= no
##$TM1= 0
##$TM2= 0
##$TOPLEV= 0
##$USERP1= <user>
##$USERP2= <user>
##$USERP3= <user>
##$USERP4= <user>
##$USERP5= <user>
##$WDW= 1
##$XDIM= 32768
##$YMAX_p= 465071851
##$YMIN_p= -682773
##$CURPLOT= <Network HP LaserJet P1505>
##$CURPRIN= <$Network HP LaserJet P1505>
##$DFORMAT= <normdp>
##$LAYOUT= <+/1D_H.xwp>
##$LFORMAT= <normlp>
##$PFORMAT= <normpl>
##$SURQMSG= 1
$$ End of Bruker specific parameters
$$ ---------------------------------
##NTUPLES= NMR SPECTRUM
##VAR_NAME=  FREQUENCY,     SPECTRUM/REAL,   SPECTRUM/IMAG
##SYMBOL=    X,             R,               I
##VAR_TYPE=  INDEPENDENT,   DEPENDENT,       DEPENDENT
##VAR_FORM=  AFFN,          ASDF,            ASDF
##VAR_DIM=   32768,         32768,           32768
##UNITS=     HZ,            ARBITRARY UNITS, ARBITRARY UNITS
##FACTOR=    0.250966925370066, 1,           1
##FIRST=     8223.43324360094, -172643,      11032
##LAST=      0,             58722,           -35495
##MIN=       0,             -682773,         0
##MAX=       8223.43324360094, 465071851,    0
$$ Real data points
##PAGE= N=1
##DATA TABLE= (X++(R..R)), XYDATA
$$ [...]
19468A09808d42640J54594A05532g4811d724l27374k8625a55774A19444b11118
$$ 109808 -442640 -288046 105532 -74811 -4724 -332098 -360723 -155774 119444 -211118
19457d12261J63831A20020A9346h9949B62071d2477k08620C54184i5868G4177
$$ -412261 -248430 120020 19346 -89949 262071 -42477 -251097 354184 -95868 74177
19446a69167A9607N5863c41448J56871h9582A42205J5130a95699e3139j66978
$$ -169167 19607 75470 -341448 -184577 -89582 142205 157335 -195699 -53139 -220117
19436b20117f2070C686d943B4955c87101A15666b13060j0746H3399A4501J47913
$$ -220117 -62070 3686 -4943 24955 -387101 115666 -213060 -223806 83399 14501 162414
19425A62414h7625j09560J2642F338J78246e7762n4854j8703k09444D953d4519
$$ 162414 -87625 -197185 -184543 6338 184584 -57762 -112616 -131319 -340763 4953 -44519
19413a88010E7244c52104a57728a3225H596b72480o1911f8857B2526i8986k52430
$$ -188010 57244 -352104 -157728 -13225 8596 -272480 -334391 -68857 22526 -98986 -351416
19402c51416A21928a6609o8077F5650g262l78927a11151A28064a15281j68398
$$ -351416 121928 -16609 -84686 65650 -7262 -386189 -111151 128064 -115281 -283679
19392b83679A9896o948e318G2317B5252b00875e8662I890J06647a5895k23006
$$ -283679 19896 12948 -5318 72317 25252 -200875 -58662 9890 116537 -15895 -238901
19381b38901a8613A53133J7106g5760L3410D3416f2104I7605b06620L520Q20o5345
$$ -238901 -18613 153133 170239 -75760 -42350 43416 -62104 97605 -206620 -203100 -202280 -267625
19369b67625L0352A37362J15408a64812a5697F8677b00563p8688m258P7846F8892
$$ -267625 -237273 137362 252770 -164812 -15697 68677 -200563 -279251 -283509 -205663 68892
19357A41204c4656j67343b0096C1715J62325b54929E212f6455C4261m245L228
$$ 141204 -34656 -201999 -20096 31715 194040 -254929 5212 -66455 34261 30016 33244
19346C3244K6605j4539a18662C8192G922i020C2371O111r716d2966j31515B42729
$$ 33244 59849 45310 -118662 38192 7922 -9020 32371 38482 28766 -42966 -174481 242729
19333a46361q4026I3060K42827b63096a00011A09768a67043G0551a33855j934
$$ -146361 -230387 93060 335887 -263096 -100011 109768 -167043 70551 -133855 -135789
19323a35789B11706B4772N6387e5086j21999B26435a8408j93892a5303A7214c12076
$$ -135789 211706 24772 81159 -55086 -177085 226435 -18408 -212300 -15303 17214 -312076
19311a6887A92364d7204E151K15027c07430a6113k57370c7348k27943c0180B66997
$$ -16887 192364 -47204 5151 220178 -307430 -16113 -273483 -37348 -265291 -30180 266997
19299f1096H2901J3466a60805j62845Q1015k4093f5340C86944a87199l4136A00861
$$ -61096 82901 96367 -160805 -323650 -242635 -266728 -65340 386944 -187199 -221335 100861
19287b83987l1779J4786h1605B42831E7940d90245a48533A3459e09641F1470b29694
$$ -283987 -315766 -300980 -81605 242831 57940 -490245 -148533 13459 -509641 61470 -229694
19275B19380b8173A46107a22911j03985j13362g1570B04420J0058e9558F2828
$$ 219380 -28173 146107 -122911 -226896 -340258 -71570 204420 214478 -59558 62828
19264a37501l353O3431A10118R6844b59865l995Q4925A222c120k94751e6787H9419
$$ -137501 -140854 -77423 110118 206962 -259865 -263860 -178935 1222 -3120 -297871 -56787 89419
19251D1597b26059R9681k00005a05554A13235a01661c2143j21270A52683a85788
$$ 41597 -226059 -126378 -326383 -105554 113235 -101661 -32143 -153413 152683 -185788
19240f9276l8443j26600i7711j58323g0171j23630A15455A8235b81431n4456m4577
$$ -69276 -107719 -234319 -97711 -256034 -70171 -193801 115455 18235 -281431 -335887 -380464
19229c80464J04529P6650j27456a19642R529j91148k2849h3211E0308a98003k6009
$$ -380464 -275935 -199285 -326741 -119642 -110113 -301261 -324110 -83211 50308 -198003 -224012
19218b24012G408i6814E9758g1156k06967a34378d9790B2704d89083A51664b06188
$$ -224012 7408 -96814 59758 -71156 -278123 -134378 -49790 22704 -489083 151664 -206188
19206b02379I4109A3863d8688j32490j18119b0892k01130l9901f7209A80584H0531
$$ -202379 94109 13863 -48688 -181178 -299297 -20892 -222022 -261923 -67209 180584 80531
19194c8450q7313b8631j7812A29972a5686A30207a25164q7191h1815F573J02374
$$ -38450 -125763 -28631 -46443 129972 -15686 130207 -125164 -212355 -81815 6573 108947
19183A08947m3090c97937J11279a07976o6891b2223D7825N7873A9371a02906k5805
$$ 108947 65857 -397937 -286658 -107976 -174867 -22223 47825 105698 19371 -102906 -128711
19172a28711a7067l47055B80341i836j46379k7536c0129k97021a06070k00907
$$ -128711 -17067 -364122 280341 -9836 -156215 -183751 -30129 -327150 -106070 -306977
19162c06977a244j28837k8766A9185h6609F2767L65482e3979p9598d4148k6888
$$ -306977 -1244 -130081 -158847 19185 -86609 62767 428249 -53979 -133577 -44148 -71036
19151g1036l8359k05886J35953H6918b0850C85630e56590K40451B24008b83364
$$ -71036 -109395 -315281 -179328 86918 -20850 385630 -556590 -316139 224008 -283364
19140I1492b36445A19775l5196J47882b18481N2822d2k07487A17164f1699A08378
$$ 91492 -236445 119775 84579 232461 -218481 -165659 -42 -207529 117164 -61699 108378
19128I7650b02217b8497j66333n1426G1317K51791b25653d342A86292K06525B9595
$$ 97650 -202217 -28497 -194830 -246256 71317 323108 -225653 -4342 186292 392817 29595
19116H2093B5944a01142C14833d7152j88517A34835e0352A41468F9484c2347m2454
$$ 82093 25944 -101142 314833 -47152 -235669 134835 -50352 141468 69484 -32347 -74801
19105g4801C24944a16521e1931a4079n6632j49593n1975A68935b2706k89636g0584
$$ -74801 324944 -116521 -51931 -14079 -70711 -220304 -272279 168935 -22706 -312342 -70584
19093A24560J15894a77277C29132a17578A06607E2808h8403c5668A61742a95316
$$ 124560 240454 -177277 329132 -117578 106607 52808 -88403 -35668 161742 -195316
19082a41579c5404k77022d7295I4238K639c7314B09781F5585j798d3276G2280
$$ -141579 -35404 -312426 -47295 94238 96877 -37314 209781 65585 63787 -43276 72280
19070a85612A05183g8884j770A57968b59390e9577A41353n7463a07351D3995a35243
$$ -185612 105183 -78884 -80654 157968 -259390 -59577 141353 83890 -107351 43995 -135243
19058d4541B24451r2562c08522c6142r7890I5448c01504B06755B2673a0502j47813
$$ -44541 224451 131889 -308522 -36142 -134032 95448 -301504 206755 22673 -10502 -158315
19047a58315j34214B21083b96129L1451B6925d12067A84561d18533B6815c00870
$$ -158315 -292529 221083 -296129 -264678 26925 -412067 184561 -418533 26815 -300870
19036c0325j76096i1233j46813J18094r1555F7747J60552e662j15290M6959B01988
$$ -30325 -206421 -91233 -238046 -119952 -211507 67747 228299 -5662 -120952 -73993 201988
19024A27762P3234E9164J88510A06006N1925n8481J84687h1515A71397n3038c88226
$$ 127762 200996 59164 247674 106006 157931 99450 284137 -81515 171397 118359 -388226
19012c56435f3925j42771A95120a8744k6516I2573A6176L13846j06578a46354
$$ -356435 -63925 -206696 195120 -18744 -45260 92573 16176 330022 223444 -146354
19001b50159e9590j82431F6439L7727b70611C08467A19984C0435K00746Q7203
$$ -250159 -59590 -242021 66439 104166 -270611 308467 119984 30435 231181 318384
18991C18384c91069F9836b77764R8751m1407j15124J64168B1190J10661f1846
$$ 318384 -391069 69836 -277764 -179013 -220420 -335544 -171376 21190 131851 -61846
18980A53227c953r0452j41201a04903F5603a63405g50A05360J52954L52501J76789
$$ 153227 -3953 -94405 -235606 -104903 65603 -163405 -750 105360 258314 610815 787604
18969G87604l80744A07370k3483N6604a98998A44962a03337j3525p0190M6456
$$ 787604 406860 107370 83887 140491 -198998 144962 -103337 -116862 -187052 -140596
18959a40596J3137b5745j65273d7407k12615a01340j09039F1879b42811o5535
$$ -140596 -127459 -25745 -191018 -47407 -260022 -101340 -210379 61879 -242811 -308346
18949c08346B07991a61648m0506l31162B87794a08517b3213q2624N1168B21617
$$ -308346 207991 -161648 -202154 -533316 287794 -108517 -23213 -105837 -54669 221617
18938a22533A85436b30570E8649b1298A73614n9721J84517f160j77864Q4250n7406
$$ -122533 185436 -230570 58649 -21298 173614 113893 298410 -6160 -184024 -99774 -157180
18927a57180E02173a04658L8200C0274c25306l6223J19846R8204j17360g0550
$$ -157180 502173 -104658 -66458 30274 -325306 -361529 -241683 -143479 -260839 -70550
18916B64849a08978r7660n3526J29918l43934B981a64265F9220M48071K30355
$$ 264849 -108978 -206638 -260164 -130246 -474180 2981 -164265 69220 517291 747646
18906G47646k59455A06674b45913h9737A48656i6999k6464F125a4008C31043a8357
$$ 747646 488191 106674 -245913 -89737 148656 -96999 -123463 6125 -14008 331043 -18357
18894G7572c40874A1990a39915B04316l0491q2096b95171J12921A9891M0523c02402
$$ 77572 -340874 11990 -139915 204316 173825 91729 -295171 -182250 19891 60414 -302402
18882b84084a36231q1266G6577b07363c8196J4846j37121b2967C1553J51875B4845
$$ -284084 -136231 -217497 76577 -207363 -38196 -23350 -160471 -22967 31553 183428 24845
18870B6094a85111C0279a52336o3089f2913a9427j41161A5194b31394d075l08207
$$ 26094 -185111 30279 -152336 -215425 -62913 -19427 -160588 15194 -231394 -4075 -312282
18859c12282Q5434B2143i788j57402B2569D984c13499J14949e9846j01577o9763
$$ -312282 -226848 22143 -9788 -167190 22569 4984 -313499 -198550 -59846 -161423 -231186
18848b31186f2050k56057A4569a02497l3662A78614J1275a16911J0316k6606K6458
$$ -231186 -62050 -318107 14569 -102497 -136159 178614 189889 -116911 -106595 -133201 -106743
18837a06743d9514l77721i8474r244A45958A4456P8118e4486j12372B20963n4344
$$ -106743 -49514 -427235 -98474 -107718 145958 14456 92574 -54486 -166858 220963 166619
18826A66619b12435B8626e266A40223a08003k36251E2868e1572I0727B5290g2848
$$ 166619 -212435 28626 -5266 140223 -108003 -344254 52868 -51572 90727 25290 -72848
18814H47i185A6412D182a23623C69664e673A87541K36969j3823m8022j31889f3484
$$ 847 -9185 16412 4182 -123623 369664 -5673 187541 424510 410687 362665 230776 -63484
18801a23301B8776J80674d4976A13809J49558d45098c5426D1932g7791r9403Q882
$$ -123301 28776 209450 -44976 113809 263367 -445098 -35426 41932 -77791 -177194 -168312
18790a68312E145a27384k27945a19435C5469J03745a10868r4575B91759c3641
$$ -168312 5145 -127384 -355329 -119435 35469 139214 -110868 -205443 291759 -33641
18779I0299c53595G3841a63551a1289l6545k1943a2093m7860l70478a79011A3251
$$ 90299 -353595 73841 -163551 -11289 -47834 -69777 -12093 -59953 -430431 -179011 13251
18767c84032c2863Q274j81383R6069j27196p4814a48988k67q0320A2584b2402
$$ -384032 -32863 -24589 -205972 -109903 -237099 -311913 -148988 -149255 -229575 12584 -22402
18755c2241n5982C6151e6583k84439B57931e07860g5500L5583j74367A83850c98081
$$ -32241 -88223 36151 -56583 -341022 257931 -507860 -75500 -39917 -214284 183850 -398081
18743c00500h8800I4835g3516A3301a76591k46126f5667p8910H4572C5252b20712
$$ -300500 -88800 94835 -73516 13301 -176591 -422717 -65667 -144577 84572 35252 -220712
18731c5113p7620A77456b26519B66708a17861A02800l9180J11188D8205b20220
$$ -35113 -112733 177456 -226519 266708 -117861 102800 63620 174808 48205 -220220
18720C35122O6574D5660f8057n5344N1508C04302K2842G2371h2274l18624g8151
$$ 335122 401696 45660 -68057 -123401 -71893 304302 327144 72371 -82274 -400898 -78151
18708C0282J89937b0718f158q547j11962I0888a01199D8685b38879r2188i0319
$$ 30282 220219 -20718 -6158 -14705 -126667 90888 -101199 48685 -238879 -331067 -90319
18696a78030o309a3318j19249j03500F4651a56032a9796H9510a82472d850k49259
$$ -178030 -184339 -13318 -132567 -236067 64651 -156032 -19796 89510 -182472 -4850 -254109
18685b54109D5840M2204b07776O6946e3417q1663e558D2422b99232N6697B129
$$ -254109 45840 88044 -207776 -140830 -53417 -135080 -5558 42422 -299232 -242535 2129
18673i2500b5281A34127Q7360d17569I6404B816d14570B9111b09234G9123L0682
$$ -92500 -25281 134127 221487 -417569 96404 2816 -414570 29111 -209234 79123 109805
18662A09805A2728a47227G8063C6627b76022p8806a02014a3357l8982C5764L46872
$$ 109805 12728 -147227 78063 36627 -276022 -354828 -102014 -13357 -52339 35764 382636
18651C82636b29168a01901q0529D3651b59270A13007D737b52297D0471L23930
$$ 382636 -229168 -101901 -182430 43651 -259270 113007 4737 -252297 40471 364401
18641C64401b21049E2278a762A51546d11838J45386H7341K3662l7173a94097h8414
$$ 364401 -221049 52278 -1762 151546 -411838 -266452 87341 111003 73830 -194097 -88414
18629c32247h8888P769k3027m2238j27498i8093d1182H8123O41R812l656a14087
$$ -332247 -88888 -81119 -104146 -146384 -273882 -98093 -41182 88123 88764 98576 94920 -114087
18616b86781C3230j6171f2628J6945H1134j6760b6959E7314N5413c86156C06739
$$ -286781 33230 17059 -62628 -45683 81134 64374 -26959 57314 112727 -386156 306739
18604A85373c71923N9216P8142Q1335A08894h8845o6720G1848a18866I8320a91334
$$ 185373 -371923 -312707 -234565 -153230 108894 -88845 -155565 71848 -118866 98320 -191334
18592b45371A67312f3154A96366C6075P4372l035a98664d1376B2657a10500A80347
$$ -245371 167312 -63154 196366 36075 110447 107412 -198664 -41376 22657 -110500 180347
18580I5162a5448r9361A12327K27187a38681I9755J24827i9756q7733A20483m9746
$$ 95162 -15448 -114809 112327 339514 -138681 99755 224582 -99756 -187489 120483 70737
18569G0737a62671I7661m6149b98245D3456N5460L7624a35585m3199B92688c94385
$$ 70737 -162671 97661 51512 -298245 43456 98916 136540 -135585 -178784 292688 -394385
18557A02905a45912f0192G0176b19540G770a08845B02900e1124j6835a5540k44333
$$ 102905 -145912 -60192 70176 -219540 7770 -108845 202900 -51124 -67959 -15540 -259873
18546b59873k9636i7690F2543b35311l523D089d71218a93871f8196q0638C32882
$$ -259873 -289509 -97690 62543 -235311 -238834 4089 -471218 -193871 -68196 -148834 332882
18534f9387j52129A05693J12002b6713A03356a11569c2526H7513J28253k3172
$$ -69387 -221516 105693 217695 -26713 103356 -111569 -32526 87513 215766 192594
18524A92594f655D2344c80643F2103b6380j29913q6550J00824C9438a76646j83706
$$ 192594 -6655 42344 -380643 62103 -26380 -156293 -242843 -142019 39438 -176646 -360352
18513c60352J00717A02629b53253l798d0229a0568j52911A12142m4576a23488
$$ -360352 -259635 102629 -253253 -257051 -40229 -10568 -163479 112142 67566 -123488
18502c76908F3151c0436k261A71280Q8664f7921j47761c9028B6713N4306h1661
$$ -376908 63151 -30436 -32697 171280 259944 -67921 -215682 -39028 26713 81019 -81661
18490i0170K1961k44891a3499j17545j57804e0193l75535J15431F1550a7666j6865
$$ -90170 -68209 -313100 -13499 -131044 -288848 -50193 -425728 -310297 61550 -17666 -34531
18479c4531A36516a50782C5095a79239a4381k09372L4858A00845g7023j60585
$$ -34531 136516 -150782 35095 -179239 -14381 -223753 -188895 100845 -77023 -237608
18469b37608f6272i073k95461a33526M4065j131n4575A9768h5740k58450R3187
$$ -237608 -66272 -9073 -304534 -133526 -89461 -90592 -145167 19768 -85740 -344190 -251003
18458b51003M9254M2638A44764a60832F7371M4854a91658J386C5237J61200a53056
$$ -251003 -201749 -159111 144764 -160832 67371 112225 -191658 -190272 35237 196437 -153056
18446H3949l9808A9776K1037g6537j1650A79129n2290n7177k2687N3991a42270
$$ 83949 44141 19776 40813 -76537 -88187 179129 126839 69662 46975 100966 -142270
18434A37402J3888c8331j64009b4485p1673a1519j80337e9474B9809J43787l4816
$$ 137402 151290 -38331 -202340 -24485 -96158 -11519 -191856 -59474 29809 173596 138780
18423A38780D3899c60303A29710a19264E259J81154b63390B9066a22768p7360
$$ 138780 43899 -360303 129710 -119264 5259 186413 -263390 29066 -122768 -200128
18413b00128C04587a83059M6253n9445i4145E9824A3708b84853a0662q8335A86382
$$ -200128 304587 -183059 -136806 -196251 -94145 59824 13708 -284853 -10662 -98997 186382
18401a92842C4877P0172J6808O3377K0214J76726j61159c2560q3001B671J99165
$$ -192842 34877 105049 121857 185234 205448 382174 221015 -32560 -115561 2671 201836
18390B01836D5597b43149E5465b44603C4483J90246q7686a18768o6364c1161j84716
$$ 201836 45597 -243149 55465 -244603 34483 224729 137043 -118768 -185132 -31161 -215877
18379b15877B7191a98497C08734b05424A68108f3806o2177o7648j35506O7587
$$ -215877 27191 -198497 308734 -205424 168108 -63806 -125983 -193631 -329137 -261550
18369b61550g608j93669A71829a87146J2602P5869a6403j63734C29295b1716h87
$$ -261550 -7608 -201277 171829 -187146 -174544 -98675 -16403 -180137 329295 -21716 -887
18357c65537E6874a04441B00487m2312J02708i5388p8129k8773b0899l89488A5000
$$ -365537 56874 -104441 200487 158175 260883 -95388 -173517 -202290 -20899 -410387 15000
18345A07064b49167f0650A12538l0531J2388N3945a30602r4021A1301a84735P4051
$$ 107064 -249167 -60650 112538 82007 94395 148340 -130602 -224623 11301 -184735 -110684
18334a10684r2325R0009B83488g1120k06466Q4414J316A19404a13814e5026J989
$$ -110684 -203009 -113000 283488 -71120 -277586 -193172 -191856 119404 -113814 -55026 -53037
18323e3037A48664R7548C2587a55183A77567J25889i3109M2732A8849a99854B70668
$$ -53037 148664 246212 32587 -155183 177567 303456 -93109 -50377 18849 -199854 270668
18311F2936k4686c012k58092n20i9082A00993l1512C3775b1686A20050b30745
$$ 62936 38250 -3012 -261104 -261624 -99082 100993 69481 33775 -21686 120050 -230745
18299F195a00290l50946A03686K7138o1441A3725J52631e4018E7459J27404c3309
$$ 6195 -100290 -451236 103686 130824 69383 13725 166356 -54018 57459 184863 -33309
18287a65652g3653k4606C7705c58189h9674A43350a57101g5125B43329a07100
$$ -165652 -73653 -98259 37705 -358189 -89674 143350 -157101 -75125 243329 -107100
18276A70882a75289A23622a53621j89416J16928j56144E3577c48805e5593k03478
$$ 170882 -175289 123622 -153621 -343037 -226109 -382253 53577 -348805 -55593 -259071
18266b59071O7445A13280J25730a44023L3886j5690h056G8665k3974a59133j7012
$$ -259071 -191626 113280 239010 -144023 -110137 -125827 -8056 78665 54691 -159133 -176145
18255a76145q2154A83914d35640J33020E0291g4433J9117H2348l0591c7321I6776
$$ -176145 -258299 183914 -435640 -302620 50291 -74433 -55316 82348 51757 -37321 96776
18243D88N4760a74905A5786O6739J42091a41743I4677K7205O4293f4692F9180
$$ 488 55248 -174905 15786 82525 224616 -141743 94677 121882 186175 -64692 69180
18231A2636a8496B65709H142J18526A9544c85514C4261b5337m8026A5307a64276
$$ 12636 -18496 265709 8142 126668 19544 -385514 34261 -25337 -73363 15307 -164276
18219A47565J0346J9676P2070C6209b3546A7588b10231A7257J2594a59541D7614
$$ 147565 157911 177587 249657 36209 -23546 17588 -210231 17257 29851 -159541 47614
18207e0121n548q7634A29571K15253D3143J64538d4516F8222e5920A66687c01702
$$ -50121 -55669 -143303 129571 344824 43143 207681 -44516 68222 -55920 166687 -301702
18195c0389p2892k26329f9761l26C8335L60236a0047A06143d69944A85537i3119
$$ -30389 -103281 -329610 -69761 -70087 38335 398571 -10047 106143 -469944 185537 -93119
18183b07213F2135g1824o2202j06476d9994B49977b55730C3451f5463k0278n9999
$$ -207213 62135 -71824 -134026 -240502 -49994 249977 -255730 33451 -65463 -85741 -145740
18172a45740c6959A95021b08747b9254A54060g3580c6254j33448H7775b50591
$$ -145740 -36959 195021 -208747 -29254 154060 -73580 -36254 -169702 87775 -250591
18161a32082C0513i6241A26459a69281G8748J49898E000a08819q6088i3720k857
$$ -132082 30513 -96241 126459 -169281 78748 228646 5000 -108819 -194907 -93720 -96577
18150i6577A51978f4821a4967A31484c04208J04212A21666B9247J71464b15418
$$ -96577 151978 -64821 -14967 131484 -304208 -199996 121666 29247 200711 -215418
18139D4049K89283j23580b7421m2317k49067B82437F0679J27061g3274j09130
$$ 44049 333332 209752 -27421 -69738 -318805 282437 60679 187740 -73274 -182404
18129a82404A34874b08992k588F1804a0243k13454A82684a78462N6945M2697j87159
$$ -182404 134874 -208992 -211580 61804 -10243 -223697 182684 -178462 -121517 -78820 -265979
18118b65979F420d3598A42137a55210d99n6367n531k31502A67869D5302a35447
$$ -265979 6420 -43598 142137 -155210 -499 -56866 -62397 -293899 167869 45302 -135447
18106C03482a7012A12281b66328B932a07411A2880P3680a27983m3980I5254B5743
$$ 303482 -17012 112281 -266328 2932 -107411 12880 86560 -127983 -171963 95254 25743
18094B07884m4765f5462J3749A14642J12524n4217G7214a95670P4063j31404G0897
$$ 207884 163119 -65462 -51713 114642 227166 172949 77214 -195670 -121607 -253011 70897
18082F3509f6145G5573d5013l6197R450I0529E625L0791L5035P4094c01081f3103
$$ 63509 -66145 75573 -45013 -81210 -71760 90529 5625 36416 71451 145545 -301081 -63103
18069A27228m9485a50819p6162I3006O1367J08042B1194N3876J35265M2854b58391
$$ 127228 77743 -150819 -226981 93006 154373 262415 21194 75070 210335 253189 -258391
18057B66956E9432b62225H0776N0337M2840M1453G2383p661a25552o6910b5577
$$ 266956 59432 -262225 80776 131113 173953 215406 72383 64722 -125552 -192462 -25577
18045h3951F1656d0529p5528B70495j20282N219C4311a34120E0212M2232J33383
$$ -83951 61656 -40529 -116057 270495 150213 155432 34311 -134120 50212 92444 225827
18034B25827l8957c1794A0540a32608A01694m5346J34792R3642b55468g126j72664
$$ 225827 186870 -31794 10540 -132608 101694 56348 191140 284782 -255468 -7126 -179790
18023a79790I862J75319q3502K96404H7819a81378h9053j74747j21245g8736a1614
$$ -179790 9862 185181 101679 398083 87819 -181378 -89053 -263800 -385045 -78736 -11614
18011G4651B0628P9638f4457k4256a1004E2920k0168K02390A08305h8062A37570
$$ 74651 20628 100266 -64457 -88713 -11004 52920 32752 235142 108305 -88062 137570
17999A43804K5097k9043d4381H5478b59282I5244g4384k2961H5889J67976a02938
$$ 143804 168901 139858 -44381 85478 -259282 95244 -74384 -97345 85889 253865 -102938
17987B75283J09507c16854B11332N6036K7198c49264H506L4659P497A4608e5552
$$ 275283 384790 -316854 211332 267368 294566 -349264 8506 43165 50662 14608 -55552
17975H2243J09232a06417A65055b91300c0177j48293C381J02365l0880d07643
$$ 82243 191475 -106417 165055 -291300 -30177 -178470 3381 105746 74866 -407643
17964b9374A02418D3426i1902C1488O4096c09195E9142J97478I2401i6783p8138
$$ -29374 102418 43426 -91902 31488 95584 -309195 59142 256620 92401 -96783 -174921
17953a74921M9305L4708H8230b11995c4426A5799c001A80581b1938j48468J6614
$$ -174921 -125616 -90908 88230 -211995 -34426 15799 -3001 180581 -21938 -170406 -153792
17942a53792N1365E133J49598b7332q8892L5250A01360a52055g0432l1549q8880
$$ -153792 -102427 5133 154731 -27332 -116224 -80974 101360 -152055 -70432 -101981 -190861
17931a90861a8489A2969J87811H1641A3829R5319c960j75576B1702J07475B2217
$$ -190861 -18489 12969 200780 81641 13829 109148 -3960 -179536 21702 129177 22217
17919C8998N8796B8001b06190k3050B58941A01888K10547I403K61040b003G0866
$$ 38998 97794 28001 -206190 -229240 258941 101888 312435 9403 270443 -2003 70866
17907a47729q2304A9295h4402D555b8521A21907B9510a1240I2891P9847a12236
$$ -147729 -230033 19295 -84402 4555 -28521 121907 29510 -11240 92891 172738 -112236
17895c2971C2970e3336a1009k47799O8506d8811A20382d2872C3102K4550K54337
$$ -32971 32970 -53336 -11009 -258808 -190302 -48811 120382 -42872 33102 57652 311989
17884C11989q9662F9048K8103j6044a7148B77006a23160A4018a79375I3559h991
$$ 311989 222327 69048 97151 81107 -17148 277006 -123160 14018 -179375 93559 -8991
17872A22232C9593K980M29552G6273d1735j74266I5074b89948e0128A72217I130
$$ 122232 39593 42573 472125 76273 -41735 -216001 95074 -289948 -50128 172217 9130
17860a14992G2009e4866C08251Q9122d5807e985A0471b5885B25108f1196j74740
$$ -114992 72009 -54866 308251 397373 -45807 -5985 10471 -25885 225108 -61196 -235936
17849b35936a10876C2096L48447B7167J86808G5200a68071I774K98703b41953
$$ -235936 -110876 32096 380543 27167 213975 75200 -168071 9774 308477 -241953
17838b35532I7869Q7886a07249A30701f9169k02897B18001f4055B23891N8504
$$ -235532 97869 185755 -107249 130701 -69169 -272066 218001 -64055 223891 282395
17828B82395A18906n5643K8790K04387i0498A04379g2999J0343I24O5618f1927
$$ 282395 118906 63263 92053 296440 -90498 104379 -72999 -62656 924 66542 -61927
17816G06e3193j91491I4033Q9594d880A43797i0418J623c0434D35331h0110B75118
$$ 706 -53193 -244684 94033 183627 -4880 143797 -90418 -88795 -30434 435331 -80110 275118
17803b02304D5164J58237K80518a62650K6144B5438b72192B0352a65563j62975
$$ -202304 45164 203401 483919 -162650 -136506 25438 -272192 20352 -165563 -328538
17793c28538E9338f1736j34234c460E1552K04867a35562E7282J2166J378d3835
$$ -328538 59338 -61736 -195970 -3460 51552 256419 -135562 57282 69448 70826 -43835
17781a1585o1466r735B17901J50418D1800b33424A62498P554D1609P7729B7000
$$ -11585 -73051 -82786 217901 368319 41800 -233424 162498 170052 41609 119338 27000
17769a28844m0133B78264q5880E5310K00595n6141b429r9991B32035J0398g6399
$$ -128844 -168977 278264 192384 55310 255905 199764 -2429 -102420 232035 242433 -76399
17757A48460a50140a8569j66542q7781G9744M42636k16481p2888a21202a6805
$$ 148460 -150140 -18569 -185111 -272892 79744 522380 305899 233011 -121202 -16805
17746b5607A16773g4686A48676n881M6330G0802a6129r014k4313j0800A06066
$$ -25607 116773 -74686 148676 142795 189125 70802 -16129 -25143 -49456 -60256 106066
17734e5672C28563D2232N4118Q2594b349B57067b2613m6673j665B91049n0664
$$ -55672 328563 42232 96350 178944 -2349 257067 -22613 -69286 -70951 291049 240385
17723B40385I337L83098c6147C3864M35152A34287j2684E9926J39231A8827J45564
$$ 240385 9337 392435 -36147 33864 469016 134287 121603 59926 199157 18827 164391
17712A64391L1964D317P5852K61698A21337g353B61644L8116F8353b1001B33183
$$ 164391 196355 4317 80169 341867 121337 -7353 261644 299760 68353 -21001 233183
17700C26093J27438B0119K30684g0873E135a39387d5046F4428J73830l3514d0572
$$ 326093 453531 20119 250803 -70873 5135 -139387 -45046 64428 238258 204744 -40572
17688A94982q4118N1797f0369C20162p7555D0976J25477c74186A33352b6534f064
$$ 194982 110864 162661 -60369 320162 242607 40976 166453 -374186 133352 -26534 -6064
17676A96613H9445a18535D18344I5776Q6769j5498a36762D90164I3661J36884
$$ 196613 89445 -118535 418344 95776 182545 167047 -136762 490164 93661 230545
17666B30545A5554K05975i219A47716m7283E296Q472M6327d6158o4611A23178
$$ 230545 15554 221529 -9219 147716 100433 5296 13768 60095 -46158 -110769 123178
17654B3297b48691D4503Q0581l1850b687n3151F455K77374a15237A27011J01990
$$ 23297 -248691 44503 125084 93234 -2687 -55838 6455 283829 -115237 127011 229001
17643B29001a6249B35099Q9460f1471l5078c5941B77483n3060R1112A19099N7067
$$ 229001 -16249 235099 324559 -61471 -96549 -35941 277483 224423 315535 119099 176166
17632A76166a91921D86879e0535B75268E1944J30979L9467R0078h5126a6113C77437
$$ 176166 -191921 486879 -50535 275268 51944 182923 222390 312468 -85126 -16113 377437
17620A90250L037J10979g5344j2891L947L8650B84291i7466G2812Q4723k2293
$$ 190250 193287 304266 -75344 -88235 -84288 -45638 284291 -97466 72812 157535 135242
17609A35242K09990k0887f7837B51598b0214B82205J09096H3152P4003L1048J13416
$$ 135242 345232 324345 -67837 251598 -20214 282205 391301 83152 157155 188203 301619
17598C01619A06082m7624L47576j87482L3055A00452K3222J27797K81652A77692
$$ 301619 106082 58458 406034 218552 251607 100452 123674 251471 533123 177692
17587A9657K69425K1282A48207R7627A12367A5809L0966M2635b51813A93893K57882
$$ 19657 289082 310364 148207 245834 112367 15809 46775 89410 -251813 193893 451775
17576D51775A74726D0798L19432B304L90422j66673K050o443A00231k4061f0247
$$ 451775 174726 40798 360230 2304 392726 226053 228103 221660 100231 76170 -60247
17564C99410L3846j47735j4170O4169o3425E6600K12085l2755N3020A11643J66600
$$ 399410 433256 285521 271351 335520 272095 56600 268685 235930 288950 111643 278243
17553B78243o2266I3890K11835A16313R1504J66603J538E7342K50863J68751D6373
$$ 278243 215977 93890 305725 116313 207817 374420 375958 57342 308205 476956 46373
17541B6775J23941E1923a70450A3271K22427Q6625j16062q5250J60184K78270
$$ 26775 150716 51923 -170450 13271 235698 322323 206261 121011 281195 559465
17531E59465B55855J29120c7540F60140J07035k00763M14869j81033J64330k16265
$$ 559465 255855 384975 -37540 660140 767175 566412 981281 800248 964578 748313
17521G48313R6339k10900B07645K24769A01847K59167A43026J16332L88977k38103
$$ 748313 844652 633752 207645 432414 101847 361014 143026 259358 648335 410232
17511D10232R0801N36393j99383P43582o20091m14310K23964N7841C66810J78765
$$ 410232 501033 1037426 838043 1581625 961534 547224 771188 829029 366810 545575
17501E45575B68504J9276J53443G9697M78421A94495J52697A15658O6200L7311
$$ 545575 268504 287780 441223 79697 558118 194495 347192 115658 181858 219169
17491B19169M94253h5541E83951A61360p4297N1875g70C10901L9524o3477j27042
$$ 219169 713422 -85541 583951 161360 87063 138938 -770 310901 350425 286948 159906
17480A59906K77736o5417q8119K43796I5659J82291L1662J79710j03930p2292
$$ 159906 437642 372225 284106 527902 95659 277950 309612 489322 385392 313100
17470C13100O9720j75279c8158D09314j52324A15815K82097j22700q8248K04829
$$ 313100 382820 207541 -38158 409314 256990 115815 397912 275212 186964 391793
17460C91793j17841m4709K08522A90632H3158L3167J07876J22232q5604j5589
$$ 391793 273952 229243 437765 190632 83158 116325 224201 346433 260829 245240
17450B45240J97354j15607L06695G8341K53051H2671J69611n3924M74829B97823
$$ 245240 442594 326987 633682 78341 331392 82671 252282 198358 673187 297823
17439B89333L8523J44209j60487p3595j8032J45803A70919L82945j83459J74470
$$ 289333 327856 472065 311578 237983 219951 365754 170919 553864 370405 544875
17429E44875B22682K21717l2856n8249m000B731M40251k05282L3390Q5126o0774
$$ 544875 222682 444399 411543 353294 349294 2731 442982 237700 271090 356216 295442
17418B95442n6968o095K42303j82978K14060j59510G8419N47586B92287j14592
$$ 295442 238474 232379 474682 291704 505764 346254 78419 626005 292287 177695
17408A77695J58713j35494P2178A13485a77227A47198K90083A28413J25899H5347
$$ 177695 336408 200914 273092 113485 -177227 147198 437281 128413 254312 85347
17397d2110A99635k5809L6773J11899J14721A19934N6064M64812B05862E4835
$$ -42110 199635 173826 210599 322498 437219 119934 175998 640810 205862 54835
17386E63551A77228E3176M23751A92774a15459B18876M2024J40779P1425k24825
$$ 563551 177228 53176 476927 192774 -115459 218876 260900 401679 473104 248279
17376B48279J13816j44530Q867J13317j61548J11816M21165A56733K33703A25931
$$ 248279 362095 217565 226432 339749 178201 290017 711182 156733 390436 125931
17365C55271r0697J79236j37403Q3322A79534K51330a07979j57463A10497M56722
$$ 355271 264574 443810 306407 389729 179534 430864 -107979 -265442 110497 567219
17355E67219k46479j05111H4519d0150C90483a80060D90039B19077m87c1771A20326
$$ 567219 320740 215629 84519 -40150 390483 -180060 490039 219077 218590 -31771 120326
17343F15946j48841F6691J83284M65339E0644L90597j46400P1159D5206N14274
$$ 615946 467105 66691 249975 715314 50644 441241 294841 366000 45206 559480
17333E59480k21695a0102C42559K21911k44892o3308K37795o3827J15151B47427
$$ 559480 337785 -10102 342559 564470 319578 256270 494065 430238 545389 247427
17322B04410N57082B04288J83211n0265M0429J4872p5029p541K03434B01065m1134
$$ 204410 761492 204288 387499 337234 377663 392535 317506 309965 513399 201065 159931
17311A59931J19135k0848J04778M8980j60732N7810M8499J54769r5846N1347n8732
$$ 159931 279066 258218 362996 411976 251244 309054 357553 512322 416476 467823 409091
17300D09091j44604J96814k25700a00567A92188J01269K57390k35107m0938K07944
$$ 409091 264487 461301 235601 -100567 192188 293457 550847 315740 274802 482746
17290D82746A31805M94971j76129j94268j01069J33426L69536b455A61487P5266
$$ 482746 131805 626776 450647 256379 155310 288736 658272 -2455 161487 236753
17280B36753J11036J3915n227D0095d4399A53576K81836j30244b5423C83382M9115
$$ 236753 347789 361704 356477 40095 -44399 153576 435412 305168 -25423 383382 432497
17269D32497A66665J12768K53632D4701K46265Q46p4002j08207J38156L14184
$$ 432497 166665 279433 533065 44701 290966 291812 217810 109603 247759 561943
17259E61943n1650B19247O6150N4219K89021j31089k40571o7818J06363G6110
$$ 561943 510293 219247 285397 339616 628637 497548 256977 189159 295522 76110
17248E74324k47507j3970k1110K3767K67701k40356j05556J77250j03911m9619
$$ 574324 326817 312847 291737 315504 583205 342849 237293 414543 310632 261013
17238B61013J02315J87469A63092N78936k16707k9806L3023A88783K27799p921
$$ 261013 363328 550797 163092 742028 525321 495515 528538 188783 416582 408661
17228D08661a29208C62645r1556m8945L01192N1726r3251j587E330M06831J66161
$$ 408661 -129208 362645 271089 222144 523336 575062 481811 480224 5330 412161 578322
17217E78322k59250J75383K03201j78982j55586K55576k43322J22197K58223k04466
$$ 578322 319072 494455 697656 518674 363088 618664 375342 497539 755762 551296
17207E51296j08668l8494K26440k02019p4328l3386K01222j18629j6512o4642
$$ 551296 442628 404134 630574 428555 354227 320841 522063 403434 386922 322280
17197C22280k5149Q9634q8058L85317j53910j30149r6063M52774L116j88470k41675
$$ 322280 297131 386765 298707 684024 530114 399965 303902 756676 759792 571322 329647
17186C29647L86025A54927M08707q7305K88544C10214J52944Q4187j42011J4309
$$ 329647 715672 154927 563634 476329 764873 310214 463158 547345 405334 419643
17176D19643o2472K28500J1859K858k32153K29489L9197l5849j24633J07682L7214
$$ 419643 357171 585671 597530 600388 368235 597724 636921 601072 476439 584121 621335
17165F21335L1553M0554J20845r8546C35534J80349J09815k72976L72137j00582
$$ 621335 652888 693442 814287 715741 335534 515883 625698 352722 724859 624277
17155F24277k619j45339j39933L66378L8450m6220k22175R4724j70281n3434L3722
$$ 624277 621658 476319 336386 702764 741214 694994 472819 567543 397262 343828 377550
17144C77550M1139O9812K4105n279l1869K34210k77366K92093A81921M71746q6079
$$ 377550 418689 488501 512606 507327 475458 709668 432302 724395 181921 653667 567588
17133E67588K48334j96360j75657K99669j40091o2140K22775k08075J1650j94823
$$ 567588 815922 619562 443905 743574 603483 541343 764118 556043 567693 372870
17123C72870M27858j86910R291K97351k17956k633j01498k9074L01516j56942
$$ 372870 800728 613818 623109 920460 702504 699871 598373 569299 870815 713873
17113G13873N0055k7563n4543K41966k19395j83031L23234j92314j1184n2571
$$ 713873 763928 736365 681822 923788 704393 521362 844596 652282 641098 588527
17103E88527K43171k29512K7814J84475K15109D46206M03563j91010n1294l8304
$$ 588527 831698 602186 630000 814475 1029584 446206 849769 658759 607465 569161
17093E69161N66895k14673k9860q5841k56967L11794J30207l09099M74526D98303
$$ 569161 1136056 921383 891523 805682 548715 860509 990716 681617 1156143 498303
17082H67800k33452j3034L42130j78690j66426K91497j78952R0319q8736l4074
$$ 867800 634348 621314 963444 784754 618328 909825 730873 821192 732456 698382
17072F98382N67719l85926k29900M58402l20848J56890j60290J22206J08842j53704
$$ 698382 1266101 880175 650275 1108677 787829 944719 784429 906635 1015477 861773
17062H61773O9981L14422k69307M4085J07877k11271J4386M13329k40030k52591
$$ 861773 931754 1246176 976869 1020954 1128831 917560 931946 1345275 1105245 852654
17052H52654K14683k62139K47333k56976J63900j24844J13800k82358l8209K46597
$$ 852654 1067337 805198 1052531 795555 959455 834611 948411 666053 627844 874441
17042H74441J46309O3325K18387j82255j04597n3893P3977L7288j28351k2795
$$ 874441 1020750 1084075 1302462 1120207 1015610 961717 1035694 1072982 944631 921836
17032I21836K7909j73263M197J28964L34839j5948j7165K33277n25087L05028
$$ 921836 949745 776482 780679 909643 1244482 1228534 1211369 1444646 919559 1224587
17022A224587J12811k17579J17934J05372j45702Q8013k25336K01453K25358k79002
$$ 1224587 1337398 1119819 1237753 1343125 1197423 1285436 1060100 1261553 1486911 1207909
17012A207909l07388M08873J62886k58898J43413l2899j30262L95880l68936j9054
$$ 1207909 900521 1309394 1472280 1213382 1356795 1323896 1193634 1589514 1220578 1201524
17002A201524J14165j26925O5276K00961k96490J26450K10909J33799j14447n2269
$$ 1201524 1315689 1188764 1254040 1455001 1158511 1284961 1495870 1629669 1515222 1462953
16992A462953q8565K28485k36756K18508J31264j89274m29016N99181k85650L31747
$$ 1462953 1374388 1602873 1366117 1584625 1715889 1526615 1097599 1696780 1411130 1742877
16982A742877k82498l3572P9719l70573N50948J67783P7560m07711j02137K82800
$$ 1742877 1460379 1426807 1506526 1135953 1686901 1854684 1932244 1524533 1422396 1705196
16972A705196J9796o0029l8777k28218M81334o76487Q89780n40201j398q695K30345
$$ 1705196 1724992 1664963 1626186 1397968 1879302 1202815 2092595 1552394 1550996 1542301 1772646
16961A772646J46944k65500J88501K2160J00779M075k62907M67719j80522p1544
$$ 1772646 1919590 1654090 1842591 1864751 1965530 1969605 1706698 2174417 1993895 1922351
16951A922351K62065L0783j47219q4660N8388n484J53564k60063K68031k56327
$$ 1922351 2184416 2215199 2067980 1983320 2041708 2036224 2189788 1929725 2197756 1941429
16941A941429M5021L11448l7063L515K1162m8520k17535J61194J5253M43762m86009
$$ 1941429 1986450 2297898 2260835 2264350 2285512 2236992 2019457 2180651 2195904 2639666 2153657
16930B153657J23992R9408J0171J24960R3818k20560L14564R2850j88194J87407
$$ 2153657 2277649 2377057 2387228 2512188 2606006 2385446 2700010 2792860 2604666 2792073
16920B792073m02131j99722M06726k75814M65252j79482L45580p9932m0643o6753
$$ 2792073 2389942 2190220 2596946 2321132 2786384 2606902 2952482 2872550 2831907 2765154
16910B765154K71371J58039k78181J33372l89609M97068k19238J79110J2248Q2622
$$ 2765154 3036525 3194564 2916383 3049755 2660146 3157214 2937976 3117086 3129334 3211956
16900C211956J64651j92261m5303J61140j04182N5660Q804P573J17919Q0036J25657
$$ 3211956 3376607 3184346 3139043 3300183 3196001 3251661 3260465 3268038 3385957 3465993 3591650
16889C591650K42839m96860M97629k06166K53274j87582K25170J76313J94709
$$ 3591650 3834489 3337629 3835258 3629092 3882366 3694784 3919954 4096267 4290976
16880D290976k10046P9589j43151K79770k79121N71036m61841L4217K82789j37728
$$ 4290976 4080930 4160519 4017368 4297138 4018017 4589053 4127212 4161429 4444218 4306490
16870D306490K33536K75222o810J19108M7396j21211J95822R4261k17803K40968
$$ 4306490 4540026 4815248 4808438 4927546 4974942 4853731 5049553 5143814 4926011 5166979
16860E166979k43318K83553J94535Q4012k13228L94404J66676J27882l09595N25322
$$ 5166979 4923661 5207214 5401749 5485761 5272533 5666937 5833613 5961495 5651900 6177222
16850F177222m37485M35435k21474Q30226j83749j16693j00519K20234N28543
$$ 6177222 5739737 6175172 5953698 6783924 6600175 6483482 6382963 6603197 7131740
16841G131740k32191J92339n1337J96260J23429J190L52841J1898N90821l39899
$$ 7131740 6899549 7091888 7040551 7236811 7360240 7361430 7714271 7726169 8316990 7977091
16831G977091K99526k06994L13038j38794N40464L03255j42015J15715M94608
$$ 7977091 8276617 8069623 8382661 8243867 8784331 9087586 8945571 9061286 9555894
16822I555894K36087M6503N15579K14370k16931L29158K51476L06182K42856l4724
$$ 9555894 9791981 9838484 10354063 10568433 10351502 10680660 10932136 11238318 11481174 11446450
16812A1446450J90645J79681J05546K89472L29690N84319K78387L77330p4726
$$ 11446450 11637095 11816776 11922322 12211794 12541484 13125803 13404190 13781520 13706794
16803A3706794M45502M76232K07064M14261O89246K3168M44116M94151P7470N97111
$$ 13706794 14152296 14628528 14835592 15249853 15939099 15962267 16406383 16900534 16978004 17575115
16793A7575115O78678M61469J58913N43710N38255N21450L35064P55258M08853
$$ 17575115 18253793 18715262 18874175 19417885 19956140 20477590 20812654 21567912 21976765
16784B1976765L17433J052574Q72582O17159O70337N99801P50391P17066P68680
$$ 21976765 22294198 23346772 24219354 24836513 25506850 26106651 26857042 27574108 28342788
16775B8342788R59390Q78077Q45726Q01842R84503J323032J057449Q50932J170567
$$ 28342788 29302178 30180255 31025981 31827823 32812326 34135358 35192807 36043739 37214306
16766C7214306J387895J048736J337530J513120J299694J805960J174524J606923
$$ 37214306 38602201 39650937 40988467 42501587 43801281 45607241 46781765 48388688
16758D8388688J835975J535020J807833K259027J804522J949856K078349K063142
$$ 48388688 50224663 51759683 53567516 55826543 57631065 59580921 61659270 63722412
16750F3722412K271300K062071K429837K257105K651615K143051K894459K761696
$$ 63722412 65993712 68055783 70485620 72742725 75394340 77537391 80431850 83193546
16742H3193546K735245K812875K179195K533085K611924K791369K588971J959434
$$ 83193546 85928791 88741666 90920861 93453946 96065870 98857239 101446210 103405644
16734A03405644K635618K022702J828289K039714J921399J141845J323654O43225
$$ 103405644 106041262 108063964 109892253 111931967 113853366 114995211 116318865 116962090
16726A16962090R64599M25709K24145m76822j60010r19841j134934j006214j438368
$$ 116962090 117926689 118352398 118576543 118099721 117939711 117019870 115884936 114878722 113440354
16717A13440354j772274k022890j919356k387006k493260k210213k446861k650202
$$ 113440354 111668080 109645190 107725834 105338828 102845568 100635355 98188494 95538292
16709I5538292k732772k732875k735686k766248k510503k501504k907457k413152
$$ 95538292 92805520 90072645 87336959 84570711 82060208 79558704 76651247 74238095
16701G4238095k595549k214022k975137j807216k533152k233405k104185j794593
$$ 74238095 71642546 69428524 66453387 64646171 62113019 59879614 57775429 55980836
16693E5980836j834887k064284j722685j812835j132427k007869j436645j471202
$$ 55980836 54145949 52081665 50358980 48546145 47413718 45405849 43969204 42498002
16685D2498002j682504j390673j285730r92161j107664j366649j040079j305918
$$ 42498002 40815498 39424825 38139095 37146934 36039270 34672621 33632542 32326624
16677C2326624o28265r87587r41084p56597j358741q36437k56201j107155n73755
$$ 32326624 31698359 30710772 29769688 29013091 27654350 26817913 26561712 25454557 24880802
16668B4880802q64439m27749j037969n57167l22400p42864n71632q1012o75496
$$ 24880802 24016363 23588614 22550645 21993478 21671078 20928214 20356582 20275570 19600074
16659A9600074p08517r60550l91287K37526l91156q84713l04386j71832j87359
$$ 19600074 18891557 17931007 17539720 17777246 17386090 16501377 16196991 16025159 15837800
16650A5837800n88558n87033m68567j21345k89457l63886l35371m66412J08461
$$ 15837800 15249242 14662209 14193642 14072297 13782840 13418954 13083583 12617171 12725632
16641A2725632l32282n89728m13704L09882n47875J66806p92274L2890j05011
$$ 12725632 12393350 11803622 11389918 11699800 11151925 11318731 10526457 10559347 10454336
16632A0454336l49689k17650M2566n42729M700l81238J82198n28003j32237K01857
$$ 10454336 10104647 9886997 9929563 9386834 9391534 9010296 9192494 8664491 8532254 8734111
16622H734111m54692J54250k175j93436l62569l06434N6365n6132k12069k79318
$$ 8734111 8279419 8433669 8431494 8238058 7875489 7569055 7625420 7569288 7357219 7077901
16612G077901K4344k9726k46514j22658k00493L9982k62848Q4k52957M1081J29339
$$ 7077901 7102245 7072519 6826005 6703347 6502854 6542836 6279988 6280072 6027115 6068196 6197535
16601F197535k30740p18512N20950l52305r2621J54814j3180N7464m61174K2818
$$ 6197535 5966795 5248283 5769233 5416928 5324307 5479121 5465941 5523405 5062231 5085049
16591E085049o0073J6916J66653l89068J4924k50079K02498k01578j18937N8646
$$ 5085049 5024976 5041892 5208545 4819477 4834401 4584322 4786820 4585242 4466305 4524951
16581D524951J89292l52865J17229k10035j41930L971k20711k340j33829l6723
$$ 4524951 4714243 4361378 4478607 4268572 4126642 4130613 3909902 3907562 3773733 3737010
16571C737010K04611j49859m6718j91489J28666J78921L2883l16706q4985j09397
$$ 3737010 3941621 3791762 3745044 3553555 3682221 3861142 3894025 3577319 3492334 3382937
16561C382937j36964l1573o265Q7551Q3934k37113j15360J11846m13580L96541
$$ 3382937 3245973 3214400 3208135 3295686 3379620 3142507 3027147 3138993 2725413 3121954
16551C121954o8446R6059r3692m1318M0237k64620J10418m8698l0326k12130J21099
$$ 3121954 3053508 3149567 3055875 3014557 3054794 2790174 2900592 2851894 2821568 2609438 2730537
16540B730537J28495J84510l90222O2271k33719K4245j8073L4093O7081r201j41439
$$ 2730537 2859032 3043542 2653320 2715591 2481872 2506117 2488044 2522137 2589218 2580017 2438578
16529B438578J4669N509J19946k5956m52972J22799J81581N097j0705j19765J637
$$ 2438578 2453247 2458756 2578702 2552746 2099774 2222573 2404154 2409251 2398546 2278781 2280418
16518B280418M9568l95195K76335j91977J82063j88794P4757J58159l91857J34086
$$ 2280418 2329986 1934791 2211126 2019149 2201212 2012418 2087175 2245334 1853477 1987563
16508A987563K08360o4896p2792R4282j70169P8450Q0544M5865l64995R8557j69882
$$ 1987563 2195923 2131027 2058235 2152517 1982348 2060798 2141342 2187207 1822212 1920769 1750887
16497A750887J36478J20191n1546o40123O33270k06319J04374J05663n87189L19530
$$ 1750887 1887365 2007556 1956010 1315887 1949157 1742838 1847212 1952875 1365686 1685216
16487A685216j65073k7533M03584m19067K47770n6837r7622l2632m468j59835
$$ 1685216 1520143 1492610 1896194 1477127 1724897 1668060 1570438 1537806 1533338 1373503
16477A373503M94266n3848j03439k27900L2703J22521j95570O5618m20534M18707
$$ 1373503 1867769 1813921 1710482 1482582 1515285 1637806 1442236 1507854 1087320 1506027
16467A506027k26604m0221K15426j60404J4351o2265K1150J79952m53219N42351
$$ 1506027 1279423 1239202 1454628 1294224 1308575 1246310 1267460 1447412 994193 1536544
16457A536544k10503l8195l5060j12172J53548P8916l62257N3897J67672J96599
$$ 1536544 1326041 1287846 1252786 1140614 1294162 1373078 1010821 1064718 1232390 1428989
16447A428989l36691J73873j30988J17300k28585J11350K87981l74876J17181
$$ 1428989 1092298 1266171 1135183 1252483 1023898 1135248 1423229 1048353 1165534
16438A165534Q9913l91106K63925l67392L80287O9215K3938n43358O40345m14256
$$ 1165534 1255447 864341 1128266 760874 1141161 1210376 1234314 690956 1331301 917045
16428I17045R4831j60204j10877K60313J72513J06070k62282K82179l57733P9685
$$ 917045 1011876 851672 740795 1001108 1173621 1279691 1017409 1299588 941855 1021540
16418A021540J08529j85063J04842j79995J90900j72100o6300K04020L0740K7901
$$ 1021540 1130069 945006 1049848 869853 1060753 888653 822353 1026373 1057113 1085014
16408A085014k17877J86642k08178k4093N5160J6611M4273l15123K34721J59077
$$ 1085014 867137 1053779 845601 821508 876668 893279 937552 622429 857150 1016227
16398A016227Q9751k80072J40881R0712E10444N29917r7618k77396K21164j64009
$$ 1016227 1105978 825906 966787 1057499 510444 1040361 942743 665347 886511 722502
16388G22502K14796l59536N52515n03655J41400J74251o0058K86588m47813Q1567
$$ 722502 937298 577762 1130277 626622 768022 942273 882215 1168803 720990 802557
16378H02557L049n0524L94688j38063l31481M76J4513J20746J90886m47837K91542
$$ 802557 805606 755082 1149770 1011707 680226 680702 695215 815961 1006847 559010 850552
16367H50552p2953k21094J93444K01740k9823m28557J57415J02477j27627Q1720
$$ 850552 777599 556505 749949 951689 921866 493309 650724 753201 625574 707294
16357G07294k28393R9384P8213j67929L44562C73220K10402m8865K47377j04104
$$ 707294 478901 578285 656498 488569 833131 373220 583622 534757 782134 678030
16347F78030K71112k90062C05331O54100j62209k7943C50715M10915j04666K39191
$$ 678030 949142 659080 305331 959431 797222 769279 350715 761630 656964 896155
16337H96155q4323k8286r034K19429m16448O4659k2805K98400m08309o7066p0000
$$ 896155 811832 783546 774512 993941 577493 642152 619347 917747 509438 442372 372372
16326C72372L05649J83492l39855J56066B43758M12920j06336o3559P7113k44985
$$ 372372 678021 861513 521658 677724 243758 656678 550342 486783 563896 318911
16316C18911L44772r9604j9619K95742l15759j9923k30897K90386L53350m43074
$$ 318911 663683 564079 544460 840202 524443 504520 273623 564009 917359 474285
16306D74285j03670J94573K21033l03367J21279j71890p7984J85953k30655K03721
$$ 474285 370615 565188 786221 482854 604133 432243 354259 540212 309557 513278
16296E13278j0319k03007O8797o0277J58369A01180L37219K37978C25558L14903
$$ 513278 502959 299952 368749 308472 466841 101180 438399 676377 325558 640461
16286F40461j37575j75436K30846j00592j01209M35815B51007K22516N3368K40890
$$ 640461 502886 327450 558296 457704 356495 792310 251007 473523 526891 767781
16276G67781B32201O7048K64651j20405B05024O0559J26843L75660C22898K32728
$$ 767781 232201 299249 563900 443495 205024 265583 392426 768086 322898 555626
16266E55626B56518J17029L5695j58423K7803A36487K26856R1065B26395L6147
$$ 555626 256518 373547 409242 250819 278622 136487 363343 454408 226395 262542
16256B62542K12225j25185J46841k9146j80925P9428p9326J4442K07929r0352
$$ 262542 474767 349582 496423 467277 286352 365780 286454 300896 508825 418473
16246D18473K62587k26050H0364N69238j67083A47728b9299D08859a1532A04673
$$ 418473 681060 455010 80364 649602 482519 147728 -29299 408859 -11532 104673
16235F44327A58872L03036j2406O7334A34392K26429J55984B12960K76591j63923
$$ 644327 158872 461908 449502 516836 134392 360821 516805 212960 489551 325628
16225C25628J27293K59883j26867n6016j76143K02728j3412l9923j17745a06208
$$ 325628 452921 712804 585937 529921 353778 556506 543094 503171 385426 -106208
16214D19782A15776d282A8617L85613A68049a12188H1358j9730K38473J14312
$$ 419782 115776 -4282 18617 404230 168049 -112188 81358 61628 300101 414413
16204D14413f8574B23570J58236j53104m5719J93899A02258J01087G233J39193
$$ 414413 -68574 223570 381806 228702 182983 376882 102258 203345 7233 146426
16194A46426J12047M3218B4238M04245G024L87590P8389j06091j68383A4068M01105
$$ 146426 258473 301691 24238 428483 7024 394614 473003 366912 198529 14068 415173
16183D15173D9682a18342C4370J95939M7276J08191c6471F1269K0428N56521E0492
$$ 415173 49682 -118342 34370 230309 277585 385776 -36471 61269 81697 638218 50492
16171B30391F1057L56494l1520o6578j20520J32106r8074O322j6730K19061B14488
$$ 230391 61057 417551 386031 319453 198933 331039 232965 239287 222557 441618 214488
16159B28644J62376C2275K06471n3879D3125P6805l0137N900J89652A22580R2407
$$ 228644 391020 32275 238746 184867 43125 119930 89793 95693 285345 122580 214987
16148B14987M9469R867A00666K69357A12156R7446c8277A56726J53348c3209B69694
$$ 214987 264456 274323 100666 370023 112156 209602 -38277 156726 310074 -33209 269694
16136E2278K1370J52727A13096K81519j80498J98406A54740J5245F7878k0471
$$ 52278 73648 226375 113096 394615 214117 412523 154740 169985 67878 47407
16126D7407Q1365R0102r6684E0635J2031h4245h36G0612R5883J8999K02708j72676
$$ 47407 128772 218874 122190 50635 62666 -84245 -836 70612 166495 185494 388202 215526
16114B15526P1748J02321c04748F3072O9860J44135G1390J45572a2170d279I7924
$$ 215526 287274 389595 -304748 63072 132932 277067 71390 216962 -12170 -4279 97924
16102C23186A48132B5824J61490n9100J90267J09048a04514C63835m1969E144
$$ 323186 148132 25824 187314 128214 318481 427529 -104514 363835 321866 5144
16091a5122C75173H6666g9091C41163j69412J2753b2150p6172A0058L87462r6549
$$ -15122 375173 86666 -79091 341163 171751 184504 -22150 -98322 10058 397520 300971
16080C00971C3973C511f3524m3442A73458p7742J41630n4111o9376B8910i8938
$$ 300971 33973 3511 -63524 -106966 173458 95716 237346 183235 113859 28910 -98938
16068a86644A26661A4346J00665O3350i2393c819A18820N8102H7450A3102K3380
$$ -186644 126661 14346 115011 178361 -92393 -3819 118820 176922 87450 13102 36482
16057C6482g1658A24466C6919J77371c86512a28420d5501E2958R5607D8720L07421
$$ 36482 -71658 124466 36919 214290 -386512 -128420 -45501 52958 148565 48720 356141
16046C56141M8559a32129C83560A6185O784P4950e5632A25502K1918a4311K572
$$ 356141 404700 -132129 383560 16185 22969 97919 -55632 125502 147420 -14311 -11739
16035a1739A48069K1909A5776K82343J40263j82990m4713d7177A81692c2741j86775
$$ -11739 148069 169978 15776 298119 438382 255392 210679 -47177 181692 -32741 -219516
16024b19516B31245f5447a8676j62851a0254q250B03945c8252F5661j5495J63129
$$ -219516 231245 -65447 -18676 -181527 -10254 -18504 203945 -38252 65661 50166 213295
16013B13295L48643k73586d2325C4109F619J12899c6685m6784q1206c6531k43433
$$ 213295 561938 288352 -42325 34109 6619 119518 -36685 -83469 -164675 -36531 -279964
16002b79964F3413R7566N57181A43813F442J4378O7440M7359a2086J507G1815
$$ -279964 63413 160979 718160 143813 6442 20820 88260 135619 -12086 -10579 71815
15990I4234a6588C03117L643j15284K94289K20598M84807K40178n04886j24275
$$ 94234 -16588 303117 306760 191476 485765 706363 1191170 1431348 926462 802187
15980H02187l89770n4427F5656O6335A3191N0262b15660A3647J63852b2813H8703
$$ 802187 412417 357990 65656 131991 13191 63453 -215660 13647 177499 -22813 88703
15968I3454b31065A55144a53230b2276D54827A49991c0192A85894c3377F6961
$$ 93454 -231065 155144 -153230 -22276 454827 149991 -30192 185894 -33377 66961
15957a0340B19908a62841E00085E8558J51899a28726I695a92664j3926D9756i2547
$$ -10340 219908 -162841 500085 58558 210457 -128726 9695 -192664 -206590 49756 -92547
15945a31549A72110C9193a93329A43635a9832D6930a22263j6019N2926B7155b6868
$$ -131549 172110 39193 -193329 143635 -19832 46930 -122263 -138282 -85356 27155 -26868
15933A03752b5201A74962c6809j83720A51676P1297j04492a01119j87017g1638
$$ 103752 -25201 174962 -36809 -220529 151676 222973 118481 -101119 -288136 -71638
15922B08681f8041B42494K9916a11692l731B63008C3997a52249G9192b56770K5192
$$ 208681 -68041 242494 272410 -111692 -115423 263008 33997 -152249 79192 -256770 -231578
15911b31578j82588e9992l15444a59677j71189I7639b2816H251d4059A50224e4874
$$ -231578 -414166 -59992 -375436 -159677 -330866 97639 -22816 8251 -44059 150224 -54874
15899D275K54975j14716E8125b47184b7325k04064c1898G0388R2542g1616A91281
$$ 4275 259250 144534 58125 -247184 -27325 -231389 -31898 70388 162930 -71616 191281
15887c20077g2002B75050J61879j10265a87702D6985M9556J36416a58832A58716
$$ -320077 -72002 275050 436929 326664 -187702 46985 96541 232957 -158832 158716
15876D2515h0513j87001a18198C9255J46071n6772J2486h3862C77482c9385B68787
$$ 42515 -80513 -267514 -118198 39255 185326 128554 141040 -83862 377482 -39385 268787
15864b11722N38A09036a11212A94856j7309O9105n4233J08754l0131h0444O290
$$ -211722 -211184 109036 -111212 194856 177547 246652 192419 301173 271042 -80444 -74154
15853g4154b3826H787J37944b04767j01219a31765B61994c4901j56642h2272D5468
$$ -74154 -23826 8787 146731 -204767 -305986 -131765 261994 -34901 -191543 -82272 45468
15841A26733K92521a99582D63267j75133d89546A46782m7841c1466A71196J70609
$$ 126733 419254 -199582 463267 288134 -489546 146782 98941 -31466 171196 341805
15831C41805b05113A73339c5907j24792A25287J04173q241a37415m1931Q2130
$$ 341805 -205113 173339 -35907 -160699 125287 229460 221219 -137415 -179346 -97216
15821i7216l47586f3006D78653e0387A21921C9589a11681c6865l0771m3392q141
$$ -97216 -444802 -63006 478653 -50387 121921 39589 -111681 -36865 -67636 -111028 -119169
15810a19169A1225h7730k59531R6182c6075g073B14008a59549q5405e0503A28583
$$ -119169 11225 -87730 -347261 -251079 -36075 -7073 214008 -159549 -244954 -50503 128583
15798a50493n0044E6030L8339i3204m3590a6556k06805C20i0192B80888A00829
$$ -150493 -200537 56030 94369 -93204 -136794 -16556 -223361 320 -90192 280888 100829
15786a0093G3514b9848B29394a86995D3225L5723E144h1208C9838a74585K9994
$$ -10093 73514 -29848 229394 -186995 43225 78948 5144 -81208 39838 -174585 -144591
15775a44591A02141J22958C7831a84403A32271a14028b2651l8906C65146a19238
$$ -144591 102141 225099 37831 -184403 132271 -114028 -22651 -61557 365146 -119238
15764A42283a36291c9609k9640q8547e3567A43169G0820a51283i738H7688B5189
$$ 142283 -136291 -39609 -69249 -157796 -53567 143169 70820 -151283 -9738 87688 25189
15752B05952B013J1029Q1410m6556g6636n2620A13799C7460J8457J03002O4857
$$ 205952 2013 13042 94452 47896 -76636 -129256 113799 37460 55917 158919 223776
15741B23776D4614L14890A43369i961A28918K37095B7330K13072B8193J35727
$$ 223776 44614 359504 143369 -9961 128918 366013 27330 240402 28193 163920
15731A63920C6214e1173k6076A36330d0205q3424B05758E7615a38432e0086k05642
$$ 163920 36214 -51173 -77249 136330 -40205 -123629 205758 57615 -138432 -50086 -255728
15720b55728A65396N551a73082O6032L5420k40499A50890m0072f4234j67582a7232
$$ -255728 165396 170947 -173082 -107050 -71630 -312129 150890 110818 -64234 -231816 -17232
15708d17827f8931D8461a03330C538a67431A93585B9797c0669E8145i1527A74090
$$ -417827 -68931 48461 -103330 3538 -167431 193585 29797 -30669 58145 -91527 174090
15696a17666n9100B50428H6006a80105D1500J67244a2390j365j72142B56037O3693
$$ -117666 -176766 250428 86006 -180105 41500 208744 -12390 -13755 -185897 256037 319730
15685C19730a22975C05098f5164j87523g6368j64007C57558g9181G9223B8975
$$ 319730 -122975 305098 -65164 -252687 -76368 -240375 357558 -79181 79223 28975
15674D7218a37268L8536A84404J82969b2587j95839C91680A712K00107b54957
$$ 47218 -137268 -98732 184404 367373 -22587 -218426 391680 1712 201819 -254957
15663d6387j55107j52000B35264D5786d411j36184L0775F6351G067J50123o5647
$$ -46387 -201494 -353494 235264 45786 -4411 -140595 -109820 66351 7067 157190 91543
15652I1543i1667l4073L9977A31572o1189N3036f3551B54439B7227b83132f3287
$$ 91543 -91667 -125740 -85763 131572 70383 123419 -63551 254439 27227 -283132 -63287
15640A75171d5948J0683H3526a39965a4955B7549K1363h1784L2704H1427i6019
$$ 175171 -45948 -35265 83526 -139965 -14955 27549 48912 -81784 -49080 81427 -96019
15628b32828A78531i9603K6508G6166b07287i5696n426l2671l2707m8834a2890
$$ -232828 178531 -99603 -73095 76166 -207287 -95696 -101122 -133793 -166500 -215334 -12890
15616a92840i2322b3363l483p537j53986m085A40483E3196A6084J27308b09737
$$ -192840 -92322 -23363 -26846 -34383 -188369 -192454 140483 53196 16084 143392 -209737
15604A52528a14207G1495o329a29740A66640a6785j83821M2921K9483c9797A650
$$ 152528 -114207 71495 65166 -129740 166640 -16785 -200606 -157685 -128202 -39797 1650
15592C01121j25604c88452B69716a46908B29610e0746F155b0494C09774b91074
$$ 301121 175517 -388452 269716 -146908 229610 -50746 6155 -20494 309774 -291074
15581A54522A1366b55557d4383B341O1084b8246q4865F1954K1565A2631c31778
$$ 154522 11366 -255557 -44383 2341 63425 -28246 -113111 61954 83519 12631 -331778
15569d341C94717d7950o7330p7055B9783b04051O3708b8745m7771C10231E4198
$$ -4341 394717 -47950 -115280 -192335 29783 -204051 -140343 -28745 -76516 310231 54198
15557a78212l7720k58090a44857A7249g3266G1072d29381A1247K9889J86070b69466
$$ -178212 -215932 -474022 -144857 17249 -73266 71072 -429381 11247 41136 227206 -269466
15545B26080K14288c7449G6804f8764A27877A3040a09132q4242B14931a51492
$$ 226080 440368 -37449 76804 -68764 127877 13040 -109132 -193374 214931 -151492
15534c4878A79905l5483D7898a55023J3180A22988f0839D09122I0471b24561C4439
$$ -34878 179905 144422 47898 -155023 -141843 122988 -60839 409122 90471 -224561 34439
15522b3140G177d9959A12865g0150F684c5878B94970K9202I8946M66328g6828
$$ -23140 7177 -49959 112865 -70150 6684 -35878 294970 324172 98946 565274 -76828
15510C77355b8661A69973m1335l2678O1406L8577N530G5495a07395D96385B30166
$$ 377355 -28661 169973 128638 95960 157366 195943 201473 75495 -107395 496385 230166
15498B14476I0605O3108J55873j11298d7951B5488K40386A09042a05474a6634
$$ 214476 90605 153713 309586 198288 -47951 25488 265874 109042 -105474 -16634
15487F7591K1017k3249B5275J93963d06413J57479E7071e476B79746b49977R1525
$$ 67591 88608 65359 25275 219238 -406413 -248934 57071 -5476 279746 -249977 -158452
15476a58452A02434L95083O4219K17694j31391j30663B51258q7011q39i4236E952
$$ -158452 102434 497517 561736 779430 648039 517376 251258 164247 163408 -94236 5952
15464H2093f5695F6351J0980b38969F9751K33373b33655B30406A02491h4031c3073
$$ 82093 -65695 66351 77331 -238969 69751 303124 -233655 230406 102491 -84031 -33073
15452B42462g6003A18438L29734a25568A78703j6306N3255a10008D69293j79529
$$ 242462 -76003 118438 448172 -125568 178703 162397 215652 -110008 469293 289764
15442B89764M23990K70719J07796J49409o02848k15230d1762C25774O3284a39129
$$ 289764 713754 984473 1092269 1241678 638830 423600 -41762 325774 389058 -139129
15431b51040A74080a50808H6157d6044A90697b33180C40440b46263C0215a05635
$$ -251040 174080 -150808 86157 -46044 190697 -233180 340440 -246263 30215 -105635
15420E1142f1399k71751J41789J097i3801c489A75630p2463a28147A40237n064
$$ 51142 -61399 -333150 -191361 -190264 -93801 -3489 175630 103167 -128147 140237 135173
15409A35173d7140B50545b60613i286B7088a2239j88075g9670j43563A39267d7160
$$ 135173 -47140 250545 -260613 -9286 27088 -12239 -200314 -79670 -223233 139267 -47160
15397I7221l5457b35132J09320k9821A46620a14594I5613a99822f7125j96928
$$ 97221 61764 -235132 -125812 -155633 146620 -114594 95613 -199822 -67125 -264053
15387b64053B88290j28840K44125G7635J42998c7665n0442H2257L2566P2652b14178
$$ -264053 288290 159450 403575 77635 220633 -37665 -88107 82257 114823 187475 -214178
15375c7084l2927B37335J23507j59507J13050j34323J75249A67979m9915J48003
$$ -37084 -70011 237335 360842 201335 314385 180062 355311 167979 118064 266067
15365B66067b96743C27486A03654L53323A71407e0794A76933J03621J725D0502
$$ 266067 -296743 327486 103654 456977 171407 -50794 176933 280554 282279 40502
15354A92169Q9933F4274a03650B5258a70187K1735e6690m481A38270K01411o452
$$ 192169 282102 64274 -103650 25258 -170187 -148452 -56690 -61171 138270 339681 333229
15343C33229j07442k3242M60950j72812j67466j56117P0948A17756B3890R3903
$$ 333229 225787 202545 663495 490683 323217 167100 238048 117756 23890 117793
15333A17793a84192B7367K08517M0118j21841J56280F4245a13339B34313d0034
$$ 117793 -184192 27367 235884 276002 154161 310441 64245 -113339 234313 -40034
15322A73458K04026j51532B1066a24529B72008l9461a91932b9252D28342o7906
$$ 173458 377484 225952 21066 -124529 272008 232547 -191932 -29252 428342 360436
15312C60436j79193K1050l5806m8940J8877m816B4771d4420B39339C0798L50622
$$ 360436 181243 202293 166487 117547 136424 131608 24771 -44420 239339 30798 381420
15301C81420j14428C1598g002C9422K12312j01668P9256r7489m3472J11588K1966
$$ 381420 266992 31598 -7002 39422 251734 150066 229322 131833 88361 199949 221915
15290B21915l7621a65755A37829J02184a08934A45582N0135J12503a14790N0032
$$ 221915 184294 -165755 137829 240013 -108934 145582 195717 308220 -114790 -64758
15280f4758A4872O8498A5936a30569A96300n7859J38158k2558i9114C64114g5918
$$ -64758 14872 83370 15936 -130569 196300 138441 276599 254041 -99114 364114 -75918
15268A5695F402b8570o5646k92295B00066F8982h9246I2079K80151b18910I3966
$$ 15695 6402 -28570 -94216 -386511 200066 68982 -89246 92079 372230 -218910 93966
15256b8998C55028N2911j74886r2741L68845B42526b52269A363K8283f4627B4934
$$ -28998 355028 407939 233053 140312 509157 242526 -252269 1363 29646 -64627 24934
15244C33122K33853j57558K49142J254233k98463J2482L19509p41519n03052B58979
$$ 333122 566975 409417 658559 1912792 1614329 1626811 1946320 1204801 701749 258979
15233e2358A57884k7581P9179q3583J61120b6792B49112e5897m7219B57780n416
$$ -52358 157884 130303 209482 125899 287019 -26792 249112 -55897 -103116 257780 252364
15222B52364c5534k7952B45056A12396m4463O4537Q3913n8196C753N1266J02136
$$ 252364 -35534 -63486 245056 112396 67933 132470 216383 158187 3753 55019 157155
15211A57155g1027A24154c9514A71787b01967C22728A5408a51732g0439A17016
$$ 157155 -71027 124154 -39514 171787 -201967 322728 15408 -151732 -70439 117016
15200A69885i6271B37865b04325B08184e6085B64937N9336H5160j5417b03649
$$ 169885 -96271 237865 -204325 208184 -56085 264937 324273 85160 69743 -203649
15189A21678J27807f8857B34974M76171B09528D5808a05623D90062A15342j2720
$$ 121678 249485 -68857 234974 711145 209528 45808 -105623 490062 115342 102622
15179A02622K44171i2653G4397g689D96100a22772B00992F7281b52251A54250
$$ 102622 346793 -92653 74397 -7689 496100 -122772 200992 67281 -252251 154250
15168F3590J20239N5491L0347I9071e3999D44575B01379M2074p4019D6557a18278
$$ 63590 183829 239320 269667 99071 -53999 444575 201379 243453 169434 46557 -118278
15156A89266J46662A19332j5902d4423A48997l4558J80264j18633J30682j15635
$$ 189266 335928 119332 103430 -44423 148997 114439 294703 176070 306752 191117
15146A91117F9534e5357B49433a17839L144B26489q9890D6662R1807l8155a13244
$$ 191117 69534 -55357 249433 -117839 -114695 226489 136599 46662 138469 100314 -113244
15134A65129G4505A7844P8921j8943a26020B83506A34533j8022R5452J88303r3525
$$ 165129 74505 17844 96765 77822 -126020 283506 134533 116511 211963 400266 306741
15123C06741n4902j01703c6156B49558k8464M00122m2427k02085a93451A52713
$$ 306741 251839 150136 -36156 249558 221094 621216 578789 376704 -193451 152713
15112B7957J80526j2982k8626G0742K70645r8512h3673j7641L8426C43509l678
$$ 27957 208483 195501 166875 70742 341387 242875 -83673 -101314 -62888 343509 339831
15101C39831G8095L20752A4439N5762b44727B12437A1300Q1156j9495J88170j20291
$$ 339831 78095 398847 14439 70201 -244727 212437 11300 92456 72961 261131 140840
15090A40840F6592Q5024J97034H6370D0613N0035a41776e7042b5428j29281c6583
$$ 140840 66592 151616 348650 86370 40613 90648 -141776 -57042 -25428 -154709 -36583
15078e7492A95854J88175A80410B222M56971I7338P00J89289k0732p2532o6512
$$ -57492 195854 384029 180410 2222 459193 97338 98038 287327 266595 194063 127551
15067A27551M4244P7705q1320h0095N968D33149A27608m9509M40119A41834J87748
$$ 127551 171795 249500 168180 -80095 -74127 433149 127608 78099 518218 141834 329582
15056C29582O06J11077k16534j3199Q3666N417K20886J62745B81757Q9586A19069
$$ 329582 330188 441265 224731 211532 295198 300615 521501 684246 281757 371343 119069
15044C16981A49393l6712q431L98832J7904j70235k2249J32544p736E5679K92798
$$ 316981 149393 112681 104250 503082 520986 350751 328502 461046 453310 55679 348477
15033C48477F0631M14922J54624K03281k09542L94749j39612J19782l24515j5225
$$ 348477 60631 475553 630177 833458 623916 1018665 879053 998835 674320 659095
15023F59095j9583m8637B46246K20413K24155C24810L43266o3057k05526H1815
$$ 659095 639512 590875 246246 466659 690814 324810 668076 605019 399493 81815
15012G32500B71040M00068n3623j26305j67817K92893k38949J34478A42638K98186
$$ 732500 271040 671108 617485 491180 323363 616256 377307 511785 142638 440824
15002D40824j62646L60805k41588L97718k22747k5883R3290E899L90151N9659
$$ 440824 278178 638983 397395 795113 572366 546483 639773 5899 396050 455709
14992D55709C4364M85827A98597K47658J2569L0040l2343Q423K8215J82926q8648
$$ 455709 34364 520191 198597 446255 458824 488864 456521 464944 493159 676085 587437
14981E87437L40510l118j71179k27293J96016k24620P693j98514L34234j49792
$$ 587437 927947 924829 753650 526357 722373 497753 505446 306932 641166 491374
14971D91374L20241k6441J23581F2410N2427L50000n3298A26906a0425B68037
$$ 491374 811615 785174 908755 62410 114837 464837 411539 126906 -10425 268037
14960C73599L8092K7709J9502j13917k8781L636A57991K47076l5591A67064F422
$$ 373599 411691 439400 458902 344985 316204 319840 157991 405067 369476 167064 6422
14948A61854L49931J12228L7808o7097J1996K75476l175k95077j21168Q70p7003
$$ 161854 511785 624013 661821 594724 606720 882196 879021 583944 462776 463646 386643
14937C86643R0407K88721k36063j47773J54673j91975M86657J6929J83840K54224
$$ 386643 477050 765771 529708 381935 536608 344633 831290 848219 1032059 1286283
14927A286283J51120J45743J74500k53518K07225O5401l27294K18318l2378J57076
$$ 1286283 1437403 1583146 1757646 1504128 1711353 1776754 1449460 1667778 1635400 1792476
14917A792476M94921L98859k59020n21110j56311k36797m73647j62781j09649
$$ 1792476 2287397 2686256 2427236 1906126 1749815 1513018 1039371 876590 766941
14908G66941k33849J24462k27811m5056J72120J64200j48727l5795Q1832p2987
$$ 766941 533092 657554 429743 384687 556807 721007 572280 536485 618317 545330
14898E45330B59183K35402J30116k84880C0073O37799j41680k04421L50163q722
$$ 545330 259183 494585 624701 339821 30073 667872 526192 321771 671934 663212
14888F63212K8165O7238J66157l9897j85674K18998r3605j46544K93329K79833
$$ 663212 691377 758615 924772 884875 699201 918199 824594 678050 971379 1251212
14878A251212k16420k09988k44272J33227j32536J53963Q53j1880j90717j71597
$$ 1251212 1034792 824804 580532 713759 581223 735186 736039 724159 533442 361845
14868C61845K26476J97862J04115k9022l3317N8691l56348m2471j51414R8795
$$ 361845 588321 786183 890298 861276 827959 886650 530302 487831 336417 435212
14858D35212r4991J3261J51134J08717O8998j58739A07772M61324p0858K44769
$$ 435212 340221 353482 504616 613333 682331 523592 107772 569096 498238 743007
14848G43007k7683k65769K38525o7064L82632J92682j09472K22125j07353j90579
$$ 743007 715324 449555 688080 621016 1003648 1196330 1086858 1308983 1201630 1011051
14838A011051J01292j73914k64476L22869l0344M1279l1802m24299K60503l70184
$$ 1011051 1112343 938429 673953 996822 966478 1007757 975955 551656 812159 441975
14828D41975M56216j50642l60236J8891P488K67494m0559K17072j04585o5838
$$ 441975 898191 747549 387313 406204 413692 681186 640627 857699 753114 687276
14818F87276l25319L31226n7540N74110m52085l46881K87756K34866k96924L99310
$$ 687276 361957 693183 635643 1209753 757668 410787 698543 933409 636485 1035795
14808A035795n0118k14004j24157M09900k0615m22765N28423l43472K5608C26101
$$ 1035795 985677 771673 647516 1057416 1036801 614036 1142459 798987 824595 326101
14797I17383m49334R9795K03509j09585k74820J25958j49367L45261k48196L49069
$$ 917383 468049 567844 771353 661768 386948 512906 363539 708800 460604 809673
14787H09673I3770M31085M24285j78013j96173O1562J47281Q7301j76978Q2665
$$ 809673 93770 524855 949140 771127 574954 636516 783797 871098 694120 776785
14777G76785m4747J06445N46279n89207K92941l40672K9806j72841P8016p048
$$ 776785 732038 838483 1384762 795555 1088496 747824 777630 604789 682805 675757
14767F75757B23272M68414K77739j80126k94786J9899K58717j9646K02726l26280
$$ 675757 223272 691686 969425 789299 494513 514412 773129 753483 956209 629929
14757F29929P0296q2398J66597l4605K8610l28122K99685j35401K26647P1273
$$ 629929 700225 617827 784424 749819 778429 450307 749992 614591 841238 912511
14747I12511m44704K56917j6053R2930J19955k0062m8542j00288j28012Q5697
$$ 912511 467807 724724 708671 801601 921556 901494 852952 752664 624652 710349
14737G10349R7108K41806D87490O70286o8744Q9939j84744N35381j20379K70528
$$ 710349 807457 1049263 487490 1157776 1089032 1178971 994227 1529608 1409229 1679757
14727A679757K23783K1318k45585o0182k28007k85000N91m50704M979K66779p2937
$$ 1679757 1903540 1924858 1679273 1619091 1391084 1106084 1106675 655971 660950 927729 854792
14716H54792r3147n0625J30335k89651L72211j38653J14917J39878R4418j57262
$$ 854792 761645 711020 841355 551704 923915 785262 900179 1040057 1134475 977213
14706I77213o0216K18521O7119J96622J55777K29908r6212N61473m90984l50304
$$ 977213 916997 1135518 1202637 1399259 1555036 1784944 1688732 2250205 1759221 1408917
14696A408917l27379J51233L1144j80571j00005j867p8403J5735k52422J94350
$$ 1408917 1081538 1232771 1263915 1083344 983339 981472 903069 918804 666382 860732
14686H60732L298p3466K17598P4490k04286K22306j39306J87908k70348K35599
$$ 860732 864030 790564 1008162 1082652 878366 1100672 961366 1149274 878926 1114525
14676A114525K29715m20189k54567P69563m94015L71622Q211j35544k07009j20308
$$ 1114525 1344240 924051 669484 1439047 945032 1316654 1324865 1189321 982312 862004
14666H62004J77886J30654J9043k17734M017j77145N81401l22489m7468J22324
$$ 862004 1039890 1170544 1189587 971853 975870 798725 1380126 1057637 1010169 1132493
14656A132493q9727K89010M3766k4804L8722K26289L100j13974k88469K10667
$$ 1132493 1042766 1331776 1375542 1350738 1389460 1615749 1618849 1504875 1216406 1427073
14646A427073k17843K34405l43760J79471l18748N11307J45358k15921k74205
$$ 1427073 1209230 1443635 1099875 1279346 960598 1471905 1617263 1401342 1127137
14637A127137K42705j30758q9224L80124m17279L54151K01973N2032m74623O3495
$$ 1127137 1369842 1239084 1149860 1529984 1112705 1466856 1668829 1720861 1246238 1309733
14627A309733J17713j81109J56247m1936j25724M48571k40338N964J4496J24377
$$ 1309733 1427446 1246337 1402584 1360648 1234924 1683495 1443157 1449121 1463617 1587994
14617A587994l5064K48012l22652p7484K2517Q8826J30491r3290J88767Q3457
$$ 1587994 1552930 1800942 1478290 1400806 1423323 1512149 1642640 1549350 1738117 1821574
14607A821574j85663o5999r8493j27404K27773J37504K50434k00732j06599j14812
$$ 1821574 1635911 1569912 1471419 1344015 1571788 1709292 1959726 1758994 1652395 1537583
14597A537583P337J65397j63622J8357L0129L20405l35191O30996p21035N38960
$$ 1537583 1544920 1710317 1546695 1565052 1595181 1915586 1580395 2211391 1490356 2029316
14587B029316Q7875l52856M67008n24930K75283p4224p9507j17125K25336K70648
$$ 2029316 2117191 1764335 2231343 1706413 1981696 1907472 1827965 1710840 1936176 2206824
14577B206824l1521p4592j53816r3318K6210O45627m58479O28344p30565M05207
$$ 2206824 2175303 2100711 1946895 1853577 1879787 2525414 2066935 2695279 1964714 2369921
14567B369921J60892m05947O46165k86044K7549N9318L33358j2020j03397l8900
$$ 2369921 2530813 2124866 2771031 2484987 2512536 2571854 2905212 2893192 2789795 2750895
14557B750895K26922K24661K02269M9839J33040L82411P49392P24994J665851
$$ 2750895 2977817 3202478 3404747 3454586 3587626 3970037 4719429 5444423 7110274
14548G110274L815236R982542K0335520K676597B0832345I010484l997894j537609
$$ 7110274 10925510 20908052 41243572 43920169 20832345 9010484 5012590 3474981
14540C474981p24963j71588L74515J792616P06958k096203r11543k87531o1739
$$ 3474981 2750018 2578430 2952945 4745561 5452519 3356316 2444773 2157242 2095503
14531B095503R7906m01246O62914k73792K49634J11782P5087j79003j9824P2552
$$ 2095503 2193409 1792163 2455077 2181285 2430919 2542701 2617788 2438785 2418961 2491513
14521B491513L2663J30463j2339N7214k393n1083l396j16152J92122M06779k54683
$$ 2491513 2524176 2654639 2642300 2699514 2697121 2646038 2642642 2526490 2718612 3125391 2870708
14510B870708K8838j34794K29798J4301n9394J98552k28228Q6618L24171k09952
$$ 2870708 2899546 2764752 2994550 3008851 2949457 3148009 2919781 3006399 3330570 3120618
14500C120618L342j76928M93430p5408m5270J8477K43291k5140J64268j30438
$$ 3120618 3123960 2947032 3440462 3365054 3319784 3338261 3581552 3556412 3720680 3590242
14490C590242K31607r3900R806k8856R0988J64910j87571L76974n80441N92390
$$ 3590242 3821849 3727949 3737755 3708899 3799887 3964797 3777226 4154200 3573759 4166149
14480D166149J13765J1417j60884Q9073n1102J50273J65175k43173J94529L71773
$$ 4166149 4279914 4291331 4130447 4219520 4168418 4318691 4483866 4240693 4435222 4806995
14470D806995j99216K25118r9870J33305n9734Q3780k87734M48256n67388N19187
$$ 4806995 4607779 4832897 4733027 4866332 4806598 4890378 4602644 5050900 4483512 5002699
14460E002699k97912P24016l25714k00548J19102L90005K63814j51622J49738
$$ 5002699 4704787 5428803 5103089 4902541 5021643 5411648 5675462 5523840 5673578
14451E673578j60703K36513r1066M24952O2703m41094J26469L22030j41465K67452
$$ 5673578 5512875 5749388 5658322 6083274 6145977 5704883 5831352 6153382 6011917 6279369
14441F279369j30361J64276Q7248K8723J09119m4416L87644j45628N41843k08124
$$ 6279369 6149008 6313284 6400532 6429255 6538374 6493958 6881602 6735974 7277817 7069693
14431G069693J60897l4424K30840L4215K54376j37819K44710J68315J39972L10530
$$ 7069693 7230590 7196166 7427006 7461221 7715597 7577778 7822488 7990803 8130775 8441305
14421H441305J09425J05733M71799j08538K11770O5280j12347J39450l96485L14202
$$ 8441305 8550730 8656463 9128262 9019724 9231494 9296774 9184427 9323877 8927392 9241594
14411I241594K80777L39828L07937l60137O60372k92650N54484L26967l2350N4667
$$ 9241594 9522371 9862199 10170136 9809999 10470371 10177721 10732205 11059172 11026822 11081489
14401A1081489l35726J18487M02310j04804R31996l32551P6847M00089J20620
$$ 11081489 10745763 10864250 11266560 11161756 12093752 11761201 11838048 12238137 12358757
14392A2358757M74987j47706L36745L37497O3178N68345n737L11474K30677O28221
$$ 12358757 12833744 12686038 13022783 13360280 13423458 13991803 13986066 14297540 14528217 15156438
14382A5156438R8843N63083j14044M03293J53947M66058M58685n3050L02028K39821
$$ 15156438 15255281 15818364 15704320 16107613 16261560 16727618 17186303 17133253 17435281 17675102
14372A7675102N40454M62791k6707M56213L80001P63281M19291P08333K67241
$$ 17675102 18215556 18678347 18651640 19107853 19487854 20251135 20670426 21378759 21646000
14363B1646000J84212M30516J72798N21469M97138P20340J53595P19408L53631
$$ 21646000 21830212 22260728 22433526 22954995 23452133 24172473 24326068 25045476 25399107
14354B5399107Q91628O75490M43415O76919O84497Q18614J033044O81058Q34198
$$ 25399107 26290735 26966225 27409640 28086559 28771056 29589670 30622714 31303772 32137970
14345C2137970K87468J287718P60616P57820Q74926R41108J640103M19500J402644
$$ 32137970 32425438 33713156 34473772 35231592 36106518 37047626 38687729 39107229 40509873
14336D0509873J250897J232082J248635J010237J731807J344172J516180J059390
$$ 40509873 41760770 42992852 44241487 45251724 46983531 48327703 49843883 50903273
14328E0903273K131368J480290J634841K289355J788847J796818K452558K186301
$$ 50903273 53034641 54514931 56149772 58439127 60227974 62024792 64477350 66663651
14320F6663651K552395K092972K961618K404804K726180K809218L345616L106268
$$ 66663651 69216046 71309018 74270636 76675440 79401620 82210838 85556454 88662722
14312H8662722L569101L590639L951580M066963M458623M102353N065470N029956
$$ 88662722 92231823 95822462 99774042 103841005 108299628 112401981 117467451 122497407
14304A22497407N357240N862267N880782O278362O853279P216561P527509Q075349
$$ 122497407 127854647 133716914 139597696 145876058 152729337 159945898 167473407 175548756
14296A75548756Q222233Q599849R585298R752980J0475090J0925859J1522453
$$ 175548756 183770989 192370838 201956136 211709116 222184206 233110065 244632518
14289B44632518J1972546J2601434J2738540J3838976J3913653J4258985J4275913
$$ 244632518 256605064 269206498 281945038 295784014 309697667 323956652 338232565
14282C38232565J4603477J4709342J4640720J4104593J3995039J2865633J2281861
$$ 338232565 352836042 367545384 382186104 396290697 410285736 423151369 435433230
14275D35433230J0646440R089039O929396K973746q45670k372162k710778k682060
$$ 435433230 446079670 455168709 462098105 465071851 464226181 461854019 459143241 456461181
14267D56461181l462791o447577q595184r839766j1103512j3018168j3850744
$$ 456461181 452998390 446550813 437955629 428115863 417012351 403994183 390143439
14260C90143439j4762397j5474862j5322532j5454508j5393826j4922619j4559020
$$ 390143439 375381042 359906180 344583648 329129140 313735314 298812695 284253675
14253B84253675j3729777j3544102j2402680j2540829j1701905j0738480q995855
$$ 284253675 270523898 256979796 244577116 232036287 220334382 209595902 200600047
14246B00600047r316275r417706q440262q466030p731373p223946o903159o296153
$$ 200600047 191283772 181866066 173425804 164959774 157228401 150004455 143101296 136805143
14238A36805143n682040n612551n326365n714082m477253m618497m337162l355269
$$ 136805143 131123103 125510552 120184187 114470105 109992852 105374355 101037193 97681924
14230I7681924l867454l811372l710351l328185k991672k919047l032378k567214
$$ 97681924 93814470 90003098 86292747 82964562 79972890 77053843 74021465 71454251
14222G1454251k806594j724056k422765k318759k041670k087928j914251j679993
$$ 71454251 68647657 66923601 64500836 62182077 60140407 58052479 56138228 54458235
14214E4458235j363761j455866j997691j477392j299419j801235q86567m15136
$$ 54458235 53094474 51638608 49640917 48163525 46864106 45062871 44176304 43761168
14206D3761168j704521j180753j608383p90114j250461n19590r14897j146849
$$ 43761168 42056647 40875894 39267511 38477397 37226936 36707346 35792449 34645600
14198C4645600q17716j156809p16116p78006n48724p21271j197957m41157o83876
$$ 34645600 33827884 32671075 31954959 31176953 30628229 29906958 28709001 28267844 27583968
14189B7583968o98653p34007m94566n85475p24757k62829n41568o23020o24798
$$ 27583968 26885315 26151308 25656742 25071267 24346510 24083681 23542113 22919093 22294295
14180B2294295k98618m46540o22414n22526j39302l30604q06154j00193l77745
$$ 22294295 21995677 21549137 20926723 20404197 20264895 19934291 19128137 19027944 18650199
14171A8650199j80234n30913k61392l54510j58658m82631m52819k24332k90230
$$ 18650199 18469965 17939052 17677660 17323150 17164492 16681861 16229042 16004710 15714480
14162A5714480j61851k37344j54528k60797m94057j42888l63082l91799j96223
$$ 15714480 15552629 15315285 15160757 14899960 14405903 14263015 13899933 13508134 13311911
14153A3311911j49443P499j29096n1147m17183m07189k20777K24478o60694k95446
$$ 13311911 13162468 13169967 13040871 12989724 12572541 12165352 11944575 12169053 11508359 11212913
14143A1212913k9758J84493j73352j70557m34340J87360n10280J1091j05036j19590
$$ 11212913 11183155 11367648 11194296 11023739 10589399 10776759 10266479 10277570 10172534 10052944
14133A0052944n68709J0928j55419p4173j07088n50489L51903k09283L5227j73711
$$ 10052944 9484235 9495163 9339744 9265571 9158483 8607994 8959897 8750614 8785841 8612130
14123H612130L6727l201l83899o04714L92435k17460K9310j98868J79527l98944
$$ 8612130 8648857 8645656 8261757 7657043 8049478 7832018 7861328 7662460 7841987 7443043
14113G443043j30657K9100m37896J65220m5284j50870J8526j67164k5309l26547
$$ 7443043 7312386 7341486 6903590 7068810 7023526 6872656 6891182 6724018 6698709 6372162
14103F372162N05857j91588l07773m7953n48040K42174J97485k07921r0730l93823
$$ 6372162 6878019 6686431 6378658 6330705 5782665 6024839 6222324 6014403 5923673 5529850
14093E529850j05716O61314m57022J31910R7435k88244j16766N0779j93010N9889
$$ 5529850 5424134 6085448 5628426 5760336 5857771 5569527 5452761 5503540 5310530 5370419
14083E370419j8750l8936J91198q0038m69996P9711l22105M1122M23831l48936
$$ 5370419 5351669 5312733 5503931 5423893 4953897 5033608 4711503 4752625 5176456 4827520
14073D827520k69942j40831K45509o8165k16285J01783m9178m1877J340L778K07814
$$ 4827520 4557578 4416747 4662256 4594091 4377806 4479589 4430411 4388534 4389874 4393652 4601466
14062D601466J4435p7622J9l38177J11857N0105k30065L4808j83703l73546L19237
$$ 4601466 4615901 4538279 4538298 4200121 4311978 4362083 4132018 4166826 3983123 3609577 3928814
14051C928814j15754n1634l59301M10520m57885L70802j14355k52463L7839q6615
$$ 3928814 3813060 3761426 3402125 3812645 3354760 3725562 3611207 3358744 3396583 3309968
14041C309968O07O7003k9239K48292J12508m63174m84383L72157J52303j22893
$$ 3309968 3310575 3377578 3348339 3596631 3709139 3245965 2761582 3133739 3286042 3163149
14031C163149l5597O1199J86562l66328j65108J41929o2378j39973J78351L19496
$$ 3163149 3127552 3188751 3375313 3008985 2843877 2985806 2923428 2783455 2961806 3281302
14021C281302l76562j42522L2940l18856L07247j19361N6255J23071q7509p8134
$$ 3281302 2904740 2762218 2795158 2476302 2783549 2664188 2720443 2843514 2756005 2677871
14011B677871k12538j47563L1659J30625M4596l6256o13357Q90927l87363j17412
$$ 2677871 2465333 2317770 2349429 2480054 2524650 2488394 1875037 2765964 2378601 2261189
14001B261189k3943M7510j9444j26148r6960L74290o9832j98160M1760J23155
$$ 2261189 2237246 2284756 2265312 2139164 2042204 2416494 2346662 2148502 2190262 2313417
13991B313417o4894M12409O48186K081056P540516J9388207J5041475j8891190
$$ 2313417 2248523 2660932 3309118 5390174 12930690 32318897 47360372 28469182
13983B8469182j3567002n698237k717672j475692l24426q66691m06746Q1015n66315
$$ 28469182 14902180 9203943 6486271 5010579 4686153 3819462 3412716 3493731 2927416
13974B927416L6198l37937j09894o1681N452L4906J23835n6155o4438j61203R8378
$$ 2927416 2963614 2625677 2515783 2454102 2459554 2494460 2618295 2562140 2497702 2336499 2434877
13963B434877j641j6304n4939L17732q57878M69363l3635K3849k42330K19083
$$ 2434877 2433236 2416932 2361993 2679725 1821847 2291210 2257575 2281424 2039094 2258177
13953B258177L8781l64422R3533J79962n22678L50472m7292K27234j33880j06771
$$ 2258177 2296958 1932536 2026069 2206031 1683353 2033825 1986533 2213767 2079887 1973116
13943A973116j61450R4590J97613P0551k54317k61295L6784o2417J97033r7073
$$ 1973116 1811666 1906256 2103869 2174420 1920103 1658808 1695592 1633175 1830208 1733135
13933A733135q6368n1774K88856j50832q524j59563J01255k1690K35654l07746
$$ 1733135 1646767 1594993 1883849 1733017 1724493 1564930 1666185 1644495 1880149 1572403
13923A572403J70371j44969J32721m4747j64580J58262l29653L45153q1102Q818
$$ 1572403 1742774 1597805 1730526 1685779 1521199 1679461 1349808 1694961 1613859 1622677
13913A622677o7286K61441m51972J81431j1599j63324J1068L1827l0046l4056
$$ 1622677 1555391 1816832 1364860 1546291 1534692 1371368 1382436 1414263 1384217 1350161
13903A350161K43284r6422N1961N300J45704k94608J24132j74315K22814n4352
$$ 1350161 1593445 1497023 1548984 1554284 1699988 1405380 1529512 1355197 1578011 1523659
13893A523659k76461m4905R3832N8766j75697l2167L37484M1563l10312J49022
$$ 1523659 1247198 1202293 1296125 1354891 1179194 1147027 1484511 1526074 1215762 1364784
13883A364784j53067m3815J23266k4r8775M4186R735k95705M28450N1964l83183
$$ 1364784 1211717 1167902 1291168 1291144 1192369 1236555 1246290 950585 1379035 1430999 1047816
13872A047816K50444J55383m74399K70207p9503J24088l5097j48748j00382J45287
$$ 1047816 1298260 1453643 979244 1249451 1169948 1294036 1258939 1110191 1009809 1155096
13862A155096l32692J88280j03168q8991J70556K31041r3406K59516m35140L5504
$$ 1155096 822404 1010684 907516 818525 989081 1220122 1126716 1386232 951092 986596
13852I86596p9993K67114Q6850l87953P4524K24655P4620k69177J93245J12734
$$ 986596 906603 1173717 1260567 872614 947138 1171793 1246413 977236 1170481 1283215
13842A283215j43033l5073K24161N4417l76438K11866q4578j4392n01988J15504
$$ 1283215 1140182 1105109 1329270 1383687 1007249 1219115 1134537 1120145 618157 733661
13832G33661O3760O3268K9110p1624K20012k5741l4689J08968l8126k45334M23366
$$ 733661 797421 860689 889799 818175 1038187 1012446 977757 1086725 1048599 803265 1226631
13821A226631l49576K47081Q9822l68800M65616k99515p4398m13896K41190J81278
$$ 1226631 877055 1124136 1213958 845158 1310774 1011259 936861 522965 764155 945433
13811I45433M1451p1360r5896j07984M84899E72926M45444K1449l83320J56509
$$ 945433 986884 915524 819628 711644 1196543 572926 1018370 1039819 656499 813008
13801H13008q8313K52358k39021P5607j7883L8772j57711J91707k12779O4759
$$ 813008 724695 977053 738032 813639 795756 834528 676817 868524 655745 720504
13791G20504P969J19382N8439l12930j7020P1317K68748k43690Q4822J09672k95310
$$ 720504 728473 847855 906294 593364 576344 647661 916409 672719 757541 867213 571903
13780E71903M29556k93845N450L6268J40396k38873K61326j34081j12366C30227
$$ 571903 1001459 707614 713064 749332 889728 650855 912181 778100 665734 330227
13769G24302k6239L9184k53638J24925J29495M877m3146m0064J23140k06002M99226
$$ 724302 698063 737247 483609 608534 738029 742906 699760 659696 782836 576834 1076060
13758A076060m21276j35478q1273J95092O5309N9572O7736P6911l98579K94406
$$ 1076060 654784 519306 438033 633125 698434 758006 825742 902653 504074 798480
13748G98480J3148B63863N97640j03971j62141k40216J97513j18911m7344R5989
$$ 798480 811628 263863 861503 757532 595391 355175 552688 433777 386433 482422
13738D82422K57844j97389M81192k70574k63475j48652J26867K2457J55342l9551
$$ 482422 740266 542877 1024069 753495 490020 341368 468235 490692 646034 606483
13728F06483K37917k70712K02883j93378J10970q3930j49747P7131K60330j78373
$$ 606483 844400 573688 776571 583193 694163 610233 460486 537617 797947 619574
13718F19574J7689B96781J79006M04862l08962j37834K27092B64606M61254j30311
$$ 619574 637263 296781 475787 880649 571687 433853 660945 264606 725860 595549
13708E95549M70502l45792j05361k86602J91890L43822m12861K01756l18761q5936
$$ 595549 1066051 720259 614898 328296 520186 864008 451147 652903 334142 248206
13698B48206K27712J32240r1084L40054l38368J81013J8851j39034N6825B06179
$$ 248206 475918 608158 517074 857128 518760 699773 718624 579590 636415 206179
13687C09509K38594m258J30397A70667O01254l77158o6130K22460J82980l51561
$$ 309509 548103 543845 674242 170667 771921 394763 328633 551093 734073 382512
13677C82512K29023K4323q7849r2064r3902K92944P3345k73248J70694m8138Q6869
$$ 382512 611535 635858 548009 455945 362043 654987 728332 455084 625778 577640 664509
13666F64509A19710N22106B46176J25178J22748M7666K9630A2064N22099o8286
$$ 664509 119710 641816 246176 371354 494102 541768 571398 12064 534163 465877
13656D65877k20182L38891j71318A50549K38469m2252K40978J41359C45478K30179
$$ 465877 245695 584586 413268 150549 389018 346766 587744 729103 345478 575657
13646E75657k59357r1035M32893L1137B21227r9197M62796A17774M83278B10025
$$ 575657 316300 225265 658158 689295 221227 122030 584826 117774 601052 210025
13635C44083K53123j71534j9433j46738L50181L0934J78093j98570j77455o0273
$$ 344083 597206 425672 406239 259501 609682 640616 818709 620139 442684 382411
13625C82411j26417O0815K04564B48775O5095K77004m3768j63500o0801J93175
$$ 382411 255994 316809 521373 248775 313870 590874 547106 383606 322805 515980
13615E15980k55101R221p2727L50016k61676M2912N02830A96296J57970q1700
$$ 515980 260879 270100 197373 547389 285713 328625 831455 196296 354266 272566
13605B72566J60062o7491j09567J48734k2543J39596L2102q4579J10959K30828
$$ 272566 432628 365137 255570 404304 381761 521357 553459 468880 579839 810667
13595H10667B8503K15422J25206K2906J10955B29495L37958A27885N15748C12212
$$ 810667 28503 243925 369131 392037 502992 229495 567453 127885 643633 312212
13584F42812A59072J82218A54629L93773J13788A4908J01006K55938j37517M6621
$$ 642812 159072 341290 154629 548402 662190 14908 115914 371852 234335 280956
13574B80956K43668B01531L11313j35654j53496K97035B50890o6234K10183j03125
$$ 280956 524624 201531 512844 377190 223694 520729 250890 184656 394839 291714
13564B91714l9211r6193l586J23706N5234P9970D2735a93307G3934N01462j82625
$$ 291714 252503 156310 152724 276430 331664 411634 42735 -193307 73934 575396 392771
13553C92771j90853C5320J87503K75501M0061k59338G1707K35911J31449o4065
$$ 392771 201918 35320 222823 498324 538385 279047 71707 307618 439067 375002
13543C75002A39844q395j9568K74519j81873J68582r5634Q7470j18234J90834
$$ 375002 139844 131449 111881 386400 204527 373109 277475 364945 246711 437545
13533D37545j82784m454G4921L82238I9647M5435R1496L02635B58554k6166K20949
$$ 437545 254761 250307 74921 457159 99647 145082 236578 539213 258554 232388 453337
13522D53337k07094n7514J08958j36354J48548j00453P7572B2220K27725O273
$$ 453337 246243 188729 297687 161333 309881 209428 287000 22220 249945 256218
13512B56218K73081j48838A5648L50477j65985K49216D6857K87037j231j00136
$$ 256218 529299 380461 15648 366125 200140 449356 46857 333894 332663 232527
13502B32527m8325J49232j47104K23519A89431L26488A03424N64979k87663A9891
$$ 232527 184202 333434 186330 409849 189431 515919 103424 668403 380740 19891
13491A33018F2711A2764R9056K18512k9201j00057C7572K66083D4255L01935j69425
$$ 133018 62711 12764 111820 330332 301131 201074 37572 303655 44255 346190 176765
13480A76765J02430Q3738A32611E2129K32085j00372p976J3933b6866D64523k3156
$$ 176765 279195 362933 132611 52129 284214 183842 175866 189799 -26866 464523 441367
13469D41367j91762e932C85385I8708J03848E0663M12736h5285B35444K05833
$$ 441367 249605 -5932 385385 98708 202556 50663 463399 -85285 235444 441277
13459D41277p3119D2525K2014L0835J68442F7712O09762l31353g2501B74336o2609
$$ 441277 368158 42525 64539 95374 263816 67712 677474 346121 -72501 274336 211727
13448B11727A9230h9668B63500R5E8833K02287K48157b7112C02118N9256A12304
$$ 211727 19230 -89668 263500 263595 58833 261120 509277 -27112 302118 361374 112304
13436C2271J44363J47975C9251J40534J92138H4271J13760M5128K87372a93716
$$ 32271 176634 324609 39251 179785 371923 84271 198031 243159 530531 -193716
13425B06682J8980L6059q3614K1751K10468A04058L59242A27095N8552K84588
$$ 206682 225662 261721 178107 199858 410326 104058 463300 127095 185647 470235
13415D70235B29926I2471M02371A5811L75997o1044p7576A02889j6030K40857
$$ 470235 229926 92471 494842 15811 391808 330764 253188 102889 86859 327716
13405C27716a87106A87058o4403K02269A15138J50621j16890L2803k8065K95488
$$ 327716 -187106 187058 122655 324924 115138 265759 148869 181672 153607 449095
13395D49095q7413j42352q201J48678k8456b8365A08787J57850P6578A30219a0824
$$ 449095 361682 219330 211129 359807 331351 -28365 108787 266637 343215 130219 -10824
13383B93081d1735a0961A20211J55112J87029A52357o439R1159j03431J71936
$$ 293081 -41735 -10961 120211 275323 462352 152357 145918 237077 133646 305582
13373C05582A5848b12217D43109A1263J82054J7680K21126B13151J35095j05786
$$ 305582 15848 -212217 443109 11263 193317 210997 432123 213151 348246 242460
13363B42460J8053K29201q5357a32030C74436J29151B08811O8360C5950L73790
$$ 242460 260513 489714 404357 -132030 374436 503587 208811 277171 35950 409740
13353D09740f945D97525A94323J13488j24530K335b52725a16762B93376Q7832
$$ 409740 -6945 497525 194323 307811 183281 185616 -252725 -116762 293376 381208
13343C81208n8369k3423a50339D59001k11935A06352I357K46820P6494j65421
$$ 381208 322839 299416 -150339 459001 247066 106352 9357 256177 332671 167250
13333A67250J29456D2936L03801p354m4587J10427r9972A23002n0370L15070E9730
$$ 167250 296706 42936 346737 339383 294796 405223 305251 123002 72632 387702 59730
13321B21567a3204B13233C0910R3108L58980A89979K4883L6313Q2357A226P9653
$$ 221567 -13204 213233 30910 124018 482998 189979 214862 251175 333532 1226 80879
13310H0879J68195j1908N3126F9271N1316E9212N93380A2546P1703J35690Q8229
$$ 80879 249074 237166 290292 69271 120587 59212 652592 12546 84249 219939 308168
13299C08168P9400A69642K7839K48523d2673G7024K4064J13883G2453K02082B0966
$$ 308168 387568 169642 197481 446004 -42673 77024 101088 214971 72453 274535 20966
13287i2177k60264B06920H0694J92588a39500k2030J2150B32231J10710j65429
$$ -92177 -352441 206920 80694 273282 -139500 -161530 -149380 232231 342941 177512
13277A77512m5121n2915R6745O9690M7795l2216A16600a06785c7044A3327R9317
$$ 177512 132391 79476 176221 245911 293706 261490 116600 -106785 -37044 13327 112644
13266A12644l5685K88692j44282H8700A8786L22941B8946m97e7616A51487K66135
$$ 112644 76959 365651 221369 88700 18786 341727 28946 28449 -57616 151487 417622
13255D17622c0075m3757p4366E987K3611J00483J62899J0421a15802B09107O67
$$ 417622 -30075 -73832 -148198 5987 29598 130081 292980 303401 -115802 209107 209774
13244B09774m5989c21097C83168j32736j10071P595a69653A94739a54996j7711
$$ 209774 163785 -321097 383168 250432 140361 147956 -169653 194739 -154996 -172707
13234a72707B1702K09740A4687f5775A519J17148J68675I6141K21100e0846k04349
$$ -172707 21702 231442 14687 -65775 1519 118667 287342 96141 317241 -50846 -255195
13223b55195b3922B84635a25807C6997O5683J37532a59919F9477k1451J21154
$$ -255195 -23922 284635 -125807 36997 102680 240212 -159919 69477 48026 169180
13213A69180K60949j42163G0648J75280o6049k2143c1091A00747Q450a81094r490
$$ 169180 430129 287966 70648 245928 179879 157736 -31091 100747 109197 -181094 -190584
13202a90584A46004L2150a54697j91344B37447A0539a64626e1356N179B57816
$$ -190584 146004 178154 -154697 -346041 237447 10539 -164626 -51356 -46177 257816
13191C5391b02111h5606G4271L4065e0585B7012L51370j17951I2001a29841B8918
$$ 35391 -202111 -85606 74271 108336 -50585 27012 378382 260431 92001 -129841 28918
13179i7946B10946J55400A15658a42353H3486j0344O8405J13770D8857K77324
$$ -97946 210946 366346 115658 -142353 83486 73142 141547 255317 48857 326181
13169C26181B7593a44785A46521M7918a31468B70610A14488c70055B78228D1492
$$ 326181 27593 -144785 146521 194439 -131468 270610 114488 -370055 278228 41492
13158A28090J838J67605b9954A54761F480K72847c7760j22395B09980J69966D4095
$$ 128090 129928 297533 -29954 154761 6480 279327 -37760 -160155 209980 379946 44095
13146B47567F8196J60389g7332o63g405B07335A0625Q1905P7807a082F11282A79246
$$ 247567 68196 228585 -77332 -77995 -7405 207335 10625 92530 170337 -1082 611282 179246
13133c5478E3892a49154G4443M1676f2686D9140N6250K08676a83196K7296d9840
$$ -35478 53892 -149154 74443 116119 -62686 49140 105390 314066 -183196 -155900 -49840
13121A72405b37214b9338C8173K91120b04354A25744a50597p6651D22263k07645
$$ 172405 -237214 -29338 38173 329293 -204354 125744 -150597 -227248 422263 214618
13111B14618a54579g1519A24330a84411b6422C13796j30308a6600p8357B10036
$$ 214618 -154579 -71519 124330 -184411 -26422 313796 183488 -16600 -94957 210036
13100C39383a31986e4776B18597C1983O2148k5141K8458b18609b0365m037A54451
$$ 339383 -131986 -54776 218597 31983 94131 68990 97448 -218609 -20365 -24402 154451
13088A7288K81764J35663F1045a92717b1966o8472L2734P583D5114J00867q791
$$ 17288 299052 434715 61045 -192717 -21966 -90438 -57704 -50121 45114 145981 137190
13077A37190k0669c260n3857k67893l0923a57645b3475r6050A95705D3228h663
$$ 137190 116521 -3260 -57117 -325010 -355933 -157645 -23475 -119525 195705 43228 -8663
13065B32965J01328g6185H2675g0759F00558B74865j31218O7436p6198b38339
$$ 232965 334293 -76185 82675 -70759 600558 274865 143647 211083 134885 -238339
13054c76597b8294A19804b036j51898D15612h146I7962L75557a29688k76595B47592
$$ -376597 -28294 119804 -2036 -153934 415612 -8146 97962 473519 -129688 -406283 247592
13042D03377D9252M2816R1405a30199B25666r0909e1818j20604o922f0653b6271
$$ 403377 49252 92068 183473 -130199 225666 134757 -51818 -172422 -179344 -60653 -26271
13030C82345c7923C02390c8191C5466K67748A03633m874P6528e4883j11429l5758
$$ 382345 -37923 302390 -38191 35466 303214 103633 98759 175287 -54883 -166312 -202070
13019b02070E6653K11844j24684l4167L5930h9593A04413J39851B7445F008N64070
$$ -202070 56653 268497 143813 109646 145576 -89593 104413 244264 27445 6008 570078
13008E70078k34360f0861A46082J96656A8600J68991F2123B5560L08616i7541
$$ 570078 335718 -60861 146082 342738 18600 187591 62123 25560 334176 -97541
12997a7061j14057A85364H1278g5965j23551f6985I8741a27301A8363J31279Q1538
$$ -17061 -131118 185364 81278 -75965 -199516 -66985 98741 -127301 18363 149642 231180
12986B31180I9793a41967d2973M389C42089e8370E6469J76117I1648K83741A25054
$$ 231180 99793 -141967 -42973 -38584 342089 -58370 56469 232586 91648 375389 125054
12974A99592b06265i4377k21949A65638K2526L7655a14920e970B21372c70245
$$ 199592 -206265 -94377 -316326 165638 188164 225819 -114920 -5970 221372 -370245
12963B75463E5809K3540O4366J40908A31273b0518J860C60587A17296a434A2178
$$ 275463 55809 79349 143715 284623 131273 -20518 -18658 360587 117296 -1434 12178
12951d7720A08578J7255P2302j5160K2632a71090e7940G4188L810a88548B21805
$$ -47720 108578 125833 198135 182975 205607 -171090 -57940 74188 77998 -188548 221805
12939E946d6031A15597K26891c32706N947A91679a04431A47594l2189J2380h8544
$$ 5946 -46031 115597 342488 -332706 -326759 191679 -104431 147594 115405 127785 -88544
12927b3303A9627P3833J48252E3609L34118j42599g8730B20004F9972J95531a16950
$$ -23303 19627 93460 241712 53609 387727 245128 -78730 220004 69972 265503 -116950
12915B36008M747b13997J05741P313p358a0385j06346a5363C64152a02087E7605
$$ 236008 240755 -213997 -108256 -100943 -108301 -10385 -116731 -15363 364152 -102087 57605
12903a41079n8913e9778C6199e611A21173n2548J41014A02825J61757a62797E5637
$$ -141079 -199992 -59778 36199 -5611 121173 68625 209639 102825 264582 -162797 55637
12891a69793c4975B29728a15556G5415f4560A78864J0372G7986C4387N9558g3203
$$ -169793 -34975 229728 -115556 75415 -64560 178864 189236 77986 34387 93945 -73203
12879i5455A1008a35960I478a27225k11736a6426r2078a9151A69793o8929d00809
$$ -95455 11008 -135960 9478 -127225 -338961 -16426 -108504 -19151 169793 100864 -400809
12867F6893a23658C19762E3239a71798B63913c37154b3283j84163e838k1856B18875
$$ 66893 -123658 319762 53239 -171798 263913 -337154 -23283 -207446 -5838 -27694 218875
12855B12254B5308Q7616E416a92152e3139E7567Q7691b5142r8211j3634c7685
$$ 212254 25308 112924 5416 -192152 -53139 57567 145258 -25142 -123353 -136987 -37685
12843a67194H50Q6638K26910K5501e0886B56209a73439m5096I2128N9212b53691
$$ -167194 850 87488 314398 339899 -50886 256209 -173439 -218535 92128 151340 -253691
12831a51698F5390J18634c57244c0871D9669K64924a38358B3022d1081j20039
$$ -151698 65390 184024 -357244 -30871 49669 314593 -138358 23022 -41081 -161120
12821a61120P064C15489a26776m813A66117l1808D8533J32188g8677m2963J7522
$$ -161120 -154056 315489 -126776 -131589 166117 134309 48533 180721 -78677 -121640 -104118
12810a04118A60158k4419b0054G069J66772o6478m8328J31784C1362K3783b945
$$ -104118 160158 135739 -20054 7069 173841 107363 59035 190819 31362 55145 -2945
12798C0203g8370I2848N4331d3513p8112a9625j33186D4662b946A52245C0242
$$ 30203 -78370 92848 147179 -43513 -121625 -19625 -152811 44662 -2946 152245 30242
12786a02001B1613a86797j97064E0886q442b26227A27777m4628K8885O9744b80220
$$ -102001 21613 -186797 -383861 50886 42444 -226227 127777 83149 112034 181778 -280220
12774B39155b78218C3624c01947A38588a55512d5865a2197A0328h0711K2353j5109
$$ 239155 -278218 33624 -301947 138588 -155512 -45865 -12197 10328 -80711 -58358 -73467
12763g3467j10424F3910J72200b09101a01203D4772a37046A87842b46127b136
$$ -73467 -183891 63910 236110 -209101 -101203 44772 -137046 187842 -246127 -2136
12752a89823I4401a03768c3243j98088F7491a98526B15565E5060j0558f9351A69786
$$ -189823 94401 -103768 -33243 -231331 67491 -198526 215565 55060 44502 -69351 169786
12740C17014b21526A53276c22587H2158g1428n3469A63888a98426C74186l0528
$$ 317014 -221526 153276 -322587 82158 -71428 -124897 163888 -198426 374186 343658
12730C43658d3884H4287k4468J13200i0550n6152K8074C1225J12143l9117c60762
$$ 343658 -43884 84287 59819 173019 -90550 -146702 -118628 31225 143368 104251 -360762
12718a19584N798J3607J5455J4433J3707A8202L18d8868D06420I5731J28453A11524
$$ -119584 -113786 -100179 -84724 -70291 -56584 18202 18520 -48868 406420 95731 224184 111524
12705C09453j33451a03876B18647o7420J85690i3911D88909A06243j6117L6959
$$ 309453 176002 -103876 218647 151227 336917 -93911 488909 106243 90126 127085
12695A27085a66125A82223a31439B43K16295e1518m2547B90110G3412a07735E953
$$ 127085 -166125 182223 -131439 243 216538 -51518 -94065 290110 73412 -107735 5953
12683F2160B9755J62413a86620A09156J85441I6395a1530p0839D49884j44032
$$ 62160 29755 192168 -186620 109156 294597 96395 -11530 -82369 449884 305852
12673C05852a61527e7620j29407A06026J84430b46641a01109K048p0742j94399
$$ 305852 -161527 -57620 -187027 106026 290456 -246641 -101109 -99061 -169803 -364202
12663c64202a65769L8881E661K21107p0570P8680E0136J87932k7321Q800k0526
$$ -364202 -165769 -126888 5661 226768 156198 234878 50136 238068 210747 219547 199021
12652A99021c2531r2559A09515k2830C1320R1872P4388H5106r551J43895E0133
$$ 199021 -32531 -125090 109515 86685 31320 123192 197580 85106 75555 219450 50133
12640b03447A21613K04410A04728k4604b07579a9632B02761c631A76460G6257
$$ -203447 121613 326023 104728 80124 -207579 -19632 202761 -3631 176460 76257
12629b43311A28886J10145k4515c6233A10856J95343a70667K8598l3716I2642
$$ -243311 128886 239031 214516 -36233 110856 306199 -170667 -142069 -175785 92642
12618B68661B9389J4071b35194A78831G6342j083J71244b27095R1740k8533A1267
$$ 268661 29389 43460 -235194 178831 76342 75259 246503 -227095 -135355 -163888 11267
12606B43874K1297I4156K09214H3318I443K02739h5907C65951b26494B10747e7055
$$ 243874 265171 94156 303370 83318 9443 212182 -85907 365951 -226494 210747 -57055
12594A5709K1666b1943j37825d0762I5166J0193m88M9112D0515c1344A94515a02803
$$ 15709 37375 -21943 -159768 -40762 95166 105359 104871 153983 40515 -31344 194515 -102803
12581b27400O6115a0917B8003N8068r754a01609B66754f3354B21076d1880J95
$$ -227400 -161285 -10917 28003 86071 76317 -101609 266754 -63354 221076 -41880 -41685
12570d1685k57050I134Q8170D881e3802m3501F8818a06677G6738O0148J6111D2839
$$ -41685 -298735 9134 97304 4881 -53802 -97303 68818 -106677 76738 136886 152997 42839
12557F415K564L9776Q3039j7242f6369A61986a88664e4625k61404B3003i1009
$$ 6415 8979 48755 131794 114552 -66369 161986 -188664 -54625 -316029 23003 -91009
12545e2177B34309r6425f51j8915B92247A6710b02468P9969A45974a02246A92400
$$ -52177 234309 137884 -651 -19566 292247 16710 -202468 -122499 145974 -102246 192400
12533b29165R9421e9433E8060b64360m0604G139J36388A8734b78664P6796B0950
$$ -229165 -129744 -59433 58060 -264360 -304964 7139 143527 18734 -278664 -201868 20950
12521b7942A63815a56317F1956K33462a69368k18279D4019J08883a71947e4665
$$ -27942 163815 -156317 61956 295418 -169368 -387647 44019 152902 -171947 -54665
12510C118K96635a96549B59497I1217i3400q5225B24556a24806K668B487J39295
$$ 3118 299753 -196549 259497 91217 -93400 -178625 224556 -124806 -122138 2487 141782
12499A41782b01237q341p2917d7348o5063A424a90802j42046a9217o8150j30338
$$ 141782 -201237 -209578 -282495 -47348 -112411 1424 -190802 -332848 -19217 -87367 -217705
12488b17705K8151A57082J03723F0922b7386E125K08926a19941j78047E2935I047
$$ -217705 -189554 157082 260805 60922 -27386 5125 214051 -119941 -297988 52935 9047
12476a87711G5461j83J24748b49351J4093H580J14500L7570H591K21558a44445
$$ -187711 75461 75278 200026 -249351 -235258 8580 123080 160650 8591 230149 -144445
12464a82205D9227J6639i0413A24648j1962J50865F7324B939i1869C70831d8782
$$ -182205 49227 65866 -90413 124648 112686 263551 67324 2939 -91869 370831 -48782
12452a29000G4671c77874L2104K0966a17351A06155K7693f6585A60337d9285l61793
$$ -129000 74671 -377874 -345770 -324804 -117351 106155 133848 -66585 160337 -49285 -411078
12441d11078a23548m7974C0576J85036H0432i6451j55174A40267c09415R1847
$$ -411078 -123548 -171522 30576 215612 80432 -96451 -251625 140267 -309415 -217568
12431b17568A8168B319K96975a99929N5665j18253a0909j56124H6390L9591a38213
$$ -217568 18168 2319 299294 -199929 -144264 -262517 -10909 -167033 86390 125981 -138213
12419A9859a14222Q987C886N6859A1430i9381n2164K1660f1680I904a4196j32926
$$ 19859 -114222 -105235 3886 60745 11430 -99381 -151545 -129885 -61680 9904 -14196 -147122
12407a47122m386B05806E5999B3471a13165A23703j4618E4048g262l19518H2476
$$ -147122 -151508 205806 55999 23471 -113165 123703 109085 54048 -7262 -326780 82476
12395g4366B3575l439b71465J34543B11751J84378B6352J98361b10680b6796B35905
$$ -74366 23575 20136 -271465 -136922 211751 396129 26352 224713 -210680 -26796 235905
12383d6965A836R7547a51792B87750a33173I0059K8010M7596J1191L33593k44584
$$ -46965 1836 99383 -151792 287750 -133173 90059 118069 165665 176856 510449 265865
12372B65865p6396C281O8992b7691G5122a70448N0010I0973a87442D6563h9119
$$ 265865 189469 3281 72273 -27691 75122 -170448 -120438 90973 -187442 46563 -89119
12360B47666o0345a33391C4253J89108p5811F2754K7459m3394b4175C29346j41214
$$ 247666 187321 -133391 34253 223361 147550 62754 90213 46819 -24175 329346 188132
12349A88132F0385h5716j84198B7174a94057b6034C0113J20713O0429c8211f87
$$ 188132 60385 -85716 -269914 27174 -194057 -26034 30113 150826 211255 -38211 -687
12337d925A99344B8903J9614f9975a2128m2431A59968e944j17913B47353J21011
$$ -4925 199344 28903 48517 -69975 -12128 -54559 159968 -5944 -123857 247353 368364
12326C68364J0058c0304I1730a23861G2787J67411R475a24065C20989d7960k656
$$ 368364 378422 -30304 91730 -123861 72787 240198 249673 -124065 320989 -47960 -50616
12315e0616B40519k180J31007b2688A6369R7162J88782j41167L92845G2238J77632
$$ -50616 240519 238339 369346 -22688 16369 113531 302313 161146 553991 72238 249870
12304B49870r6706D8548K49917N2308n7854A28902C4252J39543e1253j56909B75434
$$ 249870 153164 48548 298465 350773 292919 128902 34252 173795 -51253 -208162 275434
12292B31054k8183a3089H8467r38K68507b7685B053J83658h5539I5009J23535
$$ 231054 202871 -13089 88467 87529 356036 -27685 2053 185711 -85539 95009 218544
12281B18544O9153A0597K49540e717F7138K11044k3917r4890O7161E5527i6717
$$ 218544 287697 10597 260137 -5717 67138 278182 254265 159375 226536 55527 -96717
12269B25192K22675f783B0111P6368b4858B50551g2195A66776K09302g6245C9566
$$ 225192 447867 -6783 20111 96479 -24858 250551 -72195 166776 376078 -76245 39566
12257B9549J92788p6347a16084c9631A11404d3243A46475n7688g8792B74948D672
$$ 29549 222337 145990 -116084 -39631 111404 -43243 146475 88787 -78792 274948 4672
12245B43257j06761K68196j84957a31269B4333Q7324m1185J4655f3905C42326
$$ 243257 136496 404692 219735 -131269 24333 111657 70472 85127 -63905 342326
12234B03099i0457A9964F192a94703B59809R6658l0638C767K51162N5631r6401
$$ 203099 -90457 19964 6192 -194703 259809 356467 325829 3767 254929 310560 214159
12223B14159c21536a0730F2022M59227A58716b377A16000B971J22016K01071D0732
$$ 214159 -321536 -10730 62022 521249 158716 -2377 116000 2971 124987 326058 40732
12211I6074J56634b3335C01332K7972L9617A70469L0030a15194N990B89847a483
$$ 96074 252708 -23335 301332 329304 368921 170469 200499 -115194 -109204 289847 -1483
12199c9860A40403J2809N6382n7517e3320B17046M270j7703J37334j42388J20348
$$ -39860 140403 153212 209594 152077 -53320 217046 221316 203613 340947 198559 318907
12188C18907N8013j32306n8302m4542a56278A48389C8702J0446P6469n041J07255
$$ 318907 376920 244614 186312 141770 -156278 148389 38702 49148 125617 120576 227831
12177B27831H8082K77909l1524j28802J08171A11537E1506J75650O0230n2963
$$ 227831 88082 365991 334467 205665 313836 111537 51506 227156 287386 234423
12167B34423o9015l2323K55955K2951A75718L20254G4413K19798a15834A92161
$$ 234423 165408 133085 389040 411991 175718 495972 74413 294211 -115834 192161
12156C63449J9360A72510K0194H9932P9315a43314A29331L8752A6949b50057b0691
$$ 363449 382809 172510 192704 89932 169247 -143314 129331 168083 16949 -250057 -20691
12144A49818c19623a2330C20846j25291k028H9668f348n0198A30936Q7512C1752
$$ 149818 -319623 -12330 320846 195555 193527 89668 -6348 -56546 130936 218448 31752
12132E8114J69060F9917E558A986a633A53164G2231b807B37724k8775M1857B2488
$$ 58114 227174 69917 5558 1986 -1633 153164 72231 -2807 237724 208949 250806 22488
12119a89862l8565f0084A32503K5877J8927N1890i7820a6768A02337J64805c56901
$$ -189862 -228427 -60084 132503 158380 177307 229197 -97820 -16768 102337 267142 -356901
12107A46741K60192b82943B96458h002A30241J32845L0474b32357A54180a9395
$$ 146741 406933 -282943 296458 -8002 130241 263086 293560 -232357 154180 -19395
12096D10295n0061g8768p6263C5843P1982L79398A38326J63464J46016j35144
$$ 410295 360234 -78768 -155031 35843 107825 487223 138326 301790 447806 312662
12086C12662o1249p7617o3155Q048l265J67094o460j08669R132J55308A60884
$$ 312662 251413 173796 110641 118689 115424 282518 276058 167389 176521 331829 160884
12074f0917E02557a42642C06733o8658M0885a04256L6616A95770H9383C7861L4060
$$ -60917 502557 -142642 306733 238075 278960 -104256 -67640 195770 89383 37861 71921
12063G1921J37741b15096B17637e3935A1472J15311M9333R2298d1948B2769J07474
$$ 71921 209662 -215096 217637 -53935 11472 126783 176116 268414 -41948 22769 130243
12052A30243M5692a16204H1169f2202B08627A6260d0869i184D4729P6631l4475
$$ 130243 175935 -116204 81169 -62202 208627 16260 -40869 -9184 44729 121360 86885
12041H6885a08405G1426d8274D8822J68318a859A15434a26338j85895R5433I1634
$$ 86885 -108405 71426 -48274 48822 217140 -1859 115434 -126338 -312233 -216800 91634
12029b63886a03704N379o391A95123G1388g7140A00010K10153B6488f331A94986
$$ -263886 -103704 -98325 -104716 195123 71388 -77140 100010 310163 26488 -6331 194986
12017g6475j02509h895A35117a01349C16988b78375a5196B02088H4585m0156f7982
$$ -76475 -178984 -8895 135117 -101349 316988 -278375 -15196 202088 84585 44429 -67982
12005C13091A00949J76259A11180K33396b08175I1759J20856a41826r9226A25725
$$ 313091 100949 277208 111180 344576 -208175 91759 212615 -141826 -241052 125725
11994a91261A89989c03052H3331d3327B3538K49358c17123a33083A15109B9546
$$ -191261 189989 -303052 83331 -43327 23538 272896 -317123 -133083 115109 29546
11983E198a28716M8489c7396B47773a10292a1811B35321a19718n0427B41945H6855
$$ 5198 -128716 -80227 -37396 247773 -110292 -11811 235321 -119718 -170145 241945 86855
11971B9919f685n7674A57405b49759a01948K5375j72232j01202C62699a08897
$$ 29919 -6685 -64359 157405 -249759 -101948 -76573 -248805 -350007 362699 -108897
11960b69722B1882h4671b2861A10210d0526j50166A44109a00617j86979A80353
$$ -269722 21882 -84671 -22861 110210 -40526 -190692 144109 -100617 -287596 180353
11949C519b79932F2181d4000A58310B7424J31449c46059D3490a90652c8669A02635
$$ 3519 -279932 62181 -44000 158310 27424 158873 -346059 43490 -190652 -38669 102635
11937a09803A43575b36204F4664c5246B1816N7963a0662M156o8044j02145c3465
$$ -109803 143575 -236204 64664 -35246 21816 79779 -10662 -6506 -74550 -176695 -33465
11925G5776b60620A60354E9914i7554I0793N5426J0743a69613b6992F3843i9842
$$ 75776 -260620 160354 59914 -97554 90793 146219 156962 -169613 -26992 63843 -99842
11913b46782B71586g2089j1095j60005k58990K37294D53616G3811B3204c9376
$$ -246782 271586 -72089 -83184 -243189 -502179 -264885 453616 73811 23204 -39376
11902a8142m0382K2363j59505A64673a14365N3516k6823q1809c8043A31227O9033
$$ -18142 -58524 -36161 -195666 164673 -114365 -60849 -87672 -169481 -38043 131227 200260
11891B00260a25459F8973J32767b0241l92725f7977A63443d043G9207b60361e2771
$$ 200260 -125459 68973 201740 -20241 -412966 -67977 163443 -4043 79207 -260361 -52771
11879A12966b35653g7069E3597O8017a32010A55934d2562A352e8817m9532j14740
$$ 112966 -235653 -77069 53597 121614 -132010 155934 -42562 1352 -58817 -108349 -223089
11868b23089A20549k2255C2254a65512a4666j60861A13164m965b59941q814r0777
$$ -223089 120549 98294 32254 -165512 -14666 -175527 113164 108199 -259941 -268755 -359532
11857c59532c412r0528I3719b76964B82140h7160p2555J30e7825l87927H1276
$$ -359532 -3412 -93940 93719 -276964 282140 -87160 -159715 -159585 -57825 -445752 81276
11845a66411D09855H1933g6706k7679G3765J96498i1505E5842H321b17959p6225
$$ -166411 409855 81933 -76706 -104385 73765 270263 -91505 55842 8321 -217959 -294184
11834b94184F1972b06411B38819a13954N4334p4308E3151j2680J84864r6800a56412
$$ -294184 61972 -206411 238819 -113954 -59620 -133928 53151 40471 225335 128535 -156412
11822A2714i4260A49012L038A1765O0115d1211A40224r363b29067e5629p6057
$$ 12714 -94260 149012 152050 11765 71880 -41211 140224 130861 -229067 -55629 -131686
11811a31686E1336a38116D2280b46090Q7808D2368i7263j00504A716g2231p950
$$ -131686 51336 -138116 42280 -246090 -158282 42368 -97263 -197767 1716 -72231 -80181
11800h0181C3431J7853a73496A61306c8289A88111a12452o0055B34135a75573
$$ -80181 33431 51284 -173496 161306 -38289 188111 -112452 -172507 234135 -175573
11789a13730A8990c87833R388A48409J31261c05968O8477A80890a07977n7237
$$ -113730 18990 -387833 -378445 148409 279670 -305968 -237491 180890 -107977 -165214
11779a65214g2523E0702Q8289h8000B2274b03300A88323c52334E165h6833A09786
$$ -165214 -72523 50702 138991 -88000 22274 -203300 188323 -352334 5165 -86833 109786
11767B68576e8152I2387R477g4296B8556b30770o52A44830a08710H3215L17499
$$ 268576 -58152 92387 101864 -74296 28556 -230770 -231422 144830 -108710 83215 400714
11756D00714j43008D0711e9998E0729B3073b08305O8568B40003G61J61382a26052
$$ 400714 257706 40711 -59998 50729 23073 -208305 -139737 240003 761 162143 -126052
11744e7271A41526f6231l9565o5329I6009L6082K1519i9417m1907d6379C7533
$$ -57271 141526 -66231 -105796 -171125 96009 132091 153610 -99417 -141324 -46379 37533
11732b2198B53208F2936J86962f5511A01299a83937g0496H6740M6040a05218e398
$$ -22198 253208 62936 249898 -65511 101299 -183937 -70496 86740 132780 -105218 -5398
11720A8291K48795L8033a10345A80879C164J13053B0754J36335Q4844a85424f4962
$$ 18291 267086 305119 -110345 180879 3164 116217 20754 157089 241933 -185424 -64962
11708b22115A44724i3477b9484m6522A89247e3438D391a13904K3169B08836j1226
$$ -222115 144724 -93477 -29484 -76006 189247 -53438 4391 -113904 -90735 208836 197610
11697A97610a56402H6612b13404F1294J56896b36052G4370i5653G8896R6964a29192
$$ 197610 -156402 86612 -213404 61294 218190 -236052 74370 -95653 78896 175860 -129192
11685A21545J13619i8228F5273M5222a57398A45526d10300D3531a67204A5150
$$ 121545 235164 -98228 65273 110495 -157398 145526 -410300 43531 -167204 15150
11674G3595K2434c1338J3095k04498g166j00781C0891I219a27080a2457j41787
$$ 73595 96029 -31338 -18243 -222741 -7166 -107947 30891 9219 -127080 -12457 -154244
11663a54244b1757l8452A3058g5940A39893J7399M3519a63051F206a16054B61801
$$ -154244 -21757 -60209 13058 -75940 139893 157292 200811 -163051 6206 -116054 261801
11651b99118C45766a70572b6478l4975k0238A59762a12083j3698B95749a4802
$$ -299118 345766 -170572 -26478 -61453 -81691 159762 -112083 -125781 295749 -14802
11640b82766C22509j59343J7075b9150H7929P8121e6452k54085F1174R8933e3923
$$ -282766 322509 163166 180241 -29150 87929 166050 -56452 -310537 61174 160107 -53923
11628h0920a114k12333A74872g4232G9093g2605A09466B1886b3349j13893A40090
$$ -80920 -1114 -213447 174872 -74232 79093 -72605 109466 21886 -23349 -137242 140090
11616b8711C5745d3497G0510b8719C5705a02561A68593i1406C9448b22119B05194
$$ -28711 35745 -43497 70510 -28719 35705 -102561 168593 -91406 39448 -222119 205194
11604A73150H0377h7383A27804a37653k8889B8384b07006A98709f4653b1796k8233
$$ 173150 80377 -87383 127804 -137653 -166542 28384 -207006 198709 -64653 -21796 -50029
11593e0029A53240l7134a46221c972B56713G8254j6456K91038i2519B0594J88847
$$ -50029 153240 116106 -146221 -3972 256713 78254 61798 352836 -92519 20594 209441
11582B09441I5042d01266c0222e070n9696B86999b24109I9077e9671A22575l8338
$$ 209441 95042 -401266 -30222 -5070 -64766 286999 -224109 99077 -59671 122575 84237
11571H4237J33383b29396J13550B305P4805O2686A8417L15625d26964A09477J30833
$$ 84237 217620 -229396 -115846 2305 77110 139796 18417 334042 -426964 109477 240310
11560B40310K05656A28604J10223a20734H9912Q1406q0875D3900Q9251L22669
$$ 240310 445966 128604 238827 -120734 89912 171318 90443 43900 133151 455820
11550D55820f1842A22507h3389A39585f4107E9783f1955q9641c0909r7339b4382
$$ 455820 -61842 122507 -83389 139585 -64107 59783 -61955 -151596 -30909 -128248 -24382
11538A98368q6445K388j3978b9787B00528J69181j6325A27586D7102e0969k2489
$$ 198368 111923 114311 100333 -29787 200528 369709 353384 127586 47102 -50969 -73458
11527g3458A19606a42394A8096K74319j03918g7942E1722J66009H3673N6589A4675
$$ -73458 119606 -142394 18096 292415 188497 -77942 51722 217731 83673 140262 14675
11515B8694a1449F4394a5929B6924a28088B26221F4880l2180J86237k5751M4266
$$ 28694 -11449 64394 -15929 26924 -128088 226221 64880 32700 218937 193186 237452
11504B37452J1175J7425C4978c5446A11113a51630l811G62L7648a666H5323L5054
$$ 237452 248627 266052 34978 -35446 111113 -151630 -155441 762 38410 -1666 85323 120377
11492A20377K68087j72523a47184C24847j51060A1087I16e4549D67732k08028
$$ 120377 388464 215941 -147184 324847 173787 11087 916 -54549 467732 259704
11482B59704B4674K65720f3246G5571K490J90410G4103K88000a25531A83778d3122
$$ 259704 24674 290394 -63246 75571 78061 268471 74103 362103 -125531 183778 -43122
11470B4021J98220b02245B65009A07524J45626b35674d1751C48884D5282d2386
$$ 24021 222241 -202245 265009 107524 253150 -235674 -41751 348884 45282 -42386
11459A50560L72927e8660p4605B54259j21403b70688C35087l6352p8835I6225
$$ 150560 523487 -58660 -133265 254259 132856 -270688 335087 298735 219900 96225
11448g5563D0688c3514k11827A21132e50391a28280G8273L920b00031R7988d3485
$$ -75563 40688 -33514 -245341 121132 -550391 -128280 78273 82193 -200031 -102043 -43485
11436b6715j50665A70175a26530A29267h346j10688j31222B07256h9339B20256
$$ -26715 -177380 170175 -126530 129267 -8346 -119034 -250256 207256 -89339 220256
11425a81573A03199a27256B0580b27634j91462F6716a01269C4558P0166a27791
$$ -181573 103199 -127256 20580 -227634 -419096 66716 -101269 34558 104724 -127791
11414A75017D0797c3490G4946L362c13902a49961j27B91479b83830p8544J36703
$$ 175017 40797 -33490 74946 78308 -313902 -149961 -150088 291479 -283830 -362374 -225671
11403b25671d440m0959Q385A89012D6555A3590o237L97196a32344l3203A29600
$$ -225671 -4440 -45399 -37014 189012 46555 13590 7353 404549 -132344 -165547 129600
11391a8965C31022A62982a48562A2142a214l2730C75g2812A31840m3912d2871
$$ -18965 331022 162982 -148562 12142 -1214 -33944 375 -72812 131840 87928 -42871
11379g0013k5417D9513L4946c63013c7027D5100J42391e7360E1290R9043B0847
$$ -70013 -95430 49513 84459 -363013 -37027 45100 187491 -57360 51290 150333 20847
11367a57909j76707b1289B32459a60643B23413h5099A2162b03311C27607c0402
$$ -157909 -334616 -21289 232459 -160643 223413 -85099 12162 -203311 327607 -30402
11356c66488J10607a761A5050b1438A52848b17306P4726I4715J15890c6564B02435
$$ -366488 -255881 -1761 15050 -21438 152848 -217306 -142580 94715 210605 -36564 202435
11344B1008c69809a51439A65925C9007a57016A84250o401N4648b13165A52114
$$ 21008 -369809 -151439 165925 39007 -157016 184250 177849 232497 -213165 152114
11333b26631A56408b93112C33838C1924c41711f7541k68443J53017F7208L14084
$$ -226631 156408 -293112 333838 31924 -341711 -67541 -335984 -182967 67208 381292
11323C81292b916H6752b42313G7061j5516f142P22p0495L4919q9794q6601A96814
$$ 381292 -2916 86752 -242313 77061 61545 -6142 -5420 -75915 -40996 -130790 -217391 196814
11310e393E6484N5149a02836j99902P9088g3565p7101A32961K67389C9993c2805
$$ -5393 56484 111633 -102836 -302738 -223650 -73565 -150666 132961 400350 39993 -32805
11298A40798G353L46575a49433k3900C104a94558Q147D8467a58660M6469F2J29602
$$ 140798 7353 353928 -149433 -173333 3104 -194558 -186411 48467 -158660 -112191 62 129664
11286A29664A7326J01390E1627b16312e2895A0739f367j35892n2440g6753L7709
$$ 129664 17326 118716 51627 -216312 -52895 10739 -6367 -142259 -194699 -76753 -39044
11275c9044B16754i4779A93223a62844j2918C7983R7568n3427c6317a2425k83014
$$ -39044 216754 -94779 193223 -162844 -175762 37983 135551 82124 -36317 -12425 -295439
11264b95439a23164j31341d2401k48306C835a16517k58432e5637J6220G9926b27959
$$ -295439 -123164 -254505 -42401 -290707 3835 -116517 -374949 -55637 -39417 79926 -227959
11252E1533b0035H1364d9712q8289A38964g9369o546B50330a5505j89311j38151
$$ 51533 -20035 81364 -49712 -138001 138964 -79369 -85915 250330 -15505 -204816 -342967
11241c42967F6463i7599j32170J13844d10k11036i531j87572M0152A58119d7402
$$ -342967 66463 -97599 -229769 -115925 -410 -211446 -9531 -197103 -156951 158119 -47402
11229d8043A70450b21144g6417A88781g6572k53360B55475a31930C8405c42267
$$ -48043 170450 -221144 -76417 188781 -76572 -329932 255475 -131930 38405 -342267
11218b03716f2374j144k8234l3240p5090C8120B50c39639J28534A21349E083J96732
$$ -203716 -62374 -63518 -91752 -124992 -200082 38120 250 -339639 -211105 121349 5083 201815
11206B01815P5700f0300j46731J02921H0224b3337j64563f4913q7472M2454j27683
$$ 201815 277515 -60300 -207031 -104110 80224 -23337 -187900 -64913 -152385 -109931 -237614
11195b37614B4666j1985c09488L8614a01852r6383g6133B98855a6375k53777A53316
$$ -237614 24666 12681 -309488 -270874 -101852 -198235 -76133 298855 -16375 -270152 153316
11183A28485d9414B9048g080j4581C9391J24519G2361j5596N1651b07828e6673
$$ 128485 -49414 29048 -7080 -21661 39391 163910 72361 56765 108416 -207828 -56673
11171E0601P8651g8503j80182C34740A25641P7934H876b4174r041l06505A15486
$$ 50601 129252 -78503 -258685 334740 125641 203575 8876 -24174 -33215 -339720 115486
11159i6246A56307i5938I4040c00031i2303A82332a53007A08129a81530G684L6911
$$ -96246 156307 -95938 94040 -300031 -92303 182332 -153007 108129 -181530 7684 44595
11148D4595b0058j43862A70767a65658p6602A19864c05823H3365P9139D9407K39764
$$ 44595 -20058 -163920 170767 -165658 -242260 119864 -305823 83365 162504 49407 289171
11137B89171A15504m7821a93803B32288G7193d685j757k84386F3310a64662A02579
$$ 289171 115504 67683 -193803 232288 77193 -4685 -6442 -290828 63310 -164662 102579
11125B00425J46833j38188P0950c7926E5342k2139j6159O8861a63669C31076I0454
$$ 200425 347258 209070 280020 -37926 55342 33203 17044 85905 -163669 331076 90454
11113i4148A5291L37374c02103e714A16853e4026j80607F2686k37J36717o639
$$ -94148 15291 352665 -302103 -5714 116853 -54026 -234633 62686 62449 199166 192527
11102A92527k6651b06247c3791n5846A95179j8435b39147d1047B16872m4401f6080
$$ 192527 165876 -206247 -33791 -89637 195179 176744 -239147 -41047 216872 172471 -66080
11090C28896l2686a33931A41669K8450O5658J19544l2304K04664g5237G4600C5295
$$ 328896 296210 -133931 141669 170119 235777 355321 323017 527681 -75237 74600 35295
11078h8671D07603D7032N52013A45536J475K06007I3320J01597J0708J8213Q2439
$$ -88671 407603 47032 599045 145536 147011 353018 93320 194917 205625 223838 306277
11067C06277d8749B3559a07483D53733B05935K53130p4401J0310j96478K7376
$$ 306277 -48749 23559 -107483 453733 205935 459065 384664 394974 198496 225872
11057B25872L37135k13841j57443K37180L0532K7000K13975j6782k31667J41557
$$ 225872 563007 349166 191723 428903 459435 486435 700410 683628 451961 593518
11047E93518j80405J08421K2325K00737j07354m3397J46447k9181o1662K53907
$$ 593518 413113 521534 543859 744596 637242 593845 740292 711111 649449 903356
11037I03356l5622H3072M74378J32138j84073J67366j81594j50936K45482j73155
$$ 903356 867734 83072 557450 689588 505515 672881 491287 340351 585833 412678
11027D12678N06224m36063Q460o4429J64860k03503M47919k22967J82249n7500
$$ 412678 918902 482839 491299 426870 591730 388227 836146 613179 795428 737928
11017G37928J27088l36459J3754L11286J1165j77950k65931j63813K78887O1194
$$ 737928 865016 528557 542311 853597 864762 686812 420881 257068 535955 597149
11007E97149B38728K20016r9943L04468j42461O6034J63474j50002n9450J58951
$$ 597149 238728 458744 358801 663269 520808 586842 750316 600314 540864 699815
10997F99815j04310n8705k61580M11291j17401J09358j78278J66515q8023P0875
$$ 699815 595505 536800 275220 686511 569110 678468 500190 666705 578682 649557
10987F49557N2743j8013q3195j00447L22522R041N4584j2556P1272l01179J69241
$$ 649557 702300 684287 601092 500645 823167 832208 886792 874236 945508 644329 813570
10976H13570N4265K08758R2769M26777R4902j01690M04114K17665k16394Q4733
$$ 813570 867835 1076593 1169362 1596139 1691041 1589351 1993465 2211130 1994736 2079469
10966B079469J56184K1529l41499k6025k20275M2778l27020r6174J10657J89267
$$ 2079469 2235653 2257182 1915683 1889658 1669383 1712161 1385141 1288967 1399624 1588891
10956A588891m38722J2683L25781j87419M21382m85083K15623k81085O9027k34693
$$ 1588891 1150169 1162852 1488633 1301214 1722596 1237513 1453136 1172051 1241078 1006385
10946A006385r285k22321j27766J19523C42193E5712J42704O3462j13011L43918
$$ 1006385 997100 774779 647013 766536 342193 55712 198416 261878 148867 492785
10936D92785A29500J6824J06829c4780J2270K411B3454L24256a64994D7067c9547
$$ 492785 129500 146324 253153 -34780 -22510 -20099 23454 347710 -164994 47067 -39547
10924A00421a91431B9001d3903b0497j77667P1496q3845F4642J35488I3266l788
$$ 100421 -191431 29001 -43903 -20497 -198164 -126668 -210513 64642 200130 93266 89478
10913H9478h9712M3380D3555a13611k72172H7649c9091f519A90657p0973d5352
$$ 89478 -89712 -46332 43555 -113611 -385783 87649 -39091 -6519 190657 119684 -45352
10901f8504A7262M8539b55320O3966R4982A35615m7788B1402J01998A3631M3105
$$ -68504 17262 65801 -255320 -191354 -96372 135615 87827 21402 123400 13631 56736
10890E6736j241a99954k11877I1725J8118J66329b9175C95879e2408j80415f8482
$$ 56736 55495 -199954 -411831 91725 109843 276172 -29175 395879 -52408 -232823 -68482
10878D6637M6619r582C6359a60208C796O4955J88666f352j35158L9934o0475j5671
$$ 46637 93256 83674 36359 -160208 3796 68751 257417 -6352 -141510 -101576 -162051 -177722
10866a77722a5806E293b02832B75693a41635B11848k7085b33991B78319i8459
$$ -177722 -15806 5293 -202832 275693 -141635 211848 184763 -233991 278319 -98459
10855F7127L27577A11477Q3899B3689c467A98860a95009k48038A82318a4062o0369
$$ 67127 394704 111477 195376 23689 -3467 198860 -195009 -443047 182318 -14062 -74431
10844g4431K2295B0184b20908a08862j6763C3686j043h518k56665A27390g7140
$$ -74431 -52136 20184 -220908 -108862 -125625 33686 32643 -8518 -265183 127390 -77140
10832A09893b9116a1472A08810f9095B5334a19722k80124c1787p1261A49172d13325
$$ 109893 -29116 -11472 108810 -69095 25334 -119722 -399846 -31787 -103048 149172 -413325
10820C16220h1473q5714j08683J05595g3790K9801D2812g0179G3955d0646j18531
$$ 316220 -81473 -167187 -275870 -170275 -73790 -43989 42812 -70179 73955 -40646 -159177
10809a59177C3231c50529A27059a97142h7528B84753a64156M8282a3026B71181
$$ -159177 33231 -350529 127059 -197142 -87528 284753 -164156 -115874 -13026 271181
10798b42936B25594B6709f81A0695N508g5880C09428a01618B37301a17247C6405
$$ -242936 225594 26709 -681 10695 16203 -75880 309428 -101618 237301 -117247 36405
10786a46487A02562e8783A2232K0430c8194A04543f4263m06243b4630r0399b551
$$ -146487 102562 -58783 12232 32662 -38194 104543 -64263 -470506 -24630 -115029 -2551
10774C1770a87581c8011G0194J35814q3139o460J22209L6484e3212A515e2141
$$ 31770 -187581 -38011 70194 206008 122869 116409 238618 275102 -53212 1515 -52141
10762B14606c3765D546K01009i0065B90973b64149G1715c37939A63758m4816j266
$$ 214606 -33765 4546 205555 -90065 290973 -264149 71715 -337939 163758 118942 117676
10751A17676a26723l0965g0455l7440E0384J6099h6261A35224c11273i6149j2220
$$ 117676 -126723 -157688 -70455 -107895 50384 66483 -86261 135224 -311273 -96149 -108369
10740a08369P738F766a83135a7766D9204R0019g2371b6279j07123H2971g5604
$$ -108369 -100631 6766 -183135 -17766 49204 139223 -72371 -26279 -133402 82971 -75604
10728b7364q6842K0786l2976j00941P5169C9227b71834a32520c8663m6048E3786
$$ -27364 -114206 -93420 -126396 -227337 -152168 39227 -271834 -132520 -38663 -84711 53786
10716h4714A31732h9304J5552B404Q7622a40347e7416k0736l7629A8304a8398
$$ -84714 131732 -89304 -73752 2404 90026 -140347 -57416 -78152 -115781 18304 -18398
10704G6202b69135H616K3663A3285f9914k39106C23251G2066J52680F2099K6509
$$ 76202 -269135 8616 32279 13285 -69914 -309020 323251 72066 224746 62099 88608
10693H8608b75953a32838b5048F6430k601a37679A64320L2990c5552A6113b39448
$$ 88608 -275953 -132838 -25048 66430 63829 -137679 164320 197310 -35552 16113 -239448
10681c02I9555J63712e5254J7503J4066A13113a74392C2200K01542c00166m4045
$$ -302 99555 263267 -55254 -37751 -23685 113113 -174392 32200 233742 -300166 -344211
10670c44211D5058N1513n76E043b26989O6529c2449D70350B02476I9053k2981
$$ -344211 45058 96571 95995 5043 -226989 -160460 -32449 470350 202476 99053 76072
10659G6072d4832A90235J56652A16187f4448A08007i5660C67603b80175N4177
$$ 76072 -44832 190235 346887 116187 -64448 108007 -95660 367603 -280175 -225998
10649b25998N6477N504C5616f5132j42913N5374A47907L84901b02301C3186b66270
$$ -225998 -169521 -164017 35616 -65132 -208045 -152671 147907 532808 -202301 33186 -266270
10637F0308g5414k64355d9726A12987a58328j79543c8847j54349B10674J05646
$$ 60308 -75414 -339769 -49726 112987 -158328 -337871 -38847 -193196 210674 316320
10627C16320j11658F8388g5154F9922b18985P2010a2034l6845k77930a54350A83133
$$ 316320 204662 68388 -75154 69922 -218985 -146975 -12034 -48879 -326809 -154350 183133
10615b0837A79501g5767l17399I9779b84498L5533e8037j01835j03431h0227A080
$$ -20837 179501 -75767 -393166 99779 -284498 -248965 -58037 -159872 -263303 -80227 1080
10603b7773m27747J31119h1849K863j23560i1089l31470A26007a15308p5532m3005
$$ -27773 -455520 -324401 -81849 -78986 -202546 -91089 -422559 126007 -115308 -190840 -233845
10592b33845A81192a49774N5007j32299h1058j93597l5588f4887p8669g0931A56171
$$ -233845 181192 -149774 -94767 -227066 -81058 -274655 -310243 -64887 -143556 -70931 156171
10580g2521l3679m15176d168k54096j35233b794q0498B01230F7455h5713d2682
$$ -72521 -106200 -521376 -4168 -258264 -393497 -2794 -83292 201230 67455 -85713 -42682
10568H0697a51575j33599M8821E4469K24913d3799j72097A7918J82601F5076a40569
$$ 80697 -151575 -285174 -236353 54469 279382 -43799 -215896 17918 200519 65076 -140569
10556a17534B46368h5852j67186J8619c7923J4417r165k61178A39744E0427K2199
$$ -117534 246368 -85852 -253038 -234419 -37923 -23506 -32671 -293849 139744 50427 72626
10545G2626k620c15227O0916J09928g0274A92185a55488p6157j1238E7854L20219
$$ 72626 70006 -315227 -254311 -144383 -70274 192185 -155488 -231645 -242883 57854 378073
10534C78073c43282a39968m5852g0966l4191j7644k18318N1414l7106h5718b6596
$$ 378073 -343282 -139968 -185820 -70966 -105157 -122801 -341119 -289705 -326811 -85718 -26596
10522b1481q22G5557a22931H0433J64035a28225A07175R5873g1505b5433B9000
$$ -21481 -22303 75557 -122931 80433 244468 -128225 107175 203048 -71505 -25433 29000
10510f711j00283o8264k5604j331j89136E2308O5704c5088j55603k0307b3083
$$ -6711 -106994 -175258 -200862 -202193 -391329 52308 118012 -35088 -190691 -210998 -23083
10498a09982F3160K09801b05059f4409A71956a69689C16299a20533j54201B75571
$$ -109982 63160 272961 -205059 -64409 171956 -169689 316299 -120533 -274734 275571
10487A61256o1708m1193a51053P5074A20435a39700a1443j00199B63751a17634
$$ 161256 99548 58355 -151053 -75979 120435 -139700 -11443 -111642 263751 -117634
10476D11936P6604H0774Q90224C95084j89329I3663L78976A49875b17173b8382
$$ 411936 488540 80774 970998 395084 205755 93663 472639 149875 -217173 -28382
10465A76868J50611L0783j78329m9767R2736k2461l3487m9976k7592d5921B24537
$$ 176868 327479 358262 179933 130166 222902 200441 166954 116978 89386 -45921 224537
10453A74650m4043d43762G6025E194a26398k59186C2152c51057A5312c32774L2575
$$ 174650 130607 -443762 76025 5194 -126398 -385584 32152 -351057 15312 -332774 -300199
10442c00199B33205C026a21513B42011a49064j14422B72600r7614E7105J62881
$$ -300199 233205 3026 -121513 242011 -149064 -263486 272600 174986 57105 219986
10432B19986H6308J84783h8851k53107a9103B38719b11960l1573D9619b15644
$$ 219986 86308 271091 -88851 -341958 -19103 238719 -211960 -243533 49619 -215644
10421d0883A18004a00077A29213c67650c5286o7138C04612a01318K8343o8141
$$ -40883 118004 -100077 129213 -367650 -35286 -102424 304612 -101318 -72975 -141116
10411a41116B90912a09695A65417c30244a33367j09345A23317a78604G4163P1687
$$ -141116 290912 -109695 165417 -330244 -133367 -242712 123317 -178604 74163 145850
10401A45850o6140a33509B10243a70817J2527j2573B85905a33920q2701K6071
$$ 145850 79710 -133509 210243 -170817 -158290 -170863 285905 -133920 -216621 -190550
10391a90550B2139L5783a21124A92328a8030B64203h7266A27566K56811j43831
$$ -190550 22139 57922 -121124 192328 -18030 264203 -87266 127566 384377 240546
10381B40546A5550a50933B77631a0110m9046C48879Q3187d210G7346a8402n226
$$ 240546 15550 -150933 277631 -10110 -59156 348879 432066 -4210 77346 -18402 -23628
10370b3628B33259N6968m0864l7520a33014D99678M0560k45284n3355J09491A23755
$$ -23628 233259 290227 249363 211843 -133014 499678 540238 294954 241599 351090 123755
10358D1026K04689J09984o1477n0021c76160a9420B73316A20093R4078k9422M02518
$$ 41026 245715 355699 294222 244201 -376160 -19420 273316 120093 214171 184749 587267
10347E87267A69558L47225B42477Q6191p0153M1155j26646J18788E4641P5189
$$ 587267 169558 516783 242477 328668 258515 299670 173024 291812 54641 129830
10337A29830o2088J90811A25088J95394L2413p5662A0336P0874K55378b88876
$$ 129830 67742 258553 125088 320482 352895 277233 10336 81210 336588 -288876
10326c5226A20335J51172i0917B2602J69980e0914E0953L2844K95878F4000P7203
$$ -35226 120335 271507 -90917 22602 192582 -50914 50953 83797 379675 64000 141203
10315A41203Q113L10952G1015j3779J9340c97185c163B2564c035k38942N3403
$$ 141203 149316 460268 71015 57236 76576 -397185 -3163 22564 -3035 -241977 -188574
10304a88574E5737K47363a31969n9214e6517a7087A4140e479k0941C9847a05056
$$ -188574 55737 303100 -131969 -191183 -56517 -17087 14140 -5479 -26420 39847 -105056
10292c682m7801F8320J21096a46474o6364A37374a29584B95991q7237O3011a26680
$$ -3682 -51483 68320 189416 -146474 -212838 137374 -129584 295991 208754 271765 -126680
10280A14821j853J19734C6733J04627a16030A44373J13076b07444O4443H9772
$$ 114821 112968 232702 36733 141360 -116030 144373 257449 -207444 -143001 89772
10269i5440I3825b82316J33367c0808j58656G2487c00496C9659A6767b86181h4859
$$ -95440 93825 -282316 -148949 -30808 -189464 72487 -300496 39659 16767 -286181 -84859
10257A45278J34030a92598p9930I508J56864J70538J92644A3500O42716B60530
$$ 145278 279308 -192598 -272528 9508 166372 336910 529554 13500 656216 260530
10246A50057Q111f8889H0191a68597g3124j92522B3756M7064a74047h2989o6438
$$ 150057 158168 -68889 80191 -168597 -73124 -265646 23756 70820 -174047 -82989 -149427
10235a49427J4747K9502L4235B51251g5400H9339L6258a60189j94851a73775f1407
$$ -149427 -134680 -105178 -70943 251251 -75400 89339 125597 -160189 -355040 -173775 -61407
10223H0205a14718m1899E124b34855A78943o705c7842r0988A48435a12500j2647
$$ 80205 -114718 -156617 5124 -234855 178943 172238 -37842 -128830 148435 -112500 -125147
10212a25147b7354j22102n3322A6941c32324A10441h6286C0188b0703H4017c45298
$$ -125147 -27354 -149456 -202778 16941 -332324 110441 -86286 30188 -20703 84017 -345298
10200b78008J36138C25501A5518a08140D0306L4714a61650g1531A00572l9648
$$ -278008 -141870 325501 15518 -108140 40306 75020 -161650 -71531 100572 60924
10190F0924J00248i3587l7955o4350C7225c33789F1251E169K5858f450G4042a46916
$$ 60924 161172 -93587 -131542 -195892 37225 -333789 61251 5169 31027 -6450 74042 -146916
10177D9273c36074Q9021A28906j7474a07260A28901c9620P572m17721a24002A59384
$$ 49273 -336074 -247053 128906 111432 -107260 128901 -39620 -32048 -449769 -124002 159384
10165b85835A0020i2590K2727k77142a18488o235b0681A21505c11248h0541C4747
$$ -285835 10020 -92590 -69863 -347005 -118488 -124723 -20681 121505 -311248 -80541 34747
10153A56115c35953a38803o4309D6237M016R726a87456A09434c94248F1650n984
$$ 156115 -335953 -138803 -203112 46237 50253 59979 -187456 109434 -394248 61650 55666
10142E5666J5337d3919J0017j80298A68720i975A85427c1780f148n4605a2173
$$ 55666 71003 -43919 -33902 -214200 168720 -9975 185427 -31780 -6148 -60753 -12173
10130b66745a29819f529F0133b22315h1040j44308f8767J3192B23659b55296B27309
$$ -266745 -129819 -6529 60133 -222315 -81040 -225348 -68767 -55575 223659 -255296 227309
10118e2933m26028G6793J92975f7327A03332D2268h5963k3539k27916R6374A68952
$$ -52933 -478961 76793 269768 -67327 103332 42268 -85963 -109502 -337418 -241044 168952
10106a45697f5278l0965m7525C1309a39750d581l73664a33601B7474e7801A89395
$$ -145697 -65278 -96243 -143768 31309 -139750 -4581 -378245 -133601 27474 -57801 189395
10094E5905g2903o9731j16561r7671h3504l0808k90269J65964F3001a41359H8049
$$ 55905 -72903 -142634 -259195 -356866 -83504 -114312 -404581 -238617 63001 -141359 88049
10082A4404l993a18252G831A617K90186c75066a17111p5598q4787a09995j4635
$$ 14404 10411 -118252 7831 1617 291803 -375066 -117111 -192709 -277496 -109995 -124630
10071a24630l31246K21756p1304H0152B0628L4388L6072b98274J42828j11814
$$ -124630 -455876 -234120 -305424 80152 20628 55016 91088 -298274 -155446 -267260
10061b67260J30739M5021I1852K0566C0210b79546e7579B9968g8752k55056J60292
$$ -267260 -136521 -91500 91852 112418 30210 -279546 -57579 29968 -78752 -333808 -173516
10050a73516l3210P4527k27068J52652k39907a42441i255j7942D7050R1061a57452
$$ -173516 -206726 -132199 -359267 -206615 -446522 -142441 -9255 -27197 47050 138111 -157452
10038b24695j7118O6830H0992J6420m6927c79109j9137J68753F0032a16988B0338
$$ -224695 -241813 -174983 80992 97412 50485 -379109 -398246 -229493 60032 -116988 20338
10026b16602D1711K20863c93322f5887h772H721J45088a99159f8372b470H7709
$$ -216602 41711 262574 -393322 -65887 -8772 8721 153809 -199159 -68372 -2470 87709
10014c31529K1173F8935a09367A2759K04636b18509i0096j83924b2418e867k24482
$$ -331529 -310356 68935 -109367 12759 217395 -218509 -90096 -274020 -22418 -5867 -230349
10003b30349K8756B4819J62972b94123B4601a43871j72968a40007A34474k5460
$$ -230349 -201593 24819 187791 -294123 24601 -143871 -316839 -140007 134474 109014
9993A09014a94740I1441a32512k41269Q5636A16674b23629C7128b86178B35772
$$ 109014 -194740 91441 -132512 -373781 -288145 116674 -223629 37128 -286178 235772
9982f5398A09280j5624b34466J10576m5674J7035B8605d9542B76667e2079k62793
$$ -65398 109280 93656 -234466 -123890 -169564 -152529 28605 -49542 276667 -52079 -314872
9971c14872A71952Q3366C0198O4981A3568c66209H9061i9586A63549K02458i7948
$$ -314872 171952 255318 30198 95179 13568 -366209 89061 -99586 163549 366007 -97948
9959d2163E28c0000a910H4663b919E5536d3646k09225k89406a69188m3351I6795
$$ -42163 528 -30000 -1910 84663 -2919 55536 -43646 -252871 -542277 -169188 -212539 96795
9946b2728F2112a26012M8501A91074b23069B5464g6797F8207c4843j58941E2581
$$ -22728 62112 -126012 -77511 191074 -223069 25464 -76797 68207 -34843 -193784 52581
9934a76749j1935O0374o5667h2175K2109j63701E6438a04521K1120o1540k067
$$ -176749 -188684 -128310 -193977 -82175 -60066 -223767 56438 -104521 -83401 -144941 -147008
9923a47008C41502a43206o7487l3788a9443r5885k311A67708b37463A29256j9426
$$ -147008 341502 -143206 -210693 -244481 -19443 -115328 -117639 167708 -237463 129256 109830
9912A09830Q6653b69143J26513H3843a61588a1595A60958G4867R7529E1771K19633
$$ 109830 196483 -269143 -142630 83843 -161588 -11595 160958 74867 172396 51771 271404
9901B71404e0345r6106l22272A85679H7311k7588A5887N997a89179a2231A12375
$$ 271404 -50345 -146451 -468723 185679 87311 59723 15887 21884 -189179 -12231 112375
9889A71087a75124C471b54959A42374h4326j80069B04318o0104a40411A20137
$$ 171087 -175124 3471 -254959 142374 -84326 -264395 204318 144214 -140411 120137
9878c46049b0390m4074F9412k0380Q688a29484o0641j32806J50750P5928A7854
$$ -346049 -20390 -64464 69412 49032 57720 -129484 -190125 -322931 -172181 -96253 17854
9866a45553A5202P6622c72601k7466a71318j38154m8367E3499c17657a28345G9968
$$ -145553 15202 91824 -372601 -400067 -171318 -309472 -357839 53499 -317657 -128345 79968
9854a60646A22073D4428b17993D100R7468e4038G3605c53681A61454l0905j8735
$$ -160646 122073 44428 -217993 4100 101568 -54038 73605 -353681 161454 130549 111814
9843A11814n2783a24663e816B7286M5088C0712b38933A51960G0429e9876j25542
$$ 111814 59031 -124663 -5816 27286 72374 30712 -238933 151960 70429 -59876 -185418
9832a85418O3128j8294o2430J0691K0371A12995a55191r988A45980a24228J4278
$$ -185418 -122290 -140584 -203014 -192323 -171952 112995 -155191 -165179 145980 -124228 -109950
9821a09950k91773J87992B0853K92903a50501O1828A44629f8157j42818g5320
$$ -109950 -401723 -213731 20853 313756 -150501 -88673 144629 -68157 -210975 -75320
9810a01566j47818F2360b25735B3044a10221E7357a38337B2756a57269k23273
$$ -101566 -249384 62360 -225735 23044 -110221 57357 -138337 22756 -157269 -380542
9800c80542e1611H9494M5375a59786m1355G8429g3164D3059b23633B77184B0878
$$ -380542 -51611 89494 134869 -159786 -201141 78429 -73164 43059 -223633 277184 20878
9788b2348A50760F2294e013l90000C9123b46964k6741a06213A54264b6628m0357
$$ -22348 150760 62294 -5013 -395013 39123 -246964 -273705 -106213 154264 -26628 -66985
9777f6985l20602J30735D638b28887A1126N3008g8493A60037K74514d993k75012
$$ -66985 -387587 -256852 4638 -228887 11126 64134 -78493 160037 434551 -4993 -280005
9766b80005A57865b43801m3128C594b01232m021j81125G8382g3734k3080B85060
$$ -280005 157865 -243801 -286929 3594 -201232 -205253 -386378 78382 -73734 -96814 285060
9754b12373p0890e5590j1843j90055A66263a90049j04802e2965j78347c0593m20390
$$ -212373 -283263 -55590 -67433 -257488 166263 -190049 -294851 -52965 -231312 -30593 -450983
9743d50983h5441m7990D2211K40436a39101f8723l172F6048J51442b16586d8406
$$ -450983 -85441 -133431 42211 282647 -139101 -68723 -71895 66048 217490 -216586 -48406
9731b55113e1294l00904J70515j37774d6091C27285h0314G5440a4681k6130C1432
$$ -255113 -51294 -352198 -181683 -319457 -46091 327285 -80314 75440 -14681 -40811 31432
9719f5032A50857m9954b8281j14656L4243D4300c770A46213a75439P0143j38102
$$ -65032 150857 100903 -28281 -142937 -108694 44300 -3770 146213 -175439 -105296 -243398
9708b43398b0370A12045H928Q687K03811a6597k95574G440c11847i6108B5476
$$ -243398 -20370 112045 8928 17615 221426 -16597 -312171 7440 -311847 -96108 25476
9696A18884h2783I2377a59754f0328G5150a06706c8540m9306k86081J73232l9625
$$ 118884 -82783 92377 -159754 -60328 75150 -106706 -38540 -87846 -373927 -200695 -240320
9685b40320A70827B2061j331J00980b36489J7205c1889k14288J18398I2525e2245
$$ -240320 170827 22061 20730 121710 -236489 -219284 -31889 -246177 -127779 92525 -52245
9673b36459G1900a18384j67857A44166b75568A86599h0928k1342H1435b54339
$$ -236459 71900 -118384 -286241 144166 -275568 186599 -80928 -102270 81435 -254339
9662a65355k92851g162A2122a74397F5993d1029A05246c97714a03184n9943m7672
$$ -165355 -458206 -7162 12122 -174397 65993 -41029 105246 -397714 -103184 -163127 -210799
9651b10799B11018b1532l83979p8285A74836a3600H4504O8318J44276a96122d020
$$ -210799 211018 -21532 -405511 -483796 174836 -13600 84504 152822 297098 -196122 -4020
9639h8808r2074B8686a00871k93421h8617G5518i2773A1875a21884p9359d0233
$$ -88808 -180882 28686 -100871 -394292 -88617 75518 -92773 11875 -121884 -201243 -40233
9627c24775a3416G4691e3521l65403g0299A03107a90222B0055J46137a60994B20301
$$ -324775 -13416 74691 -53521 -418924 -70299 103107 -190222 20055 166192 -160994 220301
9615b4953k1257j40963A05600R377b45885A16110h6237J6072k21112j60837I5077
$$ -24953 -46210 -187173 105600 114977 -245885 116110 -86237 -70165 -291277 -452114 95077
9603b62282f0865Q648j01821B7445i5589G4043b47372j05949A87412g2751k17673
$$ -262282 -60865 -52217 -154038 27445 -95589 74043 -247372 -353321 187412 -72751 -290424
9592b90424e6602A1720J93260q1311a33015D9582g1766J0942j75480R7563O6287
$$ -290424 -56602 11720 204980 123669 -133015 49582 -71766 -60824 -236304 -138741 -72454
9581g2454A44857b77585H224b05888H5428c35106K5312F9337b69084G3619K11088
$$ -72454 144857 -277585 8224 -205888 85428 -335106 -309794 69337 -269084 73619 284707
9570B84707e6110B6956a54162k157K293j39092C54141b24495L8695Q4547A27750
$$ 284707 -56110 26956 -154162 -156319 -154026 -293118 354141 -224495 -185800 -101253 127750
9558c1261C72402a1848j23353A09311b18364n5860B40259c9100j19392j10946
$$ -31261 372402 -11848 -135201 109311 -218364 -274224 240259 -39100 -158492 -269438
9548b69438B254a80524G2817O2100e2248i831D4065L30757A77175b08582j2653
$$ -269438 2254 -180524 72817 134917 -52248 -9831 44065 374822 177175 -208582 -221235
9537b21235J08749A4682b8318A6436B262a71758H0649P2589E1004J65038Q8629
$$ -221235 -112486 14682 -28318 16436 2262 -171758 80649 153238 51004 216042 304671
9526C04671H7821g9123P663k46259J07416j46352A6945a71042A37144K01836i7192
$$ 304671 87821 -79123 -71460 -317719 -210303 -356655 16945 -171042 137144 338980 -97192
9514c29313C24848E6815a20050C27004b9893l56978B07333e9990A46516m7006
$$ -329313 324848 56815 -120050 327004 -29893 -386871 207333 -59990 146516 99510
9504I9510a83194D16191a62403G8338J87551j32607a45505m4127Q8259B9861a24235
$$ 99510 -183194 416191 -162403 78338 265889 133282 -145505 -189632 -101373 29861 -124235
9492a40829E9120f2160o0710K329j45318H065a34451A20736h5512j36046d0576
$$ -140829 59120 -62160 -122870 -120541 -265859 8065 -134451 120736 -85512 -221558 -40576
9480c1283j72870N5336H5224R8308B6982a04446d9690A00671A2740b03412g2936
$$ -31283 -204153 -148817 85224 183532 26982 -104446 -49690 100671 12740 -203412 -72936
9468a72762f8324G6311J50191H3677i7931B22720B3933b3066j63771e6288B67748
$$ -172762 -68324 76311 226502 83677 -97931 222720 23933 -23066 -186837 -56288 267748
9456d0300q3108A07947a65310G7146B5136O1515a23973k20456A99848K0092a09730
$$ -40300 -123408 107947 -165310 77146 25136 86651 -123973 -344429 199848 219940 -109730
9444c348k17750M9643m2897B9669i9137j56268c5765j32298A04457b08354e3675
$$ -3348 -221098 -171455 -214352 29669 -99137 -255405 -35765 -168063 104457 -208354 -53675
9432f154j40086H8179l522a43359O3147l80275I6035K8425e185k09527Q6663G2961
$$ -6154 -146240 88179 84657 -143359 -80212 -460487 96035 124460 -5185 -214712 -128049 72961
9419E438b10226R9303j0351k685r90r1493G7463a17170c7177m976I2298c93559
$$ 5438 -210226 -110923 -121274 -123959 -124949 -216442 77463 -117170 -37177 -42153 92298 -393559
9406b78740P5972j22477h7646n2190j64971B16639j3603a07370c8026j29328L4795
$$ -278740 -202768 -325245 -87646 -139836 -304807 216639 203036 -107370 -38026 -167354 -132559
9395a32559B37276B7479e3348l9759a8253j94121j52014a2375B1876Q3990R3384
$$ -132559 237276 27479 -53348 -93107 -18253 -212374 -364388 -12375 21876 105866 199250
9384A99250c31024a45073f3157b5652A9737g4885l61152b9229C29273a42284A32391
$$ 199250 -331024 -145073 -63157 -25652 19737 -74885 -436037 -29229 329273 -142284 132391
9372g1114b7137J1237l9536k08518i1397A51059a9952O427k30946l0246a14076
$$ -71114 -27137 -15900 -55436 -263954 -91397 151059 -19952 -13525 -244471 -274717 -114076
9360A09100a7715q8177l08893f6380J4038A0983b54679B06879I9057b55975I637
$$ 109100 -17715 -105892 -414785 -66380 -52342 10983 -254679 206879 99057 -255975 9637
9348B262b3141k96175h3724I6221N253a54772l1767H2285a49283O6012l84216
$$ 2262 -23141 -319316 -83724 96221 101474 -154772 -186539 82285 -149283 -83271 -467487
9337d67487a57623A4711a6864l23949J1172J64158q370A74098c6085m11910J16498
$$ -467487 -157623 14711 -16864 -340813 -329641 -165483 -173853 174098 -36085 -447995 -331497
9326c31497h3944d1151J832j64656A05904a67056B20021H88N1771c74780a50143
$$ -331497 -83944 -41151 -39319 -203975 105904 -167056 220021 888 52659 -374780 -150143
9314f2426j59977k55068A28467k6203N8875b05383O6934d9250m3261d1392p3344
$$ -62426 -222403 -477471 128467 102264 161139 -205383 -138449 -49250 -92511 -41392 -114736
9303a14736A2081b08946A9401h5488n7617B22857a01054L6820k11760d2718k9546
$$ -114736 12081 -208946 19401 -85488 -143105 222857 -101054 -64234 -275994 -42718 -72264
9292g2264A668Q514b87027i1910M0430j88015A20761c10460J37286E7309J61731
$$ -72264 1668 10182 -287027 -91910 -51480 -239495 120761 -310460 -173174 57309 219040
9281B19040p1143D4668g9696D1287P4586c52031A69934a90842A22222a37784b1599
$$ 219040 147897 44668 -79696 41287 115873 -352031 169934 -190842 122222 -137784 -21599
9269a06709L064p8511e5013a0597a875B3908b58289J3726c4980j47457F483a82722
$$ -106709 -103645 -182156 -55013 -10597 -1875 23908 -258289 -244563 -34980 -182437 6483 -182722
9256a70458a6205m7567j06536A25474a47690C1569a96330A39589a2529k19388
$$ -170458 -16205 -63772 -170308 125474 -147690 31569 -196330 139589 -12529 -231917
9246b31917K9249B10845a01024q1013H8399b08056d8795k75871i4165n95j60656
$$ -231917 -202668 210845 -101024 -182037 88399 -208056 -48795 -324666 -94165 -94760 -255416
9235b55416f2761r4335N3614G0351b75942G1723O7940A6666c7285m5113m3254
$$ -255416 -62761 -157096 -103482 70351 -275942 71723 139663 16666 -37285 -82398 -125652
9224a25652L8o226a4751j23574J8636B66333A5037b91726A2299g9107A25769B2103
$$ -125652 -125614 -131840 -14751 -138325 -119689 266333 15037 -291726 12299 -79107 125769 22103
9211a17433B2820J43889c29342A3980a25423B0659a62928L7536A6885J85429i3736
$$ -117433 22820 166709 -329342 13980 -125423 20659 -162928 -125392 16885 202314 -93736
9199a40419q4307h2723j02215Q2824G2484b46080c365j04048c7704n8029C85137
$$ -140419 -224726 -82723 -184938 -102114 72484 -246080 -3365 -107413 -37704 -95733 385137
9187a23489m092j12816f5943j5230E2103a68521k02975a07110A5763a79581A66466
$$ -123489 -127581 -240397 -65943 -81173 52103 -168521 -371496 -107110 15763 -179581 166466
9175g376A46806C5383c330A9770J91806f7354l2764r5237A50133a07019G2019
$$ -7376 146806 35383 -3330 19770 211576 -67354 -100118 -195355 150133 -107019 72019
9163F0222b08015A4250K6572a02045d761e30j20226I8528b03709J8432L576A55126
$$ 60222 -208015 14250 40822 -102045 -4761 -530 -120756 98528 -203709 -185277 -181701 155126
9150b33933E8732a46515A1749L4284N955R4860a66804A42167J7364A751J1311
$$ -233933 58732 -146515 11749 46033 51988 146848 -166804 142167 159531 1751 13062
9139A3062a19905o9521K1362B6166I139L9037k3773b86190B82993c1537A94732
$$ 13062 -119905 -189426 -168064 26166 9139 48176 24403 -286190 282993 -31537 194732
9127b3786M446p9545j90467j01820J19263A53148c21449l0862D62577d9974A08415
$$ -23786 -19340 -98885 -289352 -391172 -271909 153148 -321449 -352311 462577 -49974 108415
9115a37097l64976c8956k29061R6251n1295f4415C74017b5987o0787j98460D0613
$$ -137097 -502073 -38956 -268017 -171766 -223061 -64415 374017 -25987 -86774 -285234 40613
9103A97264D474b97999J38442b8683j05231j21255A01113b35664d4614j73178
$$ 197264 4474 -297999 -159557 -28683 -133914 -255169 101113 -235664 -44614 -217792
9093b17792m1767A24993g9904b9604J3870p8083B32241c1147k61530E3868L8342
$$ -217792 -259559 124993 -79904 -29604 -15734 -93817 232241 -31147 -292677 53868 92210
9082I2210b42015A05228b02664D7637i7724C5796a02155k1712D5777K4330a1986
$$ 92210 -242015 105228 -202664 47637 -97724 35796 -102155 -123867 45777 70107 -11986
9070I4173g4887j89574B90174q6547K2547e7409k03868A79731a51316k16536A11549
$$ 94173 -74887 -264461 290174 203627 226174 -57409 -261277 179731 -151316 -367852 111549
9058d3205A11774c7478B34883g8003B11941B5379J21342k9082r783a99166B82641
$$ -43205 111774 -37478 234883 -78003 211941 25379 146721 117639 107856 -199166 282641
9046h5940K9024k66793A22178a61949M3947M7679k4564c5055j00732j3969j71047
$$ -85940 -56916 -323709 122178 -161949 -118002 -70323 -94887 -35055 -135787 -149756 -320803
9035c20803I1411d936j57148A27771C5873a57725k59707A10388B9138c05283H4110
$$ -320803 91411 -4936 -162084 127771 35873 -157725 -417432 110388 29138 -305283 84110
9023a17759B6039K3327d52304E791P4820a50415r5349a9934A2066P0302N2525
$$ -117759 26039 49366 -452304 5791 80611 -150415 -245764 -19934 12066 82368 134893
9012A34893f3072k3908A86669b83249A40370K0771h2534B69248f3288A1269b28671
$$ 134893 -63072 -86980 186669 -283249 140370 161141 -82534 269248 -63288 11269 -228671
9000f7750d374H4486a61111E8948g3602A04932C32g1078o0285j0382L2121J1192
$$ -67750 -4374 84486 -161111 58948 -73602 104932 332 -71078 -131363 -141745 -109624 -98432
8988i8432j91572B0230i8764D768d1675r7625d0950A03079a95584k1846j36549
$$ -98432 -290004 20230 -98764 4768 -41675 -139300 -40950 103079 -195584 -217430 -353979
8977c53979A79766E2558b15763N3228q8125o1448p3230a42487b1282C8328J7842
$$ -353979 179766 52558 -215763 -162535 -250660 -312108 -385338 -142487 -21282 38328 56170
8966E6170a00143A57297a21250M1381A05618b30282N2204J9110D509k025a85090
$$ 56170 -100143 157297 -121250 -79869 105618 -230282 -178078 -158968 4509 2484 -185090
8954I2564a74145m7313K4107H595K2000e9257o461D2145b66471k42747F3089f8414
$$ 92564 -174145 -221458 -197351 8595 30595 -59257 -65718 42145 -266471 -509218 63089 -68414
8941a98989F7818K42856a11754F5349a40352e7669j05574I1317c116j8934B59922
$$ -198989 67818 310674 -111754 65349 -140352 -57669 -163243 91317 -3116 -22050 259922
8929I0725a89635A1247b82961C4790J23367K65091j76551j4753L14366J049208
$$ 90725 -189635 11247 -282961 34790 158157 423248 246697 231944 546310 1595518
8919A595518M436475j354420A024694B47810G4498J98042c0291j24011A27253
$$ 1595518 6031993 4677573 1024694 247810 74498 272540 -30291 -154302 127253
8909a6275k92860a7028b958j05580k4265J3539k1597j48994J26355e2882q8981
$$ -16275 -309135 -17028 -2958 -108538 -132803 -119264 -140861 -289855 -163500 -52882 -141863
8898a41863A94484b55068J7419a3869k88390A65856a79704p0890G8086O1709Q2169
$$ -141863 194484 -255068 -237649 -13869 -302259 165856 -179704 -250594 78086 139795 221964
8887B21964p8969c1417j3959j5119G4026N0657b59707C10893a03452c9305p8963
$$ 221964 142995 -31417 -45376 -60495 74026 124683 -259707 310893 -103452 -39305 -118268
8876a18268E9352k6488c5376j65454Q0150i375I9466c15794F5101b41017E0782
$$ -118268 59352 32864 -35376 -200830 -120680 -9375 99466 -315794 65101 -241017 50782
8864c05249e3523I995d14446a24561H5189J12654F0441a23946J9595k51987A88804
$$ -305249 -53523 9995 -414446 -124561 85189 197843 60441 -123946 -104351 -356338 188804
$$ [...]
##END NTUPLES=NMR SPECTRUM
##END=
