
##TITLE=AC1307_DOMAH11119_6534107_NLFMx5iIHR
##JCAMPDX= 6.0         $$ Bruker NMR JCAMP-DX V2.0
##DATA TYPE= NMR SPECTRUM
##DATA CLASS= NTUPLES
##ORIGIN= BRUKER
##OWNER= Administrator
$$ 1.72 TOPSPIN		Version 2.1
$$ 2012-07-18 03:38:54.312 -0500  Administrator@TOPSPIN
$$ Compression mode = diff/dup
##.OBSERVE FREQUENCY= 400.02188249412
##.OBSERVE NUCLEUS= ^1H
##.ACQUISITION MODE= SIMULTANEOUS (DQD)
##.ACQUISITION SCHEME= undefined
##.AVERAGES= 64
##.DIGITISER RES= 22
##SPECTROMETER/DATA SYSTEM= spect
##.PULSE SEQUENCE= noesygpps1d.comp
##.SOLVENT NAME= COFFEE_meoh
##.SHIFT REFERENCE= INTERNAL, COFFEE_meoh, 1, 14.96081
##AUDIT TRAIL= $$ (NUMBER, WHEN, WHO, WHERE, PROCESS, VERSION, WHAT)
$$ ##TITLE= Audit trail, TOPSPIN		Version 2.1
$$ ##JCAMPDX= 5.01
$$ ##ORIGIN= Bruker BioSpin GmbH
$$ ##OWNER= Administrator
$$ $$ C:\Bruker\TOPSPIN/data/COFFEE/nmr/AC1307_DOMAH11119_6534107_NLFMx5iIHR/32/pdata/1/auditp.txt
$$ ##AUDIT TRAIL=  $$ (NUMBER, WHEN, WHO, WHERE, PROCESS, VERSION, WHAT)
(   1,<2012-07-18 03:38:49.671 -0500>,<Administrator>,<TOPSPIN>,<go>,<TOPSPIN 2.1>,
      <created by zg
	started at 2012-07-18 03:27:19.234 -0500,
	POWCHK enabled, PULCHK disabled,
       configuration hash MD5:
       6B 1B 68 BB D9 2E 58 E2 7F 35 AD 54 07 DF 0E 41
       data hash MD5: 64K
       61 5C 9F 18 34 32 36 56 15 4A 36 BC 06 83 65 66>)
(   2,<2012-07-18 03:38:52.453 -0500>,<Administrator>,<TOPSPIN>,<proc1d>,<TOPSPIN 2.1>,
      <Start of raw data processing
       efp LB = 0.3 FT_mod = 6 PKNL = 1 PHC0 = 0 PHC1 = 0 SI = 128K 
       data hash MD5: 128K
       5B 33 72 57 CD 81 66 10 24 99 40 43 17 62 C9 E0>)
(   3,<2012-07-18 03:38:53.562 -0500>,<Administrator>,<TOPSPIN>,<proc1d>,<TOPSPIN 2.1>,
      <pk PHC0 = 2.158813 PHC1 = 0 
       data hash MD5: 128K
       72 32 4E B5 B6 50 F6 C7 C3 72 95 06 1C 42 72 25>)
(   4,<2012-07-18 03:38:53.796 -0500>,<Administrator>,<TOPSPIN>,<proc1d>,<TOPSPIN 2.1>,
      <abs ABSG = 1 
       data hash MD5: 128K
       F9 A5 F0 30 28 8E 40 56 E7 8D 33 E5 9F 8A 26 17>)
(   5,<2012-07-18 03:38:53.859 -0500>,<Administrator>,<TOPSPIN>,<proc1d>,<TOPSPIN 2.1>,
      <abs ABSG = 2 
       data hash MD5: 128K
       EA A5 35 75 F1 19 8F 8E 6D B4 AE 42 60 58 96 37>)
(   6,<2012-07-18 03:38:54.000 -0500>,<Administrator>,<TOPSPIN>,<proc1d>,<TOPSPIN 2.1>,
      <abs ABSG = 3 
       data hash MD5: 128K
       0E 2F 63 58 9A B5 B0 D6 45 62 2D 86 24 1E 06 67>)
(   7,<2012-07-18 03:38:54.171 -0500>,<Administrator>,<TOPSPIN>,<proc1d>,<TOPSPIN 2.1>,
      <abs ABSG = 4 
       data hash MD5: 128K
       0C 9F 44 B6 BA 4D 39 3B E7 0F 57 25 A8 07 82 C1>)
(   8,<2012-07-18 03:38:54.234 -0500>,<Administrator>,<TOPSPIN>,<proc1d>,<TOPSPIN 2.1>,
      <abs ABSG = 5 
       data hash MD5: 128K
       6F 3D D1 29 59 DF 24 19 48 E2 F7 2B 31 99 7F DB>)
$$ ##END=
$$ 
$$ $$ hash MD5
$$ $$ 34 EF D3 D3 62 D7 82 82 A4 1D FC 65 F6 DF 6E BC
##$RELAX= 
##$RELAX= 
##$RELAX= 
##$RELAX= 
##$RELAX= 
##$RELAX= 
##$RELAX= 
##$RELAX= 
$$ Bruker specific parameters
$$ [...]
150 150 150 150 150 150 150 150
##$TP07= 0
##$TPNAME0= <>
##$TPNAME1= <>
##$TPNAME2= <>
##$TPNAME3= <>
##$TPNAME4= <>
##$TPNAME5= <>
##$TPNAME6= <>
##$TPNAME7= <>
##$TPOAL= (0..7)
0.5 0.5 0.5 0.5 0.5 0.5 0.5 0.5
##$TPOFFS= (0..7)
0 0 0 0 0 0 0 0
##$TUNHIN= 0
##$TUNHOUT= 0
##$TUNXOUT= 0
##$USERA1= <user>
##$USERA2= <user>
##$USERA3= <user>
##$USERA4= <user>
##$USERA5= <user>
##$V9= 5
##$VALIST= <valist>
##$VCLIST= <CCCCCCCCCCCCCCC>
##$VD= 0
##$VDLIST= <DDDDDDDDDDDDDDD>
##$VPLIST= <PPPPPPPPPPPPPPP>
##$VTLIST= <TTTTTTTTTTTTTTT>
##$WBST= 2048
##$WBSW= 25
##$XGAIN= (0..3)
0 0 0 0
##$XL= 0
##$YL= 0
##$YMAX_a= 11184495
##$YMIN_a= -8578577
##$ZGOPTNS= <>
##$ZL1= 120
##$ZL2= 120
##$ZL3= 120
##$ZL4= 120
##$ABSF1= 14.96081
##$ABSF2= -5.597372
##$ABSG= 5
##$ABSL= 3
##$ALPHA= 0
##$AQORDER= 0
##$ASSFAC= 0
##$ASSFACI= 0
##$ASSFACX= 0
##$ASSWID= 0
##$AUNMP= <proc_prof1d_extract.lims>
##$AXLEFT= 0
##$AXNAME= <>
##$AXNUC= <1H>
##$AXRIGHT= 0
##$AXTYPE= 0
##$AXUNIT= <>
##$AZFE= 0.1
##$AZFW= 0.1
##$BCFW= 0
##$BC_mod= 0
##$BYTORDP= 0
##$COROFFS= 0
##$CY= 15
##$DATMOD= 1
##$DC= 0
##$DFILT= <>
##$DTYPP= 0
##$F1P= 0
##$F2P= 0
##$FCOR= 0.5
##$FTSIZE= 131072
##$FT_mod= 6
##$GAMMA= 0
##$GB= 0
##$INTBC= 1
##$INTSCL= 1
##$ISEN= 128
##$LB= 0.3
##$LEV0= 0
##$LPBIN= 0
##$MAXI= 10000
##$MC2= 0
##$MEAN= 0
##$ME_mod= 0
##$MI= 0
##$NCOEF= 0
##$NC_proc= -2
##$NLEV= 6
##$NOISF1= 0
##$NOISF2= 0
##$NSP= 0
##$NTH_PI= 0
##$NZP= 0
##$OFFSET= 14.96081
##$PC= 1
##$PHC0= 2.158813
##$PHC1= 0
##$PH_mod= 1
##$PKNL= yes
##$PPARMOD= 0
##$PPDIAG= 0
##$PPIPTYP= 0
##$PPMPNUM= 2147483647
##$PPRESOL= 1
##$PSCAL= 4
##$PSIGN= 0
##$PYNMP= <proc.py>
##$REVERSE= no
##$SF= 400.02000971271
##$SI= 131072
##$SIGF1= 0
##$SIGF2= 0
##$SINO= 400
##$SIOLD= 131072
##$SPECTYP= <>
##$SREGLST= <1H.CDCl3>
##$SSB= 0
##$STSI= 131072
##$STSR= 0
##$SW_p= 8223.68421052631
##$SYMM= 0
##$S_DEV= 0
##$TDeff= 65536
##$TDoff= 0
##$TI= <>
##$TILT= no
##$TM1= 0
##$TM2= 0
##$TOPLEV= 0
##$USERP1= <user>
##$USERP2= <user>
##$USERP3= <user>
##$USERP4= <user>
##$USERP5= <user>
##$WDW= 1
##$XDIM= 131072
##$YMAX_p= 431994224
##$YMIN_p= -11932
##$CURPLOT= <Network HP LaserJet P1505>
##$CURPRIN= <$Network HP LaserJet P1505>
##$DFORMAT= <normdp>
##$LAYOUT= <+/1D_H.xwp>
##$LFORMAT= <normlp>
##$PFORMAT= <normpl>
##$SURQMSG= 1
$$ End of Bruker specific parameters
$$ ---------------------------------
##NTUPLES= NMR SPECTRUM
##VAR_NAME=  FREQUENCY,     SPECTRUM/REAL,   SPECTRUM/IMAG
##SYMBOL=    X,             R,               I
##VAR_TYPE=  INDEPENDENT,   DEPENDENT,       DEPENDENT
##VAR_FORM=  AFFN,          ASDF,            ASDF
##VAR_DIM=   131072,        131072,          131072
##UNITS=     HZ,            ARBITRARY UNITS, ARBITRARY UNITS
##FACTOR=    0.0627417313425164, 1,          1
##FIRST=     8223.62146879497, 1252,         -55732
##LAST=      0,             2677,            -55754
##MIN=       0,             -11932,          0
##MAX=       8223.62146879497, 431994224,    0
$$ Real data points
##PAGE= N=1
##DATA TABLE= (X++(R..R)), XYDATA
$$ [...]
63986B90693L028L174L431M174M969N256N192N331N821O444P138P936Q629R078
$$ 290693 293721 296895 300326 304500 309469 314725 319917 325248 331069 337513 344651 352587 361216 370294
63972C70294R673J0810J2050J2566J2389J2480J3385J4615J5639J6772J8518K0596
$$ 370294 379967 390777 402827 415393 427782 440262 453647 468262 483901 500673 519191 539787
63960E39787K2297K3507K4826K6787K9419L2522L6005M0041M5170N2027O0639
$$ 539787 562084 585591 610417 637204 666623 699145 735150 775191 820361 872388 933027
63949I33027P0210Q0068R0774J03653J19114J35927J52293J67224J80624J92511
$$ 933027 1003237 1083305 1174079 1277732 1396846 1532773 1685066 1852290 2032914 2225425
63939B225425K02647K10743K16544K19594K19124K14181K03777J87198J64684
$$ 2225425 2428072 2638815 2855359 3074953 3294077 3508258 3712035 3899233 4063917
63930D063917J37753J08380P7727M5903J3041k0038n2486q4177j15091j44116
$$ 4063917 4201670 4310050 4387777 4433680 4446721 4426683 4374197 4290020 4174929 4030813
63920D030813j69136j88430k01587k09141k11898k10802k06780k00270j91148
$$ 4030813 3861677 3673247 3471660 3262519 3050621 2839819 2633039 2432769 2241621
63911B241621j79435j65867j51485j36908j22351j08047r4353q1593p0131o0502
$$ 2241621 2062186 1896319 1744834 1607926 1485575 1377528 1283175 1201582 1131451 1070949
63901A070949n3068m7587m3382l9808l6485l3236l0179k7643k5718k4042k2384
$$ 1070949 1017881 970294 926912 887104 850619 817383 787204 759561 733843 709801 687417
63890F87417k1141k0776k0874k0387j8875j6914j5224j3869j2535j1106r654q174
$$ 687417 666276 645500 624626 604239 585364 568450 553226 539357 526822 515716 506062 497888
63878D97888o600m929l110j085R67K688M001N185O387P355P871Q157Q612R326
$$ 497888 491288 486359 483249 482164 483131 485819 489820 495005 501392 508747 516618 524775 533387 542713
63864E42713J0103J0700J0847J0265R017P661O723O062N051L375J431j22j065
$$ 542713 552816 563516 574363 584628 593645 601306 608029 614091 619142 622517 623948 623826 622761
63851F22761j892l363n664q069r667j0425j1133j2219j3134j3269j3034j3326
$$ 622761 620869 617506 611842 603773 594106 583681 572548 560329 547195 533926 520892 507566
63839E07566j4213j4871j4874j4797j5269j5938j5908j4867j3324j1948j1067
$$ 507566 493353 478482 463608 448811 433542 417604 401696 386829 373505 361557 350490
63828C50490j0754j0830j0769r995q609p479p277p563p264o031m699m202m477
$$ 350490 339736 328906 318137 308142 299533 292054 284777 277214 269950 263919 259220 255018 250541
63815B50541m777m743m656m636m254l175j799q91o92p91p34m51r9K17M10L51o
$$ 250541 245764 241021 236365 231729 227475 224300 222501 221610 220918 220127 219393 218942 218843 219060 219470 219821 219815
63798B19815m69q00r91j233j560j707j425q68n21o27r70j228j375j491j449j117
$$ 219815 219346 218546 217555 216322 214762 213055 211630 210762 210241 209614 208644 207416 206041 204550 203101 201984
63782B01984p78q94j367j572j246r21j161j712j923j666j376j251j037o11k88
$$ 201984 201206 200312 198945 197373 196127 195206 194045 192333 190410 188744 187368 186117 185080 184469 184181
63767A84181l09m01j89K43M14M5o48j147j073n01O1R7m07r74j178r90n71J1O52
$$ 184181 183872 183471 183282 183525 183939 183984 183336 182189 181116 180615 180676 180773 180366 179392 178214 177224 176653 176664 177316
63748A77316J072J088R08Q75J041J232J440J827K336K643K577K296J987J754J766
$$ 177316 178388 179476 180384 181259 182300 183532 184972 186799 189135 191778 194355 196651 198638 200392 202158
63733B02158K207K834L029K544J904J706J890K085K352L009L843M247M116M024
$$ 202158 204365 207199 210228 212772 214676 216382 218272 220357 222709 225718 229561 233808 237924 241948
63719B41948M278M428M045L474L332L604L689L160K074O69q14k054k820l182l327
$$ 241948 246226 250654 254699 258173 261505 265109 268798 271958 274032 274701 273887 271833 269013 265831 262504
63704B62504l225k778k182j770j582j410j256j300j384j043j97O06Q97R04J155
$$ 262504 259279 256501 254319 252549 250967 249557 248301 247001 245617 244574 244377 244983 245880 246784 247939
63689B47939J742K335K764L129L440L486L242L006K955K776K005O86n09q62k15
$$ 247939 249681 252016 254780 257909 261349 264835 268077 271083 274038 276814 278819 279505 278996 278134 277919
63674B77919R72J951K101J380N00L94J215K077K189J939K312L287L644K556O47
$$ 277919 278891 280842 282943 284323 284823 285217 286432 288509 290698 292637 294949 298236 301880 304436 305083
63659C05083j003k213l398m502n061n171n456o092o566o462n861m885l550k271
$$ 305083 304080 301867 298469 293967 288906 283735 278279 272187 265621 259159 253298 248413 244863 242592
63645B42592j762k105k464k102j202l26L81J049J593J923K265K750K992K640K119
$$ 242592 240830 238725 236261 234159 232957 232631 233012 234061 235654 237577 239842 242592 245584 248224 250343
63630B50343K220L080M092M760N135N461N857O419P176P865Q171Q258Q655R539
$$ 250343 252563 255643 259735 264495 269630 275091 280948 287367 294543 302408 310579 318837 327492 337031
63616C37031J0506J1302J2332J4143J6651J9193K1249K2822K4213K5634K7145
$$ 337031 347537 358839 371171 385314 401965 421158 442407 465229 489442 515076 542221
63605E42221K8696L0095L0939L0669K8833K5347K0477J4605Q179J941l021n844
$$ 542221 570917 601012 631951 662620 691453 716800 737277 751882 760061 762002 758981 753137
63593G53137o594o218n767n762o302p410r120j1395j4185j7425k0777k3510k4939
$$ 753137 746543 740325 734558 728796 722494 715084 705964 694569 680384 662959 642182 618672 593733
63580E93733k5009k4177k2740k0637j8032j5665j4139j3100j1643r496p287n465
$$ 593733 568724 544547 521807 501170 483138 467473 453334 440234 428591 419095 411808 406343
63568D06343l689j578M21J605K178L129M905O792P807P766P262P046P583Q888
$$ 406343 402654 401076 401497 403102 405280 408409 413314 420106 427913 435679 442941 449987 457570 466458
63554D66458J0496J1848J2935J4331J6424J8950K1471K4006K6890L0262L3984
$$ 466458 476954 488802 501737 516068 532492 551442 572913 596919 623809 654071 688055
63543F88055L7641M0148L9645L4658K5689J5240N992r28n836r192j0873j0655
$$ 688055 725696 765844 805489 840147 865836 881076 887068 886140 880304 871112 860239 849584
63531H49584q932o660m692l458l287m681p968j2732j7941k2700k6692k9878l2070
$$ 849584 840652 833992 829300 825842 822555 817874 809906 797174 779233 756533 729841 699963 667893
63518F67893l3022l2735l1530k9891k8266k6829k5329k3273k0489j7329j4385
$$ 667893 634871 602136 570606 540715 512449 485620 460291 437018 416529 399200 384815
63507C84815j2077j0521r548q753p800o783o057n577m785l340j686o15m51q39
$$ 384815 372738 362217 352669 343916 336116 329333 323276 317699 312914 309574 307888 307273 306822 305983
63493C05983j208j243j037q92q61n72K00R04P72N9m2R64K145K618K907L892N083
$$ 305983 304775 303532 302495 301603 300742 300170 300370 301274 302046 302105 302063 303027 305172 307790 310697 314589 319672
63476C19672N197M194L454L738M163L582K016K14j436k895l982m604n062n597
$$ 319672 324869 329063 332517 336255 340418 344000 346016 346230 344794 341899 337917 333313 328251 322654
63462C22654n892n585m985m716m832m806m296l406k241p80P17J664J731J265Q91
$$ 322654 316762 311177 306192 301476 296644 291838 287542 284136 281895 281115 281832 283496 285227 286492 287383
63447B87383R82J606K767M354N959P084P638Q038Q727R688J0629J1511J2688J4571
$$ 287383 288365 289971 292738 297092 303051 310135 317773 325811 334538 344226 354855 366366 379054 393625
63433C93625J7305K0618K3710K5269K4217K0687J6089J1986R079P419P040P933
$$ 393625 410930 431548 455258 480527 504744 525431 541520 553506 562585 570004 577044 584977
63421E84977R702J1908J4616J8137K2329K6618L0729L4754L8462M0997M1440L9286
$$ 584977 594679 606587 621203 639340 661669 688287 719016 753770 792232 833229 874669 913955
63409I13955L4414K7097J8236R137Q62n862j0240j1733j0964r639r097r457j0460
$$ 913955 948369 975466 993702 1002839 1003701 997839 987599 975866 964902 955263 946166 936709 926249
63396I26249j2472j5931k0369k4776k8643l1956l4329l5041l4023l2137l0241
$$ 926249 913777 897846 877477 852701 824058 792102 757773 722732 688709 656572 626331
63385F26331k8408k6267k3651k0737j7838j5266j3185j1447r737p910n980l866
$$ 626331 597923 571656 548005 527268 509430 494164 480979 469532 459795 451885 445905 442039
63373D42039j504P82K470L566M771O599Q688J0292J1271J2139J3277J4599J6028
$$ 442039 440535 441317 443787 447353 452124 458723 467411 477703 488974 501113 514390 528989 545017
63360E45017J7853K0309K3058K5485K7440K9372L1686L4210L6354L7520L7147
$$ 545017 562870 583179 606237 631722 659162 688534 720220 754430 790784 828304 865451
63349H65451L4657K9735K2757J4691O572p35o420r869j1172j1242j1097j1167
$$ 865451 900108 929843 952600 967291 973863 973128 966708 956839 945667 934425 923328 912161
63337I12161j1409j1929j3141j5344j8425k2024k5809k9398l2163l3369l2713
$$ 912161 900752 888823 875682 860338 841913 819889 794080 764682 732519 699150 666437
63326F66437l0684k8192k5729k3093k0053j6964j4251j1566q252m848l334n170
$$ 666437 635753 607561 581832 558739 538686 521722 507471 495905 487653 482805 479471 474301
63314D74301r448j3566j5557j5312j3827j2120j0906j0442j0261r573q231o959
$$ 474301 464853 451287 435730 420418 406591 394471 383565 373123 362862 353289 345058 338099
63302C38099o298n835m871l426k050j002k04K40J72m9J55N61J55j507l568m859
$$ 338099 331801 325966 321095 317669 315619 314617 314413 314653 314825 314776 314931 315492 315647 314140 310572 305713
63286C05713n170n001m570l770k832k237j995j619r97o48r07j363j374q33j28
$$ 305713 300543 295542 290972 287202 284370 282133 280138 278519 277522 276874 275967 274604 273230 272397 272269
63271B72269L28L16j20n70n64j39K09L27O41J286J649J290Q37J168K098K722K875
$$ 272269 272597 272913 272793 272223 271659 271520 271729 272056 272697 273983 275632 276922 277759 278927 281025 283747 286622
63254B86622L257M101M695M571M293M642N561O421O804O646O060N510N744P060
$$ 286622 289879 293980 298675 303246 307539 312181 317742 324163 330967 337613 343673 349183 354927 361987
63240C61987Q889J0504J1810J3055J4176J5030J5956J7433J9212K0401K0556K0233
$$ 361987 370876 381380 393190 406245 420421 435451 451407 468840 488052 508453 529009 549242
63228E49242K0303K1002K1752K1772K0811J9432J8510J8415J8842J9458K0333
$$ 549242 569545 590547 612299 634071 654882 674314 692824 711239 730081 749539 769872
63217G69872K1407K2019K1526K0142J8588J6975J4704J1412P442L223j238n948
$$ 769872 791279 813298 834824 854966 873554 890529 905233 916645 924087 927310 926072 920124
63205I20124j0499j4399j7591k0306k2594k4127k4371k2955k0090j6696j3714
$$ 920124 909625 895226 877635 857329 834735 810608 786237 763282 743192 726496 712782
63194G12782j1241q633n619k752n35J450M000P188J0342J3030J5485J7936K0102
$$ 712782 701541 692908 687289 684537 684002 685452 689452 696640 706982 720012 735497 753433 773535
63181G73535K1586K2530K3432K4478K5367K5852K6153K6629K7129K7029K5942
$$ 773535 795121 817651 841083 865561 890928 916780 942933 969562 996691 1023720 1049662
63170A049662K4201K2433K0827J8967J6309J2551P733K232l337q661j4152k0454
$$ 1049662 1073863 1096296 1117123 1136090 1152399 1164950 1172683 1174915 1171578 1162917 1148765 1128311
63158A128311k7345l3558l7961m0596m2235m3260m3382m2308m0105l7069l3647
$$ 1128311 1100966 1067408 1029447 988851 946616 903356 859974 817666 777561 740492 706845
63147G06845l0471k7971k5788k3104j9768j6689j4793j3916j3126j1875j0434
$$ 706845 676374 648403 622615 599511 579743 563054 548261 534345 521219 509344 498910
63136D98910r220q214p099n720m190k788j845j554j734j881j600r23j59N74J501
$$ 498910 489690 481476 474377 468657 464467 461679 459834 458280 456546 454665 453065 452142 451983 452557 454058
63121D54058K854M463N697N957N258M271L713L683L731L428K771K015J415J132
$$ 454058 456912 461375 467072 473029 478287 482558 486271 489954 493685 497113 499884 501899 503314 504446
63107E04446J140J125P68K38Q1M15N82N6o88p17K7O59O44M77P37J121R60L18j21
$$ 504446 505586 506711 507479 507717 507798 508213 508795 508851 508163 507446 507473 508132 508776 509253 509990 511111 512071 512389 512268
63088E12268r4l0k52m58k55K40O24P83R55J363J999K690L191L374L445L896M975
$$ 512268 512174 512144 511892 511434 511179 511419 512043 512826 513781 515144 517143 519833 523024 526398 529843 533739 538714
63071E38714O310P304P836Q353R230J0302J1246J2075J3058J4227J5367J6468
$$ 538714 545024 552328 560164 568517 577747 588049 599295 611370 624428 638655 654022 670490
63059F70490J7930K0089K2745K5339K7543K9550L1752L4315L7018L9497M1569
$$ 670490 688420 708509 731254 756593 784136 813686 845438 879753 916771 956268 997837
63048I97837M3356M5068M6652M7779M8260M8338M8387M8444M8310M8068M8101
$$ 997837 1041193 1086261 1132913 1180692 1228952 1277290 1325677 1374121 1422431 1470499 1518600
63037A518600M8504M8808M8584M8070M7752M7397M5996M2822L8126L2500K5831
$$ 1518600 1567104 1615912 1664496 1712566 1760318 1807715 1853711 1896533 1934659 1967159 1992990
63026A992990J7436P199l950j4949k5461l5483m4375n1012n4940n6793n7325n6497
$$ 1992990 2010426 2017625 2013675 1998726 1973265 1937782 1893407 1842395 1787455 1730662 1673337 1616840
63014A616840n3972m9986m5170l9679l3197k5857j8473j1568m696K783J0595J7759
$$ 1616840 1562868 1512882 1467712 1428033 1394836 1368979 1350506 1338938 1334242 1337025 1347620 1365379
63002A365379K3781K9087L4205L8977M2865M5765M8032M9826N0803N0641M9635
$$ 1365379 1389160 1418247 1452452 1491429 1534294 1580059 1628091 1677917 1728720 1779361 1828996
62991A828996M8462M7598M7081M6775M6395M5242M2388L7367L0477K2220J2806
$$ 1828996 1877458 1925056 1972137 2018912 2065307 2110549 2152937 2190304 2220781 2243001 2255807
62980B255807K392q599j9857l1564m3814n5830o6357p4765q1155q5464q7265q6680
$$ 2255807 2258199 2249600 2229743 2198179 2154365 2098535 2032178 1957413 1876258 1790794 1703529 1616849
62968A616849q4663q1901p8014p2510o6044o0024n5095n0702m6131m1499l7523
$$ 1616849 1532186 1450285 1372271 1299761 1233717 1173693 1118598 1067896 1021765 980266 942743
62957I42743l4642l2525l0349k7591k4684k2685k2116k2251k1894k0656j9133
$$ 942743 908101 875576 845227 817636 792952 770267 748151 725900 704006 683350 664217
62946F64217j7934j6975j5807j4336j2945j2089j1813j1644j1012r865q759q216
$$ 664217 646283 629308 613501 599165 586220 574131 562318 550674 539662 529797 521038 512822
62934E12822q130q014p629p089o467n688m776l919l233k787k728l073l394l117
$$ 512822 504692 496678 489049 481960 475493 469805 465029 461110 457877 455090 452362 449289 445895 442778
62920D42778k180j093k52K99M41j58j443k667l150l017k829k716k418j990j883
$$ 442778 440598 439505 439253 439552 439993 439835 438392 435725 432575 429558 426729 424013 421595 419605 417722
62905D17722k268k756k945k827k462j736p33jJ8l43m17j75k28q08j325j192o64
$$ 417722 415454 412698 409753 406926 404464 402728 401995 401994 402012 401669 401252 401077 400849 400041 398716 397524 396860
62888C96860m26o36q50p25m34l47o37j120j321p65M45J490J586Q15q3n83n90n9
$$ 396860 396434 395798 394948 394223 393789 393442 392805 391685 390364 389599 390044 391534 393120 393935 393852 393269 392679 392620
62870C92620R44J780J568K71j095j552j118m58p8r7k65j4R84K078K071Q28k35
$$ 392620 393564 395344 396912 397183 396088 394536 393418 392960 392882 392785 392520 392506 393490 395568 397639 398467 398232
62853C98232J18J374K138K026J799J975K294K450K415K013J025r2l82M01J315
$$ 398232 398350 399724 401862 403888 405687 407662 409956 412406 414821 416834 417859 417767 417385 417786 419101
62838D19101J296K87q83j354q76rK53n22j562j668o75M68J024J166J178Q06n3
$$ 419101 420397 420684 419801 418447 417571 417562 417815 417293 415731 414063 413388 413856 414880 416046 417224 418030 417977
62821D17977o53j59J215K432K882K877K929K995K690J930J178J050J697K649L298
$$ 417977 417324 417165 418380 420812 423694 426571 429500 432495 435185 437115 438293 439343 441040 443689 446987
62806D46987L474L502L775M455N425O381P046P509Q167R137J0020J0563J1180
$$ 446987 450461 453963 457738 462193 467618 473999 481045 488554 496721 505858 515878 526441 537621
62793E37621J2290J3501J4182J4625J5822J8108K0936K4063K7931L2535L7015
$$ 537621 549911 563412 577594 592219 608041 626149 647085 671148 699079 731614 768629
62782G68629M0921M5055N0281N6175O1615O6125O9862P2776P4760P6248P7629
$$ 768629 809550 854605 904886 961061 1022676 1088801 1158663 1231439 1306199 1382447 1460076
62771A460076P8151P6231P0987O2826N2566M0699K7575J3643p02j5045k8583m0322
$$ 1460076 1538227 1614458 1685445 1748271 1800837 1841536 1869111 1882754 1882052 1867007 1838424 1798102
62759A798102m9881n7618o3921o8721p1927p3773p4412p3564p0949o6982o2627
$$ 1798102 1748221 1690603 1626682 1557961 1486034 1412261 1337849 1264285 1193336 1126354 1063727
62748A063727n8618n4993n1364m7448m3313l9180l5200l1500k8293k5675k3297
$$ 1063727 1005109 950116 898752 851304 807991 768811 733611 702111 673818 648143 624846
62737F24846k0583j7459j4576j2547j1187r788p904n632l393j783j313j799k206
$$ 624846 604263 586804 572228 559681 548494 538706 530802 525170 521777 519994 518681 516882 514676
62724E14676j638l34Q38J707K884M599O267P450Q457R664J0880J1912J3234J5425
$$ 514676 513038 512704 513542 515249 518133 522732 528999 536449 544906 554570 565450 577362 590596 606021
62710F06021J8291K1169K3901K6942L0602L4719L9078M3682M8567N3727N9290
$$ 606021 624312 645481 669382 696324 726926 761645 800723 844405 892972 946699 1005989
62699A005989O5332P1547P7436Q2948Q8467R3970R8572J01175J01323R9126R4632
$$ 1005989 1071321 1142868 1220304 1303252 1391719 1485689 1584261 1685436 1786759 1885885 1980517
62688A980517Q7608P7814O5177M9845L2362J3754m950k3236m0889n7274p1354
$$ 1980517 2068125 2145939 2211116 2260961 2293323 2307077 2302127 2278891 2238002 2180728 2109374
62677B109374q2483r0790r6511r9434r9454r7359r4395r1082q6913q1404p4974
$$ 2109374 2026891 1936101 1839590 1740156 1640702 1543343 1448948 1357866 1270953 1189549 1114575
62666A114575o8560o2690n7294n2193m7387m2884l8616l4658l1279k8561k6093
$$ 1114575 1046015 983325 926031 873838 826451 783567 744951 710293 679014 650453 624360
62655F24360k3306k0170j7322j5387j4286j3518j2888j2528j2212j1199r187p014
$$ 624360 601054 580884 563562 548175 533889 520371 507483 494955 482743 471544 462357 455343
62643D55343n863n890o186n973n306m519l628k637j870j519j173l12Q27J345P48
$$ 455343 449480 443590 437404 431431 426125 421606 417978 415341 413471 411952 410779 410467 411294 412639 413387
62628D13387m75j450j833j832j609j038j95L34L5p23r08k2J275K020K096K140
$$ 413387 412912 411462 409629 407797 406188 405150 404955 405289 405324 404601 403693 403671 404946 406966 409062 411202
62612D11202K598L373M318N483O739P727Q304Q741R308J0042J1059J2583J4471
$$ 411202 413800 417173 421491 426974 433713 441440 449744 458485 467793 477835 488894 501477 515948
62599E15948J6124J7277J8514K0623K3648K6975L0159L3229L6205L8705M0170
$$ 515948 532072 549349 567863 588486 612134 639109 669268 702497 738702 777407 817577
62588H17577M0316L9214L7025L3720K9104K3162J6200Q618P05p086j3996j9550
$$ 817577 857893 897107 934132 967852 996956 1020118 1036318 1044936 1045641 1038555 1024559 1005009
62576A005009k4156k8507l2374l4684l4983l4206l3586l3352l2901l1805l0177
$$ 1005009 980853 952346 919972 885288 850305 816099 782513 749161 716260 684455 654278
62565F54278k8302k6363k4369k2054j9246j6438j4529j3625j2710j0931q707o976
$$ 654278 625976 599613 575244 553190 533944 517506 502977 489352 476642 465711 457004 450028
62553D50028n887n021m423m457m783m454l153j636p41n66o57n18J80J292K047
$$ 450028 444141 439120 434697 430240 425457 421003 417850 416214 415473 414907 414250 413732 413912 415204 417251
62538D17251J739O74l1L23J392K459L131L365L315L398M028N150O459Q066J0355
$$ 417251 418990 419664 419633 419956 421348 423807 426938 430303 433618 437016 441044 446194 452653 460719 471074
62523D71074J3112J5477J7098J8680K1011K4009K7149L0362L3948L7977M2286
$$ 471074 484186 499663 516761 535441 556452 580461 607610 637972 671920 709897 752183
62512G52183M6793N1300N5156N7692N8822N8776N7333N3908M8466M1717L4244
$$ 752183 798976 850276 905432 963124 1021946 1080722 1138055 1191963 1240429 1282146 1316390
62501A316390K5885J6379O232l532j2363k0444k7824l3820l7589l9015l8641l6911
$$ 1316390 1342275 1358654 1364886 1361354 1348991 1328547 1300723 1266903 1229314 1190299 1151658 1114747
62489A114747l3928k9886k5164j9870j3907p674k079K570P164J2610J8493K3616
$$ 1114747 1080819 1050933 1025769 1005899 991992 984318 982239 984809 991973 1004583 1023076 1046692
62477A046692K7525L0654L3107L4252L3623L1331K7387K1446J3802N889r31o783
$$ 1046692 1074217 1104871 1137978 1172230 1205853 1237184 1264571 1286017 1299819 1305708 1304777 1297994
62465A297994j2973k0390k8647l6515m2821m6949m8973m9454m9011m8068m6848
$$ 1297994 1285021 1264631 1235984 1199469 1156648 1109699 1060726 1011272 962261 914193 867345
62454H67345m5393m3444m0591l6701l2098k7342k2989j9552j7207j5463j3492
$$ 867345 821952 778508 737917 701216 669118 641776 618787 599235 582028 566565 553073
62443E53073j1031q613o744n229l672k200j214n88L15J727K973L121K016M82n69
$$ 553073 542042 533429 526685 521456 517784 515584 514370 513782 514097 515824 518797 521918 523934 524416 523847
62428E23847j111j844l092m257m686m738n349o632p621p597o952o481o343o220
$$ 523847 522736 520892 517800 513543 508857 504119 498770 492138 484517 476920 469968 463487 457144 450924
62414D50924n989n734n367m800m277m049l883l343k527j995k056k493k982l358
$$ 450924 444935 439201 433834 429034 424757 420708 416825 413482 410955 408960 406904 404411 401429 398071
62400C98071l420k947k064j280r08o75q1R34J873K155J671Q59L38M61J120J928
$$ 398071 394651 391704 389640 388360 387452 386777 386696 387630 389503 391658 393329 394188 394526 394987 396107 398035
62384C98035K512K713K617K459K416K632L364M876O893Q460Q761Q074P471P598
$$ 398035 400547 403260 405877 408336 410752 413384 416748 421624 428517 436977 445738 453812 461283 468881
62370D68881Q158Q703R271J0062J0962J1834J2967J4769J7206J9883K2545K5274
$$ 468881 477039 485742 495013 505075 516037 527871 540838 555607 572813 592696 615241 640515
62358F40515K8343L2047L6478M1232M5658M9475N2811N5384N6217N4583N0777
$$ 640515 668858 700905 737383 778615 824273 873748 926559 981943 1038160 1092743 1143520
62347A143520M5444L8647L0277K1021J2079L992l439j0201j5893k0664k5427l0725
$$ 1143520 1188964 1227611 1257888 1278909 1290988 1294980 1291541 1281340 1265447 1244783 1219356 1188631
62335A188631l5941m0016m2402m3068m2105l9893l7194l4580l1937k8934k5674
$$ 1188631 1152690 1112674 1070272 1027204 985099 945206 908012 873432 841495 812561 786887
62324G86887k2525j9624j7052j5249j4626j4797j4869j4514j4286j4668j5356
$$ 786887 764362 744738 727686 712437 697811 683014 668145 653631 639345 624677 609321
62313F09321j5749j5735j5544j5126j4237j3041j2130j1750j1447j0703r641q721
$$ 609321 593572 577837 562293 547167 532930 519889 507759 496009 484562 473859 464218 455497
62301D55497p968o900n273l556k413k000j897j583q24K87J389K041K079J809J736
$$ 455497 447529 440629 435356 431800 429387 427387 425490 423907 423083 423370 424759 426800 428879 430688 432424
62286D32424K099K829L824M989O009O446O251N874N734N825O053O670P894R245
$$ 432424 434523 437352 441176 446165 452174 458620 464871 470745 476479 482304 488357 495027 502921 512166
62272E12166R882R675R535J0329J1878J3302J4123J4633J5315J6315J7502J8812
$$ 512166 522048 531723 541258 551587 563465 576767 590890 605523 620838 637153 654655 673467
62260F73467K0427K2710K5821K9324L2493L5254L8513M2974M7927N1776N3673
$$ 673467 693894 716604 742425 771749 804242 839496 878009 920983 968910 1020686 1074359
62249A074359N3870N2459M8716M2155L3506K4121J4902O234j573q397j4556k0450
$$ 1074359 1128229 1180688 1229404 1271559 1305065 1329186 1344088 1350322 1348749 1340352 1325796 1305346
62237A305346k6204l1966l7986m3929m8675n1473n2801n3317n2612m9949m5802
$$ 1305346 1279142 1247176 1209190 1165261 1116586 1065113 1012312 958995 906383 856434 810632
62226H10632m1515l7645l3754k9711k5981k2574j9020j5581j3287j2330j1626
$$ 810632 769117 731472 697718 668007 642026 619452 600432 584851 571564 559234 547608
62215E47608j0414r165q301p242n543l952l271l026k393j687j706k118j880r41
$$ 547608 537194 528029 519728 512486 506943 502991 499720 496694 494301 492614 490908 488790 486910 485969
62201D85969k55r7L96J803L580M917N624N843N682N476N788O718P643Q040Q146
$$ 485969 485714 485617 486013 487816 491396 496313 501937 507780 513462 518938 524726 531444 539087 547127 555273
62186E55273Q510R315J0379J1539J2636J3399J3636J3422J2852J1758R902P416
$$ 555273 563783 573098 583477 595016 607652 621051 634687 648109 660961 672719 682621 690037
62174F90037M933L232K783L496M928O779R159J2317J6208K0469K4739K8858L2778
$$ 690037 694970 698202 700985 704481 709409 716188 725347 737664 753872 774341 799080 827938 860716
62161H60716L6337L9180M0781M0677L8755L5221L0280K4048J6908R664L138k370
$$ 860716 897053 936233 977014 1017691 1056446 1091667 1121947 1145995 1162903 1172567 1175705 1173335
62149A173335p072j1372j5644k0153k4883k9452l3230l5527l5799l4103l1333
$$ 1173335 1166263 1154891 1139247 1119094 1094211 1064759 1031529 996002 960203 926100 894767
62138H94767k8626k6334k3965k1171j8279j5670j3230j0811q720p204n925m453
$$ 894767 866141 839807 815842 794671 776392 760722 747492 736681 727961 720757 714832 710379
62126G10379k960j768o63P49K278L480M438N383N727M370J258k198m527n469n549
$$ 710379 707419 705651 704988 705737 708015 711495 715933 721316 727043 731413 732671 730473 725946 720477 714928
62111G14928m999l683j920p90j423l934p178r680j0836j1055j0774r854q175o309
$$ 714928 709929 706246 704326 703536 702113 698179 691001 681321 670485 659430 648656 638802 630627 624318
62097F24318n022m338l639k535j122M14J884K944L410L703M409N456O227O463
$$ 624318 619296 614958 611319 608784 607662 608076 609960 612904 616314 620017 624426 629882 636109 642572
62083F42572O573P032Q003R497J1359J3132J4407J5415J6745J8496K0173K1397
$$ 642572 649145 656177 664180 673677 685036 698168 712575 727990 744735 763231 783404 804801
62071H04801K2172K2489K2237K1570K0814J9998J9073J8556J9255K1141K3251
$$ 804801 826973 849462 871699 893269 914083 934081 953154 971710 990965 1012106 1035357
62060A035357K4884K6185K7186K6977K4502J9757J3822P876K533k131o322j0183
$$ 1035357 1060241 1086426 1113612 1140589 1165091 1184848 1198670 1206546 1209079 1206948 1200626 1190443
62048A190443j3618j6608j9587k3139k7262l1363l5025l8212m0595m1396m0305
$$ 1190443 1176825 1160217 1140630 1117491 1090229 1058866 1023841 985629 945034 903638 863333
62037H63333l8153l6185l4956l4172l3220l1475k8471k4288j9774j6034j3625
$$ 863333 825180 788995 754039 719867 686647 655172 626701 602413 582639 566605 552980
62026E52980j2225j1084r735q408p635p411p043o143n366n544o402o885o633o203
$$ 552980 540755 529671 519936 511528 503893 496482 489439 483296 477930 472386 465984 459099 452466 446263
62012D46263n833n003l562k290j790j589r94k16P7j48k81J11J030K286L564M490
$$ 446263 440430 435427 431865 429575 427785 426196 425202 424986 425063 424915 424634 424745 425775 428061 431625 436115
61996D36115N033N507N863N454M012K369J576J614J548P76n17k004l640n405p071
$$ 436115 441148 446655 452518 457972 461984 464353 465929 467543 469091 469867 469350 467346 463706 458301 451230
61981D51230q345r026r126q933q791q589p799o285m738l895l646l315k668k136
$$ 451230 442885 433859 424733 415800 407009 398420 390621 384336 379598 375703 372057 368742 366074 363938
61967C63938k193k858l733m245m056l409k923k738k319j320l06l5l77m75J49J159
$$ 363938 361745 358887 355154 350909 346853 343444 340521 337783 335464 334144 333838 333803 333426 332951 333100 334259
61951C34259J965K289K233K149K441L155L970M750N818P362Q895R850J0364J1049
$$ 334259 336224 338513 340746 342895 345336 348491 352461 357211 363029 370391 379286 389136 399500 410549
61937D10549J2138J3371J4487J5231J5181J4226J3062J2555J2591J2288J1300
$$ 410549 422687 436058 450545 465776 480957 495183 508245 520800 533391 545679 556979
61926E56979J0141R097P701N686L680K341J220o98l537o246p833q347q341p849
$$ 556979 567120 576217 583918 589604 593284 595625 596845 596147 592610 586364 578531 570184 561843 553994
61912E53994o430m097j645K71J929L964O334Q429J0116J1857J3556J4138J2784
$$ 553994 547564 543467 541822 542093 544022 547986 554320 562749 572865 584722 598278 612416 625200
61899F25200J0107P412N155K797Lk773m942o435p515q323q795q780q232p411o846
$$ 625200 635307 642719 647874 650671 650674 647901 642959 636524 629009 620686 611891 603111 594879 587468 580622
61884E80622o787o835o399n499m785m824n641o913q298r485j0214j0414j0173
$$ 580622 573835 567000 560601 555102 550317 545493 539852 532939 524641 515156 504942 494528 484355
61871D84355r599q726p580o325n346n044n277n142l824j648K26J266K104L373
$$ 484355 474756 466030 458450 452125 446779 441735 436458 431316 427492 425844 426070 427336 429440 432813
61857D32813M792N883O923Q424J0202J1796J3338J5273J7425J9177K0380K1298
$$ 432813 437605 443488 450411 458835 469037 480833 494171 509444 526869 546046 566426 587724
61845E87724K1902K2004K1887K1880K1450J9675J6629J3276R963O039J295l276
$$ 587724 609626 631630 653517 675397 696847 716522 733151 746427 756390 762429 763724 760448
61833G60448o627q767j0126j0649j0102q734o917m565j467K056N386Q205J0421
$$ 760448 753821 745054 734928 724279 714177 705443 698526 693961 692494 694550 699936 708141 718562
61820G18562J1774J1983J1201R825P948N252J463l254q207j2449j5320j6926j7877
$$ 718562 730336 742319 753520 763345 771293 776545 778008 774754 766547 754098 738778 721852 703975
61807G03975j8563j8893j8742j8196j7320j6123j4912j4162j3880j3560j2973
$$ 703975 685412 666519 647777 629581 612261 596138 581226 567064 553184 539624 526651
61796E26651j2460j2219j1853j1059j0174r486q557o884m875l476l029l088l223
$$ 526651 514191 501972 490119 479060 468886 459400 450843 443959 439084 435608 432579 429491 426268
61783D26268l368l439l245k837k475k179j708r90j63O68J327J346M68o75j049
$$ 426268 422900 419461 416216 413379 410904 408725 407017 406027 405864 406532 407859 409205 409673 408998 407949
61768D07949n05J19L54Q08K018L293L462K472J490J503K413L492M168M265L974
$$ 407949 407444 407563 407917 408725 410743 414036 417498 419970 421460 422963 425376 428868 433036 437301 441275
61753D41275L784M023M375M177L326K358J542M32j225k785l482l574l907m562
$$ 441275 445059 449082 453457 457634 460960 463318 464860 465292 464067 461282 457800 454226 450319 445757
61739D45757m720l999l120k990l660m514m933m515l211j635p64q34r82m63K73
$$ 445757 441037 437038 433918 430928 427268 422754 417821 413306 410095 408460 407696 406862 405880 405417 405690
61724D05690L78N0K53J170J919J964J829K085K386K117J532J492K226K983K957
$$ 405690 406068 406118 406371 407541 409460 411424 413253 415338 417724 419841 421373 422865 425091 428074 431031
61709D31031K123J048J74m82j069j605k015k304k624l124l782m333m401l846l072
$$ 431031 433154 434202 434376 433894 432825 431220 429205 426901 424277 421153 417371 413038 408637 404791 401719
61694D01719k806l248l657l201k170j720k384l436m015m153m147l705k525j301
$$ 401719 398913 395665 392008 388807 386637 384917 382533 379097 375082 370929 366782 363077 360552 359251
61680C59251j087j823k385k136j559j247j162j153j389j873k153j982j671j424
$$ 359251 358164 356341 353956 351820 350261 349014 347852 346699 345310 343437 341284 339302 337631 336207
61666C36207r23q8L96Ko20l53P88J617J367O49N61J327K255K698K707K733K992
$$ 336207 335284 335196 335592 335594 334974 334621 335409 337026 338393 339042 339603 340930 343185 345883 348590 351323 354315
61649C54315L248L106K420J419N13K9jJ71K97M60R65J806K450K433K003J855K190
$$ 354315 357563 360669 363089 364508 365021 365050 365049 365220 365517 365977 366942 368748 371198 373631 375634 377489 379679
61632C79679K472K136J213J67o43j124j330j398j478j636j849k162k655l238l551
$$ 379679 382151 384287 385500 385667 385024 383900 382570 381172 379694 378058 376209 374047 371392 368154 364603
61617C64603l227k254j097m94q78j817k263j684q08q80k187l740m411m059l422
$$ 364603 361376 359122 358025 357531 356653 354836 352573 350889 350081 349201 347014 343274 338863 334804 331382
61602C31382l251l683m217m202l509k734k527k827l061k995k925l031l039k648
$$ 331382 328131 324448 320231 316029 312520 309786 307259 304432 301371 298376 295451 292420 289381 286733
61588B86733j911j104n56o56j469k276k125j074l25o90j452j358l11N63M22l93
$$ 286733 284822 283718 283162 282506 281037 278761 276636 275562 275237 274547 273095 271737 271426 271989 272411 272018
61572B72018r76r19m70rL22N55O39M09j35o76q02m25J57O15Q51Q70O55K91J07
$$ 272018 271042 270123 269653 269644 269966 270521 271160 271569 271434 270758 269956 269531 269688 270303 271154 272024 272679 272970 273077
61553B73077N22J597K759L117K326J121O18J034J515J457J356J807K297J927R32
$$ 273077 273599 275196 277955 281072 283398 284519 285137 286171 287686 289143 290499 292306 294603 296530 297462
61538B97462M17N99N32k18p47k41P55J200J016Q18P40M55O5P7N08P00J42r88k103
$$ 297462 297879 298478 299010 298792 298045 297804 298559 299759 300775 301593 302333 302788 302853 302930 303438 304138 304280 303292 301189
61519C01189k647k299j217j63M4o71j567j903j582r86m46m4J84J37j55l17N3P93
$$ 301189 298542 296243 295026 294863 294907 294236 292669 290766 289184 288198 287752 287708 287892 288029 287874 287557 287610 288403
61501B88403J192Q34K30J65O44R93R42R42J282J605J549J389J549J870J811J152
$$ 288403 289595 290429 290659 290824 291468 292461 293403 294345 295627 297232 298781 300170 301719 303589 305400 306552
61485C06552J65p01j063p44P0R60J678K255K678K827K811K962L272L263K628J668
$$ 306552 306717 306016 304953 304209 304279 305239 306917 309172 311850 314677 317488 320450 323722 326985 329613 331281
61469C31281Q52L19j0k37n75j223j904k069j723j520j769j969j717j378j313j115
$$ 331281 332133 332452 332442 332205 331630 330407 328503 326434 324711 323191 321422 319453 317736 316358 315045 313930
61453C13930l42M68M72j57m18J12P90R34N96K88L28O56R48R16O75P05J202J723
$$ 313930 313588 314056 314528 314371 313953 314065 314855 315789 316385 316673 317001 317657 318605 319521 320196 320901 322103 323826
61435C23826J804J637J700J927J810J250P89R14J458J800J455N63j41k2O26Q36
$$ 323826 325630 327267 328967 330894 332704 333954 334743 335657 337115 338915 340370 340933 340792 340770 341396 342232
61419C42232K34l91j58P17J305J202Q32O76Q09J037J091P25L5n04o03n40n96n78
$$ 342232 342466 342075 341917 342634 343939 345141 345973 346649 347458 348495 349586 350311 350346 349842 349239 348699 348103 347525
61401C47525l30l09r68j861k083j494p56l31p7J36J88J03J38K97K96M0k43l96
$$ 347525 347195 346886 345918 344057 341974 340480 339724 339393 339316 339452 339640 339743 339881 340178 340474 340514 340271 339875
61383C39875m58m20k58j31j15J12R09K069L031L528L594L211K476J978K254L028
$$ 339875 339417 338997 338739 338608 338493 338605 339514 341583 344614 348142 351736 354947 357423 359401 361655 364683
61367C64683L581L706L647L278K302J186Q92J472J910J605J170J316J851K341
$$ 364683 368264 371970 375617 378895 381197 382383 383275 384747 386657 388262 389432 390748 392599 394940
61353C94940L023M244N510N940N474M944M914N014M503L131J267n02j723k122
$$ 394940 397963 402207 407717 413657 419131 424075 428989 434003 438506 441637 442904 442402 440679 438557
61339D38557j616n34L68N04J71K47R72J496J026qn64m59m93j216k312l196l542
$$ 438557 436941 436407 436775 437279 437450 437697 438669 440165 441191 441183 440619 440160 439667 438451 436139 432943 429401
61322D29401l203k238j154n70m87l84J4O10J562L198N128O316O355O043O245O932
$$ 429401 426198 423960 422806 422236 421749 421365 421379 421989 423551 426749 431877 438193 444548 450591 456836 463768
61306D63768P682Q505R520J0451J0991J1278J1288J0330P896M740K234P08p15
$$ 463768 471450 479955 489475 499926 510917 522195 533483 543813 551709 556449 558683 559391 558676
61293E58676k554m066m380l839l629m339n440o137o238o077n933n751n304m505
$$ 558676 556122 552056 547676 543837 540208 535869 530429 524292 518054 511977 506044 500293 494989 490484
61279D90484l681l432l926m309l342r63J350K257K151K320K924K970K164J537
$$ 490484 486803 483371 479445 475136 471794 470831 472181 474438 476589 478909 481833 484803 486967 488504
61265D88504J758K122J932J803K587L835M533M769N375O162N845L896J419r6k15
$$ 488504 490262 492384 494316 496119 498706 502541 507074 511843 517218 523380 529225 533121 534540 534444 534229
61250E34229M99J239J500J273R10N29k41j559k763l061k511j705q19K15Q53L13
$$ 534229 534728 535967 537467 538740 539650 540179 539938 538379 535616 532555 530044 528339 527520 527735 528588 528901
61234E28901j263k846l718l858l291k026o41P2K62Q74K232L553M108M006L624
$$ 528901 527638 524792 521074 517216 513925 511899 511258 511330 511592 512466 514698 518251 522359 526365 529989
61219E29989L072K501K212K256K486K994L821M366M024L293L152L432L068K045
$$ 529989 533061 535562 537774 540030 542516 545510 549331 553697 557721 561014 564166 567598 570666 572711
61205E72711J577K001K097J225O16J461K996L828M184N386P662R836J1041J1616
$$ 572711 574288 576289 578386 579611 580227 581688 584684 588512 592696 598082 605744 615580 626621 638237
61191F38237J2232J2924J3061J1815Q844M944J732K55Q2O0m41j358k452l500m279
$$ 638237 650469 663393 676454 688269 697113 702057 703789 704044 704126 704186 703745 702387 699935 696435 692156
61176F92156m803n312n780n895n720n794o259o536o281n982o131o429o385o103
$$ 692156 687353 682041 676261 670366 664646 658852 652593 646057 639776 633794 627663 621234 614849 608746
61162F08746n894n649n246n085n517o165o428o300o132n852n043l588j780rJ295
$$ 608746 602852 597203 591957 586872 581355 575190 568762 562462 556330 550478 545435 541847 540067 540058 541353
61147E41353J797J631J271P61m92k757n325p206q084q152p588o555n342m113k806
$$ 541353 543150 544781 546052 546813 546321 543564 538239 531033 522949 514797 507209 500654 495312 491199 488393
61132D88393j576q66q04r37p62n5J302L152M731N372N579O457Q011R177R698J0572
$$ 488393 486817 485951 485147 484210 483448 483393 484695 487847 492578 497950 503529 509986 517997 527174 536872 547444
61116E47444J2207J3647J4289J4964J6389J7877J8565J8770J9017J8930J8265
$$ 547444 559651 573298 587587 602551 618940 636817 655382 674152 693169 712099 730364
61105G30364J7887J8459J9099J8631J7251J5637J3420R994O068K839L09k191m477
$$ 730364 748251 766710 785809 804440 821691 837328 850748 860742 866810 869649 869958 867767 863290
61092H63290o008p223q895j0571j1230j0995j0814j0817j0506j0104j0216j0483
$$ 863290 857282 850059 841164 830593 819363 808368 797554 786737 776231 766127 755911 745428
61080G45428j0075r184q524p753o044l944k968l282l439k478q34Q64K501L882
$$ 745428 735353 726169 717645 709892 703848 699904 696936 693654 690215 687737 686903 687767 690268 694150
61066F94150M721N355O344P433Q018Q387R283J0531J1476J2322J3635J4899J5199
$$ 694150 698871 704226 710570 718003 726021 734408 743691 754222 765698 778020 791655 806554 821753
61053H21753J5034J5682J6995J7718J7849J8627K0145K1059K0997K1299K2743
$$ 821753 836787 852469 869464 887182 905031 923658 943803 964862 985859 1007158 1029901
61042A029901K4354K5106K5299K5651K6373K7641K9647L1860L3438L4503L5876
$$ 1029901 1054255 1079361 1104660 1130311 1156684 1184325 1213972 1245832 1279270 1313773 1349649
61031A349649L7571L8891L9720M0253L9980L8765L8285M0299M4100M8194N3678
$$ 1349649 1387220 1426111 1465831 1506084 1546064 1584829 1623114 1663413 1707513 1755707 1809385
61020A809385O2745P4191Q4198R1816J00076J11478J26510J47191J77184K16994
$$ 1809385 1872130 1946321 2030519 2122335 2222411 2333889 2460399 2607590 2784774 3001768
61010C001768K63904L18576L86548M71051N70524O86431Q26646R96969J198201
$$ 3001768 3265672 3584248 3970796 4441847 5012371 5698802 6525448 7522417 8720618
61001H720618J435976J712463J979619K106021J936308J426584P22568P8764l13236
$$ 8720618 10156594 11869057 13848676 15954697 17891005 19317589 20040157 20118921 19805685
60992A9805685m17760l01173l7639K97241N68099N89203K47049l84795j077235
$$ 19805685 19387925 19086752 19049113 19346354 19914453 20503656 20750705 20365910 19288675
60983A9288675j602814j865399j900632j793269j614204j411033j215563j042209
$$ 19288675 17685861 15820462 13919830 12126561 10512357 9101324 7885761 6843552
60975F843552q89176p51278o29394n26181m39722l66163l04555k55279k16672
$$ 6843552 5954376 5203098 4573704 4047523 3607801 3241638 2937083 2681804 2465132
60966B465132j86305j63112j45668j30850j16569j03811r3757q5055p5981o7188
$$ 2465132 2278827 2115715 1970047 1839197 1722628 1618817 1525060 1440005 1364024 1296836
60956A296836n9932n3437m6513m0337l7069l6604l6762l6041l4365l1947k9094
$$ 1296836 1236904 1183467 1136954 1096617 1059548 1022944 986182 950141 915776 883829 854735
60945H54735k6520k4412k1887j8599j5880j4863j4561j3409j1715j0876j0983
$$ 854735 828215 803803 781916 763317 747437 732574 718013 704604 692889 682013 671030
60934F71030j1056j0982j1343j1741j1242j0209r882j0189r773q329p194p244
$$ 671030 659974 648992 637649 625908 614666 604457 594575 584386 574613 566284 559090 551846
60922E51846p625p180o020n063m804n019n182m981m661m783n220m907l284j468
$$ 551846 544221 537041 531021 525958 521154 516135 510953 505972 501311 496528 491308 486401 483117 481649
60908D81649r20j410j481p01r1k57n11j93L30M93M07L11L2m71p05l68J19K39L0
$$ 481649 480729 479319 477838 477137 477046 476789 476278 476085 476415 476908 477315 477626 477658 477187 476482 476114 476233 476472 476502
60889D76502l33j006k052l085l834m642n835p008p491p252o761o199n428m600
$$ 476502 476169 475163 473111 470026 466192 461550 455715 448707 441216 433964 427203 421004 415576 410976
60875D10976m162m126l929l247k581k629l303l740l274k058o80N39J577K350K657
$$ 410976 406814 402688 398759 395512 392931 390302 386999 383259 379985 377927 377247 377786 379363 381713 384370
60860C84370K524K225J930J598J295J268J552J814J819J762J877K026J927J644
$$ 384370 386894 389119 391049 392647 393942 395210 396762 398576 400395 402157 404034 406060 407987 409631
60846D09631J419J235R24N83M87O11N83J59n15j193j821k441k976l226l076k697
$$ 409631 411050 412285 413209 413792 414279 414890 415473 415632 415117 413924 412103 409662 406686 403460 400384 397687
60830C97687k465k606k945l159l204l233l192k870k382k108k060j861j528j598
$$ 397687 395222 392616 389671 386512 383308 380075 376883 374013 371631 369523 367463 365602 364074 362476
60816C62476k174k532k222j909k361l145l265k665k168k106k092k096k613l567
$$ 362476 360302 357770 355548 353639 351278 348133 344868 342203 340035 337929 335837 333741 331128 327561
60802C27561m045l547k666k080j627r28k65k08p51j353j633j576j356j259j450
$$ 327561 323516 319969 317303 315223 313596 312668 312403 312195 311444 310091 308458 306882 305526 304267 302817
60787C02817j631j235k33P26J246J670K257K474J773O26M0L13R18J413J727J705
$$ 302817 301186 299951 299718 300444 301690 303360 305617 308091 309864 310490 310530 310843 311761 313174 314901 316606
60771C16606J158M25J97O79J362J789J958J898J393M36m40o30j07N29N43l12j474
$$ 316606 317764 318189 318386 319065 320427 322216 324174 326072 327465 327901 327461 326831 326724 327253 327796 327484 326010
60754C26010j940j241N5J030J400J406J086L51l28j90P24J514J660J523J361O99
$$ 326010 324070 322829 322884 323914 325314 326720 327806 328157 327829 327639 328363 329877 331537 333060 334421 335120
60738C35120p59k323l175l467l790m017l552k567k024k408l114l264k585j381
$$ 335120 334361 332038 328863 325396 321606 317589 314037 311470 309446 307038 303924 300660 298075 296694
60724B96694j28O73O82j9r32j504j370m85O90J363J155N59K69K59R1j20K04J080
$$ 296694 296566 297239 297921 297902 296970 295466 294096 293611 294301 295664 296819 297378 297647 297906 297997 297877 298081 299161
60706B99161J770J829J605J485J288Q74P40J372K372K777K182J097K58r3k28m94
$$ 299161 300931 302760 304365 305850 307138 308012 308752 310124 312496 315273 317455 318552 318810 318717 318489 317995
60690C17995q62r81o63k63k51n15m83k7L21J39k93n17m69k72J45Q27J487J833
$$ 317995 317133 316152 315489 315226 314975 314460 313977 313950 314271 314410 314117 313600 313131 312859 313004 313831 315318 317151
60672C17151J968K125K259K182J845J167J1j400k388k596k471k532k563k084j294
$$ 317151 319119 321244 323503 325685 327530 328697 328708 327308 324920 322324 319853 317321 314758 312674 311380
60657C11380q22p50o05k18R1J90L52P41J201J655K188K680K863K803K844K947
$$ 311380 310558 309808 309203 308985 309076 309266 309618 310359 311560 313215 315403 318083 320946 323749 326593 329540
60641C29540K669J870R45J52p51j973l296m375m997m829l529j492O9L07l26p99
$$ 329540 332209 334079 335024 335176 334425 332452 329156 324781 319784 314955 311426 309934 310003 310310 309984 309185
60625C09185q21q48r99o82N10K027K777K275J109L10K39K80k74j135j242j08J447
$$ 309185 308364 307516 306517 305835 306345 308372 311149 313424 314533 314843 315082 315362 315088 313953 312711 312603 314050
60608C14050K208J925J343J072R77P31N06P20J239J313N04o08r18l1J339K270
$$ 314050 316258 318183 319526 320598 321575 322306 322812 323532 324771 326084 326588 325980 325062 325031 326370 328640
60592C28640K512K247J454J33j061j189k49O17M19n46j196q94O6J009J487J546
$$ 328640 331152 333399 334853 334986 333925 332736 332487 333104 333523 332977 331781 330887 330953 331962 333449 334995
60576C34995J625K094K724K921K671K784L901N556O807P514Q382R726J0876J1026
$$ 334995 336620 338714 341438 344359 347030 349814 353715 359271 366078 373592 381974 391700 402576 413602
60562D13602J0175Q906P495N586K797n88l651n554o246o361o365n997m767k809
$$ 413602 423777 432683 440178 445764 448561 447973 444322 438768 432522 426161 419796 413799 409032 406223
60548D06223q41O91K008L396M650N395N775O351P440Q880J0480J2334J4557J6832
$$ 406223 405382 406073 408081 411477 416127 421522 427297 433648 441088 449968 460448 472782 487339 504171
60534E04171J8470J8841J7742J5403J2252Q605M556K25l886p028q871r808j0408
$$ 504171 522641 541482 559224 574627 586879 595484 600040 600265 596379 589351 580480 570672 560264
60521E60264j0684j0286r261q131p237o442n668n143m775l846j870N42K287L090
$$ 560264 549580 539294 530033 521902 514665 508223 502555 497412 492637 488791 486921 487463 489750 492840
60507D92840L596M328N314O665Q790J1727J4960J8177K1705K5781K9915L3406
$$ 492840 496436 500764 506078 512743 521533 533260 548220 566397 588102 613883 643798 677204
60495F77204L6043L7876L8713L8340L6969L4993L2562K9780K6909K3771J9357
$$ 677204 713247 751123 789836 828176 865145 900138 932700 962480 989389 1013160 1032517
60484A032517J2823M645l935j2439k1206k9918l7183m1961m4589m5824m5728m4079
$$ 1032517 1045340 1049985 1046050 1033611 1012405 982487 945304 903343 858754 812930 767202 723123
60472G23123m1326l8257l5067l1522k7786k4361k1306j8244j5164j2513j0437
$$ 723123 681797 643540 608473 576951 549165 524804 503498 485254 470090 457577 447140
60461D47140q623p020o095n976o001n534m810m421m384m207l702l205k936k721
$$ 447140 438517 431497 425402 419426 413425 407891 403081 398660 394276 390069 386367 383162 380226 377505
60447C77505k364j987j785j714j577j273q68n17l36l21l88n36q52j330j772j991
$$ 377505 375141 373154 371369 369655 368078 366805 365937 365420 365084 364763 364375 363839 362987 361657 359885 357894
60431C57894j965j660r49M0P33O43j2n61p08p50r84j291j356r50j0J202K015J880
$$ 357894 355929 354269 353320 353360 354093 354736 354724 354163 353455 352705 351721 350430 349074 348124 348114 349316 351331 353211
60413C53211J082N65R05J793K574K847K452J530P35Q53J798K551K449K018K067
$$ 353211 354293 354858 355763 357556 360130 362977 365429 366959 367694 368547 370345 372896 375345 377363 379430
60398C79430K539K828K750K528K245J985K151K872L424L117K487K640L495L792
$$ 379430 381969 384797 387547 390075 392320 394305 396456 399328 402752 405869 408356 410996 414491 418283
60384D18283K946J841J436J596J766J963K416K885L054L070L187L261L161L225
$$ 418283 421229 423070 424506 426102 427868 429831 432247 435132 438186 441256 444443 447704 450865 454090
60370D54090L644L883L371K490K073K140J911J071K50J14N77J203J882K781L900
$$ 454090 457734 461617 464988 467478 469551 471691 473602 474673 474923 475037 475614 476817 478699 481480 485380
60355D85380M972N738O199O656P449Q481R150Q881P692O030M188K216K28j548
$$ 485380 490352 496090 502289 508945 516394 524875 534025 542906 550598 556628 560816 563032 563260 561712
60341E61712l025m224n014n226n032m832m745m502l953l387l213l567m309n118
$$ 561712 558687 554463 549449 544223 539191 534359 529614 525112 521159 517772 514559 510992 506683 501565
60327E01565n639n694n494n381n422n453n384n081m147k485q92k94k57P55L231
$$ 501565 495926 490232 484738 479357 473935 468482 463098 458017 453870 451385 450493 450199 449942 450697 453928
60312D53928N720O844P270Q611J0968J2919J3658J3786J3935J3911J3555J3131
$$ 453928 459648 466492 473762 482373 493341 506260 519918 533704 547639 561550 575105 588236
60300E88236J2408J0488P280M042J496j603o755j3219j8551k1243k1602k0237
$$ 588236 600644 611132 618412 622454 623950 622347 615592 602373 583822 562579 540977 520740
60288E20740j7313j3543j0409q693p640o265m725l745l336k899k143j243m09J45
$$ 520740 503427 489884 479475 470782 463142 456877 452152 448407 445071 442172 440029 438786 438377 438522
60274D38522O3p16j596j881j569j171r56q86j135k062l564m830m997l939k406
$$ 438522 438585 437869 436273 434392 432823 431652 430696 429810 428675 426613 423049 418219 413222 409283 406877
60259D06877j410j368j804j995j806j615j472j019l13K0j94j49Q07K121K808K871
$$ 406877 405467 404099 402295 400300 398494 396879 395407 394388 394075 394095 393901 393752 394559 396680 399488 402359
60243D02359L078L585L687K910J623M63k18l30l2K11Qm39o17l81P8P27J576K202
$$ 402359 405437 409022 412709 415619 417242 417705 417487 417157 417125 417336 417344 416905 416288 415907 415985 416712 418288 420490
60225D20490K087J435R80R70J083J319K103L330M174M199L934L914L917L639L498
$$ 420490 422577 424012 424992 425962 427045 428364 430467 433797 437971 442170 446104 450018 453935 457574 461072
60210D61072M053N048N757N955O023O256O572O831O943O779O330N979O151O681
$$ 461072 465125 470173 475930 481885 487908 494164 500736 507567 514510 521289 527619 533598 539749 546430
60196E46430O799N964M557L581L584M047L976L100K101J554J064p9j724k918l074
$$ 546430 553229 559193 563750 567331 570915 574962 578938 582038 584139 585693 586757 586678 584954 582036 578962
60181E78962k494j838j563j919k844l791m247m433m930n619n712m937l882k997
$$ 578962 576468 574630 573067 571148 568304 564513 560266 555833 550903 545284 539572 534635 530753 527756
60167E27756k034r27l55q19j775k276k109j773j691j920k292k423j876p33L29
$$ 527756 525722 524795 524440 523621 521846 519570 517461 515688 513997 512077 509785 507362 505486 504753 505082
60152E05082Q11Q57P17L04l66q74j022j210j658j832j219k16M45O59P31O56L56
$$ 505082 505893 506750 507467 507771 507405 506531 505509 504299 502641 500809 499590 499374 499819 500478 501209 501865 502221
60135E02221K69Q95K035L169M199N123N351M324K575J225N82J87K0N62J574K093
$$ 502221 502490 503385 505420 508589 512788 517911 523262 527586 530161 531386 531968 532155 532175 532737 534311 536404
60119E36404J887J864K566L262L174K761K997L923M678M688M120L384K722K208
$$ 536404 538291 540155 542721 545983 549157 551918 554915 558838 563516 568204 572324 575708 578430 580638
60105E80638J732J115M84L10O80Q51M5j448k473k377j721j509k062k859l296l270
$$ 580638 582370 583485 583969 584279 584959 585810 585855 584407 581934 579557 577836 576327 574265 571406 568110 564840
60089E64840l066k787k139r31K72L73j064l049m078l859l594m269n239n148l901
$$ 564840 561774 558987 556848 555917 556189 556562 555498 552449 548371 544512 540918 536649 531410 526262 522361
60074E22361k867l044l903m451m639n016n471n311m432l545l154k971k588k109
$$ 522361 519494 516450 512547 508096 503457 498441 492970 487659 483227 479682 476528 473557 470969 468860
60060D68860j862j978k455l236m008m303l986l329k546j632p09j3N02J108J753
$$ 468860 466998 465020 462565 459329 455321 451018 447032 443703 441157 439525 438816 438803 439305 440413 442166
60045D42166K175K491L043L564L404K710K453K900L149K693K409L108M077M073
$$ 442166 444341 446832 449875 453439 456843 459553 462006 464906 468055 470748 473157 476265 480342 484415
60031D84415L168K457K392K466K248J668N52j205l036m168m635n106n835o521
$$ 484415 487583 490040 492432 494898 497146 498814 499366 498161 495125 490957 486322 481216 475381 468860
60017D68860o999p222o811n543m158l730m245m680m509m129l799l188k264j681
$$ 468860 461861 454639 447828 442285 438127 434397 430152 425472 420963 416834 413035 409847 407583 405902
60003D05902j864k425k766k699k234j507j050j413k192k191r12P64J661J521Q80
$$ 405902 404038 401613 398847 396148 393914 392407 391357 389944 387752 385561 384649 385413 387074 388595 389475
59988C89475M11O82J850L173L499K650J752J785K412K773K725K613K343J555M72
$$ 389475 389886 390568 392418 395591 399090 401740 403492 405277 407689 410462 413187 415800 418143 419698 420170
59973D20170k25m08p01j585k711l302k984k094j333j140j294j148l61O61J178
$$ 420170 419945 419537 418836 417251 414540 411238 408254 406160 404827 403687 402393 401245 400884 401545 402723
59958D02723R13L95L54Q26J021L13q08j277r29p39j225j424k84J531K367J843
$$ 402723 403636 404031 404385 405211 406232 406545 405737 404460 403531 402792 401567 400143 399859 401390 403757 405600
59942D05600J234J491K063K076J635J283J018N36n9m62p13r16p43J54J411K222
$$ 405600 406834 408325 410388 412464 414099 415382 416400 416936 416877 416415 415702 414786 414043 414197 415608 417830
59926D17830K298K165K463L210L797L637K771J804J161N93k92j206j435q64j41
$$ 417830 420128 422293 424756 427966 431763 435400 438171 439975 441136 441729 441437 440231 438796 437932 437791
59911D37791K57N24Q72J002O85L31N24J173J626J472R27N34N89P98N45l25j041
$$ 437791 438048 438572 439444 440446 441131 441462 441986 443159 444785 446257 447184 447718 448307 449105 449650 449325 448284
59894D48284p11N06J556J909K148K979M192N072N300N077M721M489M557M801M890
$$ 448284 447573 448079 449635 451544 453692 456671 460863 465935 471235 476312 481033 485522 490079 494880 499770
59879D99770M802M859N097N044M421L643L235L133K946K547K026J385O52L8m08
$$ 499770 504572 509431 514528 519572 523993 527636 530871 534004 536950 539497 541523 542908 543560 543598 543190
59864E43190r30j553j812j403p22k97j5N30J206J570J788K616M304O082P011O965
$$ 543190 542260 540707 538895 537492 536770 536473 536458 536988 538194 539764 541552 544168 548472 554554 561565 568530
59848E68530O483N839M638K466l44k777l966l763k473n58J140J409l11l073n304
$$ 568530 575013 580852 585490 587956 587612 584835 580869 577106 574633 574075 575215 576624 576313 573240 567936
59833E67936o493p275p886p613o131m378l331k648j377L75J397R46l88j385j320
$$ 567936 561443 554168 546282 538669 532538 528160 524829 522181 520804 521179 522576 523522 523134 521749 520429
59818E20429l96N51O84j02j118j587j314n33M70J262J161j45j948l006k788j964
$$ 520429 520033 520584 521268 521166 520048 518461 517147 516614 517084 518346 519507 519362 517414 514408 511620 509656
59802E09656j595k067k882l281k964k252j672j468j568j834k080k020j598j263
$$ 509656 508061 505994 503112 499831 496867 494615 492943 491475 489907 488073 485993 483973 482375 481112
59788D81112j469j941j933j301p20o82q05n10J20N17L66j77p25q76m98Q6M55P22
$$ 481112 479643 477702 475769 474468 473748 473066 472261 471751 471871 472388 472754 472577 471852 470976 470478 470564 471019 471741
59770D71741J379K450L329L626L572L404L058K813L385M822N936N604M237L209
$$ 471741 473120 475570 478899 482525 486097 489501 492559 495372 498757 503579 509515 515119 519356 522565
59756E22565L168L619L888L827L578L297L194L442L935M395M633M643M552M524
$$ 522565 525733 529352 533240 537067 540645 543942 547136 550578 554513 558908 563541 568184 572736 577260
59742E77260M462L848K337N78k26J82P57O25J62J16M74Q81J461K341K857K270
$$ 577260 581722 585570 587907 588485 588259 588441 589198 589823 589985 590101 590575 591456 592917 595258 598115 600385
59726F00385R91K02L92J014J493J770J936K077K433L080L460K882J496J78n59
$$ 600385 601376 601578 601970 602984 604477 606247 608183 610260 612693 615773 619233 622115 623611 623789 623230
59711F23230r14j094r16l20L04N79O38R13J612K500L119L233L116L224L583L880
$$ 623230 622316 621222 620306 619986 620290 620869 621507 622420 624032 626532 629651 632884 636000 639224 642807 646687
59695F46687M191N081O640Q031Q403P788O563M629J794j396l989n513o011n621
$$ 646687 650878 655959 662599 670630 679033 686821 693384 698013 699807 698411 694422 688909 682898 677277
59681F77277m744m241m592n139n002m480m638n700o813p345p413p074o033m536
$$ 677277 672533 668292 663700 658561 653559 649079 644441 638741 631928 624583 617170 610096 604063 599527
59667E99527l646m057n153n688n097l793k503j584q47Q4J224K140K577K871L442
$$ 599527 595881 591824 586671 580983 575886 572093 569590 568006 567159 567243 568467 570607 573184 576055 579497
59652E79497M162M572M509M048L188K161J636J906K093J044j082k939l696l864
$$ 579497 583659 588231 592740 596788 599976 602137 603773 605679 607772 608816 607734 604795 601099 597235
59638E97235m317n239o262o995p197o883o440o223o046n449m467l558k911k383
$$ 597235 592918 587679 581417 574422 567225 560342 553902 547679 541633 536184 531717 528159 525248 522865
59624E22865k085k368l182m025m572m813m689m246m031m505n131m916l936l312
$$ 522865 520780 518412 515230 511205 506633 501820 497131 492885 488854 484349 479218 474302 470366 467054
59610D67054l526l768l362k772k587k390j425J60J512K110J961J234K88k19Q1
$$ 467054 463528 459760 456398 453626 451039 448649 447224 447384 448896 451006 452967 454201 454489 454270 454351
59595D54351P32J009Q49P49R80J380J857K518L252L608L222K176Q62l55j341k168
$$ 454351 455083 456092 456941 457690 458670 460050 461907 464425 467677 471285 474507 476683 477545 477190 475849 473681
59579D73681k912l425l485l165k965l258l764l804l069k034j460j617k118k447
$$ 473681 470769 467344 463859 460694 457729 454471 450707 446903 443834 441800 440340 438723 436605 434158
59565D34158k426k050j180J75J433J830J301N37P2j88l08O7R30J381O27p41j249
$$ 434158 431732 429682 428502 428677 430110 431940 433241 433778 433850 433662 433354 433421 434351 435732 436359 435618 434369
59548D34369k60J436K751L408L795M212M612M973N628P006R088J1509J4430J8642
$$ 434369 434109 435545 438296 441704 445499 449711 454323 459296 464924 471930 481018 492527 506957 525599
59534E25599K3701K6337K2505J1924o10r476j3035j3320j2314j0320p437m522
$$ 525599 549300 575637 598142 610066 609456 599980 586945 573625 561311 550991 543554 539032
59522E39032k247n09P81J322J096N59m4p95j400j360r41j096k153l421m332n052
$$ 539032 536785 536276 537057 538379 539475 540034 539990 539195 537795 536435 535494 534398 532245 528824 524492 519440
59506E19440n753o154o205o383o825o889o059m709l568k874k414j970j441q46
$$ 519440 513687 507533 501328 494945 488120 481231 475172 470463 466895 464021 461607 459637 458196 457350
59492D57350m02k83k38N9M45N84P03J308K168K495K238K312L265M583N661O615
$$ 457350 456948 456665 456427 456486 456931 457515 458218 459526 461694 464189 466427 468739 472004 476587 482248 488863
59476D88863P672Q502Q744Q633Q547Q240P102M989K473L65q83j458j897k411k594
$$ 488863 496535 505037 513781 522414 530961 539201 546303 551292 553765 554130 553247 551789 549892 547481 544887
59461E44887k103j293p30l57K90J177J819K061K271K786L747N236P057Q575R374
$$ 544887 542784 541491 540761 540404 540694 541871 543690 545751 548022 550808 554555 559791 566848 575423 584797
59446E84797R694R675Q736O577M084K204N30j662l659m231l801l860m396l958
$$ 584797 594491 604166 612902 619479 623563 625767 626297 624635 620976 616745 612944 609084 604688 600730
59432F00730k472j888l400n821p421p850p448o222m401k695j212P99L448N721
$$ 600730 598258 596370 592970 587149 579728 571878 564430 558208 553807 551112 549900 550699 554147 559868
59418E59868P113Q512J0833J3924J7215K0318K2801K4921K8405L3985L7826L3548
$$ 559868 566981 575493 586326 600250 617465 637783 660584 685505 713910 747895 785721 819269
59406H19269J9564K013j1379j8138k0056j8514j3906p682j171O556J5924K2596
$$ 819269 838833 840846 829467 811329 791273 772759 758853 751171 750000 756556 772480 795076
59394G95076J9995O993r861k2786k9096l0477k8886k5205k0353j5637j2025r785
$$ 795076 815071 822064 812203 789417 760321 729844 700958 675753 655400 639763 627738 617953
59382F17953q470p093m999k768j439q77N8J683L007L360L250L243L096K576K160
$$ 617953 609483 602390 597391 594623 593184 592307 592365 594048 597055 600415 603665 606908 610004 612580 614740
59367F14740K266K554K499K114J688J391J427J940K548K584K052J727K022K461
$$ 614740 617006 619560 622059 624173 625861 627252 628679 630619 633167 635751 637803 639530 641552 644013
59353F44013K624K901L869N425P020Q293R164R634R898J0311J0972J1564J1754
$$ 644013 646637 649538 653407 658832 665852 674145 683309 692943 702841 713152 724124 735688 747442
59340G47442J1567J1228J0920J0678J0248R066O791L902J399j97j270k472l999
$$ 747442 759009 770237 781157 791835 802083 811149 817940 821842 823241 823044 821774 819302 815303
59327H15303n527o615p108p352p935r011r975j0122r492q751q377q347q527q920
$$ 815303 809776 803161 796053 788701 780766 771755 761780 751658 742166 733415 725038 716691 708164 699244
59313F99244r340r286q365o783n252m242l453k158j21K180M451P032R700J0555
$$ 699244 689904 680618 672253 665470 660218 655976 652523 650365 650244 652424 656875 663907 673607 684162
59299F84162P408M84p264j2913j5771j6707j6523j5708j4726j3584j1788r415
$$ 684162 691570 692054 684790 671877 656106 639399 622876 607168 592442 578858 567070 557655
59287E57655p465o448n458l570j358JM62Q49J471K070K734L721M702N153N247
$$ 557655 550190 543742 538284 534714 533356 533357 533819 534668 536139 538209 540943 544664 549366 554519 559766
59272E59766N480N863O378P652R979J2156J2589J1362R994R332Q918Q301P582
$$ 559766 565246 571109 577487 585139 595118 607274 619863 631225 641219 650551 659469 667770 675352
59259F75352O571M708K124k04j736k900m154n314o035o219n815m869l899l498
$$ 675352 681923 686631 688755 688551 686815 683915 679761 674447 668412 662193 656378 651509 647610 644112
59245F44112l498l164k245j191l91J32L62M20Q56K032L284L551K814J981J497
$$ 644112 640614 637450 635205 634014 633623 633755 634117 634537 635393 637425 640709 644260 647074 649055 650552
59230F50552R88L31qQ7L0n85j494k465l658n033o039o275n921n325m624l945l532
$$ 650552 651540 651871 651863 651950 651980 651395 649901 647436 643778 638745 632706 626431 620510 615185 610561 606616 603084
59213F03084l490l719m096m477m617m446m153l761k979j916j295j386j361n15
$$ 603084 599594 595875 591779 587302 582685 578239 574086 570325 567346 565430 564135 562749 561388 560873
59199E60873N22P40L70L00M87K44k10P5J142K051K483L048L836M071L464K789
$$ 560873 561395 562135 562505 562805 563292 563536 563326 563401 564543 566594 569077 572125 575961 580032 583496 586285
59183E86285K723L138L817M805N733N841N126M496M410M238L376K177J296Q86
$$ 586285 589008 592146 595963 600768 606501 612342 617468 621964 626374 630612 633988 636165 637461 638347
59169F38347P51P04N02K0l69k04K57L75J62J62L15n3j001j758j959k149k800l656
$$ 638347 639098 639802 640304 640324 639955 639751 640008 640383 640545 640707 641022 640969 639968 638210 636251 634102 631302 627646
59151F27646m310m672m759m721n100o206p316p410o677o184o164n862n132m783
$$ 627646 623336 618664 613905 609184 604084 597878 590562 583152 576475 570291 564127 558265 553133 548350
59137E48350n092n269m883m514m491m182l179k149j794j873j846j661j325n29
$$ 548350 543258 537989 533106 528592 524101 519919 516740 514591 512797 510924 509078 507417 506092 505563
59123E05563P53J987K852L664M650N560O308P222Q324R140R487R723R999J0061
$$ 505563 506316 508303 511155 514819 519469 525029 531337 538559 546883 556023 565510 575233 585232 595293
59109E95293R904R761R388Q396P288O954P069O393M840L745L627L369K268J285
$$ 595293 605197 614958 624346 632742 640030 646984 654053 660446 665286 669031 672658 676027 678295 679580
59095F79580J236J252K71j195k016k194k398k561k199j541j164r95o97n22r43
$$ 679580 680816 682068 682339 681144 679128 676934 674536 671975 669776 668235 667071 666076 665379 664857 663914
59080F63914j800k657l537m569n390n634n598n753o011o128o327o823p248p148
$$ 663914 662114 659457 655920 651351 645961 640327 634729 628976 622965 616837 610510 603687 596439 589291
59066E89291o682o211n676m890m022l319k741k312k295k643k898k992l417m216
$$ 589291 582609 576398 570722 565832 561810 558491 555750 553438 551143 548500 545602 542610 539193 534977
59052E34977m533l801k662k069k083k137j928j480q16j14K56L00M61Q66J083R20
$$ 534977 530444 526643 523981 521912 519829 517692 515764 514284 513468 513354 513610 513910 514371 515237 516320 517240
59036E17240P55P39N15R4J80J099K193K727K733K460J913J403J736L233N240P042
$$ 517240 517995 518734 519249 519343 519523 520622 522815 525542 528275 530735 532648 534051 535787 539020 544260 551302
59020E51302Q548R677J0040R715R487R741R917R502Q674P507N594L020P74m65
$$ 551302 559850 569527 579567 589282 598769 608510 618427 627929 636603 644110 649704 652724 653498 653033
59006F53033j056j507j790k013k576l113k463l87J848L269M249N081M955L444
$$ 653033 651977 650470 648680 646667 644091 640978 638515 638128 639976 643245 647494 652575 657530 660974
58992F60974J629N76j38j195k073k073j737j876k200k249k634l872m966m693l561
$$ 660974 662603 663179 663041 661846 659773 657700 655963 654087 651887 649638 647004 643132 638166 633473 629912
58977F29912k831k308q36J566L684N016O127P281Q121Q656R276R849R820R266
$$ 629912 627081 624773 623937 625503 629187 634203 640330 647611 655732 664388 673664 683513 693333 702599
58963G02599Q836Q800Q911R000Q861P922N883L402J351k34j830l545n326p376
$$ 702599 711435 720235 729146 738146 747007 754929 760812 764214 765565 765331 763501 759956 754630 747254
58949G47254r540j0985j1344j1502j2153j2510j1575r979r130r091q678p371n836
$$ 747254 737714 726729 715385 703883 691730 679220 667645 657666 648536 639445 630767 623396 617560
58936F17560m711m050l789l776l554k960k561k716k778k165j464j434j549q99
$$ 617560 612849 608799 605010 601234 597680 594720 592159 589443 586665 584500 583036 581602 580053 579154
58922E79154J16L33k99q00p79o63n97l16K7J15L34J251K442K952K712K494K773
$$ 579154 579270 579603 579304 578504 577725 577062 576465 576149 576176 576291 576625 577876 580318 583270 585982 588476 591249
58905E91249L595N101P104Q651R209R755J1341J3137J3414J2181J1043J0610R734
$$ 591249 594844 599945 607049 615700 624909 634664 646005 659142 672556 684737 695780 706390 716124
58892G16124P682N448M444M939O302P852R116R908J0444J0865J0814R984Q802
$$ 716124 723806 729254 733698 738637 744939 752791 761907 771815 782259 793124 803938 813922 822724
58879H22724P782O656M944L005J531M35p37j737k148k554l959o058p435p444o818
$$ 822724 830506 837162 842106 845111 846642 847077 846340 844603 842455 839901 835942 829884 822449 815005 808187
58864H08187o364o110n838n524n161m802m809n452o420p252p904q420q574q485
$$ 808187 801823 795713 789875 784351 779190 774388 769579 764127 757707 750455 742551 734131 725557 717072
58850G17072q841r823j0480j0016q869p790o756n854n981p333q311p539o034n612
$$ 717072 708231 698408 687928 677912 669043 661253 654497 648643 642662 635329 627018 619479 613445 607833
58836F07833o027n693m561m094m657n049m668m202l981l441k509j960k020j950
$$ 607833 601806 596113 591552 587458 582801 577752 573084 568882 564901 561460 558951 556991 554971 553021
58822E53021j250j87Q89J708J756J012O40J707L449M279M080L929L869K898J137
$$ 553021 551771 551584 552473 554181 555937 556949 557589 559296 562745 567024 571104 575033 578902 581800 582937
58807E82937J75Q50K158K724K163Q22p17j791k271k886m032m793m349l588l771
$$ 582937 583112 583962 586120 588844 591007 591829 591112 589321 587050 584164 580132 575339 570990 567402 563631
58792E63631m353l941k816k462k887k703j690j103j284j102n1J100K018L262M714
$$ 563631 559278 555337 552521 550059 547172 544469 542779 541676 540392 539290 539239 540339 542357 545619 550333
58777E50333N440N477N900O778O878N791M472L274J402j131k954l425l582m272
$$ 550333 555773 561250 567150 573928 580806 586597 591069 594343 595745 594614 591660 588235 584653 580381
58763E80381m980n220n503o112o384n909n197m608l860l042k762k924k702k009
$$ 580381 575401 570181 564678 558566 552182 546273 541076 536468 532608 529566 526804 523880 521178 519169
58749E19169j566j333m45J010J824J610J293J366J391J502K531M133M756M106
$$ 519169 517603 516270 515825 516835 518659 520269 521562 522928 524319 525821 528352 532485 537241 541347
58735E41347L758M582N422N269M854N101N558N502N190M978M512L739L396L641
$$ 541347 545105 549687 555109 560378 565232 570333 575891 581393 586583 591561 596073 599812 603208 606849
58721F06849L380J907N0j041j147m56J034K835L938M203M658N803O687O320M988
$$ 606849 610229 612136 612186 611145 609998 609542 610576 613411 617349 621552 626210 632013 638700 645020 650008
58706F50008L534K258R96n01k489m800o560p305p947r440j0978j1185j0593j0919
$$ 650008 653542 655800 656796 656295 653806 649006 642446 635141 627194 617754 606776 595591 584998 574079
58692E74079j2141j2579j1790j1047j0756r849q107o727o010m857l160k403l053
$$ 574079 561938 549359 537569 526522 515766 505917 497810 491083 485073 480216 477056 474653 471600
58679D71600l627l190k599k427j896p94k48n75m78O25J558J714K225L784N314
$$ 471600 467973 464783 462184 459757 457861 457067 456819 456244 455766 456391 457949 459663 461888 465672 470986
58664D70986N977O490P367P883P742P716P614N863K254j131k874l904n127n803
$$ 470986 476963 483453 490820 498703 506445 514161 521775 527638 529892 528761 525887 521983 516856 511053
58650E11053n551n496n954n455l628k523l274l995l029j844k394l785m023l230
$$ 511053 505502 500006 494052 488597 484969 482446 479172 475177 472148 470304 467910 464125 460102 456872
58636D56872k682k251j204j85j68o36o77n96p25j68J466K655K155J095R48J162
$$ 456872 454190 451939 450735 450550 450382 449746 449069 448473 447748 447580 449046 451701 453856 454951 455899 457061
58620D57061P12L52J093K000J773J191J711K867L335L402M104M980M823L853L064
$$ 457061 457773 458125 459218 461218 462991 464182 465893 468760 472095 475497 479601 484581 489404 493257 496321
58605D96321K341J154K08M90J496K161K687L734M761M858M269L559K330L55j166
$$ 496321 498662 499816 500024 500514 502010 504171 506858 510592 515353 520211 524480 528039 530369 530724 529558
58590E29558j196n55l50%J460L272M055L996M216M937N845P164Q830R715R152
$$ 529558 528362 527807 527457 527457 528917 532189 536244 540240 544456 549393 555238 562402 571232 580947 590099
58575E90099Q102P488O839N876N687O677P251O387N723P012R253J0537J1151J2545
$$ 590099 598201 605689 612528 618404 624091 630768 638019 644406 650129 657141 666394 676931 688082 700627
58561G00627J4637J6453J8137K0145K1644K1764K1157K0426J8515J4646J0210
$$ 700627 715264 731717 749854 769999 791643 813407 834564 854990 873505 888151 898361
58550H98361O689L384n48l655m302l608l616m152m088m171n717p893r145j0086
$$ 898361 905050 908434 907886 904231 899929 896321 892705 888553 884465 880294 874577 866684 857539 847453
58536H47453j2168j4669j5859j6004j6468j6880j6033j4521j3692j3007j1188
$$ 847453 835285 820616 804757 788753 772285 755405 739372 724851 711159 698152 686964
58525F86964r001q039p781o710n392n413o223o005m955m655m889m127k599j942
$$ 686964 677963 669924 662143 655433 650041 644628 638405 632400 627445 622790 617901 613774 611175 609233
58511F09233k217k023j194p36n41K66J170R59J1m14m40q05q44K95J449J094J21
$$ 609233 607016 604993 603799 603063 602522 602788 603958 604917 604928 604514 604074 603269 602425 602720 604169 605263 605384
58494F05384L15J189J202R51K004L637L909L174L315M225M311L838M499O132P057
$$ 605384 605699 606888 608090 609041 611045 614682 618591 621765 625080 629305 633616 637454 641953 648085 655142
58479F55142P266Q199R869J1113J2159J3926J5385J4701J2425J0487Q756N703
$$ 655142 662408 670607 680476 691589 703748 717674 733059 747760 760185 770672 779428 785131
58467G85131J817j021k916n386p901q410o976n539m440k386M32K461L744N633
$$ 785131 786948 785927 783011 777625 769724 761314 754338 748799 744359 741973 742405 744866 748610 754243
58453G54243P879R050R312R841J0150R086P643P392P063M277j75l441n191p254
$$ 754243 762122 771172 780484 790325 800475 809561 817204 824596 831659 835936 835761 832320 827129 819875
58439H19875r482j0052r299r171r267p548m590k984k799j812O0Q89J077K988O232
$$ 819875 810393 800341 791042 781871 772604 765056 760466 757482 754683 752871 752931 753820 754897 757885 764117
58424G64117P775P066O726P740Q286P695P416P445O016L320J604J085l07k777
$$ 764117 771892 778958 785684 793424 801710 809405 816821 824266 830282 833602 835206 836291 835984 833207
58410H33207m289m576n377o482n792l759l308m894n796m949m142l967k866q47
$$ 833207 828918 824342 818965 812483 806691 802932 799624 794730 788934 783985 779843 775876 773010 772163
58396G72163K09N41K443N628P047O057N370O149O552N850N589N880M948L104K798
$$ 772163 772372 772913 775356 780984 788031 794088 799458 805607 812159 818009 823598 829478 834426 837530 840328
58381H40328M044M249L131L176M637M959L833L888N472N831M486M283N933O619
$$ 840328 844372 848621 851752 854928 859565 864524 868357 872245 877717 883548 888034 892317 898250 904869
58367I04869N393M926O424P684P615P920R043R179Q568R782J2568J3486J1856
$$ 904869 910262 915188 921612 929296 936911 944831 953874 963053 971621 981403 993971 1007457 1019313
58354A019313J0892J1688J1466R228P657P787P257N429M894O169O416N097N294
$$ 1019313 1030205 1041893 1053359 1062587 1070244 1078031 1085288 1090717 1095611 1101780 1108196 1113293 1118587
58341A118587P727R156Q555R012J1547J2953J1996J1866J4138J6063J6195J6928
$$ 1118587 1126314 1135470 1144025 1153037 1164584 1177537 1189533 1201399 1215537 1231600 1247795 1264723
58329A264723J9088J9811J8237J7426J8320J7657J4350J1829J1588J0562P570
$$ 1264723 1283811 1303622 1321859 1339285 1357605 1375262 1389612 1401441 1413029 1423591 1431161
58318A431161O024P450Q553P599P428R219R735P877P549J0672J3682J4168J4713
$$ 1431161 1437185 1444635 1453188 1460787 1468215 1477434 1487169 1495046 1502595 1513267 1526949 1541117 1555830
58305A555830J6918J8026J6838J6612J8790K0159J9386J9764K2418K3677K2287
$$ 1555830 1572748 1590774 1607612 1624224 1643014 1663173 1682559 1702323 1724741 1748418 1770705
58294A770705K2120K4490K5222K2791K1742K4320K6432K5724K5879K8838L0729
$$ 1770705 1792825 1817315 1842537 1865328 1887070 1911390 1937822 1963546 1989425 2018263 2048992
58283B048992K9714K9864L3006L4853L3499L3338L6239L7570L5569L5553L9852
$$ 2048992 2078706 2108570 2141576 2176429 2209928 2243266 2279505 2317075 2352644 2388197 2428049
58272B428049M2926M1794M1797M6343N0526N0964N2316N7639O1942O1993O2889
$$ 2428049 2470975 2512769 2554566 2600909 2651435 2702399 2754715 2812354 2874296 2936289 2999178
58261B999178O8114P2739P3294P4565P9678Q3545Q3245Q4436R0215R4428R3605
$$ 2999178 3067292 3140031 3213325 3287890 3367568 3451113 3534358 3618794 3709009 3803437 3897042
58250C897042R4292J00595J06013J06187J07766J15649J23477J26306J30416J40701
$$ 3897042 3991334 4091929 4197942 4304129 4411895 4527544 4651021 4777327 4907743 5048444
58240E048444J50745J55703J62278J75361J87788J94370K02635K18255K33802
$$ 5048444 5199189 5354892 5517170 5692531 5880319 6074689 6277324 6495579 6729381
58231F729381K43787K56285K77153K97884L12287L29442L56344L84054M05837
$$ 6729381 6973168 7229453 7506606 7804490 8116777 8446219 8802563 9186617 9592454
58222I592454M31813M69942N10325N45074N85216O40186O99962P56450Q22403
$$ 9592454 10024267 10494209 11004534 11549608 12134824 12775010 13474972 14231422 15053825
58213A5053825R08980J005837J104898J221248J367556J531782J704999J905928
$$ 15053825 15962805 16968642 18073540 19294788 20662344 22194126 23899125 25805053
58205B5805053K152079K435440K756354L150879L652367M259435M977552N854824
$$ 25805053 27957132 30392572 33148926 36299805 39952172 44211607 49189159 55043983
58197E5043983O936721Q228880R752097J1585552J3799045J6394748J9376534
$$ 55043983 61980704 70209584 79961681 91547233 105346278 121741026 141117560
58190A41117560K2807011K6712400L0990769L5430614L9530093M1961387M0414870
$$ 141117560 163924571 190636971 221627740 257058354 296588447 338549834 378964704
58183C78964704L2733655J8826928J468937j5103082k7589028l4910270l7737638
$$ 378964704 411698359 430525287 431994224 416891142 389302114 354391844 316654206
58176C16654206l7365265l5035824l1754694k8200627k4698892k1371424j8314268
$$ 316654206 279288941 244253117 212498423 184297796 159598904 138227480 119913212
58169A19913212j5610300j3266886j1244888r526442q099777o914310n909060
$$ 119913212 104302912 91036026 79791138 70264696 62164919 55250609 49341549
58162D9341549n062396m370287l801318l314740k900123k560944k278907k028590
$$ 49341549 44279153 39908866 36107548 32792808 29892685 27331741 25052834 23024244
58154B3024244j808835j627687j472991j326861j193135j083131r88887q95896
$$ 23024244 21215409 19587722 18114731 16787870 15594735 14511604 13522717 12626821
58146A2626821q08088p36061o73869o10675n52654n11024m79739m45974m11798
$$ 12626821 11818733 11082672 10408803 9798128 9245474 8734450 8254711 7808737 7396939
58137G396939l85546l62472l33598l03955k83239k67349k47033k25953k12820
$$ 7396939 7011393 6648921 6315323 6011368 5728129 5460780 5213747 4987794 4774974
58128D774974k03933j90378j74823j64990j57956j46515j34035j27764j24096
$$ 4774974 4571041 4380663 4205840 4040850 3882894 3736379 3602344 3474580 3350484
58119C350484j15364j04774j00169r9025r3738q6157q3035q2387p7710p0959o8413
$$ 3350484 3235120 3130346 3030177 2931152 2837414 2751257 2668222 2585835 2508125 2437166 2368753
58108B368753o8202o4308n8540n6637n6695n3104m7843m6666m7993m6448m3413
$$ 2368753 2300551 2236243 2177703 2121066 2064371 2011267 1963424 1916758 1868765 1822317 1778904
58097A778904m3493m4610m2008l8158l8192l9556l6514l1178k9612l0592k8610
$$ 1778904 1735411 1690801 1648793 1610635 1572443 1532887 1496373 1465195 1435583 1404991 1376381
58086A376381k4705k4036k5591k4461k1710k2173k4742k4459k2046k2126k3956
$$ 1376381 1351676 1327640 1302049 1277588 1255878 1233705 1208963 1184504 1162458 1140332 1116376
58075A116376k3043k0161j9906k1844k1626j9337j8638j9150j7568j4832j4514
$$ 1116376 1093333 1073172 1053266 1031422 1009796 990459 971821 952671 935103 920271 905757
58064I05757j5614j4398j1706j1167j1977j0662q284q535j0491j0432r186j0440
$$ 905757 890143 875745 864039 852872 840895 830233 821949 813414 802923 792491 783305 772865
58052G72865j3325j3834j2151j1635j2036j0528q089p972r194q259n959n871p479
$$ 772865 759540 745706 733555 721920 709884 699356 691267 683295 674101 665842 659883 654012 646533
58039F46533p392o042o610q496q397o701o467p268o382m811n738q211q713p812
$$ 646533 639141 633099 626489 617993 609596 602895 596428 589160 582778 577967 572229 564018 555305 547493
58025E47493q809j0904j0328p409o073o884o889n803o093p397o851m787m271n327
$$ 547493 538684 527780 517452 510043 503970 497086 490197 484394 478301 470904 464053 459266 454995 449668
58011D49668n186l779l476l951k849r74j254l198l794l185l863n079l865r85n4
$$ 449668 444482 440703 437227 433276 430427 429453 428199 425001 421207 418022 414159 409080 405215 404230 404176
57996D04176j302j883j734l139n010l857l43J254J65k10J067J205m80j307o00
$$ 404176 402874 400991 399257 396118 391108 387251 386908 388162 388327 388117 389184 390389 389909 388602 388002
57981C88002p76k310k793j818j777l108l575k830k910l763l137j263q17j799j408
$$ 388002 387226 384916 382123 380305 378528 375420 371845 369015 366105 362342 359205 357942 357125 355326 353918
57966C53918O46J626R19P32J313N33j185q07J720K875J471J75J77n87k783m085
$$ 353918 354564 356190 357109 357841 359154 359687 358502 357695 359415 362290 363761 363936 364113 363526 360743 356658
57950C56658l617l385m011l521j619p47j519j459L57J690J520J854L712N283N517
$$ 356658 353041 349656 345645 342124 340505 339758 338239 336780 337137 338827 340347 342201 345913 351196 356713
57935C56713N741O493O451N714O265Q020Q269O186M079L090J589j036k949l577
$$ 356713 362454 368947 375398 381112 387377 395397 403666 409852 413931 417021 418610 417574 414625 411048
57921D11048m894p535r321r111q541q628q153o773o181o804o681m950l291k680
$$ 411048 406154 398619 389298 380187 371646 363018 354865 348092 341911 335107 328426 323476 320185 317505
57907C17505k019r29n71p86J21J832J936J81q91n08q43k505l016j321K39J55J20
$$ 317505 315486 314557 313986 313200 313321 315153 317089 317270 316379 315871 315028 312523 309507 308186 308425 308580 308700
57890C08700J322K137J593J480K900M043L553K954L544L915K757J403J378J923
$$ 308700 310022 312159 313752 315232 318132 322175 325728 328682 332226 336141 338898 340301 341679 343602
57876C43602J753J022nj807l794m228l138k731l724m181l105k142k345k396j433
$$ 343602 345355 346377 346372 344565 340771 336543 333405 330674 326950 322769 319664 317522 315177 312781 311348
57861C11348p01p75k01J597K925K874K868L714M077L405L299M352M726L500K388
$$ 311348 310647 309872 309671 311268 314193 317067 319935 323649 327726 331131 334430 338782 343508 347008 349396
57846C49396K428K097M71p85o03n65j776k646j912j044j493k257k230k238k748
$$ 349396 351824 353921 354392 353607 353004 352439 350663 348017 346105 345061 343568 341311 339081 336843 334095
57831C34095k299l71R80M37k99L87J347J339J486K699L424K424J316J676K150
$$ 334095 331796 331425 332405 332842 332543 332930 334277 335616 337102 339801 343225 345649 346965 348641 350791
57816C50791J053n40j039j432l394o158q021r072j0024j0082q511o676o146o240
$$ 350791 351844 351304 350265 348833 345439 339281 331260 322188 312164 302082 293571 286895 280749 274509
57802B74509n663m833m505l937k544j642k320l256k812j510m75O58K151K547J036
$$ 274509 268846 264013 259508 255571 253027 251385 249065 245809 242997 241487 241012 241670 243821 246368 247404
57787B47404m82q1J213J538J372K064K991K913K626L574N100N691N668O137O490
$$ 247404 246922 246841 248054 249592 250964 253028 256019 258932 261558 265132 270232 275923 281591 287728 294218
57772B94218N553M091L678L939L305J659O5j242k558l279k859k256k535l032k687
$$ 294218 299771 303862 307540 311479 314784 316443 316508 315266 312708 309429 306570 304314 301779 298747 296060
57757B96060k063k079j993p34Q22J081K80j65J0J89M87J225J695J273Q48J380
$$ 296060 293997 291918 289925 289191 290013 291094 291374 291209 291219 291408 291895 293120 294815 296088 296936 298316
57741B98316K090J848J224J315J642J179L55J72K89j52p56q24r19j718k314j601
$$ 298316 300406 302254 303478 304793 306435 307614 307969 308141 308430 308278 307522 306698 305779 304061 301747 300146
57725C00146l18J64Q4M02P49K71m39k46M83O61M75P89J355J432J389J913K473
$$ 300146 299828 299992 300076 300478 301227 301498 301059 300813 301296 301957 302432 303221 304576 306008 307397 309310 311783
57708C11783K262J798J932K175J716J129J396K125K474K800L737M675M835M716
$$ 311783 314045 315843 317775 319950 321666 322795 324191 326316 328790 331590 335327 340002 344837 349553
57694C49553M829M226K087m54k015l265n423p725q526p938p221o491n175l815
$$ 349553 354382 358608 360695 360241 358226 354961 349538 341813 333287 325349 318128 311637 306462 302647
57680C02647l283k919j534O07K635M959Q314J1941J4829J7774K2112K7432L2715
$$ 302647 299364 296445 294911 295518 298153 303112 311426 323367 338196 355970 378082 405514 438229
57667D38229L8712M6641N5106O0389N9232M9675L0934N360k0425l9448m9634n3369
$$ 438229 476941 523582 578688 639077 698309 747984 778918 784278 763853 724405 674771 621402
57655F21402n2968m9205m3410l7646l2508k7203k1901j7790j4938j2260r633p866
$$ 621402 568434 519229 475819 438173 405665 378462 356561 338771 323833 311573 301940 294074
57643B94074o754n267l571k771k764k312j203l29J68Q96J497R88l17j093j061
$$ 294074 287320 282053 278482 275711 272947 270635 269432 269103 269271 270167 271664 272652 272335 271242 270181
57628B70181r89r80o27m72j294k314k165j259j084j505j082J16L78q52k247k794
$$ 270181 269192 268212 267585 267113 265819 263505 261340 260081 258997 257492 256410 256526 256904 256052 253805 251011
57612B51011k764k387j537q63j259k224k398j763j484j751j617q92k97J35R29
$$ 251011 248247 245860 244323 243460 242201 239977 237579 235816 234332 232581 230964 230072 229775 229910 230839
57597B30839J616J205L9o29p28j069j370p17K72j2j515k557k432j863j035L98
$$ 230839 232455 233660 233699 233070 232342 231273 229903 229186 229458 229446 227931 225374 222942 221079 220044 220442
57581B20442J502P88j024j553l59M45k67j038n89J23k33j267j756j315l13P24
$$ 220442 221944 222732 221708 220155 219796 220241 219974 218936 218347 218470 218237 216970 215214 213899 213586 214310
57565B14310J112N06l87n95l16l93o96n08j22l35p47l57M85O78N38J218K312K295
$$ 214310 215422 215928 215541 214946 214630 214237 213541 213033 212911 212576 211829 211472 211957 212635 213173 214391 216703 218998
57547B18998J203M77L42j85q20k63R53P54q44j298N32K652L119K499K041J653
$$ 218998 220201 220678 221020 220835 220015 219752 220705 221459 220615 219317 219849 222501 225620 228119 230160 231813
57531B31813R07K09j45m86o69n2Q88Q37l4j06R30J546J178J139J992K357J422
$$ 231813 232720 232929 232784 232298 231629 231577 232465 233302 233268 233162 234092 235638 236816 237955 239947 242304 243726
57514B43726M27M61Q85J088J779L278M381M205L473K891J944M49m56l4Q57J261
$$ 243726 244153 244614 245499 246587 248366 251644 256025 260230 263703 266594 268538 268987 268531 268497 269354 270615
57498B70615J284R67j99j755k148j090k16m33n78K41J005P37K02K56L64J26M21
$$ 270615 271899 272866 272667 270912 268764 267674 267458 267025 266447 266688 267693 268430 268632 268888 269252 269378 269799
57481B69799J618K395J881J289J779K334J507j68j242j548j667j382l40O84P47
$$ 269799 271417 273812 275693 276982 278761 281095 282602 282434 281192 279644 277977 276595 276255 276939 277686
57466B77686J34l39n45n42j5Q10R48L31L38J538K516K209J704K276L092K655J202
$$ 277686 277820 277481 276936 276394 276379 277189 278137 278468 278806 280344 282860 285069 286773 289049 292141 294796 295998
57449B95998qo41q97l55J119K351K359J926K183K690K554K287K810L587L534K961
$$ 295998 295990 295349 294452 294097 295216 297567 299926 301852 304035 306725 309279 311566 314376 317963 321497 324458
57433C24458K781K627J668O11Q90K266L099K785K195J917J716J668K204L001L123
$$ 324458 327239 329866 331534 332145 333035 335301 338400 341185 343380 345297 347013 348681 350885 353886 357009
57418C57009K474J905J863J964J941K022K345K745L118L404L442L305L439L881
$$ 357009 359483 361388 363251 365215 367156 369178 371523 374268 377386 380790 384232 387537 390976 394857
57404C94857L959L300K491K021J451M26k89J21J116J572J468J646K313K896L120
$$ 394857 398816 402116 404607 406628 408079 408505 408216 408337 409453 411025 412493 414139 416452 419348 422468
57389D22468L244L361L323L281L546M076M582M979N285N389N327N366N474N170
$$ 422468 425712 429073 432396 435677 439223 443299 447881 452860 458145 463534 468861 474227 479701 484871
57375D84871M243L164K527K539L164M132M693M269L405L132L416L352K927L093
$$ 484871 489114 492278 494805 497344 500508 504640 509333 513602 517007 520139 523555 526907 529834 532927
57361E32927L912M263L857L824M630N111M478L618L443L513L397L761M906N730
$$ 532927 536839 541102 544959 548783 553413 558524 563002 566620 570063 573576 576973 580734 585640 591370
57347E91370N521N337O129O950O542N436M863M736M393M193M698N204M878M503
$$ 591370 596891 602228 608357 615307 621849 627285 632148 636884 641277 645470 650168 655372 660250 664753
57333F64753N267O519O555N232M108M224N154O021O270N679M669M283M991O000
$$ 664753 670020 676539 683094 688326 692434 696658 701812 707833 714103 719782 724451 728734 733725 739725
57319G39725O471O641O958P104O792O504O419N829M714M605O417Q687R520R107
$$ 739725 746196 752837 759795 766899 773691 780195 786614 792443 797157 801762 808179 816866 826386 835493
57305H35493Q754Q524P779O993P024P379P044O451O695P470P668P470P921Q848
$$ 835493 844247 852771 860550 867543 874567 881946 888990 895441 902136 909606 917274 924744 932665 941513
57291I41513R147Q796Q778R256R567R712J0161J0478R897Q955Q890R608R982R818
$$ 941513 950660 959456 968234 977490 987057 996769 1006930 1017408 1027305 1036260 1045150 1054758 1064740 1074558
57277A074558R830R980R652R262R828J0981J1263J0448R805J0004J0474J0863
$$ 1074558 1084388 1094368 1104020 1113282 1123110 1134091 1145354 1155802 1165607 1175611 1186085 1196948
57265A196948J1496J2174J2120J1382J0834J0675J0341R917J0102J0734J0903
$$ 1196948 1208444 1220618 1232738 1244120 1254954 1265629 1275970 1285887 1295989 1306723 1317626
57254A317626J0598J0716J1270J1188J0200R357R353R672R783R876J0083J0174
$$ 1317626 1328224 1338940 1350210 1361398 1371598 1380955 1390308 1399980 1409763 1419639 1429722 1439896
57242A439896J0276J0839J1671J2127J2206J2368J2374J1599J0455J0060J0499
$$ 1439896 1450172 1461011 1472682 1484809 1497015 1509383 1521757 1533356 1543811 1553871 1564370
57231A564370J0780J0562J0459J0596J0391R984J0359J1678J2901J3393J3570
$$ 1564370 1575150 1585712 1596171 1606767 1617158 1627142 1637501 1649179 1662080 1675473 1689043
57220A689043J3702J3417J2770J2476J2665J2582J1955J1517J1797J2475J3198
$$ 1689043 1702745 1716162 1728932 1741408 1754073 1766655 1778610 1790127 1801924 1814399 1827597
57209A827597J3977J4584J4648J4517J4919J5643J5781J5330J5244J5718J5886
$$ 1827597 1841574 1856158 1870806 1885323 1900242 1915885 1931666 1946996 1962240 1977958 1993844
57198A993844J5485J5370J5915J6298J5971J5591J5824J6374J6746J7035J7349
$$ 1993844 2009329 2024699 2040614 2056912 2072883 2088474 2104298 2120672 2137418 2154453 2171802
57187B171802J7387J7055J6709J6489J6236J6220J6918J7912J8096J7298J6563
$$ 2171802 2189189 2206244 2222953 2239442 2255678 2271898 2288816 2306728 2324824 2342122 2358685
57176B358685J6599J6958J7105J7131J6981J6128J4471J2665J1133R657Q238P384
$$ 2358685 2375284 2392242 2409347 2426478 2443459 2459587 2474058 2486723 2497856 2507513 2515751 2523135
57164B523135P198P068O652O261O061N747N252M881M625M248M050M443M821M174
$$ 2523135 2530333 2537401 2544053 2550314 2556375 2562122 2567374 2572255 2576880 2581128 2585178 2589621 2594442 2598616
57150B598616K893K584L739N006N174M573L977L531L378M067N531O712P013P161
$$ 2598616 2601509 2604093 2607832 2612838 2618012 2622585 2626562 2630093 2633471 2637538 2643069 2649781 2656794 2663955
57136B663955P982R194J0157J0880J1618J2162J2303J2279J2241J1843J0901R765
$$ 2663955 2671937 2681131 2691288 2702168 2713786 2725948 2738251 2750530 2762771 2774614 2785515 2795280
57124B795280Q628P145N170L321K361K551L869O266R469J3175J7619K3322L0113
$$ 2795280 2803908 2811053 2816223 2819544 2821905 2824456 2828325 2834591 2844060 2857235 2874854 2898176 2928289
57111B928289L7164M4104N1307N8923O6587P4403Q3409R4692J08680J25665J46416
$$ 2928289 2965453 3009557 3060864 3119787 3186374 3260777 3344186 3438878 3547558 3673223 3819639
57100C819639J71947K03080K40449K84541L35711L94392M60985N35089O15231
$$ 3819639 3991586 4194666 4435115 4719656 5055367 5449759 5910744 6445833 7061064
57091G061064O99859P88162Q79235R70838J059630J142235J215586J276460J320075
$$ 7061064 7760923 8549085 9428320 10399158 11458788 12601023 13816609 15093069 16413144
57082A6413144J337603J316274J247053J135276R99383Q52770O86708M75913K02972
$$ 16413144 17750747 19067021 20314074 21449350 22448733 23301503 23988211 24464124 24667096
57073B4667096j23747m73660q09444j099140j321756j469629j546994j564398
$$ 24667096 24543349 24069689 23260245 22161105 20839349 19369720 17822726 16258328
57065A6258328j533619j466620j375323j269523j155717j039084r25059q17757
$$ 16258328 14724709 13258089 11882766 10613243 9457526 8418442 7493383 6675626
57057F675626p18585o27935n46929m76281m14963l61535l15667k77168k44802
$$ 6675626 5957041 5329106 4782177 4305896 3890933 3529398 3213731 2936563 2691761
57048B691761k17332j94517j75970j60218j46048j33558j22853j12951j03092
$$ 2691761 2474429 2279912 2103942 1943724 1797676 1664118 1541265 1428314 1325222
57039A325222r3841q5744p8034o9668o0442n0335l9092k7081j4890j751J2803
$$ 1325222 1231381 1145637 1067603 997935 937493 887158 848066 820985 806095 804344 817147
57028H17147K4470K4715R023j6840m1373n7071o3714o4187o0794n5415m9817m4666
$$ 817147 841617 866332 875355 858515 817142 760071 696357 632170 571376 515961 466144 421478
57016D21478l9661l4969l1228k8283k5305k2052j8866j5712j2466r795q479q194
$$ 421478 381817 346848 315620 287337 262032 239980 221114 205402 192936 183141 174662 166468
57004A66468p999p613p209o561n552m883n057n320m784l853l258k498q13J068
$$ 166468 158469 150856 143647 137086 131534 126651 121594 116274 111490 107637 104379 101881 101068 102136
56990A02136J792J599J956L303M770N929P349R304J1179J2156J1538Q702L828
$$ 102136 103928 105527 107483 110786 115556 121485 128834 138138 149317 161473 173011 181713 185541
56977A85541j521n627q149r622j0092r382q154p290o538n024k806p45Q59K342
$$ 185541 184020 178393 170244 160622 150530 141148 132994 125704 119166 114142 111336 110591 111450 113792
56963A13792L731M867O199Q306J0864J3166J5229J7285J8546J7675J4248Q807
$$ 113792 117523 122390 128589 136895 147759 160925 176154 193439 211985 229660 243908 252715
56951B52715K001n156j0771j3374j3524j2952j2357j1241r533p874o378m498k153
$$ 252715 254716 249560 238789 225415 211891 198939 186582 175341 165808 157934 151556 147058 144905
56938A44905J65K385M920P761J0517J3274J6446J9863K2689K4062K3071J8699
$$ 144905 145070 147455 152375 160136 170653 183927 200373 220236 242925 266987 290058 308757
56926C08757J0856J196q075j5766k1360k4028k3370k0667j7907j5823j4000j2395
$$ 308757 319613 320809 312734 296968 275608 251580 228210 207543 189636 173813 159813 147418
56914A47418j1372j0598r400p988p063o400n225l781l145l560m151m211l625k264
$$ 147418 136046 125448 116048 108060 100997 94597 89372 85591 82446 78886 74735 70524 66899 64635
56900F4635k25J570K268K367K906L748M084M217N266P227Q952J0071J1349J3086
$$ 64635 64410 65980 68248 70615 73521 77269 81353 85570 90836 98063 107015 117086 128435 141521
56886A41521J4754J6294J8123J9501J8498J4208P914J566l735p480r223r054p768
$$ 141521 156275 172569 190692 210193 228691 242899 250813 252379 248644 241164 231941 222887 215119
56873B15119o144m521l044j550O86M152Q137J1509J4358J7808K2305K7190L1964
$$ 215119 208975 204454 201410 199860 200546 204698 212835 224344 238702 256510 278815 306005 337969
56860C37969L6774M1436M4798M5153M0707L0281J4832j914j5696k4699k9584l1233
$$ 337969 374743 416179 460977 506130 546837 577118 591950 590036 574340 549641 520057 488824
56848D88824l0004k6803k2896j8444j2744o117l0N080J0504J7293K4906L2448
$$ 488824 458820 432017 409121 390677 377933 371816 371786 376866 387370 404663 429569 462017
56836D62017M0069M8436N7573O6631P3810P6088P0047N3933K9206K95k6945m7471
$$ 462017 502086 550522 608095 674726 748536 824624 894671 948604 977810 978105 951160 903689
56824I03689n9267o3661o3068n8890n2057m4277l7080l0242k2797j5091q211j818
$$ 903689 844422 780761 717693 658803 606746 562469 525389 495147 472350 457259 449048 447230
56812D47230N433J3544K1228K8263L5722M3591M9931N2557M9838M0031K2381k95
$$ 447230 452663 466207 487435 515698 551420 595011 644942 697499 747337 787368 809749 809454
56800H09454k2145l8495m8354n2713n2572m9278m4710l9744l3965k7594k2082
$$ 809454 787309 748814 700460 647747 595175 545897 501187 461443 427478 399884 377802
56789C77802j7965j3920q986m018K42M783J0573J6606K1250K4299K6074K5430
$$ 377802 359837 345917 336931 332913 333155 337938 348511 365117 386367 410666 436740 462170
56777D62170K0512J1170n41j1990k1185k7070k9740l0272k9651k8152k5973k3743
$$ 462170 482682 493852 493311 481321 460136 433066 403326 373054 343403 315251 289278 265535
56765B65535k1790j9710j7232j4838j3004j1498r991q623p517o432n431n037n315
$$ 265535 243745 224035 206803 191965 178961 167463 157472 148849 141332 134900 129469 124432 119117
56752A19117n465m916l994l097k045p82N4q7r15j714j989j494l35P66J038O36
$$ 119117 113652 108736 104742 101645 99600 98818 98872 98785 97870 96156 94167 92673 92338 93104 94142 94778
56736I4778K82K0n65j053n27O08P58m55j436r66J56N77K84N3Q1J09J44K27J80
$$ 94778 95060 95080 94515 93462 92935 93543 94301 93846 92410 91444 91600 92177 92461 92514 92595 92704 92848 93075 93255
56717I3255J31N73J465K082K110K064K284K384J992J173M7j049j162K10J802J834
$$ 93255 93386 93959 95424 97506 99616 101680 103964 106348 108340 109513 109560 108511 107349 107559 109361 111195
56701A11195O12Q2P70J213O57J44K03q5q46n83J154K373J587J51kP50R49O26O75
$$ 111195 111807 111889 112659 113872 114529 114673 114876 114791 113945 113362 114516 116889 118476 118627 118625 119375 120324 120950 121625
56682A21625R14O89M73J030J792J708R78M94L08M5K0M84O10l90j826k566k697
$$ 121625 122539 123228 123701 124731 126523 128231 129209 129703 130011 130056 130076 130560 131170 130780 128954 126388 123691
56665A23691k798k470j096O10J364J135Q29P50N83L99M66N06K14J3L47Q77J168
$$ 123691 120893 118423 117327 117937 119301 120436 121265 122015 122598 122997 123463 123969 124183 124196 124543 125420 126588
56648A26588J354J300K45j681k805j999l77M66O67J152J627J292N68L69L63k43
$$ 126588 127942 129242 129487 127806 125001 123002 122625 123091 123758 124910 126537 127829 128397 128766 129129 128886
56632A28886r16n43N25R45M71j2j78m27o84n79n09j139k079k343j863j301p87
$$ 128886 127970 127427 127952 128897 129368 129356 129178 128751 128067 127488 126979 125840 123761 121418 119555 118254 117467
56615A17467j11L20k4p11r18o57l87MO51R05L52p4O37J820K110J506J028R56Q80
$$ 117467 117356 117676 117652 116941 116023 115366 114979 114983 115634 116539 116891 116817 117454 119274 121384 122890 123918 124874 125754
56596A25754R15J379J767J485J050J177J416J002M02M24O52L65J70R00J694J168
$$ 125754 126669 128048 129815 131300 132350 133527 134943 135945 136347 136771 137423 137788 137958 138858 140552 141720
56580A41720j62o46j31K26K95R21J849J875R84L23J15l83r72o03O17J478J852
$$ 141720 141558 140912 140781 141007 141302 142223 144072 145947 146931 147254 147369 146986 146014 145411 146028 147506 149358
56563A49358K800M418N533N810O274P426Q516Q943Q700P395M546J087j163j788
$$ 149358 152158 156576 162109 167919 174193 181619 190135 199078 207778 215173 219719 220806 219643 217855
56549B17855j925k207k198j943k100k440k014j086j006j924k491k096j563j323
$$ 217855 215930 213723 211525 209582 207482 205042 203028 201942 200936 199012 196521 194425 192862 191539
56535A91539q74l83p88j867k097j004J62O11R53J408J137O4n42j50J58k95p55
$$ 191539 190665 190282 189494 187627 185530 184526 184688 185299 186252 187660 188797 188861 188319 188169 188327 188032 187277
56518A87277q31j408k675l122j818r5L68j86m92k18K14N98O82o0j315j715p12
$$ 187277 186446 185038 182363 179241 177423 177328 177696 177510 177018 176800 177014 177612 178294 178234 176919 175204 174492
56501A74492L42J00q01q66N4Q44Q85O26O62J057J383J047q5j244j476q78l84l53
$$ 174492 174834 174934 174133 173267 173321 174165 175050 175676 176338 177395 178778 179825 179740 178496 177020 176142 175758 175405
56483A75405l02q7k29q29j253j120p16k46K98N13m1q00p54n0K88J68M55J118J102
$$ 175405 175103 175016 174787 173958 172705 171585 170869 170623 170921 171434 171393 170593 169839 169789 170077 170245 170700 171818 172920
56464A72920K78j95J05K32k44m09K35Q43Q21P96J231J531J315J196J478J505J009
$$ 172920 173198 173003 173108 173340 173096 172687 172922 173765 174586 175382 176613 178144 179459 180655 182133 183638 184647
56447A84647P79J176J393R56N73P85J001P15K97n3q28j926k302j626r49r56j007
$$ 184647 185426 186602 187995 188951 189524 190309 191310 192025 192322 192269 191441 189515 187213 185587 184638 183682 182675
56430A82675o76o51j251j528q46N1M71Q80J634K066J774J397J259P21k15l24Q23
$$ 182675 181999 181348 180097 178569 177723 177774 178245 179125 180759 182825 184599 185996 187255 187976 187761 187437 188260
56413A88260J838J656J039Q42M79n36j176n76L03K85j09J02N15L11j72l48p06
$$ 188260 190098 191754 192793 193635 194114 193578 192402 191826 192129 192414 192305 192407 192922 193233 193061 192713 192007
56396A92007j627k085j195R5M44K42N87J204J145P61J096J959K352K267K436K724
$$ 192007 190380 188295 187100 187195 187639 187881 188468 189672 190817 191578 192674 194633 196985 199252 201688 204412
56380B04412K315J257L89J11K23O32J142J102L24k40J95R71J061O65O94J277J872
$$ 204412 206727 207984 208373 208484 208707 209339 210481 211583 211907 211667 211862 212833 213894 214559 215253 216530 218402
56363B18402K233K283J785R52O53J109J371R34O84J289J909J696J383J899K603
$$ 218402 220635 222918 224703 225655 226308 227417 228788 229722 230406 231695 233604 235300 236683 238582 241185
56348B41185K352J415Q21O32L31N2J36K43J15L50J191J654J138P33J506K663L010
$$ 241185 243537 244952 245773 246405 246736 246788 246924 247167 247282 247632 248823 250477 251615 252348 253854 256517 259527
56331B59527L021L695M426L901K325R51K08l8P33K677M186L530J432J09K33O36
$$ 259527 262548 266243 270669 274570 276895 277846 278054 278016 278749 281426 285612 289142 290574 290683 290916 291552
56315B91552N25J71k60q04r65l68K20N6l9J081K784L567L504L927N071N947O318
$$ 291552 292077 292248 291988 291184 290219 289851 290071 290127 290088 291169 293953 297520 301024 304951 310022 315969 322287
56298C22287O894P614P431N958L989K400J633J959L055L754L369K750K884L295
$$ 322287 329181 336795 344226 350184 354173 356573 358206 360165 363220 366974 370343 373093 375977 379272
56284C79272L200L215M279N723O236O039O200O566O281N799O281P428P962P959
$$ 379272 382472 385687 389966 395689 401925 407964 414164 420730 427011 432810 439091 446519 454481 462440
56270D62440Q642J0136J1367J2061J2942J4065J4771J5244J6370J8194K0104K2287
$$ 462440 471082 481218 492585 504646 517588 531653 546424 561668 578038 596232 616336 638623
56258F38623K5350K8715L1297L3497L6765M1343M6245N1283N7255O4189P1182
$$ 638623 663973 692688 723985 757482 794247 835590 881835 933118 990373 1054562 1125744
56247A125744P8021Q5243R2627R9224J04823J09788J13544J14804J13257J09538
$$ 1125744 1203765 1289008 1381635 1480859 1585682 1695470 1809014 1923818 2037075 2146613
56237B146613J03728R5280Q4157P0623N4400L5612J6000k466j9626l6148n1281
$$ 2146613 2250341 2345621 2429778 2500401 2554801 2590413 2606413 2603947 2584321 2548173 2496892
56226B496892o3616p3419q2025q9281r3784r5398r5438r4532r2323q9061q5490
$$ 2496892 2433276 2359857 2277832 2188551 2094767 1999369 1903931 1809399 1717076 1628015 1542525
56215A542525q1404p6251p0789o6166o1852n6648n1247m7423m4991m2137l8463
$$ 1542525 1461121 1384870 1314081 1247915 1186063 1129415 1078168 1030745 985754 943617 905154
56204I05154l5239l2741k9906k6662k4149k2449k0391j7785j5633j4093j2484
$$ 905154 869915 837174 807268 780606 756457 734008 713617 695832 680199 666106 653622
56193F53622j1145j0938j1019r651p188n668n388m699l232k486k760k397q26L73
$$ 653622 642477 631539 620520 610869 603681 598013 592625 587926 584694 582208 579448 577051 576225 576598
56179E76598K40j48J07L48J02J38R52J986K863L746M287M004L663M317N176M673
$$ 576598 576838 576690 576797 577145 577247 577385 578337 580323 583186 586932 591219 595223 598886 603203 608379 613052
56163F13052L447L736N819P729Q504R100R881J0056R871J0664J2411J3760J4796
$$ 613052 616499 620235 626054 633783 642287 651387 661268 671324 681195 691859 704270 718030 732826
56150G32826J7053K0605K3944K6922L1029L6510M2253M8662N7416O8009P7777
$$ 732826 749879 770484 794428 821350 852379 888889 931142 979804 1037220 1105229 1183006
56139A183006Q5923R4073J02110J06823J05666R8948Q7770P3205N8399M7837M3057
$$ 1183006 1268929 1363002 1465112 1571935 1677601 1776549 1864319 1937524 1995923 2043760 2086817
56128B086817M1632M1008M0182L7228K9309J6727L669o518j3873j9005k1621k3324
$$ 2086817 2128449 2169457 2209639 2246867 2276176 2292903 2296572 2290054 2276181 2257176 2235555 2212231
56116B212231k8149l8247n1778o6202q0353r2178r8265r7681r3102q6616p7611
$$ 2212231 2184082 2145835 2094057 2027855 1947502 1855324 1757059 1659378 1566276 1479660 1402049
56105A402049o6316n5685m7704m1024l4153k7911k2974j8235j3413j0176q842
$$ 1402049 1335733 1280048 1232344 1191320 1157167 1129256 1106282 1088047 1074634 1064458 1055616
56094A055616p175m131j636r41n11Q23J979K480L722N789O599N853O080Q093R362
$$ 1055616 1048441 1044310 1042674 1041733 1041222 1042045 1044024 1046504 1050226 1056015 1062614 1068467 1074547 1082640 1092002
56079A092002Q716Q458R849J0726R894R568J0974J1872J1061J1110J3679J6252
$$ 1092002 1100718 1109176 1119025 1129751 1139645 1149213 1160187 1172059 1183120 1194230 1207909 1224161
56067A224161J6567J6257J7120J7725J6913J6703J8581K0518K0717K0694K1836
$$ 1224161 1240728 1256985 1274105 1291830 1308743 1325446 1344027 1364545 1385262 1405956 1427792
56056A427792K2719K2545K3163K5053K5508K3626K2462K3551K4111K2682K2271
$$ 1427792 1450511 1473056 1496219 1521272 1546780 1570406 1592868 1616419 1640530 1663212 1685483
56045A685483K4500K6087K4889K4009K5772K7210K6063K5666K8881L2469L2894
$$ 1685483 1709983 1736070 1760959 1784968 1810740 1837950 1864013 1889679 1918560 1951029 1983923
56034A983923L2609L5087L8462L9742M0733M4058M7654M8884M9733N2476N4594
$$ 1983923 2016532 2051619 2090081 2129823 2170556 2214614 2262268 2311152 2360885 2413361 2467955
56023B467955N3611N2438N4360N7233N8219N9510O3651O8067P0053P2163P6822
$$ 2467955 2521566 2574004 2628364 2685597 2743816 2803326 2866977 2935044 3005097 3077260 3154082
56012C154082Q0996Q2288Q4620R1240R7978J00475J02219J07994J15211J19514
$$ 3154082 3235078 3317366 3401986 3493226 3591204 3691679 3793898 3901892 4017103 4136617
56002D136617J23224J30164J37824J42814J48419J58397J69177J76605J84237
$$ 4136617 4259841 4390005 4527829 4670643 4819062 4977459 5146636 5323241 5507478
55993E507478J96355K09341K19002K29560K45784K63489K77856K93634L16327
$$ 5507478 5703833 5913174 6132176 6361736 6607520 6871009 7148865 7442499 7758826
55984G758826L41219L62539L85358M16281M50710M82368N16771N61511O12083
$$ 7758826 8100045 8462584 8847942 9264223 9714933 10197301 10714072 11275583 11887666
55975A1887666O61973P17627P87953Q68598R53179J049978J169806J308148J458620
$$ 11887666 12549639 13267266 14055219 14923817 15876996 16926974 18096780 19404928 20863548
55966B0863548J633117J848181K103671K397440K748292L180358L699448M312348
$$ 20863548 22496665 24344846 26448517 28845957 31594249 34774607 38474055 42786403
55958D2786403N053671N963551P057258Q352025R902866J1769662J3969576J6506126
$$ 42786403 47840074 53803625 60860883 69212908 79115774 90885436 104855012 121361138
55950A21361138J9413967K2713106K6336455L0112348L3634898L5896246L5125464
$$ 121361138 140775105 163488211 189824666 219937014 253571912 289468158 324593622
55943C24593622K9516849J8661433M390470r989802k1506696k8810318l2128351
$$ 324593622 354110471 372771904 377162374 367172572 345665876 316855558 284727207
55936B84727207l2448746l0849024k8232948k5241742k2226477j9335780j6654652
$$ 284727207 252278461 221429437 193196489 167954747 145728270 126392490 109737838
55929A09737838j4252327j2151243j0331406q774577p469106o381731n465171
$$ 109737838 95485511 83334268 73002862 64228285 56759179 50377448 44912277
55922D4912277m691757m050710l519386l066433k678012k354331k084638j849364
$$ 44912277 40220520 36169810 32650424 29583991 26905979 24551648 22467010 20617646
55914B0617646j642371j468427j322179j190200j070273r69122q83913q04063
$$ 20617646 18975275 17506848 16184669 14994469 13924196 12955074 12071161 11267098
55906A1267098p28661o64930o11670n60381n10720m69574m36398m03733l70733
$$ 11267098 10538437 9873507 9261837 8701456 8190736 7721162 7284764 6881031 6510298
55897F510298l42762l19122k94027k68286k47780k31641k13721j94400j79500
$$ 6510298 6167536 5848414 5554387 5286101 5038321 4806680 4592959 4398559 4219059
55888D219059j68587j55664j40792j30383j26238j23986j21822j21431j20895
$$ 4219059 4050472 3894808 3754016 3623633 3497395 3373409 3251587 3130156 3009261
55879C009261j15863j07471j00724r5749q8745q0433p5205p2830o9274o4863o3542
$$ 3009261 2893398 2785927 2685203 2589454 2500709 2420276 2345071 2272241 2202967 2138104 2074562
55868B074562o4691o3641n9847n6898n4980n0779m4566m0135l8109l6069l4650
$$ 2074562 2009871 1946230 1886383 1829485 1774505 1723726 1679160 1639025 1600916 1564847 1530197
55857A530197l6584m0341m1535m0078l9304l8946l5935l1333k9274k9535k8331
$$ 1530197 1493613 1453272 1411737 1371659 1332355 1293409 1257474 1226141 1196867 1167332 1139001
55846A139001k6021k6690l0075l1257k8867k6593k5922k4255k1111j9525k0002
$$ 1139001 1112980 1086290 1056215 1024958 996091 969498 943576 919321 898210 878685 858683
55835H58683j9369j6905j5649j6324j5830j3246j1664j2405j2710j0939r222r180
$$ 858683 839314 822409 806760 790436 774606 761360 749696 737291 724581 713642 704420 695240
55823F95240r504r338r856j1132j1429j0691j0918j2263j2605j1631j1310j1822
$$ 695240 685736 676398 666542 655410 643981 633290 622372 610109 597504 585873 574563 562741
55811E62741j1074q886p516p448o730n047m259m407l312q76M51J65N79K407L574
$$ 562741 551667 542781 535265 527817 521087 516040 511781 507374 504062 503186 503637 503802 504381 506788 510362
55796E10362L236K976L188K271L73j23J164J751O66j09N12J181J393K430L862
$$ 510362 513598 516574 519762 522033 522406 522283 523447 525198 525864 525755 526267 527448 528841 531271 535133
55781E35133K944j080n451p808q408p505m081J599P605J3655K1445L0451L6549
$$ 535133 538077 536997 531546 523738 515330 507825 503744 505343 512948 526603 548048 578499 615048
55768F15048L6031K8315J4260m507k3553l6779m1616m0625l7201l2527k7348k3102
$$ 615048 651079 679394 693654 689147 665594 628815 587199 546574 509373 476846 449498 426396
55756D26396j9950j6660j3518j2326j2811j2424j0548r391r672r139o777m738
$$ 426396 406446 389786 376268 363942 351131 338707 328159 318768 309096 299957 293180 288442
55744B88442m435m158k403k83J212L132N730O729M564P97k514n311p708q495p414
$$ 288442 284007 279849 277446 277163 278375 281507 287237 293966 298530 299327 296813 291502 283794 275299 267885
55729B67885o420o769p120o205n018m653m413l713l511m139m008k227l01M41R65
$$ 267885 261465 254696 247576 241371 236353 231700 227287 223574 220063 215924 211916 209689 209388 209829 210794
55714B10794K580M972P584J0640J3366J3591J0709O762L203q50n643q909r022
$$ 210794 213374 218346 225930 236570 249936 263527 274236 280998 284201 283351 277708 268799 259777
55701B59777p661p154p423p493p820q856r351q263o727o113n802m768l613l109
$$ 259777 252116 244962 237539 230046 222226 213370 204019 195756 189029 182916 177114 172346 168733 165624
55687A65624k475j008J59j13q55n56N45J424K133L108L887M001L887L725K843
$$ 165624 163149 162141 162300 162187 161332 160776 161321 162745 164878 167986 171873 175874 179761 183486 186329
55672A86329J390P98J435J660N21o11m83J3j98m64r0J11l54k96Q79J587O18o46
$$ 186329 187719 188517 189952 191612 192133 191522 191039 191052 190854 190390 190300 190411 190057 189761 190640 192227 192845 192199
55654A92199n82J06J51J17Q54J428Q60K91J035K131K056J372J331J380M11r09
$$ 192199 191617 191723 191874 191991 192845 194273 195133 195424 196459 198590 200646 202018 203349 204729 205140 204231
55638B04231j494k209m373p009q094p635p134o847n998m935m714n097m997m380
$$ 204231 202737 200528 196155 189146 181052 173417 166283 159436 153438 148503 143789 138692 133695 129315
55624A29315l847l068j463K05P89N61M25J64p16j386r25k15p21k126l032l208
$$ 129315 125468 122400 120937 121142 121931 122492 122917 123081 122365 120979 120054 119839 119118 116992 113960 110752
55608A10752l264l007k070j304j551j857r62K51j8j506k317j861j232j000p30
$$ 110752 107488 104481 102411 101107 99556 97699 96737 96988 96970 95464 93147 91286 90054 89054 88324
55593H8324l73l22k86K09N36j46j183j260m56J81N32J238K186K809L370M288M888
$$ 88324 87951 87629 87343 87552 88088 87942 86759 85499 85043 85224 85756 86994 89180 91989 95359 99647 104535
55576A04535M517M167N148O872P895Q429R788J1877J3291J3403J2427R953N670
$$ 104535 109052 113219 118367 125239 133134 141563 151351 163228 176519 189922 202349 212302 217972
55563B17972J076j774l006m362o214p303p303p353p917q264q180q274q428p792
$$ 217972 219048 217274 214268 209906 203692 196389 189086 181733 173816 165552 157372 149098 140670 132878
55549A32878o537n794n754n466m617l821l174k161j056o51p01k86M03M22M8M36
$$ 132878 126341 120547 114793 109327 104710 100889 97715 95554 94498 93847 93146 92860 93263 93685 93733 94169
55533I4169J373J480P02M72J166J530J047Q02J327J523N32r49j970k507k747k550
$$ 94169 95542 97022 97724 98196 99362 100892 101939 102741 104068 105591 106123 105174 103204 100697 97950 95400
55517I5400k163k190k426k043j222j145k009k589k228j782j978k283k028j438
$$ 95400 93237 91047 88621 86578 85356 84211 82202 79613 77385 75603 73625 71342 69314 67876
55503F7876q76k23M38N58N3m72o85p71n84K58J233J110k93j736k188j814j154
$$ 67876 67000 66777 67215 67773 67826 67354 66669 65898 65314 65572 66805 67915 67622 65886 63698 61884 60730
55486F0730m80j49m35q22n44J3k46j297j891j445o72j91J42L13K0l57n8N59L79
$$ 60730 60250 60101 59666 58844 58300 58313 58067 56770 54879 53434 52762 52571 52713 53026 53046 52689 52631 53190 53569
55467E3569m19l45R19J789J198J76R4P13R35L63p01j823k352j706l50M59L76L29
$$ 53569 53150 52805 53724 55513 56711 56887 56981 57694 58629 58992 58291 56468 54116 52410 52060 52519 52895 53224
55449E3224Q25J068M22m80p63m77q2K59L56q8p38p45n2M19K59J09K89J59n84j175
$$ 53224 54049 55117 55539 55059 54296 53819 53737 53996 54352 54264 53526 52781 52729 53148 53407 53516 53805 53964 53380 52205
55429E2205r70l55J75P39J275J171L99l9M36J102J208J067J163J249J206J719
$$ 52205 51235 50880 51055 51794 53069 54240 54639 54600 55036 56138 57346 58413 59576 60825 62031 63750
55413F3750L089M208L816K154M64n99j264j862k513l191l547l131k177j584j715
$$ 63750 66839 71047 74863 77017 77481 76882 75618 73756 71243 68052 64505 61374 59197 57613 55898
55398E5898j929j758j635j858j735n93R46J621J067N0n75o28m52m35n34l01L97
$$ 55898 53969 52211 50576 48718 46983 46390 47336 48957 50024 50074 49499 48871 48419 47984 47450 47149 47546
55381D7546R39P49K58K52N33K97l30m15Q4R5p65j555j586j346j308j054k87M00
$$ 47546 48485 49234 49492 49744 50277 50574 50244 49829 49913 50008 49243 47688 46102 44756 43448 42394 42107 42507
55363D2507M55J44j94o49j013o05N33J342J214P50N05J85k46J5J140J852J169
$$ 42507 42962 43106 42912 42263 41250 40645 41178 42520 43734 44484 44989 45174 44928 44943 46083 47935 49104
55346D9104n2m57j50j41n77p78m93l8L76N88K00p71j434j060j26M22M34L22R2
$$ 49104 49052 48595 48445 48304 47727 46949 46456 46418 46794 47382 47582 46811 45377 44317 44191 44613 45047 45369 45461
55327D5461m31p84k40J034J941J631L67p48q14p5K61m60j282q60N39J371J154
$$ 45461 45030 44246 44006 45040 46981 48612 48979 48231 47417 47342 47603 47143 45861 45001 45540 46911 48065
55310D8065R56J344J338K04j187j692j448j085n01M82J196R82K67k32n97j069
$$ 48065 49021 50365 51703 51907 50720 49028 47580 46495 45994 46476 47672 48654 48921 48689 48092 47023
55294D7023j117k76P51R20L67R3N16J219J742J800J189J75m33k30K30L40K53K55
$$ 47023 45906 45630 46381 47301 47668 47761 48277 49496 51238 53038 54227 54402 53969 53739 53969 54309 54562 54817
55276E4817J40j78k40N4K0n75q32j53O00M34j94k77Q3J90K04P18J393J305L96
$$ 54817 54957 54779 54539 54593 54613 54038 53206 53053 53653 54087 53893 53616 53699 53889 54093 54811 56204 57509 57905
55257E7905n55j110j304j019k43L90K21m81r74j056r07n26n3j5m46n12J10L46
$$ 57905 57350 56240 54936 53917 53674 54064 54285 53804 52830 51774 50867 50341 50288 50273 49827 49315 49425 49771
55239D9771n96j625j211K59J091P18L1l68o92r17o85k40k13n18n53l30k98k47
$$ 49771 49175 47550 46339 46598 47689 48407 48438 48070 47378 46461 45776 45536 45323 44805 44252 43922 43624 43377
55221D3377L82J230J365Q00N11Q87J286J155N98j14o30l29Q78J852J480L33j83
$$ 43377 43759 44989 46354 47154 47665 48552 49838 50993 51591 51477 50847 50518 51396 53248 54728 55061 54878
55204E4878l5m01j417j787q86L22Q71R61R83P41K09j2K73L96m4m27j49L82M72
$$ 54878 54843 54442 53025 51238 50352 50674 51545 52506 53489 54230 54439 54427 54700 55096 55052 54625 54476 54858 55330
55185E5330J19k54n19p03o83m67l95o06p57n60k23p2q2l8J62M94Q40R02M75j97
$$ 55330 55449 55195 54676 53973 53290 52823 52428 51822 51065 50505 50282 50210 50128 50090 50252 50746 51586 52488 52963 52766
55165E2766o33o83n98n48m46j62L53J042J524J260L54k62Q6R05J287J130Q95N98
$$ 52766 52133 51450 50852 50304 49858 49696 50049 51091 52615 53875 54229 53967 54053 54958 56245 57375 58270 58868
55147E8868n3q23j131q80l94K40R47J181N70k43l76n7j52n67l61N76J220R25J53
$$ 58868 58815 57992 56861 55981 55587 55827 56774 57955 58525 58282 57906 57849 57697 57130 56769 57345 58565 59490 59643
55128E9643n21j028j200n98O15J449J257M63j28k36j02j18n83j275j420o12M34
$$ 59643 59122 58094 56894 56296 56911 58360 59617 60080 59952 59716 59614 59496 58913 57638 56218 55606 56040
55111E6040P57N44O40J018Q66J66j24L28O62K61l47m53j39J97M98P46O89L16l1
$$ 56040 56797 57341 57981 58999 59865 60031 59907 60235 60897 61158 60811 60358 60219 60416 60914 61660 62349 62665 62634
55092F2634k33m64n63p6Q65J481J405J091R62R02Q60J078J442J357N53n60j538
$$ 62634 62401 61937 61374 61298 62163 63644 65049 66140 67102 68004 68864 69942 71384 72741 73294 72734 71196
55075G1196k204k231j323j6N59M4p40j004p70l30K14N61K60m69p77l39L21Q40
$$ 71196 68992 66761 65438 65422 65981 66025 65285 64281 63511 63181 63395 63956 64216 63747 62970 62631 62952 63792
55057F3792J436K018J901R00j87p02q52r69q88n44k78j26L10Q31N34p02j634j355
$$ 63792 65228 67246 69147 70047 69860 69158 68306 67337 66449 65905 65627 65501 65811 66642 67176 66474 64840 63485
55039F3485n45k43l01r7J06k75q17n68M03R90N65l63r37p57NP88J000O63M70Q58
$$ 63485 62940 62697 62396 62299 62405 62130 61313 60745 61148 62138 62703 62340 61403 60646 60651 61439 62439 63102 63572 64430
55019F4430J349J213M72k45n35m25p9K25P8n39r66n60M11R69M93o40j440j183
$$ 64430 65779 66992 67464 67219 66684 66259 66180 66405 66483 65944 64978 64418 64829 65798 66291 65651 64211 63028
55001F3028r1Q25Q23K78J24N84J013R52O50M13J66j48l81n71q61r65m54L08M69
$$ 63028 62937 63762 64585 64863 64987 65571 66584 67536 68186 68599 68765 68617 68236 67665 66804 65839 65385 65693 66162
54982F6162J26L36J303J774R22k94n96j67K8o3J51N58N38K29L59R37J113N06k68
$$ 66162 66288 66624 67927 69701 70623 70329 69733 69566 69594 69531 69682 70240 70778 71007 71366 72303 73416 73922 73654
54963G3654n29k89P0L52N36O31O63O50O06O52Q82J019N60m21j095q53r2L85L42
$$ 73654 73125 72836 72906 73258 73794 74425 75088 75738 76344 76996 77878 78897 79457 79036 77941 77088 76996 77381 77723
54944G7723O4k88p13j047j075q22l90K07P15N38n15j727k141j578n68L65R96J261
$$ 77723 77787 77499 76786 75739 74664 73842 73452 73659 74374 74912 74397 72670 70529 68951 68383 68748 69744 71005
54926G1005J331J583K119K543K514K269K248K531K924L323L675L953M379N251
$$ 71005 72336 73919 76038 78581 81095 83364 85612 88143 91067 94390 98065 102018 106397 111648
54912A11648O248O501N688M428L207J636n39k477l233l250l790n046n895n515
$$ 111648 117896 124397 130085 134513 137720 139356 138817 136340 133107 129857 126067 121021 115126 109611
54898A09611m410l548l229l108k853k399j833j300r07o73n17l43j11P6L4j87k03
$$ 109611 105201 101653 98424 95316 92463 90064 88231 86931 86024 85351 84834 84491 84380 84456 84490 84303 84100
54881H4100K27P16Q12Q42J548K820L686L756L826M604N599N935N568N044M563
$$ 84100 84327 85043 85855 86697 88245 91065 94751 98507 102333 106937 112536 118471 124039 129083 133646
54866A33646L937L107K106Q38o18j871k830l908n202n969n568m363l220k524k296
$$ 133646 137583 140690 142796 143634 143016 141145 138315 134407 129205 123236 117668 113305 110085 107561 105265
54851A05265k638l380l772l362k730k633k824k553j840j364j300j200r07p82r58
$$ 105265 102627 99247 95475 92113 89383 86750 83926 81373 79533 78169 76869 75669 74762 73980 73022
54836G3022j043o87%O77J028R06M93J46n6l11m95j93L94L89l83q11j00Q71Q01
$$ 73022 71979 71292 71292 71969 72997 73903 74396 74542 74486 74175 73680 73487 73881 74270 73887 73076 72976 73847 74648
54817G4648Lj13Q40J793J921J524J140P52K25k78n84p11n95j31N28J045J257J070
$$ 74648 74651 74538 75378 77171 79092 80616 81756 82508 82733 82455 81871 81160 80565 80434 80962 82007 83264 84334
54799H4334L41o75j125n07M72P03J54k52n5K99L80K87J82Pj76j71l9m8k19l76
$$ 84334 84675 84000 82875 82368 82840 83543 83697 83445 83390 83689 84069 84356 84538 84545 84369 84198 84159 84111 83892 83516
54779H3516n51p91p40J3J178J975K065J796J585J601J952K662L494M219M887N497
$$ 83516 82965 82174 81434 81447 82625 84600 86665 88461 90046 91647 93599 96261 99755 103974 108861 114358
54763A14358N708N331M844M901N600O601P564P925O855M191R56j697l657n309
$$ 114358 120066 125397 130241 135142 140742 147343 154907 162832 169687 173878 174834 173137 169480 164171
54749A64171o506o948p011p134o940o065n287n413n605m346j927l28n01j344j613
$$ 164171 157665 150717 143706 136572 129632 123567 118280 112867 107262 102916 100989 100661 100160 98816 97203
54734I7203j359j054o81k41j26l27k88J00K88K00M97J311J811J567J301J690K401
$$ 97203 95844 94790 94109 93868 93742 93415 93127 93227 93515 93715 94212 95523 97334 98901 100202 101892 104293
54717A04293L002L810M999N743N244L989L112K817K257P73j351l294m410m652
$$ 104293 107295 111105 116104 121847 127091 131080 134192 137009 139266 140039 138688 135394 130984 126332
54703A26332m470m236l788k851j745j176j358j938k651l329l436k558j320q51
$$ 126332 121862 117626 113838 110987 109242 108066 106708 104770 102119 98790 95354 92796 91476 90625
54689I0625j207j373r72p45j049j121m44K96L35n8k77l53m99n26m35p16j391j610
$$ 90625 89418 88045 87073 86328 85279 84158 83714 84010 84345 84287 84010 83657 83158 82632 82197 81481 80090 78480
54671G8480j000m24n72p11jQ83P83rk62J30J75l06l90K25O08J82k44J68R14R49
$$ 78480 77480 77056 76484 75773 75772 76655 77438 77429 77167 77297 77472 77166 76776 77001 77609 77791 77547 77715 78629 79578
54651G9578K69j76Q4M98M72K44M40J077J526J401J019P52M21k33q54q87m93l15
$$ 79578 79847 79671 79755 80253 80725 80969 81409 82486 84012 85413 86432 87184 87605 87372 86518 85631 85138 84823
54633H4823l89j96J87l9j060j873j673r45n12j97O41J710J949R89l32r70o54J17
$$ 84823 84434 84238 84425 84386 83326 81453 79780 78835 78323 78126 78767 80477 82426 83415 83083 82113 81459 81576
54615H1576N99L53l81q73p07j70K91O31Q60O56r0p26n25K17M91o6p51q37m35q6
$$ 81576 82175 82528 82147 81274 80567 80397 80688 81319 82179 82835 82745 82019 81494 81711 82202 82136 81385 80548 80113 80027
54595H0027M2K07N39Q40R16Q83R53J033P78J78k28m6L35K58k25m60k11N9K4q5
$$ 80027 80069 80276 80815 81655 82571 83454 84407 85440 86218 86396 86168 86122 86457 86715 86490 86030 85819 85878 85902 85817
54575H5817j43m59j079j341o98M29J151J166Q86P37P52O95K89m55j033r05k45
$$ 85817 85674 85215 84136 82795 82097 82526 83677 84843 85729 86466 87218 87913 88202 87747 86714 85809 85564
54558H5564J61k9l24k72q6p4l0K65N27M79L85N23O65O59R40J743K312J817P22
$$ 85564 85725 85696 85372 85100 85014 84940 84910 85175 85702 86181 86566 87089 87754 88413 89353 91096 93408 95225 95947
54539I5947K65P65J359J344Q83K61n74j460j754j174l90k63p93j257j215r51q67
$$ 95947 96212 96977 98336 99680 100563 100824 100250 98790 97036 95862 95472 95209 94416 93159 91944 90993 90126
54522I0126q85o37j29J87P5p8J39M56L01k89o88o60n85o23l95K08O21M81K28L51
$$ 90126 89241 88604 88475 88662 88737 88659 88798 89254 89555 89266 88578 87918 87333 86710 86315 86523 87144 87625 87853 88204
54502H8204O16O50O92J040J239O84l14r13r44r69j181j156o76q6L11O24R61J169
$$ 88204 88820 89470 90162 91202 92441 93125 92811 91898 90954 89985 88804 87648 86972 86886 87197 87821 88782 89951
54484H9951J156J086J107J140J018O10n6n97m69K99Q88O77J94M40J460K275K161
$$ 89951 91107 92193 93300 94440 95458 96068 96012 95415 94946 95245 96133 96810 97004 97444 98904 101179 103340
54467A03340J371N15j1K8O61J333J221K27p38q10p4P82J306J384R30N5o54n75
$$ 103340 104711 105226 105215 105243 105904 107237 108458 108685 107947 107137 107063 107845 109151 110535 111465 111520 110866 110291
54449A10291N0J39j003k648l223j998K0J094N05r16j847j682p39K90P90O17K76
$$ 110291 110341 110480 109477 106829 103606 101608 101628 102722 103227 102311 100464 98782 98043 98333 99123 99740 100016
54432A00016M66J187J587R91j33o94l16K40K4r97j898j732m52J061J893J844J265
$$ 100016 100482 101669 103256 104247 104114 103420 103104 103344 103368 102371 100473 98741 98289 99350 101243 103087 104352
54415A04352M42m39r60p67k38j64o37q77m47O9M5k16p1L88N79L93K68M57P85J058
$$ 104352 104794 104355 103395 102628 102390 102226 101589 100712 100265 100334 100379 100163 100092 100480 101059 101452 101720 102177 102962 104020
54395A04020J272J425J454J273Q32K67K6M07Q97O17m18j146r18l42j94k79o8L17
$$ 104020 105292 106717 108171 109444 110276 110543 110569 110976 111873 112490 112072 110926 110008 109666 109472 109193 109125 109442
54377A09442N04O72J051J211P78L65P37J490J636J231J212J750J989J561J226
$$ 109442 109946 110618 111669 112880 113658 114023 114760 116250 117886 119117 120329 122079 124068 125629 126855
54362A26855J687K616L181K937J960P12j49l57m46j015j756j907j526j388j715
$$ 126855 128542 131158 134339 137276 139236 139948 139799 139442 138996 137981 136225 134318 132792 131404 129689
54347A29689j976j956k065k336k199j592j351j987k830k954k281j345m99J52N03
$$ 129689 127713 125757 123692 121356 119157 117565 116214 114227 111397 108443 106162 104817 104318 104470 104973
54332A04973O16P12P40L86k45m54J34R71J220O58k34q01o22R7N25O0p82r48l44
$$ 104973 105589 106301 107041 107427 107182 106728 106862 107833 109053 109711 109477 108676 108054 108151 108676 108736 107954 107006 106662
54313A06662Q9p3r9N54J257J221O76J74m91j683k739k552j163K15P86Q93J004
$$ 106662 106751 106678 106579 107133 108390 109611 110287 110461 109970 108287 105548 102996 101833 102048 102834 103727 104731
54296A04731R10L28l20l28L89J164J333Q43J09n20r77j209r37J9J207J789J501
$$ 104731 105641 105969 105649 105321 105710 106874 108207 109050 109159 108639 107662 106453 105516 105535 106742 108531 110032
54279A10032J017J038J305J058K13m62m46j52j67l01M7P72J002L20n03n07J86
$$ 110032 111049 112087 113392 114450 114663 114201 113755 113603 113436 113135 113182 113954 114956 115276 114773 114266 114452
54262A14452O21M06J34L79R11J230J263J132P71K08j07J20N14N47L13K06J38k15
$$ 114452 115073 115479 115613 115992 116903 118133 119396 120528 121299 121507 121400 121520 122034 122581 122894 123100 123238 123023
54244A23023o45o07j18K12J35qk2j49n12q40j021j312j754j939j567r08m02j47
$$ 123023 122378 121771 121653 121865 122000 121992 121970 121821 121309 120469 119448 118136 116382 114443 112876 111968 111566 111419
54226A11419n1r5k72m49m83l14N1M43N25J89j89k53j88k48q9P10J617J609O86
$$ 111419 111368 111273 111001 110552 110069 109755 109806 110249 110774 110963 110774 110521 110333 110085 109996 110706 112323 113932 114618
54207A14618j9J05K95k68j204j671j619j469j079L4J493K019R02r93k002j373
$$ 114618 114599 114704 114999 114731 113527 111856 110237 108768 107689 107723 109216 111235 112137 111144 109142 107769
54191A07769L4P88M71k2J68O99O61J2l05K44J068J337J030P20P23Q37P19K97j17
$$ 107769 107803 108591 109062 109040 109208 109907 110568 110580 110275 110519 111587 112924 113954 114674 115397 116234 116953 117250 117133
54172A17133q9L40N56J65l28k42J45l9q47j427j374j220j270j003j08P55R34P21
$$ 117133 117044 117384 117940 118105 117777 117535 117680 117641 116794 115367 113993 112773 111503 110500 110392 111147 112081 112802
54154A12802O70N96K3q53j416j458j140n09L01P77N99K15J82L39K60J46M34Q57
$$ 112802 113472 114068 114091 113238 111822 110364 109224 108715 109016 109793 110392 110607 110789 111128 111388 111534 111968 112825
54136A12825P22K4n85q20j010j208r57j16P37J063R56P26M42J57J48N11Q79R00
$$ 112825 113547 113571 112986 112166 111156 109948 108991 108875 109612 110675 111631 112357 112799 112956 113104 113615 114494 115394
54118A15394P41P74J018J196J203J125R27N88N03J169K311K805J981O01K2M61
$$ 115394 116135 116909 117927 119123 120326 121451 122378 122966 123469 124638 126949 129754 131735 132336 132358 132819
54102A32819Q48M26k41k55L55R49J367J958K795L559L991L814K467j97l021m278
$$ 132819 133667 134093 133852 133597 133952 134901 136268 138226 141021 144580 148571 152385 154852 154655 151634 147356
54086A47356l605k389j944k134k132j847j775j862j360J49K007L000K560J356
$$ 147356 143751 141362 139418 137284 135152 133305 131530 129668 128308 128457 130464 133464 136024 137380
54072A37380O11Q18J395J689J818K173K594K704K570K297J358n64k380k567j292
$$ 137380 137991 138809 140204 141893 143711 145884 148478 151182 153752 156049 157407 156843 154463 151896 150604
54057A50604l10n69j239j393j229j014k85R96J683J015mP6J175K120K483K770
$$ 150604 150294 149725 148486 147093 145864 144850 144565 145561 147244 148259 148255 148331 149506 151626 154109 156879
54041A56879L222L532L620L754M012M233M398M532M525M489M780N204M872L543
$$ 156879 160101 163633 167253 171007 175019 179252 183650 188182 192707 197196 201976 207180 212052 215595
54027B15595K361K408L181L452L014K456J790N55r72j906j986j618r73j06K55
$$ 215595 217956 220364 223545 226997 230011 232467 234257 234812 233840 231934 229948 228330 227357 227251 227506
54012B27506o88k470l815m426n090n939o007m886l547k924k720k345k066k438
$$ 227506 226818 224348 220533 216107 211017 205078 199071 194185 190638 187714 184994 182649 180583 178145
53998A78145l090l017j841l16M34n8j182j824j576j186j471k093k142j628j457
$$ 178145 175055 172038 170197 169881 170315 170257 169075 167251 165675 164489 163018 160925 158783 157155 155698
53983A55698j877k033j394n68k21p0M00Q99Q43M11L49Q82J547J989K420L193M251
$$ 155698 153821 151788 150394 149826 149605 149535 149935 150834 151677 152088 152437 153319 154866 156855 159275 162468 166719
53966A66719N103N298M947M798N499O703P174N930L150p4k584l794l842l459l398
$$ 166719 171822 177120 182067 186865 192364 199067 206241 212171 215321 215247 212663 208869 205027 201568 198170
53951A98170l793m091l675k478r96J71Q28J339K140L085L527L240K855K950L166
$$ 198170 194377 190286 186611 184133 183137 183308 184136 185475 187615 190700 194227 197467 200322 203272 206438
53936B06438K842K258K371L378M322M326L550K726K271K239K565L022L187K860
$$ 206438 209280 211538 213909 217287 221609 225935 229485 232211 234482 236721 239286 242308 245495 248355
53922B48355K326K074K374L137M004M607M924N230N532N385M680M198M711N741
$$ 248355 250681 252755 255129 258266 262270 266877 271801 277031 282563 287948 292628 296826 301537 307278
53908C07278O010N018L382J732K10r26j244j006j138j854k274j951j894l142n102
$$ 307278 313288 318306 321688 323420 323630 322704 321460 320454 319316 317462 315188 313237 311343 308201 303099
53893C03099o269o215n887o036o391o439o216n987n739n329m892m708m761m683
$$ 303099 296830 290615 284728 278692 272301 265862 259646 253659 247920 242591 237699 232991 228230 223547
53879B23547m165l320k579k249k192k063j810j725k051k657l182l348l134k771
$$ 223547 219382 216062 213483 211234 209042 206979 205169 203444 201393 198736 195554 192206 189072 186301
53865A86301k534k406k088j493j034j170j727k070j894j451j081q53p20o23m49
$$ 186301 183767 181361 179273 177780 176746 175576 173849 171779 169885 168434 167353 166500 165780 165157 164708
53850A64708j99k03p54j500j710j184n05k22k42k17j16j20k42l06j73J52N18P16
$$ 164708 164509 164306 163552 162052 160342 159158 158653 158431 158189 157972 157856 157736 157494 157188 157015 157167 157685 158401
53832A58401O90N72L81j14q40j108l82Q14J452J332J168J305J280Q07L56L34M06
$$ 158401 159091 159663 160044 159930 159090 157982 157600 158414 159866 161198 162366 163671 164951 165758 166114 166448 166854
53815A66854J52j12K05J109K089K765L037K898K511K286K546L226M035M673M840
$$ 166854 167006 166894 167099 168208 170297 173062 176099 178997 181508 183794 186340 189566 193601 198274 203114
53800B03114M424L842L704L974L920L170K273J875J871J800J639J675J908K028
$$ 203114 207538 211380 215084 219058 222978 226148 228421 230296 232167 233967 235606 237281 239189 241217
53786B41217J828J347P44K88Q8k44j173k346k779k259j824k325l212l483l208
$$ 241217 243045 244392 245136 245424 245512 245268 244095 241749 238970 236711 234887 232562 229350 225867 222659
53771B22659l156l437l523l386l503l840l790l245k818k824k873k746k783l110
$$ 222659 219503 216066 212543 209157 205654 201814 198024 194779 191961 189137 186264 183518 180735 177625
53757A77625l213k743k096j697j335p78m52p57j079m38J013J997J751R15M38L32
$$ 177625 174412 171669 169573 167876 166541 165763 165311 164554 163475 163037 164050 166047 167798 168713 169151 169483
53741A69483O3l17j47P26J545J559R31M29L84L56k33j300k085j892q07M52J379
$$ 169483 169546 169229 169082 169808 171353 172912 173843 174272 174656 175012 174779 173479 171394 169502 168695 169147 170526
53724A70526K101K784L031K429J466J117J451J493P62J36N52J588K132J908J487
$$ 170526 172627 175411 178442 180871 182337 183454 184905 186398 187160 187296 187848 189436 191568 193476 194963
53709A94963J185R35R33J389J769J381P10J066K694M303M802M502M136L719K994
$$ 194963 196148 197083 198016 199405 201174 202555 203265 204331 207025 211328 216130 220632 224768 228487 231481
53694B31481K265J940J922K059K618L633M276L697K150O07m58j230j829k065j869
$$ 231481 233746 235686 237608 239667 242285 245918 250194 253891 256041 256648 256190 254960 253131 251066 249197
53679B49197j387p41j09J69j10p00j289j819k135j774o71L70N06n1m48l80j99
$$ 249197 247810 247069 246960 247129 247019 246319 245030 243211 241076 239302 238631 239001 239507 239456 239008 238628 238429
53662B38429m2K85O32N19l4m29l74k46l55m32j74K16L85L49K75P7l47p35o45p2
$$ 238429 238387 238672 239304 239823 239789 239360 238986 238740 238385 237953 237779 237995 238380 238729 239004 239081 238734 237999 237354 237282
53642B37282N38Q51J071J654K689L721M140L768K972K298K030J980J715J019L36
$$ 237282 237820 238671 239742 241396 244085 247806 251946 255714 258686 260984 263014 264994 266709 267728 268064
53627B68064N00J745L158L524K749J919J861K207K164J719J614K324L519M394
$$ 268064 268564 270309 273467 276991 279740 281659 283520 285727 287891 289610 291224 293548 297067 301461
53613C01461M403L737L178L269L585L316K565K355L081L703L170J971J446J887
$$ 301461 305864 309601 312779 316048 319633 322949 325514 327869 330950 334653 337823 339794 341240 343127
53599C43127K321K027J289N78j52j005j617j613j111m49K48Q83J068M73o31j485
$$ 343127 345448 347475 348764 349342 349190 348185 346568 344955 343844 343395 343643 344526 345594 346067 345436 343951
53583C43951j572j060n21l95p50j392k033k351k185j785j688k077k368j883q02
$$ 343951 342379 341319 340798 340403 339653 338261 336228 333877 331692 329907 328219 326142 323774 321891 321089
53568C21089q1k60q56j086p90k84K79R29J461J487R25J76k24qO19J132J151Q06
$$ 321089 321008 320748 319892 318806 318016 317732 318011 318940 320401 321888 322813 322989 322765 322757 323376 324508 325659 326465
53550C26465M62J63k49n09p9R09J534J325J025J561K750L669L936L914L931M008
$$ 326465 326927 327090 326841 326332 326253 327162 328696 330021 331046 332607 335357 339026 342962 346876 350807 354815
53534C54815M263M930N960P067Q116R016R416R107Q655R019J0399J1952J2751
$$ 354815 359078 364008 369968 377035 385151 394167 403583 412690 421345 430364 440763 452715 465466
53521D65466J2718J2500J2784J3759J4996J5846J6179J6547J7408J8491J9329
$$ 465466 478184 490684 503468 517227 532223 548069 564248 580795 598203 616694 636023
53510F36023K0110K1371K3025K4299K4733K4611K4382K4141K3813K3353K2641
$$ 636023 656133 677504 700529 724828 749561 774172 798554 822695 846508 869861 892502
53499H92502K1571K0378J9482J8968J8563J8113J7740J7458J7168J6998J7189
$$ 892502 914073 934451 953933 972901 991464 1009577 1027317 1044775 1061943 1078941 1096130
53488A096130J7498J7340J6692J6299J6703J7518J8042J8150J8090J7784J6946
$$ 1096130 1113628 1130968 1147660 1163959 1180662 1198180 1216222 1234372 1252462 1270246 1287192
53477A287192J5682J4374J2958J0917Q189N553L698K283L46k421n360p804r775
$$ 1287192 1302874 1317248 1330206 1341123 1349312 1354865 1358563 1360846 1361192 1358771 1353411 1345607 1335832
53464A335832j1579j3083j3869j3768j2927j1648j0634j0951j3063j6016j8349
$$ 1335832 1324253 1311170 1297301 1283533 1270606 1258958 1248324 1237373 1224310 1208294 1189945
53453A189945j9639k0463k0911k0361j8851j7626j7650j8430j8897j8639j7645
$$ 1189945 1170306 1149843 1128932 1108571 1089720 1072094 1054444 1036014 1017117 998478 980833
53442I80833j5766j3281j1297j0492r932q234n550l380k568k542k438j984j125
$$ 980833 965067 951786 940489 929997 920065 911831 906281 902901 900333 897791 895353 893369 892244
53429H92244K93K137L897N194N971O261O279O643P938J0052J2384J4567J6492
$$ 892244 892537 894674 898571 903765 909736 915997 922276 928919 936857 946909 959293 973860 990352
53416I90352J7879J8633J9352K0782K2769K4583K6039K7566K9207L0573L1795
$$ 990352 1008231 1026864 1046216 1066998 1089767 1114350 1140389 1167955 1197162 1227735 1259530
53405A259530L3514L5742L7624L8677L9472M0747M2515M4437M6385M8294M9976
$$ 1259530 1293044 1328786 1366410 1405087 1444559 1485306 1527821 1572258 1618643 1666937 1716913
53394A716913N1385N2588N3355N3343N2818N2478N2371N1749N0243M8428M6825
$$ 1716913 1768298 1820886 1874241 1927584 1980402 2032880 2085251 2137000 2187243 2235671 2282496
53383B282496M5149M2983M0579L8395L6403L4256L1668K8243K3579J8093J3143
$$ 2282496 2327645 2370628 2411207 2449602 2486005 2520261 2551929 2580172 2603751 2621844 2634987
53372B634987R631O820L149k136q684j5935k3475l0588l6264m0000m2260m3912
$$ 2634987 2644618 2651438 2654587 2652451 2643767 2627832 2604357 2573769 2537505 2497505 2455245 2411333
53360B411333m5389m6544m7186m7528m7903m8174m7736m6227m3914m1185l8259
$$ 2411333 2365944 2319400 2272214 2224686 2176783 2128609 2080873 2034646 1990732 1949547 1911288
53349A911288l5723l4715l5787l7932l9623m0500m1065m1101l9733l7094l4604
$$ 1911288 1875565 1840850 1805063 1767131 1727508 1687008 1645943 1604842 1565109 1528015 1493411
53338A493411l3125l2009l0419k8458k6380k3833k0721j7947j6358j5657j5163
$$ 1493411 1460286 1428277 1397858 1369400 1343020 1319187 1298466 1280519 1264161 1248504 1233341
53327A233341j4985j5558j6601j7424j7838j7953j7543j6405j4978j3797j2703
$$ 1233341 1218356 1202798 1186197 1168773 1150935 1132982 1115439 1099034 1084056 1070259 1057556
53316A057556j1338j0004r138q274o501l820j184O87J783K259K308K537L630N558
$$ 1057556 1046218 1036214 1027076 1018802 1012301 1008481 1007297 1007984 1009767 1012026 1014334 1016871 1020501 1026059
53302A026059P758R991J2358J4525J5854J6439J7163J8539K0171K1603K2919K4169
$$ 1026059 1033817 1043808 1056166 1070691 1086545 1102984 1120147 1138686 1158857 1180460 1203379 1227548
53290A227548K4906K4852K4448K4198K3808K2606K0595J8553J7085J6001J4721
$$ 1227548 1252454 1277306 1301754 1325952 1349760 1372366 1392961 1411514 1428599 1444600 1459321
53279A459321J2881J0413P304L672M3k822m655o105q126j0910j3732j5888j7435
$$ 1459321 1472202 1482615 1489919 1493591 1493634 1490812 1486157 1480052 1471926 1461016 1447284 1431396 1413961
53266A413961j8854k0289k1498k2341k2991k3647k4278k4667k4667k4424k4350
$$ 1413961 1395107 1374818 1353320 1330979 1307988 1284341 1260063 1235396 1210729 1186305 1161955
53255A161955k4698k5145k5073k4304k3264k2420k1879k1640k1842k2477k3261
$$ 1161955 1137257 1112112 1087039 1062735 1039471 1017051 995172 973532 951690 929213 905952
53244I05952k3951k4502k4714k4229k3143k2131k1552k0928j9739j8314j7295
$$ 905952 882001 857499 832785 808556 785413 763282 741730 720802 701063 682749 665454
53233F65454j6544j5281j3234j1042r473q746q575q577q535q568r016r984j1154
$$ 665454 648910 633629 620395 609353 599880 591134 582559 573982 565447 556879 547863 537879 526725
53220E26725j2201j3068j3616j3533j2952j2655j2960j2998j1891j0236r398r547
$$ 526725 514524 501456 487840 474307 461355 448700 435740 422742 410851 400615 391217 381670
53208C81670r537q773p900p381o673n506m791n314o346o688o523o928p826p833
$$ 381670 372133 363360 355460 348079 341406 335900 331109 325795 319449 312761 306238 299310 291484 283651
53194B83651o418m910m708n442n683m918l830l018k422j968j925k284k549k420
$$ 283651 277233 272323 267615 262173 256490 251572 247742 244724 242302 240334 238409 236125 233576 231156
53180B31156k250k366k481k192j712j546j707j742j444j030p33n89o01p01o47
$$ 231156 228906 226540 224059 221867 220155 218609 216902 215160 213716 212686 211953 211364 210763 210062 209415
53165B09415k96Q1J64N7J8j64q50j803k319k136j570p91K52J182J281M74m43q86
$$ 209415 209119 209200 209364 209421 209439 209275 208425 206622 204303 202167 200597 199806 200058 201240 202521 202995 202552 201666
53147B01666j060j154q14O6P75O79J92J43N22O01M9o36q20l52M10Q96P95L55Q1
$$ 201666 200606 199452 198638 198704 199479 200158 200350 200493 201015 201616 201665 201029 200209 199857 200267 201163 201958 202313 202394
53128B02394K9j66m75l22M33J046R32O41J110K324L323L338K384J015l7k20K96
$$ 202394 202423 202257 201782 201460 201893 202939 203871 204512 205622 207946 211269 214607 216991 218006 217969 217749 218045
53111B18045O78L82k38o01p20r02j121j255j507j909j915j223n80q99j896k495
$$ 218045 218723 219105 218867 218266 217546 216644 215523 214268 212761 210852 208937 207714 207134 206235 204339 201844
53095B01844k370k122k008j550n15N72J188J382J310Q34q4j028j491j348q70m79
$$ 201844 199474 197352 195344 193794 193279 193851 195039 196421 197731 198565 198481 197453 195962 194614 193744 193265
53079A93265m60o29m75Q8L98n9q00j047r56j253j864j892j087l08k21m09j66M49
$$ 193265 192805 192176 191701 191789 192187 192128 191328 190281 189325 188072 186208 184316 183229 182921 182700 182291 182125 182574
53061A82574R27J086J074Q93M39j70n72m08M03J408J730R13l47p91q8Q97J354
$$ 182574 183501 184587 185661 186554 186993 186823 186251 185843 186246 187654 189384 190297 189950 189159 189071 189968 191322
53044A91322J403J445J308O78j20m26j74Pl46j002j344r82o5P91R08J84o78p65
$$ 191322 192725 194170 195478 196156 196036 195610 195436 195443 195097 194095 192751 191769 191704 192495 193403 193587 192909 192144
53026A92144R3J096J367R02M48M72O71N76K53J6k50q13j348j241o17k81l87j10
$$ 192144 192237 193333 194700 195602 196050 196522 197193 197769 198022 198038 197788 196975 195627 194386 193769 193488 193101 192991
53008A92991R17J751J455N41J46L42K55m06j020j125q64l65M14J130J173N53O3
$$ 192991 193908 195659 197114 197655 197801 198143 198398 197992 196972 195847 194983 194618 195032 196162 197335 197888 197951
52991A97951L11J087J789J953J376L06m37j70P33J212Q30J68j59j34J33P39J608
$$ 197951 198262 199349 201138 203091 204467 204773 204336 204166 204899 206111 206941 207109 206950 206816 206949 207688 209296
52974B09296K287K486K404K306K187J978J698J271N95j23n18n82o44p54o03r0
$$ 209296 211583 214069 216473 218779 220966 222944 224642 225913 226508 226385 225867 225285 224641 223887 223284 223194
52958B23194N27R87J105N51p50k079k474j920j332j242j292j183j213j543j641
$$ 223194 223721 224708 225813 226364 225614 223535 221061 219141 217809 216567 215275 214092 212879 211336 209695
52943B09695j099m23l89r52j291q70r6J27n47j333j107J18R98O31j33K6R00J179
$$ 209695 208596 208173 207784 206832 205541 204671 204575 204702 204155 202822 201715 201833 202831 203462 203329 203355 204255 205434
52925B05434N98J87L34J79o99j368j111n78n50n79M1Q53Q70R9o20q92r39q47n06
$$ 205434 206032 206219 206553 206732 206033 204665 203554 202976 202426 201847 201888 202741 203611 203710 203090 202198 201259 200412 199906
52906A99906q5J48L18O03O68J02p71j202r70n00j30J92N18P24O73L15k61o83m86
$$ 199906 199821 199969 200287 200890 201558 201660 200889 199687 198717 198217 198087 198279 198797 199521 200194 200509 200248 199565 199079
52887A99079K81J044J431J620J708J328L52o07r09o58k63K29P51P92P2o83n48
$$ 199079 199360 200404 201835 203455 205163 206491 206843 206236 205327 204669 204406 204635 205386 206178 206250 205567 205019
52870B05019L43J041J097Q66O52L73K0k30m09o75q91p75m52k92k33J40P84J023
$$ 205019 205362 206403 207500 208366 209018 209391 209411 209181 208772 208097 207206 206431 205979 205687 205454 205594 206378 207401
52852B07401L24j106k550l362l272k567j919j800k032k130j920j547j069m95p3
$$ 207401 207725 206619 204069 200707 197435 194868 192949 191149 189117 186987 185067 183520 182451 181956 181883
52837A81883j26n74r67j017p84m19J0M19O56N94K72L7L92J342J956J273k49r58
$$ 181883 181757 181183 180216 179199 178415 177996 178006 178425 179081 179675 179947 179984 180376 181718 183674 184947 184698 183740
52819A83740j02J157J367O84J76L7l42q73o99L01J124J031M39P2L6J09K06J48
$$ 183740 183638 184795 186162 186846 187022 187059 186717 185844 185145 185446 186570 187601 188040 188112 188148 188257 188463 188611
52801A88611m34j459k133j836r29k71j65k26q4J90L65M00M42N43N33K55j11j38
$$ 188611 188177 186718 184585 182749 181820 181549 181384 181158 181074 181264 181629 182029 182471 183014 183547 183802 183691 183553
52783A83553K90O98N55k6m26k64K30N86N37J23l50m68j9P19J175R60J06r70j685
$$ 183553 183843 184541 185096 185070 184644 184380 184610 185196 185733 185856 185506 185038 185019 185738 186913 187873 187979 187009 185324
52764A85324j638r71k46J19J35j64q36j551j443j36J487K103J481N97K86M61O39
$$ 185324 183686 182715 182469 182588 182723 182559 181723 180172 178729 178593 180080 182183 183664 184261 184547 185008 185647
52747A85647O42N53N02O78J225J953K479K718K959L322L563L418K868J997R60
$$ 185647 186289 186842 187344 188022 189247 191200 193679 196397 199356 202678 206241 209659 212527 214524 215484
52732B15484J98J75P03R57M69k44l65J24M45K7q49j500j633j526j513j605j643
$$ 215484 215682 215857 216560 217517 217986 217742 217377 217501 217946 217973 217124 215624 213991 212465 210952 209347 207704
52715B07704j650j751j803j450o35K50Q16J087J201J074O02P5n1K52N35M28M7
$$ 207704 206054 204303 202500 201050 200415 200665 201481 202568 203769 204843 205445 205520 205469 205721 206256 206684 206731
52698B06731k11j14K32N47O63O24M78P7o89j506j818j451p45kP91J522J734J216
$$ 206731 206520 206406 206638 207185 207848 208472 208950 209027 208338 206832 205014 203563 202818 202816 203607 205129 206863 208079
52680B08079M25n4k10l71n82o69p68j221j976k463k167j174j36J79m24j272j387
$$ 208079 208504 208450 208240 207869 207287 206618 205850 204629 202653 200190 198023 196849 196713 196892 196468 195196 193809
52663A93809n89L46P48Q69J291J966K355K239J879J590J561J901K418K562K032
$$ 193809 193220 193566 194314 195183 196474 198440 200795 203034 204913 206503 208064 209965 212383 214945 216977
52648B16977J217O23J51n22j187j322r57o37o78r19j220j573j822j795j668j669
$$ 216977 218194 218817 218968 218446 217259 215937 214980 214343 213665 212746 211526 209953 208131 206336 204668 202999
52632B02999j568r77q0O48J294K347L618M150L448K173J203N82j94j246k142k454
$$ 202999 201431 200454 200374 201022 202316 204663 208281 212431 215879 218052 219255 219837 219643 218397 216255 213801
52616B13801k102j332n25m0J6j94m16m32j48L10O15N41K12j19l54m56k93J59N88
$$ 213801 211699 210367 209842 209802 209818 209624 209208 208776 208628 208938 209553 210094 210306 210187 209833 209377 209084 209243 209831
52597B09831O73M64K33J02Q0K29M74M60K3m22l67J22N93Q44R12P20K17k54l31
$$ 209831 210504 210968 211201 211303 211383 211612 212086 212546 212569 212147 211780 211902 212495 213339 214251 214971 215188 214934 214603
52578B14603j84k06l11r7M24Q44J012J043Q26J76n61p63m62l68p84j160r03j43
$$ 214603 214419 214213 213902 213805 214229 215073 216085 217128 217954 218130 217569 216806 216344 215976 215192 214032 213129 212986
52560B12986N58Q38P09M59M90Q78J111O59k48q40p88n01m17n11o25p39p93o43
$$ 212986 213544 214382 215091 215550 216040 216918 218029 218688 218440 217600 216812 216311 215894 215383 214758 214019 213226 212583
52542B12583l51k14l96p75j130j182o32M58J398J497Q66K29K5R4J07j35o95j325
$$ 212583 212232 212018 211622 210847 209717 208535 207903 208361 209759 211256 212122 212351 212376 212470 212577 212442 211747 210422
52524B10422j452q33j9L23K96M17P44J022J299J612J425L61p75q14Q9P45Q24J213
$$ 210422 208970 208137 208118 208441 208737 209154 209898 210920 212219 213831 215256 215617 214842 214028 214117 214862 215686 216899
52506B16899K318L286L375K954K571J993Q10p00j939k675k967k912k721k565k169
$$ 216899 219217 222503 225878 228832 231403 233396 234206 233506 231567 228892 225925 223013 220292 217727 215558
52491B15558j253l41l31j128j635j355r83j050j034l52O19J212J380J417J365
$$ 215558 214305 213964 213633 212505 210870 209515 208532 207482 206448 206096 206715 207927 209307 210724 212089
52476B12089J263J288J308R19L21L06R52J260O44j27j22M12P10P15Q92J351J907
$$ 212089 213352 214640 215948 216867 217188 217494 218446 219706 220350 220223 220101 220513 221223 221938 222830 224181 226088
52459B26088K469K794K428J452O43L51o7j089k072k241j827j498j286r31o58p64
$$ 226088 228557 231351 233779 235231 235874 236225 236158 235069 232997 230756 228929 227431 226145 225214 224556 223792
52443B23792r88j008j004j041o02M46J174Q29j0m41o25j062j289p10J0j80q07
$$ 223792 222804 221796 220792 219751 219149 219595 220769 221598 221588 221147 220522 219460 218171 217461 217471 217291 216484
52426B16484n03P22J434J059O72J152J914K050J611J183J014J020J097J122J125
$$ 216484 215981 216703 218137 219196 219868 221020 222934 224984 226595 227778 228792 229812 230909 232031 233156
52411B33156J542K666L982M745N111N836O914P513P300O676N556L188l26l432
$$ 233156 234698 237364 241346 246091 251202 257038 263952 271465 278765 285441 290997 294185 293859 290427
52397B90427m840m990n061n228m831l713k531j869j743j887k018j824j123p3R72
$$ 290427 285587 280597 275536 270308 265477 261764 259233 257364 255621 253734 251716 249892 248769 248696 249668
52382B49668J731K017J745J148Q41J301K321L162L281K802K312K265K618K983
$$ 249668 251399 253416 255161 256309 257150 258451 260772 263934 267215 270017 272329 274594 277212 280195
52368B80195L125L193L472L986M442M432L650K164N48m78o96m83k00J47N19O21
$$ 280195 283320 286513 289985 293971 298413 302845 306495 308659 309207 308729 308033 307550 307350 307497 308016 308637
52352C08637M46N98J590L045M050M102L351K259J400J329K067K931L372L729M648
$$ 308637 309083 309681 311271 314316 318366 322468 325819 328078 329478 330807 332874 335805 339177 342906 347554
52337C47554N967O916P284P679Q615R896J0989J1599J1804J1991J2726J4295J6345
$$ 347554 353521 360437 367721 375400 384015 393911 404900 416499 428303 440294 453020 467315 483660
52324D83660J8237J9640K0568K1157K1684K2496K3437K3690K2731K1093J9632
$$ 483660 501897 521537 542105 563262 584946 607442 630879 654569 677300 698393 718025
52313G18025J8424J7105J5871J5209J4816J3874J2414J1334J0889J0187Q604O733
$$ 718025 736449 753554 769425 784634 799450 813324 825738 837072 847961 858148 866752 873485
52301H73485N386M406L204J954J431J799K198J600k22k612m697o082o972p661
$$ 873485 878871 883277 886481 888435 889866 891665 893863 895463 895241 892629 887932 881850 874878 867217
52287H67217q136q216p899p273o299m983l540k046j60K353N030P143Q579R832
$$ 867217 859081 850865 842966 835693 829394 824411 820871 818825 818665 821018 826048 833191 841770 851602
52273H51602J1145J2303J3134J3766J4300J4752J5201J5572J5405J4436J3224
$$ 851602 862747 875050 888184 901950 916250 931002 946203 961775 977180 991616 1004840
52262A004840J2508J2074J1084R528Q424Q331Q484P911O657N410M460L606K755
$$ 1004840 1017348 1029422 1040506 1050034 1058458 1066789 1075273 1083184 1089841 1095251 1099711 1103317 1106072
52249A106072K024J442Q65J29r49k540m552o581q211r224r512r069q205p461p169
$$ 1106072 1108096 1109538 1110403 1110532 1109583 1107043 1102491 1095910 1087699 1078475 1068963 1059894 1051689 1044228 1037059
52234A037059p210p206o818n861m431k965j981j646j670j551q85L16J510K162
$$ 1037059 1029849 1022643 1015825 1009964 1005533 1002568 1000587 998941 997271 995720 994835 995151 996661 998823
52220I98823K454L022L807L901L054K518L521N486O828P153P479Q366R130R061
$$ 998823 1001277 1004299 1008106 1012007 1015061 1017579 1021100 1026586 1033414 1040567 1048046 1056412 1065542 1074603
52206A074603Q362P477O451N328M476M056L853L819M195M824N035M535L836L418
$$ 1074603 1082965 1090442 1096893 1102221 1106697 1110753 1114606 1118425 1122620 1127444 1132479 1137014 1140850 1144268
52192A144268L118K617K034J716J773K029K096J528M15m30n44p85k286m589o103
$$ 1144268 1147386 1150003 1152037 1153753 1155526 1157555 1159651 1161179 1161594 1161164 1160620 1159835 1157549 1152960 1146857
52177A146857o430o872q232r570r810r334q932q361p068n504m503l828k575o80
$$ 1146857 1140427 1133555 1125323 1115753 1105943 1096609 1087677 1079316 1072248 1066744 1062241 1058413 1055838 1055158
52163A055158R28J550J225L61m14k60J084K667L231K725K186K223K347J868P52
$$ 1055158 1056086 1057636 1058861 1059222 1058808 1058548 1059632 1062299 1065530 1068255 1070441 1072664 1075011 1076879 1077631
52148A077631n91j844k813l256k957j952o09M96J010J135J348J783K205K538K958
$$ 1077631 1077040 1075196 1072383 1069127 1066170 1064218 1063609 1064105 1065115 1066250 1067598 1069381 1071586 1074124 1077082
52133A077082L447L808M311N619P768R876J1298J2498J4317J6877J9781K2777
$$ 1077082 1080529 1084337 1088648 1094267 1102035 1111911 1123209 1135707 1150024 1166901 1186682 1209459
52121A209459K5606K7630K8352K8084K7558K7120K6644K5944K4822K3061K0815
$$ 1209459 1235065 1262695 1291047 1319131 1346689 1373809 1400453 1426397 1451219 1474280 1495095
52110A495095J8630J6657J4298J1155P766M824K186n94l227m994n805o190o510
$$ 1495095 1513725 1530382 1544680 1555835 1563601 1568425 1570611 1570017 1566790 1561796 1555991 1549801 1543291
52097A543291o857p476q511r568j0164j0388j0482j0228r601r562j0955j2837
$$ 1543291 1536434 1528958 1520447 1510879 1500715 1490327 1479845 1469617 1460016 1450454 1439499 1426662
52085A426662j3188j1452r157p702o696n003k467K14K665N074P567J0003J2178
$$ 1426662 1413474 1402022 1392865 1385163 1378467 1373464 1370997 1371211 1373876 1378950 1386517 1396520 1408698
52072A408698J3850J4772J5066J5327J6059J7126J7928J7897J6686J4276J1256
$$ 1408698 1422548 1437320 1452386 1467713 1483772 1500898 1518826 1536723 1553409 1567685 1578941
52061A578941Q710P314O614N492L387P39j754l958o108q042r128r180r089j0041
$$ 1578941 1587651 1594965 1601579 1607071 1610458 1611197 1609443 1605485 1599377 1591335 1582207 1573027 1563938 1553897
52047A553897j2221j4746j6848j8628k0450k2235k3669k4675k5157k4791k3572
$$ 1553897 1541676 1526930 1510082 1491454 1471004 1448769 1425100 1400425 1375268 1350477 1326905
52036A326905k2179k1147j9953j7720j4653j2008j0556r828q989p844o686n804
$$ 1326905 1304726 1283579 1263626 1245906 1231253 1219245 1208689 1198861 1189872 1182028 1175342 1169538
$$ [...]
##END NTUPLES=NMR SPECTRUM
##END=
