
##TITLE=AC1309_BRAAS11121_6614207_eynF3lD209
##JCAMPDX= 6.0         $$ Bruker NMR JCAMP-DX V2.0
##DATA TYPE= NMR SPECTRUM
##DATA CLASS= NTUPLES
##ORIGIN= BRUKER
##OWNER= Administrator
$$ 1.72 TOPSPIN		Version 2.1
$$ 2012-08-02 17:36:03.375 -0500  Administrator@TOPSPIN
$$ Compression mode = diff/dup
##.OBSERVE FREQUENCY= 400.02188249412
##.OBSERVE NUCLEUS= ^1H
##.ACQUISITION MODE= SIMULTANEOUS (DQD)
##.ACQUISITION SCHEME= undefined
##.AVERAGES= 8
##.DIGITISER RES= 22
##SPECTROMETER/DATA SYSTEM= spect
##.PULSE SEQUENCE= zg30
##.SOLVENT NAME= COFFEE_meoh
##.SHIFT REFERENCE= INTERNAL, COFFEE_meoh, 1, 14.98509
##AUDIT TRAIL= $$ (NUMBER, WHEN, WHO, WHERE, PROCESS, VERSION, WHAT)
$$ ##TITLE= Audit trail, TOPSPIN		Version 2.1
$$ ##JCAMPDX= 5.01
$$ ##ORIGIN= Bruker BioSpin GmbH
$$ ##OWNER= Administrator
$$ $$ C:\Bruker\TOPSPIN/data/COFFEE/nmr/AC1309_BRAAS11121_6614207_eynF3lD209/10/pdata/1/auditp.txt
$$ ##AUDIT TRAIL=  $$ (NUMBER, WHEN, WHO, WHERE, PROCESS, VERSION, WHAT)
(   1,<2012-08-02 17:35:56.046 -0500>,<Administrator>,<TOPSPIN>,<go>,<TOPSPIN 2.1>,
      <created by zg
	started at 2012-08-02 17:34:49.468 -0500,
	POWCHK enabled, PULCHK disabled,
       configuration hash MD5:
       6B 1B 68 BB D9 2E 58 E2 7F 35 AD 54 07 DF 0E 41
       data hash MD5: 64K
       B4 4C B7 DD 70 47 C9 97 9C EA 91 B9 B0 D1 70 72>)
(   2,<2012-08-02 17:35:58.906 -0500>,<Administrator>,<TOPSPIN>,<proc1d>,<TOPSPIN 2.1>,
      <Start of raw data processing
       efp LB = 0 FT_mod = 6 PKNL = 1 PHC0 = 0 PHC1 = 0 SI = 32K 
       data hash MD5: 32K
       CC C3 6E AB EB 39 E1 7E CE 4B D8 8C 32 D9 1F AA>)
(   3,<2012-08-02 17:35:59.234 -0500>,<Administrator>,<TOPSPIN>,<proc1d>,<TOPSPIN 2.1>,
      <pk PHC0 = 181.7633 PHC1 = 0 
       data hash MD5: 32K
       D8 AB 17 62 BB EC 44 B0 5A 50 5A CA CD 71 9F 66>)
(   4,<2012-08-02 17:35:59.312 -0500>,<Administrator>,<TOPSPIN>,<proc1d>,<TOPSPIN 2.1>,
      <abs ABSG = 1 
       data hash MD5: 32K
       B6 31 FD CE 70 F1 89 7E 06 86 10 1B A9 7B 1B 1D>)
(   5,<2012-08-02 17:35:59.343 -0500>,<Administrator>,<TOPSPIN>,<proc1d>,<TOPSPIN 2.1>,
      <abs ABSG = 2 
       data hash MD5: 32K
       A1 ED 10 21 15 F7 64 E0 3F CB 0A 87 EB 26 32 22>)
(   6,<2012-08-02 17:35:59.375 -0500>,<Administrator>,<TOPSPIN>,<proc1d>,<TOPSPIN 2.1>,
      <abs ABSG = 3 
       data hash MD5: 32K
       9D 5D 7F BF 01 06 90 1B 1E 0E 82 81 75 7A 24 36>)
(   7,<2012-08-02 17:35:59.421 -0500>,<Administrator>,<TOPSPIN>,<proc1d>,<TOPSPIN 2.1>,
      <abs ABSG = 4 
       data hash MD5: 32K
       F2 70 95 58 EE 50 3E 06 00 16 A5 8E EF EF 7F 06>)
(   8,<2012-08-02 17:35:59.484 -0500>,<Administrator>,<TOPSPIN>,<proc1d>,<TOPSPIN 2.1>,
      <abs ABSG = 5 
       data hash MD5: 32K
       39 23 B3 B8 01 AB C6 EA B2 5E 86 68 B7 D1 EE B3>)
$$ ##END=
$$ 
$$ $$ hash MD5
$$ $$ D4 29 C2 EB F5 FE 4E B3 B2 D0 B3 DA 0F D7 74 68
##$RELAX= 
##$RELAX= 
##$RELAX= 
##$RELAX= 
##$RELAX= 
##$RELAX= 
##$RELAX= 
$$ Bruker specific parameters
$$ --------------------------
$$ [...]
150 150 150 150 150 150 150 150
##$TP07= 0
##$TPNAME0= <>
##$TPNAME1= <>
##$TPNAME2= <>
##$TPNAME3= <>
##$TPNAME4= <>
##$TPNAME5= <>
##$TPNAME6= <>
##$TPNAME7= <>
##$TPOAL= (0..7)
0.5 0.5 0.5 0.5 0.5 0.5 0.5 0.5
##$TPOFFS= (0..7)
0 0 0 0 0 0 0 0
##$TUNHIN= 0
##$TUNHOUT= 0
##$TUNXOUT= 0
##$USERA1= <user>
##$USERA2= <user>
##$USERA3= <user>
##$USERA4= <user>
##$USERA5= <user>
##$V9= 5
##$VALIST= <valist>
##$VCLIST= <CCCCCCCCCCCCCCC>
##$VD= 0
##$VDLIST= <DDDDDDDDDDDDDDD>
##$VPLIST= <PPPPPPPPPPPPPPP>
##$VTLIST= <TTTTTTTTTTTTTTT>
##$WBST= 1024
##$WBSW= 4
##$XGAIN= (0..3)
0 0 0 0
##$XL= 0
##$YL= 0
##$YMAX_a= 476161
##$YMIN_a= -624931
##$ZGOPTNS= <>
##$ZL1= 120
##$ZL2= 120
##$ZL3= 120
##$ZL4= 120
##$ABSF1= 14.98509
##$ABSF2= -5.573092
##$ABSG= 5
##$ABSL= 3
##$ALPHA= 0
##$AQORDER= 0
##$ASSFAC= 0
##$ASSFACI= 0
##$ASSFACX= 0
##$ASSWID= 0
##$AUNMP= <proc_prof1d_extract_pilot.lims>
##$AXLEFT= 0
##$AXNAME= <>
##$AXNUC= <1H>
##$AXRIGHT= 0
##$AXTYPE= 0
##$AXUNIT= <>
##$AZFE= 0.1
##$AZFW= 0.1
##$BCFW= 0
##$BC_mod= 0
##$BYTORDP= 0
##$COROFFS= 0
##$CY= 15
##$DATMOD= 1
##$DC= 0
##$DFILT= <>
##$DTYPP= 0
##$F1P= 0
##$F2P= 0
##$FCOR= 0.5
##$FTSIZE= 32768
##$FT_mod= 6
##$GAMMA= 0
##$GB= 0
##$INTBC= 1
##$INTSCL= 1
##$ISEN= 128
##$LB= 0
##$LEV0= 0
##$LPBIN= 0
##$MAXI= 10000
##$MC2= 0
##$MEAN= 0
##$ME_mod= 0
##$MI= 0
##$NCOEF= 0
##$NC_proc= -8
##$NLEV= 6
##$NOISF1= 0
##$NOISF2= 0
##$NSP= 0
##$NTH_PI= 0
##$NZP= 0
##$OFFSET= 14.98509
##$PC= 1
##$PHC0= 181.7633
##$PHC1= 0
##$PH_mod= 1
##$PKNL= yes
##$PPARMOD= 0
##$PPDIAG= 0
##$PPIPTYP= 0
##$PPMPNUM= 2147483647
##$PPRESOL= 1
##$PSCAL= 4
##$PSIGN= 0
##$PYNMP= <proc.py>
##$REVERSE= no
##$SF= 400.02
##$SI= 32768
##$SIGF1= 0
##$SIGF2= 0
##$SINO= 400
##$SIOLD= 32768
##$SPECTYP= <>
##$SREGLST= <1H.CDCl3>
##$SSB= 0
##$STSI= 32768
##$STSR= 0
##$SW_p= 8223.68421052631
##$SYMM= 0
##$S_DEV= 0
##$TDeff= 65536
##$TDoff= 0
##$TI= <>
##$TILT= no
##$TM1= 0
##$TM2= 0
##$TOPLEV= 0
##$USERP1= <user>
##$USERP2= <user>
##$USERP3= <user>
##$USERP4= <user>
##$USERP5= <user>
##$WDW= 1
##$XDIM= 32768
##$YMAX_p= 456066594
##$YMIN_p= -656587
##$CURPLOT= <Network HP LaserJet P1505>
##$CURPRIN= <$Network HP LaserJet P1505>
##$DFORMAT= <normdp>
##$LAYOUT= <+/1D_H.xwp>
##$LFORMAT= <normlp>
##$PFORMAT= <normpl>
##$SURQMSG= 1
$$ End of Bruker specific parameters
$$ ---------------------------------
##NTUPLES= NMR SPECTRUM
##VAR_NAME=  FREQUENCY,     SPECTRUM/REAL,   SPECTRUM/IMAG
##SYMBOL=    X,             R,               I
##VAR_TYPE=  INDEPENDENT,   DEPENDENT,       DEPENDENT
##VAR_FORM=  AFFN,          ASDF,            ASDF
##VAR_DIM=   32768,         32768,           32768
##UNITS=     HZ,            ARBITRARY UNITS, ARBITRARY UNITS
##FACTOR=    0.250966925370066, 1,           1
##FIRST=     8223.43324360094, -131785,      -41792
##LAST=      0,             105868,          -238825
##MIN=       0,             -656587,         0
##MAX=       8223.43324360094, 456066594,    0
$$ Real data points
##PAGE= N=1
##DATA TABLE= (X++(R..R)), XYDATA
$$ [...]
23760 -188544 -104365 -137051 -34980 76983 -82556 -139157 -4665 -457229 -184068 -115292 -410876
23749 -410876 137823 -99237 70729 290871 -243904 -37305 -248511 -147540 36409 -442772
23738 -174701 -127794 40999 216129 -85126 38127 -72681 107961 -67255 277805 -62911 -269433
23727 -269433 82918 221477 -153373 218220 -139077 -150852 97415 -125409 96775 10893
23716 -103575 58357 196004 131604 -458692 44483 -135851 -159646 144023 -69799 191283
23705 -261441 92555 70647 -91219 104918 -225841 -362156 168438 92827 46360 31680 -59699
23693 -165128 -182323 64569 112741 139687 -52899 25263 83713 -111752 180650 249161 112196
23681 -175283 129356 244560 128147 103897 219044 -25579 -83529 -200515 69653 -192355
23670 -132193 77604 155417 101357 158806 -17336 157598 -16532 -177777 90327 64484 360939
23659 360939 -216814 40075 260562 -120302 157127 87722 -247154 -399916 -233891 -214402
23649 -214402 148530 -4206 97662 73096 179356 -219033 -39983 -3000 191963 4032 -178797
23637 69704 146313 -78312 107974 56900 61776 -194163 -468274 -3400 162362 48509 2746
23625 134933 -99548 -148454 -178821 -408394 180203 -37634 -164116 22255 38668 -49350 133592
23613 175132 195077 99808 -179516 -308605 -59588 -130450 -35274 -1974 334470 -264960 30540
23601 57724 -49311 98250 76254 -196909 194982 528159 443793 357722 66517 266795 -22942
23589 248980 193809 301246 -56406 -25197 10202 259653 3453 -12617 118007 -17959 311974
23577 -116142 159282 -46658 193521 -80094 -22376 -13806 -231315 -116451 -14445 105132 373228
23566 373228 183423 -22474 -112152 338327 -13783 -124503 -109263 -209071 220707 -5530 -167645
23555 -167645 -152942 43953 -77676 393999 -257827 -160077 95729 -240992 158590 62835 281441
23544 281441 -487305 162226 -36983 125012 -184697 158291 -174026 -189487 -110984 179015
23533 98284 -129626 -340149 27652 -30387 -309422 -116066 86451 -140563 58183 117890 60472
23522 60472 -163597 -126006 123684 84869 -246032 -177683 192353 -21936 -93366 60138 -123196
23510 250372 56766 -108321 51857 177741 122740 112334 121227 -83126 -201407 114771 153381
23499 153381 -96316 -118198 22458 -22706 26925 -172851 122539 4911 103126 -66952 -44362
23488 -44362 -230310 -230345 182988 35729 36478 -82132 75527 -293105 -119684 -20361 19553 -141115
23475 -117338 223393 -307074 160378 -17436 -169821 -179227 -37186 88852 169962 -187817 81032
23463 -256265 -315088 -288633 64767 139625 -45463 125330 -3624 67821 -2783 146040 153878 176019
23451 176019 -11295 -121101 -75075 -199338 -184772 38049 223565 107948 141862 -200932
23440 141004 -146639 199492 246772 149231 -287154 9138 -49045 -278147 61183 -18930 187298
23428 72788 -147272 -192204 -30582 -182123 106001 -223727 272290 29763 -34796 -323824
23418 -323824 -300320 -260374 42546 -140388 -194620 -522954 27796 216884 7751 242609 -41226
23406 29479 51788 -192775 -270271 -131447 247434 -155653 89080 281320 -201938 289650
23395 233895 70152 -199783 -43281 -80372 -144181 284384 80563 293488 -272307 27092 -274988
23383 -166420 -38887 157359 326547 -7040 -87078 4591 23648 181889 -181864 -355124 214946
23371 -92575 36995 -10486 230941 -371803 -84103 67834 279551 -292179 148049 -117894
23360 223093 144108 -278592 -288181 -245427 -307856 -11790 -70837 -143788 81830 -234260 -68449
23348 68907 -261886 -91777 -106381 -245397 -167775 -88911 -161677 -63938 -10927 -76567 -245152
23337 -245152 -68919 156111 -121620 53150 10481 199277 -25787 30867 225037 -196017
23326 -54448 130529 45387 108893 155230 61263 -187946 -308012 -58157 -62977 210967 -16046
23314 -1330 235218 -165314 -29820 66397 -223528 30852 185724 -46799 -264982 113729 -64920
23302 -6801 -31680 92958 80781 -54433 25455 -105860 -81960 158087 86016 50373 26004
23291 26004 -157300 130678 145870 -552669 -10060 234789 -68394 -74883 116353 40751 -159671
23279 154297 144008 -233423 138998 2403 -146934 12978 36117 240236 -93233 -232339 -75951
23267 177214 227472 -146039 221669 -52549 142001 128957 74114 237316 -212774 167822
23256 -168823 386410 -116572 -134585 82948 49693 -55375 6113 -99131 -197826 -161648 -128835
23245 -128835 118903 -4418 117967 58626 20406 -4408 192233 -61195 -279741 -143077 130735
23233 83799 -361900 -143084 210460 -7922 341951 188590 36783 131430 19666 205214 -93840
23221 -29338 257673 -206626 223102 -163766 51493 -104882 -202550 112186 23208 58699
23211 58699 -173631 -31918 -48446 -42226 -85057 -217715 -447011 26155 -357479 -13189 -92527
23200 -92527 -5242 43479 20331 173265 12057 -52272 -69308 5960 46383 121673 -299719 -22940
23187 43135 122780 344618 -27693 -58610 37435 61661 80994 59837 359123 -146478 -211041
23176 -211041 -109278 166538 236285 -117774 4696 -150706 85217 -144475 122006 -244565
23165 50109 45811 184073 -237130 -83955 -227999 -7120 -123774 -200851 54965 16740 -115236
23153 228272 -114334 -54889 -196346 -285914 -234097 -4963 32774 -7378 306936 10684 274827
23142 274827 -81333 -2479 -8335 -32003 -209818 25296 -29829 184973 -110156 24227 89858
23131 89858 -385701 51767 120500 115591 196133 38522 -243969 309501 175488 11947 -51820
23119 -65962 -153357 13552 -70744 154363 -84107 109789 199918 -285376 65429 37826 180355
23108 180355 -147132 -193693 -144876 -212514 -3561 -11779 87807 40781 119790 -21864 368671
23096 -337415 -180413 237777 169500 -68626 439195 165035 42773 146346 92339 -22087
23085 42104 -61511 -207889 227819 145241 -197507 -98648 -95932 -95445 75619 75706 -493919 85585
23072 -38813 -37732 -32060 -82505 -71441 164978 80588 -4971 -116772 -127755 98010 -35949 137054
23059 102277 40124 -46131 -155449 85799 -157260 279396 -17170 141133 118147 295845
23049 295845 20388 254450 -83056 66895 -100952 -90011 -246478 -114207 -129066 -277030
23039 -277030 -135504 -203596 256268 169262 -220578 93518 284712 87554 168987 -138282
23028 -65989 83759 -24226 46620 -128474 -150067 168052 222267 -41998 -26535 -63000 -31472
23016 100550 -187698 -18642 -20921 11336 32218 77179 297 126551 -240037 22343 243894
23005 243894 -418640 32132 -228495 -56870 -110719 -15668 272049 -53335 -301752 116450
22994 235596 -76248 199034 13199 -14038 -278919 181419 172330 44811 -71879 -193580 -266022
22983 -266022 66556 -24154 38592 -358793 -313084 -75579 -44358 -29379 116931 -138080 -40965
22971 -88323 -47674 35228 112467 -85667 336833 229349 33539 -42652 -167661 -499004 36176
22959 152608 -85613 -74823 -161381 -35607 -189496 -50742 227879 347200 -93146 -30304 102738
22947 -42924 8080 137122 141634 -99787 111093 -29924 29737 100430 -140782 -97147 138503
22935 12316 -390756 25190 151617 36595 -232684 -50705 170355 65457 -232524 326290
22924 -18722 -69649 89712 -274876 -30575 218582 95325 147312 14733 -122545 -38844 664
22912 411608 -222601 273850 56870 -13061 173533 -104186 25527 -28040 -28742 -60584 -206648
22901 -206648 -73970 -41834 -30695 49689 -375230 -254981 -179163 -165502 -114916 -34071 -217123
22890 -217123 -33099 -181545 185577 -14758 55105 -65341 -186738 -65761 -281752 -98519 57277
22878 34642 -503536 -229225 -63377 -218034 -370850 92250 39517 312369 -54650 -193224
22868 -193224 -39615 91933 122903 97660 -113827 39132 30043 -60684 -184181 75658 -20078
22856 -78020 130816 63008 333402 -47614 281251 -60553 222089 -186688 -13880 -70366 200087
22844 108511 -12996 -259086 192438 -246610 317959 -62591 -96086 -157685 70860 77023 284421
22833 284421 -29193 -20962 194304 -21977 -83770 31010 -340612 22933 -226462 -272350 59896
22821 -296801 114825 -99523 -317283 -62136 -87661 71272 -243347 185488 -9251 -96039 -196089
22810 -196089 -146593 216605 101277 62058 131380 -464859 177698 -63394 71706 144055 76494
22799 76494 -117833 280025 -128216 -119325 -142553 -91247 -390553 77605 -214198 -121542 -123570
22788 -123570 11758 -33677 -330521 -146730 -228204 -160677 198538 -83716 -152963 174335 -169160
22776 280687 -113379 82678 -287626 -134524 46620 -174737 -15730 45853 -267282 50013
22765 242440 268119 195336 42635 166357 21787 -27834 -277952 -61721 -48019 -79647 61844
22753 97547 -46659 236591 -123527 -192855 -24678 64528 -37501 20681 -189412 -102716 69343
22741 -168407 71183 215548 157545 -220758 -153627 75594 -44932 -192269 47225 58715 -161849
22729 -140681 21829 51031 153611 -39359 125646 -6553 -324272 -137044 -201670 43752 -11066
22717 56988 -194421 50545 -175901 -311997 99724 26269 81528 -5870 -46363 -286514 -360496
22706 -360496 190417 -298221 -65362 84859 164605 223535 52488 -56585 -28006 -184214 -121731
22695 -121731 5822 11073 127141 -119753 12829 127584 21085 -176856 197711 -252184 -218777
22684 -218777 -268788 -291485 34057 -194328 -7513 37700 -37898 18673 106542 -11742 467560
22672 -67624 -151899 -129243 154639 -11596 225241 -155356 103068 -139392 -64002 -116642 -92080
22661 -92080 -226038 -5439 -17795 273938 -120114 -113437 -68685 -326631 69417 -306871 249490
22649 -293592 -266695 -172657 76476 -26360 -75970 147122 -21424 40140 61893 8056 102370
22638 102370 -60392 185020 -147387 158850 -117253 -163355 -214509 -109483 21841 -294986
22627 84606 112968 -233526 -26616 -27567 -229477 -130624 -193547 -345691 -249984 295694 -174180
22615 346767 -269972 104876 110909 95111 -77344 53519 -71911 202694 145422 59815 -741
22603 -48788 -108754 23210 -67948 241540 -113749 28539 -231500 27297 208162 -169800 -111230
22592 -111230 -228965 182118 143084 16612 137735 -136346 -62988 303304 -478960 -112426
22581 -116698 -95515 164759 35054 -58153 19849 97043 30946 20480 -276626 249541 228401
22570 228401 -143868 113461 86529 -209916 -208593 -77836 96900 223513 -193874 240806
22559 -236873 14721 85681 -95376 107115 -221285 -95063 46088 179940 -102710 73395 124495
22548 124495 140092 189184 -317703 141871 -83849 -119303 98537 -259159 -525548 93954 -50926
22536 351951 -26614 81216 -97044 -77795 -45147 205638 -194277 24024 182072 13554 -21214
22524 213426 -52351 -288632 214715 156511 143380 71892 -408939 16099 -194117 289869
22513 149296 40427 -21613 -58713 88311 -133761 -33372 -246147 -151854 32769 -76954 60209
22501 -140505 -190919 -69426 -196411 130193 65901 191873 -65147 24509 -92058 -200854 -225300
22490 -225300 -82229 246402 158968 -36018 -177879 -288280 -146313 -44102 202973 -189694
22479 230064 -96900 -168196 -131499 112582 -36356 -143599 -318697 131962 -127655 102417
22468 90243 191041 -136160 157239 -353812 -53086 -126168 29426 -136361 -222726 -169754 77416
22456 -80097 385574 -151000 -212337 -9984 254461 -166124 119347 -256467 -119185 -146168
22446 -146168 145611 263080 97224 -107492 173942 307833 84143 -362463 81782 -78788
22435 -13551 143563 -14357 -276637 -258417 119656 -188607 171386 -13434 -377126 -8703 54672
22423 64610 -150335 -16376 -91126 -143503 -95151 64554 -311799 -21634 -288197 58561 67855
22412 67855 -48426 -218333 13914 -57787 34929 50070 -304732 231540 -166826 37699 -186769
22400 -17911 -28311 -435202 -140952 171117 -112686 78573 -88678 -325467 172580 15614
22389 -151101 39624 -249746 73318 -263306 -6137 -4877 -281047 64274 65049 -108208 -199359
22378 -199359 406097 109273 -288037 -114657 -169065 -179367 67009 -81647 -188107 -229868
22368 -229868 -173044 -64566 -300803 -263156 -100713 101797 -229151 -94649 134671 24460
22357 63455 -244414 -87774 61035 -154758 -29354 -307719 4525 -65444 -40741 -325458 -155897
22345 -23035 -15620 -227921 102668 -75194 333858 81026 -87242 -199663 -30637 -120478 -40164
22333 139361 -110380 -188377 -220965 20811 -210421 28998 300513 -37960 -150382 -18777 354656
22321 125610 -148436 -219371 -98879 209886 -60056 -102986 126165 -140865 -22634 -24105 70602
22309 -304096 -241285 292092 -110398 -205126 39932 -228492 -68673 172247 10699 -14736 -225264
22298 -225264 -167762 -72608 -12065 172387 -31303 19117 -123030 218908 168751 -77928 -134707
22287 -134707 339550 41951 -25934 -322130 -62678 -146279 -28861 113283 76922 -139118 -56642
22275 132519 -97941 64860 278934 -157539 80881 227242 11993 -406908 -36397 219417
22264 163343 181262 166114 108107 3478 -24920 -9414 155165 -296073 -132076 -80824 267750
22252 -191977 -82611 86422 -401952 -230996 175176 59112 -123920 -79590 241190 26444
22241 -398064 124699 13593 28828 -73887 -145397 -176829 340087 -90661 -242150 -40218 -196118
22230 -196118 68313 -344403 248699 -160376 67841 -94006 -137136 215430 -221604 29916
22219 -63024 -96025 244048 -5747 331671 -100873 -111811 177148 -118851 -145157 22823 18449
22208 18449 -51814 -273681 61890 -131703 -4401 45762 -200142 143747 -444521 -398088 97969
22196 -43732 -99154 203531 -220415 -79220 -435233 62036 97309 -475419 -21943 -271355 -161562
22185 -161562 -194517 -358412 9479 -26739 -10608 -4410 82307 165794 175958 104836 118974 -45298
22172 -156477 13983 236609 -36038 -155853 241771 138398 52756 -127470 -133115 -43173 39553
22160 -345228 -2651 98441 27066 -305648 26783 -2480 41484 -63607 128672 -395833 48685
22148 -807 -18728 309150 -65598 61929 126500 -49629 16049 -304844 -96702 -250477 209998
22136 -110042 3327 -285409 75317 -22358 93866 268176 39217 -53144 87349 -76484 -211603
22125 -211603 460316 -84820 -265350 -113582 -277188 17707 -393760 -112644 -89964 -137312
22115 -137312 62479 -109798 78738 86765 -78113 14541 -269363 253136 127010 -295427 66121
22103 216241 145832 -175020 -263320 -40123 -14293 -10387 -51201 -237002 -185237 112380 -344127
22091 75280 -47305 -192830 -148044 -149151 -7654 -119789 96076 -84470 -17463 91721 -229379
22079 -144924 -214618 -152765 -147484 -173448 -214153 77953 -82794 193120 -101768 -285901 53042
22067 -145519 -259852 -528642 -257221 -270098 12766 113801 4093 17295 9484 32537 -213308
22055 -427055 26466 -114308 446825 -202780 148559 219073 89476 -7485 -122368 -183451 51423
22043 -167078 107492 -43266 -166531 -146927 95681 24619 120964 -72578 36525 91304 245042
22032 245042 -4967 -361600 -456711 153664 -71380 209465 -22463 -124279 13075 -234766 -34307
22020 -249992 -56069 -35624 -102998 334321 -52438 -178916 -36222 -56105 56771 34693 -249003
22008 -289474 72620 64427 -134963 59364 -188841 -187286 49829 -8950 -270385 44001 -200599
21996 -331783 -96410 -10076 -124897 -24408 -134973 58160 295747 -227056 -269881 171216
21985 -256928 214939 -51506 -196286 -154179 -16572 -151368 381604 406754 -201214 -192276 347649
21973 -74083 -71140 -231391 -113924 -76126 61607 -387368 59218 -132096 143333 -157766 -68601
21961 328376 32064 81122 -35070 -154862 72775 -201128 -123283 279635 -143671 -215783 250310
21949 96444 -66274 -8485 -83726 -90470 105484 41709 -94331 -37673 -153318 -15210 93301 -262461
21936 -229261 -44986 -124626 27795 88109 227494 44054 -212291 -120200 97208 16797 -184120
21924 -6733 282752 -229721 258013 -91995 -91679 16864 -183956 103395 21304 -98303 -219071
21913 -219071 -144780 149034 -128557 157342 176266 -103990 -305240 -100668 91254 -216538
21902 -179213 -272194 -316964 -378232 85245 206459 151640 -206229 -82150 -202401 -409886 -129558
21890 -68936 84792 -275958 -100930 285524 -6371 -121991 41204 -138042 -17361 -314573 51364
21878 55823 -275408 -166024 -5983 13292 -59814 -301632 -89847 160664 -118067 168010 -68678
21866 -188952 -285188 -109812 -156479 54134 45059 5970 129771 -87316 32075 51398 -76583
21854 -83626 84663 44428 -67701 -193773 -10114 151907 -142372 -3982 132783 -42224 -226951
21843 -226951 -67984 30281 -537 162853 -59728 -440072 -40995 -315451 -106687 64127 -196480
21831 -129198 131615 55786 333823 -124320 -54468 -136760 121559 58045 67291 -91847 -382426
21820 -382426 -52965 67689 103227 -88809 -30141 275725 80396 -151541 -8050 105853 210792
21809 210792 -75739 56812 -22586 -71515 -56216 298669 -74423 -328273 50888 -80986 279000
21797 -119448 716 -31320 152808 -52411 -393 -23501 -178712 -149275 141201 -10824 138614
21785 -53302 13528 -168655 -139775 212075 -178417 21716 41298 29774 -305205 129573 -174101
21773 -274385 163427 125239 267517 76560 -47912 -23028 189073 -144757 133068 111095
21763 111095 39219 349174 160902 92082 -108073 119570 200647 -147035 416915 132410
21752 66439 -287569 72275 -32083 198995 -373566 -116520 238922 -465335 -323781 59817
21741 -96359 -131230 -276315 -106039 -296035 -339126 -12845 -222274 31792 -185199 24392 -17010
21729 78486 -11043 -360921 -239082 158424 166840 -89650 -135578 -60887 89610 -168277 -210142
21718 -210142 170298 -28683 -73530 -154072 -112588 -271891 303621 -22043 340325 -112132
21707 -157091 -133067 149517 -244095 -131769 99312 289552 -57267 150244 -124281 -87582
21697 -87582 -133187 -287456 113277 -262694 -208187 -222614 -13034 -499275 25441 -163235 -170384
21686 -170384 -60015 -30905 -377847 -263744 -276684 48614 -392990 7656 -187078 -335458 -173685
21675 -173685 152834 -143306 -58207 -348757 -11271 -620241 -219629 -83689 60891 -439730
21664 -155803 19356 -244733 -104540 -389163 -15227 99525 -197951 -140355 -10467 -35039 -136693
21653 -136693 18836 51421 266734 127728 235303 179271 -336862 -204595 216354 11378
21642 28877 39090 -95810 -205489 -25908 -339145 3206 -30093 -72194 26641 78431 137018
21631 137018 32524 19132 26769 88132 -283376 -77408 312966 4355 -325699 -120367 -168098
21620 -168098 -45237 27863 156812 -5862 228430 -58754 -262471 162352 -125764 331937
21609 -41177 -97823 19540 144018 16399 -321985 -510655 -165583 -31570 -286224 186052
21598 -33790 45005 -37358 -78763 93165 -52386 -171668 -63132 -68018 -170939 199560 171385
21587 171385 146998 56088 -243009 154941 -195533 -60261 -70920 -19380 -326297 -178510
21577 -178510 -99305 -80461 -68913 114011 201185 -68823 -142723 203698 87335 -304303 22696
21565 -240703 -67451 220940 154839 31001 230540 -13223 -179521 -61115 -24700 -270105 68492
21553 -68747 73052 29117 -11741 -196392 -130574 -56086 -292678 182597 -156276 -125410 -388550
21542 -388550 -215072 -187196 58957 -185462 249470 193913 -187068 253295 -98863 -301294
21532 -301294 13524 273474 91794 -68271 -189511 27109 -309142 -74822 -129784 -193690 -396941
21521 -396941 193454 283997 209628 -246788 141770 -342229 -92592 -259692 -40602 175837
21510 -214096 -184754 -70897 272148 -166571 17975 32256 -359713 -164672 -310267 -181624
21500 -181624 -159690 -206082 74381 65280 -374878 46259 22261 -120770 93519 -40088 66153
21488 264371 -228212 20045 -81581 -30371 -55631 -220446 144167 -31080 2014 -31278 -285
21476 -311702 -82862 -136467 -38236 -276994 -69367 -1855 -79490 -26543 55808 -146598 -103234
21465 -103234 -120114 48880 -92229 6954 287693 -47346 -174027 29436 17485 269445 -249135
21453 54412 -157577 -126691 84609 43995 -6180 24187 -245428 -27563 -3616 209178 154004
21442 154004 -22686 -133614 115364 224993 139299 308803 363382 37744 44847 186173 175344
21431 175344 298494 -158693 -140346 232246 -207120 57477 -238920 -256581 -332310 -234795
21421 -234795 -2968 -260146 217912 -209803 144090 -142818 -360821 -3107 -112929 75305
21410 27215 60770 112321 172452 -185639 -260710 -60249 69318 60339 19821 -147050 -16334
21398 350573 -304531 -10056 103505 25209 -146964 -75389 -374319 97661 -109567 17965
21387 -132994 -285770 -132514 176872 318030 182818 -168517 -62989 -222294 -265026 -54699
21376 20928 -115313 -202938 172973 239542 -220443 -234038 -270911 -14280 -177173 -333855 86454
21364 25519 -290139 381751 -160544 164056 -139326 -411371 108643 -32139 -262243 -187065
21354 -187065 128177 27458 -68366 -171578 -446359 -164015 12111 -62276 -256083 75987
21343 332498 -177730 -114407 -77812 -208239 -388951 -74538 -68777 -150048 182668 4739 200546
21332 200546 -515186 296 -230833 -410492 -204461 -207702 -5269 -230952 315645 -41996 -28465
21321 -28465 229309 -94789 23302 -109422 137791 -360798 -277491 -34349 205815 -187114
21310 -287599 53163 -110057 -89370 -198372 33738 -292165 -56899 -378071 372949 -315003
21299 129822 137289 312 29864 66975 100571 -80687 -23199 212100 -158034 98880 167226 -90217
21286 -316310 -109684 -84152 100047 -168754 -157264 133431 -121430 -158702 235749 -58728
21275 138770 -89585 -32639 -234942 -24273 -291689 -64886 -165139 -82115 238986 -59960 18760
21263 -192845 -26994 -257337 -507072 -207033 -208640 -6515 194016 18439 -132863 27894 -190222
21251 102376 -12830 298567 -278649 210267 -180368 90716 -33167 -201234 30689 -90581
21240 -155980 89631 156674 32732 39542 243528 -236334 235378 -98421 150508 -172871 179445
21228 225728 97634 -126781 -350060 -60438 7348 -131401 -45439 26468 -67911 -342126 -43844
21216 251452 -51178 -184575 -16699 -216422 276928 -116042 -245217 -62608 1180 25756 -413066
21204 -18788 1208 66911 140085 -163299 192696 5196 -35394 -101941 -446931 -290891 -146511
21193 -146511 -79457 196172 48573 144552 301723 -254178 37080 -97091 -4875 9470 -145214
21181 21556 -86604 -337810 -330581 201231 -16341 132645 412795 409395 -36914 -248739 -283091
21170 -283091 -515563 134173 -5295 -132945 135852 20824 -176356 -118498 -338994 -390894
21160 -390894 93918 -124852 -5624 -326611 -138145 136715 -510722 -81321 169207 -130966
21149 -296980 19890 87419 -47 19490 151870 -397245 -251975 -59827 -181799 118102 123503
21138 123503 133840 -79085 -141529 1488 7392 -82077 20211 140896 121099 39335 -164968
21126 22246 -15753 77725 48957 25891 1879 73539 -183398 -73231 196522 166667 34054
21114 198973 204558 14425 -138633 63462 40529 -59025 -116495 -82528 -258551 64289 -304277
21102 -254440 -130132 118299 -93920 -177998 -264759 -64095 114862 51391 251117 111911
21091 15281 81020 -72748 109392 100558 -188482 -187713 -50424 68142 -132702 132005 -198828
21079 105657 147565 -306857 -88086 -104516 -142363 77499 -191585 55560 -170415 74715 160968
21068 160968 49311 157219 -1348 -162666 54987 145895 -66549 160763 178547 -228168 -97611
21056 -60272 -69206 25130 -161432 -277673 -93247 -305798 -110683 218020 -123086 -245597
21046 -245597 -186080 -70345 86350 -191435 146317 -26403 -75591 96567 -223170 -175987 -106611
21035 -106611 -27860 -4143 8603 -132096 98621 60069 -43350 -493190 -173140 160095 126988
21024 126988 -253753 128085 -358509 -195952 -239907 16072 -45549 -33260 -88579 40709 -70978
21012 126314 274736 95105 -165591 115199 38166 63774 364449 464485 100460 79500
21002 79500 -117780 134685 172473 18399 -15098 111149 -105114 246423 -353700 -3474 50750
20990 -41123 110815 -121966 28823 -113391 2501 -296465 -14164 -80778 -109891 118678 73872
20979 73872 -244755 -97948 -20845 -212176 6307 -85283 -160647 -3557 -36515 -38741 -6556 -76883
20967 -76883 -373865 -177474 39545 -157300 -136009 -190619 2167 -37163 -156256 -61753 88768
20955 -18119 -82024 189683 -83619 88173 161362 153893 44143 -72873 -1023 70553 130070 323981
20943 323981 285933 327610 114699 359714 107962 35926 117452 -10201 -31914 26411 -293529
20931 -239295 266085 -299907 217331 60332 23632 131565 356808 24815 60849 -10558
20920 -56467 -112210 33770 92530 -157962 292159 -174609 -86590 -261945 83455 472635 21086
20908 143976 -79761 -183033 101048 -157844 -29671 -182920 -2803 22581 124424 -109874
20897 15703 -109636 3170 -110628 163273 -4049 43707 -209181 -282205 -84503 -2791 46580
20885 -26645 -92655 -108388 -101220 -526892 -157726 -58055 10219 -99226 -140152 -195673 -30663
20873 318771 -256147 1250 -130579 -59690 -135986 -169717 -8217 35930 -210830 209865 -184035
20861 -212730 83486 -129093 349872 123213 100079 -122372 -131076 96754 -339125 -7020 75045
20849 -58342 -457294 -73143 -151026 -169469 52312 111924 47091 -266945 53819 259642 -258007
20837 138077 145664 70602 -18735 -215330 51879 -182336 231045 -443281 -23977 -208316 14412
20825 -108405 -234142 83988 85184 -80295 -320250 53393 131648 -181289 12641 -133808 -251632
20814 -251632 218387 -125840 -11372 -169822 70002 4404 -70422 -145596 38162 -201783 241002
20802 3142 -153788 -29535 170647 62943 -95068 -210620 -91968 -99489 -134290 186830 -198754
20790 -140982 55547 6714 8937 -73004 -180895 216603 -59478 -65656 52266 65300 -168771
20778 86226 57603 -262505 -128989 -204584 -38085 -140874 -393408 115376 -267411 -188931
20768 -188931 -483640 291378 56199 89287 -82607 9593 59518 137719 -181867 130558 82102
20757 82102 -57515 -260969 5245 -58071 36882 -387264 -73736 53737 -138501 -6965 -269202
20746 -269202 -166663 -53749 -85291 65370 -272806 -111040 -253626 -327646 -145529 -154882 155424
20734 83377 115792 127076 3506 -55322 119439 41149 -419515 103142 -5794 -238 -100210 143631
20721 75041 -228316 -66508 -2429 -18494 168094 -319121 -62645 -130203 -6761 -95532 526683
20709 39396 124174 49629 15512 45641 189962 -168160 -77576 -111470 40873 43458 -200255
20697 16247 -22674 -68916 171553 151686 -149870 -363809 18531 -5672 -171893 303317 321737
20686 321737 -133239 65192 121072 -271212 -200825 -375565 40056 -78149 217904 -242862
20675 -140037 -77815 153476 -93425 -12661 81062 36976 -186191 -175287 10588 -477693 73834
20663 276380 -33478 -293130 -40082 -47541 -354866 -6356 119814 -171346 57421 13100 76227
20652 76227 -49956 -187438 143963 -69364 -196141 -149035 2386 -385946 -268843 -193121 -33024
20640 -62000 -63429 -118283 82601 -337749 99442 -242931 93266 -250405 -225946 -15868 -112375
20629 -112375 -223106 16119 29139 -261552 -112021 245985 -106870 370519 -209715 -52272
20618 254239 -213728 -202463 178648 -82273 -1270 -150180 -281144 -109154 -73383 262163
20607 122013 -6604 -36537 12338 94433 156435 -72435 -182757 35482 75612 30351 -567207
20595 -505435 -180631 -110779 27523 4288 -196492 -194302 -169526 146833 96695 140946 183070
20584 183070 209974 80080 -196987 21113 283322 96623 -9393 -111901 -100849 -13430 -470757
20573 -470757 -318703 -42401 -68277 115293 113601 -34563 341565 -175628 -233748 229241 113945
20561 495 -159842 -99013 83015 -48599 77317 -68761 -277176 83978 -347685 -142531 -19634
20549 298604 -166107 203341 78096 176608 -20020 -313747 -14540 -46140 -206861 -134529 32969
20537 -177237 81828 31963 -212116 -110332 -52040 -44439 -46463 -220044 -62751 -334988 -72312
20525 -81404 196915 -349396 -276622 -19220 328698 69343 35344 328338 -212890 -554124
20515 -554124 109273 85361 -46600 -273284 237928 255314 -159933 115955 31754 -95562
20504 -195357 -391361 -175133 -115995 -25895 -137296 -144561 68729 74648 -92212 -353353 -117801
20492 -115748 102898 -21170 164422 55677 -55185 148605 -334274 -56351 -184460 -253084
20482 -253084 -285461 -212956 -458739 -281805 -152981 -45644 -61956 180599 239132 -55459 45373
20470 -187701 79499 -378821 335685 35814 -176286 -44523 -45275 489476 -146241 16142 279654
20459 279654 164567 -16479 -5349 -31083 26339 142730 78985 104444 6218 212109 -269078
20447 52136 74998 123691 46272 -85038 119901 178478 149986 2374 26182 -131584 -121673 -99197
20435 -99197 -147385 -133498 166282 -93533 -350567 176005 -56395 -235174 129261 126151 202247
20424 202247 -204602 -413913 -49642 -1863 -43394 220376 139446 -293897 -23908 -531718 33487
20412 180929 -253978 -98365 -94755 128231 -163263 -57839 -232206 92242 12988 -77324 -320924
20401 -320924 -152934 -6468 -404291 -142953 -304136 -170957 16673 7751 -28732 -399737 -239680
20390 -239680 -267210 -53653 109330 215595 -211222 -3085 67812 -439043 -218962 -76789 -214381
20379 -214381 -13920 -205003 -261163 -15675 213549 -85451 -56759 -2161 23063 -45890 -58377
20368 -58377 -479813 -28165 201062 -54241 157900 94924 231707 -249893 10160 -150257
20357 -63409 -55138 -175372 -60066 -12883 -195060 -88917 90780 -131464 -52956 -16800 182905
20345 -207875 -76061 -310097 220846 45816 -10355 57887 -333013 -90347 -38160 -79068 129445
20333 121638 256730 -17192 -69744 352999 39823 -477462 32778 -263969 -111913 62493
20322 11532 49308 -458442 287261 -78108 172358 -273695 -86796 -6464 -178629 -35615 35085
20310 -13236 -58329 -87394 -462737 135011 -68612 364727 77928 105136 -358159 100738 -28122
20298 -59236 -87990 -88656 36554 -11192 26582 -186533 -188171 -56814 2551 172368 60093 -262630
20285 -363301 -207403 -353056 192481 59749 107898 43015 -212462 -10554 -187929 55350
20274 -148506 -151708 -263739 -22902 -322775 -138065 -151886 -253823 1017 -370609 -2114 -201631
20263 -201631 274303 -32928 -25628 -215096 -299075 69211 -35760 282191 -144533 -150738 7932
20251 55682 -32178 -217883 -74863 122576 -108309 -16538 -815 372205 -195411 45857 -155531
20239 -28901 101559 102877 -41720 377378 -307247 -154513 -301416 76496 -238404 -195830 -67184
20227 -373512 -162867 -90347 -145396 69642 48260 -55076 -406768 -221744 204816 -204524
20216 35198 -124012 48747 382111 -24359 -341206 63399 18285 179830 -74507 -132284 195414
20204 -139919 -184607 -227920 217794 -250069 -34274 59514 168727 -113934 230751 -7994 -126521
20193 -126521 11469 -155380 38438 -199207 -118040 -85488 -133416 266700 26797 122194 -295315
20181 -37583 -108741 -72862 -330185 -233212 2915 -484817 -106850 108417 173243 -187825 -97709
20170 -97709 22326 -121912 14484 77151 -263170 -82050 -48908 77150 -115435 204243 -20334
20158 172339 113365 142971 263662 -66679 -224235 -93710 109105 132794 418453 534952
20148 534952 177145 447345 413973 2920 133901 74820 105825 -46823 461481 358611 536864
20137 536864 -51067 -29585 304418 -137273 -126083 120678 -51966 -16994 -331934 54601 205686
20126 205686 -239803 209373 -283674 -140515 93476 -120824 27993 -169276 152067 147222
20116 147222 -190831 112294 -216165 61279 86920 80985 310470 352932 197137 151921 218566
20105 218566 -114381 -30208 -159625 38662 -165920 -51305 -93978 -56911 226625 21564 -81890
20093 189503 -135174 6099 -193923 -49980 -53265 246286 -171415 46756 -259022 14655 232587
20082 232587 9151 20274 191896 -14103 78254 -50144 -326268 -176915 32833 -133532 -28726
20070 200628 -143085 264112 19654 -175437 -103376 -183118 -131517 230324 -85104 -179512 72606
20058 -297460 -44036 -433137 29377 339698 -69091 -185959 -69873 32853 -404228 -180467
20047 -70211 133755 123725 -56842 -17364 -220376 126833 -192890 145205 -89586 191942
20036 -71026 3847 -21408 149128 -278008 -131893 76863 412164 -300130 -212212 84556 37410
20024 118586 193858 -90556 -163269 -189678 -218604 -221959 -212599 -231788 38204 112755 -76287 -30005
20011 82992 -282078 16735 62774 18467 71064 -126200 -132636 -75909 -62121 -372574 166380
19999 -217377 -196424 -251719 332749 201491 36821 157933 57588 -229738 100681 120480
19989 120480 -100078 227311 229555 176698 300715 -266749 60614 207765 126706 37668 33245
19978 33245 -121168 173048 35178 -329818 326105 -192871 -477 -192706 -65074 101359 -140385
19966 125508 58839 -367889 183336 544462 428103 186100 86272 -28169 390255 236239
19956 236239 114474 142901 274738 133103 480419 -123766 -98794 36928 52304 185028
19946 185028 -336709 -26579 -119956 -308474 128762 23692 360030 173873 282761 -147747
19935 -136358 -86046 242010 39507 -198869 -9863 197815 46000 -100076 -22613 40969 -67329
19923 -317485 -408622 -53871 -264746 -19587 -99616 -232868 -63881 116698 -80659 75354 -279727
19911 169936 -222639 76058 -36252 -20553 -143804 50369 -168159 179565 -64870 -268241
19901 -268241 -221485 126751 -181308 78348 159999 -75259 -580044 -95795 -195158 -70427 -83097
19890 -83097 -41782 -10073 -211597 74919 -97663 181351 -307636 -333771 242767 -375000 -294176
19879 -294176 -181871 -73795 22886 11386 -162153 107076 -98174 -314064 15657 -320820
19868 -63617 -173484 -148086 296859 -113895 79181 87865 -38177 61795 -274041 -204402 -59955
19856 219027 -78190 -115072 -124076 -31326 380178 -258654 -103146 -165528 -298353 156236 -122287
19844 98931 -214346 -44007 25359 -74560 15314 107330 100503 217610 -3194 81117 -191621
19832 -96313 -247151 -180549 271767 100199 -169395 -118995 90119 -94316 -4597 -24419 62520
19820 -70283 -122739 -260588 -87259 43769 -264642 144289 -120691 -5178 -177670 -33912 -515181
19809 -515181 -105836 -91899 65669 146858 -187036 -135680 -120592 -25347 -364978 37430 -10124
19797 307801 -416795 200512 190779 -111653 -397235 143908 -105618 -129546 -136881 -215706 -49826
19785 -34917 26961 175836 110103 238642 18838 -264002 74909 223674 -63377 -115795 -6000
19773 -182753 178340 11615 -354409 -218188 -54155 -157085 49309 -157073 -421725 -299812
19763 -299812 -281542 -178905 -45832 180369 286192 -183558 70547 -276109 8106 -282016
19752 312123 -68347 -307340 -223769 -11675 133411 -221181 -235089 -349152 3074 -211737 -110156
19741 -110156 -828 115293 100926 284191 108075 66870 -106707 -74486 -8773 208223 350489
19730 350489 708411 663653 593985 208370 289635 87063 -105284 -79178 -46947 -123912 -71017
19719 -71017 -126888 -142948 184888 -209287 -185505 21342 -174917 -151836 109640 -124249 357462
19707 -38748 -198127 16187 -11570 248106 103975 -58809 -168153 270246 56783 170161
19697 170161 437464 397853 7514 159101 383183 30382 -126301 243092 77272 -355009
19686 97765 39374 -309338 156774 -164574 -27726 -21130 -144626 -45963 -160150 302080 115483
19674 87827 81591 59567 -172793 327824 285304 -349160 115239 26296 161964 -10714 10458
19662 123364 -126909 -65230 -461855 -283883 122543 59676 265641 -35990 -171116 -2687
19651 -139236 -108012 163388 255672 5181 -235241 -123365 -215224 -178427 -203118 128220 24355
19639 30881 -95415 -282368 -107645 -26028 -75888 -68911 -163392 -151929 -221264 246440 -18314
19627 -233348 202256 -200124 133428 -20486 43263 -113222 -127007 -341235 -311455 -20966
19616 -130950 -92877 -197355 -195710 -94733 -243744 -227977 114382 -161758 -73332 27681 -83000
19604 93524 -310322 -230722 448 -69494 -149143 -93724 75319 130619 124049 -97218 -21295 -318474
19592 -318474 -283039 59939 -116508 -221005 -222982 -249669 -90541 -33617 -97345 -189873 61699
19580 -137066 29210 296946 -19313 -204020 -146653 -510569 -24348 -412241 89167 -48827 206660
19568 184721 -51675 76765 58073 807 -238632 -234077 34946 288370 45572 19620 -126220
19556 64963 17153 -296746 -2954 -334618 270211 -163420 -253263 37382 -92679 -197865 -303829
19545 -303829 -1523 -101236 -96095 -278419 -264504 -34753 -9458 -65271 -188025 -242959 -206709 -42599
19532 -228574 -37072 160608 -371708 -115402 -146167 147743 -155041 241148 -280436 -81369
19521 -32773 -200977 -67869 -210909 -74710 -95629 -356856 -342109 -46757 -6432 -163172 170358
19509 88892 -247509 32905 108185 -106315 -176550 -29797 -224217 795 228295 -285053 -61888
19497 46316 -65793 9007 -101747 82394 77333 -123259 83612 431947 -17941 -351392 -217523
19486 -217523 -261186 199719 -102009 -43688 -123278 -90976 71661 -377417 -75836 37111 220974
19475 220974 113792 114843 145726 116983 -325239 -60451 -255726 -80455 13810 -157296 80099
19463 -55032 57664 44722 -389958 123640 -360731 -167730 -284992 -25558 -159911 91840
19452 -149374 139618 -299535 -17903 -77708 35131 -94401 53668 116782 -148834 -73821 75907
19440 -255370 -44703 -376248 -215914 -134742 137904 60850 37700 -312628 75576 5699 140482
19429 140482 94837 197893 -162954 -103843 -36434 -72970 17184 350429 -17573 -63120 -344152
19418 -344152 -115360 134601 84680 99769 41230 -151821 167171 -61195 -221345 -2417 -123034
19407 -123034 -340283 -16364 -45304 -83904 -85643 56927 -18543 217836 -12649 -18855 -193217
19396 -193217 -238865 123762 -254497 -191503 -247319 99332 215601 -246480 -309510 188041
19385 56163 34148 -122476 -127075 -13748 -175812 -349804 -443149 -101725 -118754 -210041 -173217
19374 -173217 -120132 126372 -108106 255918 -147455 -135339 -398835 -199441 -21033 -104473
19364 -104473 -178794 -80525 -49155 -211566 -153055 -7992 -203902 -120789 -403989 144488 318915
19353 318915 -64869 -302788 -97367 -207491 252947 129465 -151718 -161641 20049 125731
19343 125731 228326 124534 157154 37305 -317830 -85322 12388 -198027 168072 -150414
19332 -200512 -116325 3632 -100751 31984 -5152 -227413 -20650 -333498 172393 -186735 72463
19320 -159825 -254945 -47101 -395157 -94156 -109708 55770 -206618 -269224 -276250 -19290 454523
19308 46544 -291984 389724 -32235 -109721 204990 107227 43832 -65079 -214286 -198805 -82166
19296 318304 -36843 -210921 -502971 -106017 -371043 -236207 -97250 109625 128455 -100666
19285 108324 -334423 -188554 -52510 277983 -8816 -111986 -62013 -378556 -96538 -306903
19275 -306903 -55257 -223518 37323 -60096 -131418 376203 -180465 37314 -123997 8608 -85633
19263 -60834 -151450 -29055 63418 -153307 -346107 -63194 -272952 269175 -84187 -10266 96662
19251 182427 -14616 109537 -198345 8509 217927 -304740 2542 -112983 -199586 -34132 -265667
19240 -265667 -60314 285836 -405392 -190709 -213462 78321 172765 44650 -107240 82994 -157061
19228 -60409 18594 -11577 -232459 143030 -184272 17391 -111000 93517 228179 -4174 96834
19216 -25511 -168124 -131150 -203168 -43807 -6856 -229748 -125914 -229384 128030 231274 -11472
19204 -424408 -5803 -197641 -54150 187366 153803 70231 -35812 -165955 36962 284322 -59213
19192 -213190 -167660 -107344 211098 -208913 67721 -297340 -118732 -279760 -64607 -80029
19182 -80029 145407 84718 -13073 47181 148470 -181595 -182247 -66680 -224775 123796 278198
19171 278198 -47585 -165259 -61438 -21265 -171355 101887 27202 -206057 -253368 -84169 -14987
19159 -295837 -91130 -253137 222067 298395 96802 39994 6781 -26264 -293071 166594 -134513
19147 -165768 -90355 97656 18046 110149 -133690 75388 -73157 -33151 -438994 3838 -47314
19135 54285 -286365 -151750 -276494 -52212 -417418 -131890 187021 -178963 -176921 -133600
19125 -133600 -178181 -307507 -248431 98380 304034 -581914 -148274 22298 -26932 -226768
19115 -226768 -66867 -21087 226271 -94578 184448 5063 -42009 -262936 -123185 -39627 -135167
19104 -135167 -323500 -177359 -325035 115976 364151 -223308 51396 -23453 -212923 -112432
19094 -112432 -130188 -141027 -214967 -203556 -101988 254756 -144429 -234388 6959 -207895 38408
19082 -31339 -6021 98347 127742 -287459 -158037 -164566 -119591 206594 -101944 241206 -141098
19070 436126 -178486 -232825 -111272 34866 922 -154780 -174796 -167427 -390084 -165581 -318280
19059 -318280 137062 93072 56831 -248177 -4378 -128328 -74703 -116803 167497 -354881 233929
19047 59438 -285957 -26490 -168820 -199243 -227535 -263572 353150 -12701 -201934 -18788 114429
19035 -121865 144751 3727 -204838 112734 -93610 158549 -146908 -8554 124552 -1902 107014
19023 -47044 -122685 78552 -29173 202953 48454 26624 -109566 74202 49055 64449 83556
19012 83556 -316188 -261703 185119 94697 1886 -79766 301447 131127 236535 252127 -207570
19000 149621 -59280 152956 -149649 -21775 40643 -179106 -90317 -162067 -255915 98777 103866
18989 103866 -243773 -539 100444 -200794 88692 298496 -239536 -306744 9126 6376 -7664
18977 -105347 306205 63574 81874 407583 207149 -38055 740650 128526 -135782 185148
18966 148435 -153508 -34125 -34131 138438 -197810 -172164 12425 -111651 -28600 -65568 -476841
18955 -476841 -100928 22786 367675 174657 -476354 -144349 -207266 150419 -185062 -62960
18944 -315532 95653 256216 189644 -192390 60097 -8229 142600 97230 -233726 -39174 -262550
18933 -262550 -110008 30376 -77473 -63320 -38582 111699 -198516 -279747 -151156 254505
18922 10717 -242962 -2745 -256394 -107374 97384 -43082 -272501 250579 131834 5522 210632
18911 210632 310022 16643 420086 423114 698458 470249 -57111 -363275 -247921 -281311 -4081
18899 -116265 44600 42836 41424 -300717 86848 -283300 254245 210265 194904 33517 -195248
18887 10889 -21302 -159213 -173523 -125778 -77957 61531 -232474 37089 91884 -309773 -173639
18876 -173639 -200328 -260872 93891 6396 -279727 -50658 -58238 20676 -288977 -309863 262928
18864 -189686 80072 -107050 205138 -86780 13689 -103608 -175714 287914 -72095 118474
18853 163496 -34694 -66525 12743 114773 32503 -270443 23535 38772 -40402 -102419 -269703
18842 -269703 366488 -132881 181769 -120409 -161417 -160193 -242921 -84978 80774 85700 -219380
18830 85521 -93804 -91170 -77389 -240307 88889 -21702 -133358 336818 -149949 -169318 -68650
18818 83916 100103 30430 251866 174114 5521 142604 22726 -16930 161896 -77867 1014
18806 8922 136668 152345 -120901 -212882 -27851 -202386 -40608 -8762 -223347 129070 -95689
18794 -84221 -99813 -104254 82751 -70812 -97656 -309880 -124003 39197 297824 -103869 -254648
18783 -254648 9432 -123874 -31230 -28248 -101500 -234423 -26434 -248813 23514 -282798 52275
18771 -250802 99945 -99780 -146919 -191442 -146388 82353 3174 15641 -225502 38987 38153 -161535
18758 -211369 71466 -276074 125077 -157226 -109218 94741 -65811 417831 -287270 -158017
18748 -158017 -196038 -198868 -161851 75288 -151471 -53497 178145 16254 -11890 -252489 16979
18736 -77328 28394 -15365 -69852 -131055 152013 -196470 12130 -101695 -173494 -305184 38731
18724 364803 -157184 43779 29169 -42222 -229242 38939 107253 -179573 22437 -234818 67133
18712 -77006 -170146 474598 -277125 -68872 -115747 -138495 70913 -203476 -205873 -31911 -80702
18701 -80702 157890 33297 417 -153700 -136455 -254654 232927 -186166 344235 -18276 -367124
18690 -367124 -246534 25866 89875 -5147 136993 -67781 -86482 -281531 -137746 20996 -387025
18678 -98219 -76766 197273 -134532 -84990 -137345 50862 -391824 83844 -92246 56808 -112034
18666 -138239 -87720 -173696 -86709 -208627 21599 -112395 -68250 104958 -252680 -142993
18656 -142993 -74979 -18141 -154865 -17824 -63224 -249271 258729 31650 150266 -313981
18645 -270888 404839 -14047 -50777 111911 -5011 -166566 -277682 142805 -5888 176081 -213284
18633 100417 -112723 -26283 -29567 -12492 83864 76190 -103477 -419076 155736 117347 169530
18622 169530 93571 -49384 -131490 97044 -216677 -316568 229059 -1257 -291589 160807 134474
18611 134474 135241 -106960 -106237 -86825 3268 141423 -194669 14763 -316247 -63623 -63055 -112429
18599 -112429 15168 -85937 -83262 92766 -171409 126550 12773 -116390 -151433 203676 32800
18587 4248 33250 157017 -164102 330311 -370721 -56288 -142619 557581 185078 -14017 -25786
18576 -25786 -62531 -68924 -209709 -255519 -71959 34736 -266616 -165859 -18380 -176878 -412483
18565 -412483 162002 -76389 27885 187028 -67149 -194627 37384 105557 -250339 -384386
18555 -384386 69180 -5976 186291 -10809 106 -404059 159528 -66257 -268468 -77032 339217
18543 -33100 -48598 216453 100543 -164633 -32099 -119654 -54207 -411963 58954 108141 13120
18531 44082 -22378 36393 -324018 -146289 -117661 -59511 -163222 151858 283932 -184133
18520 -72875 107852 -35916 48017 36554 -45747 2154 123796 122072 114860 -278852 -246072 -102580
18507 -60770 -167370 -93586 -215615 -50424 -122940 -111468 -69508 -43515 122278 6826 -330305
18495 -278499 -173248 -179575 -287688 -61859 54627 -121818 -261239 50826 22940 -387617 486952
18483 -78885 -332230 120427 177045 -289069 -75944 106667 101025 -146687 -247474 -162281 -112679
18472 -112679 -236584 -222314 -232703 374986 -59971 22392 57567 -159994 -9250 -75987 -22134
18460 -104866 90069 -65724 -284142 17150 106798 -138921 108883 39129 -62926 -154588 1860
18448 -154061 241049 -132823 228669 196594 -177512 -60142 -2361 155896 -291161 -16335
18437 -293981 -55448 34 116744 178271 109026 -263556 -275246 23712 -293371 43506 64254
18426 64254 -114203 -213137 169141 278980 -72155 -192947 -55539 277690 -67636 -138789 -409268
18415 -409268 -53385 -49827 -275570 -20332 -100997 184938 12751 -320932 -88640 -121144 -291433
18404 -291433 203093 123392 -52003 96353 -299001 134092 -13965 -227275 -90080 152631
18393 -82768 -141578 -113085 120301 -178321 259173 43948 -20019 40091 92400 -79529 -19240
18381 -97960 -200423 404607 -105112 -47264 138859 44698 408924 211949 -107649 -351202
18371 -351202 204735 73997 -365259 -199912 260371 210979 -410560 112170 -137038 40266
18360 -7252 123410 -44991 -6683 -33419 38656 61915 194014 -12512 18549 183559 149027
18349 149027 -274032 61229 -7171 -249357 -12458 27613 93697 258369 -238905 -223374 25185
18337 -230415 99700 -189674 -42866 -52718 -30405 258887 -21155 -95658 151161 133857 26681
18325 247357 -177877 -244776 -143195 75733 74975 -247835 35116 -343461 47717 -178838 -99075
18314 -99075 -325343 78000 -198697 22009 440316 176615 -198808 -137483 191028 104682
18304 104682 176358 -59876 304747 -41567 65463 61402 7628 7257 87641 193814 89777 -246760
18291 -63457 -32632 -141846 -123286 38175 -43169 -133317 -278389 100525 170692 -121751 -111572
18280 -111572 87232 243909 100704 231213 -7113 -133339 -325053 89210 -15929 -14297 38504
18268 -133681 40512 206870 -176493 76305 -65623 18265 -238474 235705 -21699 34706 66695
18257 66695 -85091 23233 227886 37648 -3373 -112051 -27748 48748 -176055 -233424 -54994
18245 -84910 121881 55255 -158862 -376312 204024 217019 81540 47641 -88230 -114826 139464
18233 258974 -3254 55912 -17864 -221457 155128 39141 -121703 -196344 -321611 173660 103543
18222 103543 103271 90227 -229688 -176089 -184189 -279751 -273898 483695 -401455 21102 -17295 -16667
18210 -16667 1834 -80000 -195837 -316374 9946 -249990 124055 -169205 35147 -261103 -291519
18199 -291519 -51239 -163416 40368 -155111 62858 -46393 -153268 -71136 14059 -250756 -309344
18188 -309344 37966 -347569 98426 -161190 -6103 -246341 343484 63957 32335 -93961 96202
18176 245342 -176763 80955 164932 -8945 41974 -168211 416283 -96508 -23294 96775 258537
18165 258537 252562 -78000 41862 77348 -45602 -14651 342990 -84335 342348 -79095 -249726
18154 -249726 -130132 -91671 398257 -1866 -204026 -66038 128157 120743 292638 -234682 -147066
18143 -147066 69607 -144052 -195881 -253905 76004 -150661 -231884 41650 -191555 -184500 15230
18131 198116 -47325 48946 155002 -63819 -65118 176120 386070 99609 -362209 32143 -110114
18119 -63992 1925 466482 100375 28570 126057 -211101 -205649 -32089 136279 27784 -38217
18107 -38703 -110504 -85060 81336 -202631 418085 -39297 -186373 -87062 176009 -202834 127594
18095 144435 240616 70084 151174 -129006 189998 195300 -139899 305839 -17627 432243 -74878
18083 -259487 101309 240377 -21639 -186744 114197 -50052 155356 174325 -10839 -75918
18073 -75918 -102494 117173 -123409 92240 74102 -118955 -109553 -103147 -259245 -27066 108504
18061 -81482 68760 101086 409609 411246 -185085 -253270 -19209 -130436 107573 -300331 -209036
18050 -209036 -91416 -360233 184175 96646 64976 -149830 -36104 -188727 -76290 -72850 -118704
18039 -118704 -45762 -289170 23724 151925 225039 -32209 -296635 -87324 -180210 -45200 220156
18027 155835 408974 -112747 -69027 10878 -49658 138407 165521 37593 -29357 -147451 -177293
18016 -177293 -116449 317207 -115657 23014 122774 -118680 22956 6860 -311662 135878 3442
18004 156599 -24655 -124283 28226 -1273 1489 -238919 29918 -344128 253299 57432 -5956
17992 417385 25978 14565 82911 -189338 188815 26988 113573 -78876 -160716 -181155 -172953
17981 -172953 -45687 246029 -40178 -7475 -197960 -34841 -78729 -27178 -120418 57406 292261
17970 292261 -487335 -220429 23235 -111765 103626 176550 29246 -35005 -390965 -211734
17960 -211734 -29577 -92361 -101430 179876 -10195 138859 -157694 257320 10416 403617 -335610
17948 -115416 157830 -215811 -96984 14664 -156857 -46967 -90061 120498 -52611 121767
17937 199397 4380 270854 -30842 258295 -223704 -29741 -207393 161176 72415 6221 -7533
17925 -12099 84735 -56529 107729 -206296 -135156 -69874 -21638 -11290 180360 -6113 -90900
17914 -90900 -262804 -129817 -13138 -125311 -15836 163156 -14220 32060 62895 -261954 -65358
17902 -122489 -286335 -175590 142358 36583 -1424 -27399 136402 61019 305004 -50857 -24605
17890 -187531 359901 22626 -141985 -32007 -166045 -21305 -209313 83440 168208 -141501
17879 -67673 196357 -286877 90115 73567 127131 -52724 175825 174133 304316 46819 -131641
17867 116442 35562 -84683 -13388 51658 -91840 -182746 -125218 -139341 -198288 -87652 207758
17855 102405 -87857 2452 -43715 -97499 103383 -119162 112861 39552 155587 85872 146681
17844 146681 135841 -150801 263245 155637 33337 -56972 -57529 168281 11919 520681 -99208
17832 -100960 -1790 181581 -462918 188167 -18067 7264 293934 121133 113339 -56322 -66362
17821 -66362 148009 40462 -263488 -9779 -216643 -287027 -125008 14971 67077 16312 -20432
17809 416932 -114054 -69648 154716 -57692 230990 155118 -19344 187965 -278280 -82153
17798 -16741 139755 -52294 182145 -40144 -263415 56676 80003 214297 -52363 -25027 13055
17786 -12212 260262 13935 -189289 36244 -242323 -65212 97370 379673 255295 -115607
17775 221103 -20182 129969 238609 118746 186955 -2274 146516 364749 -27867 458347
17764 47017 191142 -94798 239305 124673 115285 205997 -56751 -209592 55100 -206910 263398
17752 276773 270352 91391 74395 -131506 109713 448244 6141 -251562 271046 91388 146496
17741 146496 182288 193849 403540 240436 58104 283208 32493 -256366 88848 -8372 -163514
17730 -163514 -95280 68041 -233551 181262 366645 248746 214831 -28956 156061 152988 63753
17718 -64741 -44306 151629 -148235 71855 -179117 63877 248865 131390 150505 388850
17708 388850 -235518 256955 51241 -246352 16389 31906 -78967 86121 -131683 -325437
17698 -325437 -116479 -222034 163036 -25626 -37061 241016 -20814 68659 -23730 128087
17687 105512 -89819 -102751 62602 163418 -240356 105854 47974 168399 -283613 232811
17676 367885 267881 110911 31758 343183 150046 134447 225778 201549 35768 -83641 262936
17664 18996 1774 91659 165570 29115 41344 -44729 117398 -96479 -47662 224107 205852
17653 205852 53317 139645 -250993 187582 242976 162667 -160592 61251 276685 39277 70396
17642 70396 217632 -48496 93210 361410 320836 -33519 124729 -141774 -4146 74532 -212597
17630 -200917 -143890 76795 296598 73758 145956 -844 90883 -47385 99125 16687 368469
17619 368469 -12586 -143996 117931 18095 134926 -25176 271986 43330 62728 -222268
17608 -84878 409964 -76547 78992 204552 81694 194905 208379 80543 377242 162524 207681
17597 207681 162176 114382 95541 217010 80195 -165888 89140 174384 285302 313942 142975
17585 150613 107835 434987 -39034 -216443 155324 -165608 -18489 114275 -135300 21978
17574 109667 25027 217661 423121 -19348 218203 111398 71680 16311 -28335 139712
17563 -259240 103485 244462 157219 -159085 157945 -55236 5248 188167 308028 -108597
17552 188306 99882 -135944 158378 31608 396089 313626 292547 44005 174891 270438 322303
17541 322303 -64465 -80534 -55842 -167644 394040 289040 270005 35977 166703 273216
17531 273216 249118 361391 655610 3053 392692 858454 755824 1075443 1161059 783022
17521 783022 1060089 653015 320859 228162 298324 325002 199588 292508 598092 684885
17511 684885 599493 724749 980818 960054 805258 888209 618201 319417 471088 579540
17501 579540 549327 493465 443030 252732 178964 293063 403493 123477 396268 48848
17490 218326 306818 512444 382667 117700 470263 432415 268483 37279 352489 91820
17479 93077 407375 144292 404037 330291 188497 503874 613106 228700 372787 22192
17468 303120 235688 -5545 210861 293527 435012 247704 161422 390231 171941 281550
17458 281550 380778 -40987 343699 232977 176759 51310 461940 133657 404271 137280
17447 486433 437087 263564 475175 334562 431475 437266 192618 328172 598892 528103
17437 528103 136780 562766 417668 344497 494505 404992 508385 507630 347983 515307
17427 515307 402747 217437 162870 69226 433278 162486 140135 148362 595987 454993
17417 454993 516737 183251 239878 781602 509976 227541 343931 667643 286823 502611
17407 502611 -102364 358835 503345 488153 531679 147567 431294 284426 400387 20087
17396 182092 57026 407488 328271 240689 150874 146521 352938 192781 -94063 253004 230338
17385 230338 141646 423711 489474 330988 470638 508425 303065 83054 455829 368927
17375 368927 124500 287586 211209 616092 266125 549744 526201 293914 754206 101637
17364 237587 257740 235546 518426 104328 59172 330829 173152 483275 153002 315745
17354 315745 298656 -133731 -159361 157749 -112801 85965 108588 190168 -117216 75389 146115
17343 146115 228080 -45943 373909 146732 253556 235759 -158959 319834 -26732 434482
17332 476050 374736 367990 248146 323178 417250 -77889 312020 177052 176625 247188 491797
17321 491797 136524 19518 -161549 143466 419104 -44473 265731 244596 98794 373263
17311 373263 350115 388543 38315 106347 412327 177930 336870 344160 398051 483639 445516
17300 445516 305198 385424 91851 487685 386809 -60078 233081 346720 205457 197924
17290 197924 414451 324252 219564 125366 232344 127173 251026 211380 121739 272766
17280 272766 495291 427982 132160 399913 493647 444683 442959 109319 431326 366507 470264
17269 470264 369403 300890 156576 373714 563379 134473 388915 356523 -104024 84871
17258 233064 390503 264354 130567 21353 577436 564767 372400 429063 76680 249800
17248 249800 407636 328965 175374 360897 152066 456872 519113 67723 326922 372787
17238 372787 174645 490261 615510 454884 149798 184311 476787 492323 407373 346710
17228 346710 104683 288304 95372 200694 334105 630064 160269 329096 347878 532415
17218 532415 220169 304832 293983 153777 281850 517206 265969 560036 614481 214879
17207 345536 231359 397095 399861 246546 307162 219648 467711 369867 459228 317941 345574
17196 345574 538671 296080 570852 393183 724518 307603 284726 376420 170011 125128
17186 125128 514728 731836 231831 415896 687416 411021 573350 204184 385415 471627
17176 471627 686073 562211 385158 454840 476745 233166 300120 338204 268119 532839
17166 532839 402925 554499 394360 652173 391519 634679 525222 516362 396411 764267
17156 764267 565876 601353 525232 464183 530173 548059 389733 533778 282060 570129
17146 570129 519260 368219 371942 473201 639911 409749 417759 334483 568630 95047 466692
17135 466692 508892 518306 398272 908658 509157 508285 887006 784741 503797 550729 810301
17124 810301 658968 794465 348798 390588 -9061 750174 348382 628578 679936 627838
17114 627838 341082 620946 861417 661818 582135 678466 387908 586575 642692 258498
17103 597471 695174 603130 622722 429766 996363 972170 596187 370738 462763 688671
17093 688671 814006 761221 727058 557404 770634 702417 620402 779568 684832 603237 703979
17082 703979 902049 674237 736019 668583 674281 517698 1023022 1234662 783858 714225
17072 714225 779195 720779 524326 682367 945389 1069299 988380 522018 862541 759063
17062 759063 952499 1108668 1089352 1204777 612548 740058 800006 851964 797909 767255
17052 767255 910859 862649 755397 1216812 1128511 866516 817530 1345987 722294 1082811
17042 1082811 867821 568786 1003980 932683 913792 980749 1003602 776734 820270 1158387
17032 1158387 851542 913234 1230556 1160772 1080636 875726 1282439 1073215 1162708 816895
17022 816895 930772 1311505 772807 1302099 1030768 1134127 957626 1328741 1332345 1077382
17012 1077382 1199695 1103482 1229093 1103647 1083154 1103385 884465 859053 1404279 1069624
17002 1069624 1133294 1114185 1087397 1235283 1285673 1249121 1376455 1247090 1338856 1281945 1350233
16991 1350233 1195796 862293 1300459 1299781 1139624 1600353 1075884 1276278 1555254 1286344
16981 1286344 1148998 1228967 1080342 1360985 1460920 1360219 1496138 1333925 1446914 1109007
16971 1109007 1518166 1469078 1482204 1325175 1398626 1308333 1707349 1384532 1630995 1629677
16961 1629677 1638487 1542151 1733957 1779198 1671355 1701338 2030884 1641359 1723642 1802009 1601288
16950 1601288 1742422 1864412 1782022 1713842 1725676 1532320 1731120 1847416 1783242 2166246
16940 2166246 2150131 1826228 1677060 1985608 1823877 1867249 2141866 1849293 1941536 2197701
16930 2197701 1893527 2005228 2225843 2032942 2094878 2483568 2285926 2315398 2109852 2430040
16920 2430040 2116437 2293912 2320920 2212707 2623475 2079646 2504964 2415943 2374138 2476420
16910 2476420 2591706 2350023 2516648 2538778 2613074 2872755 2848496 2310556 2624843 2727010
16900 2727010 2738874 2978300 2624341 2856499 2872444 2759309 2683430 2989813 2984401 3157350
16890 3157350 3232413 2789599 3216873 3457637 3405123 3060018 3487047 3271548 3494083 3524242
16880 3524242 3262185 3597586 3466383 3457007 3873973 3719314 3827489 3975365 4089536 3815954
16870 3815954 3898920 3880041 4034925 4315526 4222510 4395501 4414756 4220694 4147342 4275426
16860 4275426 4431187 4491005 4705831 4669599 4747690 4842915 4657249 4875188 5026892 5133719
16850 5133719 5057214 5254826 5067555 5194322 5245860 5787972 5993993 5697596 5759953 6231847
16840 6231847 5755733 6043164 6163061 6582338 6397950 6588665 6596863 6719742 6901543 6983899
16830 6983899 7326311 7458592 7212130 7457982 7229587 7437600 7504392 7912402 8266053 8426000
16820 8426000 8263396 8728674 8687642 9181751 9248993 8820610 9371191 9624691 9864234 9847285
16810 9847285 10054458 10535340 10672877 10482310 11143157 10797854 11230614 12033013 12323940
16801 12323940 12109916 12535504 12830629 13114023 13280550 13771996 13881059 14461293 14504901
16792 14504901 14883044 15241450 15755922 16325701 16512952 16562327 17035860 17762409 18315593
16783 18315593 18794675 19477461 19639954 19987165 20755596 21148993 21776261 22749805 23233218
16774 23233218 23683886 24437943 25159470 25840902 27020538 27610437 28284458 29414940 30188745
16765 30188745 31316725 32496537 33336572 33992031 35424698 36564838 37520601 39209598
16757 39209598 40341568 41713196 43301550 45066398 46102393 47982209 49482696 51693641
16749 51693641 53402633 55303322 57209241 59532117 61523034 63766311 66212438 68188135
16741 68188135 71010737 73332446 76286122 78672355 81034499 83961447 86669853 89609472
16733 89609472 92140976 94778971 97633954 99831536 102438391 104438321 107078115 108946969
16725 108946969 110619717 112473468 114051485 115347247 115940794 116571939 117266751 116770810
16717 116770810 116403668 116280933 115372371 113995398 112836268 110947532 109050880 107030869
16709 107030869 104892403 102212437 100133304 97155899 94714694 92061812 89493077 86574184
16701 86574184 83589159 81097432 78088177 75550542 72890873 70088456 67630003 65633554
16693 65633554 63059604 60735001 58680255 56458677 54285708 52531341 50406170 48476652
16685 48476652 46854948 45381213 43967787 42108201 41054463 39011647 38058703 36433450
16677 36433450 35439581 34459621 32786170 31798361 31297238 30145300 29009465 28267256 27525701
16668 27525701 26297461 25779893 25262569 24449818 23453136 22829536 22193070 21506944 20677455
16659 20677455 20240567 19535301 19380183 18824326 18452414 17645728 16939269 16552585 16256400
16650 16256400 15734959 15750523 15023469 14839363 14402876 13966490 13609702 13440690 13009302
16641 13009302 12627986 12523232 12498123 11600005 11687977 11412090 11163199 11152848 10709168 10427878
16631 10427878 10088168 9877610 9435559 9298367 9251557 9181996 9044311 8721660 8682773 8139338
16621 8139338 8464086 8002293 8066750 7926230 7756630 7392478 7925436 7103220 7277859 6912167
16611 6912167 7026661 7004485 6841260 6710803 6337796 6196074 6192133 6159731 6184234 5964009
16601 5964009 5807986 5899444 5567774 5757990 5271291 5246438 5482866 4929283 5028040 5191022
16591 5191022 5046247 4841301 4926468 4798906 4635029 4511454 4586302 4333651 4545508 4230205
16581 4230205 4515054 4161765 4204074 3989270 3831512 3870745 3744808 3976947 3917135 3953876
16571 3953876 3752425 3504988 3901732 3310767 3852287 3682002 3270993 3611306 3385286
16562 3385286 3305893 3274911 3358192 3126407 3397371 3311503 3285461 2753962 3147713 2935708
16552 2935708 3086967 2620572 3045303 2763886 2836104 2481552 2827557 2880611 2594414 2755465
16542 2755465 2544952 2745363 2541962 2736432 2844137 2476289 2457750 2304415 2569408 2214183
16532 2214183 2066739 2537599 2085930 2347677 2061721 1889287 2021870 2002884 2047494 2192617
16522 2192617 2011028 2067158 1862899 2352199 1838521 1918891 1858761 1876390 1768460 2068328
16512 2068328 1594445 2092462 1878613 1973453 1763790 1693345 1682942 1488213 1484448 1545056
16502 1545056 1793259 1429520 1442006 1657432 1342530 1487591 1712109 1655211 1405359 1735761
16492 1735761 1715311 1712670 1612419 1486213 1328339 1593157 1436010 1494361 1512170 1427504
16482 1427504 1459832 1233142 1164024 1232211 1472966 1416654 1401440 1310845 1220873 1287027 1310449
16471 1310449 1180064 1585640 1281839 1281123 1511867 1716761 1113810 1206718 1223540 1401758
16461 1401758 1211343 1355026 1122193 1107200 1245938 1231253 1010796 1117479 1091093 1041837
16451 1041837 1128010 1124437 1200637 1164910 1215341 1332665 943380 1281746 1202659 1127828 1153701
16440 1153701 1008323 1075326 1270218 1008089 777900 1019997 1135808 1008421 885843 903537
16430 903537 775462 656149 1221767 1135352 686804 1165586 1030447 1128518 714379 1046019
16420 1046019 999710 658337 1107221 998212 796748 870759 880642 1088349 812874 737412
16410 737412 803180 895528 730313 778509 1003229 731142 392922 731236 928810 790663
16400 790663 703797 618903 938330 783378 945761 729066 791924 946116 527495 792824
16390 792824 496867 976936 539009 678203 902409 846066 619304 677714 748511 970718
16380 970718 631919 613980 802915 585088 540366 581706 588455 705359 638997 438180 742108
16369 742108 866836 694233 766238 325499 723874 1092881 962809 615356 615198 366308
16359 366308 565075 816475 696183 940848 241751 429397 421668 574380 465427 464857
16349 464857 461177 563114 677448 698763 663564 373267 474703 670068 634738 533215
16339 533215 449785 654824 287164 447558 492466 480943 82432 338196 597194 383135
16329 383135 281499 524155 473108 295197 587009 458192 358941 95643 450642 16554
16318 160207 696533 421120 481802 512322 312214 193163 567675 -18271 404827 631666
16308 631666 354764 403799 470511 333440 578691 444803 436426 392980 484629 420293 259047
16297 259047 469626 131382 388820 557251 583097 943285 432537 367047 198802 362617
16287 362617 502390 318611 454836 -36982 409648 262627 448986 352710 302591 529850
16277 529850 211793 221411 225377 224797 252747 322772 220867 75177 459047 133719 401700
16266 401700 223647 481653 534637 324573 359634 166683 306952 252273 532429 488849
16256 488849 329239 285724 155185 233244 528889 644164 23938 163721 448539 105406
16245 602972 203680 418810 111919 385854 72392 475261 478123 413963 275238 365855
16235 365855 317074 410911 342907 224466 103095 202537 73703 142049 470299 58946 329395
16224 329395 213342 348342 176029 172370 -82018 213680 136743 218372 465246 461271 308587
16213 308587 359888 318367 149455 231081 260130 198959 -20793 248807 169366 248091 221769
16202 221769 348963 442274 138805 -178377 52698 102971 10243 231604 397760 332102
16192 332102 119297 161058 510072 296189 241598 -114151 456032 9649 266763 71066
16181 395803 96459 358296 105320 108967 39237 177576 14871 647108 310709 372097 381245
16170 381245 -240720 164306 142508 -36942 250734 -122266 -124371 519308 116728 76284
16160 76284 269182 188511 -35399 460874 75358 125351 272740 110414 300944 197043
16150 197043 -124476 129263 -110978 129252 144388 12345 328629 403762 127899 -48269
16139 334290 442286 -37540 366733 3716 -92567 126034 239932 86733 -96099 222539 351527
16128 351527 142248 -42072 106957 117890 74530 366578 51979 170412 397222 372050
16118 372050 635131 -155211 88358 8460 -104305 74279 -179676 -210563 -3707 -115842 28652
16106 -184775 238976 99950 470465 -218668 -270242 -174314 -101098 249832 46551 332715
16096 332715 102180 448790 36793 488716 10428 -93687 67722 -105840 121621 141444
16086 141444 164031 -35767 199214 39873 -10844 124335 -123353 138667 -146894 98336
16075 -17280 65192 -1080 203962 -18166 131140 216119 230804 182347 227471 -29461 -80239
16064 -80239 -39212 -38692 -124311 278953 96177 -25937 -179882 -44256 44723 84737 -31089 30092
16051 23732 312356 111651 420009 -288295 224788 96494 414310 124345 176065 153273
16041 153273 10841 239930 -48301 -29213 37533 -53596 210405 206390 148073 -229267 -63039
16029 -226347 -203579 -39203 49712 190342 42479 -401825 77197 -165300 191519 116482 -5282
16017 41784 -138769 -23070 -168745 83205 -14728 100275 -252790 157432 -271924 -231704
16007 -231704 -246331 272604 55886 -201170 -22149 1849 6158 112696 -109505 -384644 81863
15995 58971 177059 -197019 114022 205827 68439 -251394 239281 431643 762702 812480
15985 812480 916320 1317249 988359 1150151 890575 441664 514022 17 86708 -35128 115570
15973 201481 -143515 171507 223296 49877 88910 131888 -218648 306551 333562 196728
15963 196728 352736 256753 128407 -133286 -334208 -70905 36148 319271 -346594 73537
15952 299827 355125 -257970 -243038 -107730 25194 1152 137754 -95262 37309 -102294 157926
15940 143443 -176101 67495 -12708 -150729 18377 -270865 -170395 -60200 65411 78439 41165
15929 41165 -20532 -153446 -246019 11643 -149825 46865 -44852 -6830 171393 87881 115661
15918 115661 -36848 -358049 -217778 285083 261179 278522 37750 74785 44824 -259508 -47807
15906 -241189 -76601 264248 -114336 2542 256105 -119651 -208919 208072 13525 43597 -85694
15894 58710 45011 -48735 -266931 -41237 71654 44016 117020 23807 335696 3229 -74492
15882 -27606 161624 -156936 -12277 228846 -203037 -248427 -28921 151941 79667 -57290 78667
15870 -303853 67644 473237 -4201 235528 -16205 -278017 -11408 55847 -244320 -142213 412114
15858 50787 118298 -206928 8945 74485 195478 -162031 -118359 198700 -103186 -6474 -91192
15847 -91192 -137572 -4795 162999 -105062 -188059 -12806 -771 -78273 -232362 64972 -180592
15835 123421 -20441 -139386 -339955 122827 116858 14377 -24294 -113402 76875 -433624 -55270
15823 -15580 943 -188300 114257 -252200 -86681 -68483 80771 -332757 34816 -142667 163013
15811 -100137 -241815 40682 -99506 52954 109669 195176 -10105 -182497 -173440 -18520 -11214
15800 -11214 -3643 -159917 260462 -175988 111406 -341157 -323993 -154545 -10067 -126068
15790 -126068 187925 -243272 -101234 137330 22317 89205 73341 -99040 -37460 -113855 32315
15778 -454762 -138237 -157465 53976 -233712 208016 225316 1548 73513 -431873 131211 67048
15767 67048 -82635 -102005 -254465 -237110 411703 44093 -129142 264154 17756 90409 -140584
15755 -5658 436559 226582 190987 261318 295662 136058 -12740 123756 141382 154668 308494
15744 308494 32331 35143 -82634 -337892 262227 -109354 209062 28202 -136961 -71137 -170575
15733 -170575 -207562 -16751 -80315 188189 29223 86379 -218165 32254 11910 -146995 160126
15721 195352 -186038 41275 297506 249591 -108554 -97821 296064 82193 -58653 -78682 -503231
15710 -503231 131840 -82392 88729 119259 -371051 -130060 -226467 268664 149041 130350
15700 130350 -15864 40975 -23474 -25045 60367 106652 -87529 -108351 -5336 133805 151010 38153
15687 275474 18534 -39427 -5296 8975 170077 37221 -408004 -247821 100555 -289071 -190731
15676 -190731 -57235 -153187 82892 -117469 157619 172433 144301 115137 199076 229565 -214394
15664 -180618 -236137 -203543 73650 -82233 279031 -17343 135181 3896 151019 -187363 174096
15652 -303908 143290 -52317 -536465 -84394 -54189 162837 5199 -27327 -59503 -137256 -185072
15641 -185072 -81630 90320 -19663 19068 94395 -205071 -23315 -151879 22658 32366 61720
15630 61720 96303 -75967 61593 199967 21565 8843 290857 -312325 -40761 -189172 1129
15618 364146 -86713 280919 -297038 13379 98245 -71669 135004 -215277 -127165 192754
15607 -53807 156053 33202 150508 -142540 34840 181994 -7773 -141653 -22481 35057 -28627
15595 117765 -173574 35797 -88180 -231539 130029 -163141 123805 168518 101606 569 108570
15584 108570 -99314 -57656 -168321 308884 -521603 11838 89645 87040 -79973 -105511 -87153
15573 -87153 364939 271778 66877 -27833 -259226 -399427 -57788 -207700 133613 2987 -144457
15561 106181 8525 -725 -4407 -34055 -145805 -148369 62440 240631 -404595 182550 121463 -112628
15548 42859 -57909 -188067 233166 107044 178904 -43348 400012 433864 -163822 71677 -216297
15536 123239 -22911 129367 -93116 -7192 50586 395651 200815 -19895 272270 165809 17204
15524 242322 -202757 -213867 -125342 220760 -57790 327310 164998 383360 201456 234010
15514 234010 -148442 96839 245129 -437849 -116886 325401 -29462 151591 335956 117859
15503 -39359 298791 66645 254084 -67515 214754 168331 306159 277371 6512 280591 367167
15492 367167 122234 123919 135102 196083 -885 1227 -91736 119210 188697 -326365 -166872
15481 -166872 -121616 151182 34678 -384352 -159779 271910 104207 649778 117790 626735
15471 626735 725676 179402 -53018 244587 48337 297343 203111 -11676 431186 -58215 -341538
15460 -341538 -138651 204426 -120607 443050 -186034 -37452 -116916 -131396 150232 62656
15449 227826 -68444 121567 271340 190109 138909 138890 359813 785392 614486 1020492 1238470
15438 1238470 731118 672074 480884 363824 -179492 -12375 121303 166247 127595 23463
15427 116124 -183364 -102576 -193712 11127 -169177 -158061 152535 300812 -40266 -97852 120918
15415 -68737 24090 -312253 303132 128418 -26050 -2948 111082 -6023 -180314 82586 87163
15404 87163 165006 23827 -133643 170537 162453 -78940 -244185 5601 320767 -90184 13177
15392 -89720 -103268 -39884 301233 46692 -34853 160034 246662 -91963 11952 -89122 -245909
15381 -245909 -33510 163620 -134624 -186984 69085 -120577 203309 181437 419550 265241
15371 265241 191579 82367 284929 160332 -29005 7551 203168 64310 468303 430914 270103
15360 270103 302028 375451 432972 290643 45431 341649 285595 -194162 157476 79732 284831
15349 284831 188171 165045 294204 184290 16117 -43280 236988 151184 83048 211656 369052
15338 369052 495903 145341 234903 573537 215264 92977 -232034 417802 125820 182217
15328 182217 70480 255478 471065 94917 188240 212772 114236 63289 22274 -154062 383377
15316 52854 234615 53435 199342 -32796 -143222 46381 399090 436524 97737 42799 38795
15305 38795 256031 39814 196750 90174 -64685 34608 70126 37102 1700 -136975 -168637
15294 -168637 -162753 266021 -154512 197088 -154298 232115 99074 241116 -69309 281377
15283 -173442 3184 252899 115058 -278720 -197978 6291 350760 -47072 -115943 -106600 32818
15271 45910 266106 208478 321967 187613 -87794 -17229 -86017 -62354 -204973 128550 -168036
15259 110524 54472 19499 79991 -80057 -326245 75684 -76902 -138515 110123 339545 -24742
15247 192813 44675 553518 279307 530549 884865 1410066 1469482 1619066 1263279 973182
15237 973182 280689 102035 24495 228496 43658 295019 176560 283274 201460 -166279
15226 -110364 135882 -33001 228945 233977 -245211 -188900 30427 -357164 -7819 245186 129941
15215 129941 96461 60847 253620 -64485 28524 63259 -195515 -15059 213165 -71181 55887
15203 -65288 159511 19008 67400 37393 -88087 76285 55180 112611 68568 -50727 143898
15191 -121299 143151 160016 177298 168540 109668 59702 172691 -701 -30439 217939 121429
15180 121429 146731 -66960 -23635 211672 175757 9893 -297284 -210312 480297 662 248285
15169 248285 212924 -103958 395436 8999 -76580 8941 35802 141615 21431 137939 93883
15158 93883 32644 196075 361859 122051 234962 207121 -59215 315538 152083 -208384
15147 129851 -16618 -188611 -83747 -40953 -82543 83164 128230 82933 569203 277048 -82786
15135 310278 224611 -91978 251423 103215 -222595 327059 169157 -134145 336297 -5634
15124 -31435 113303 142694 80964 307522 285759 242788 390691 371388 299477 304913 250000
15113 250000 6256 171394 159257 275789 -93888 37653 -307012 186440 75424 158236 46347
15101 104214 -15420 -177295 65093 374503 96150 44587 151686 191094 145836 118613 130820
15090 130820 92912 -185077 69239 19764 8583 421364 -96205 208089 68025 465989 255577
15079 255577 174429 13173 -55263 -15031 74661 80054 -157006 14166 95494 616761 62768
15067 363186 205270 27127 122084 -65460 258646 256961 159601 170385 448326 142143 740744
15056 740744 332680 396959 161644 78156 141787 205088 188919 161062 538763 207081 87073
15044 71242 178683 208300 41545 481363 296812 90351 431013 241548 -151359 275326
15033 123717 223746 764365 798539 547223 631704 799789 572031 575861 469582 341113
15023 341113 467500 346320 161290 582850 272648 664919 444641 426438 436686 385489
15013 385489 73553 319822 568219 -87768 33464 412719 532960 172611 423803 147488
15002 323700 345146 220253 625848 599606 389684 303126 413684 487061 504603 251924
14991 388901 113398 418796 330788 463634 434950 412539 620444 355102 840455 395765
14980 551420 756149 722978 424973 545370 591110 387419 746788 582118 626986 721320
14970 721320 547574 725263 615742 313094 167960 252814 413940 417030 184250 193076
14960 193076 438366 350809 362110 63919 383535 755095 340752 396297 291113 338676
14950 338676 577230 294657 253994 419465 413903 253115 520523 618492 660832 481876
14940 481876 484592 357914 581600 425446 124999 508819 526809 684791 383479 814145
14930 814145 973212 1025925 1118690 1106281 1595247 1285950 1493094 1858286 1762146 1109186
14920 1109186 1524029 1592696 1657899 1744658 2282223 2257129 1634690 1278363 1312401 1277494
14910 1277494 931978 578884 710040 690082 540858 431067 596178 348958 422046 321774
14900 321774 712447 397365 172393 303561 69844 477926 671076 253752 53782 204606
14890 204606 443578 603110 616317 699015 297158 743419 589430 779125 847629 876627
14880 876627 903320 657833 1010655 867947 813055 667727 472778 861434 431020 337853
14870 337853 573313 223251 510952 354985 743218 651596 959978 1061794 653876 395158
14860 395158 508365 677000 557985 555977 87650 334301 366110 439892 397933 403633 415597
14849 415597 625379 419486 315148 591278 469528 1000289 1105300 1030446 1148936 1021369
14839 1021369 1030218 1077399 985087 685340 646143 562680 592041 158630 690859 319658 186521
14828 186521 163663 253441 462617 536851 606962 743444 534544 806850 759738 822376 1051838
14817 1051838 945619 807564 641721 874062 752300 771420 519318 562670 712896 678458
14807 678458 721490 828855 829339 1296744 976736 1066420 575061 584738 484617 643588 689575
14796 689575 395766 180542 275828 574984 443850 399808 464333 487078 535881 806890
14786 806890 730247 583794 382555 530817 757587 602022 476899 734876 556225 465097
14776 465097 671707 1037629 1182263 1133679 813631 863994 815126 802299 1024851 906352
14766 906352 467957 509251 762084 620093 756798 380462 711582 534041 556736 556855
14756 556855 883930 673740 589864 442521 692359 211397 169651 424030 866519 684528
14746 684528 661841 743860 774030 485199 522067 539832 716383 730800 894540 562348 579953
14735 579953 731218 847061 859101 913343 825105 1003026 1048572 1475494 1680634 1779277
14725 1779277 1802796 1540656 1393350 1544598 1125568 757633 1015481 1050962 1059571 917325
14715 917325 1129235 914623 879027 829219 738168 898222 967808 957632 1021528 903915 1103963
14704 1103963 1156898 1151952 1416573 1656047 1843173 1622470 1937897 1185603 1427986 891483
14694 891483 1276986 868519 984112 1119574 867192 569465 755290 794744 775072 1023024
14684 1023024 855824 949813 1127984 766637 1149666 1001525 823924 996698 720160 1333966
14674 1333966 1191816 668055 718733 1116980 847844 897389 1016935 962847 966980 1169857
14664 1169857 916060 683669 1237165 1123867 1412941 877101 598382 1131899 1242137
14655 1242137 1051774 1306195 1338938 1113559 1389440 1479036 1162175 1280138 1226613 1210032
14645 1210032 846361 980387 1188148 1182180 1224653 1072532 1428079 1297143 1191483 1137363
14635 1137363 1291797 1218788 1125595 885461 1400024 1041796 1378300 1585466 1379735 1221624
14625 1221624 1157254 1341961 1053439 1014621 1137261 1184792 1520446 1355774 941782 1054592
14615 1054592 1468888 1446400 1389911 1636883 1403074 1224247 1374074 1466548 1374050 1625577
14605 1625577 1218719 1403515 1702816 1246184 1672071 1472485 1494546 1688581 1334437 1572513
14595 1572513 1663002 1602409 1879538 1716651 1518158 1830822 1722483 1485439 1702538 1948498
14585 1948498 1754175 1630580 1978408 2214778 1730186 2013211 1582043 1821407 1836805 1923253
14575 1923253 1837813 2184613 2057866 2365504 2326830 2154239 2208328 2233585 2383934 2029317
14565 2029317 2253898 1859493 2383921 2313229 2547621 2700790 2728014 2559099 2968961 2910084
14555 2910084 2896588 3350738 3420894 4024655 4410703 4701328 6164145 9165954 15892792
14546 15892792 32178746 39683154 24889805 12916167 6552428 4425268 3619248 3752913
14538 3752913 5295206 3967722 3028094 2261949 2057094 2134052 1934830 2085324 2226104
14529 2226104 2126263 2211968 2016791 2164689 2452697 2024116 2277829 2346538 2268480 2352956
14519 2352956 2461805 2586960 2547224 2538181 2455466 2591201 2421494 2818390 2744561 2653801
14509 2653801 2770830 2647830 2818254 2912234 2805099 3155530 3027515 2946424 3129046 2971358
14499 2971358 3072240 3050629 2926352 3276947 3468858 3121666 3037745 3637756 3389604 3678372
14489 3678372 3334801 3495015 3516586 3502470 3843028 3797625 3492581 3649768 3918615 3605556
14479 3605556 3856759 3651724 3686933 3860727 4025168 3838952 4113535 3866829 4502758 3960271
14469 3960271 4203255 4159792 4377460 4145138 4358822 4583536 4529555 4235947 4472882 4434551
14459 4434551 4757182 4670433 4835808 4699158 4668712 5004204 4726748 5354426 5333289 5190586
14449 5190586 5188563 5366780 5531164 5499236 5379160 5401518 5734090 5397431 5640662 5843216
14439 5843216 6037264 5772776 5897420 6175269 6360355 6369742 6430136 6481933 6743383 6791213
14429 6791213 6952144 6439606 7018599 7080561 6869118 7230067 7254184 7586041 7985805 7873161
14419 7873161 7997849 8574273 8157690 8370114 8359404 8813216 8455138 8469736 8558538 8924012
14409 8924012 8859615 9289654 9362436 9432543 9662718 10056714 9753707 10204387 10173019 10280873
14399 10280873 10117486 10601336 10750036 10898549 10848411 11241472 11337983 11544330 11386612 11874736
14389 11874736 12127352 12022841 12526144 12654019 13135449 13005746 13505525 13534091 14094548
14380 14094548 14362868 14871027 14830252 14982269 15380475 15680661 15855949 16386185 16489572
14371 16489572 16584681 17300188 17566646 17619060 18273682 19024664 19171506 19132270 20011283 20204006
14361 20204006 20348360 21111571 21262483 21765783 22108330 22989719 23394455 23837018 24347749
14352 24347749 24925297 25667454 25830081 26899606 27418724 27921511 28579531 29694423 29986776
14343 29986776 30968755 31960017 32840656 33509042 34406145 35657466 36756174 37513383 38528329
14334 38528329 39537495 40758307 41919330 43233403 44703924 46064020 47283654 48758773
14326 48758773 50635641 51904072 53720044 55718350 57219480 59296782 61758788 63552743
14318 63552743 66052640 67966035 70737868 73669504 76139407 78741432 81805948 85317739
14310 85317739 88906729 92295419 96141545 100292091 104932938 108851602 114299743 119264210
14302 119264210 124558816 130339651 136654318 142846833 149853878 156796304 164546883 172556298
14294 172556298 181346429 190246046 200052922 210123332 221304744 232567534 244679722
14287 244679722 256954583 270007254 284053263 297846263 312920341 327987404 343058017
14280 343058017 357949883 373484482 388410384 402940763 416549888 429276452 440225539
14273 440225539 449047604 453924898 455674546 456066594 455566663 447775254 445008668 440995595
14265 440995595 433344824 423608293 412805909 401262653 388573561 375572272 361892977
14258 361892977 347546484 333602434 318718747 303874537 289175046 274874928 260824717
14251 260824717 246746452 233930788 222352951 211620052 200426648 190159673 180614329
14244 180614329 171825410 163482025 155244128 148083175 141003485 134358146 128571966 122841936
14236 122841936 117254493 111883146 106910169 102159679 98260678 94506891 90833070 86584812
14228 86584812 83486389 80259095 76685111 73869775 71282181 68298542 65963033 63652758
14220 63652758 61763004 59417423 57616669 55569985 53934792 51940370 50140527 49240778
14212 49240778 47876218 45782279 44384185 42954199 41709110 41323099 40193163 38886995
14204 38886995 37655405 36287199 35499721 34727315 34193277 33059853 32258876 31272692 30118137
14195 30118137 29552060 28900580 28058829 27546048 27003080 25940529 25632032 24887154 24437786
14186 24437786 23771490 23343934 22446813 21938563 21511872 21032685 20869837 20250609 19623811
14177 19623811 19110558 19053842 18657121 18176514 17659470 17276357 17255339 16837881 16620845 16165841
14167 16165841 15881850 15612118 15450649 15115186 14987645 14624040 14502769 13883198 13758080
14158 13758080 13400739 13469947 12914674 12902109 12722625 12466822 11904657 12066755 11691764 11688669
14148 11688669 11495073 11283512 11073495 10489992 10870320 10178191 10155282 10343050 9983856
14139 9983856 9669475 9607601 9602018 9561348 9398698 9200483 9105195 9265510 8892354 8641259
14129 8641259 8595751 8382567 8566651 8210237 8114340 8242910 7641496 7695350 7939978 8080822
14119 8080822 7759573 7518294 7338057 7203097 7039108 7108669 6769278 6838101 6872816 6738184
14109 6738184 6794852 6334424 6324216 6451027 6073910 6427313 6220716 6313030 5913848 5834272
14099 5834272 5804757 5581992 5743079 5625847 5490401 5797449 4989902 5366721 5272040 5275241
14089 5275241 5180261 4917921 5091230 5134255 5048311 5182326 5054441 4777212 4562791 4598312
14079 4598312 4575851 4498127 4719584 4411467 4367198 4570938 4330973 4385630 4268659 4062835
14069 4062835 4337448 3763623 4061975 4126489 4422051 4240659 4147154 3896641 4109844 4029855
14059 4029855 3837263 3909265 3994106 3728512 3853615 3702218 3590358 4121263 3460072 3722430
14049 3722430 3078991 3456720 3216173 3113399 3528796 3193688 3019600 3169733 2954074
14040 2954074 3348318 3228640 3253937 3243092 3298989 2939396 3155874 3072805 3144513 3178709
14030 3178709 3046975 3040328 2862927 2950709 2880167 2823457 2869335 2719062 2887866 2744781
14020 2744781 2884677 2637844 2713282 2415646 2538504 2539868 2346297 2376198 2476604 2509182
14010 2509182 2339887 2161365 2336425 2410711 2223070 2374627 2112076 2156896 2192316 1797644
14000 1797644 1944400 2233439 2071997 2447576 1742244 2057679 1964341 2037284 2287781 2082802
13990 2082802 2599823 3065574 4301159 9377930 23605718 41121712 29778025 17883804
13982 17883804 10627587 6860134 5430374 4673652 3974404 3647975 3276462 3191846 2897172
13973 2897172 2543199 2717592 2615161 2428891 2287493 2482987 2150748 2541586 2148298
13964 2148298 1992164 1970286 2156006 2215245 1976180 1887355 1785027 1987079 1996267 2049890
13954 2049890 1795411 1976304 1993198 1501589 1621812 1949355 1711191 1845517 1549386 1952037
13944 1952037 1835481 1700517 1786967 1692544 1683456 1450629 1383357 1842276 1884586 1841440 1640572
13933 1640572 1408044 1383916 1619757 1693514 1588141 1604171 1751408 1946394 1605072 1401521
13923 1401521 1553412 1403841 1547182 1545640 1593456 1364530 1595634 1646431 1606570 1380173
13913 1380173 1276491 1030046 1400612 1527187 1261946 1554519 1249238 1421828 1277279
13904 1277279 1700211 1489905 1267893 1525190 1341562 1445575 1364884 1231027 1508738 1293323
13894 1293323 1121548 1199053 1248340 1287646 1133691 840442 1177604 1236267 946037 1129007
13884 1129007 1155467 1281591 1170120 1344876 890745 1192999 1195627 972622 1191694 1549465
13874 1549465 1309151 1177451 1203243 1220958 1131795 1062643 1104744 939851 1037445 1196483
13864 1196483 846591 1120145 1078995 1060407 971156 1065509 964389 748431 948065 924208
13854 924208 1427263 1169461 812588 749469 935655 1161693 1022032 1091041 988619 996674
13844 996674 1105929 781557 836785 967393 1143949 986554 759102 1056878 914014 906320
13834 906320 829196 1087571 876520 1086574 723804 854956 718505 744795 528291 716980
13824 716980 735872 739826 735959 674326 916034 1011508 935376 1144201 1039908 606826 860686
13813 860686 619624 642285 883317 818891 838261 901341 841624 836096 746359 553733 1021059
13802 1021059 325680 643335 1082950 360306 976731 1071694 709440 569188 683525 787137
13792 787137 680710 752590 562766 960939 902525 452145 715096 794351 646161 697935
13782 697935 647460 799348 329536 909522 591557 569122 640995 950761 376978 821521
13772 821521 512600 855629 653361 531732 1141547 363445 811595 731245 637389 906772
13762 906772 944367 477563 344017 572688 410078 761519 775630 657292 799142 442094
13752 442094 866136 726810 879860 780876 556479 926250 299504 311440 643194 473524
13742 473524 578203 654785 731400 650508 536092 329125 602975 346788 506118 336081
13732 336081 446279 448433 706361 610020 359317 777506 711300 684919 221628 691572
13722 691572 679974 869883 710208 611378 849523 708546 447189 305613 541026 451958
13712 451958 604484 709254 604935 457092 563353 603794 398527 580809 387055 712615
13702 712615 589685 818430 535778 402090 543480 826320 206509 706775 681290 794854
13692 794854 219694 441289 605866 437339 422104 484494 388601 131488 421498 340445
13682 340445 286865 561445 213828 541433 625589 560753 319034 380894 648232 733070
13672 733070 167702 331926 494867 607314 582304 557083 261041 280690 527762 269483
13662 269483 268433 610425 527279 307605 340460 352112 124948 296862 278777 120327 439051
13651 439051 -147448 425637 269595 341585 28894 289380 390424 484639 252847 309656
13641 309656 595518 115803 674553 436009 380871 366981 324742 107400 639810 575685
13631 575685 285674 214244 495632 452116 460899 259722 288432 487541 623445 408722
13621 408722 61860 471609 323968 298052 496159 308113 441924 428779 446190 402656
13611 402656 365468 494488 16670 397469 570065 136242 507094 493999 208032 351509
13601 351509 376709 163457 476759 339291 300097 505797 58580 212140 110917 425745
13591 425745 285353 112903 429108 279183 396811 17224 186912 354748 432405 570818
13581 570818 -190376 173728 430217 399109 100608 208700 170490 88086 370490 580714
13571 580714 392930 303197 517885 138471 381061 356536 402576 102853 213654 503241
13561 503241 246175 279870 299215 68939 120957 490119 264361 8154 200476 182334 519904
13550 519904 130405 250527 380481 204967 184754 354590 263967 116908 417116 412631
13540 412631 372510 509135 172272 3020 262466 151819 320820 534842 766164 248183
13529 -36355 191893 220156 380737 317192 538684 -2999 250549 184826 481240 -158330 342584
13517 246995 539638 481066 482346 399443 290373 85217 -148621 124511 -77400 198681 415262
13506 415262 312451 369711 -189869 462428 86745 244706 570433 342746 443054 33566
13495 -4368 213862 106558 393756 361829 428032 47596 -35309 215104 193935 442475 115614
13483 512751 392211 408821 3764 378177 28965 232011 99608 109888 399774 33623 296909
13472 296909 228728 295041 251466 -77105 130706 70196 666932 63029 143604 126706 -66119
13460 205798 -119369 19212 342096 -8669 244029 100904 -54639 614971 106976 468502
13450 468502 170975 382466 262692 421735 2230 118832 79407 112484 356682 -18983
13439 -195298 180350 -58562 106899 187268 43487 180128 273702 160587 427952 96252
13428 118833 142798 5128 259867 259976 159344 253824 166381 421225 127590 227324 7012
13416 351903 299172 122404 -35713 -28428 204778 192892 371130 -24908 187606 339881 240290
13405 240290 178007 -36115 -199118 166882 213386 -371747 145455 162981 349769 165728
13394 370039 386061 258615 401128 107284 538336 266382 80689 161523 -179848 175135
13383 115794 299304 235575 478775 -61501 106383 457744 -81278 433030 65472 174909
13373 174909 240422 15513 144508 281537 46739 -10636 306394 174497 273660 353191 -92224
13361 185679 305399 369339 118073 413267 -29031 390760 -159840 112207 233697 33288
13350 64611 140601 272910 538854 439285 356689 247592 194510 115353 280992 278168 365787
13339 365787 256604 34943 24430 186396 959082 148915 201784 431668 -143990 91048
13328 -106035 45380 246992 110204 293367 -64527 96137 412683 336119 302992 -18291 199451
13316 424766 194906 126594 112575 287307 231847 70442 -74835 439266 254436 388493
13306 388493 183345 -79865 -33587 52464 43232 122196 28357 160581 181153 340339 22002
13294 86250 158678 97730 366542 45522 85064 159496 54801 -127706 86711 146855 54603
13282 -86852 -207942 -38362 332720 147212 321091 224887 -140252 154553 180306 257367
13272 257367 133168 33342 451790 -168222 -46662 7704 333784 239991 -189135 146052
13261 207588 80354 -111347 -87366 255892 -123093 -88618 -20530 202231 23859 -105887
13250 266131 -222826 341729 162551 198225 445749 -48888 373623 -100190 123831 97426
13240 97426 178651 160028 27398 419713 46843 274346 253321 139057 -32159 61803 115715
13229 115715 251053 71502 152623 68587 136145 6345 -107523 -32794 77070 -106974 105559
13217 167673 -100784 132767 255227 229496 154720 90626 -196883 258212 278956 103072
13206 -68407 3268 663 229269 30204 189904 373686 69517 6325 -123030 -24220 487997
13194 459232 94519 194821 179522 235416 306871 19530 41859 -406810 521699 -79766 -85004
13183 -85004 13902 302465 -18536 112540 546970 52415 38623 498698 -39135 -32994 -32514
13172 -32514 -134317 269650 -19257 37221 127948 149385 -39566 -20344 85532 40518 -168978
13160 101577 -81565 -128673 304058 267924 551798 97325 88533 48949 103956 -239338 136130
13148 4412 -26311 145760 -100166 -213488 -144927 171823 -265796 49778 168906 -173018
13137 60591 78622 419957 116494 83356 -153322 -61778 252915 457537 208097 110195
13127 110195 107832 150483 198734 270737 16036 216265 113747 202035 -102064 -68671 181542
13115 15724 91309 336823 -59815 167915 86144 184843 47050 41933 290381 239552 301626
13104 301626 -336707 105340 77701 32875 -23183 -70430 100392 -117269 294390 88012
13093 97378 26179 -45216 -49877 -175336 8908 149357 119087 47277 -150948 33144 -220413
13081 -14387 -139865 168358 -55577 -173869 101158 -36705 53014 -115793 162268 -79052
13070 -265634 -77673 157743 136786 162806 -78625 153991 31757 -191166 15708 -46893 102564
13058 216818 301915 109022 -67503 13469 273638 -84449 155670 268017 -179640 -62298
13047 -108529 361796 76954 -62962 267699 266991 -109909 -82991 143803 55703 125341 223349
13036 223349 -224382 -145359 18262 171044 32822 -115686 -24232 -71229 108268 203565 -40106
13024 -160254 -318642 52729 -66003 -186453 -123199 45268 225159 65609 -51124 -21208 -92612
13013 -92612 106618 290388 181386 58077 47588 302662 95486 338457 253277 98632 53762
13002 53762 -176727 245077 172775 409336 130236 118037 5749 71438 -172487 39539 268200
12991 268200 -85592 -35201 -40878 -335903 -128916 -8511 97075 83563 30260 302712 171476
12980 171476 176986 -72009 -32720 -74138 40412 -150144 -205037 -217548 -82346 -38914 174221
12968 41201 132327 295598 -30061 -43846 148561 96778 -35765 67202 182541 155615 68984
12956 221664 246737 -121573 14226 -231212 291053 221580 161394 -6949 -138877 -82200 133142
12944 -858 138012 -23947 -31342 56033 -4267 -277347 99728 101391 -97709 -173963 287820 71298
12931 38946 17831 396488 -9432 70810 -147127 31796 -329546 236318 -95646 -35636 29402
12919 114030 162188 -74444 150025 74574 66938 310572 -42831 -75106 -327460 -190375 207309
12907 27678 84386 -291182 115964 -2302 106937 11533 113059 142514 464575 -748 246833
12895 313625 -73914 156994 -126882 264413 8082 -88140 -274729 3987 -78768 -153224 173010
12883 321681 -45070 263116 292075 -167145 -112795 192320 154650 168427 -155648 95442 -17760
12871 373179 145899 -67453 122546 82392 -236136 -101444 37608 555 -298763 4249 85038
12860 85038 -247990 54932 115328 175703 167698 -305115 -187988 118112 124235 181211 47516
12848 37112 -5467 -147252 176885 -59154 -25094 -129115 -177379 -276962 202332 -7721 179072
12836 294319 189508 -53842 42235 -5938 148424 220890 -102050 358194 174312 38416 84553
12825 84553 129537 250361 89477 325449 201182 -78180 -25110 -300136 21008 314654 -119498
12813 -8546 122455 -108463 219833 -225189 -184620 -308747 94547 177851 -183110 -167144 -403620
12802 -403620 -44239 88691 -16867 -20637 -179360 22123 -276013 129444 -217632 -290695 -95235
12790 -10029 -83143 333352 -222733 -15141 198889 -192952 -13901 92678 158424 -83279 80111
12778 271671 -247495 -122814 -163578 240124 3315 -152811 -180139 181956 -8895 41102 21048
12767 21048 128792 -75551 -152253 24396 156025 83612 32794 -58913 -151450 -205092 1338
12755 33012 -67751 68736 -256307 -93940 -7333 65874 289221 -299828 -98780 -172359 -49012
12743 295358 -126215 -92869 -55420 -60963 51032 183642 114092 293140 -201544 63702 71845
12732 71845 86775 168778 44552 -36753 269552 9660 9828 -447533 133561 197187 -38279 85525
12719 99643 166167 148027 178546 173457 163373 73500 -151073 205976 121797 -79963 99360
12707 41029 304728 169221 -140289 38512 7918 -12019 242044 175573 -54610 -78980 155904
12695 48653 156347 62541 283752 14393 -113191 157570 -96784 250733 46341 131123 -46719
12683 -98638 -473571 76449 269038 -102964 24421 174740 133528 268071 195181 111783 195781
12672 195781 -3628 17276 205877 -92320 -148773 10218 180894 -6370 -141690 286994 257877
12661 257877 -368401 95816 357977 207823 -269051 320630 -150834 21683 -46508 236840
12650 92699 9404 360707 41318 52983 -62684 48641 -73854 185999 -180570 -22682 83672
12638 151686 255938 -387569 274666 200651 -212057 323930 131709 -64389 146263 -132592
12627 127979 281895 264959 76723 180802 460122 -43777 167584 3846 -378416 -57098 -58037
12616 -58037 139322 -142309 233768 93182 -227597 -179082 -28644 -119642 469034 167321
12605 273045 89827 -358510 159750 451982 168935 139817 19210 180 -89408 104301 380392
12594 380392 79988 8188 -38564 -59659 -20578 -140753 -102605 -29496 -131747 353130 197661
12583 197661 146130 -172305 204492 67099 -141218 -76927 -57164 -43196 19571 -126968 -44599
12571 -12140 21555 294639 -185408 145965 -80531 -14280 -44941 -205840 25231 -66249 -275361
12560 -275361 -360832 302872 554 122524 -237984 -86709 193495 7299 -32825 -27275 -41825
12549 -41825 313165 5873 -116689 175464 284359 -237960 13470 -58074 -141631 75480 -147370
12537 -72719 18723 -70859 -29364 -129663 322543 178713 -469095 182870 -99997 -34697 -327709
12526 -327709 -6195 -96048 127910 -130391 -22245 -67221 136782 -10405 186723 -113723 -94934
12515 -94934 -490701 155002 168012 68709 171189 24429 853 -242433 122124 -143756 80928
12503 239234 17366 38576 18380 217538 -101442 139060 98846 110890 239263 -351603
12492 208694 115190 194005 -89783 81171 -149940 -60517 53576 -23927 203196 -78516 241753
12480 53553 -254635 110869 -81418 -46239 58254 222298 234398 115504 -111624 -132311 111714
12468 171196 76665 -53916 -241761 -119541 -60384 -8881 -91122 -111832 -81394 -276097 187210
12456 270030 83027 211963 -11484 -23931 209362 -80538 -174241 61232 -120524 169969 -2727
12444 219239 244247 -178339 -71421 -363238 132126 28258 102943 187595 -122980 -7167 -328066
12433 -328066 106753 -122054 83141 145719 18540 -157076 -160938 17185 -215909 38951 117575
12422 117575 151521 -283857 -385471 -231256 28895 -3717 -237728 -29786 -170824 -83361 302898
12410 -138635 -293836 16089 -88811 63649 49164 143165 -127294 118651 249361 165532 -319424
12398 236631 -8214 34322 -221068 73114 160857 -81617 119502 -78135 -69796 157388 -103647
12386 -216674 276296 132787 555950 -114242 1525 22581 -244417 -25964 243279 -335719
12375 215618 74914 -90867 -35675 251656 193946 -223126 166964 133870 231408 91053 93176
12364 93176 -84112 -228834 -216741 47562 234270 -21568 -52246 -268526 106944 67362 -34421
12352 -214293 144189 106818 149973 91140 166002 190948 -96769 -52904 -146626 -197421 97056
12340 -4443 29786 -18294 33286 -45275 -79084 169218 131374 239365 201650 322338 375456
12329 375456 315125 99427 -234270 -89419 265738 88324 418361 -252099 363968 179003
12318 -7935 -157100 132159 251304 402781 234028 117056 110757 70867 43529 -6732 17176
12306 85208 -99257 136620 -136250 151786 -86407 -49744 -59147 -141066 2647 -89325 216603
12294 -287102 -56399 -207477 269962 -278430 205496 208480 37635 -88523 133917 165512 89584
12283 89584 88823 442827 82323 -105327 155261 74967 224557 35849 13119 294012 357944
12272 357944 213612 213698 99869 -109293 178296 85397 226511 171864 68792 149814 50223
12260 -144654 415935 175080 70957 319065 142581 154546 57053 352492 180281 108089
12250 108089 108916 199181 73928 -7718 -95037 59337 136203 321294 145650 -5213 1383 132195
12238 132195 137173 340449 306998 -108581 83475 -65888 412864 173816 140881 401002 43547
12226 499839 -32542 170505 -36055 181799 -131538 580056 249250 207920 34546 535785
12216 535785 210843 272860 153150 80936 696669 103313 366792 140971 314054 -84262
12205 -10113 114827 -216559 72319 191796 323062 202933 262691 443269 -33883 192492
12194 252378 153897 520416 492440 161974 251995 320353 220702 285159 2072 416755 47429
12182 -37597 -87437 273752 374134 338323 410494 90099 166800 123148 634140 -16497 210479
12170 534666 148544 -34152 57281 132202 44292 447059 124096 256625 639834 270134
12159 29066 -1881 89802 20701 -133863 -171577 656 34434 135689 103507 161403 88862 43797
12146 232932 219672 65501 -116793 169978 132901 194001 121613 139661 -90937 361029 181225
12135 181225 135013 -109104 17004 248040 102288 211869 -5379 293926 268808 138602
12125 138602 285312 84786 271659 114034 187581 -107204 -115066 74875 591653 20317 137748
12114 137748 414402 224981 264249 108588 62136 234375 -143190 81388 172872 38031
12103 119693 125360 -49231 31430 -17798 127280 185854 168951 168392 183478 -120335 -135 -77068
12091 -77068 -113592 -250843 -91990 192042 -220224 -49822 95081 18866 -237728 174916 281612
12080 281612 74764 194083 154778 34577 140400 102115 -75936 -75731 258913 125801 -184424
12068 198107 -26353 -90887 441621 146537 121931 -24277 -56609 15034 -158381 80748 253973
12057 253973 189674 67581 119308 133441 137280 663628 126653 -56587 114484 -310562 -81146
12045 156647 75367 -89671 1925 -173378 -106125 178768 -379163 -73179 46854 198839 -27221
12033 -205131 -33307 -138803 207723 160862 -127567 -202144 -117025 160115 22576 303368
12023 303368 3178 141772 -86740 110162 236134 12544 33946 136298 232103 23920 295657
12012 295657 22074 326132 24967 -178077 115217 135448 -179173 507888 58740 -15583
12001 184087 109972 73059 79412 376604 76407 329731 230837 -41137 40108 -123156 -33947
11989 119168 -307275 -4374 257177 -160920 72725 3624 -248159 -248414 8686 369025 15113
11977 -144249 -239888 33110 -32275 83738 -111225 -253837 -94910 -75471 39925 261070 267237
11966 267237 -33417 -62029 -327640 -91910 -79834 166800 68554 149489 -31767 -245733 -63942
11954 341101 -112207 85327 8978 -194530 37820 -308533 32391 -207026 -277853 -155105 -161026
11943 -161026 -35925 -39397 -24356 -223069 -141802 35767 17549 274661 -84105 -98740 -13994
11931 394862 -42908 -188637 -37756 -174498 -151286 -90026 48878 113051 118549 -251892 -118995
11919 -78755 -403845 -241014 255150 151146 -132397 374020 123083 217005 253756 -124768
11908 204593 -224165 -224671 271332 242658 163241 343011 -120834 76913 195861 -44268 -32733
11897 -32733 -47467 -431185 73086 53690 -23954 -171687 -17945 -49890 191814 16742 55129
11886 55129 10586 359454 177179 31469 141273 -84942 292477 -83558 -151991 87265 9347
11874 268191 -337122 -393208 -136505 86144 -98746 -49921 72102 -42003 -112620 -179903 -45156
11862 56063 -34168 -182749 -252739 -86565 68482 275993 94660 -96655 -94261 -191023 -71538
11850 -130574 251642 -156838 -65735 -16683 11931 101900 224487 -38443 -106177 -73971 -301278
11839 -301278 203102 -116304 -57907 -111959 -47971 -85154 -29226 -141464 144671 -170592
11828 -136580 -149058 -264559 -150074 175844 -77544 -293362 -4997 -103468 -405635 67831 -213603
11816 18338 172767 -165938 81796 -100483 -37927 124670 -522402 -271848 -267091 -228365 -156958
11805 -156958 -284260 287238 51537 -485219 16590 -204110 -48288 127247 3485 170628
11795 170628 -48817 -17035 66596 -206046 -53967 -57155 -221652 -152242 270102 106397 24387
11783 -172597 194119 -218506 61157 -9286 -154012 283827 -41967 63403 173272 173687 -169363
11771 52581 356561 31931 103122 -198721 15068 -381693 204838 -64598 101997 -74849 -15698
11759 51712 222463 71753 -88549 -212931 -25755 75885 193780 1154 -158688 113139 -12712
11747 -258202 117046 -272137 285023 -16941 -80144 -35962 -128736 -11537 125122 -288257
11736 226461 62004 -92383 253173 -174051 138378 -121369 -384165 182358 107484 215021
11726 215021 -109769 -251456 -214158 310955 364554 -134117 52545 -182776 -29310 15718
11715 -66896 11468 84899 95713 19818 -7428 -245413 325938 91515 278463 47835 -105912
11703 -175114 -133752 99350 -19882 -149674 -18418 -46308 -20055 -27233 276677 51777 429238
11692 429238 402722 239492 -234125 409886 -127456 18151 173623 143684 162905 211462
11682 211462 94341 -220309 223765 -153652 322997 -95281 -18256 -163459 276114 -123951
11671 -160007 -109998 -58686 -21072 -285950 -46040 149132 139913 45342 124988 1347 -137190
11659 91207 -90937 120499 45333 -235089 -60386 -78363 -151380 21817 -154847 -137065 -269477
11648 -269477 41587 76 -37370 -82778 -50783 -2465 -21163 -4934 -33158 124155 214839 -48577
11635 -152992 -178633 43373 -62204 283635 118111 -113978 115434 162103 -378091 44110
11624 121546 -208731 12485 79617 70074 164281 15508 -234552 238600 51276 -107791 107657
11612 332691 59651 172244 70694 -82657 122131 -109998 -89896 337250 206864 -245301
11601 362533 95901 33636 100102 62814 303332 -92237 241053 -150643 -66370 -73086 -241927
11590 -241927 299651 110075 -108836 281011 -98215 82561 79548 233519 -46992 -187287
11580 -187287 80109 -88865 -45270 -26152 114183 -222575 66322 178037 278157 104956
11569 -68215 -63729 293812 344827 -110675 -458443 -44931 176444 -158329 290604 -157256
11558 -215597 367826 149644 116408 32752 -224186 -174150 -94213 50126 62165 116900 -52258
11546 76601 163595 -264113 -131758 22801 37916 75603 -96379 -60241 6555 38156 36825 238107
11534 238107 49679 -114024 -22891 85430 239744 358691 -294405 163802 172149 -31785 61394
11522 79535 136136 149404 304046 -237870 342304 64316 -105094 122562 81202 133678 -165929
11510 138758 119800 457091 343875 -179503 415739 151754 -17252 174940 179160 113077
11500 113077 -21409 129023 -237731 279851 -76787 -48739 -163428 241212 -207861 -103000
11489 131382 -76903 -93105 -82950 51251 -15331 -33744 341490 -23832 303783 217813 -37155
11477 287927 114200 -49852 220807 35186 107036 -3429 14162 12987 131628 225089 24417
11465 25096 120217 38366 -86683 -58182 125805 263399 103862 129770 -77581 216745 -145275
11453 197028 120145 -79242 -14482 81610 210987 108437 -20584 4600 -5138 135148 67320
11441 214399 93796 70958 285150 374303 334824 110569 6758 185072 362358 -21974 290913
11429 -16139 -15545 -111946 318079 -54267 203485 -48623 -133524 -101285 -285116 -4799 -54066 -250267
11417 -250267 230519 51894 158680 151529 107345 -116982 -155810 -35937 388709 -106656 274032
11405 -512 -7247 -237617 -135377 278013 -12935 162194 -10191 -59216 53297 -92784 313657
11393 177400 -242932 -35676 133889 -16301 310301 -30224 44643 -139707 -103632 261843
11382 210627 -271295 268288 -38508 9416 231447 -142852 87960 172210 63146 -23364 192044
11370 -10261 -8252 -241106 68106 -70019 -177603 -200514 150184 -4329 -42063 5597 -165178
11358 114157 -231978 5342 142048 -19545 -153795 -248860 -186393 25323 -260025 -196684 -75019
11346 202098 -131503 98644 125749 -136333 -239539 79078 -89255 184812 -190346 504064
11335 -309727 -377077 5208 -291568 -147167 -93876 157755 -229550 120722 -89893 16677 210370
11324 210370 -121566 8153 9647 -287053 296995 23980 40196 -161352 -266458 -42063 -171155
11313 -171155 -194764 88919 -103404 221706 -96842 122386 -147483 14804 10556 -313454 106650
11301 -85222 43764 4725 -70295 105875 -2446 95875 -22841 -142245 311924 179510 46411
11289 -9803 -60345 -122547 -46918 -78436 -90095 -140115 -172731 56112 131726 388788 -180203
11277 -217073 -360207 -246776 -95808 -78974 22940 -238042 -216361 -306042 -209619 171328 -154436
11265 120255 -224480 -232215 65806 -204942 77682 -13767 46008 -122424 -155573 196387 179322
11254 179322 -164699 -21477 73559 111467 -433328 -29375 -404839 104542 -256544 -38750
11243 24203 -21101 128436 -118625 -199232 -258550 -93344 -104152 -115336 46884 2290 -134074
11231 -324846 251522 326247 10688 10746 -190840 -416018 109973 -284295 -26866 344371 207683
11220 207683 -150095 163381 132768 -148209 -102204 27471 -197800 -167856 -148915 -1876 -190362
11209 -190362 -158013 -45957 -24649 81850 -26425 -102118 190792 -143904 27057 198509 -261720
11197 -86429 155666 -43604 157368 -89422 -190158 239049 -105184 104281 -145217 261298
11186 -131235 -12211 -163036 84372 -419565 -99155 -498001 -381283 -441335 170790 -194657
11175 157483 -253401 110617 -37644 203259 -106030 193260 400977 70088 -44586 71366
11164 -14982 -31572 -15448 36995 -100155 -48434 -50748 -154544 -95067 -317793 -217853 109160
11152 131198 -13074 -30661 39723 114348 -318423 -37891 -489800 -337898 35553 23143 80769
11141 80769 -3240 -342602 -165512 118389 -15593 -88663 -257281 35835 -41923 160764 -322210
11129 -40061 108660 -78998 176539 -92777 -54664 -248905 316328 331044 101530 120708 -164169
11117 150854 -83507 -26741 256278 213333 292432 12638 278096 89558 380667 119903 106651
11106 106651 276534 176477 -141076 -2691 47421 -6767 60170 345706 319026 19385 373573
11095 373573 104746 168434 42049 252093 129088 180864 287761 7346 27173 26159 694890
11084 694890 285186 353748 525197 577790 197121 207514 292477 37554 98742 410600 382819
11073 382819 333304 362705 467495 147733 364711 412162 212328 314128 166252 384328
11063 384328 -22951 566604 446766 747926 776817 451413 421953 690116 179812 797176
11053 797176 614561 886265 739004 683535 813313 616075 925447 1039978 828915 700878
11043 700878 762419 858950 588200 946743 663737 898381 549865 748361 828243 584321
11033 584321 719878 828992 798669 778603 1005723 567188 998496 535816 771574 723220
11023 723220 875596 646195 1120678 666657 937451 450924 715395 842450 833865 738200
11013 738200 587665 685118 867390 753906 738830 465199 504231 862584 376764 722437
11003 722437 668737 869114 780089 366655 602356 374456 641966 586183 690798 682016
10993 682016 651622 864065 802311 761273 809309 561378 818723 711148 1035719 996268
10983 996268 828199 1220530 627883 732921 1130441 1374853 1186599 1574419 1143198 1842783
10973 1842783 2078778 1723400 2373031 2673691 3045522 3170999 3068661 2802141 2964609
10964 2964609 2980921 2809236 3037047 2235817 2269027 1907646 1729605 1941507 1853631 1829340
10954 1829340 1860686 1896804 1650432 1476406 1380640 1194161 1023081 1292048 831089 875324
10944 875324 534385 470948 418648 394776 379282 197794 375992 217867 94856 315322
10934 315322 97635 -25577 44659 119071 97021 336886 55149 314023 -110038 -103495 -138570
10923 -138570 207733 47098 -154139 -67623 221488 334098 33382 41630 61241 -23341 182039
10911 282 -354076 9210 -88479 1424 -114195 34601 -160019 -126914 29909 -2329 -339146 -205724
10899 -205724 -115960 39946 -77611 -252255 -81024 187577 -209750 -85658 121137 103273 183983
10888 183983 145081 -17517 -171853 369897 121890 -363663 56960 -331648 74118 93229
10878 93229 -190469 -245159 288820 -67516 117658 89857 10155 161827 -166997 -59465 -88045
10867 -88045 -92753 -186089 -413538 -313796 -178330 -155191 8837 -38463 -191772 -69231 221651
10855 231546 52418 76646 -167712 -71766 123582 -556990 -19190 148542 103310 -203699
10844 -113472 -111922 281579 239070 -57010 164636 -193541 -175402 -313865 243088 158854 -284462
10832 -66603 345049 89705 -124606 -9526 64188 -162799 332925 -50106 120326 1407 -91810
10820 -226375 81860 48997 179993 -115182 44934 -85193 -474020 251656 -70561 -217299
10810 -217299 -16183 167830 -1010 -85421 120135 -15970 -237431 -322374 17117 -302848 -168110
10799 -168110 1901 -182855 -135174 -276985 -162425 -99128 -365386 -127882 -63381 21255 -54282
10787 -98435 -92982 189413 -4769 -160515 -156970 575571 -71160 -349474 -126188 -2674 157042
10775 69447 -362779 -108252 174664 -220072 -70511 -238994 -47706 -172566 -56011 -343664
10765 -343664 -244508 -16984 -34755 -25524 -157204 243704 -151781 -68862 75202 -86616 -251446
10754 -251446 144264 98826 -188124 155018 -256440 -270024 15630 -72982 26394 332282
10744 332282 -116915 -372161 53378 -198894 -16009 51979 -268050 209040 240458 -298219
10733 -70862 -151813 -184957 130670 -95521 -128224 51616 -56452 114601 64911 -51176 -38210
10722 -38210 360680 41643 23652 -216689 213709 55631 -49255 -225123 184687 -21660 -42652
10711 -42652 228635 -243621 -168438 35442 -37795 9893 42082 137443 124440 -352295 -102987
10699 10950 -177888 457335 -213303 142977 212585 17499 162315 -85854 165864 53649
10688 133711 156656 -374825 -98330 -52470 -108080 70673 39109 -301302 -121361 161469 -214530
10676 19479 -310625 -146932 -180486 175605 -207926 -32869 -41796 253922 -77251 15579 77948
10665 77948 -83991 180585 -58941 95659 61539 -283319 -45433 214737 -82847 -416199 -138993
10653 193140 319961 13407 -249051 -29244 -88787 -109493 -199143 -73506 176546 -7696 -389818
10642 -389818 32578 197613 -145394 -193410 -77025 -5143 110123 -277220 -81211 52054 -255815
10630 234286 -80150 55718 67785 -56053 -185931 -144691 -112840 -224668 189282 -56065 21188
10618 105528 -135158 422569 51918 195312 -103895 18131 81484 -122603 146056 74736
10608 74736 8886 5370 -154367 19699 -227527 -94368 27379 -187487 -13520 -156093 -51309
10596 -133763 270741 -45057 -62445 -109085 -194286 -152139 122067 -11993 -53983 -28642 261650
10584 -130831 23419 -89418 -139129 36698 -115608 -82630 -90937 -589396 -164217 -216113 -71814
10572 87393 -248179 -58032 -61928 187171 -256461 -121007 66421 -37226 48535 -23269 180034
10560 -192484 150831 -76548 -206398 -250681 -145288 -93486 -7578 -113620 15798 -109560 135845
10548 -76783 131994 52625 20186 55472 11837 -66998 53873 82406 246684 122172 -103120
10536 -169908 -33915 2137 -44736 -306754 -7293 -163149 -196979 108381 -103949 -353686 165618
10524 -451853 -53941 84589 17720 -96235 202081 -231239 -381690 -160667 151623 -191581
10513 71761 -179095 -118467 -302253 -454162 -46334 -87972 -190832 121494 -220933 -7496 92840
10501 -107804 -15864 116614 135077 107959 -29802 -110289 110822 1420 170082 -50014 185545
10489 -2100 -63552 -102736 -290064 -105695 -40086 93139 109775 -87371 -168972 -25493 -61235
10478 -61235 100817 -208382 -72388 503098 436015 162917 69297 103678 259323 97758 185362
10467 185362 263665 -74647 -161735 54756 -100481 -374400 144434 244231 -29764 -28732 371956
10455 -228766 -555123 -22828 -239312 13967 147143 -73856 254176 29286 112128 -307489
10444 -102682 162047 20382 -364919 -40656 42584 24068 112396 94309 184552 -172360 113449
10432 -277277 216663 -216858 -86901 285992 161504 78463 -73967 -17043 -33691 124434
10421 81098 -89017 -124814 -193679 -157117 -101690 -37823 46404 13501 201976 17681 324408
10410 324408 -90970 94625 -162009 61441 -206494 -210693 -33460 99568 -4510 -360557 -8628
10398 161384 -97372 -46440 -116022 223226 184487 141683 144690 193288 233209 479986 -206347
10386 52779 -15375 -45427 183777 -252866 111418 -17220 -162826 279954 -270958 225270
10375 370401 7684 109743 123139 341041 347093 233470 136155 405928 205950 227713 124011
10364 124011 583405 290571 342395 446063 241796 617583 -2812 169233 334485 463581
10354 463581 473252 -107948 202263 335475 306693 240724 839079 623256 487029 324079
10344 324079 248626 318174 25958 246380 507644 400681 -1303 -23545 253506 -26612 150341
10332 190991 230338 -36959 -150000 -315384 -21758 -343661 235546 -30971 32953 261567
10322 261567 140955 321941 118984 63301 21248 230890 -7512 -41379 151166 207658 -215478
10310 228831 210019 270277 338924 237975 -428063 -200807 372325 231162 150490 -101165
10299 210758 -17986 54442 79100 -100631 -40125 -121446 -66192 101939 101171 25541 -291348
10287 85240 -203646 -487582 274260 -153882 33219 60129 -173868 -227458 -259450 -11022 -233550
10276 -233550 197513 -119393 -66483 -170984 -28154 210902 -59108 43931 -148858 -128028
10266 -128028 169856 19463 47059 78 -237220 261336 270689 47710 167624 253695 263022 279694
10254 279694 -133223 293723 431776 398346 305350 175337 258987 349700 110477 109973 182494
10243 182494 166854 278341 -32773 -113154 -155470 209243 -123726 -60128 6479 -204792 -155461
10232 -155461 171357 42935 -344544 -301696 209717 -310180 -5064 -26232 -201251 -112683 55317
10220 134464 -115180 64224 179114 241360 196710 82644 68249 -339782 50402 -205694 -247453
10209 -247453 412992 -36541 -111369 -349804 143136 -232211 -82911 179062 -317559 -186741
10199 -186741 -196544 -175737 8579 -192241 -288668 31846 -32986 -145807 99096 -129717 404194
10187 -383732 211641 77825 100101 101932 -286647 109069 -72585 -287135 -112131 -33188 222682
10175 -127337 -380169 -121602 -471152 -45950 298177 -306851 -183993 -32588 -179673 -124400
10165 -124400 -119642 -222005 219941 59745 -111219 113297 94192 -150291 -275116 -407639
10155 -407639 -235932 -30555 -5294 -219874 -214699 -4546 23249 -66068 -255888 -31884 -206091
10144 -206091 -118775 -121 124543 134502 -29773 -174505 87778 -263653 223855 72806 -380272
10132 56221 301242 -21959 91769 -234295 -413106 -159925 287809 -268036 5573 -207977
10121 -346009 19182 -382779 -11223 120943 -106270 -141722 54524 -203724 -217454 -72078 -21586
10109 -121629 -279398 -56427 -24664 -247713 -178116 9935 -98875 -85742 15925 -45160 74745
10097 -16113 -189898 -113267 23248 40200 -76020 -158824 -357419 41689 109499 -464806 216657
10085 -135987 -16679 -315846 -95485 -135294 321316 -61899 -375555 83284 -316729 181902
10074 -69051 410560 -200706 242339 -62623 -290912 -16286 -453 64131 -78967 -215451 54307
10062 -190959 408880 -170973 -30642 161021 258865 -131581 -123870 181206 119948 23556 165865
10051 165865 -270813 214410 -158866 -194588 68499 86250 136080 -302046 -104833 2662 23800
10040 23800 85181 21993 -193746 284886 -88691 -315202 -19656 -70171 -117631 -235568 31117
10028 -58964 147128 138094 -47651 182588 -115019 -106134 9644 73950 -39488 -240712 -341239
10017 -341239 6194 70095 -86489 236830 119123 -166197 -290787 26079 -645888 229262
10006 -89858 -123709 68784 -153735 -289935 54169 133177 -487480 -72409 181938 -234818 -96879
9994 -284609 20219 -9905 -38700 -47162 -126176 -68729 223582 50501 180739 -70015 -334265
9983 -334265 -307790 330593 -244321 -219693 159066 -125530 -185765 -30302 320 -63443 -120516
9972 -120516 334852 -114122 -93909 -120581 -113013 -318895 79395 -142120 -79899 -179121 -83889
9960 -196438 80977 6349 108784 -253828 -183648 -25186 23836 72522 -127964 45947 86173
9949 86173 -30593 42356 -168659 32983 -10949 -98038 -72112 37104 410559 -67321 -297414
9938 -297414 -149003 -60186 -330563 -27513 -319828 -23608 150614 -238496 -466261 -656587
9928 -656587 -124650 -100493 184513 -33630 -183955 26287 161162 28663 -48995 -264791 70307
9916 -14025 -394394 -177361 -221049 -215990 -474031 -105706 -85057 -394115 268961 -84683 -119869
9905 -119869 -273396 -68201 -215837 -360549 -114563 -203312 -16858 -81754 -291719 -25828 -12802
9893 -81468 144338 244474 71969 -232647 67455 178017 -47766 19115 205334 138176 -80881
9881 58126 308066 67004 -96037 110233 -101511 323285 -26130 -255038 -63383 -195415 -211464
9870 -211464 -32361 55475 -59898 -13690 -171751 72479 -10789 -224745 -274030 -266307 -275601 234481
9857 121531 -306219 48286 -45087 -268567 26701 -90033 72572 -48362 42556 69108 -263953
9845 45300 -117127 55486 100204 -98665 114754 105004 -195514 -420145 9670 -142937 214864
9833 -229720 -193038 -21267 -34761 131458 -72221 -152288 -93926 65571 28721 -22337 -99880
9822 -99880 50814 -123962 -207555 60983 153085 -190679 17598 159150 -123078 -6988 -243225
9811 -243225 57226 -193451 55112 386248 113027 -12504 -124872 -304096 53477 -272798
9800 -212195 -13204 -116843 53955 -166142 66207 -285565 -115269 323703 -393278 -111858
9789 -145115 -118438 -37462 110051 -116055 -167991 -108881 23429 -129822 -167311 -13602 101101
9777 -17334 -126311 303882 -120977 129355 -488378 114946 -78080 -74144 215222 -140825
9766 129846 -208383 -179819 -25405 -242967 -188543 62456 98508 -224565 -40453 -474828 -148897
9754 -217130 -327368 -16152 -20405 -573476 89892 -121877 -79240 -228137 -448840 267831 -21003
9742 172011 -312225 -12547 -172271 -33646 -83358 15332 -334955 -3985 -78097 29220 109525
9731 109525 -114024 -356344 31739 178861 -145359 106703 -212824 -145548 52228 147005
9721 147005 -43803 -137431 -124713 172730 -17769 -169620 15521 -88795 -12589 139961 -72817
9709 -25801 -100234 119318 -168037 35958 34047 -355470 -33377 31939 260857 29570 90305
9698 90305 -211369 24561 -208356 -288736 227879 88095 234760 -25887 -282055 271468 -305952
9686 -47965 34061 -408159 -210527 -106857 -24531 -196202 -111997 33669 -396934 90269 220918
9675 220918 -120761 -142538 -204240 -150732 -329858 -126946 30034 -353771 8773 120713 -288610
9663 -281372 108658 -358435 -283738 45539 249890 140551 -68819 122190 152559 37005 -76291
9651 -76496 -23409 -336177 29873 -193727 -16125 -427613 -163662 -69618 190004 -130499 -43491
9639 12192 -87474 -370232 -256854 -56917 81566 -270968 -43777 227824 -55623 129803 -71255
9627 133187 276616 -176361 -242750 -259956 178330 -387878 -52486 -79680 263641 -95104 137962
9615 -39061 -118267 36554 -253397 196564 -6028 138865 80635 -218369 111986 -69242 150064
9603 116040 -148057 6705 183794 -4966 -187230 -178159 -136440 39043 -37315 -61404 51402 -283574
9590 32717 309643 -148391 -231248 -381548 284823 -511243 -158516 -100797 -217560 264653
9579 -115231 119155 -213153 11414 199047 -77798 -96507 28527 -112003 259542 -110678
9568 -338015 -20786 9728 -69801 77226 -338063 59671 -427783 -79289 158384 170948 -96852
9556 -223818 -26776 -116374 -126026 38872 -147544 -248156 -173227 102691 -64333 -105781 189799
9544 -226781 -120462 -70235 -65863 87507 -170905 -88319 -316728 -77020 -118047 -158133 49223
9532 282580 -272647 -267290 -95777 322785 271 -28440 -364348 -405339 -162072 102268 141626
9521 141626 -392578 -246117 -151186 113313 2961 114147 126961 -73582 -87479 415344 -16876
9509 -49055 6830 -275081 3377 -217548 -155908 171511 -125839 6464 -118052 -166763 -172501 -242513
9497 -242513 30370 -61064 -270973 -8104 -30939 192535 -76233 -191827 90036 129456 -133504
9485 -264118 -61011 -179557 -71551 28397 -51149 -186927 -791 -287289 -65142 -1226 -269470
9474 -269470 132869 -88174 -181106 -13669 170159 -38949 131716 -198596 -76241 84615 97969
9463 97969 158190 84070 48210 30371 -50065 -212863 -47922 -178421 -180690 152146 -152321
9451 -147547 -102764 6332 95487 -68287 85305 -360793 -69451 -140219 -407685 285824 -126694
9439 -294141 -10745 39818 -172639 -384286 250227 -381932 -12625 -23961 -244295 95091 34990
9427 -76096 -21099 -120064 315479 -294732 -158959 -150272 -68520 -219671 -148229 121817 -99622
9415 -125296 -13841 -54588 -438310 -168534 -153859 -215666 -177709 25357 173455 131786 -20914
9403 -132977 -66453 15990 -26144 -453328 -253581 160253 35707 112651 37471 209266 -103121
9391 -226663 -202523 -59749 14415 29084 193565 -35906 -63256 -101388 -86765 -225932 -162136
9380 -162136 -163851 -236885 -42306 -24448 -166966 -306398 79930 158324 246540 -217715 -27876
9368 -294386 -312123 -85552 -153288 -143669 143642 -125390 171626 192237 -222848 -477857 -37011
9356 -29441 101125 -219947 -248008 -42739 -48179 -417920 119131 208820 122296 -257521 -63902
9344 -198786 -119672 109624 -337808 50434 -95320 -296387 30060 -88582 -178653 40556 5753
9332 -27196 28016 309448 47763 -15894 -37588 127052 -170154 -150247 -10718 -186994 138466
9320 -309049 78552 42733 197474 81307 -105573 -300379 -350236 167053 193619 -168171 -293413
9309 -293413 215471 62966 -110958 319566 50738 -96376 -276422 -36959 -31768 -213813 137768
9297 193278 -29113 13330 -97607 -179276 -150463 72464 19010 -311923 -71934 -85609 61236
9285 -125221 333386 83018 -305135 -253802 -198254 32557 -125064 -267152 -60268 -222915 -178854
9274 -178854 -267009 -67530 44188 -329915 -161023 -142279 109097 -411313 -53490 55698 -148711
9262 -8647 -275620 151807 -319955 -134446 -194027 -340165 -126257 -166284 -67251 -265935 -363282
9251 -363282 180945 -38091 -59487 37433 -198104 -363784 -127467 306440 235429 12404 -136416
9239 145147 -100888 -1593 -179258 274605 -115560 77655 -148253 470923 -214211 -113380
9229 -113380 -3720 -25069 -25091 -22346 151547 -179483 97959 -46849 54781 113198 103426 97244 11847
9215 103055 -142028 170787 -232840 -185278 -113003 -110976 -318230 28907 128436 78794 4736
9203 -383222 18451 -48583 -75054 -315552 -186201 110836 -143626 70171 -317520 -65309 -177544
9192 -177544 -247082 10374 2145 133669 109066 -5315 -95540 -12781 254456 -2545 -4857 -118484
9180 -118484 130800 190875 -431849 -215907 -382212 68000 -63606 -279722 -89323 -187916 -76872
9168 66561 195146 267732 -43653 -206722 142187 200261 -187322 108596 -242798 127471
9157 -307702 -467245 -291559 -252973 -127123 -92853 -37812 219497 44501 -76790 -19437 -16864
9146 -16864 112331 65630 -234448 -10706 -211906 -59830 -441193 -372641 224708 -190998 -50068
9134 159383 -3424 142815 -229090 -144437 105893 178754 -327071 53039 84647 -269928 142457
9122 -30049 205838 -158089 -369962 -294007 143987 -151539 127357 170051 217532 -49631 474568
9110 146829 45211 52517 -99018 -100503 -47859 -66867 62329 -340257 79357 -497673 155456
9098 -129674 -287337 -67624 303999 171194 -259160 87057 67240 8131 -9876 -26454 212267
9086 -135570 -63802 -381198 129743 -300664 25622 -120963 159591 -77992 13429 284072
9076 284072 -282332 -99367 428893 -489160 485 9546 -49041 38366 184503 -328538 -135013
9064 -197206 -228941 -40418 -266331 367392 -33658 -161905 -187019 -344801 -74803 -226563 -199977
9053 -199977 -58206 -135858 -102766 -67395 27518 -168871 -74519 -291421 6189 113452 -123988
9041 -233291 79537 -226877 278916 -152017 196572 -93865 -168245 -18263 -205698 -16536 -270651
9030 -270651 -329710 -29880 -12693 -66198 162706 -74324 146347 41724 -52446 198595 -348478
9018 35624 -44173 -155156 -258541 -95700 105710 -118002 136843 -38268 -73291 17361 313976
9007 313976 319923 -265416 53357 -255341 -186425 -327893 -270524 -119406 -273302 88557 228072
8996 228072 -61594 -303570 46957 -107431 -29919 51301 -84392 3722 -103136 87572 -144405
8984 51662 -479611 -254130 -35454 -199030 66809 -776 -108203 -265993 89461 194492 227322
8973 227322 -106782 117891 24209 -159257 153606 -58939 -148722 -170625 -107712 -52223 -120215
8962 -120215 9336 -268395 223927 -30309 -168681 -25694 -178865 -19513 -44318 397800 -69407
8950 112605 127473 -17142 -129396 -96523 -245732 -38058 76537 -81790 -44946 -136091 -219499
8939 -219499 -136174 -159635 -31754 -148578 -216834 29358 308106 514341 -164140 -60494 32886
8927 -234619 -34407 -291513 463485 218598 197676 851089 1849477 6709624 7244695 4045836
8917 4045836 1678274 921509 350012 250905 276580 -73941 -198151 149232 105819 -161250
8906 416380 67109 30137 128529 -108998 162565 -9275 -62068 54197 3371 -19461 -3406 -21467
8894 -21467 34420 92447 225165 -267185 245640 206145 -168633 146847 13147 -27117 -198981
8883 -198981 -16725 -222073 180955 -198537 28743 -229683 12764 121529 60075 -72559 -76661
8872 -76661 -66571 -104556 -103774 316232 20147 18425 -178736 -5348 -107815 31842 329869 -232637
8859 42215 176275 72480 73363 -13256 260771 24332 244105 29927 137433 -31844 -12234
8847 -108800 -22951 1554 29322 -155659 71606 -67867 420350 -61635 -247115 -233941 85045
8835 172424 -20007 74067 32280 78575 -77049 200958 -389265 149294 -277479 195127 133998
8824 133998 -226836 39488 -109265 67731 -314110 -158003 99658 -273892 183107 -219128
8813 -140061 -22447 -24729 64744 -297630 149790 27768 -153514 -227180 -45192 -184267 -296341
8802 -296341 30349 -362978 -32126 -28838 -95810 -162612 -112173 139344 -166851 231782 44952
8790 65864 77283 65839 -18953 -74951 -25445 -282425 -166764 -469578 -170656 -209304 -366707
8779 -366707 -228947 9346 -337062 244360 22954 -282016 -141139 -69243 -99599 43640 -65327
8767 -43248 20457 -135024 121545 -435609 -72256 119893 -256503 -113132 -98780 264948
8756 -106604 232160 229999 -276596 -140898 -340405 46928 9984 -123390 -146671 66196 -239114
8744 -205644 31373 264671 -76825 -7353 -25514 -169455 313066 52966 261760 -106044 110128
8732 -161639 -115604 88857 -26920 65624 -185471 -216014 40799 -408801 -287771 26468 8210
8720 -178216 291781 128374 238159 14297 -181848 -280263 -165865 97329 -287480 -94102
8709 -7268 -67127 -86948 -127733 -173445 121667 -412603 -44196 -568805 -208841 147352 -64254
8697 -185986 -88767 -254923 -349469 -250953 -91455 -352318 -111444 111127 -141214 -48571 -6374
8685 13510 169 70482 -11638 -157521 7389 -260625 20991 259241 -88425 106551 63097 -304766
8672 -128332 -39519 -281975 259706 46331 -72136 -143821 -39743 286196 75758 -33525 128108
8660 -157213 348665 63127 -292590 -119503 -237618 22031 327536 211199 269183 -296207
8649 81348 -47792 -167937 65926 -138768 -6819 -162993 -4023 41492 -537487 52382 -104474
8637 -133860 -17633 -145870 -102277 -246023 -38368 -122172 217720 -111610 -127571 142210 -125678
8625 20079 354889 -325145 -297234 -49709 -21110 -337241 -40319 257782 15392 39358 -30721
8613 334209 150444 -440860 69818 -91391 127861 38325 -114055 -333843 82537 -173289
8602 -143220 -132247 134202 130599 69593 -260081 57345 116175 -26395 -146451 -44241 -133498
8591 -133498 -186700 -223352 -80625 -74988 286421 -45231 -302816 136052 -104861 1478 -176654
8579 188525 96504 190663 -124065 -32843 62402 -401400 78088 398487 19416 81563 216634
8568 216634 -82938 -172493 -270331 54363 -258750 -302893 -7847 -80997 -45763 -20559 -398924
8557 -398924 230226 157514 -43780 -153499 -84906 -101357 94565 -68421 290734 -77303 -27292
8545 -159398 -256851 -95478 -28579 83224 -87644 -338221 -323579 -292039 -86622 -5815 -233289
8534 -233289 -206600 -339729 -279034 338796 -156965 61578 -221513 11466 -43396 255462 23965
8522 336248 -28676 -110482 -82006 26775 -351108 -363667 -143953 -151526 -54011 -28476 236854
8510 -361584 -7061 -259655 -260403 85155 172520 -6471 -128282 202049 -316310 133221 -237754
8498 -104886 -153425 -260735 -226266 -136638 -249311 -10227 -78593 -170403 184657 -163431 213607
8486 144376 -227417 -22160 -216609 -110885 -165540 -243000 -170379 -421828 -33779 -213185 -166509
8475 -166509 132886 -367721 74974 -55938 -206725 433 -164809 -189561 -77367 45833 88848
8464 88848 59042 158850 -228246 97090 -102717 -234427 -108521 228916 172599 -44269 -27735
8453 -27735 136032 -49971 -36133 1318 -130632 164590 -125058 -100821 -103244 -311889 -83180
8441 -101434 -21938 -111352 -153796 -47204 -128348 -8673 -12937 -225109 40946 -98924 106414 410550
8429 410550 49927 -225204 -476981 149112 -62679 59148 16711 193385 -135376 46277 -237359
8417 -339971 -151788 -173011 43523 -381011 -28494 -196166 131272 -243687 -72684 -49327 47187
8405 -183233 -280580 -80759 -2019 -256214 -233564 -168704 235437 -105596 -61657 -318803 41902
8393 161425 151858 141157 -59109 -499402 -79419 -147813 -34004 -87717 35513 58355 -84952 -59625
8381 -59625 -14644 -66143 -144275 111644 -158210 -85334 155475 129583 70900 -38563 -112324
8370 -112324 -80089 -216375 -165168 -131074 237280 -122826 -217594 -94685 -203194 -90911 -7749
8358 -26116 -22059 -52122 46438 -54029 50156 53449 -26323 10807 -31335 166546 -47078 -106348
8346 -106348 121541 -26431 -316043 -29349 -165989 102560 15610 42871 -128910 -52183 -20160
8334 -74415 -124949 -383078 3290 -360797 -9199 118814 152197 -43581 -21326 -272139 -143153
8323 -143153 -315643 -4046 -145478 199636 -120522 189755 160765 -463257 -147340 95287
8312 -116378 -36626 -123651 255484 212290 -19742 149503 -218848 36341 -175825 -160094 -50200
8300 -243560 -256027 -207277 -181289 -42851 188791 -127076 312450 -162796 -7818 -285221 -54005
8288 14892 25131 178188 -239751 185251 44305 95576 43136 -461548 -222647 194878 -103326
8276 -82618 -47519 235900 -43560 -62791 -11412 100419 -154016 -49650 -274223 -390680 -306224
8265 -306224 80559 166577 169113 -72800 15262 181281 -77025 318449 22614 -96288 133 -123370
8252 22072 -151196 1302 -314665 -116455 -119775 -299914 -143969 -115226 -14366 -401536 -204195
8241 -204195 -306019 -49566 -233856 -316910 -39630 258978 -162936 -392554 74268 -116773
8230 -86806 -124108 -200086 -38192 96575 -155417 -230821 -71489 142574 -342119 -226271 -129998
8219 -129998 -218457 -111777 -52664 -65097 -66313 264030 -22057 70831 -96751 -146377 -130225
8208 -130225 -153215 -99422 150888 122892 -184953 -116430 115571 -46085 -145815 138780 46077
8196 52838 215527 223130 -192612 70226 -370657 -25943 -379506 -121887 170520 -97506 -185424
8185 -185424 25282 -99597 -126476 -304626 5404 -132663 -18192 33733 -10128 1961 -78187 29078
8172 -30188 216399 230407 38793 37585 -265584 113830 -254029 142815 -92606 -141748 314927
8160 -165953 -16342 -128285 131524 -96133 -225455 -35080 -213331 -329317 25636 -503071
8149 -150173 308812 -94679 -216989 -313455 347334 -121653 -3810 135538 -42563 -52222 -194756
8138 -194756 -127098 -331135 -127283 -101008 -339196 -182674 -216137 -237770 166456 -64599 4502
8126 142879 -74040 -271014 -233123 209358 -53425 25773 124083 248900 -9369 -79234 -12977
8114 47215 -13962 -112785 -183573 -32920 -219398 168687 36432 -85035 -194120 97206 -81809
8102 -15804 393170 -434678 -166707 -81725 13075 77416 -454464 161052 -85077 108939 -180862
8090 170427 -13199 -123005 -43633 18304 -183578 216271 -59914 47378 97966 152463 67727
8078 -78499 -275110 46434 -144062 -69546 136228 325861 -219899 -2325 81517 32392 -91541
8066 -148791 -46697 367425 124309 117216 -80552 -348275 172687 -106352 -144934 -155133 -44933
8054 5579 30263 56163 -197997 -548465 -225255 -235796 -415387 25842 -2528 105610 112855
8043 112855 105842 -317718 239467 -259762 -61937 192596 75412 -65031 24227 151461 91405
8032 91405 13859 28356 156090 90843 110032 -266402 -286551 26109 -29813 -324301 -185855
8021 -185855 -121301 3267 198139 -25092 -62841 60482 97763 205513 -214018 242959 48308
8009 -361737 -132054 116719 -65790 -50789 -527 20412 286596 272055 -138522 -158868 -154152
7998 -154152 -89535 -166983 41511 -108688 -265457 158681 -100910 -40367 222302 59315 -6514
7986 101400 55729 112897 -180468 -158732 -158221 -174045 37838 110133 -16098 -333988 -151346
7974 -293912 -388038 -51736 -88235 -140598 -182145 -120334 -103423 125386 54409 -76349 27675
7962 -257396 -44059 99844 -126998 167371 -189758 212131 -190531 -70599 -240150 -276629
7952 -276629 67563 -181101 63666 -222796 -415171 -21196 82608 -260765 -306172 29440 64599
7941 64599 -77924 102557 17613 86467 -60927 -290867 -178122 -15434 226376 137871 37560
7929 -140251 88537 149485 -195880 -34271 39162 70615 -94843 277339 -73883 7088 366955
7918 366955 -149566 1974 -140726 225213 11204 1161 326957 -98114 -240158 -100008 102078
7906 -99044 -65570 -175918 -188157 35531 63197 -49978 -88421 -7683 -149889 -110986 -416541
7895 -416541 151730 -77583 -66997 -103009 -196945 -70243 103219 18719 -98251 -139539 234614
7883 -315854 41496 -149702 -84889 -11423 23288 -251726 -207993 56844 -228654 144544 -341322
7871 -31684 -150080 -65969 -96582 -60991 137360 -65892 134047 -235620 280343 127014 43202
7859 -137172 93124 -155452 -140234 -133908 200645 -349901 270505 -66523 -236251 -36971 164275
7847 118577 -181935 167055 -122824 -143931 -79827 -38471 63107 -439717 134826 -292436
7836 -136044 -147199 -6867 -80192 -100157 69831 -207393 -365217 13300 275522 -327423 66397
7824 30486 -82860 -224673 -234764 -104496 83570 54527 -114441 -58560 -84979 35530 -25572
7812 130294 -159183 -143033 72875 -56263 241057 -279167 47487 -326181 -202747 -222237 -373431
7801 -373431 -72474 101628 -88982 -177107 193192 31422 -185672 -182766 68971 60822 200535
7790 200535 -21907 71612 -31846 67840 229543 -231097 114488 -18306 -211586 -424871 5005
7778 -197933 -402137 -270436 -5272 -48882 -224932 310733 -299613 211959 1721 -145610 262268
7766 -166096 35336 -303069 -306383 -55877 -177328 97754 164690 257944 -423547 -24700 -53701
7755 -53701 -255293 -136652 -296097 37491 192683 107645 -259198 -24711 -42503 -225891 -170166
7744 -170166 240918 153042 -138373 -275569 -192210 -58182 -10577 -43090 -73938 115401 -49174
7732 -93210 -84017 -119261 -335809 249925 271788 -306871 -78621 -213732 -211552 -100442 -202440
7721 -202440 -28724 61313 153612 73230 -241755 189641 14467 -11533 -12542 -247828 19130
7709 68444 140024 312289 22180 203832 30654 297685 -110703 -375063 265324 -92358 238847
7697 -168188 -208977 194223 -19238 -38538 65056 15333 159036 -138553 47206 -192352 157766
7685 -380713 28632 -174863 -219343 -258359 71749 -162213 273384 -167581 -229003 -298138 -68600
7673 -227644 6347 -30302 -6682 -160273 -27756 -43736 192159 -152160 -128366 -140648 -30303
7661 110947 240035 -8885 -171130 -278999 -121390 -112213 -39146 -63552 90118 123882 -30666
7649 37011 12903 198819 413438 -38973 171125 290660 -267159 383053 27037 220692
7639 220692 -178751 54457 -427625 -274008 143550 47654 1295 -144801 -287078 141797
7628 -167537 -156352 -85334 -14316 138754 -164023 354 -107136 -205655 -234044 46581 -59019
7616 86139 -168615 -14551 424643 -179681 -342812 -376838 -111185 -295455 -22858 -142669
7606 -142669 10626 178064 -163229 47777 -18035 -105512 -209450 -242970 -87287 -10830 -306143
7595 -306143 -171259 -79128 -80962 213563 -210930 205021 -853 56585 21822 28776 -111529
7583 155580 -168318 -82527 -127545 -144697 18736 112464 -4429 -208782 63295 -266818 -30343
7571 6 -148930 -263025 174700 154403 88734 -31903 -282685 -136018 -181583 75070 -86487 -52167
7559 -52167 -132973 16697 -34829 -6644 125555 5880 -111451 -165369 -63616 -213975 -228448 109131
7546 345213 257588 -88424 -190286 -11969 194049 226774 180790 -248884 170709 45152 36896
7535 36896 -375940 186651 46193 -186884 20195 104026 196881 31863 95613 -167264 -169624
7524 -169624 -125374 23227 -142389 -101366 -138586 -151665 197265 -166508 -21131 -90660 69821
7512 158130 -278406 8308 -39400 -203679 -205902 -174459 -150005 -178275 -43933 41431 -161113
7500 -76398 280293 -1261 -232134 -302606 -150182 -152703 -220932 145750 183527 -64431 21179
7488 -120393 312725 -180345 -144474 -222578 -112447 -118692 60048 -34454 45631 -47258 52428
7476 -4282 70240 57021 -116124 -129389 -88733 -73619 -204285 54923 86918 223688 -91825
7464 54748 100762 13827 -73955 -98991 235371 -35822 61191 465823 -303158 184074 -368315
7452 -100761 -88254 171889 169145 -111514 62097 -51848 46713 -200548 -108127 44620 -193538
7440 -196171 120417 239684 -201439 27496 -100598 -298860 252683 90390 -144986 -234266
7430 -234266 -199520 -53292 -21297 -111910 120529 -51595 -86814 -386905 -43905 -206867 156056
7418 -101490 168796 458691 -149650 104470 -207328 -98880 165034 -389891 40166 38158
7408 38158 342239 150955 -62474 195856 161301 -121555 247498 -122665 -202411 -431477
7398 -431477 -73716 -65789 142815 124272 184767 112315 -421932 -475854 -17302 52477 -278800
7386 -195624 64789 -45818 137432 81669 148996 53916 10590 117942 -196944 -25601 -29084
7375 -29084 214370 41805 -72940 9714 57187 85411 -78220 61444 8747 -289043 -280145 -80281
7362 51157 276766 -144681 -59224 18582 -207437 42780 113431 -351336 -182232 -230807 169231
7350 -105687 4631 418432 6925 154406 214138 -390109 12490 433791 -262220 -364488 170761
7338 135436 -136039 -193086 74237 -280494 -107707 173888 -60101 -222788 -434941 199715
7327 14098 -354773 88076 -61295 -242834 156222 -424989 7958 175747 -206918 234946 154169
7316 154169 -238821 -313089 19154 67920 -119988 -62385 -117718 226519 -223618 -309639 -102168
7304 -222844 213205 -9411 154243 -41732 -170062 45535 -57743 -333309 -34672 -108649 -550562
7293 -550562 41955 -293715 149133 -387668 -118413 85525 23392 -18356 252773 -173038
7282 -164912 61643 39541 31921 339941 131845 21270 -91587 -132056 -249003 122968 45132
7270 -337703 72116 -378284 -334712 50167 128427 -388835 -113027 123866 89680 -61940 2052
7258 125991 -143464 524537 -69081 -206671 -90171 14405 -251430 10546 -95805 -6330 137766
7246 296522 -174903 -317319 -13253 15561 -32822 -65158 129661 132307 20630 88812 51982
7235 51982 -167603 335002 210420 -24320 -11586 183215 91282 328611 105507 55926 -108676
7223 45048 -169636 -242566 -2108 3213 31126 -71625 11052 -155467 83918 -265792 238942
7211 -84967 -15252 -165764 -2463 97188 66161 -122811 -248329 98900 340791 -158416 276111
7199 182447 253620 -85533 -54419 80527 20273 -134312 -48215 11272 -43379 164549 173720
7188 173720 11178 -279461 -155597 -125990 49208 208006 -33924 -286175 -252338 -202374 -94922
7176 -169127 -294855 -51367 111773 268727 32162 16373 -338102 -74672 61365 -192358 -228822
7165 -228822 -92341 -99055 -21856 -405039 -93631 135552 279266 -68214 -213234 -160043 133102
7153 66828 95909 -202963 -14276 110412 405483 -354936 31969 -17485 37301 -233913 160263
7141 -192967 305573 -145180 50499 26897 -3426 -109256 -89357 170621 -140378 -51072 91916
7129 -53614 29803 -45484 248528 110031 -73758 -164718 -309642 -208635 -92303 -69353 212174
7117 209814 -216786 278011 -28109 77363 -59849 538450 -115082 -70680 -1014 169208 -181376
7105 177298 -48989 -75027 -233232 -44182 -130222 -135206 270467 -187095 -306474 200608 -122614
7093 -157932 290896 144472 -58001 -327857 111258 112658 66858 -61627 -79891 -213100 233182
7081 117705 350312 -197953 366341 -331048 -379513 72333 58677 160828 28789 -369393
7070 29396 -139062 -141268 -184273 -116218 -257331 -245660 -45754 320902 -90544 61855 90329
7059 90329 106022 126492 -266838 32434 290283 53911 -112634 -24681 -69051 -112194 165532
7047 107091 -99245 -72790 280128 13037 -50537 44053 288567 22148 27160 -217092 -193073
7036 -193073 -104601 -18791 282175 -298702 34543 70844 69943 -105380 239614 -308960 -301357
7025 -301357 -27613 -141656 -86908 -311184 244535 51695 95169 -448814 70794 -24094 10327
7013 -75203 7627 141985 -110938 61435 -595470 16687 -248080 -121227 70970 97435 -15452
7001 -114223 82556 -23007 204423 133142 -167019 13319 80406 233784 -53725 -210 7910 -258445
6988 -370025 -221467 28290 197607 -175628 265 12538 167623 -64584 -169218 -50020 -31087
6977 -31087 -90820 -3229 114750 -318512 213009 20611 75241 -103417 -52767 -112790 -83376
6966 -83376 -49569 -119012 -308369 279939 -36744 -27398 -278372 184516 148452 -30097 -118471
6955 -118471 33897 -188012 24220 86872 -166070 -26242 -254678 -582833 -136012 -99643 -389705
6944 -389705 -46483 167478 -41799 -48046 -23172 -264794 -208578 -237545 158085 168940 -40867
6932 202168 21058 -212750 -196099 23747 -342629 7811 189518 -151499 10470 92673 277750
6921 277750 1989 -30791 196477 -152565 -70338 -148324 -166916 150520 -106598 286058 -45586
6909 -122434 64198 52214 -196952 95218 18201 -52521 -250976 -85050 -150282 214770 14031
6897 72872 299581 119299 -134096 253597 -156725 -18283 222919 -346868 132547 -127666
6886 1833 238562 113163 61514 146133 28147 -147274 67273 -66559 -53981 -273035 126369
6874 135581 21130 -401358 -300184 255033 209091 5985 -3937 -41938 223947 71428 -3633
6862 -45639 126821 156654 48031 249619 -17746 133190 53066 -138319 12641 88296 62328
6851 62328 -254126 -141878 184625 -83269 -2258 130835 123208 -38698 62623 188540 83795
6839 77895 280407 40593 -228403 -275010 -96715 143024 -101254 129264 -242262 11543 -134079
6827 -232554 542 107256 92202 -127408 -38495 -78460 80669 -141455 321743 164178 -182340
6815 -36633 -94664 -196071 269669 129462 -195912 -120585 -236029 -19973 149879 173882 120477
6804 120477 -181919 -11775 -122695 181545 102761 -281089 70373 -143479 2134 58347 32732
6793 32732 -187216 -26435 120188 -52009 133286 116642 40331 -94405 -117034 120184 -36722
6781 -363616 323144 -35616 -186812 -33434 33286 70309 -217387 -243815 -328935 82264 226026
6770 226026 -485531 -334823 190011 423150 -30383 -64574 77212 32251 -128357 -23401 -163945
6759 -163945 62693 -171636 -334477 3538 -34856 100326 7529 311385 212105 235046 -403668
6747 895 -63365 73979 353380 -46775 -196298 -213225 14786 48503 -121636 -178043 -342729
6736 -342729 -312888 27673 -62840 -310953 -219435 127163 116207 13096 -175220 -341909 -212635
6725 -212635 -207161 -136911 141873 -183314 -139827 82287 23672 227426 17791 -58988 120381
6713 -55972 39586 66514 1731 -20167 -167539 102248 -278578 -100038 -372518 21027 -225784
6701 52460 131422 265135 133272 207688 55180 34864 -84452 -148836 -146681 402854 -14787
6689 -72251 -351812 -118549 -261315 -109092 164335 -429333 26806 -54552 183762 145907
6679 145907 12553 220304 -67780 256638 -53740 36736 167465 31540 -108766 161572 -63682
6667 4798 163054 -360254 -211637 -311378 -121151 -547418 -121965 476 -300554 6445 -254465
6655 74639 39788 53285 14916 -49546 26366 161095 -251698 -19235 -178230 -113227 33888
6643 16882 -59782 135780 78993 105309 270499 12071 -109575 -56173 59986 -41280 -139461
6632 -139461 -23345 42343 326937 -138677 4533 -49048 -43138 41081 14914 -23890 -156381
6621 -156381 -170766 -150734 -86584 160234 -112402 -254959 -404380 138515 320150 117854
6610 -254329 -128472 -288494 -12448 -114473 -155584 -19107 141469 -110020 -115465 -81764 -243630
6599 -243630 -149223 76757 -167098 -110680 11363 219 -25993 92164 94593 38029 254364 -87887
6586 94379 -213586 -74959 41182 -116696 18197 92145 87687 419900 14929 -237473 152722
6574 -213981 -204821 -45191 -342510 60535 203110 131892 -58898 37169 -8430 -1077 -124086 9543
6561 81746 80930 55194 -122645 46779 173088 -413424 10084 38456 -198618 200235 405091
6550 405091 -181646 181689 112267 353394 -404857 51184 -150151 -20648 -30591 -92089 292606
6538 -97330 -71171 96066 -145175 112652 224965 119866 169125 -62174 178570 -24365 -165473
6527 -165473 -56490 78285 -166825 -29426 -139704 -26060 69760 -12094 84431 -129309 -169671
6516 -169671 19721 57306 12265 55510 295253 188905 52426 -19205 -100324 -264931 98171
6504 299763 -98264 120906 -170211 92155 -2367 99141 -179530 -15921 -10450 -394792 -342707
6493 -342707 113808 -26802 -140786 174131 46300 67135 -128220 114859 47866 -87608 -197957
6482 -197957 -35680 -223443 -78181 16971 -49677 -95512 128640 163049 -93862 -103635 -3373 130689
6469 -54134 -228083 124635 32268 -67048 -35714 -192390 60657 136240 258949 166124 216187
6458 216187 89233 87241 193228 236190 27055 -299207 55063 170011 -308169 -137150 68126
6446 -217294 231523 84848 -12430 51241 83734 110184 -67337 4016 43101 -341637 67587
6434 -181761 20355 -138075 -212487 84335 -204727 13282 -222764 -436119 -64944 -134245 -87277
6423 -87277 -477757 -81538 -104731 -335977 -38368 -445410 202488 375273 33705 -101135 91113
6411 -113159 231868 47782 -73150 -117216 34829 -350575 149003 -220216 226799 -78761 200073
6399 279784 -137437 -188473 -79577 69872 219647 -141598 264238 -185057 153542 -25182
6388 -228252 150684 -185333 305122 99706 58646 80700 -83354 -91810 80189 333880 34422
6376 -83608 6579 158743 198694 166031 133232 100843 233889 275426 -504305 -319914 -84969
6364 -507007 -30365 81737 -414451 -122250 83609 -38755 115862 79835 199978 86873 104992
6353 104992 132762 -143690 -159865 -106024 425316 -187795 -10656 133496 212420 106804 -165768
6341 40695 73254 265048 201596 165667 174784 -24235 121507 39262 -73784 205713 -172812
6329 -333103 230622 -27478 -331739 -52925 -306503 410699 -43879 52834 224995 -27337 -248722
6318 -248722 22166 -77127 28024 248335 -246471 181904 87983 273200 88374 -64981 64975
6306 -100941 65750 32558 -149046 -225252 -42751 -136733 -535016 207060 58843 -305224 22603
6294 100421 -131845 126173 2913 68003 123888 -197588 168719 -323253 -232858 79616 162996
6283 162996 15816 45634 254189 -58353 -28322 -184604 54792 -69902 176108 -49444 148211
6271 -230711 -405834 2760 4783 -162091 58011 366792 -33431 -99617 -60736 179932 -211643
6259 -9990 238090 -172874 209093 63547 -123168 -110032 -229099 -107771 111251 -246516
6248 169861 355878 -47988 281393 -115220 85581 115829 44083 -61220 -301825 25608 -201724
6236 30976 176101 -43336 234199 141954 -315223 -86925 277287 -90562 -94206 94616 276127
6225 276127 41883 -110212 -223232 -143780 -303201 -174393 -120940 -387809 -100340 8554 -134113
6213 -110336 -174283 -8585 -85209 -41285 107339 -223902 -44884 289011 60175 -42587 156346
6201 -3235 17459 -314239 -191278 -35587 -202650 125345 58155 198852 -75269 140232 151834
6190 151834 443898 -50375 130252 -159843 74494 69992 -63815 -159256 123340 27400 -37984
6178 68948 1435 125775 53611 -112965 -182629 -141304 145555 170016 -220616 33931 -11856
6166 -62035 -222896 354458 -51835 18063 281191 -35670 -20238 -103116 -49371 -17295 -141047
6155 -141047 -83184 32346 14625 -174881 106421 -66175 -125789 -68376 57615 310143 -223591
6143 40268 113713 -21620 414969 -77386 -15980 -43468 -134569 -171970 192107 259413 -102190
6131 -36803 -122441 112589 309514 -151927 -81465 -11340 -147312 60308 -160068 123434 16326
6119 188981 173034 -35399 -139912 165274 -46971 -58707 175562 -71463 -135408 132743 191718
6108 191718 102573 108690 -145369 25874 6254 -227572 -274967 99591 -99785 131627 -171406
6096 -129348 -107180 121937 -60891 -135454 133409 170710 206579 -352810 -187499 -147427 -135781
6085 -135781 240356 301917 -88506 161261 -250279 -25971 -176521 -95971 214668 161386 -51418
6073 190994 183783 282396 -43098 -104289 -5591 257708 -184440 132903 -129261 201306 -178740
6061 -82192 -219248 -58897 -36809 110450 -205356 -10511 70265 -259099 97252 123612 -147145
6049 174665 75176 -12961 -82630 -83794 -99968 -270763 -69356 -118224 -13140 24497 -43883 218952
6036 86534 184495 -74362 10617 -432955 98457 -83433 -97319 91450 -346537 111866 -145381
6024 -32565 -178038 -456712 10567 98641 -91137 -284910 -29835 -101091 201838 35750 -246151
6012 174699 -92817 330420 210161 126675 204737 -20667 -96705 -46073 -73443 104816 -13079
6000 173126 -222813 33419 129039 196493 1945 -111153 212700 -54278 -112971 -265143 238948
5988 -9730 -235302 116253 -160943 37339 -79881 49641 61026 -42796 244668 -300629 215176
5976 -92707 19198 -20166 275164 -58054 296989 -118998 -4823 -214337 5802 -123187 14807
5964 112465 -6258 -17528 143324 3480 -307493 -101917 -207075 194687 -454353 80309 82374
5953 82374 -89586 -163013 -18252 -40797 36183 -327435 -188998 289535 -35526 -164862 -208555
5942 -208555 81375 97638 -281946 238686 33437 141368 94431 61601 -172976 -212833 50531
5930 -129082 -27695 -172718 -89829 114118 -233060 70726 74932 41098 43815 14840 -136767
5918 55416 -94607 205923 224356 104277 199614 54957 130591 -50655 14038 16185 -71921 -392647
5906 -392647 -44631 -139660 -93666 22102 -58292 177569 -108463 -119235 -93553 -5425 -20312
5895 -20312 405663 222374 106464 4860 44502 97378 213228 -248563 -44178 58065 101538
5884 101538 -302903 217265 158945 -26080 186215 -155536 21049 -523411 -117556 -126616 197094
5872 120487 -49737 -300099 -56178 -21225 -11481 185124 -12550 107592 4232 -219210 -354013
5861 -354013 43646 -330707 -95917 70396 -190660 278854 -111397 -139494 -210173 -307293 249443
5849 -243301 67284 137503 -79986 -107025 -59410 -109383 323011 -234215 167169 41423 97094
5838 97094 19628 -59348 -94854 220111 -374959 -65501 281090 -94944 20531 1347 -58353
5826 -136427 -162690 42546 287547 353389 74594 493828 276057 266131 409257 -161883 -161515
5815 -161515 -246381 110426 347134 -32817 112085 57579 65796 -294217 85489 191989 45779
5803 130343 14632 -173555 35747 286882 91302 -320462 -76859 -208 181713 -107855 154809
5791 -166493 70276 -260995 27854 -2947 144249 64521 59113 124554 -254173 110538 107501
5780 107501 196819 65866 28803 -31528 -237066 47194 -21979 442344 -147908 -37426 165402
5768 146957 -155492 149265 12830 137084 -184471 -236896 -167028 151527 -53391 -242160
5758 -242160 -203128 -230506 26918 124481 -18240 57546 73990 99 346436 -33824 -6140 174388
5745 -407594 41739 117275 15648 380416 -253406 -195074 -27202 -212084 163167 -93210 -108319
5734 -108319 -119172 73082 328609 -255856 -113902 146540 -144319 34147 72919 -186568
5723 -133821 -67726 28088 -185141 24240 -72413 15400 -159773 51660 -14051 74430 -204750
5711 -324488 -224842 98552 148987 38381 -56781 217713 -118457 40081 452035 57638 -225677
5699 -225604 -82054 -510800 210729 169566 15598 -305379 55102 -246439 -25691 27024 -98938
5687 47063 -33997 -215734 189742 29344 -74022 10430 -289181 125477 28648 -59668 -392782
5676 -392782 74615 -180515 308457 64699 -137254 -42983 100351 133263 22748 -235067 -129429
5665 -129429 -218152 -135957 -312308 -71148 -174930 39973 -33883 -28744 208442 61192 -136488
5653 -278573 114624 -109330 -63633 48534 -37203 -41921 217047 33550 -26485 367178 -56580
5641 -121551 248373 134571 3729 -109941 3773 180785 -119793 61497 -45069 -132662 96423
5629 -192871 114890 79687 110242 -39759 -9936 -120314 59218 76586 -17799 -253793 -173290
5618 -173290 -369080 29548 72984 -57434 -61783 100811 -295856 -259988 -304851 -206793 213797
5606 97032 306268 -87746 21345 -27622 304573 -165852 -124907 21925 159821 -176476 66361
5594 -66103 -283194 9513 -17926 116150 117062 851 148013 24919 -247395 4944 38541 309689
5582 309689 147749 -84901 -224974 -244540 -36983 113197 -49672 -170385 280044 -3576 64610
5570 -201034 125837 263806 280172 -12227 -87346 -19274 -76315 178884 283917 287373 230906
5559 230906 86717 -154122 -96174 -85822 -532055 -99851 -107365 -134834 59721 474013 -22277
5547 -115174 -45797 -194535 118236 -136628 67768 -400730 -329351 70739 -169880 483662
5536 33034 -38510 -224390 -76125 117612 126501 -85970 108616 233021 229172 49844 -409920
5524 -161382 322496 -151273 131999 -217782 122434 34576 -192411 -15362 375772 -131854
5513 268496 -191559 71297 50653 -7636 40669 92015 -6965 89505 68985 200074 51655 -283564
5500 400071 -84348 -148735 -287632 -13175 -128421 -59083 -93968 -203958 -154507 -195508 30771
5488 49946 109991 84068 70257 85279 330799 21138 -37661 -409179 -97127 -7571 129117
5476 133920 318032 83278 -259491 -22936 295590 144156 73272 229395 -38047 157300
5465 -82775 173939 -274357 50587 -154000 -164139 -114363 314413 211556 -295652 -163862
5455 -163862 -111841 -129317 -239659 155861 51579 202975 -35094 11086 -272020 -90547 -73498
5444 -73498 37382 78739 142366 -126522 -69584 -28174 -66185 -106512 398036 -242110 68246
5432 161712 -159663 148 124594 126894 -97908 331052 184241 17433 236247 -250141 246963
5420 253150 11957 276035 106872 -113154 200143 62369 390746 386964 119535 78787 -101828
5408 96440 -189 -114396 52853 -38292 18595 -56539 210504 85504 246626 94687 118863 120609
5396 120609 -169511 -96121 88852 -58235 -17154 239730 58671 261612 -205820 131004 154971
5385 154971 83695 99984 92981 102511 52817 -6245 -171890 -75265 30751 113080 -90345 -142954
5373 -142954 112969 66676 84699 124298 -88958 -146051 207043 -6568 -21614 129811 151438
5362 151438 -25645 194834 39513 -2800 -237017 -345077 -113140 -181924 -65173 3047 111858
5351 111858 -6453 107162 19248 53074 183003 325147 59171 38870 29993 82363 -66835
5339 -24040 99128 31571 145838 58275 286996 123347 -59395 -120111 -46131 222145 87276
5327 331854 263702 -194458 -40635 148997 -70227 -211997 96473 -231320 -57752 -16891 120763
5315 -279279 161334 -3400 -9228 -204668 313683 -219023 24156 -187293 200015 -125320 -179056
5304 -179056 -62644 -164028 59800 64563 -34413 11242 14282 -388171 -66848 109941 -276590
5292 104111 -141382 -38613 -163589 434747 -70585 -59282 96069 -382450 -21050 -247639 -215054
5281 -215054 184086 -17114 -46832 42678 35684 -322578 -100723 -148977 -264233 55368 -97801
5269 40098 -127227 -198432 144564 -33275 211050 187384 363797 21328 -118821 77612 190389
5258 190389 19438 -108036 -13996 199915 268400 -108247 99545 -241796 -357982 -196086
5248 -196086 152247 -158617 78096 -118525 -170183 -33102 39149 -57227 -169305 28251 23667
5237 23667 281668 -265902 43820 -62037 587086 13874 171057 -60679 -242633 93949 61002
5226 61002 332911 -103623 -100897 79535 306453 -104103 152997 265158 -347078 187746
5215 -126869 -203118 -62008 -73873 122098 -75970 15608 130925 99713 -187790 -66587 763
5203 -192756 121157 -9667 -25092 -57887 -10820 -14742 283875 399668 10905 155686 469852
5192 469852 210301 226703 -273725 50037 511884 143733 -119804 -184142 95750 -196957
5181 -311012 -103958 141614 120760 -215093 84643 115939 -121619 -86684 202115 -280219
5170 -276328 105165 -32127 170532 -157302 153914 -186093 266951 86699 201462 152582
5160 152582 111975 -7763 43717 -258206 115346 -114409 -35115 -153299 -67330 -12898 -162333
5149 -162333 243276 -202984 -7676 300085 426659 289469 171676 -86209 -305341 6104 -98852
5137 -131369 -84972 -102878 -110405 352177 -229600 -111631 39876 -15765 154934 283356 -30923
5125 279297 -260929 67063 -35579 40726 133811 -166478 -71207 -205260 121603 53171 23688
5113 -79139 260078 129997 -43637 -171424 177752 -368665 -29773 23052 170456 63317 -287338
5101 478130 209325 21201 -7822 -134885 84017 362449 194770 94978 6510 -105230 -22220
5089 -61334 318316 -116967 -222686 -6229 24304 21470 169922 95124 -39521 -328390 20424
5077 204960 -195079 6324 -158867 -38219 125068 75390 101234 -47506 124054 -59675 217986
5065 70936 42961 19948 -56474 -109704 -117954 -7490 15878 -121199 -109470 161451 -121424 -136892
5053 -136892 56110 207986 6936 277689 293630 38978 -150383 -64603 -28898 233583 -163351
5041 158583 229735 93928 405169 366877 -109121 -10940 37483 23965 279068 95645 -349971
5029 -15111 -303846 65766 -36370 46749 -325140 -67368 -6298 -55618 390 -129383 351772 17328
5016 4258 318428 252658 -116765 270368 9728 -56718 -52159 344980 96896 -104626 130389
5004 -177729 -234376 -283829 230186 157805 -319082 -50461 -121095 -108102 31523 -387043 -30895
4992 237717 -59114 39739 154021 42007 -95561 -169848 -10339 234367 28461 105124 80053
4981 80053 11502 72539 228649 -114507 -49471 -182120 97943 -100119 -140910 -209704 29843
4969 -61511 -102400 -93452 -217710 -27637 -76079 72485 -38231 -16987 -129608 238692 23914
4957 165165 -260073 98501 -80134 -222196 -51898 -18485 -3062 -194210 -51262 103851 -55799
4945 -55049 -62127 -135521 -72099 -55793 36602 244349 464468 -191573 -120546 52933 151132
4934 151132 -24035 68174 -112253 68346 258510 -192319 111658 -115009 -44132 96023 172587
4923 172587 151091 -130521 102779 49919 52579 -169520 -234180 43578 15884 -1813 -90359
4912 -90359 -401475 -43210 151658 242383 -95568 89297 -131730 8108 -358925 208459 23643
4900 -33076 -135895 122349 -81603 28226 252038 451430 -293581 1629 289620 -187057 159793
4888 -1812 -71909 -193506 70805 -81187 -233928 -57858 159085 -96004 238407 9414 67673
4877 67673 440727 -79132 30635 248729 9448 -86674 158186 69375 148388 -104215 47757
4865 -104768 238874 -129174 13365 100317 -191492 62938 -109648 171788 -74040 -193856
4855 -193856 -224450 79974 -210678 425100 56904 -92067 -20703 73878 -18653 -88478 -99761
4844 -99761 151280 140551 -13373 88582 -32607 266919 243601 -135560 113868 248455 223721
4833 223721 -100857 -76584 -158827 22678 301449 7151 -3343 253083 -34548 183057 496595
4822 496595 -169709 183564 200618 294527 257398 -245646 -23282 -136330 -256522 -30990 70417
4810 -164143 179696 46678 -38032 116589 156389 205195 -12460 -265957 252461 -501281 -30167
4798 146148 -170219 -52666 117368 -131489 74060 242888 68141 -93192 -74369 154095 -71562
4786 81766 91160 208592 -86140 -253398 -129057 -19849 -114800 32994 79448 -155669 189571
4774 105542 -166769 15555 -95177 -2037 -162046 4800 -9436 181017 -220087 190290 -167899
4762 60072 -129150 -74380 -162031 119055 -92346 203589 -115712 -57404 -377301 263400 354606
4751 354606 111270 134325 370231 227390 52236 -33107 150629 -268592 171414 -318231
4740 -70768 215930 -2915 212026 170646 340525 42198 -68914 -161642 205838 -24740 -117759
4729 -117759 -134348 319349 -254144 -201599 72177 28811 53527 -54485 185 -54619 53915 113077
4717 113077 100323 266115 166897 266556 490724 80872 -117574 212795 50966 123532 320027
4706 320027 -224543 -204353 -3513 -164468 118176 -166016 147553 -213207 -397332 -82389
4695 -194391 12590 26759 35394 8622 169598 -284280 46580 -88402 96698 -111577 -60572
4684 -60572 -33389 -8175 77728 -55695 -9869 207730 -84978 -78137 -73230 -95606 73801 -277392
4671 300406 -129367 -63605 -110376 150563 64491 88847 87800 -187818 236034 28767 -107180
4659 -35179 -59800 -241912 -90324 48185 86704 -61864 -87141 85950 39956 -161044 -136445
4648 -136445 20652 -26133 -169345 -9112 51173 -124858 -58536 53116 10376 54392 176065
4637 176065 208865 100955 251508 92351 9047 -113223 278934 251754 109855 -47143 -102865
4626 -102865 -278773 -65522 -126595 -54747 -143263 -22794 -49558 99538 98933 -83307 -47929 -108071
4614 -108071 -192015 -57447 -112198 -172259 -78189 -53194 -49221 -177916 403133 56422 162261
4603 162261 234073 180413 303096 162895 -42688 207316 27257 84309 105282 -41217 -159174
4592 -159174 365823 -105243 -25011 39795 161900 97015 -18369 -307195 -52293 103239 -219211
4580 17781 -15202 66069 -315838 21038 30020 -16701 -30269 -331596 191172 -165956 167483
4568 -37831 203238 206555 -2507 -80819 383257 -83058 60890 -190016 -127643 311505 -5801 19793
4555 -113544 28192 -225433 78688 130468 -131566 -116765 -375351 74413 -134483 -115129 76353
4543 122562 -99970 142178 145432 -141173 -169349 -114366 51149 183572 -46609 285844 301816
4532 301816 73550 90878 213118 -284425 137102 105579 -149202 -165189 72828 168896 -23382
4520 181958 169290 -100318 -102328 -198506 -260368 35206 -316465 -279286 -45291 108063 174704
4509 174704 149910 16494 399496 141708 24430 -66705 30381 379887 -76846 -217552 106637
4497 14450 -12281 45895 73353 213482 135175 -362684 -62248 -2875 391150 249213 290577
$$ [...]
##END NTUPLES=NMR SPECTRUM
##END=
